##TITLE=1H_DE-141k_d6_TFA2
 200.13Hz,DMSO-d6.
 8 sc
 3.6.2026
##JCAMPDX= 6.0         $$ Bruker NMR JCAMP-DX V2.0
##DATA TYPE= NMR FID
##DATA CLASS= NTUPLES
##ORIGIN= UXNMR, Bruker Analytische Messtechnik GmbH
##OWNER= pz
$$ XWIN-NMR		Version 3.5
$$ Wed Jun  3 16:28:54 2026 Russian Standard Time (UT+4h)  she@DPX200
##.OBSERVE FREQUENCY= 200.131
##.OBSERVE NUCLEUS= ^1H
##.DELAY= (6, 6)
##.ACQUISITION MODE= SIMULTANEOUS
##.ACQUISITION SCHEME= undefined
##.AVERAGES= 8
##.DIGITISER RES= 18
##SPECTROMETER/DATA SYSTEM= spect
##.PULSE SEQUENCE= zg30
##.SOLVENT NAME= DMSO
##.SHIFT REFERENCE= (INTERNAL, DMSO, 0, 14.3821)
##AUDIT TRAIL= $$ (NUMBER, WHEN, WHO, WHERE, WHAT)
$$ ##TITLE= Audit trail, XWIN-NMR		Version 3.5
$$ ##JCAMPDX= 5.01
$$ ##ORIGIN= Bruker BioSpin GmbH
$$ ##OWNER= she
$$ F:/spectra/data/she/nmr/H-C/1/audita.txt
$$ ##AUDIT TRAIL=  $$ (NUMBER, WHEN, WHO, WHERE, WHAT)
(   1,<2026-06-03 16:27:32.54 +0400>,<she>,<DPX200>,
      <created by zg, POWCHK disabled, PULCHK disabled
       configuration hash MD5:
       00 E9 B6 7A A2 85 ED C7 34 08 36 98 17 FE 4E 26
       data hash MD5: 16K
       E3 A7 55 95 75 4F A1 7B CF 4D CA 1A 36 68 94 99>)
$$ ##END=
$$ 
$$ hash MD5
$$ B3 38 B0 2B AE 30 8F 8F A5 B3 4B FC C8 DB 44 60
##$RELAX= 
##$RELAX= 
##$RELAX= 
##$RELAX= 
##$RELAX= 
##$RELAX= 
$$ Bruker specific parameters
$$ --------------------------
##$DU= <F:/spectra>
##$EXPNO= 1
##$NAME= <H-C>
##$PROCNO= 1
##$TYPE= <nmr>
##$USER= <she>
##$AMP= (0..31)
100 100 100 100 100 100 100 100 100 100 100 100 100 100 100 100 100 100 
100 100 100 100 100 100 100 100 100 100 100 100 100 100 
##$AQSEQ= 0
##$AQ_mod= 1
##$AUNM= <au_zg>
##$AUTOPOS= <>
##$BF1= 200.13
##$BF2= 200.13
##$BF3= 200.13
##$BF4= 200.13
##$BF5= 200.13
##$BF6= 200.13
##$BF7= 200.13
##$BF8= 200.13
##$BYTORDA= 1
##$CFDGTYP= 0
##$CFRGTYP= 5
##$CHEMSTR= <none>
##$CNST= (0..31)
1 1 145 1 1 1 1 1 1 1 1 1 1 1 1 1 1 1 1 1 1 1 1 1 1 1 1 1 1 1 1 1 
##$CPDPRG= <>
##$CPDPRG1= <>
##$CPDPRG2= <>
##$CPDPRG3= <>
##$CPDPRG4= <mlev>
##$CPDPRG5= <mlev>
##$CPDPRG6= <mlev>
##$CPDPRG7= <mlev>
##$CPDPRG8= <mlev>
##$CPDPRGB= <>
##$CPDPRGT= <>
##$D= (0..31)
0 0.7 0 0 0 0 0 0 0 0 0 0.03 0 0 0 0 0 0 0 0 0 0 0 0 0 0 0 0 0 0 0 0 
##$DATE= 1780489651
##$DBL= (0..7)
120 120 120 120 120 120 120 120 
##$DBP= (0..7)
150 150 150 150 150 150 150 150 
##$DBP07= 0
##$DBPNAM0= <>
##$DBPNAM1= <>
##$DBPNAM2= <>
##$DBPNAM3= <>
##$DBPNAM4= <>
##$DBPNAM5= <>
##$DBPNAM6= <>
##$DBPNAM7= <>
##$DBPOAL= (0..7)
0.5 0.5 0.5 0.5 0.5 0.5 0.5 0.5 
##$DBPOFFS= (0..7)
0 0 0 0 0 0 0 0 
##$DE= 6
##$DECBNUC= <off>
##$DECIM= 32
##$DECNUC= <off>
##$DECSTAT= 4
##$DIGMOD= 1
##$DIGTYP= 9
##$DL= (0..7)
0 120 120 120 120 120 120 120 
##$DP= (0..7)
150 150 150 150 150 150 150 150 
##$DP07= 0
##$DPNAME0= <>
##$DPNAME1= <>
##$DPNAME2= <>
##$DPNAME3= <>
##$DPNAME4= <>
##$DPNAME5= <>
##$DPNAME6= <>
##$DPNAME7= <>
##$DPOAL= (0..7)
0.5 0.5 0.5 0.5 0.5 0.5 0.5 0.5 
##$DPOFFS= (0..7)
0 0 0 0 0 0 0 0 
##$DQDMODE= 0
##$DR= 18
##$DS= 0
##$DSLIST= <SSSSSSSSSSSSSSS>
$$ [...]
##$SUBNAM0= <"">
##$SUBNAM1= <"">
##$SUBNAM2= <"">
##$SUBNAM3= <"">
##$SUBNAM4= <"">
##$SUBNAM5= <"">
##$SUBNAM6= <"">
##$SUBNAM7= <"">
##$SUBNAM8= <"">
##$SUBNAM9= <"">
##$SW= 18.0517599122864
##$SWIBOX= (0..15)
0 0 2 0 0 0 0 0 0 0 0 0 0 0 0 0 
##$SW_h= 3612.71676300578
##$TD= 16384
##$TD0= 1
##$TE= 0
##$TE2= 300
##$TE3= 300
##$TEG= 300
##$TL= (0..7)
0 120 120 120 120 120 120 120 
##$TP= (0..7)
150 150 150 150 150 150 150 150 
##$TP07= 0
##$TPNAME0= <>
##$TPNAME1= <>
##$TPNAME2= <>
##$TPNAME3= <>
##$TPNAME4= <>
##$TPNAME5= <>
##$TPNAME6= <>
##$TPNAME7= <>
##$TPOAL= (0..7)
0.5 0.5 0.5 0.5 0.5 0.5 0.5 0.5 
##$TPOFFS= (0..7)
0 0 0 0 0 0 0 0 
##$TUNHIN= 0
##$TUNHOUT= 0
##$TUNXOUT= 0
##$USERA1= <user>
##$USERA2= <user>
##$USERA3= <user>
##$USERA4= <user>
##$USERA5= <user>
##$V9= 5
##$VALIST= <valist>
##$VCLIST= <CCCCCCCCCCCCCCC>
##$VD= 0
##$VDLIST= <DDDDDDDDDDDDDDD>
##$VPLIST= <PPPPPPPPPPPPPPP>
##$VTLIST= <TTTTTTTTTTTTTTT>
##$WBST= 1024
##$WBSW= 4
##$XGAIN= (0..3)
0 0 0 0 
##$XL= 0
##$YL= 0
##$YMAX_a= 364253
##$YMIN_a= -392947
##$ZGOPTNS= <>
##$ZL1= 120
##$ZL2= 120
##$ZL3= 120
##$ZL4= 120
##$ABSF1= 10
##$ABSF2= 0
##$ABSG= 5
##$ABSL= 3
##$ALPHA= 0
##$AQORDER= 0
##$ASSFAC= 0
##$ASSFACI= 0
##$ASSFACX= 0
##$ASSWID= 0
##$AUNMP= <proc_1d>
##$AZFE= 0.1
##$AZFW= 0.1
##$BCFW= 1
##$BC_mod= 2
##$BYTORDP= 1
##$COROFFS= 0
##$CY= -3
##$DATMOD= 1
##$DC= 2
##$DFILT= <>
##$DTYPP= 0
##$F1P= 0
##$F2P= 0
##$FCOR= 0.5
##$FTSIZE= 0
##$FT_mod= 4
##$GAMMA= 1
##$GB= 0.15
##$INTBC= 1
##$INTSCL= 1
##$ISEN= 128
##$LB= 0.25
##$LEV0= 0
##$LPBIN= 0
##$MAXI= 10000
##$MC2= 0
##$MEAN= 0
##$ME_mod= 0
##$MI= 1.114404
##$NCOEF= 0
##$NC_proc= 0
##$NLEV= 6
##$NOISF1= 3.799351
##$NOISF2= 2.8
##$NSP= 1
##$NTH_PI= 0
##$NZP= 0
##$OFFSET= 14.38212
##$PC= 1
##$PHC0= -4218.633
##$PHC1= 9.39229
##$PH_mod= 1
##$PKNL= yes
##$PPARMOD= 0
##$PSCAL= 0
##$PSIGN= 0
##$REVERSE= no
##$SF= 200.129724274929
##$SI= 16384
##$SIGF1= 3
##$SIGF2= 2
##$SINO= 400
##$SIOLD= 16384
##$SREGLST= <1H.CDCl3>
##$SSB= 0
##$STSI= 0
##$STSR= 0
##$SW_p= 3205.1282051282
##$SYMM= 0
##$S_DEV= 0
##$TDeff= 0
##$TDoff= 0
##$TI= <>
##$TILT= no
##$TM1= 0
##$TM2= 0
##$TOPLEV= 0
##$USERP1= <user>
##$USERP2= <user>
##$USERP3= <user>
##$USERP4= <user>
##$USERP5= <user>
##$WDW= 1
##$XDIM= 8192
##$YMAX_p= 0
##$YMIN_p= 0
$$ End of Bruker specific parameters
$$ ---------------------------------
##NTUPLES= NMR FID
##VAR_NAME=  TIME,          FID/REAL,        FID/IMAG
##SYMBOL=    X,             R,               I
##VAR_TYPE=  INDEPENDENT,   DEPENDENT,       DEPENDENT
##VAR_FORM=  AFFN,          ASDF,            ASDF
##VAR_DIM=   8192,          8192,            8192
##UNITS=     SECONDS,       ARBITRARY UNITS, ARBITRARY UNITS
##FACTOR=    0.0002768,     1,               1
##FIRST=     0,             0,               0
##LAST=      2.2672688,     0,               0
##MIN=       0,             -392947,         0
##MAX=       2.2672688,     364253,          0
$$ Real data points
##PAGE= N=1
##DATA TABLE= (X++(R..R)), XYDATA
$$ [...]
1960a3J276O37o87j626j182k35J197J104J235j08j274j474l55O97J531J120j92
$$ -13 1263 1900 1213 -413 -1595 -1830 -633 471 1706 1598 324 -1150 -1505 -808 723 1843 1651
1977A651j021j558o98JJ791J610L78j144j647r65J26Q65J634Q44m15j605j127
$$ 1651 630 -928 -1626 -1625 166 1776 2154 1010 -637 -1602 -1476 -611 1023 1867 1452 -153 -1280
1994a280p40J189J816J074K2j584j449q45N6J670J392N87o33j972j159L21J233
$$ -1280 -2020 -831 985 2059 2081 497 -952 -1797 -1741 -71 1321 1908 1275 -697 -1856 -1535 -302
2011c02J496J106n30j515j930l26N68J783J622m6j433j376r42J44J750J491M21
$$ -302 1194 2300 1770 255 -1675 -2001 -1433 350 1972 1926 493 -883 -1825 -1681 69 1560 1981
2028A981j254j234j345J30R80J491J124m96j171j361m82N98J400P33L41j011j546
$$ 1981 727 -507 -1852 -1722 -742 749 1873 1377 206 -1155 -1637 -1039 361 1094 1435 424 -1122
2045a122m07J19J253J662M39q57j179j050l93J327Q12O83m57p94j055j0M51R79
$$ -1122 -1529 -1410 -157 1505 1944 1087 -92 -1142 -1535 -208 604 1287 830 36 -1019 -1029 -578 401
2063D01J008o0j217j075p47P98P34R74J25k94j265m73L7J007R38M64p50q02j050
$$ 401 1409 1349 132 -943 -1690 -892 -158 816 941 647 -618 -1091 -1054 -47 891 1355 605 -197 -1247
2082a247k84J238Q73N33k74q17j021j27L78R76Q06J35j081r27n98M39J244P47
$$ -1247 -1531 -293 580 1113 839 22 -999 -1126 -748 228 1034 1169 88 -839 -1437 -998 246 993
2100I93L56q38j170o15k1P86Q41R15l87j106j218L38R76R01M46m1j129j075m34
$$ 993 1349 511 -659 -1274 -1295 -509 332 1247 860 -246 -1464 -1126 -150 751 1197 1156 27 -1048 -1482
2119a482P81J052P89j27p04q89o75K94J056R92J13l83j119j051m2J117J168L20
$$ -1482 -701 351 1140 1013 309 -580 -1255 -961 95 1087 1200 817 -302 -1353 -1395 -278 890 1210
2137A210l87p43j015j36K45J155P81j95n92r10p41K39J044R33O88n90j162j018
$$ 1210 823 80 -935 -1071 -826 329 1110 915 323 -587 -1328 -1089 -45 888 1576 986 -176 -1194
2155a194J9R67J004O43l81q74q53o15M24J035P44M41j044r87n34K47O26J260N90
$$ -1194 -1175 -208 796 1439 1058 184 -669 -1284 -860 175 919 1360 316 -671 -1205 -958 -332 928 1518
2174A518p38j058q94M52L14Q83P24l22j241m0q40N60P47P33L44p98r28k93P5N78
$$ 1518 780 -278 -1172 -720 -406 477 1201 879 -362 -402 -1242 -682 65 798 1142 344 -584 -877 -802 -224
2194b24R03K70k84q42q60M39L86P13L57l26o88l98J7l2P23N97j80m23o65l52N12
$$ -224 679 949 665 -177 -1037 -598 -212 501 858 532 -156 -554 -537 -569 154 751 571 148 -517 -869 -357
2215c57L17P21M27p71o05m21J01O24O14k08j87l88l80J9K80O36K12l72j27o00
$$ -357 -40 681 1108 337 -268 -689 -588 36 650 442 255 -133 -513 -494 -214 422 634 262 135 -465
2235d65n05P02N62K52J03p77j29k44J89L73M18J3m63l61l20J32M57L90K14q6n44
$$ -465 -970 -268 294 546 649 -128 -257 -501 -312 61 479 492 29 -332 -652 -520 -63 327 541 455 -89
2256h9k24l45N93L83L71n7p50l41p05L67P52P17M5m59o76l16L19K53K75N47n02
$$ -89 -313 -658 -65 318 689 632 -118 -459 -1164 -797 -45 672 717 258 -418 -734 -415 -162 113 660 158
2277A58l47l29mN06L35J43k26k81l25K2l9L40O15K37p62p09J09L93P7N53J79n67
$$ 158 -189 -518 -522 -16 319 462 236 -45 -370 -348 -387 -47 568 805 43 -666 -557 -164 -87 466 645 78
2299G8N4q91J54L95N60M61n70k08l99o0J30O11L53j62l16n66j17K38J24N88j67
$$ 78 132 -759 -605 -210 350 811 241 33 -366 -426 -296 315 668 506 190 -376 -493 -255 -131 457 290
2320B90j98l13m3k74L02M22K36j56k23k91n8J00L05J77J87n60p4l64L1K44K56
$$ 290 92 -221 -264 -538 -236 186 422 266 43 -248 -306 -206 99 276 463 -97 -171 -535 -504 -260 -4
2341dK10Q2l25j96j62M55L61k76J31l25k26l83K52O78j0N1k75j78nJ4K25k6K56
$$ -4 206 288 -37 -233 -395 60 421 145 276 -49 -275 -658 -406 272 262 313 38 -140 -145 -131 94 68 324
2364C24l01j64j97L8K66L2K20p5l48j8N4K03J08q8K91l29k23lK68JL10k09j05
$$ 324 23 -141 -338 -300 -34 -2 218 143 -205 -223 -169 34 142 54 345 16 -207 -210 58 59 369 160 55
2387E5k42l5J93j92L34K65l20k86Q5j81L77J85Q5m42j79L13k01K19n2J25q4jJ29
$$ 55 -187 -222 -29 -221 113 378 58 -228 -143 -324 53 238 323 -119 -298 15 -186 33 -19 106 22 21 150
2410A50k5j84j97N69J17k72O8m21J27O8J55m4P1j69j03k25N64j22l0L42m84Q9
$$ 150 125 -59 -256 313 430 158 226 -195 -68 0 155 111 182 13 -90 -315 249 127 97 439 -45 44
2432D4j92L27jM2L2q1l00K9k19K60K76n0j30m38J23K04q6L50o0j65O0j62P1J04
$$ 44 -148 179 178 220 252 171 -129 -100 -319 -59 217 167 37 -401 -278 -74 -160 190 130 -35 25 -137 -66 38
2456C8j8j3N6o9n7K51j42r5K23k24J62m14L0J90o0jK91J17k73k38J49L9j02K92
$$ 38 20 7 63 -6 -63 188 46 -49 174 -50 112 -302 -272 -82 -142 -143 148 265 -8 -246 -97 -58 -160 132
2480A32J47m32J97j6K2O9j55ok4nP7K10k00J12k34K14k96K67ll67J04N07j21J
$$ 132 279 -153 44 28 50 119 -36 -42 -66 -71 6 216 16 128 -106 108 -188 79 76 -291 -187 320 199 200
2504B00l99j14J69j8L33j56k24J25R7j42Q9k91M20j47J63l89L47k47N39l04n0
$$ 200 -199 -313 -144 -162 171 15 -209 -84 13 -129 -40 -331 89 -58 105 -284 63 -184 355 51 1
2525AJ21l56K93l9P7K34n05L39l19J9o2J48P6m5j5K1j01J70j83K60J0j78m5k64
$$ 1 122 -234 59 20 97 331 -174 165 -154 -135 -197 -49 27 -18 -33 -12 -113 57 -126 134 144 -34 -79 -343
2549c43K03K36P3q5J04k46K4M0J65o25N48k30Mo7J87j52K95j75K4M8j17K92r6
$$ -343 -140 96 169 84 188 -58 -34 6 171 -454 94 -136 -132 -199 -12 -164 131 -44 -20 28 -89 203 107
2572A07j37k4n9L7kJ96k25J47J70j87K30k61K99l44P2o6J74j29J24j19R2j04m2
$$ 107 -30 -54 -113 -76 -78 118 -107 40 210 23 253 -8 291 -53 19 -47 127 -2 122 3 95 -9 -51
2595e1L7Q3O0K39m85J01k85M35j62J19J26j3j01q5K6J23N0O0l13pk71J42N9m7
$$ -51 -14 69 129 368 -117 -16 -301 134 -28 91 217 204 103 18 44 167 217 277 -36 -43 -314 -172 -113 -160
2619a60M7K56l67K83k19J96J84l54K85l61J26k8J0K80j38k05o1J73k02L5L41m0
$$ -160 -113 143 -224 59 -160 36 220 -134 151 -210 -84 -112 -102 178 40 -165 -226 -53 -255 -220 121 81
2641H1k51L20P7k39MR8K82k03k38m5J38K34k56l55R9K06o5L68j59k23K08o5j77
$$ 81 -170 150 227 -12 -8 90 372 169 -69 -114 24 258 2 -353 -254 -48 -113 255 96 -127 81 16 -161
2664a61J07R6j79K13r6K23j74k5k6P7K64l40L72n87K38j06J18j37m2P7N5n2K16
$$ -161 -54 42 -137 76 -20 203 29 4 -22 55 319 -21 351 -236 2 -104 14 -123 -165 -88 -33 -85 131
2687A31l0j22l52L27M4J14Q9k98J28J36j9j15P3j83m8K55k74p4Q5R1n6k70N02
$$ 131 101 -21 -373 -46 -2 112 201 -97 31 167 148 33 106 -77 -125 130 -144 -218 -133 -42 -98 -368 134
2710A34k15P2j39K34Q4k74k11Q1K17o7J53j0j26L82q3l91J91j08J44r0J41k32
$$ 134 -81 -9 -148 86 170 -104 -315 -234 -17 -84 69 59 -67 315 232 -159 32 -76 68 -22 119 -113
2732a13J00K9j54K75k09j26K02p0J65O3j70R5l64L29k59J12J46l8j11L69k7j58
$$ -113 -13 16 -138 137 -72 -198 4 -66 99 162 -8 87 -277 52 -207 -95 51 13 -98 271 244 86
2754H6J13k93M92m44N4l74K91J67%M0j11O9j54M7J93o2n3R9j23N8m01K06J60k30
$$ 86 199 -94 398 -46 8 -366 -75 92 92 132 21 90 -64 -17 176 114 61 160 37 95 -306 -100 60 -170
2778a70l2K16L1j68K73j29k9J67J32m36J75k92J51Q9j92M8K96j84j13q6R7K13
$$ -170 -202 14 45 -123 150 21 -8 159 291 -145 30 -262 -111 -22 -214 -166 130 -54 -167 -253 -156 57
2800E7j05L8k11J77K92k51j20L27k49j32K80j34J97l99K49K84k91k24L2K07j73
$$ 57 -48 -10 -221 -44 248 -3 -123 204 -45 -177 103 -31 166 -233 16 300 9 -215 -183 24 -149
2821a49K69j27j0l21R7L10j50O9J07m0l14L87l77L58k53R9R4J43l96J93j97J37
$$ -149 120 -7 -17 -338 -241 69 -81 -12 95 55 -259 128 -249 109 -144 -45 49 192 -204 -11 -208 -71
2843g1J9j05L36j09j53M10k70K08j46j63J65k4p7O0J79m03K90j82M39m11j06K36
$$ -71 -52 -157 179 70 -83 327 57 265 119 -44 121 97 20 80 259 -144 146 -36 403 -8 -114 122
2865A22k04J70j49P5k04K38J28j59J29k28q1L33j29k55J13j21N89k20N2l10J55
$$ 122 -82 88 -61 14 -190 48 176 17 146 -82 -163 170 41 -214 -101 -222 367 147 199 -111 44
2886D4K07l60J4J17J56l76J60P4M4j76J56n1j61L17k63J25klk43K17J26k18j33
$$ 44 251 -109 -95 22 178 -198 -38 36 80 -96 60 9 -152 165 -98 27 25 22 -221 -4 122 -96 -229
2909b29M11j58j21R3J65l75l3J92J32r0r2Q2K4J47j56l1K8k91M31k42m0K32k4
$$ -229 182 24 -97 -4 161 -214 -247 -55 77 -13 -105 -23 1 148 -8 -39 -11 -302 129 -113 -153 79 55
2932E5r6R4J95k29L9O7j54p5L49O3l93L43l24J20j44j03R8lJ1J79K3k43M10k45
$$ 55 -41 53 248 19 58 125 -29 -104 245 308 -85 258 -66 54 -90 -193 -95 -98 -87 92 115 -128 282 37
2956C7j13k45M54j64j65J0J35n0pJ98r6pj6O0j74L38k94K09K3j02J42k72l1m3
$$ 37 -76 -321 133 -31 -196 -186 -51 -101 -108 90 -6 -13 -29 31 -143 195 -99 110 133 31 173 -99 -130 -173
2980a73J16l1l8J45J21j33l8p2o5J94J6K86k10j16P2j54q4O4j0R5J02k43rL5P1
$$ -173 -57 -88 -126 19 140 7 -31 -103 -168 26 42 328 118 2 74 -80 -164 -100 -110 -15 87 -156 -165 -130 -59
3005e9L3j76O0J79J91m79J60k16M83p7K3k69j31N58n01J45Q8J69j56MQ6l72K90
$$ -59 -26 -202 -142 37 228 -251 -91 -307 176 99 122 -147 -278 280 -221 -76 12 181 25 29 115 -257 33
3028C3m04L83J06j10n8J2K86j71q6K62k12J6J6k09J72j44j1j7J32m2o2J49jK89
$$ 33 -371 12 118 8 -50 -38 248 77 -9 253 41 57 73 -136 36 -108 -119 -136 -4 -46 -108 41 40 329
3052C29l93j12K94R9k8j19K9j02m6J65k59o6O3L5J65j77K6J61k9L64l75M8J26
$$ 329 -64 -176 118 217 189 70 99 -3 -49 116 -143 -209 -146 -111 54 -123 -97 64 35 399 24 72 198
3075A98j90o4l4L6K88l91J51K94l77l9R8J46L5l07L34k5k52R6L5qr4o2N9K7N6
$$ 198 8 -56 -90 -54 234 -157 -6 288 -89 -128 -30 116 151 -156 178 153 -99 -3 32 24 -70 -132 -73 -46 10
3100A0q5J00%m8l3J77j79J5j25K36k74M17j77o8Q8k5J41j31k65L59m1l20J30J00
$$ 10 -75 25 25 -23 -56 121 -58 -43 -168 68 -206 211 34 -34 54 29 170 39 -226 133 92 -228 -98 2
3124Bn3K74j74J14J16k14m8m1J93k69K84q0j3o9j5r7M7r1K64J43l15o4J38j98
$$ 2 -51 223 49 163 279 65 17 -24 169 -100 184 104 91 22 7 -90 -43 -134 130 273 -42 -106 32 -166
3148a66L36j44j76K40j34M9K09q8k93K48p3K6q8N7l39J91L77j18j30j4K38k18
$$ -166 170 26 -150 90 -44 5 214 126 -167 81 8 34 -54 3 -336 -145 232 114 -16 -30 208 -10
3170a0k39K42P6M5J1J95n84J77J37po6J04J15l31K12l7p1kK79k78p2M56m03J52
$$ -10 -249 -7 69 114 125 320 -264 -87 50 43 -23 81 196 -135 77 40 -31 -33 246 -32 -104 352 -51 101
3194A01n32L91k2o4J66j08M4M39l52k43L32k36J07p4P2j50l8L13j39L9j9L0j13
$$ 101 -431 -40 -62 -126 40 -68 -24 415 63 -180 152 -84 23 -51 21 -129 -167 146 7 46 27 57 -56
3217e6o7R0J1J16j83qJ68J79l35j31L49m6P0k03l8L71k65lJ52j9PO2l20J72K35
$$ -56 -123 -33 -22 94 -89 -97 71 250 -85 -216 133 87 157 -46 -84 287 22 19 171 152 159 221 -99 73 308
3242C08l18M8j68O1K27L3l09J19P8j97J12j54K90j70k6P9K4j36N2j7J74j08O5
$$ 308 -10 38 -130 -69 158 191 -118 1 79 -118 -6 -160 130 -40 -66 13 37 -99 -47 -64 110 2 67
3265F7J50q9j73J40l3j88M02j33lJ69k98P3rr0n7J78P5l60K56r5ok72L90Q3l29
$$ 67 217 128 -45 95 62 -126 276 143 140 309 11 84 75 -15 -72 106 181 -179 77 -18 -24 -296 94 177 -152
3290a52R6N2k4O1p4P0j13Qp5K99k42PK00o7J99k66J25k53J09j23J1K69q4l3j72
$$ -152 -56 -4 -28 33 -41 29 -84 -76 -151 148 -94 -87 113 46 245 -21 104 -149 -40 -163 -152 117 33 0 -172
3315a72J38O4j5j16P2n8J54r8L8j87J89l50K99l1L25k91L23j47p3j55K44j3k31
$$ -172 -34 30 15 -101 -29 -87 67 -31 7 -180 9 -341 -42 -73 252 -39 284 137 64 -91 153 140 -91
3338i1L82l3m00nJ39J12o9K12k33J96p5kl63J14P6l9K33k3L4q5j94K48L7k62o9
$$ -91 291 258 -142 -147 -8 104 35 247 14 210 135 133 -230 -116 -40 -79 154 131 165 80 -114 134 171 -91 -160
3363a60J04J07K75m37J61J33j82j9j56K30l55L05k06N00j41r3j66K06j02j27J08
$$ -160 -56 51 326 -111 50 183 1 -18 -174 56 -299 6 -200 300 159 66 -100 106 4 -123 -15
3384a5j28K28m19M67j51l50N24q5l65J5M19j47J68q6J42l19k7j54K15J51N1k12
$$ -15 -143 85 -334 133 -18 -368 156 71 -294 -279 140 -7 161 75 217 -102 -129 -283 -68 83 134 -78
3406g8L0j22J52k00K6L73j42j58j90L67l3p3j83L57k43RJ89j35J72l34K4J64K15
$$ -78 -48 -170 -18 -218 -192 181 39 -119 -309 58 25 -48 -231 126 -117 -108 81 -54 118 -216 -192 -28 187
3429A87k90K13o6j43J89j13l3J93k20q9Q2K50j05k57J73L85k60j57l7J26K84l74
$$ 187 -103 110 44 -99 90 -23 -56 137 -83 -172 -90 160 55 -202 -29 356 96 -61 -98 28 312 -62
3451f2K26m46K65J04K4m7k58L43o7k40K64J47j83l2J6j99J68J50O8M0k22k12J52
$$ -62 164 -282 -17 87 111 64 -194 149 82 -158 106 253 70 38 54 -145 23 173 241 281 59 -153 -1
3474aJo8j01M1P4k54M82Ol34J76L56k39L0j43j6J91j36k5l7L04k41o0J75j26l93
$$ -1 0 -68 -169 -128 -54 -308 174 180 -154 22 378 139 169 26 10 201 65 40 3 307 66 6 181 55 -338
3499c38J76L3O9K51o0k25J95j97K67k50K39r7j46K31q1r1l6J34j64MPp9K18m6
$$ -338 -162 -129 -60 191 131 -94 101 -96 171 -79 160 63 -83 148 67 -24 -60 74 -90 -86 -79 -158 60 14
3523A4O5q9k67L73Q4l84J73J26l08Q9q8J02r3J79k18K24q8J68nK63k25k19J79
$$ 14 79 -10 -277 96 180 -204 -31 95 -213 -124 -212 -110 -203 -24 -242 -18 -106 62 57 320 95 -124 55
3546E5k96o0N8K07j50j5J74j7L3J82j06j85R8J33l44K89k58Q2J40j50J31p5N3
$$ 55 -241 -301 -243 -36 -186 -201 -27 -44 -11 171 65 -120 -22 111 -233 56 -202 -120 20 -130 1 -74 -21
3569b1M70m37RjJ3j8m0M7L0k85K26k63L1K79k68P6J73J3l47K44Q3Q2l1k05J42
$$ -21 449 12 21 20 33 15 -25 22 52 -233 -7 -270 -239 40 -228 -152 21 34 -313 -69 14 96 65 -140 2
3594BJ36q3k29J97q7p3M3N8k57J12j3N6J81k37L28J12l25M1l53K02K33r3n1LJ45
$$ 2 138 55 -174 23 -64 -137 -94 -36 -293 -181 -194 -138 43 -194 134 246 -79 -38 -391 -189 44 -49 -100 -97 48
3619D8j26Q6m81P50m78M05k3R7m11J09R4n6r3J44r8K19Rj53J17l22N4J02j09j23
$$ 48 -78 8 -473 277 -201 204 181 278 -133 -24 70 14 -79 65 -33 186 195 42 159 -163 -109 -7 -116 -239
3643b39K6J1N9K24j19l46N05p7j09p1K08j04K66l10J00j14K59l70P5M8j8K12k33
$$ -239 -213 -202 -143 81 -38 -384 121 44 -65 -136 72 -32 234 -76 24 -90 169 -201 -126 -78 -96 116 -117
3666a17J58Q1l82K43k6K69j93J07r8k33P1M1j34L0o9J72J06qr7R1r5J51K3o2j71
$$ -117 41 122 -260 -17 -43 226 33 140 42 -191 -120 -79 -213 -183 -252 -80 26 18 -79 12 -83 68 91 29 -142
3691a42J44o2j7J73n7O1J08j98m0J9k41J17J73J73j1n31K43M22k93J69n11N66
$$ -142 2 -60 -77 96 39 100 208 10 -30 -11 -252 -135 38 211 200 -331 -88 334 41 210 -301 265
3713B65j67m6k63M01p1k02q8J98r6K5K21m24K37J82j03j35r6L82l5M4n66L84J11
$$ 265 98 52 -211 190 119 -83 -171 27 -69 -44 177 -247 -10 172 69 -66 -162 220 185 229 -337 47 158
3736A58l18J70k88J07R3j2j24J84k37L33j37R6mp3p4J94K94l43j25J59P6L7n8
$$ 158 -160 10 -278 -171 -78 -90 -214 -30 -267 66 -71 25 21 -52 -126 68 362 19 -106 53 129 166 108
3759A08j20Kj5m4K09N5o1%r5p1Q6j14j4l4Q7N1l3K79k26n7j7J57r0r0Q2K5J40
$$ 108 -12 -10 -25 -69 140 195 134 134 39 -32 54 -60 -74 -108 -21 30 -3 276 50 -7 -24 133 43 -47 35 60 200
3786B00j90J54k34Q2K95l03J70k74K48l4n3J64l12K23l53J59p0k0K82k97P9N1
$$ 200 10 164 -70 12 307 4 174 -100 148 114 61 225 -87 136 -217 -58 -128 -148 134 -163 -84 -33
3808c3J91R4k43M9j59O0l5j9K16m0k10L45P5n92L98r6j59L21k34M4K71j78J28
$$ -33 158 252 9 58 -101 -41 -76 -95 121 81 -129 216 291 -301 97 1 -158 163 -71 -27 244 66 194
3831A94j68J52k65K50j51n5J80l53K39j49M94k78j62k9P7j32j5J59L7J66p2j8
$$ 194 26 178 -87 163 12 -43 137 -216 23 -126 368 90 -72 -101 -24 -156 -171 -12 25 191 119 101
3853A01j5J71k9j33j16m2l6J71j95R4M1J17n9m07M36P4k58J59M8Om2k28L19j49
$$ 101 86 257 228 95 -21 -63 -99 72 -123 -29 12 129 70 -337 99 173 -85 74 122 128 86 -142 177 28
3877B8n0R7n7k10K27j80K49k8r5J21j77p2J83P3K5k09q8K93P4j55j30J99j68M3
$$ 28 -22 75 18 -192 35 -145 104 76 -19 102 -75 -147 36 109 134 -75 -163 130 204 49 -81 118 -50 -7
3901gO9j58j22M7K98k62M00l53J31j38M69l20j03K46k42K5o4J9J71Q5k43L86k93
$$ -7 62 -96 -218 -171 127 -135 265 -88 43 -95 374 54 -49 197 -45 -20 -84 -65 106 191 -52 334 41
3924D1n8j5K77k75j33J91N9M1l60L43j78j0J31n6J71m06M1L81K6mj56k06k13O1
$$ 41 -17 -32 245 -30 -163 28 87 128 -232 111 -67 -77 54 -2 169 -237 -196 185 211 207 51 -155 -368 -307
3948c07K16K61k04j75J73L3J41k78K8J96O3j68J99l07P5J2L7L43k03l20JK59R6
$$ -307 -91 170 -34 -209 -36 -3 138 -140 -112 84 147 -21 178 -129 -54 -42 -5 338 135 -185 -184 75 171
3971A71j77K70j18n2j2l39N20j81Q6J0k90M3K88l0j78k33J41m5J26k68L08L5q0
$$ 171 -6 264 146 94 82 -257 263 82 168 178 -112 -69 219 189 11 -222 -81 -126 0 -268 40 75 -5
3994eN1j51j6L9O8P5N8l2J9k3j30J7oj46K74k29M15m14k0K84k83J19k95K98Lj98
$$ -5 46 -105 -121 -82 -14 61 119 87 106 83 -47 -30 -36 -182 92 -137 278 -136 -156 128 -155 -36 -331 -33 -30 -228
4020b28J90O4pp2Q4k74K91j69J0J73m0J36k63J41k03J58J27k6n7J03m48L48N3
$$ -228 -38 26 19 -53 31 -243 48 -121 -111 62 22 158 -105 36 -167 -9 118 92 35 138 -310 38 91
4043I1J96k16J41n73M51m71K47K13J62o0l40L88r6j75R0j36J94J50r1k09P0r1
$$ 91 287 71 212 -361 90 -381 -134 79 241 181 -159 229 133 -42 48 -88 106 256 165 -44 26 -65
4065f5l6O9k16K36J07J15j20j77j81K40K9j89J62lJ09N9M2j46K2j33k1K62Nj42
$$ -65 -101 -32 -248 -12 95 210 90 -87 -268 -28 1 -188 -26 -29 80 139 181 35 57 -76 -97 165 170 28
4089B8J3J49k95M96k12k44M2J55p4j46k2Q4K02j22L63l49n9j9j01P2L35J6j26
$$ 28 41 190 -105 391 179 -65 -23 132 58 -88 -110 -26 176 54 417 68 9 -10 -111 -39 296 312 186
4112A86m9j02p6N5j15L82k05mJ11l39K28j36J23J91l34L6R7L3p1K26l03M3K85
$$ 186 137 35 -41 14 -101 281 76 72 183 -156 72 -64 59 250 -84 -48 49 82 11 237 -66 -23 262
4135B62n25K22j76L97j6r6J2O7k39J82j08O9l9K0r9N3P8j98K20l37L68l36rJ73
$$ 262 -263 -41 -217 180 164 68 80 147 -92 90 -18 51 12 32 -67 -14 64 -134 86 -251 117 -219 -228 -55
4159e5J61Q6O2m23k1K10P2j42M08j39l56M51k57l30L62j28J37L6p8J22j97k77
$$ -55 106 192 254 -169 -190 20 92 -50 358 219 -137 314 57 -273 89 -39 98 134 56 178 -19 -296
4181b96M15j12J25k28K78j04k68R9J1P7L9k40L48%j49j53J19l6J21k8R1j27N3
$$ -296 119 7 132 -96 182 78 -190 -91 -80 -3 36 -204 144 144 -5 -158 -39 -75 46 18 109 -18 35
4204C5J09k16J66N4N5l16J03Nj86K18r6k12J98K02M9l40K74J3j86J53p4l5J1K60
$$ 35 144 -72 94 148 203 -113 -10 -5 -191 27 -69 -281 -83 119 168 -172 102 115 -71 82 8 -27 -16 244
4228B44l57L25k75J22Q7o8L29m00J35j7M5l6Pj26M58m34k75L91o5j56n3J52K54
$$ 244 -113 212 -63 59 146 78 407 7 142 125 170 134 141 15 473 39 -236 155 90 -66 -119 33 287
4251B87j14j20n1J41k66M0K14K53m99m3lJ31K5L8m7K1P1O8k99K54k0M2k31K24
$$ 287 173 53 2 143 -123 -83 131 384 -115 -158 -161 -30 -5 33 -14 7 78 146 -153 101 81 123 -108 116
4275A16j8l59L85j12o1j69L63p9j42P1P8l60K85j83P6L75n02L80P9n8j71l90N44
$$ 116 98 -261 124 12 -49 -218 145 66 -76 -5 73 -287 -2 -185 -109 266 -236 144 223 165 -6 -396 148
4298A48n8j1k61L07k33J43lj19N9j59L43K67j08l97L84k00L3j91M5J4J06j78J86
$$ 148 90 79 -182 125 -108 35 32 -87 -28 -187 156 423 315 -82 302 102 135 -56 -11 3 109 -69 117
4321A17K7j33j0j80J19J1K51n8k42K23j59K4j05Q4L15m86J46L3o3K9J85N7l02
$$ 117 144 11 1 -179 -60 -49 202 144 -98 125 -34 -10 -115 -31 284 -202 -56 -23 -86 -57 128 185 -117
4344a17J8J94n7J37k99K71j38l0L61k42J3j89q1J33J65k05J29lK5j10K53j58k18
$$ -117 -99 95 38 175 -124 147 9 -21 340 98 111 -78 -159 -26 139 -66 63 60 85 -25 228 70 -148
4367a48J68J45K1l28O1J70r0n8P7k3k31L63nNn13O72j74r9Q4l98O7L04p2JQ9j40
$$ -148 20 165 186 -142 -81 89 -1 -59 18 -5 -236 127 122 127 -386 286 112 13 97 -301 -234 70 -2 -1 88 -52
4393e2o3J47J22l3j05Q3l43L51j6Ln0p9K0J60k93K1J93J83q6k3j60J44j82j66
$$ -52 -115 32 154 121 16 99 -244 107 91 94 44 -35 -15 145 -148 -127 66 249 163 140 -20 124 -58 -224
4417b24P6L7R8j33j23L22J6j88K24j41K02j55Q9k2m2Pj74K27K01k67k85K26N9
$$ -224 -148 -111 -13 -146 -269 53 69 -119 105 -36 166 11 100 78 36 43 -131 96 297 30 -255 -29 30
4440C0J9k31K60j46k3o2J91j0l88J12M36m34J14J59m4k20j15L36J08l6pK2O1l3
$$ 30 49 -182 78 -68 -91 -153 38 28 -360 -248 188 -246 -132 27 -17 -237 -352 -16 92 56 49 71 132 99
4464I9l46L75m20K94K5L7O2n3l09M47j95L2K8j59o9r5M06l39L84o11L00R0j80
$$ 99 -247 128 -292 2 27 64 126 73 -236 211 16 48 76 -83 -152 -247 159 -180 204 -407 -107 -17 -197
4487a97K15J3k4K48m76K96q2J03P4j82J60m38L51j91J35P1Q0J3k23K90k58P3J24
$$ -197 18 31 7 255 -221 75 -7 96 170 -12 148 -290 61 -130 5 76 156 169 -54 236 -22 51 175
4510A75l16k4J48k0J08j06J14J44j81j2j99J24k62L89J1r9J81k01J42k22K6K03
$$ 175 -141 -165 -17 -37 71 -35 79 223 42 30 -169 -45 -307 82 93 -6 175 -26 116 -106 -80 123
4532A23n5l31J9J45K0M3J40k62J58o8J13n8J78l90L30l3l40M51l99J26o9K60J64
$$ 123 68 -263 -244 -99 -79 -36 104 -158 0 -68 45 -13 165 -225 105 72 -268 183 -216 -90 -159 101 265
4555B65j57k04J10q5Q2m8P5j44J71N8j61m7J52nPJ9q6o1K0j13K41j18j15J22q5
$$ 265 108 -96 14 -71 11 -37 38 -106 65 123 -38 -85 67 62 69 88 2 -59 -39 -152 89 -29 -144 -22 -107
4580a07K05j46p2K55j95R0o0J50j18n0L09K2k71NQ5l88J49R3J3J22j20n0K50k82
$$ -107 98 -48 -120 135 -60 30 -30 120 2 -48 261 283 12 17 102 -286 -137 -44 -31 91 -29 -79 171 -111
4604a11QJ66k44M00r4M7j93l44J06J63J85O7j90J94j55j40K55k84K26l08K41J39
$$ -111 -103 63 -181 219 125 172 -21 -365 -259 -96 89 156 -34 160 5 -135 120 -164 62 -246 -5 134
4626A34N8j91J55O5j21k31j7J61O7P0J20l16O3Nj11k7J86j62j44K98j46K58l63
$$ 134 192 1 156 221 100 -131 -148 13 80 150 270 -46 17 22 -89 -116 70 -92 -236 62 -84 174 -189
4649a89J02r0K08Q9j61K83k77PM7j26J11n3J77k84L11k29L04l73L43j69J49n1
$$ -189 -87 -177 31 120 -41 242 -35 -28 19 -107 4 -49 128 -156 155 -74 230 -143 200 31 180 129
4671A29l27L83j35L6j00l4j48M33l00K36j40P3m24M92l55J26K21k60mK11j35R9
$$ 129 -198 185 50 86 -14 -48 -196 237 -63 173 33 106 -318 174 -181 -55 166 -94 -98 113 -22 77
4693G7p1j89J66Q7j65O3k3J2J73j01J6J62l64L15p8qJj98L41j98l17L76m17K63
$$ 77 6 -183 -17 70 -95 -32 -55 -43 130 29 45 207 -157 158 80 72 73 -125 216 18 -299 77 -340 -77
4717g7K24l36L2J93N5M0J37k62p0n2J95r8K15j53K6k1K30k94o8j57K66L28m34
$$ -77 147 -189 -157 36 91 131 268 6 -64 -116 79 -19 196 43 69 48 278 -16 -84 -241 25 353 -81
4740h1J28j02j51P4K75k4J9j88l46L76N7jJ6j24o9K1J02J87j49k64K96j41K56
$$ -81 47 -55 -206 -132 143 119 138 -50 -396 -20 37 36 52 -72 -141 -120 -18 169 20 -244 52 -89 167
4763A67p8j02N6j71l3K19k90J74J92j00j48K29l5k90J45m7J6l8J53N9r9l5L1J01
$$ 167 89 -13 43 -128 -161 58 -232 -58 134 34 -114 115 80 -210 -65 -112 -96 -134 19 78 -21 -56 -25 76
4787G6k41J94p5O9L28k68k62J64J23k4K38k73M9k00J17j37K07n0r7J64K2k34L43
$$ 76 -165 29 -46 23 351 83 -179 -15 108 84 322 49 98 -102 15 -122 85 35 -62 102 124 -110 233
4810B33O2k58n0j71J34J53O0j31j41J35N9q3j30J13J42k16%J62j59M8m7J23N8
$$ 233 295 37 -13 -184 -50 103 163 32 -109 26 85 2 -128 -15 127 -89 -89 73 -86 -38 -85 38 96
4833I6J23M0J7l57l5J76K63m39N9j03P0L34j7m28J47j22L7J63j57j04K94j60J63
$$ 96 219 259 276 -81 -116 60 323 -116 -57 -160 -90 244 227 -201 -54 -176 -139 24 -133 -237 57 -103 60
4856F0r7j33k17L28J44J82k91L16l82J99o8jk52JL29l6k42L35n2Oo8j13M15k77
$$ 60 -37 -170 -387 -59 85 267 -24 292 -90 109 41 40 -212 -211 118 82 -160 175 123 129 61 -52 363 86
4880H6j06j93J09L10o5k15k16J86K55l16J62%O2p3K07k18m5k56L20J58j60R2O3
$$ 86 -20 -213 -104 206 141 -74 -290 -104 151 -165 -3 -3 59 -14 193 -25 -70 -326 -6 152 -8 84 147
4903A47j39j78p0K91q5j7q8J52J79k23r3J53J01l18K84K8M1r9o3K48j37%k53J9
$$ 147 8 -170 -240 51 -34 -51 -139 13 192 -31 -124 29 130 -188 96 124 165 66 3 251 114 114 -139 -120
4927a20L41k25j34j03L17J48l35N34k88m00M57j20q0j32p2K55n1n0k19L34J4j1
$$ -120 221 -4 -138 -241 76 224 -111 423 135 -265 192 72 -8 -140 -212 43 -8 -58 -277 57 71 60
4949F0l8j11j9J42j47K51l47L61l47J30J67m0k33R1J09J57q3l82L17Q5j56m9n1
$$ 60 22 -89 -108 34 -113 138 -209 152 -195 -65 102 62 -171 -80 29 186 103 -279 38 123 -33 -82 -133
4972a33K23Qj07k05L78r0q2j46L01j08Ml5k38K34j95L81q8k21O8%M09m24L01o6
$$ -133 90 98 -9 -214 164 74 -8 -154 147 39 43 8 -230 4 -191 190 102 -119 -51 -51 358 -66 235 169
4996A69k62J79k73J03Q7K56j65o3P0m9j77L25l95J1K05J13j07J75m8l12M5n4J42
$$ 169 -93 86 -187 -84 3 259 94 31 101 52 -125 200 -195 -184 21 134 27 202 154 -158 -113 -167 -25
5019b5P6J06m5k9k47k18M66m3m5j82K64P4Q0J52l08j62n1J58n4J01L1j62K02L03
$$ -25 51 157 112 83 -164 -382 84 41 -4 -186 78 152 232 384 76 -86 -137 21 -33 68 99 -63 139 442
5043D42k43m6m4J77k80j65J81j31J08J16k53J32j76M54k99M3l7J27q5Qm3K78l02
$$ 442 199 153 109 286 6 -159 22 -109 -1 115 -138 -6 -182 272 -27 16 -21 106 21 29 -14 264 -38
5066c8K9m7k2L30n09J75J77K85m71r3M57k8l10j5J22l30Q7K45P2l36L01J28j52
$$ -38 -9 -56 -78 252 -257 -82 95 380 -91 -184 273 245 -65 -80 42 -288 -201 44 116 -220 81 209 57
5089E7K51l14j7L6J0K4Q0j75Pj57L82k62l15N26K4k27J8j94N5J94m1P0m1j38n
$$ 57 308 -6 -23 13 23 47 127 -48 -41 -198 184 -78 -393 133 157 -70 -52 -246 -191 3 -38 32 -9 -147 -152
5114a52O7J10J29k02k50J86r4L48p6p2J19m28L03J24k18q2J43Nj35K69j69J11
$$ -152 -85 25 154 -48 -298 -112 -206 142 66 -6 113 -315 -12 112 -106 -188 -45 -40 -175 94 -75 36
5136C6l1l2q1l2J42Q3k10J18k7r9M05l71J41j18M6r7K0J59j97J10j20NK81k59
$$ 36 5 -27 -108 -140 2 85 -125 -7 -34 -133 272 -99 42 -76 -30 -127 -107 52 -145 -35 -155 -150 131 -128
5160a28J13J40J17l58j09R6L38j13Jl45K06N3K92j93j71K18k21n6m8j19J82j55
$$ -128 -15 125 242 -116 -225 -129 209 96 97 -248 -42 11 303 110 -61 157 -64 -120 -168 -287 -105 -260
5182b60K63K39k38l6n9J85l21R1L65k22j33M5L5l1K41k79J60J1l1k15L19p8j55
$$ -260 3 242 4 -32 -91 94 -227 -136 229 7 -126 -81 -46 -77 164 -115 45 56 25 -190 129 51 -104
5205a04K24j20n1j47K02K7o6Q5L0L2P4m46l6K43j8J62J01k77%J78k39J26m1K7
$$ -104 120 0 -51 -198 4 31 -35 50 80 112 186 -260 -296 -53 -71 91 192 -85 -85 93 -146 -20 -61 -34
5229c4L73m02J0j91J68LO1LK26k75L4lO5J34q3J13m10K86j92K07j31j1J42o4J48
$$ -34 339 -63 -53 -244 -76 -73 -12 -9 217 -58 -24 -27 38 172 89 202 -208 78 -114 93 -38 -49 93 29 177
5254A77j4l40o6Q1Q4Q1q6K41j24k78K87n6j32K5K23lj03k7K14j40k05J43j95M2
$$ 177 163 -177 -243 -162 -78 3 -83 158 34 -244 43 -13 -145 -120 103 100 -3 -30 184 44 -161 -18 -213 -171
5278a71K9J45j7K35j56m2j34K56j76P0k19K35KL6k03K11J71l36l27M46r6j35K16
$$ -171 -142 3 -14 221 65 23 -111 145 -31 39 -180 55 57 93 -110 101 272 -64 -391 55 -41 -176 40
5301D0Qj79R0j49J79L4j14j00K96N1Jl4k88J22J22P5j27jL7k82K75r4l03M50k11
$$ 40 48 -131 -41 -190 -11 23 -91 -191 105 156 157 123 -165 -43 79 154 27 26 63 -219 56 -38 -341 109 -102
5326a02K23j54L54m68J40O6k1j71L85k89Q7r6J85k42j6K69k55J77j15j9K0%j8
$$ -102 121 -33 321 -147 -7 59 38 -133 252 -37 50 -46 139 -103 -119 150 -105 72 -43 -62 -42 -42 -60
5349f0Q8L31j41l33J19J54j31M1Nm6j37J95J15k17J05j87J12l01K10j03j64J38
$$ -60 28 359 218 -115 4 158 27 68 73 27 -110 85 200 -17 88 -99 13 -288 -78 -181 -345 -207
5371b07J36j41J44p3M11j30n5%j25J34m2L24k35j31k5J53k74N3P4j56j11L24M8
$$ -207 -71 -212 -68 -141 270 140 85 85 -40 94 52 376 141 10 -15 138 -136 -83 -9 -165 -276 48 96
5394I6J42m66L89l96N73k61J17j41m00L99k34K62k78O2R0m3j10N24l00j27L10
$$ 96 238 -228 161 -235 338 77 194 53 -347 52 -182 80 -198 -136 -46 -89 -199 325 25 -102 208
5415B08m57J26K38P5j20j39j30j59J40J10O9J08J6k11J50O9k97K75q8k72K49J26
$$ 208 -249 -123 115 190 70 -69 -199 -358 -218 -108 -39 69 85 -126 24 93 -204 71 -17 -289 -40 86
5437H6k46K21j31K92l36k1J63oQ1o8J72l67K19l3M1mQ5j32J68l36M3K43K11l23
$$ 86 -160 61 -70 222 -114 -135 28 22 103 35 207 -160 59 26 67 63 148 16 184 -152 -109 134 345 22
5461B2k12M22j43M8j21J92m36K87j90R9L6q9J07Ql2k7K80k32K5r1J50J90k6K8
$$ 22 -190 232 89 137 16 208 -228 59 -131 -32 4 -85 22 30 -2 -29 251 19 44 -47 103 293 267 295
5485B95k88o1j79J85rk0J7K34m10P3J70%k6J25R1l28J07j29J86l00J09Q8J69n0
$$ 295 7 -54 -233 -48 -57 -77 -60 174 -236 -163 7 7 -19 106 197 -131 -24 -153 33 -267 -158 -70 99 49
5509D9j21Q9J35j27l7N0m2j56K90J79l20j15L90l54m3M71j39r7j83J43J72k18
$$ 49 -72 17 152 25 -12 38 -4 -160 130 309 -11 -126 264 -90 -133 338 199 102 -81 62 234 16
5531A6k39L69k59Q8O1O6m20L69j01K67k11R6j94K3J12l4J72j32J09k97J29k44
$$ 16 -223 146 -113 -25 36 102 -318 51 -50 217 6 102 -92 -69 43 9 181 49 158 -139 -10 -254
5553b54L93m7L8n1p0k71L91k2o4Nk13J96k87J51K74k11L24j77k32L66k51l52L26
$$ -254 139 92 130 79 9 -262 129 107 43 48 -165 31 -256 -105 169 -42 282 105 -127 239 -12 -364 -38
5576c8K12l43K31J74q3k98p1J62J84o1J3k19K02j65J87Nn8j64J59n1K02l05M9
$$ -38 174 -169 62 236 153 -145 -216 -54 130 69 82 -137 65 -100 87 92 34 -130 29 -22 180 -125 -76
5599g6j13N30k54l5k1q9m0j4J82k53K07j13M5L14k99j24K92m65M88m79K75O0N3
$$ -76 -189 341 87 52 31 -58 -98 -112 70 -183 24 -89 -44 270 -29 -153 139 -326 162 -317 -42 18 71
5622G1l75K33M33k98o7j15J37Kp2P0Q6jk9m2j24J93r1K04j81j26k03L66K1o7k21
$$ 71 -304 -71 362 64 -3 -118 19 21 -51 19 105 104 75 33 -91 102 11 215 34 -92 -295 71 92 25 -196
5647a96L33j73J49J2j07k17K15N7j67K12l87J25K76M7l39K44K5j91R9l9l8j00
$$ -196 137 -36 113 125 18 -199 16 73 -94 118 -269 -144 132 179 -160 84 109 -82 17 -22 -60 -160
5669a60K38j45q3J52k17M96j23r2J68m62J39j8N9L30l92k4L19j16j31k1n3O2L97
$$ -160 78 -67 -150 2 -215 281 158 66 234 -228 -89 -107 -48 282 -110 -134 185 69 -62 -83 -136 -74 323
5692C23m99J93Q3j65J96k5l7K56j49l05J05K79j79kj62J87j66lJ01n9L0M2N0j01
$$ 323 -176 17 100 -65 131 106 69 325 176 -129 -24 255 76 74 -88 99 -67 -70 31 -28 2 44 94 -7
5716gl1L67k74Q2k52J18Q7N4N1j83j30L0k5j9J28k6J27n4J29k22n5J19p7k5O9
$$ -7 -38 329 55 137 -115 3 90 144 195 12 -118 -88 -113 -132 -4 -30 97 43 172 -50 -105 14 -63 -88 -19
5741a9l5K30j83j39R5k5j93K63J60m76M03n9J02l95M57k94P5K63k4l63Q3N9p2
$$ -19 -54 176 -7 -146 -51 -76 -269 -6 154 -322 81 22 124 -271 186 -108 -33 230 206 -157 -74 -15 -87
5764h7K5J49k76J63J33j18j12J16N8q9J00j98M1j9L83j89j22j21R9J81l2J40k69
$$ -87 -62 87 -189 -26 107 -11 -123 -7 51 -38 62 -136 -95 -114 269 80 -42 -163 -64 117 85 225 -44
5787d4mJ8J64j44m9P6k89L44L5j66j46K06K59N8k25j45L6q8L6QK22m52N12j00
$$ -44 -48 -30 134 -10 -59 17 -272 72 107 -59 -205 1 260 318 93 -52 -16 -104 -68 -60 162 -290 222 122
5811A22l56J84K52j17p1K07k67K11j38M3O6o0j39J39j64Q8j17J12m5J5J21j70
$$ 122 -234 -50 202 85 14 221 -46 165 27 70 136 76 -63 76 -88 0 -117 -5 -50 -35 86 -84
5833h4Q4Q4l65L44L2k05M97l11l7j18R5pj09J12j04J16k00N1K43r4k12K45O9k83
$$ -84 0 84 -281 63 95 -110 387 76 39 -79 16 9 -100 12 -92 24 -176 -125 118 24 -188 57 126 -157
5857a57K30J13j65J29o3O0j61k03K14j56L14l32K86k36j43L17j30k2o2J55O3Q7
$$ -157 73 186 21 150 87 147 -14 -217 -3 -159 155 -177 109 -127 -270 47 -83 -105 -167 -12 51 138
5879A38k72J57L7p5N8P1j09j61J98r5n6K49m07K10r9Q1J78n0J03j08j12L4K37
$$ 138 -134 23 60 -15 43 114 5 -156 42 -53 -109 140 -267 -57 -156 -75 103 53 156 48 -64 -30 207
5902B07k65J72r1N2k61L39N9j46o0j07M5j06J91P5Q5N9j99J28o3J24k93P3L99
$$ 207 -58 114 23 75 -186 153 212 66 6 -101 -56 -162 29 104 189 248 49 177 114 238 -55 18 417
5925D17m15j32K85O0R0l44j10r4J69K37l72J00L7J21J54l75N2n0m0oJ12J74l11
$$ 417 2 -130 155 215 305 -39 -149 -243 -74 163 -209 -109 -72 49 203 -172 -120 -170 -210 -216 -104 70 -241
5948b41K39j28K58l36K36P3j7n4k2r7J01j89L02j16J18p4k74L29P9k18K1R4j11
$$ -241 -2 -130 128 -208 28 101 84 30 8 -89 12 -177 125 9 127 53 -221 108 187 -31 -10 84 -27
5971b7K30M3k01P9q3l80N17r3k6k04K4J62q6J65j84K80j96j91n5K49l1j01J89
$$ -27 203 246 45 124 41 -339 178 85 59 -145 -121 41 -45 120 -64 216 20 -171 -226 23 -8 -109 80
5994H0p3N5K9j5R7l38K2K16J29k29r4L62m66M02K68m10M92p13l2L84j57j44o7
$$ 80 7 62 91 76 173 -165 -143 73 202 -27 -121 241 -225 177 445 35 527 -186 -218 166 9 -135 -202
6017b02J20Oj63M08k2j14J52J75j63j81J85k74K30o3J05j79k0M93o12K77k93K58
$$ -202 -82 -76 -239 169 147 33 185 360 197 16 201 -73 157 94 199 20 0 493 -119 158 -135 123
6039A23M3l00p0k0L7J61P3p3j70J84P2p8o0j46M43l85K48qK42m17K84r4r2R0l85
$$ 123 166 -134 -204 -224 -187 -26 47 -26 -196 -12 60 -18 -78 -224 219 -166 82 74 316 -101 183 89 -3 87 -298
6064b98O04m14N9J07j56q4L21J86j31j34K09n9k92r5P1K45r0J34l9l92K46r6k4
$$ -298 306 -108 -49 58 -98 -182 139 325 194 60 269 210 -82 -177 -106 139 49 183 144 -248 -2 -98 -122
6087a22j3J7O89o28r8j52K95l5R7j10j70L51o87N78M5j41r4J89l45L56J15k32
$$ -122 -135 -118 571 -57 -155 -307 -12 -47 50 -60 -230 121 -566 12 57 -84 -178 11 -334 22 137 -95
6109i5O0M5q3K83l01j79J21K47p1n3K1N5n6K7L13m40K69r1Kq4J29k57R8j29j21
$$ -95 -35 10 -73 210 -91 -270 -149 98 27 -26 -5 50 -6 21 334 -106 163 72 74 -10 119 -138 -40 -169 -290
6134b90K99Ol6K06q6l06L33k90L25j05R3j50Q3o8q1mK36n9o7j24L77n83K72q8
$$ -290 9 15 -21 185 99 -207 126 -164 161 56 149 -1 82 14 -67 -71 165 106 39 -85 292 -291 -19 -107
6158a07K15o6l31K9J86N8J33J97k87n1l55M50p3K38l66L07l77M73l39Pk6m5J05
$$ -107 108 42 -289 -260 -74 -16 117 314 27 -24 -379 71 -2 236 -130 177 -200 273 -66 -59 -85 -130 -25
6181b5p5K77J15O8k14k67q2K65m5K35r1k09j02jL17JK4k44K29k78q5J68L2K45
$$ -25 -100 177 292 360 146 -121 -203 62 17 252 161 -48 -150 -151 166 167 191 -53 176 -102 -187 -19 13 258
6205B58k36k26L6P2K38p4K4j23j24M59m03n0N8J14J68K4m08J25J20j16l6J51j54
$$ 258 22 -204 -168 -96 142 68 92 -31 -155 304 -99 -149 -91 23 191 215 -193 -68 52 -64 -100 51 -103
6228a03l11M25m4L9j03j39n1R1L73l77J77l94M08J02o3L87j74k05J14l41j13M40
$$ -103 -414 11 -33 6 -97 -236 -287 -196 177 -200 -23 -417 -9 93 30 417 243 38 152 -189 -302 138
6250A38k69k6K29J4N4J32j83m03j62N43j7j45M99o1q06K15j47N14Q9R5q38K31
$$ 138 -131 -157 72 86 140 272 89 -314 -476 67 50 -95 404 343 -463 -248 -395 119 208 303 -535 -304
6272c04L57K66p95M20L73m71J43lj29M57o05L38K70l56O1k35M34K16k33l37%K62
$$ -304 53 319 -476 -56 317 -154 -11 -14 -143 314 -291 47 317 -39 22 -213 221 437 204 -133 -133 129
6294A29j51O5o9N61r43J52R09j180J70P15o15M78j42L52q36j74L74j53J81p7m0
$$ 129 -22 43 -26 535 -408 -256 653 -527 -357 358 -257 221 79 431 -405 -579 -205 -358 -177 -254 -294
6315b94M32k34k12m8L02P55p23l58P02p61N69O9p01L64r9N22l82m47Q08q80N34
$$ -294 138 -96 -308 -356 -54 701 -22 -380 322 -439 130 199 -502 -138 -237 285 -97 -544 264 -616 -82
6336h2j82J93L73j07J30j83R1k37R8l5L35o45M60m51K18k95k33N68J01j25j34
$$ -82 -264 -71 302 195 325 142 233 -4 94 59 394 -251 209 -242 -24 -319 -552 16 117 -8 -142
6357a42N22n70O3K43J1m52M77Q2n73K82K5K2K00j5M5l3P3m4M8l88q0j1K19J70
$$ -142 380 -190 -127 116 127 -325 152 234 -339 -57 -32 -10 190 175 220 187 260 216 264 -124 -204 -215 4 174
6381A74j60J21k07k48K50J51j12N2Q4l48L09R2J4l40K86j92Q1J34l14J93J17j68
$$ 174 14 135 -72 -320 -70 81 -31 21 105 -243 66 158 172 -168 118 -74 7 141 -173 20 137 -31
6403c1R5l3k69K69O0j76K15j71n4o7K37k74l4L73J01Qk99R3r9J2q3J77j04J75
$$ -31 64 31 -238 31 91 -85 130 -41 -95 -162 75 -199 -233 140 241 249 -50 43 -56 -44 -127 50 -54 121
6427A21n5j21j14L00k57P9j0J35J47l31N33o16K39l8k32J52Q4j06l9R1n6K27k23
$$ 121 66 -55 -169 131 -126 -47 -57 78 225 -106 427 -189 50 12 -220 -68 16 -90 -129 -38 -94 133 -90
6450i0J47pj23j34J22J35j27K42k23L1k69J24K22J12N4l00K45j51J16j16J20k67
$$ -90 57 50 -73 -207 -85 50 -77 165 -58 -27 -296 -172 50 162 216 -84 161 10 126 10 130 -137
6472a37L83j55n1j23P6J74j68J06k66L8R4l4K51k69J95J4J99m96K6K21o0j05q7
$$ -137 246 91 40 -83 -7 167 -1 105 -161 -123 -29 -63 188 -81 114 128 327 -169 -143 78 18 -87 -174
6495a74K8L74j83Q0K1k84K91k02R3K6m0n1L87l66j24L00k09J32j11n4j8J88k00
$$ -174 -146 228 45 125 146 -138 153 -49 44 70 30 -21 366 0 -124 176 -33 99 -12 -66 -84 104 -96
6518i6qJ19j14J5M21k03m0j35K2K7LRn7J03j46J02J93l7n5J45m03M88l91r8J81
$$ -96 -104 15 -99 -84 337 134 94 -41 -19 8 11 20 -37 66 -80 22 215 178 123 268 -135 353 -38 -136 45
6543D5l2j17N3r0P9Q7r2j65K81m7J61j37j6J07KP5m19J99K67l78J64j03K09l1
$$ 45 13 -104 -51 -141 -62 25 -67 -232 49 2 163 26 10 117 119 194 -225 -26 241 -137 27 -76 133 102
6567A02K5l7k44K4M00k76j04K57k15q8M87l17k0N1j02q7K28J02j37k77l1M36j49
$$ 102 127 90 -154 -130 270 -6 -110 147 -68 -156 331 14 -6 45 -57 -144 84 186 49 -228 -259 177 28
6590B8K61k9l10R2J17n12R31j196P27l14J483o26r66k2K13n68J3O10P55j250N99
$$ 28 289 260 -50 42 159 -353 578 -618 109 -205 1278 652 -314 -336 -123 -691 -678 -68 687 -563 36
6611C6p4m49Q52o54K31M2L3l34R9K45K6n6q8O0k28L72o6j5Q9k41K25j70j54K59
$$ 36 -38 -487 365 -289 -58 -16 17 -317 -218 27 53 -3 -91 -31 -259 113 47 32 121 -120 105 -65 -219 40
6635D0j06L24k17j58J89k66J2J26N8qK43k66q9L04K27l01k90k5M13k38L3j10L43
$$ 40 -66 258 41 -117 72 -194 -182 -56 2 -6 237 -29 -118 186 413 112 -178 -203 210 -28 5 -105 238
6658B38m41K76j34L88l71l17L77J29J1j59kJ9J87k07n7j59R3K41m72K0M89k86
$$ 238 -203 73 -61 327 -44 -361 16 145 156 -3 -5 14 201 -6 -63 -222 -129 112 -360 -340 149 -137
6680a37L90m45k0R25k61P2l26l0k99K46j40O6K91j85J87o26N27n58N76j47j37
$$ -137 253 -192 -212 713 452 524 198 168 -131 115 -25 41 332 147 334 -292 235 -323 253 106 -31
6701c1m70N51P1j53M79j53Ml54R2l91O0K30n47P46L31q40k61N94n52l02O62L19
$$ -31 -501 50 121 -32 447 294 298 -56 36 -355 -295 -65 -612 134 465 -375 -636 -42 -594 -896 -234 85
6723H5n63O58k20p92L78O42j46k28Q42o99J04j22j062K081m68j155M82k49k44
$$ 85 -478 180 -40 -832 -454 188 42 -186 656 -43 61 -61 -1123 958 490 -665 -183 -432 -676
6742f76N09l08M41N6m3N57n57l32J313r44l30P8J66M12K67l07o03J306j101m11
$$ -676 -167 -475 -34 22 -21 536 -21 -353 960 16 -314 -236 -70 342 609 302 -301 1005 -96 -507
6762e07j62J72q8R93j37r70M9J323j155J48L16l33n49J140L69l76j96L7n79P44
$$ -507 -669 -497 -585 408 271 -699 -650 673 -482 -334 -18 -351 -900 240 609 233 37 74 -505 239
6782B39o39N11q45L63k71O53N74o34k65j129k08K810j992O76K67p5k73K20M11
$$ 239 -400 111 -734 -371 -642 11 585 -49 -314 -1443 -1651 1159 -833 -157 110 35 -238 -18 393
6801C93mk21j151J378o07N68J58p20R41o71l54J2n6L05N36l20j69L69l21pK05
$$ 393 389 168 -983 395 -212 356 514 -206 735 64 -290 -278 -334 -29 507 187 18 387 66 59 264
6822B64k50N47q49N89J19l70l27j27M07k07j11J31J77k14n7M31l40K17o9o25J010
$$ 264 14 561 -288 301 420 50 -277 -404 3 -204 -315 -184 -7 -221 -278 153 -187 30 -39 -664 346
6843C46m6p77N74K18J00o46J12L7R4M71l41k22P9q8K41q2j03R6pj39R6n8J43k00
$$ 346 300 -477 97 315 415 -231 -119 -82 12 483 142 -80 -1 -89 152 70 -33 63 56 -83 13 -45 98 -102
6867a02J79m67L88j20J64o3Q2J11k73K85%j01j72J29j64L24l41K09lL0j07M4J6
$$ -102 77 -390 -2 -122 42 -21 61 172 -101 184 184 83 -89 40 -124 200 -141 68 65 95 -12 32 48
6890D8j55k0j1J4J71o3O4j02P7J95j50L1l86L56lj11K82k98L19k65n7J21L7k2
$$ 48 -107 -127 -138 -124 47 -16 48 -54 23 218 68 99 -287 69 66 -45 237 -61 258 -7 -64 57 94 72
6914G2l6L45j13l68n5M59m17L11m31J15L08k18j67J55J83K99m94k61L80J87k56
$$ 72 36 381 268 -100 -155 304 -113 198 -233 -118 190 -28 -195 -40 143 442 -52 -313 67 254 -2
6935bq0K45N6j01Q4k95j38K76j8L6J10k12J95j13j02Q2J20J8k57J39l73J23J90
$$ -2 -82 163 219 118 202 -93 -231 45 27 63 173 -39 156 43 -59 23 143 161 -96 43 -330 -207 -17
6958a7J53j76M09l93j30L2L83k74J5J8j30J78l8O6j27l20M48j09J51l2J14j21
$$ -17 136 -40 369 -24 -154 -122 261 -13 2 20 -110 68 30 96 -31 -351 97 -12 139 107 221 100
6980A00kk54L7K97m36M73j3j23k44K07N4j34MM2m1nK95j60J59K4k65L5p2Oj71
$$ 100 98 -156 -119 178 -258 215 202 79 -165 42 96 -38 -34 8 -33 -38 257 97 256 280 15 50 -22 -16 -187
7005a87J35N6R5p0P2J3j28j00L9q3J08K87j54j2j66K68p2k56J37J41m64N48k98
$$ -187 -52 4 99 29 101 114 -14 -114 -75 -158 -50 237 83 71 -95 173 101 -155 -18 123 -341 207 -91
7028i1L91k12K46k00j40J73J05l90O41k58p3j75p1J67q8K1k33P0K75r4j54N19
$$ -91 300 88 334 134 -6 167 272 -118 523 265 192 17 -54 113 25 46 -187 -117 158 64 -90 429
7050D29n31K6j21LJ62o3L32j1k02M25j55k93K13Jl49K62l3q7J79l04Q9M5o5j02
$$ 429 -102 -76 -197 -194 -32 -95 237 226 24 449 294 1 214 215 -134 128 95 8 187 -117 -28 17 -48 -150
7074a50K76k22J17Jk71L32K30k02j15l0K1o0Q6n0j8j36J76m9m0J44R9l99K15J67
$$ -150 126 -96 21 22 -249 83 313 111 -4 -34 -13 -73 13 -37 -55 -191 -15 -64 -104 40 139 -260 -45 122
7098A22j34L9j17J84J22M7l35K2j82J20N5J05J24l10M45k70J22j31m0J9j3J81
$$ 122 -12 27 -90 94 216 263 -72 -50 -232 -112 -57 48 172 -138 307 37 159 28 -12 7 -6 175
7120A75r5L8j01Q8k42K56j80j63L39l83K26R8k53J58J62j05K35l29Q6l6j18L82
$$ 175 80 118 17 105 -137 119 -61 -224 115 -268 -42 56 -197 -39 123 18 253 -76 10 -26 -144 238
7142B38p7k60L94j93j35K0r1J37j38J72Q6L9j70K64k65RK75j82mR7m02J60j21
$$ 238 161 -99 295 102 -33 -13 -104 33 -105 67 153 192 22 286 21 30 305 123 119 216 -186 -26 -147
7165a47J48K4J2j42J20k34N60l08K5r2K63j6k04J13l8k44j54L34o6K18k81L0l
$$ -147 1 25 37 -105 15 -219 341 33 58 -34 229 213 9 122 84 -160 -314 20 -46 172 -109 -79 -82
7188h2J92n10O34Lr9j84nJ24l86K04q1J96j37J31M3j81K09j56o9K32k25J25M8
$$ -82 110 -400 234 237 138 -46 -51 73 -313 -109 -190 6 -131 0 43 -138 71 -85 -154 78 -147 -22 26
7211B6k72K77o1M9k5L4J36m6J89j82n9P0k28K05Ol29K24n6m1P7P0m37K86J17j25
$$ 26 -246 31 -30 19 -6 28 164 118 307 125 66 136 -92 113 119 -210 14 -42 -83 -6 64 -373 -87 30 -95
7236i5L13j01L5j16p9Q6n2Q6L4j71N0M3M6j42j12R2J85k06J98j92k92M43R8Qq8
$$ -95 218 117 152 36 -43 43 -9 77 111 -60 -10 33 79 -63 -175 -83 102 -104 94 -98 -390 53 151 159 71
7261G1J60k1l56L49l80J98K8k52J58Q5J31j49P1q7k85K82mJ8j46J18m7K37k62
$$ 71 231 210 -146 203 -177 21 49 -203 -45 40 171 22 93 6 -279 3 -1 17 -129 -11 -58 179 -83
7284h3Q5O5J55k03RJ45j67k09L13qk99N6J39r8K3j17M01k55R6LJ1P5j66L36l56
$$ -83 2 67 222 19 28 173 6 -203 110 102 -197 -141 -2 -100 -77 -194 207 -48 48 51 62 137 -29 307 -49
7309d9m7K69p0j09On3J57j4k2j05n8n6J40L25k05N6P4m6j08Q7k09J7M1J28j45
$$ -49 -96 173 103 -6 0 -53 104 90 68 -37 -95 -151 -11 314 109 165 239 193 85 172 -37 -20 21 149 4
7334DO7Kq7k04M83j95j97J17j46L3K19k12j29M01j42r6L95m05n4l5K47j69K4O6
$$ 4 71 73 -14 -218 265 70 -127 -10 -156 -123 96 -116 -245 156 14 -82 313 -92 -146 -181 66 -103 -79 -13
7358a3l3j87J76M3M7j13J32J57k08r6mL04k22j74K65K02j19l63K86PJ39k57L19
$$ -13 -46 -233 -57 -14 33 -80 52 209 1 -95 -99 205 -17 -191 74 276 157 -206 80 87 226 -31 288
7381B88m13l1R3J04j80K6J19K7l67M91j98j77K51J84M8q4r3k32K59l03J38J82
$$ 288 -125 -156 -63 41 -139 -113 6 33 -334 157 -41 -218 33 217 265 181 88 -144 115 -188 -50 132
7403A32j16P2J51l40K48Q8k34Q8P4j91K71k38J6K65n08l0K29p1J06n7K14j17j36
$$ 132 16 88 239 -101 147 235 1 89 163 -28 243 5 21 286 -222 -252 -23 -94 12 -45 169 52 -84
7426h4K57m00M04k15P0J6k09n4M8J30J43N2O4r7j15N6j7j57M6M66l51q8K15k33
$$ -84 173 -227 177 -38 32 48 -161 -215 -167 -37 106 158 222 125 10 66 49 -108 -62 404 53 -35 180 -53
7450e3Q1j91J66p1k2J34J18m03L89j17k30J42K22j39k01K84J53k59l06P8K18J11
$$ -53 28 -163 3 -68 -90 44 162 -241 148 31 -199 -57 165 26 -175 109 262 3 -303 -225 -7 104
7472A04k31K24j22J9P4j3k9k0Q4j05L2k73M27rk50OL09l69J64L8j18J71j86j12
$$ 104 -127 97 -25 -6 68 55 26 6 90 -15 17 -256 171 162 -88 -82 227 -142 22 60 -58 113 -73 -185
7496a85J97R8k71L33K9k85J42j76P6p3J18P7j60j4j9K1K9J39j97J75j50M5k88
$$ -185 12 110 -161 172 201 -84 58 -118 -42 -115 3 80 -80 -94 -113 -92 -63 76 -121 54 -96 -51 -339
7519c39R3J82J51j24m4K8J5j01K66r7j77K86k99J93J31j07rr1O9R3k89K83j76
$$ -339 -246 -64 87 -37 -81 -53 -38 -139 127 30 -147 139 -160 33 164 57 48 -43 26 119 -170 113 -63
7542f3k20J67J46l1J24Pk93P4L47k85m6J03m3J34j16J07j32J43j68j11K20k29
$$ -63 -283 -116 30 -1 123 130 -163 -89 258 -27 -73 30 -13 121 5 112 -20 123 -45 -156 64 -165
7564a65J95l7K39m3k78k9M7O3O9l7J79j96K58l21K62j40j15j5r4K45k0j24j29
$$ -165 30 -7 232 189 -89 -118 -71 -8 61 24 203 7 265 -56 206 66 -49 -64 -158 87 67 -57 -186
7587a86L4J6J79M8o3K82j71J6k04J35k96n8N4K85k52L16p5J61n91o9M60K15j27
$$ -186 -152 -136 43 91 28 310 139 155 -49 86 -210 -268 -214 71 -181 135 60 221 -370 -439 21 236 109
7610A09l47K84j09p1K62m4j01nk49L46k47L04q0K20k06pk91M10k9P9m77M06m9
$$ 109 -238 46 -63 -134 128 84 -17 -22 -271 75 -172 132 52 272 66 59 -232 178 149 228 -249 157 108
7633A08k26N4J73l5O7M7j91K56m36J37J87j01m7j7j44P8J89L1k96q2L56j15J69
$$ 108 -118 -64 109 74 141 188 -3 253 -183 -46 141 40 -7 -24 -168 -90 99 130 -166 -248 108 -7 162
7656A62q3k99K87Q8l23p4K48J38j40M7J04J19m64L04j13O0j1r2O4j79L01k43K82
$$ 162 79 -220 67 155 -168 -242 6 144 4 51 155 274 -190 114 1 61 50 -42 22 -157 144 -99 183
7679A83k04J19k90Q0M1j0J89j2j77p4J77R4k46J69J35j75j61K52k04J19n0J92
$$ 183 -21 98 -192 -112 -71 -81 108 96 -81 -155 22 116 -130 39 174 -1 -162 90 -114 5 -45 147
7701A47l32pJ55j1ln9J53k08K84j44k1o6P0j56J36K94j25O6r2J31m42J92n5L50
$$ 147 -185 -192 -37 -48 -51 -110 43 -165 119 -25 -46 -112 -42 -198 -62 232 107 173 81 212 -230 -38 -93 257
7725B57k90m4L12m06J31K23k53K24j80J83k11j5j20L33k70K11j17J07nk34Q6P1
$$ 257 -33 -77 235 -171 -40 183 -70 154 -26 157 -54 -69 -189 144 -126 85 -32 75 70 -164 -78 -7
7747gj17Q2N6j50L46j08j36l0J28R9j24k41L01M4j62J2Q0j37R3m8P7J4j87K11
$$ -7 -124 -42 14 -136 210 102 -34 -64 64 163 39 -202 99 143 -19 -7 73 -64 29 -19 58 72 -115 96
7771I6n9J33k41K68Ll59j78L24J52k61K7J87O5k81J76j34Q7j71M32p2k32K31m22
$$ 96 37 170 -71 197 200 -159 -337 -13 139 -122 -95 92 157 -124 52 -82 5 -166 266 194 -38 193 -229
7794b29K11k94L48Lj28P5j17J93J9N7j19j20j29K5J23J40J69k48K13O6K5kj53
$$ -229 -18 -312 36 39 -89 -14 -131 62 81 138 19 -101 -230 -205 -82 58 227 -21 192 258 283 281 128
7817A28k73K50k10K43q5j33k7J38j08J08o5p6J62j7j31K07jj61m8K43J2j93Q0
$$ 128 -145 105 -105 138 53 -80 -107 31 -77 31 -34 -110 52 35 -96 111 110 -51 -99 144 156 -37 43
7840D3l02K11p8n9K28k50L82k25K24j18K3N1Q5k97P3J18j28J01j61Q1J66p2j50
$$ 43 -259 -48 -126 -185 43 -207 175 -50 174 56 79 130 215 -82 -9 109 -19 82 -79 2 168 96 -54
7863e4J20Nj95j47O4J24K38k29J18N0m5j27K62Q1k60j83J29j9j2J0J09jl21M24
$$ -54 66 71 -124 -271 -207 -83 155 -74 44 94 49 -78 184 265 5 -178 -49 -68 -80 -70 39 38 -283 141
7887A41Ol08J72J9K05k97K03j04j67J81l5Q9k23R5j18J79p9n7j11K95l8J40k37
$$ 141 147 -161 11 30 235 -62 141 37 -130 51 16 105 -118 -23 -141 38 -41 -98 -209 86 48 188 -49
7910d9q2K65j54j41MJ94rk7Q5j54O4p5j51L44L34n61K99j01l43J09kJ21R9o7J06
$$ -49 -131 134 -20 -161 -157 37 28 1 86 -68 -4 -79 -230 114 448 -113 186 85 -258 -149 -151 -30 69 2 108
7935A08j60K16J1p7J6m29M41k11O4J97p8k71L54m61Q7L97k62J54R5k42J75k18
$$ 108 -52 164 175 98 114 -315 126 -85 -21 176 98 -173 181 -280 -193 204 -58 96 191 -51 124 -94
7957i4O0J22k05L6k4J26j98K38j63K68j66n0K68k1P2M6j6j89k39J33j51M7JPM08
$$ -94 -34 88 -117 -81 -105 21 -177 61 -102 166 0 -50 218 197 269 315 299 110 -129 4 -147 -100 -99 -92 316
7982C16l08q2p2M3L34l51Q1L15m7j86j72l8M58m36J08O0q4j41L14J43k32n5M5
$$ 316 8 -74 -146 -103 231 -120 -39 276 229 43 -129 -167 291 -145 -37 23 -61 -202 112 255 23 -32 13
8005A3k9o5rl3K03l66K36J28j51o7L73k78P4J01k56K86j15j44R9J37j11L8N8O5
$$ 13 -16 -81 -90 -123 80 -286 -50 78 -73 -140 233 -45 29 130 -126 160 45 -99 0 137 26 64 122 187
8029A87M5j63ro7P6j2j41O1j1r0K54Q6l45M22o9j7l97J82J01q5J83l51K28l05
$$ 187 232 69 60 -7 69 57 -84 -23 -34 -124 130 216 -129 293 224 207 -190 -8 93 8 191 -160 68 -237
8053b37K60l9m4Q0p3m0J49P1k53J93J76l90K6K59j61j53R7l0J30N3o2Q7Lj88R6
$$ -237 23 -16 -60 20 -53 -93 56 127 -126 67 243 -147 -121 138 -23 -176 -79 -109 21 74 12 99 102 -86 10
8078A0R2k37J89j94K86j39j03L18j49O7l00J58j87M4o8O7L30j17J21l33L59m25
$$ 10 102 -135 54 -140 146 7 -96 222 73 140 -160 -2 -189 -145 -213 -146 184 67 188 -145 214 -211
8100b11r5K65n0j5l8p3L32J00L8k71k3N3k01J65N4k99M81k31Q6o7L23l70r4K26
$$ -211 -306 -41 -91 -106 -144 -217 115 215 253 -18 -41 12 -189 -24 30 -269 212 -19 67 0 323 -47 -141 85
8124H5k37J92o3R2j22KJ48l40L07oJ03n0j84j20M18m73j8L53j7r6k19Q2K66k10
$$ 85 -152 40 -23 69 -53 -51 97 -243 64 58 161 111 -73 -193 225 -248 -266 87 70 -26 -245 -163 103 -107
8148a07n2K3O5j45M12j98j32M28k44l7P7j33N2r6K04l13L52q3l4j45N8j53L02
$$ -107 -159 -136 -71 -216 196 -2 -134 294 50 13 90 -43 9 -87 117 -196 156 73 39 -106 -48 -201 101
8171A01j51j26J61j79K95j02J00r2j29o2L37j93P1j51J6jJ46mK89k57
$$ 101 -50 -176 -15 -194 101 -1 99 7 -122 -184 153 -40 31 -120 -104 -105 41 37 326 69
8191F9
$$ Imaginary data points
##PAGE= N=2
##DATA TABLE= (X++(I..I)), XYDATA
0@%%%%%%%%%Qj6J6j6K4l2M0n0O0p4Q8j12J36j60J92k24K61l03L53m08M66n36O14
$$ 0 0 0 0 0 0 0 0 0 0 8 -8 8 -8 16 -16 24 -26 34 -40 48 -64 72 -88 104 -120 141 -162 191 -217 249 -287 327
32C27o97P89q93J005j130J271j420J583j765J964k181K416k674K955l262L600
$$ 327 -370 419 -474 531 -599 672 -748 835 -930 1034 -1147 1269 -1405 1550 -1712 1888
48A888l967M372m819N308n848O451p125P882q739R718j0852J2184j3772J5701
$$ 1888 -2079 2293 -2526 2782 -3066 3385 -3740 4142 -4597 5121 -5731 6453 -7319 8382
62H382j8106K1205k5370L1297m0470N6714r4061L40879O6754o43458l7020K98792
$$ 8382 -9724 11481 -13889 17408 -23062 33652 -60409 280470 347224 -296234 -333254 -34462
74c4462K42632j86271j40201J51224K62620j33022l91393j64074L39363M02500
$$ -34462 208170 21899 -118302 32922 295542 162520 -228873 -392947 -53584 348916
84C48916J5337l47798k31725P5143J73345j4278j03805K9791J87413Q0152j62684
$$ 348916 364253 16455 -215270 -140127 33218 18940 -84865 -55074 132339 212491 49807
95D9807k41775k1245K28568K26448k8928k23679j58861O0826J41188J9152r6151
$$ 49807 -191968 -213213 15355 241803 212875 -10804 -169665 -108839 32349 51501 -44650
106d4650o990J52834J13088j33887k55209n0979K39587K23581q3913k70124r5100
$$ -44650 -51640 101194 214282 80395 -174814 -225793 13794 237375 153462 -116662 -211762
117b11762J71789J59607p2284j47881M3548J86611L2600k07115j72239J03242
$$ -211762 -39973 119634 47350 -100531 -56983 129628 162228 -44887 -217126 -113884
127a13884K35329M6700j88181j52303P4170J66155K8773j02879m3689Q5046O4903
$$ -113884 121445 168145 -20036 -172339 -98169 67986 96759 -6120 -49809 35237 100140
138A00140q4169j43663j5629J42615J32505k8906j43453q8894N4039J13808M0478
$$ 100140 15971 -127692 -143321 -706 131799 102893 -40560 -129454 -75415 38393 78871
149G8871n3986n1149K0048L2759m7560r8452p739J37097J37947l6758j77042r6873
$$ 78871 24885 -26264 -6216 26543 -21017 -119469 -127208 9889 147836 111078 -65964 -162837
161a62837R7949J51222Q052j15143n4977O9329N0581p9513r6795N9029J73092
$$ -162837 -64888 86334 94386 -20757 -75734 -6405 44176 -35337 -132132 -73103 99989
172I9989O5253j34064j60613R862J39064P0597o9272q0851K1125O0905j5701p5252
$$ 99989 165242 31178 -129435 -119573 19491 90088 20816 -60035 -38910 21995 6294 -68958
184f8958q905R8142R2152l0770j21158p6670L9778R3880M2675l5051n2533j0519
$$ -68958 -77863 20279 112431 81661 -39497 -116167 -76389 17491 60166 25115 -27418 -37937
196c7937K2172O101j6645P964N9380N3774l7930j19614p8403N7087J31032N9421
$$ -37937 -15765 -9664 -26309 -18345 41035 94809 56879 -62735 -141138 -84051 46981 106402
208A06402o0272q0977m865L7447n629l5287K5888R4214M0993r8067j43265k4596
$$ 106402 46130 -34847 -39712 -2265 -7894 -43181 -17293 76921 117914 19847 -123418 -148014
220a48014J17300J19270M582o7365l5765R396j1624m3620j563P9710Q1653j9307
$$ -148014 -30714 88556 93138 25773 -9992 -596 -12220 -55840 -57403 22307 103960 84653
232H4653j10374q5290K2589R2970O8412K582l3695l0241k3435k6925j6404K3822
$$ 84653 -25721 -111011 -88422 4548 72960 75542 41847 11606 -11829 -38754 -55158 -31336
244c1336O3258M9912j8206q0028o3872J8956Q2399N9555j4299n2037k7426K033
$$ -31336 31922 81834 63628 -16400 -80272 -61316 21083 80638 66339 14302 -13124 -11091
256a1091r436k3508J2620O6104N4689k9819q7847m3823M9294P4759J2992m6006
$$ -11091 -20527 -44035 -31415 34689 89378 59559 -28288 -72111 -22817 51942 64934 18928
268A8928l3601R772R377k2850j9109L3932O2543J5565n4693o1098J393N3743L6433
$$ 18928 -14673 -4901 4476 -18374 -37483 -3551 58992 74557 19864 -41234 -39841 13902 50335
281E0335j7783l8999j4124J2232Q762n393M553K8097K5914j2864m8754l5600J5413
$$ 50335 32552 -6447 -20571 -8339 423 -4970 -417 27680 53594 40730 -8024 -43624 -28211
294b8211M8512K6664k1842l9782j2555J9235J8917J101J369J7117J1115k5081
$$ -28211 20301 46965 25123 -14659 -27214 -7979 10938 12039 13408 30525 41640 16559
306A6559m9353k0217L6781N3794J0843l8029l6496L883K6453J2659n342L194J4926
$$ 16559 -32794 -53011 -16230 37564 48407 10378 -26118 -22235 4218 16877 11535 14729 29655
319B9655m210l8328l9621O840N1179M3174o688m0428k5635Q021J9470O212k173
$$ 29655 25445 -12883 -52504 -45664 5515 48689 42001 1573 -24062 -16041 3429 9641 7468
332G468M586N761j4623l3595j8201K5010M9130K5007k1389m0320j7397J2706J7661
$$ 7468 12054 17815 3192 -30403 -48604 -23594 25536 50543 29154 -11166 -28563 -15857 1804
345A804L544k240L201m78j8196k4296J470L7200M1017L562l7130l9464q865J8653
$$ 1804 5348 3108 6309 5831 -12365 -36661 -35191 2009 43026 46588 9458 -30006 -38871 -20218
359b0218J9767P536R15K02q224k0394j5782J2035L8117L2247o930m2205l9841
$$ -20218 -451 7085 8000 8202 -22 -20416 -36198 -24163 13954 46201 39271 -2934 -42775
372d2775o337K3008K6341J2365L400j520j1501k3542j5436J4938L7166K2844j6990
$$ -42775 -49112 -26104 237 12602 16002 14482 2981 -20561 -35997 -21059 16107 38951 21961
385B1961m1027k5516O694K2795J7994J0632R100j478k1093k9733q489K4209L3018
$$ 21961 -19066 -44582 -37888 -15093 2901 13533 22633 21155 62 -29671 -38160 -13951 19067
398A9067P774k2478k7848r521J0288J6456J4015J0845M038r975k2064j9326j446
$$ 19067 26841 4363 -23485 -33006 -22718 -6262 7753 18598 22636 12661 -9403 -28729 -30175
411c0175J7493K1122P368j1721j6608o082Q973J3937O667j289k377n033j1394
$$ -30175 -12682 8440 15808 4087 -12521 -18603 -9630 4307 10974 9685 7308 2275 -9119
424i119j3635n58J7148J9158M30j5421q913R599J2753j460j1510n197N566L83
$$ -9119 -22754 -23312 -6164 12994 13424 -1997 -10910 -1311 11442 9982 -1528 -6725 -1159 -776
438g76r995o695J1374J9779M741j4993j4352L826J4805O821o769j0966m552k177
$$ -776 -10771 -17466 -6092 13687 18428 3435 -10917 -7091 7714 14535 7766 -3200 -7752 -9929
452i929j480J650J0363J4397P379o240j5328j1672J77J0422J0904Q63r760r861
$$ -9929 -11409 -9759 604 15001 22380 16140 812 -10860 -10683 -261 10643 11506 1746 -8115
466h115k144N769O722O526Q508N984p023k0501j6828M349J9391J2914m502j0899
$$ -8115 -10259 -4490 2232 8758 17266 23250 16227 -4274 -21102 -16753 2638 15552 11050 151
480A51l197L498J399j94O978J1185N71j6988k0527l397J4709J5443M337l724l255
$$ 151 -3046 452 1851 1657 8635 19820 20391 3403 -17124 -20521 -5812 9631 13968 10244 6989
495F989k279l415j979N430Q898J363j0246j3672o058N512J1820J0167M987k949
$$ 6989 4710 1295 -684 4746 13644 15007 4761 -8911 -14969 -9457 2363 12530 17517 14568
509A4568p611p497k703J978M242K472o39m093o906l965N930J4019R561l189j0496
$$ 14568 6957 -540 -3243 -1265 2977 5449 4810 717 -6189 -10154 -4224 9795 19356 16167 5671
524E671q196k176N96J15L642P378K328p796j0664j23J2467J2697J485p835q553
$$ 5671 -2525 -4701 -4105 -3990 -348 7030 9358 1562 -9102 -9225 3242 15939 17424 9589 1036
539A036n993o153l396M780J2762J1263k52j0704r547m51N901M932O86j650l024
$$ 1036 -4957 -11110 -14506 -9726 3036 14299 14047 3343 -6204 -6655 -754 4178 4864 3214 190
554A90m602m964k262M194Q435R421L366n307r804o394P28M566J807k155j655J608
$$ 190 -4412 -9376 -11638 -7444 991 10412 13778 8471 -1333 -7727 -6999 -2433 -626 -2781 -4436 -2828
570b828J887r48m73L431N059P27o284p016j778K264N70j599j82M480N487Q82k507
$$ -2828 -941 -1889 -2362 1069 6128 6855 571 -6445 -8223 -5959 -5389 -6988 -7170 -2690 2797 3679 1172
587A172k218n37K99k298j630N9P58m35k282J4L272O508L753o44m623n123l855
$$ 1172 -1046 -1583 -1284 -3582 -5212 -5153 -4395 -4830 -7112 -7098 -3826 2682 6435 5791 1168 -3955 -7810
604g810j230N06K224K771K834Q49j462k041p4K471K705J65k907m689k966j791
$$ -7810 -9040 -8534 -6310 -3539 -705 144 -1318 -3359 -3433 -962 1743 1908 -999 -5688 -8654 -10445
620a0445J158L949N213M267j27k596l578j515P02J030k87j775k665j510M52L617
$$ -10445 -9287 -5338 -125 4142 4015 1419 -2159 -3674 -2972 -1942 -2229 -4004 -6669 -8179 -7727 -4110
636d110N865M788J092m295o622m292o9L137K094L05n96J029L86j451q2L464N186
$$ -4110 1755 6543 7635 3340 -3282 -7574 -7643 -4506 -2412 -2107 -2703 -1674 -1288 -2739 -2821 643 5829
653E829J803m763p664m229P83K856K661K623L493J787k412l542r50K400K663n94
$$ 5829 7632 2869 -4795 -9024 -8241 -5385 -2724 -101 3392 5179 2767 -775 -1725 675 3338 2744
669B744l756m139k027M38L487N470M442J222k058l658l123k021o06J622K584J114
$$ 2744 -1012 -5151 -7178 -6740 -3253 2217 6659 7881 5823 2165 -958 -2979 -3585 -1963 621 1735
685A735j974k184O57K799K784J199J384J297l149o684n683M92N947M552R89l23
$$ 1735 -239 -2423 -1766 1033 3817 5016 6400 7697 4548 -2136 -7819 -7327 -1380 3172 4161 3838
701C838J026j57k244k881J519L664P48m093m682j828J491K471L583M091L079j028
$$ 3838 4864 4707 2463 -418 1101 4765 5513 1420 -3262 -5090 -3599 -1128 2455 6546 9625 8597
717H597m462m773j723Q12R14J025J670M22q55k440O51L827L473P21k182l704l789
$$ 8597 4135 -638 -2361 -1549 -635 390 2060 2482 1627 -813 -162 3665 7138 7859 5677 1973 -1816
734a816l332n67L281M939K963o25k163p06J76o40k88J296Q69k520m498k911K726
$$ -1816 -5148 -5715 -2434 2505 5468 4843 2680 1974 2150 1510 1222 2518 3387 867 -3631 -6542 -3816
751c816M785L113P29O07R1k388m298k539J129K446O13j711j006J482J788J107
$$ -3816 969 4082 4811 5418 5509 3121 -1177 -3716 -2587 -141 472 -1239 -2245 -763 1025 2132
767B132O98J444j84k946l408j943M91R28R24R59J470N58n33p78J474J189o58k927
$$ 2132 2830 4274 4090 1144 -2264 -4207 -3716 -2788 -1864 -905 565 1123 590 -188 1286 2475 1817 -1110
785a110k530j200j66P95K000L036J744n46j827p92q4k58j033n04j10n5j493j313
$$ -1110 -3640 -4840 -5006 -4211 -2211 825 2569 2023 196 -596 -680 -938 -1971 -2475 -2585 -2640 -4133 -5446
803e446K273L563K905J58j670k476j763k196j312J223K520Q75l29o74L32R82Q46
$$ -5446 -3173 390 3295 3453 1783 -693 -2456 -4652 -5964 -4741 -2221 -1346 -1675 -2349 -2017 -1035 -189
820a89Q03K96j074k825k970j061J769K769J862J129N35j038j474j307J094J524
$$ -189 614 910 -164 -2989 -5959 -7020 -5251 -2482 -620 509 1044 6 -1468 -2775 -1681 -157
836a57O71j454k238k250m19P78K805L990L273n99l464m447k759Q9J412K363K121
$$ -157 514 -940 -3178 -5428 -5847 -5069 -2264 1726 4999 4400 936 -3511 -6270 -6181 -4769 -2406 -285
853b85J097j026k122j379J026K435K479J191j630l578l366j669J211L154L450
$$ -285 812 -214 -2336 -3715 -2689 -254 2225 3416 1786 -1792 -5158 -6827 -5616 -2462 988
868I88K272P60j499k330k506n68J242J963P19j098k058j859J56J862L498K676
$$ 988 3260 4020 2521 191 -2315 -2883 -1641 322 1041 -57 -2115 -3974 -3818 -1956 1542 4218
884D218P15j676l207l299j533L09K665K771J282m46j397j026L36J004J629R84
$$ 4218 4933 3257 50 -3249 -4782 -4473 -1808 963 2245 1799 402 -624 -288 716 2345 3329
900C329n61k661k696j815R67K535K839K486R58j411k521k494n37J463J271J72
$$ 3329 2768 107 -2589 -4404 -3437 -902 1937 4423 5381 3970 1449 -1045 -1582 -119 1152 1324
916A324q98r48n35l04O94K491L089Q34j982l479j900j082K93J420J723K092L48
$$ 1324 426 -522 -1057 -1361 -667 1824 4913 5747 3765 286 -1614 -2696 -2403 -983 740 2832 3180
933C180j388j184O52J399O59o61j605j392j130r36P64K709K223J79q06m92r9r96
$$ 3180 1792 608 1260 2659 3318 2657 1052 -340 -1470 -2406 -1642 1067 3290 3469 2663 2171 2072 1076
951A076j120K84N60o74j653o19J811K648Q37j035p47P33l22j597j235N86R15n58
$$ 1076 -44 240 800 126 -1527 -2146 -335 2313 3150 2115 1368 2101 1779 182 -1053 -467 448 -110
969a10j431l11J952K376P16j81O6j161k361k574l3J952J562K99m68M73J72j277
$$ -110 -1541 -1852 100 2476 3192 3011 3077 1916 -445 -3019 -3052 -1100 462 761 293 766 938 -339
987c39o52J520K420K67l468k954n86P72J221J513J994J946j028l020j776M30J389
$$ -339 -991 529 2949 3216 -252 -3206 -3792 -3020 -1799 -286 1708 3654 2626 -394 -2170 -1740 -351
1004c51j26n32P13m9j454j857O24L660K547m05j727r76r16k076j926P21L163J866
$$ -351 -477 -1009 -296 -345 -1799 -3656 -3032 628 3175 2770 1043 67 -849 -2925 -4851 -4130 -967 899
1022H99l98j110K84N06j376p44J473J963q9l366k268j44K061Q55Q70K027J736
$$ 899 501 -609 -325 181 -1195 -1939 -466 1497 1408 -1958 -4226 -4370 -2309 -1454 -584 1443 3179
1039C179p96l632k341OJ493Q61L88P91M54k081k249R00L522K914p89k165j634
$$ 3179 2383 -1249 -3590 -3584 -2091 -1230 -842 -51 403 -1678 -3927 -3027 495 3409 2620 455 -1179
1056a179j057j968j505K153M534K664j818k652p89N46N2j85J003J751j131l029
$$ -1179 -2236 -4204 -5709 -3556 978 3642 1824 -828 -1617 -1071 -1019 -1204 -201 1550 419 -2610
1072b610k486J527K980J677O59M57o2j841l677j188K489K733K94j843l38O93J6
$$ -2610 -5096 -3569 -589 1088 1747 2204 2142 301 -3376 -4564 -2075 658 952 -891 -1229 -536 -520
1089e20q46N57K909J891k449l481j030O87P97l10J074K443J370j827k011j13K146
$$ -520 -1366 -809 2100 3991 1542 -1939 -2969 -2282 -1485 -1795 -721 1722 3092 1265 -746 -859 1287
1106A287Q6j786j134J026P22q83r07J529K389K07j586l81M80K16j850j179R37
$$ 1287 1373 -413 -1547 -521 201 -682 -1589 -60 2329 2536 950 569 1049 1265 -585 -1764 -827
1123h27J399m98r27Q86J989P44j514j226J59J213n80j527n60J252M69q55J98J570
$$ -827 572 74 -853 33 2022 2766 1252 26 185 1398 818 -709 -1269 -17 452 -403 -205 1365
1141A365J725m47j430m80P16j231j714J7J347J455n34k79R53J407n08k098j004
$$ 1365 3090 2643 1213 733 1449 218 -1496 -1479 -132 1323 789 510 1463 2870 2362 264 -740
1158g40J427O85j199j331J36J179K48M5P43J349O12j602j816k15K55l87m02R08
$$ -740 687 1372 173 -1158 -1022 157 405 450 1193 2542 3154 1552 -264 -479 -224 -611 -1013 -105
1176a05J602M31j548q39R10J457j86n91l17j27j129j922l58J701K374J151p14
$$ -105 1497 1928 380 -459 451 1908 1722 1131 814 687 -442 -2364 -2722 -1021 1353 2504 1790
1193A790k05m16j486j157L23J613R48j211j742j87J033J304L48O20J046o23k171
$$ 1790 1585 1169 -317 -1474 -1151 462 1410 199 -1543 -1730 -697 607 955 1575 2621 1998 -173
1210a73k708M07J262R67p6O14P35l20j835l35J725J773K6j785j469p61p25j35
$$ -173 -2881 -2474 -1212 -245 -321 293 1028 708 -1127 -1462 263 2036 2062 277 -1192 -1953 -2678 -2813
1228b813J023K972J973o45k183j379N13J11m11P9J060J3j372j289O64J768J052
$$ -2813 -1790 1182 3155 2510 327 -1052 -539 -428 -839 -760 300 313 -1059 -2348 -1684 84 1136
1245A136J82K0m1j173k012j561J061K275R81p56l77K06R9m34l16J043J239n29
$$ 1136 1318 1338 1297 124 -1888 -3449 -2388 -113 868 112 -265 -59 40 -394 -710 333 1572 1043
1263A043k132q78q5O19L90P41J557M92o75j723p50O87Q50n21o62J12P20m67l41
$$ 1043 -1089 -1967 -2052 -1433 -1043 -302 1255 1747 1072 -651 -1401 -714 136 -385 -1047 -935 -215 -682 -1023
1282a023L80J522Q69o43r71r05o90l26O9J122J129K54p17p59P71N89m08l82O53
$$ -1023 -643 879 1748 1105 134 -771 -1461 -1787 -1718 -596 533 787 70 -689 82 671 263 -119 534
1301E34j58o27j388l22N84J707M46j52jO6l6r03m34L58l8J28m43MO83K05J73P27
$$ 534 376 -251 -1639 -1961 -1377 330 776 624 623 689 653 -250 -684 -326 -364 -236 -679 -675 8 213 386 1113
1323A113R2k46q55o21m07N89L78q0j18K6L45J85L46M45K0j72q79m83l84j97M62
$$ 1113 1205 959 104 -517 -924 -335 43 -37 -155 -129 216 401 747 1192 1212 1040 161 -322 -706 -903 -441
1344d41N85O75K23l40n18r0N17M04m82m70k33j78l54L19K57J298R5L36l49m95
$$ -441 144 819 1042 702 184 94 611 1015 533 63 -170 -348 -702 -383 -126 1172 1267 1603 1254 759
1364G59p45m37K50O90j10j38k84l99N82N69M19q8M74n70r08p22k89N47O44L31
$$ 759 14 -423 -173 517 407 269 -15 -414 168 737 1156 1068 1542 972 64 -658 -947 -400 244 575
1384E75N22N5q96j29k0L79L26P9j29p27m81l36K80O53J012P28l38n29r70o24k84
$$ 575 1097 1152 256 127 107 486 812 891 762 35 -446 -782 -502 151 1163 1891 1553 1024 54 -570 -854
1405h54Q67K34K05j80l22j73K26M09M97K81K7q83q62m37o6L36P50Q61n6l20m99
$$ -854 13 247 452 272 -50 -223 3 412 909 1190 1217 334 -528 -965 -1031 -695 55 916 860 540 41
1426D1n0M1N39J53k69m24l06n88j58M93O42R48J41o09o23m56j75j42O18O3j57
$$ 41 -9 32 571 724 455 31 -275 -863 -1021 -528 114 1062 1203 594 -29 -485 -660 -802 -184 -121 -278
1447b78j6j1J15L20K9M81ro3j38j008p82j37J044N31L44K10k08m1m39m17N57q0
$$ -278 -294 -305 -190 130 159 640 631 568 430 -578 -1360 -1497 -453 78 422 632 424 383 -56 -473 84 4
1469DJ90m82m65j80q1N29O31O55o5j74o88l85P5K06j60K12j24J6P4l38N73M91
$$ 4 194 -288 -753 -933 -1014 -485 146 801 736 562 -126 -511 -436 -230 -390 -178 -302 -286 -212 -550 23 514
1491E14M49j74j94r44o97j24p8J047P64J64m43k20k48N9L64r1L36m74k22q19j25
$$ 514 963 789 595 -349 -1046 -1170 -1248 -201 563 727 284 64 -184 -125 239 148 484 10 -212 -1031 -1156
1512a156O15R46N81l69l59p20j52j1N50M49J40p25n12k77K87Q08L60P06J96q61
$$ -1156 -541 405 986 617 258 -462 -614 -625 -75 374 514 -211 -723 -1000 -713 95 455 1161 1357 496
1532D96q13j000L1J060P28j15m8j11n06K45J94R46j65k25q78q13J62K52L51N78
$$ 496 -317 -1317 -1286 -226 502 387 339 228 -278 -33 161 1107 942 717 -161 -974 -812 -560 -209 369
1552C69M68J13q04n92L33O34j6J2n18l05j51M5p7R98M16N7k93l81k0k85J72j9
$$ 369 837 950 146 -446 -113 521 505 517 -1 -306 -457 -412 -489 509 925 982 689 308 288 3 175 156
1574A56n0J96p64L2K81R42L07l64j64k53k33l0J0o7L5O2j76K62L14N23k35k02
$$ 156 106 302 -462 -430 -149 793 1100 736 572 319 86 56 66 -1 34 96 -80 182 496 1019 784 582
1596E82k90m69j46j71L63O37L53o33m85k14Q25N65J35p8m64p76r95L04Q08R58
$$ 582 292 -177 -323 -494 -131 506 859 226 -259 -473 352 917 1052 974 510 -266 -1261 -957 -149 809
1616H09J75l10l81k12l05L76M19L27J14j129j335j34J218Q13J003Q1n88p93q62
$$ 809 984 674 293 81 -224 152 571 898 1012 -117 -1452 -1586 -368 445 1448 1529 941 148 -714
1635g14k44J079M35N68k82j226r60O5Q78J237Q02J48r97j621r57O09R68J008N19
$$ -714 -958 121 556 1124 842 -384 -1344 -1279 -401 836 1638 1786 789 -832 -1789 -1180 -212 796 1315
1654A315n65j161p69k36J299J118J041n04j291j873l21N23J084J922m7o64j250
$$ 1315 750 -411 -1180 -1416 -117 1001 2042 1538 247 -1626 -1947 -1424 -340 1582 1535 871 -379
1671c79j026K29J080R57K51n25q41j230j77P05J480O80r2p26j094o89K57J057
$$ -379 -1405 -1176 -96 861 1112 587 -254 -1484 -1661 -956 524 1204 1112 386 -708 -1397 -1140 -83
1689h3J032K52r29j298o01M04J118Q59N71k65j463m57l51N86M53O79J96j093l85
$$ -83 949 1201 272 -1026 -1627 -1223 -105 754 1325 1060 -403 -860 -1211 -625 -172 507 703 -390 -775
1708g75q9P38P20M81j43j003q91l73M97R02O23j67n18o21m93L86O33J006L89q73
$$ -775 -864 -126 594 1075 932 -71 -962 -1335 -838 64 687 520 2 -619 -1112 -726 -93 913 1302 429
1728D29j199o55Q5Q85Q59P78l30j209o49k87O47J337M06o06q82m57q45Q14J099
$$ 429 -770 -1425 -1340 -455 404 1182 852 -357 -1006 -1293 -646 691 1097 491 -391 -848 -1693 -879 220
1747B20J343J65q83j755m73M11R52J105J76o46j103j120J70J415J490M03m64j623
$$ 220 1563 1728 845 -910 -1383 -972 -20 1085 1261 615 -488 -1608 -1438 -23 1467 1870 1406 -217
1765b17j103j66N56J599J071q4j126j533o08N39J655J112K74q29j670j157l59
$$ -217 -1320 -1486 -930 669 1740 1656 530 -1003 -1611 -1072 583 1695 1969 1140 -530 -1687 -2046
1782b046J719J619P09m55j283j703j11J214J079R59j8j324j916q54Q23J712J967
$$ -2046 -327 1292 2001 1546 263 -1440 -1551 -337 742 1701 1683 359 -1557 -2411 -1588 124 2091
1799B091J14j129j521j261J15J291J317P80l64j408j262o97J355J563J256k97
$$ 2091 2205 1076 -445 -1706 -1591 -300 1017 1797 1433 25 -1237 -1934 -579 984 2240 1943
1815A943r00k129r99N90J435J839L10r78j808j013J58J302J657O86m54j621j296
$$ 1943 1043 -1086 -2085 -1495 -60 1779 2089 1111 -697 -1710 -1552 -250 1407 2093 1639 18 -1278
1832a278r14J143J207J554Q7j389j094q63L97J234J569J20j176j604q15M64J242
$$ -1278 -2192 -1049 158 1712 1799 410 -684 -1547 -1150 84 1653 1773 597 -1007 -1822 -1358 -116
1849a16J189M82o48j076q11k49N71J275P10k52j074j199m29Q12J734Q54k72j126
$$ -116 1073 1555 907 -169 -980 -1229 -658 617 1327 1075 1 -1198 -1627 -815 919 1773 1501 375
1867C75j030q78M05J218J039Q4p93j343n45M51J067J427M0m08j641j128k81J695
$$ 375 -655 -1533 -1128 90 1129 1213 420 -923 -1468 -1017 50 1477 1517 1109 -532 -1660 -1941 -246
1885b46J260N05l00j478j103m61J008J678J059m06j075j840n48K11J765J739J40
$$ -246 1014 1519 1219 -259 -1362 -1823 -815 863 1922 1516 441 -1399 -1947 -1736 29 1768 1908
1902A908q44j415j532Q0J287J726J048j063j697j501K4P10K035J399l37j113j608
$$ 1908 1064 -351 -1883 -1803 -516 1210 2258 1195 -502 -2003 -1979 -1269 766 2165 1828 715 -893
1919h93j093N46J263J537M66j048j355j498M35J271J498J038l42j907j871j79
$$ -893 -1986 -1440 -177 1360 1826 778 -577 -2075 -1640 -369 1129 2167 1825 -82 -1953 -2132
1935b132J036J401J502j72j168j451p87K22J657J684L81j297j859j027K94J349
$$ -2132 -1096 305 1807 1635 467 -984 -1771 -1549 108 1792 2173 876 -983 -2010 -1716 -367
1951c67J400R49o94j485j352k35J087J342J151j61j438j639r03R53J351J769M71
$$ -367 1033 1982 1288 -197 -1549 -1784 -697 645 1796 1635 197 -1442 -2345 -1392 -41 1728 2199
1968B199j224j725j099J22J170J687P41p57j331j120n08J197J280J523n77j222
$$ 2199 975 -750 -1849 -1727 -557 1130 1871 1114 -217 -1337 -1845 -648 632 2155 1578 356
1984C56j468p60O23J255J633l13q14r52j349O20J208J278M99j008j117p07l22
$$ 356 -1112 -1872 -1249 6 1639 1326 512 -440 -1789 -1169 39 1317 1816 808 -309 -1016 -1338
2001a338P12J319Q66m16r01j020m87N90J316O96j14r64j385n27O11J177J238K62
$$ -1338 -626 693 1559 1143 242 -778 -1265 -675 641 1337 1223 259 -1126 -1653 -1042 135 1373 1635
2019A635r60j257m88K65P83J106k5j21j303j081R0J060J437N74o02j096j228j52
$$ 1635 675 -582 -1070 -805 -22 1084 1059 938 -365 -1446 -1356 -296 1141 1715 1113 17 -1211 -1363
2037a363N57J272J244n57j084j057n02O30R71J372J76r13j171j343K14J181J454
$$ -1363 -806 466 1710 1153 69 -988 -1490 -860 111 1483 1659 746 -425 -1768 -1554 -373 1081
2054A081N74n75j157j210l61Q78J621R48j90j352j324p41O03J330J396M92j283
$$ 1081 1655 1080 -77 -1287 -1648 -770 851 1799 1609 257 -1067 -1808 -1205 125 1521 2013 730
2071G30j237j030K11R22J555N62n03j506j161n35J147J493J155l04j229j073p43
$$ 730 -507 -1537 -1326 -404 1151 1713 1210 -296 -1457 -1992 -845 648 1803 1499 270 -803 -1546
2088a546M97J367Q66Q5q08j034q71k51J159J690K28l78r86j807L60O30J248Q73
$$ -1546 -1049 318 1184 1269 461 -573 -1444 -1695 -536 1154 1382 1004 18 -1789 -1429 -799 449 1322
2106A322k17r12r84o86M46J146J079J1n40j287o07j51J487Q53M95o08j013j076
$$ 1322 1105 193 -791 -1477 -1031 115 1194 1205 665 -622 -1229 -1380 107 960 1455 847 -166 -1242
2124a242o6R59Q40P69j74j109j125j44O56R33N66J60j96j179p23j27J017J095
$$ -1242 -1308 -349 491 1260 1086 -23 -1148 -1292 -636 297 863 1023 827 -352 -1075 -1202 -185 910
2142I10J49n25j069n77M14L37J141K89j16r57j075J14M04R46K48K03o95o88k92
$$ 910 1059 534 -535 -1112 -698 -361 780 1069 953 -4 -1079 -965 -561 385 633 836 141 -547 -839
2161h39O9J007O28J38q98o21p05M74J050K63J92k39q06p48J53P86P85j18j9o67
$$ -839 -770 237 865 1003 105 -516 -1221 -747 303 566 758 519 -287 -1035 -882 -96 689 571 552 -115
2181a15o01k07M27N52R96k52o83j032k87O85N90O37m5l09n59p91J69M99Q02L57
$$ -115 -716 -923 -496 56 1052 800 117 -915 -1202 -517 73 710 665 356 -203 -994 -825 -326 476 833
2201H33k23o36p34k45P10O33K84J56o57r36l05L63R95O09q9n47n49n09L9M25R86
$$ 833 610 -26 -760 -1005 -295 338 622 778 121 -815 -1120 -757 238 847 758 211 -338 -847 -808 -383 603
2222F03M47k80r90m27j80M56O87N83j75p43p41l38N01O30P38q6k37q27n51O8O42
$$ 603 1050 770 -220 -647 -827 -371 316 899 724 -19 -760 -1098 -597 33 771 685 448 -379 -930 -862 -220
2243b20K82R38l73n21p35j34K48R71qJ58l22p14l03M7P75L84j30k32m33j30J7
$$ -220 62 1000 627 106 -629 -763 -515 456 448 606 284 -430 -733 -686 89 473 343 111 -322 -452 -435
2264d35K15M86K27P4p64l55J46K29L62L20l51m7l12m66L36J89L72M51p37j78j02
$$ -435 -220 266 493 567 -197 -552 -406 -177 185 505 154 107 -205 -671 -335 -146 226 677 -60 -238 -340
2285c40k77O03L22J84j77m30j93M0k3M11J44q5k21m04J21j4L57K51Q1o6o94J67
$$ -340 -617 -14 308 492 315 -115 -308 -268 -291 120 264 179 -42 -446 -325 -339 18 269 350 284 -410 -243
2307b43j6LK65K63l66j07m66L89L48L84j83j54n89J88J1O2J38P72l77n28l02J52
$$ -243 -259 -256 9 272 -94 -201 -667 -278 70 454 271 117 -472 -284 -273 -211 -73 699 322 -206 -508 -356
2329c56K98J98j2J53l08l89l6K10K06J76J82j97m37l9J36J96M09k16K70p22j47
$$ -356 -58 140 128 281 -27 -416 -452 -242 -36 140 322 125 -312 -351 -215 -19 390 174 444 -278 -425
2350d25J91k4N07J03o8j32m95l7J88J39K74j9j14j59l32J84J2M49L1k58l59R5
$$ -425 -234 -258 249 352 284 152 -343 -380 -192 -53 221 202 88 -71 -403 -219 -207 242 273 15 -344 -249
2372b49k4K63m1M67k24j36l96p3K02J76L59mj54k69k39J51m2K75J17j75J21l20
$$ -249 -273 -10 -51 416 192 56 -340 -413 -211 -35 324 320 166 -103 -342 -191 -233 42 159 -16 105 -215
2394b15q8L20k5N24m00K3m79KJ51J69L63j83K22m18m0n7J63J62J38l4k10k74j33
$$ -215 -303 17 -8 516 116 139 -340 -338 -187 -18 345 162 384 -34 -74 -131 32 194 332 298 88 -186 -319
2417c19%M28q7L18k87J8l0j86J97R1o1jm80K66Q2J79k7Kj36Q4j25k49J40K24J9
$$ -319 -319 109 22 340 53 71 41 -145 52 143 82 81 -399 -133 -51 128 101 103 -33 51 -74 -323 -183 41 60
2442F0q4ol01K72O0K70l83M07k6l12k22M3M60k73J05j85O4J67k7PmJ68l17j68
$$ 60 -24 -30 -331 -59 1 271 -112 295 269 -43 -265 -222 238 -35 70 -115 -51 116 89 96 92 260 -57 -225
2466b25M5J19r3M57J35l92j22N8k66N42j70lo5M2r3j7o8J10J86N1ro2n27O9M87
$$ -225 -180 -61 -154 303 438 46 -76 -18 -284 258 88 85 20 62 -31 -48 -116 -6 180 231 222 160 -367 -298 189
2491A89n3k17K20j07ol27N99k70O4K45k61m5P8j78N5J80R6m79M32k21k13J87L3
$$ 189 136 -81 139 32 26 -301 298 28 92 337 76 31 109 -69 -14 166 262 -217 215 -6 -219 -32 1
2514AJ08O9J7l08k67K41L3J74n4k25K79k55K5J90j9P4j6J04l38J51J43L57o25
$$ 1 109 178 195 -113 -380 -139 -106 68 14 -211 68 -187 -162 28 9 83 67 171 -167 -16 127 484 -141
2537a41K01j62K08j02J72j74m4J43J15k93l3k6L27j45J24k32k46L67o9oJ52k75
$$ -141 60 -102 106 4 176 2 -42 101 216 -77 -110 -136 191 46 170 -62 -308 59 -10 -16 136 -139
2559a39K00j61J63p1k2p6K38N3k16J50l51L41l20K23J73k8j0l00J66o2k4O9j35
$$ -139 61 -100 63 -8 -30 -106 132 185 -31 119 -232 109 -211 12 185 157 147 -153 13 -49 -73 -4 -139
2582a39L02J32k96P8k29L1N1M0nk3J87j63L31k04p3L1l8p6J97k05J80m3k65O3
$$ -139 163 295 -1 77 -152 -121 -70 -30 -35 -58 129 -34 297 93 20 51 13 -63 134 -71 109 66 -199 -136
2606a36J35J57p2J9j50l8M1J8J60k91J54k9%O7j27q2M63l67K42l72J53m9J28l7
$$ -136 -1 156 84 103 -47 -85 -44 -26 134 -157 -3 -32 -32 35 -92 -174 289 -78 164 -208 -55 -104 24 -13
2630a3J93k48lK54L5k88J52m0R3k29K7M25l49n8J95m2q0O0j46J05M0l2J9N6l44
$$ -13 180 -68 -71 183 218 -70 82 42 135 -94 -67 358 9 -49 146 104 24 84 -62 43 83 51 70 126 -218
2655b18N91l31j66R3J06j73J98o5M8oK44l73n5K02j54J86o7J10l69K27K47m34
$$ -218 373 42 -124 -31 75 -98 100 35 83 77 321 -52 -107 95 -59 127 60 170 -199 28 275 -159
2677a59K78J2j10k5K14n27M94r7j1k55J04j69J61j74K93J07j97o7K1M9P0n3L72
$$ -159 119 131 21 -4 210 -317 177 80 69 -186 -82 -251 -90 -264 29 136 -61 -128 -107 -58 12 -41 331
2700C31k15j63J45k42LK75j89k33M21j19J80j49RQ7k4j02J3l08K10O8J92l56K8
$$ 331 116 -47 98 -144 -141 134 -55 -288 133 14 194 45 54 141 117 15 28 -280 -70 -2 190 -166 -138
2723a38N0j17J06L2j68K86P5m5k9r1M5K2j5j37J75k2p7J23j34J12K02k33r0l6
$$ -138 -88 -205 -99 -67 -235 51 126 81 52 -39 6 28 13 -124 51 29 -48 75 -59 53 255 22 -68 -104
2747a04K35k38j32L38J65l71J37K4p8J05N0j50j05K50l55K06J05k03R0M05m24
$$ -104 131 -107 -239 99 264 -107 30 54 -24 81 131 -19 -124 126 -229 -23 82 -121 -31 374 -50
2768e0j24K26K5O1K17l69KJ53p6PJ39p3p6o1L16j91j09J96l71K09k59K30J78l3
$$ -50 -174 52 77 138 355 -14 -12 141 65 72 211 138 62 1 317 126 17 213 -158 51 -208 22 200 167
2792A67j5L27p98J96N9J08l81M61r0mLM1m7l48L13k1J66p9l0q8J45L20n51J55
$$ 167 152 479 -319 -123 -64 44 -337 124 34 30 33 74 27 -321 -8 -29 137 58 28 -60 85 405 -146 9
2816Iqq1K8Q3j04pJ65j02L2P6j85J41j71j91J07J84n4R1p3N7r9k1J72j1j42L7
$$ 9 1 -80 -52 31 -73 -80 85 -17 15 91 -94 47 -124 -315 -208 -24 -78 13 -60 -3 -102 -123 49 38 -104 -67
2842f7j15K77k62J81J29k39L2%J01o2l6mK05j82K23j08k85L53p8j4N0J25j15j18
$$ -67 -182 95 -167 14 143 -96 -64 -64 37 -25 -61 -65 140 -42 181 73 -212 141 63 49 99 224 109 -9
2866iJ39K4n2N0o7rp4O3n0L9j12k2J95n5k41j8K27j26%L9J33K5l5no0L25l16j3
$$ -9 130 154 102 152 85 76 2 65 15 54 -58 -80 115 60 -181 -199 28 -98 -98 -59 74 99 64 59 -1 324 8 -5
2894eM6j11N4p4K9K69k31R4K66k89j59L55k89R4r0JjP8J8J27P7m75N1K41j26J18
$$ -5 41 -70 -16 -90 -61 208 -23 71 337 48 -111 244 -45 49 -41 -40 -41 37 55 182 259 -216 -165 76 -50 68
2920F8l11Q8J12J0j35K55op5j96J62j41K5%K26%N3m2o5k21J50J95l54Q0O7pp1
$$ 68 -243 -155 -43 -33 -168 87 81 6 -190 -28 -169 -144 -144 82 82 135 93 28 -193 -43 152 -202 -122 -55 -62 -133
2946a33J50j9M90m84J42l71P8K84j68J2L5K61l43QJ3j11R2J57m07L77j95J86k39
$$ -133 17 -2 488 4 146 -225 -147 137 -31 -19 16 277 -66 -58 -45 -156 -64 93 -314 63 -132 54 -185
2969a85L58J59j60l41J95l89L83M43n87J51k54K0J68J17j05K11j04O0j59K46l24
$$ -185 173 332 172 -169 26 -363 20 463 -124 27 -227 -207 -39 78 -27 184 80 140 -19 227 -97
2990i7Q1q2l4M1L4K18n5l19K28l0M3j02k3J02j47L28p5j07Q3l7j60K90l97K34
$$ -97 -16 -98 -132 -91 -57 161 106 -213 15 -15 28 -74 -97 5 -142 186 111 4 87 50 -110 180 -217 17
3014A7O0L1o9k29J04J20n8J2K8j99M30L1k49j23J82j50L03o0j21j95Q0K44k94
$$ 17 77 108 39 -190 -86 34 -24 -12 16 -183 247 278 29 -94 88 -62 241 181 60 -135 -55 189 -105
3037a05M5p0J39j92P8N3J85j72j6N1m27M32n9Q0O6m6K09j57j08om3L43j20j87
$$ -105 -60 -130 9 -183 -105 -52 133 -39 -55 -4 -431 1 -58 22 88 42 251 94 -14 -20 -63 280 160 -27
3061b7J83l43KK98j3j21k2m6M8j10J45j93o4L48k9j30L33m52N2K08j72j46J23
$$ -27 156 -187 -185 113 100 -21 -43 -89 -41 -151 -6 -199 -263 85 56 -74 259 -193 -141 67 -105 -251 -128
3084a28n7J85N3p4r6j73K07o7J79N7m4p2k7J90J17l88j22K38k17L19J31n6Q0l49
$$ -128 -185 0 53 -21 -117 -290 -83 -150 29 86 42 -30 -57 133 250 -138 -260 -22 -239 80 211 155 235 -114
3108a14L37n24J98m0l2K56K05l33M0k7j86J58R3j35M8O7J30j38j8P1%K5k4q2N4
$$ -114 223 -301 -103 -143 -175 81 286 -47 -7 -34 -220 -62 31 -104 -56 11 141 3 -15 56 56 81 57 -25 29
3133B9k73L94K1j80J95p9lm3Lm4J72l35L38j08k29j06L58j29k7k72L99l03K21
$$ 29 -244 150 171 -9 186 107 104 61 64 20 192 -143 195 87 -142 -248 110 -19 -46 -318 81 -222 -1
3156aL09j82l62K44j42K1L11m4J3j15k47RK76R4k99M11l97J18p3n8kL6M9n8M95
$$ -1 308 126 -236 8 -134 -113 198 154 167 52 -195 -186 90 184 -115 296 -101 17 -56 -114 -116 -80 -31 -89 406
3181D06k94k05P0n02P36j69p6k2k96M59j65R2n7K90q8M3k31K80n49L02m8J26j65
$$ 406 112 -93 -23 -525 211 42 -34 -56 -352 107 -58 34 -23 267 179 222 -9 271 -278 24 -24 102 -63
3204f3k2J59Ok5l6j20L62m01M89n94K66j57j21K83J37j46N7Nl9j7j57J63n1k01
$$ -63 -85 74 80 55 19 -101 261 -140 349 -245 21 -136 -257 26 163 17 74 79 40 23 -134 29 -22 -223
3228b23J9l4J73l32K91L34l26K82l43K52j39j73J96k0rk08M4K68M0m0K53l19N9
$$ -223 -204 -238 -65 -397 -106 228 -98 184 -159 93 -46 -219 -23 -43 -52 -260 -216 52 92 52 305 -14 45
3251D5k04Q1LO9J04kk02R3L66k76p8l3M0j5l8q9L42n9l36L58p1l27J90K32j76
$$ 45 -159 -78 -75 -6 98 96 -106 -13 353 77 -1 -34 6 -9 -47 -136 206 147 -189 169 98 -229 -39 193 17
3276A7P6j45J40r9Q0j69J17LQ3m5o7Q2L5L4k20K85j69P3j31J32J34k99K19j20
$$ 17 93 -52 88 -11 69 -100 17 20 103 58 -9 73 108 142 -78 207 38 111 -20 112 246 -53 166 46
3300D6q6K37j08P3k54R7J84Lk89j36M44m01Q4L22j18q9m2j80L39j58r1J7K93k87
$$ 46 -40 197 89 162 -92 5 189 192 -97 -233 211 -190 -106 216 98 9 -33 -213 126 -32 -123 -106 187 -100
3324a00K82L1j95O6k28K37M9j71n5p2K44Jr0r6P2J55k72K90j40K6j46K73l81L6
$$ -100 182 213 18 84 -144 93 142 -29 -84 -156 88 89 -1 -97 -25 130 -142 148 8 34 -112 161 -220 -184
3348a84J79m3n4R0K09j62J12N2k24j9k01O0J07K75l58j2M33m40K05kK5q4J90N5
$$ -184 -5 -48 -102 -12 197 35 147 199 -25 -44 -245 -185 -78 197 -161 -173 260 -180 25 23 48 -36 154 209
3372B09k28j18J27j3J31k34L35k06Q6j47O2k74J78K26j10k8j60L15j72j62L20
$$ 209 -19 -137 -10 -23 108 -126 209 3 89 -58 4 -270 -92 134 24 -4 -164 151 -21 -183 137
3393A37j97J4J19m3k64O7K39k11N1k13N20k11O3p4p4J54p6j0j38R6L13n66L75
$$ 137 -60 -46 73 30 -234 -167 72 -139 -88 -301 219 8 71 -3 -77 77 1 -9 -147 -51 262 -304 71
3416G1qM3K23j89j69J7j3P7Q9k20j07K1p3M15j93J09J52j60j47K29k94L63k05
$$ 71 63 106 329 140 -29 -12 -25 52 141 -79 -186 -165 -238 177 -16 93 245 85 -62 167 -127 236 31
3439C1R9j3P2j55j01J68k85J39M01l84P9p2l8J91n7l53L24j54N1O7l11M23j30
$$ 31 130 117 189 34 -67 101 -184 -45 356 -28 51 -21 -59 132 75 -278 46 -108 -57 10 -301 122 -8
3462hJ46j30j94K45k13R7k62L61J0L1p2lk26j7J98j08M03j72n1L1J3q9R9j02j09
$$ -8 138 8 -186 59 -154 -57 -319 42 52 83 11 8 -218 -235 -37 -145 258 86 35 66 79 -10 89 -13 -122
3487a22j56J77J36j48J41j78qk9K53O3j85J70k78L46m95K79j05K21q7MKj27M4
$$ -122 -278 -101 35 -113 28 -150 -158 -187 66 129 -56 114 -164 182 -313 -34 -139 82 -5 -1 1 -126 -82
3510h2k56M47O4k7l56J34M5l8J83k56J39Q9l3l17J41k5J91l0m9K68j71l8r4L6
$$ -82 -338 109 173 146 -210 -76 -31 -69 114 -142 -3 86 53 -264 -123 -148 43 13 -36 232 61 23 -71 -35
3534c5J41j85J26J11k63Q4j1R1k42J22J6%K44k87K65k59p3K64j19k0R2J70k07
$$ -35 106 -79 47 158 -105 -21 -32 59 -183 -61 -45 -45 199 -88 177 -82 -155 109 -10 -30 62 232 25
3557B5R3l08L11l6k19K80n3l38L10j50J38o0J8k1J23l57P5R8o4K25k3J59m83M16
$$ 25 118 -190 121 85 -134 146 93 -245 65 -85 53 -7 11 -10 113 -244 -169 -71 -135 90 67 226 -257 159
3581A59l47K29K8j37k6N02o29J90L56l22k4N6Q2R7j76k09L6l1m9J96L46l55M0
$$ 159 -188 41 69 -68 -94 408 -221 -31 325 3 -21 35 117 214 38 -171 -135 -166 -215 -19 327 -28 12
3604A2R2j8j77L69M9l21K31o2j69R8P4p7j30J40j52J53j23j0p9K12k62K65J80
$$ 12 104 86 -91 278 327 6 237 175 6 104 178 101 -29 111 -41 112 -11 -21 -100 112 -150 115 295
3627B95m76K87p4k74P2N0L53mm24O0L05k83J16pJ04r2Q1j69K18k79L50j18o5p3
$$ 295 -181 106 32 -242 -170 -120 233 229 -195 -135 170 -113 3 -4 100 8 89 -80 138 -141 209 91 26 -47
3651d7oo3p2P2J37J11n0n7p9q1J43j02j1L69k75J43J3j84M8L0M0j86J82j33j18
$$ -47 -53 -116 -188 -116 21 132 82 25 -54 -135 8 -94 -105 264 -11 132 145 -39 9 39 79 -107 75 -58 -176
3676a76Q7L05j09j77L27j19m3k20j21M89j98PP0l36J56kk01J84K22k1J54p1k04
$$ -176 -89 216 107 -70 257 138 95 -125 -246 243 45 52 122 -214 -58 -60 -261 -77 145 124 278 207 3
3699Cp5K84r5k32m0J23L4kQ6k03p7m3K51j14J90o6J2k7jR1j63J08P9L03m82j62
$$ 3 -72 212 117 -115 -155 -32 2 0 86 -117 -194 -237 14 -100 90 24 36 9 8 99 -64 44 123 426 -56 -218
3725b18M81m05M05m94L75j72R3k59k5Oj20M14J84j57j02j4l5o7J67L0k81J98j73
$$ -218 263 -142 263 -231 144 -28 65 -194 -219 -213 -333 81 265 108 6 -8 -43 -110 57 87 -194 4 -169
3748a69L66j68Q4j81L6K26j34j52l8n5K09L7l8K9j48p1R0L9J31j5l00R9J57q8
$$ -169 197 29 113 -68 -32 194 60 -92 -130 -185 24 61 23 52 -96 -167 -77 -38 93 78 -222 -123 34 -54
3772e4l8J51j06J57k32l5k10L89k1J65k22O7n7j12J95K35n1m56L68J19j61L2m88
$$ -54 -92 59 -47 110 -122 -157 -367 22 1 166 -56 11 -46 -158 37 272 221 -235 133 252 91 123 -365
3795c65M08L4J6n08J43J54n7K45p9m3j43K8J85j97J95j20L7J08Q3k13l85J98K88
$$ -365 43 77 93 -415 -272 -118 -175 70 -9 -52 -195 -167 18 -179 16 -104 -67 41 124 -89 -474 -276 12
3818A2M6J90k38R3k44k42P06k72L6k95K67k6K4N5o3L0o6J76k04K6J62J30j57k39
$$ 12 58 248 10 103 -141 -383 323 51 87 -208 59 33 57 112 49 79 13 189 -15 11 173 303 146 -93
3842i3L1j69M49l59L54k32J37l13K71l96L08l2j13J46j30K2j49L49j34J49J98
$$ -93 -62 -231 218 -141 213 -19 118 -195 76 -320 -12 -44 -157 -11 -141 -119 -268 81 -53 96 294
3863B94j59J0k04n3J37K75n4k02k45l3K2L23l11J31J12P8j92MJ58r7R4O8k31Q2
$$ 294 135 145 -59 -112 25 300 246 44 -201 -234 -212 111 -200 -69 43 121 -71 -67 91 -6 88 156 -75 7
3887Gj70L71l37J36m1j78J81L0J79j11l7j9n0n3n7l5J97k6j9L0J68o6k19Q8L08
$$ 7 -163 208 -129 7 -34 -212 -31 -1 178 67 30 11 -39 -92 -149 -184 13 -13 -32 -2 166 100 -119 -31 277
3912B77m53k6L7l1O3R5Q4J4j27j78P4j30K39K3k7J50J47k90K31l75J07K09m16
$$ 277 -176 -202 -165 -196 -133 -38 46 60 -67 -245 -171 -301 -62 -39 -66 84 231 -59 172 -203 -96 113 -303
3935c03K53o5K46j37O1K5n7J77J07l58k8j06J86Q7J22j39p5J8n1K5q1RJ86k00
$$ -303 -50 -115 131 -6 55 80 23 200 307 -51 -79 -185 1 88 210 71 -4 14 -37 -12 -93 -84 102 -98
3959i8J30J01l40M04j62L01l39q5M45j97J46j34j57r7J12J01j7k39J85N3k01J31
$$ -98 32 133 -207 197 35 336 -3 -88 357 160 306 172 15 -82 30 131 114 -125 60 113 -88 43
3981D3l37L34j2L4O3k91l8L26l37J90j4J26J03j61rj61J96k75J80K9Rj66J28N4
$$ 43 -294 40 28 62 125 -166 -204 122 -215 -25 -39 87 190 29 20 -141 55 -220 -40 -11 -2 -168 -40 14
4005A4J38J28j19j06k49J46m2J03j13J28j19M58k35k50N7K93k14Rj74K3R3k47
$$ 14 152 280 161 55 -194 -48 -90 13 -100 28 -91 367 132 -118 -61 232 18 27 -147 -124 -31 -278
4027b78L66J12Lj43J36m68L11k1O2RJ71o0k02J28r2J94l52j35j3J05J61K46k04
$$ -278 88 200 203 60 196 -272 39 18 80 89 260 200 -2 126 34 228 -124 -259 -272 -167 -6 240 36
4050C6J66k87k0o4j50K31K22k07R6n6j4%LK89L2l93J99q2n6J07J03k38J61p9l6
$$ 36 202 -85 -105 -169 -319 -88 134 -73 23 -33 -47 -47 -44 245 277 -116 83 1 -55 52 155 -83 78 -1 -37
4075c7Q9l13J63K61k72L32j03Pk22J91l5j60J4k6J15p1N7R2k55j2J57p7j38J92
$$ -37 52 -261 -98 163 -109 223 120 127 -95 96 61 -99 -85 -111 4 -67 -10 82 -173 -185 -28 -105 -243 -51
4099e1mK62p8j84m3j82K89j67J30l0L13l28j25J62j5J32q9l0M6j89K80p7j22R9
$$ -51 -55 207 129 -55 -98 -280 9 -158 -28 -58 255 -73 -198 -36 -51 81 -8 -38 8 -181 99 22 -100 -1
4123an0m8J56k03Q5J20l0qm9L0k14R9Q5P4J72l19K27Q1k18J16j01r7J72k37j2
$$ -1 -51 -99 57 -146 -61 59 29 21 -28 2 -212 -113 -28 46 218 -101 126 207 -11 105 4 -93 79 -158 -170
4148a70J64J17k22j5N80n20J09k65J53j54M64k92j11K20k79K78n0K8k5K76k36
$$ -170 -6 111 -111 -126 454 -66 43 -222 -69 -223 241 -51 -162 58 -221 57 7 35 10 286 50
4169E0p5L3J48l26K43P3k0j2L4k8L1k43K02j46K3K2j41N0J70O6k98P7j10J1Q8
$$ 50 -25 8 156 -170 73 146 126 114 148 120 151 -92 110 -36 -13 9 -132 -82 88 154 -144 -67 -177 -166 -78
4194g8j80L38Q6l10M0L62k65j28K98n4k14J95m22L14k3j2L05j15O1l42K7n2J23
$$ -78 -258 80 166 -144 -104 258 -7 -135 163 109 -105 90 -332 -18 -41 -53 252 137 198 -144 -117 -169 -46
4217d6K01k99L3J97k57M1J14P4j29O0l16L01j93K99Q2o0k34K9Q6L1k0l4j41j09
$$ -46 155 -144 -111 86 -171 -130 -16 58 -71 -11 -327 -26 -219 80 162 102 -132 -103 -17 14 -6 -40 -181 -290
4241b90K59j02Q8p5J68J36l9j42Q5j49j74K04J44m8qj4j76N8qJ69j27J2J53l78
$$ -290 -31 -133 -45 -120 48 184 145 3 88 -61 -235 -31 113 65 57 43 -133 -75 -83 86 -41 -29 124 -254
4265b54Q5P6J91p2O9j48J56j60j63L46j84Q9J76k7l06J75L3p7j70J44K78k96J
$$ -254 -169 -93 98 26 95 -53 103 -57 -220 126 -58 31 207 180 -126 49 82 5 -165 -21 257 -39 -38
4288c8k09M32J19k24L25o20K75j59j21K19J13P1N0m13J16J23j72N52l53j41K10
$$ -38 -247 185 304 80 405 -215 60 -99 -220 -1 112 183 233 -180 -64 59 -113 439 86 -55 155
4309A55j08j55J45r7MN8j39J52q1j32J26j86N25l05N3J17P5o49N45J13J0k26r1
$$ 155 47 -108 37 -60 -56 2 -137 15 -66 -198 -72 -258 267 -38 15 132 207 -442 103 216 226 0 -91
4332i1J67N5k92J33J69k84J54Q9l42J84p9K64r2K32k72J86l9j66L10l86o7K18
$$ -91 76 131 -161 -28 141 -143 11 100 -242 -58 -137 127 35 267 -5 181 142 -24 286 -100 -167 51
4354E1j45R1J41l41M90n53K06j0J66j18J35lk63K03q2K3%k47J20O8P0j13j42n
$$ 51 -94 -3 138 -203 287 -266 -60 -70 96 -22 113 110 -153 50 -32 -9 -9 -256 -136 -68 2 -111 -253 -258
4378b58L19j26J62k16j27L7J60m1J40J55j69K0q3j6l6J37k40J44L22k20k14J43
$$ -258 61 -65 97 -119 -246 -209 -49 -90 50 205 36 56 -27 -43 -79 58 -182 -38 284 64 -150 -7
4400gK28m54L85k57No2J50K9K2J63k12k2m8O9K71l14J07r0J19m5J57J09j16J00
$$ -7 221 -233 152 -105 -100 -162 -12 17 39 202 -10 -32 -80 -11 260 -54 53 -37 82 37 194 303 187 287
4424B87p2j86j58q6k8K24k51L66k45rL93n9m37J65K1l6J52k40L03l45q4O01l63
$$ 287 215 29 -129 -215 -243 -19 -270 96 -149 -158 235 176 -261 -96 -75 -111 41 -199 104 -241 -325 276 -87
4447h7L18o7k75J57j63m8K32j15J28k11K27l20L40m8j20n8L25k93J98j10J04m0
$$ -87 231 164 -111 46 -117 -165 67 -48 80 -131 96 -224 116 68 -52 -110 215 -78 120 10 114 74
4469G4j62j10M04m12jM59p6j18J00k72K72k66lQ9L23m89R5K79j31K84j66j91O0
$$ 74 -88 -198 206 -206 -207 252 176 58 158 -114 158 -108 -111 -22 301 -188 -93 186 55 339 173 -18 42
4492D2J55k03q6j17M8M02k84K20k51j0n4O0Pj21K04n7Q7j92k61N49l28K93j46
$$ 42 197 -6 -92 -209 -161 241 -43 177 -74 -84 -138 -78 -71 -192 12 -45 42 -150 -411 138 -190 103 -43
4515d3J09j9k63j42M02N8j57l0M53k61j05J04K1J36m49O3r2J05LK83l25J39r0
$$ -43 66 47 -216 -358 44 102 -55 -85 368 107 2 106 127 263 -186 -123 -215 -110 -107 176 -149 -10 -100
4538a00L37l41J09M7J09l94J47k15K91J74r5O0j77P2k24L30K25m77J07Nk25M37
$$ -100 237 -104 5 52 161 -233 -86 -301 -10 164 69 129 -48 24 -200 130 355 -122 -15 -10 -235 202
4560B02o1j88J38q7L9%l48L12J32Lm0j17J8J84o55L41J44O8p3O3j41k04M11r3
$$ 202 141 -47 91 4 43 43 -305 7 139 142 102 -15 3 187 -468 -127 17 85 12 75 -66 -270 141 48
4584D8j51Q1J04k7O7q9J1k3J40k85Q2R9j58j24L17k32J85j25k78M39K81l02M22
$$ 48 -103 -22 82 55 122 33 44 21 161 -124 -42 57 -101 -225 92 -140 45 -80 -358 81 362 60 482
4607D82k49l26q0J93K46K9j96N0m36M68k50J29J9L4k24K86k82K91qnj11J50Mk65
$$ 482 233 -93 -173 20 266 295 99 149 -287 181 -69 60 79 113 -111 175 -107 184 176 171 60 210 214 -51
4631e1J05j72J71Qp1j13J73p4L53l10m59L72r9n9L20k40K65Ko0k19L29j3l1o6
$$ -51 54 -118 53 61 -10 -123 50 -24 329 19 -440 -68 -167 -226 94 -146 119 121 61 -158 171 158 127 61
4655F1k20J30J79m9J43k15N8M4k5o0O6M3k12pJ04j5o2J92j56K90j47j35k42J85
$$ 61 -159 -29 150 101 244 29 87 131 106 46 112 155 -57 -64 40 25 -37 155 -1 289 142 7 -235 -50
4679e0nJ23L4k85K12k25J33K7J96j60J87j72R6N1K3l32J37P8k63L82q3M1N0m35
$$ -50 -55 68 102 -183 29 -196 -63 -36 160 0 187 15 111 162 185 -147 -10 68 -195 187 104 145 195 -240
4703b40M48j43O0j3k52J58j29J39L7o6P2O0j12J40k54J55J62k9k02l66L71j26
$$ -240 208 65 125 112 -140 18 -111 28 65 -1 71 131 19 159 -95 60 222 193 -9 -375 -4 -130
4725a30L42l51Q6k15L29l90N28q7n3k60N54j26l95P4N2l3J99L6j9j94L6P3l3R6
$$ -130 212 -139 -53 -268 61 -329 199 112 59 -201 353 227 -168 -94 -42 -75 124 160 141 -53 -17 56 23 119
4749A19l50J51j0R3o0J53Q9j59nQ2j28K06J37l22o8M29k01Q8m28L09k56J07j14
$$ 119 -231 -80 -90 3 -57 96 185 26 21 103 -25 181 318 -4 -72 357 156 244 -184 125 -131 -24 -138
4772a38K31m84K78J24k10K40J02n6j03K21k47k2L41k32l5r4j4K02k70M5m8r0J70
$$ -138 93 -391 -113 11 -199 41 143 87 -16 205 -42 -64 277 45 10 -84 -98 104 -166 -121 -169 -259 -89
4795h9o6K05q1j74K07J72j58J6kj24M6j69K61k61O8J00Q9l66L67J15l57M17k93
$$ -89 -155 50 -31 -205 2 174 16 32 30 -94 -48 -217 44 -217 -149 -49 40 -326 41 156 -201 216 -77
4818g7pL38l43R3J5J9j62K06l56J52j99L69J57J13l63K51p5m44K68j14J97nJ6
$$ -77 -84 254 -89 4 19 38 -124 82 -274 -122 -321 48 205 318 -45 206 131 -313 -45 -159 38 33 49
4841D9n8J37j42P2k02m9K74K6j12r2J54j29Q1jJ4o4K06j86J85k19J83k37P1K0
$$ 49 -9 128 -14 58 -144 -193 81 107 -5 -97 57 -72 9 8 22 -42 164 -22 163 -56 127 -110 -39 -19
4865a9N1L7l8O0m73O28r4L5j71j30J1K9K9O3N5K2p6k03L06l3o9J6J49l34J73K46
$$ -19 32 69 31 91 -382 246 152 187 16 -114 -103 -74 -45 18 73 95 19 -184 122 89 20 36 185 -149 24 270
4891B70l06N7l07N19k47m1J56N2j44j7K50l49K41J50j07k67k39K56o9K31j09j23
$$ 270 -36 21 -286 233 -14 -55 101 153 9 -8 242 -107 134 284 177 -90 -329 -73 -142 89 -20 -143
4913a43K13J8j77J81k4n26N52k04J47j55L94j53j47O5j18M2j25o7QM73l49M1o2
$$ -143 70 88 -89 92 68 -458 94 -110 37 -118 276 123 -24 41 -77 -35 -160 -227 -219 254 -95 -54 -116
4936a16r4J70K45k26J32j46j42O4l8J44k85J69J23n3k84L02k68O30k76l5j8j34
$$ -116 -210 -40 205 -21 111 -35 -177 -113 -151 -7 -292 -123 0 -53 -337 -35 -303 327 51 16 -2 -136
4958a36P9Q4j8K07k90L40j74k35p6M3N7L8L0j1P2j07r8K40Q9NK4R7k37j23LJ58
$$ -136 -57 27 9 216 -74 266 92 -143 -219 -176 -119 -81 -51 -62 10 -97 -195 45 134 139 163 260 23 -100 -97 61
4984F1k00L29k93R2qJ52k34J15J00j87K17k32K29Rj73lm4Q7j09K51Ok15qk3J42
$$ 61 -139 190 -103 -11 -19 133 -101 14 114 -73 144 -88 141 150 -23 -26 -70 17 -92 159 165 -50 -58 -81 61
5009F1n1K04l24J77L8R0j82k5j45q2K09K20k69l7K90k98J23l8rK02p7o3l42L84
$$ 61 10 214 -110 67 105 195 13 -12 -157 -239 -30 190 -79 -116 174 -124 -1 -39 -48 154 77 14 -328 56
5033E6j34K76nl03J78P8k38J07j63j6J74l65N09k51L15l10K63J31j10j73Q9J68
$$ 56 -78 198 193 -110 68 146 -92 15 -148 -164 10 -355 154 -97 218 -92 171 302 192 19 108 276
5055B76m79K43k73M0J87K3j63N9J03j5J24j37kK29k62r6l0L0J87J5j39O3J79m38
$$ 276 -203 40 -233 -193 -6 17 -146 -87 16 1 125 -12 -14 215 -47 -143 -173 -143 44 59 -80 -17 162 -276
5079b76N32k61M6L4j08Kj59R4K5K09j49K09j73L4m3J75m30J76J9j45Q9j55K39
$$ -276 256 -5 41 75 -33 -31 -190 -96 -71 138 -11 198 25 59 16 191 -239 -63 -44 -189 -100 -255 -16
5102a6l2J33k56K67j26J99m46j6K05N6lQ9j68L07k48o3K0qk2K14k86J49J28p8
$$ -16 -48 85 -171 96 -30 169 -277 -293 -88 -32 -35 54 -114 193 -55 -118 -98 -106 -128 86 -200 -51 77 -1
5126aJ6J1r7j0K53k36K86k47J6Q9j29K42k33j62J52j49L11j05l8K48o0k76J3k22
$$ -1 15 26 -71 -81 172 -64 222 -25 -9 80 -49 193 -40 -202 -50 -199 112 7 -31 217 157 -119 -106 -328
5150c28K21J5l35N73j88L4j49J39J13l7P8Q6k70J54j44J02m6R2j36n8K12Rn9r0
$$ -328 -107 -92 -427 146 -42 -8 -157 -18 95 58 136 222 -48 106 -38 64 18 110 -26 -84 128 137 78 -12
5174a2k66N02l08K55j64j81K74N5j96J15p2R1L5j63P7l0Q3m6k52P6J7Q5K73j35
$$ -12 -278 224 -84 171 7 -174 100 155 -41 74 2 93 128 -35 42 12 95 49 -203 -127 -110 -25 248 113
5198A13j39J39l20L62N1l74J54Q8j56O0P6o8j37M31l38J14k0L8Nm4j06R5j38O7
$$ 113 -26 113 -207 155 206 -168 -14 74 -82 -22 54 -14 -151 280 -58 56 36 74 79 35 -71 24 -114 -47
5222d7jJ03j24q2L8K08k10k62L07N2J01m61P59m19L6K86l32J86k87J15P6n2j53
$$ -47 -48 55 -69 -151 -113 95 -115 -377 -70 -18 83 -378 381 -38 -2 284 -48 138 -149 -34 42 -10 -163
5245a63K50l74M40k02R8p0j20K48j22K41k64j93M79l05J1L5k84L41j68K43J0j9
$$ -163 87 -287 153 -49 49 -21 -141 107 -15 226 -38 -231 248 -57 -46 -11 -295 46 -122 121 131 112
5267A12j44J18j41J03l3l08J57M8J34K4j24mm6J90j04o1o9K29j03m7j18M61k05
$$ 112 -32 86 -55 48 15 -293 -136 -88 46 70 -54 -58 -104 86 -18 -79 -148 81 -22 -69 -187 274 69
5290F9M1k47J52j00j21L79j95L64l94J47k02K3P6KJ96N6k86n5l5K22K07j33k03
$$ 69 110 -137 15 -85 -206 173 -22 342 -52 95 -107 -84 -8 -6 190 246 -40 -95 -130 92 299 166 -37
5313c7J2K3k1J9L4j45L5J46j14O4M8r9r8K89l91L04J7J23k07J04r7O2r7l9OKN4
$$ -37 -25 -2 -23 -4 30 -115 -80 66 -48 16 64 -35 -133 156 -235 69 86 209 2 106 9 71 -26 -65 -59 -57 -3
5340cj20Q3J48K1k45Q0q5K54j92N0K93k91J73r5k82P9L23j29k6J32j1n26M20J56
$$ -3 -123 -40 108 129 -116 -36 -121 133 -59 -9 284 -7 166 71 -211 -132 191 62 36 168 157 -369 51 207
5364B07j92mn0L34l92Qj14j80J56M63l3k69l35O46n17J97JL79o2j12q7po9R4L4
$$ 207 15 11 -39 295 -97 -89 -203 -383 -227 236 203 -66 -401 245 -272 -75 -74 305 243 131 44 37 -32 62 96
5389I6j80j12K70m2j33j98M03k25R6K46k92p8N1N1j04M25o18K98J55m6l42N59
$$ 96 -84 -196 74 32 -101 -299 104 -121 -25 221 -71 -149 -98 -47 -151 274 -344 -46 109 63 -279 280
5411B80l20J92k15j40J33J68k14J72P7m97M51k60P4J93l88J97jQ6l0R5j2K7p3
$$ 280 -40 152 -63 -203 -70 98 -116 56 133 -364 87 -173 -99 94 -294 -97 -98 -12 -42 53 41 68 -5
5434eM4j34K42l19K83O1j07j10k04O03l35J11Q4k92J1M1k29J67K8K41j03j74J16
$$ -5 39 -95 147 -172 111 172 65 -45 -249 354 19 130 214 -78 -67 -26 -255 -88 -60 181 78 -96 20
5457B0j00J49l04K00J3j10J04k7j34J88Q3j03OP4k07K70Jk32K96j68L4km8j68
$$ 20 -80 69 -235 -35 -22 -132 -28 -55 -189 -1 82 -21 -15 59 -148 122 123 -109 187 19 53 51 3 -165
5481a65L64n5l12N2N9R9LqK01q3r2J3j12j82J00m2J10J60j28j04j56L49J40lp5
$$ -165 199 144 -168 -116 -57 42 45 37 238 155 63 76 -36 -218 -118 -160 -50 110 -18 -122 -278 71 211 208 133
5506A33k38J45m1L1j02R7j03J09j71k32J71K66j99J26L7K10l57L04k89j23K83
$$ 133 -105 40 -1 30 -72 25 -78 31 -140 -372 -201 65 -134 -8 29 239 -118 186 -103 -226 57
5527E7j91p8J83P9j07J54o3M0j85J79p5K73k14k46L49k42Q7K9K83k10k1K7k69
$$ 57 -134 -212 -29 50 -57 97 34 74 -111 68 -7 266 52 -194 155 -87 0 29 312 102 81 108 -161
5550a61JJ56Q1o8Rk46K55Q0l59L03r4j30K55J76k22k3J0N3j55J14m8J92k51k02
$$ -161 -160 -4 77 9 18 -228 27 107 -252 51 -43 -173 82 258 36 13 23 76 -79 35 -13 179 -72 -274
5574b74K61j19J02J45r6K7k33L50l27mK29j36L0k90M68R9k75r2K67j79l5J92j28
$$ -274 -13 -132 -30 115 19 46 -187 163 -164 -168 61 -75 -45 -335 133 232 -43 -135 132 -47 -82 110 -18
5597a8m2R9j26j22K04k9L5O6k1J15l75M18p3j88L6rj64J99P6K25J6k89nj33O1
$$ -18 -60 39 -87 -209 -5 -34 1 67 46 161 -214 204 131 -57 -21 -30 -194 5 81 306 322 33 28 -105 -44
5622d4j16k7J49K0J66k48J73j02P3k1m3M8k04M00L9P5l61qp3L7J31k7p9J88j28
$$ -44 -160 -187 -38 -18 148 -100 73 -29 44 23 -20 28 -176 224 263 338 -23 -31 -104 -67 64 37 -42 146 18
5647A8K54j62P1l24K48j12o7J51k35K49O8k47l03O67l89L37k96J00n0k32K90k29
$$ 18 272 110 181 -143 105 -7 -74 77 -158 91 159 -88 -391 276 -113 224 -72 28 -22 -254 36 -193
5669a93P1n3Q8K3j73J46J56M0j08j06J34j76K64K8j36o0n1J4K63l02J66J05M2
$$ -193 -122 -175 -87 -64 -237 -91 65 105 -3 -109 25 -151 113 141 5 -55 -106 -92 171 -131 35 140 182
5692A82m1rj10j92N8R6J43k16J39r9M6j35J43j3k04l0J73L1J89j06j26pn1J23
$$ 182 141 132 22 -170 -112 -16 127 -89 50 -49 -3 -138 5 -8 -212 -242 -69 -38 151 45 -81 -88 -139 -16
5716a6K69k00n1j56M60r6k66K87k92m9j00q4K20K42l11J63o7RL9j39J72k0K03
$$ -16 253 53 2 -154 306 210 -56 231 -61 -110 -210 -294 -74 168 -143 20 -47 -38 1 -138 34 14 217
5739B17k28j04L8Q0k25K55k44L36l52M18L3j84j90L05m85K48j05K87l8R9m43J28
$$ 217 -11 -115 -77 3 -222 33 -211 125 -227 191 224 40 -150 155 -330 -82 -187 100 62 161 -282 -154
5761a54M85l86K04q5%Ro5n1j43j6M47j17k24L4J72j93J92J3q4k64L11j57K91l17
$$ -154 331 -55 149 64 64 73 8 -43 -186 -202 245 128 -96 -62 110 -83 109 122 38 -226 85 -72 219 -98
5785i8K73n05L83R1l54K83k81L81k49k09J23o1L16j89K9J42K17j41l40K79q6k76
$$ -98 175 -330 53 144 -210 73 -208 173 -76 -285 -162 -223 93 -96 -67 75 292 151 -189 90 4 -272
$$ [...]
8191d2
##END NTUPLES=NMR FID
##END=
