##TITLE=1H_DE-140W_TFA
 200.13Hz, DMSO+CCl4.
 8 sc
 
 7.4.2026
##JCAMPDX= 6.0         $$ Bruker NMR JCAMP-DX V2.0
##DATA TYPE= NMR FID
##DATA CLASS= NTUPLES
##ORIGIN= UXNMR, Bruker Analytische Messtechnik GmbH
##OWNER= pz
$$ XWIN-NMR		Version 3.5
$$ Tue Apr  7 15:20:34 2026 Russian Standard Time (UT+4h)  she@DPX200
##.OBSERVE FREQUENCY= 200.1313
##.OBSERVE NUCLEUS= ^1H
##.DELAY= (6, 6)
##.ACQUISITION MODE= SIMULTANEOUS
##.ACQUISITION SCHEME= undefined
##.AVERAGES= 8
##.DIGITISER RES= 18
##SPECTROMETER/DATA SYSTEM= spect
##.PULSE SEQUENCE= zg30
##.SOLVENT NAME= CDCl3
##.SHIFT REFERENCE= (INTERNAL, CDCl3, 0, 14.3821)
##AUDIT TRAIL= $$ (NUMBER, WHEN, WHO, WHERE, WHAT)
$$ ##TITLE= Audit trail, XWIN-NMR		Version 3.5
$$ ##JCAMPDX= 5.01
$$ ##ORIGIN= Bruker BioSpin GmbH
$$ ##OWNER= she
$$ F:/spectra/data/she/nmr/H-C/1/audita.txt
$$ ##AUDIT TRAIL=  $$ (NUMBER, WHEN, WHO, WHERE, WHAT)
(   1,<2026-04-07 15:19:03.03 +0400>,<she>,<DPX200>,
      <created by zg, POWCHK disabled, PULCHK disabled
       configuration hash MD5:
       00 E9 B6 7A A2 85 ED C7 34 08 36 98 17 FE 4E 26
       data hash MD5: 16K
       5C 34 A8 E3 6A 61 6D E6 F6 B4 17 04 6C 53 A2 E3>)
$$ ##END=
$$ 
$$ hash MD5
$$ 97 8C 3F 89 6A 88 A7 3A 19 71 7B 9A D4 93 2A 17
##$RELAX= 
##$RELAX= 
##$RELAX= 
##$RELAX= 
##$RELAX= 
##$RELAX= 
$$ Bruker specific parameters
$$ --------------------------
##$DU= <F:/spectra>
##$EXPNO= 1
##$NAME= <H-C>
##$PROCNO= 1
##$TYPE= <nmr>
##$USER= <she>
##$AMP= (0..31)
100 100 100 100 100 100 100 100 100 100 100 100 100 100 100 100 100 100 
100 100 100 100 100 100 100 100 100 100 100 100 100 100 
##$AQSEQ= 0
##$AQ_mod= 1
##$AUNM= <au_zg>
##$AUTOPOS= <>
##$BF1= 200.13
##$BF2= 200.13
##$BF3= 200.13
##$BF4= 200.13
##$BF5= 200.13
##$BF6= 200.13
##$BF7= 200.13
##$BF8= 200.13
##$BYTORDA= 1
##$CFDGTYP= 0
##$CFRGTYP= 5
##$CHEMSTR= <none>
##$CNST= (0..31)
1 1 145 1 1 1 1 1 1 1 1 1 1 1 1 1 1 1 1 1 1 1 1 1 1 1 1 1 1 1 1 1 
##$CPDPRG= <>
##$CPDPRG1= <>
##$CPDPRG2= <>
##$CPDPRG3= <>
##$CPDPRG4= <mlev>
##$CPDPRG5= <mlev>
##$CPDPRG6= <mlev>
##$CPDPRG7= <mlev>
##$CPDPRG8= <mlev>
##$CPDPRGB= <>
##$CPDPRGT= <>
##$D= (0..31)
0 0.7 0 0 0 0 0 0 0 0 0 0.03 0 0 0 0 0 0 0 0 0 0 0 0 0 0 0 0 0 0 0 0 
##$DATE= 1775560742
##$DBL= (0..7)
120 120 120 120 120 120 120 120 
##$DBP= (0..7)
150 150 150 150 150 150 150 150 
##$DBP07= 0
##$DBPNAM0= <>
##$DBPNAM1= <>
##$DBPNAM2= <>
##$DBPNAM3= <>
##$DBPNAM4= <>
##$DBPNAM5= <>
##$DBPNAM6= <>
##$DBPNAM7= <>
##$DBPOAL= (0..7)
0.5 0.5 0.5 0.5 0.5 0.5 0.5 0.5 
##$DBPOFFS= (0..7)
0 0 0 0 0 0 0 0 
##$DE= 6
##$DECBNUC= <off>
##$DECIM= 32
##$DECNUC= <off>
##$DECSTAT= 4
##$DIGMOD= 1
##$DIGTYP= 9
##$DL= (0..7)
0 120 120 120 120 120 120 120 
##$DP= (0..7)
150 150 150 150 150 150 150 150 
##$DP07= 0
##$DPNAME0= <>
##$DPNAME1= <>
##$DPNAME2= <>
##$DPNAME3= <>
##$DPNAME4= <>
##$DPNAME5= <>
##$DPNAME6= <>
##$DPNAME7= <>
##$DPOAL= (0..7)
0.5 0.5 0.5 0.5 0.5 0.5 0.5 0.5 
##$DPOFFS= (0..7)
0 0 0 0 0 0 0 0 
##$DQDMODE= 0
##$DR= 18
##$DS= 0
##$DSLIST= <SSSSSSSSSSSSSSS>
$$ [...]
##$SUBNAM0= <"">
##$SUBNAM1= <"">
##$SUBNAM2= <"">
##$SUBNAM3= <"">
##$SUBNAM4= <"">
##$SUBNAM5= <"">
##$SUBNAM6= <"">
##$SUBNAM7= <"">
##$SUBNAM8= <"">
##$SUBNAM9= <"">
##$SW= 18.0517328524113
##$SWIBOX= (0..15)
0 0 2 0 0 0 0 0 0 0 0 0 0 0 0 0 
##$SW_h= 3612.71676300578
##$TD= 16384
##$TD0= 1
##$TE= 0
##$TE2= 300
##$TE3= 300
##$TEG= 300
##$TL= (0..7)
0 120 120 120 120 120 120 120 
##$TP= (0..7)
150 150 150 150 150 150 150 150 
##$TP07= 0
##$TPNAME0= <>
##$TPNAME1= <>
##$TPNAME2= <>
##$TPNAME3= <>
##$TPNAME4= <>
##$TPNAME5= <>
##$TPNAME6= <>
##$TPNAME7= <>
##$TPOAL= (0..7)
0.5 0.5 0.5 0.5 0.5 0.5 0.5 0.5 
##$TPOFFS= (0..7)
0 0 0 0 0 0 0 0 
##$TUNHIN= 0
##$TUNHOUT= 0
##$TUNXOUT= 0
##$USERA1= <user>
##$USERA2= <user>
##$USERA3= <user>
##$USERA4= <user>
##$USERA5= <user>
##$V9= 5
##$VALIST= <valist>
##$VCLIST= <CCCCCCCCCCCCCCC>
##$VD= 0
##$VDLIST= <DDDDDDDDDDDDDDD>
##$VPLIST= <PPPPPPPPPPPPPPP>
##$VTLIST= <TTTTTTTTTTTTTTT>
##$WBST= 1024
##$WBSW= 4
##$XGAIN= (0..3)
0 0 0 0 
##$XL= 0
##$YL= 0
##$YMAX_a= 273175
##$YMIN_a= -236128
##$ZGOPTNS= <>
##$ZL1= 120
##$ZL2= 120
##$ZL3= 120
##$ZL4= 120
##$ABSF1= 10
##$ABSF2= 0
##$ABSG= 5
##$ABSL= 3
##$ALPHA= 0
##$AQORDER= 0
##$ASSFAC= 0
##$ASSFACI= 0
##$ASSFACX= 0
##$ASSWID= 0
##$AUNMP= <proc_1d>
##$AZFE= 0.1
##$AZFW= 0.1
##$BCFW= 1
##$BC_mod= 2
##$BYTORDP= 1
##$COROFFS= 0
##$CY= -3
##$DATMOD= 1
##$DC= 2
##$DFILT= <>
##$DTYPP= 0
##$F1P= 0
##$F2P= 0
##$FCOR= 0.5
##$FTSIZE= 0
##$FT_mod= 4
##$GAMMA= 1
##$GB= 0.15
##$INTBC= 1
##$INTSCL= 1
##$ISEN= 128
##$LB= 0.25
##$LEV0= 0
##$LPBIN= 0
##$MAXI= 10000
##$MC2= 0
##$MEAN= 0
##$ME_mod= 0
##$MI= 1.114404
##$NCOEF= 0
##$NC_proc= 0
##$NLEV= 6
##$NOISF1= 3.799351
##$NOISF2= 2.8
##$NSP= 1
##$NTH_PI= 0
##$NZP= 0
##$OFFSET= 14.38212
##$PC= 1
##$PHC0= -3713.922
##$PHC1= 22.3923
##$PH_mod= 1
##$PKNL= yes
##$PPARMOD= 0
##$PSCAL= 0
##$PSIGN= 0
##$REVERSE= no
##$SF= 200.129724274929
##$SI= 16384
##$SIGF1= 3
##$SIGF2= 2
##$SINO= 400
##$SIOLD= 16384
##$SREGLST= <1H.CDCl3>
##$SSB= 0
##$STSI= 0
##$STSR= 0
##$SW_p= 3205.1282051282
##$SYMM= 0
##$S_DEV= 0
##$TDeff= 0
##$TDoff= 0
##$TI= <>
##$TILT= no
##$TM1= 0
##$TM2= 0
##$TOPLEV= 0
##$USERP1= <user>
##$USERP2= <user>
##$USERP3= <user>
##$USERP4= <user>
##$USERP5= <user>
##$WDW= 1
##$XDIM= 8192
##$YMAX_p= 0
##$YMIN_p= 0
$$ End of Bruker specific parameters
$$ ---------------------------------
##NTUPLES= NMR FID
##VAR_NAME=  TIME,          FID/REAL,        FID/IMAG
##SYMBOL=    X,             R,               I
##VAR_TYPE=  INDEPENDENT,   DEPENDENT,       DEPENDENT
##VAR_FORM=  AFFN,          ASDF,            ASDF
##VAR_DIM=   8192,          8192,            8192
##UNITS=     SECONDS,       ARBITRARY UNITS, ARBITRARY UNITS
##FACTOR=    0.0002768,     1,               1
##FIRST=     0,             0,               0
##LAST=      2.2672688,     0,               0
##MIN=       0,             -236128,         0
##MAX=       2.2672688,     273175,          0
$$ Real data points
##PAGE= N=1
##DATA TABLE= (X++(R..R)), XYDATA
$$ plain form
0 0 0 0 0 0 0 0 0 0 0 0 0 0 0 0 0 0 4 -6 8 -8 8 -8 8 -14 16 -16 19 -24 24 -30 32 -38 43 -47 53 -60 68 -75 83
39 83 -93 104 -116 127 -142 154 -171 188 -208 229 -252 277 -306 338 -373 413 -458 513 -574 646
59 646 -734 846 -981 1160 -1404 1754 -2294 3230 -5135 10443 -54458 -136887 167532 273175
73 273175 112476 146479 229921 109663 32789 36909 -48229 -117754 -100160 -128524 -144315 -83965
85 -83965 -65839 -51625 43630 69938 35254 99008 138326 57300 32594 50772 -9966 -48559
97 -48559 -34789 -74081 -90827 -33974 -32062 -56869 5928 50089 15617 31675 73960 38148
109 38148 16704 40420 3797 -38042 -14791 -21227 -54017 -33164 -18553 -30089 -652 20813
121 20813 1048 20029 53149 24598 5179 33954 21541 -19716 -12264 -6326 -33928 -31598 -14730
$$ packed form
0@%%%%%%%%%%%%%%%%Mj0J4j6J6j6J6k2L0l2L5m3M8n4O2p0Q1r0J00j13J28j43J58
39H3j76J97k20K43k69K96l25L59l96M37m81N29n83O44p11P86q71R71j087J220
59F46j380J580j827K141k564L158m048N524q365J5578o4901q2429L04419J05643
73B73175j60699L4003Q3442j20258p6874M120q5138o9525J7594k8364j5791O0350
85h3965J8126J4214R5255K6308l4684O3754L9318q1026k4706J8178o0738l8593
97d8559J3770l9292j6746N6853J912k4807O2797M4161l4472J6058M2285l5812
109C8148k1444K3716l6623m1839K3251o436l2790K0853J4611j1536K9437K1465
121B0813j9765J8981L3120k8551j9419K8775j2413m1257P452N938k7602K330J6868
$$ plain form
134 -14730 -24833 -18231 5110 3394 8171 27800 21400 14259 27582 17289 -5219 2349 4077
147 4077 -20964 -21938 -6385 -14527 -19605 -3418 -649 -3234 9126 11189 4970 13236 13455 1093
161 1093 4053 6665 -7157 -8108 415 -8600 -13627 -1054 207 -7153 589 7635 2470 4381 8095
176 8095 2535 2328 5284 -3448 -6130 983 -3460 -9244 -1315 1655 -4018 68 5694 1095 780 5777
192 5777 2939 -563 1445 208 -2642 -1204 -2537 -5072 -1422 9 -3764 -1075 3425 945 257
207 257 4090 3378 889 2241 1856 -971 -1043 -1411 -2858 -2210 -1416 -2822 -895 1155 -707 -248 3279
224 3279 2269 -423 1907 2819 -248 -849 471 -497 -1312 -632 -1195 -1156 51 -159 -838 620 503 -9
242 -9 838 1446 -57 52 1247 14 -1106 -465 -98 -903 -202 -156 39 620 270 67 392 873 -169 -236
$$ packed form
134a4730j0103O602K3341j716M777J9629o400p141J3323j0293k2508P568J728
147D077k5041r74J5553q142n078J6187K769k585J2360K063o219Q266K19j2362
161A093K960K612j3822r51Q523r015n027J2573J261p360P742P046n165J911L714
176H095n560k07K956q732k682P113m443n784P929K970n673M086N626m599l15M997
192E777k838l502K008j237k850J438j333k535L650J431l773K689M500k480o88
207B57L833p12k489J352l85k827p2l68j447O48P94j406J927K050j862M59L527
224C279j010k692K330R12l067o01J320r68q15O80n63L9J207k10o79J458j17n12
242iQ47O08j503J09J195j233j120O41L67q05P01M6J95N81l50k03L25M81j042o7
$$ plain form
262 -236 575 -216 -691 -7 -87 -472 -132 237 -44 -326 -14 221 501 79 22 537 474 -275 -493 -25 333
283 333 -633 -668 109 -14 -317 -2 284 245 336 240 514 332 -137 -125 97 79 -572 -47 19 -401 -360 198 524
306 524 -351 -133 273 217 119 106 179 106 -15 74 -156 -136 -39 -17 -181 -305 111 -206 276 116 -365 101 0
329 0 228 114 9 -108 -89 -165 -63 8 74 -122 156 76 24 45 -10 192 -154 -148 278 -70 -308 163 -94 -67 -31
354 -31 -191 -31 108 117 -13 152 -179 66 -192 173 46 -241 152 -102 74 -25 -160 -215 -219 151 -23 -14 -104 -217
378 -217 295 -142 55 -9 272 160 -31 69 -58 -6 -139 240 141 55 -121 116 -105 -305 44 27 100 172 -40
401 -40 -77 -84 59 258 -86 -91 -303 83 85 104 -176 -65 64 13 -60 141 102 -229 -382 291 46 64 19 43 89 -70
427 -70 78 62 152 239 74 3 -155 -111 -302 194 6 -115 49 -6 -42 115 -86 99 -182 -265 -174 59 25 -142
$$ packed form
262b36Q11p91m75O84q0l85L40L69k81k82L12K35K80m22n7N15o3p49k18M68L58
283C33r66l5P77j23l03L15K86l9R1r6K74j82m69J2K22j8o51N25O6m20M1N58L26
306E24q75K18M06n6r8j3P3p3j21Q9k30K0R7K2j64j24M16l17M82j60m81M66j01
329@K28j14j05j17J9p6J02P1O6j96K78q0n2K1n5K02l46OM26l48k38M71k57K7L6
354c1j60J60J39Rj30J65l31K45k58L65j27k87L93k54J76r9j35n5mL70j74Rr0j13
378b17N12m37J97o4K81j12j91J00j27N2j33L79r9q6j76K37k21k00L49j7P3P2k12
401d0l7pJ43J99l44nk12L86KJ9k80J11J29n1p3K01l9l31j53O73k45J8m5K4M6j59
427g0J48j6R0Q7j65p1j58M4j91M96j88j21J64n5l6J57k01J85k81q3R1K33l4j67
$$ plain form
451 -142 -165 172 -420 -67 129 15 54 -35 75 -38 -332 101 41 278 -69 -227 -221 280 186 -407 177 66 -106
474 -106 75 147 20 -113 110 -144 68 89 50 -16 -125 93 -233 -109 -94 73 172 23 17 -60 137 -62 -231
497 -231 -49 -178 -310 -85 -5 -45 -2 43 -289 -88 59 -168 -150 166 109 -66 -26 51 -302 207 -33 -1 -1 228
521 228 -68 70 -27 -153 -208 -28 -128 156 -178 63 -165 -71 102 151 92 4 213 112 -145 -151 -22 133 -147
544 -147 -304 -149 40 175 6 3 -40 -39 -22 66 30 50 246 299 405 -324 -71 -65 -8 -26 64 131 -38 116 -100 -193
570 -193 59 -19 173 99 -89 15 6 -30 -66 -16 -81 100 8 -143 -130 -203 23 -68 245 -105 -76 -22 -10 180 11
595 11 48 186 -127 -70 55 283 -11 293 -87 25 -156 313 105 123 0 185 40 62 158 -224 62 3 -22
618 -22 -123 223 -29 216 -92 -103 -60 -76 13 -187 -89 -281 -104 -368 106 56 -169 160 -251 147 -152 232 251
$$ packed form
451a42k3L37n92L53J96j14L9q9J10j13k94M33o0K37l47j58ON01r4n93N84j11j72
474a06J81P2j27j33K23k54K12K1l9o6j09K18l26J24J5J67R9j49op7J97j99j69
497b31J82j29j32K25Q0m0M3M5l32K01J47k27J8L16n7j75M0P7l53N09k40L2%K29
521B28k96J38r7j26n5J80j00K84l34K41k28R4J73M9n9q8K09j01k57oJ29J55k80
544a47j57J55J89J35j69lm3JJ7Q8l6K0J96N3J06p29K53ON7j8R0O7j69J54k16r3
570a93K52p8J92p4j88J04rl6l6N0o5J81r2j51J3p3K26r1L13l50K9N4J2J90j69
595A1L7J38l13N7J25K28k94L04l80J12j81M69k08J8j23J85j45K2R6l82K86n9k5
618b2j01L46k52K45l08j1M3j6Q9k00R8j92J77k64M74n0k25L29m11L98k99L84J9
$$ plain form
641 251 127 -55 -162 -129 -178 -71 80 90 218 133 58 191 -142 47 -145 39 -141 70 -86 -171 -139 200 70
664 70 -97 48 -6 346 241 338 -32 153 285 -82 112 138 -74 -3 -295 -6 173 60 -64 168 150 84 57
687 57 65 -31 172 -78 -43 86 354 -237 153 43 -1 123 347 48 -81 -35 -44 104 4 -68 -175 -75 -53 28
711 28 -196 -68 -155 -30 3 14 -44 -105 83 88 129 -152 -246 51 122 -34 85 96 -214 20 179 -136 -109 83 -51
736 -51 84 71 15 76 4 -229 173 -254 10 102 -228 188 286 50 -55 51 -78 -14 130 -40 -29 196 203 -200
760 -200 131 15 -141 144 47 -32 156 -47 -395 -62 25 -206 37 -192 34 -10 -222 35 97 -112 105 -26
782 -26 -122 47 -96 230 106 14 -186 -303 -116 -24 -20 -89 -173 -49 -71 213 -34 -48 40 -41 94 44 72 185 -86
807 -86 -71 87 101 125 213 -294 65 -239 152 7 64 8 182 163 18 -240 -3 -156 -183 11 -341 -75 148
$$ packed form
641B51j24j82j07L3m9J07J51J0J28q5p5J33l33J89j92J84j80K11j56q5L2L39j30
664G0j67J45n4L52j05R7l70J85J32l67J94K6k12P1k92K89J79j13j24K32j8o6k7
687E7Qr6K03k50L5J29K68n91L90j10m4J24K24k99j29M6rJ48j00p2j07J00K2Q1
711B8k24J28q7J25L3J1n8o1J88NM1k81r4K97P1j56J19J1l10K34J59l15K7J92j34
736e1J35j3n6O1p2k33M02m27K64R2l30M16R8k36j05J06j29O4J44j70J1K25Pm03
760b00L31j16j56K85r7p9J88k03l48L33Q7k31K43k29K26m4k12K57O2k09K17j31
782b6r6J69j43L26j24r2k00j17J87R2Mo9q4J24k2K84k47j4Q8q1J35n0K8J13k71
807h6J5J58J4K4Q8n07L59l04L91j45N7n6J74j9j45k58K37j53k7J94l52K66K23
$$ plain form
830 148 -200 12 -95 -76 254 169 17 223 -65 -48 -185 -90 256 145 -160 -121 81 -19 29 39 -76 46 196
853 196 -69 -56 303 -105 12 345 7 -95 -78 -125 -257 -22 -25 11 -186 149 -156 67 14 -142 193 89 -149
876 -149 27 -113 -22 65 195 264 -27 57 -142 88 24 76 -159 104 -75 -143 -83 75 -28 399 4 -108 -21
899 -21 -98 102 103 -84 163 -50 71 36 -65 -189 26 -280 -231 -107 5 122 -80 73 138 95 -139 173 -39
922 -39 130 71 106 -158 37 178 -21 -43 64 223 139 86 214 -84 303 5 35 -198 -141 -148 -131 -9 -326 252
946 252 106 -281 127 300 0 192 69 119 -124 -390 -1 -161 -132 -186 94 -126 40 56 -169 -203 -55 -47 -54
969 -54 -51 136 -82 16 66 53 1 138 46 12 -194 -170 72 199 -90 271 15 -9 -34 87 73 261 -158 -75 17
994 17 -228 230 -238 102 -156 26 21 212 -33 -109 11 127 -154 294 105 -113 118 200 117 114 14 14 -119 152
$$ packed form
830A48l48K12j07J9L30q5j52K06k88J7j37R5L46j11l05L9K02j00M8J0j15J22J50
853A96k65J3L59m08J17L33l38j02J7m7j32K35lL6j97L35l05K23n3j56L35j04k38
876a49J76j40R1Q7J30O9k91Q4j99K30o4N2k35K63j79o8O0J58j03M27l95j12Q7
899b1p7K00Jj87K47k13J21l5j01j24K15l06M9J24J12J17k02J53O5m3k34L12k12
922c9J69n9L5k64J95J41j99k2J07J59q4n3J28k98L87k98L0k33N7pJ7J22l17N78
946B52j46l87M08J73l00J92j23N0k43k66L89j60K9n4K80k20J66J6k25l4J48Qp
969e4LJ87k18R8N0j3n2J37r2l4k06K4K42J27k89L61k56k4k5J21j4J88m19Q3R2
994A7k45M58m68L40k58J82nJ91k45p6J20J16k81M48j89k18K31Q2q3lj00%j33K71
$$ plain form
1018 152 -52 23 27 -111 170 351 -207 -62 9 -437 102 -14 159 104 20 -230 139 40 -158 127 -66 -184
1040 -184 133 133 129 73 -162 -209 -148 -163 -22 -74 78 111 87 216 99 -125 46 -34 -124 -48 92 -82 151 326 236
1065 236 -8 97 -52 -282 -114 136 185 -355 -130 106 143 161 -97 -196 13 15 210 -63 193 218 -67 -147 179
1088 179 121 195 -138 -258 277 -72 50 182 35 9 -97 -153 294 8 248 -261 103 -37 -153 175 73
1109 73 115 -307 -1 126 -74 221 151 4 59 58 87 101 118 -88 -226 56 -162 -119 -116 -24 -216 -163 226 -391 -168
1134 -168 -25 49 80 118 -68 57 -23 -81 75 92 -220 146 152 83 144 185 -120 14 54 57 -110 -239 151 155 137 11
1160 11 -192 265 -71 56 -210 -160 -19 -265 -222 -304 46 -75 -28 197 -264 29 136 -124 157 134 98 -111
1182 -111 46 -433 99 64 -164 127 222 119 -336 277 81 -12 118 51 -67 4 -196 -135 79 -337 10 -46
$$ packed form
1018A52k04P5Mj38K81J81n58J45P1m46N39j16J73n5q4k50L69r9j98K85j93j18
1040a84L17%mn6k35m7O1j5J41n2J52L3k4J29j17k24J71q0r0P6J40j74K33J75r0
1065B36k44J05j49k30J68K50M9n40K25K36L7J8k58r9K09KJ95k73K56K5k85q0L26
1088A79n8P4l33j20N35l49J22J32j47k6j06n6M47k86K40n09L64j40j16L28j02
1109G3M2m22L06J27k00K95p0j47N5jK9J4J7k06j38K82k18M3LR2j92N3L89o17K23
1134a68J43P4L1L8j86J25q0n8J56J7l12L66Oo9O1M1l05J34M0Lj67j29L90Mj8j26
1160A1k03M57l36J27k66N0J41k46M3q2L50j21M7K25m61K93J07k60K81k3l6k09
1182a11J57m79N32l5k28K91R5j03m55O13j96r3J30o7j18P1k00O1K14m16L47n6
$$ plain form
1204 -46 142 -36 220 -133 -88 -8 -56 110 -128 -54 193 206 -106 15 -167 -91 220 -37 -101 405 -152 193 -178
1227 -178 -189 -14 -83 -120 6 -70 -59 228 -279 92 3 -142 -88 126 -64 19 200 166 -153 -72 -189 -147 -116 -94
1251 -94 43 189 2 -75 219 -16 71 174 -199 140 301 6 -145 -231 76 49 -126 5 -7 252 -124 -93
1273 -93 54 -190 114 -22 449 -78 -29 97 -146 50 -373 -61 -103 12 30 -13 -371 23 234 220 -102 -120
1295 -120 -27 -80 222 -55 -124 41 -152 184 110 236 44 -32 132 7 -261 51 120 75 -357 -286 -293 -83 -84 175
1319 175 146 380 -124 143 -28 -306 -18 45 53 -26 -64 -46 89 -59 207 29 -63 -51 56 105 -51 14 -6 142
1343 142 110 -165 -188 167 403 -139 -105 -110 127 81 72 106 -124 109 -81 -175 107 54 -6 271 70 96 -90 -134 30
1368 30 -277 -245 -54 112 -196 -54 211 -72 -244 -39 35 -342 -86 59 67 103 -49 7 -43 -185 -217 -119 -228
$$ packed form
1204d6J88j78K56l53M5Q0m8J66k38P4K47J3l12J21j82P6L11k57o4N06n57L45l71
1227a78j1J75o9l7J26p6J1K87n07L71q9j45N4K14j90Q3J81l4l19Q1j17M2L1K2
1251i4J37J46j87p7K94k35Q7J03l73L39J61k95j51q6L07k7j75J31j2K59l76L1
1273i3J47k44L04j36M71n27M9J26k43J96m23L12m2J15J8m3l58L94K11j4l22j8
1295a20R3n3L02k77o9J65j93L36p4J26j92p6J64j25k68L12O9m5m32P1pK10jK59
1319A75k9K34n04K67j71k78K88O3Qp9l8J8J35j48K66j78r2J2J07M9j56O5k0J48
1343A42l2k75k3L55K36n42L4nK37m6rL4k30K33j90r4K82n3o0K77k01K6j86m4J64
1368C0l07L2J91J66l08J42K65k83j72K05P4l77K56J45QL6j52N6n0j42l2R8j09
$$ plain form
1391 -228 157 -91 -187 -171 -194 -117 -18 -46 -17 278 9 171 115 89 33 -244 64 -352 -57 247 -24 -190 -39
1414 -39 -79 165 175 -38 262 -115 -194 -211 117 11 293 -12 357 158 -58 -177 72 -10 16 86 148 126 -153
1437 -153 36 73 -21 50 45 -219 -72 -92 -32 1 -11 96 52 -154 -206 -196 -42 -129 126 96 -42 192 -79 64 30
1462 30 -64 78 -15 -100 11 -4 -28 -76 61 -252 -96 -73 -4 27 -154 24 163 -435 -106 -86 103 -104 -83 -158
1486 -158 -16 68 15 -84 -39 18 113 170 89 -15 53 41 -229 54 -263 -190 69 10 -411 161 -145 11 179 164
1510 164 -214 -312 119 306 100 -204 135 -53 97 28 185 -175 -366 -74 -40 -54 -75 34 104 55 -235 -132
1532 -132 -118 19 -100 -8 163 -48 -72 -70 -46 19 -164 -99 -54 74 36 73 -219 -122 113 93 -50 -56 58 -60 -136
1557 -136 23 -88 -11 -56 -98 148 214 122 -157 143 91 96 93 97 279 -157 -529 35 78 52 97 212 -116 -112 -103 -214
$$ packed form
1391b28L85k48r6J6k3P7R9k8K9K95k69J62n6k6n6k77L08m16K95L04k71j66J51
1414c9m0K44J0k13L00l77p9j7L28j06K82l05L69j99k16j19K49q2K6P0O2k2k79
1437a53J89L7r4P1nk64J47k0O0L3j2J07m4k06n2J0J54q7K55l0j38K34k71J43l4
1462C0r4J42r3q5J11j5k4m8J37l13J56K3O9L1j81J78J39n98L29K0J89k07K1p5
1486a58J42Q4n3r9M5N7R5N7q1j04O8j2k70K83l17P3K59n9m21N72l06J56J68j5
1510A64l78r8M31J87k06l04L39j88J50o9J57l60j91K92L4j4k1J09P0m9k90J03
1532a32J4J37j19R2J71k11k4KK4O5j83O5M5J28l8L7k92R7K35k0j43oJ14j18p6
1557a36J59j11P7m5m2K46O6r2k79L00n2NlMJ82m36l72N64M3k6M5J15l28MRj11
$$ plain form
1583 -214 -58 -125 -1 -108 -214 35 -301 77 7 9 102 184 35 -15 69 6 268 -8 293 176 -65 7 -175
1606 -175 133 -58 -95 139 -193 -183 -263 7 -15 57 -55 200 -98 -198 -144 168 -58 -133 -40 125 107 -22 -181
1629 -181 -48 -75 184 175 -8 -62 -70 128 352 -83 -79 85 -93 128 4 20 -65 -22 -143 -7 220 -359 -25 -145
1653 -145 189 158 11 92 -61 -119 -184 -11 -33 184 158 -66 -60 -76 -24 203 -238 21 149 -371 167 189 -22 142
1677 142 -44 -33 -38 -227 -98 -67 -154 -36 61 -88 236 185 263 -157 -166 -13 108 152 -62 95 165 -105 -20 -150
1701 -150 55 -121 -287 169 48 -70 6 -183 46 -107 -191 -36 -134 -43 -47 172 154 378 -34 -7 73 -42 -150
1724 -150 -67 -185 2 1 -51 -259 89 225 -85 -52 128 -85 99 -13 63 -29 77 -78 54 160 106 79 -22
1747 -22 163 -70 -159 -335 -164 -273 -106 71 -240 57 129 -153 115 -233 107 104 87 -81 151 -109 45 -120
$$ packed form
1583b14J56o7J24j07j06K49l36L78p0KR3Q2j49n0Q4o3K62k76L01j17k41P2j82
1606a75L08j91l7K34l32J0q0K70k2P2j12K55k98j00N4L12k26p5R3J65j8j29j59
1629a81J33k7K59rj83n4qJ98K24m35MJ64j78K21j24J6q5M3j21J36K27n79L34j20
1653a45L34l1j47Q1j53n8o5J73k2K17k6k24Oj6N2K27m41K59J28n20N38K2k11J64
1677A42j86J1nj89J29L1q7J18R7j49L24n1P8m20rJ53J21M4k14J57P0k70Q5j30
1701a50K05j76j66M56j21j18P6j89K29j53q4J55r8R1mK19j8K24m12K7Q0j15j08
1724a50Q3j18J87jn2k08L48J36l10L3J80k13J84j12P6r2J06j55J32J06n4k7j01
1747b2J85k33q9j76J71j09J67J77l11K97P2k82K68l48L40lj7j68K32k60J54j65
$$ plain form
1769 -120 -69 -42 -61 -34 163 31 131 -68 25 -145 22 -20 11 37 105 -193 -34 -149 29 263 -10 56 -80
1792 -80 2 92 119 213 -77 40 243 -217 -223 21 84 111 -275 -177 4 135 4 222 232 -98 344 -141 -20 111
1816 111 -13 -21 -45 48 204 264 -51 -297 118 71 -51 -144 184 -16 91 -12 79 78 -372 -7 -171 -10 48 45
1840 45 -198 130 -71 -217 -2 -172 -154 187 250 65 -302 247 -49 -338 161 -21 117 0 227 -175 -293
1861 -293 -17 1 -61 128 126 22 102 -79 -127 15 194 122 -332 85 -306 24 -80 55 33 -79 -79 -168 -251 -65
1885 -65 288 93 -223 -98 -256 33 -80 377 -151 -199 -38 -5 -115 -15 22 -59 269 38 -8 124 -25 30
1907 30 12 -50 74 146 14 65 -49 55 -247 62 -61 -15 -8 -67 -57 108 209 75 -83 -132 -310 -214 -103 -21
1931 -21 2 -61 158 78 27 -6 -2 -181 320 18 -7 207 130 155 83 44 195 -335 177 -53 -256 124 152 -66 62
$$ packed form
1769a20N1K7j9K7J97j32J00j99R3j70J67m2L1K6O8k98J59j15J78K34k73O6j36
1792h0Q2R0K7R4k90J17K03m60oK44O3K7l86R8J81J31j31K18J0l30M42m85J21J31
1816A11j24qk4R3J56O0l15k46M15m7j22r3L28k00J07j03R1jm50L65j64J61N8l
1840D5k43L28k01j46K15j70J8L41O3j85l67N49k96k89M99j82J38j17K27m02j18
1861b93K76J8o2J89kj04Q0j81m8J42J79p2m54M17l91L30j04J35k2j12%q9q3J86
1885f5L53j95l16J25j58K89j13M57n28m8J61L3j10J00L7q1L28k31m6J32j49N5
1907C0j8o2J24P2j32N1j14J04l02L09j23M6Pn9J0J65J01j34j58m9j78R6J11Q2
1931b1K3o3K19q0n1l3Mj79N01l02k5K14p7K5p2l9J51n30N12k30k03L80K8k18J28
$$ plain form
1956 62 69 -181 -7 -33 -107 97 -106 -118 -81 -18 112 -117 64 -71 -124 -161 -131 78 -120 38 128 -78 -188 53
1980 53 -140 41 -5 75 -38 -33 -173 57 144 -132 234 -109 61 64 -101 -183 381 219 -213 100 150 -465 -7
2003 -7 -45 61 161 147 -237 264 119 152 -37 -53 259 -175 266 413 166 284 56 71 79 -138 52 132 -203
2026 -203 15 -6 -167 195 255 32 231 -37 11 -212 -127 57 -264 -11 361 -142 -183 -136 -73 155 194 139 83
2049 83 166 142 -38 5 -23 3 -19 56 -85 163 -115 26 156 204 127 -23 -137 63 205 -48 0 79 -108 105
2073 105 -217 289 -51 -165 32 30 -56 -93 -85 -245 -206 89 465 138 73 -29 78 164 246 239 186 -27 -108 41 -137
2098 -137 -119 218 -115 -219 -18 -25 40 22 -71 28 50 -52 190 -303 -207 56 216 4 18 -50 -38 -138 12 -28
2122 -28 174 54 96 242 -33 65 -136 25 336 -14 -41 -137 -22 -260 76 -136 158 133 16 134 -31 83
$$ packed form
1956F2Pk50J74k6p4K04k03j2L7O3J30k29J81j35n3l7L0K09j98J58R0k06j10K41
1980E3j93J81m6Q0j13Nj40K30Q7k76L66l43J70Lj65q2N64j62m32L13N0o15M58
2003gl8J06J00j4l84N01j45L3j89j6L12m34M41J47k47J18k28J5Qk17J90Q0l35
2026b03K18k1j61L62O0k23J99k68M8k23Q5J84l21K53L72n03m1M7O3K28L9n5n6
2049H3Q3k4j80M3k8K6k2P5j41K48k78J41J30M8p7j50j14K00J42k53M8P9j87K13
2073A05l22N06l40j14J97kq6l7Qj60L9K95L76l27o5j02J07Q6Q2pn3k13q1J49j78
2098a37J8L37l33j04K01pO5j8r3R9K2j02K42m93R6K63J60k12J4o8J2j00J50m0
2122b8K02j20M2J46k75R8k01J61L11l50k7r6J15k38L36k12K94k5j17J18j65J14
$$ plain form
2144 83 -36 -162 -295 -120 -112 -71 151 138 -220 -101 118 -3 -212 -237 -220 -104 140 37 195 121 -170 53 157
2167 157 368 -40 111 -97 -182 216 -113 10 -71 103 78 41 63 89 50 156 -146 110 -19 -128 47 -82
2189 -82 -140 111 -139 -361 -100 93 -52 -160 -110 -135 -162 41 -151 -77 -237 -188 125 -32 76 207 -127 31
2211 31 46 149 -12 -142 -191 -32 -128 -316 -274 -56 109 -127 212 -34 1 15 186 -308 -260 94 94 -63 -219
2234 -219 35 130 165 76 57 -69 -47 39 -77 198 -74 -68 -176 -65 -46 46 283 84 64 31 -192 -139 -122 68 -53
2259 -53 193 -237 -221 -161 -35 -228 -178 -140 -7 -104 7 -85 -121 220 -200 80 -150 67 54 39 -29 -74 30 -46
2283 -46 -230 -185 182 -35 -232 53 263 -71 -154 88 22 -14 35 -65 -66 -139 -131 -55 52 13 33 -10 -67 129 -190
2308 -190 -15 -38 -366 -176 44 146 48 103 -36 45 -30 103 -175 -86 83 28 -53 -41 102 -45 -174 -219 -83
$$ packed form
2144H3j19j26j33J75QM1K22j3l58J19K19j21k09k5J7J16K44j03J58p4k91K23J04
2167A57K11m08J51k08q5L98l29J23q1J74k5l7K2K6l9J06l02K56j29j09J75j29
2189h2n8K51k50k22K61J93j45j08N0k5k7K03j92P4j60M9L13j57J08J31l34J58
2211C1J5J03j61j30m9J59r6j88M2K18J65k36L39k46L5J4J71m94M8L54%j57j56
2234b19K54R5L5q9j9j26K2Q6j16K75k72Oj08J11J9R2K37j99k0l3k23N3J7J90j21
2259e3K46m30J6O0J26j93N0L8J33r7J11r2l6L41m20K80k30K17j3j5o8m5J04p6
2283d6j84M5L67k17j97K85K10l34q3K42o6l6M9j00jp3QP6J07l9K0m3n7J96l19
2308a90J75k3l28J90K20J02r8N5j39Q1p5J33k78Q9J69n5q1J2J43j47j29m5J36
$$ plain form
2331 -83 86 -90 -60 -52 -34 20 15 -35 203 19 142 121 24 60 -124 170 54 -47 273 196 -142 -167 146 85 -256
2356 -256 120 -260 -179 -221 66 -183 14 88 233 48 120 61 -75 43 -13 123 -187 102 294 -324 -247 88
2378 88 -182 182 46 -148 -69 -1 130 -75 -271 223 262 162 24 -61 -39 82 -93 -125 -100 220 -133 -35 150
2401 150 -105 -1 55 107 -11 -30 -213 -109 41 -55 88 -48 39 -62 -193 113 -238 -119 122 282 217 -13
2423 -13 214 41 250 -195 -167 129 -23 -240 -38 -187 176 39 -91 -179 226 -98 13 181 -38 -157 -156 -4
2445 -4 161 -26 159 -21 9 -13 -4 -8 -32 -70 155 -183 116 378 126 -130 -36 -3 -228 60 -95 144 -133 105
2469 105 -28 65 -352 -236 376 -159 -68 70 69 130 -249 11 195 264 -195 -119 107 -180 -38 16 -198 58 106
2492 106 -398 88 1 218 -260 -36 -83 4 69 147 166 0 160 40 -58 75 223 -139 -114 -90 352 350 -88 13
$$ packed form
2331h3J69j76L0QJ8N4nn0K38j84J23k1r7L6j84K94j16j01L20p7l38k5L13o1l41
2356b56L76l80Q1m2K87k49J97P4J45j85P2n9j36J18n6J36l10K89J92o18P7L35
2378H8k70L64j36j94P9O8J31k05j96M94L9j00j38q5K2J21j75l2K5L20l53R8J85
2401A50k55J04N6N2j18j9j83J04J50r6J43j36Q7j01j31L06l51J19K41J60o5k30
2423a3K27j73K09m45K8K96j52k17K02j49L63j37j30q8M05l24J11J68k19j19JJ52
2445dJ65j87J85j80L0k2Rmk4l8K25l38K99K62k52k56R4L3k25K88j55K39k77K38
2469A05j33R3m17J16O12n35R1J38jO1l79K60J84O9m59P6K26k87J42N4k14K56M8
2492A06n04M86q7K17m78K24m7Q7O5P8J9j66J60j20r8J33J48l62K5K4M42km38J01
$$ plain form
2516 13 -110 235 88 30 -257 135 197 -56 161 -93 -125 89 85 107 358 90 330 48 82 44 1 92 44 -339
2540 -339 -39 -115 37 -103 2 -179 39 43 76 -179 18 -26 -150 233 18 129 -150 143 -9 274 -77 178
2562 178 24 78 -148 -107 82 -84 -227 -33 -161 -89 -126 -79 142 39 151 245 -128 -123 -33 14 288 67 -31 -155
2586 -155 65 240 -160 -42 -154 -93 -1 -143 223 209 -81 -198 -133 -88 -242 64 -10 45 26 0 20 181 99 88
2610 88 -143 -148 -123 -11 -203 -373 73 221 -27 125 217 -322 121 402 -229 -108 38 50 231 95 121 -219
2632 -219 112 -155 -65 42 56 2 -12 69 -47 -89 -166 51 -20 -187 184 -34 61 -163 218 -66 121 120 -14 -119
2656 -119 -200 -52 -122 49 -120 151 183 188 271 -25 185 50 -149 -143 -76 -72 0 174 -81 23 -2 176 14 -159
2680 -159 -102 -320 26 -208 38 -77 -184 -70 133 61 -142 274 68 21 183 57 5 -77 -72 -218 -164 -110 -116 58
$$ packed form
2516A3j23L45j47n8k87L92O2k53K17k54l2K14mK2K51k68K40k82L4l8m3R1m8l83
2540c39L00p6J52j40J05j81K18ML3k55J97m4j24L83k15J11k79K93j52K83l51K55
2562A78j54N4k26M1J89j66j43J94j28P2l7M7K21j03J12R4l73NR0M7K74k21r8j24
2586a55K20J75m00J18j12O1R2j42L66j4k90j17O5M5j54L06p4N5j9k6K0J61q2j1
2610H8k31nK5J12j92j70M46J48k48J52R2n39M43K81o31J21J46J2J81j36K6l40
2632b19L31k67R0J07J4n4j4Q1j16m2p7K17p1j67L71k18R5k24L81k84J87jj34j05
2656a19q1J48p0J71j69K71L2NQ3k96K10j35j99OO7MP2J74k55J04k5J78j62j73
2680a59N7k18L46k34K46j15j07J14K03p2k03M16k06m7J62j26n2q2Nj46N4N4oJ74
$$ plain form
2704 58 -246 129 130 87 71 -199 72 -107 -115 37 -72 -116 -187 4 -58 -70 107 -23 176 101 -163 -101 -49 20 -168
2729 -168 279 3 70 193 -172 44 91 -135 62 -95 -131 -156 -19 81 -157 -150 -280 -17 -83 73 -226 -156 57
2752 57 -61 209 67 245 101 38 -60 -42 141 21 -242 -99 65 -67 69 -167 -93 -137 -20 112 137 -171
2774 -171 -120 -125 92 20 -232 145 74 273 159 -386 -69 114 -47 189 -3 -199 -23 -10 -17 -15 -114 0 -61 38
2798 38 -13 14 278 91 -9 -43 4 15 40 51 -66 117 114 -64 -10 13 -98 -149 -51 -301 143 -350 -5 248 -53
2823 -53 -364 68 -240 -146 -11 -126 -389 -58 291 -107 -20 148 -119 380 102 -311 -116 176 -86 -131 -172 -230
2845 -230 37 43 29 -327 20 182 -210 248 -194 190 -224 -94 208 -175 15 157 169 85 179 30 230 -19
2867 -19 120 31 -66 28 25 153 -33 -192 -21 -77 47 164 312 -96 76 1 248 -19 24 24 452 96 -216 -115
$$ packed form
2704E8l04L75Jm3j6k70K71j79qJ52j09m4p1J91o2j2J77j30J99p5k64O2N2O9j88
2729a68M47k76O7J23l65K16M7k26J97j57l6k5J37J00k38Pj30K63o6J56k99P0K13
2752E7j18K70j42J78j44o3r8J8J83j20k63J43J64j32J36k36P4m4J17J32K5l08
2774a71N1nK17p2k52L77p1J99j14n45L17J83j61K36j92j96J76J3pKr9J14o1R9
2798C8n1K7K64j87j00l4M7J1K5J1j17J83lj78N4K3j11n1R8k50M44m93L45K53l01
2823e3l11M32l08R4J35j15k63L31L49l98Q7J68k67M99k78m13J95K92k62m5m1n8
2845b30K67Oj4l56L47J62l92M58m42L84m14J30L02l83J90J42J2q4R4j49K00k49
2867a9J39q9r7R4lJ28j86j59J71n6J24J17J48m08J72p5K47k67M3%M28l56l12J01
$$ plain form
2891 -115 60 53 -74 87 73 70 68 -95 -16 90 213 86 -345 95 73 -70 -58 57 102 -49 59 19 -112 -98
2915 -98 -241 16 -75 -221 189 255 -79 -96 -206 151 42 -174 -113 -112 -100 66 -127 -56 -17 -126 28 -152 199
2938 199 75 42 17 -21 -368 -129 416 -66 13 -27 -291 -51 -241 252 -130 -147 -80 15 131 144 70 -159 176
2961 176 173 16 -88 -4 -97 -152 -116 135 144 77 179 -22 8 -60 23 234 -39 -134 -79 -148 88 -57 -88 -310 -228 6
2987 6 -47 -158 -49 -79 -345 9 109 -27 12 -19 193 -233 -73 68 206 70 -196 60 202 124 -89 48
3009 48 42 146 131 67 77 -320 -1 110 189 239 -193 464 -168 -104 0 34 -89 -109 201 241 -64 -147 16 146
3033 146 56 -85 83 -90 -111 117 65 363 56 -75 245 -178 -125 -135 39 167 -92 -305 -120 430 -266 292
3055 292 184 -184 -156 -17 58 -38 -76 196 -43 -244 30 73 -223 54 -19 56 -117 -143 80 27 208 173 -213
$$ packed form
2891a15J75pj27J61j4lkj63P9J06J23j27m31M40k2j43J2J15M5j51J08m0j31J4
2915i8j43K57r1j46M10O6l34j7j10L57j09k16O1JJ2J66j93P1L9j09J54j80L51
2938A99j24l3k5l8l47K39N45m82P9m0k64K40j90M93l82j7O7R5J16J3p4k29L35
2961A76lj57j04Q4r3n5L6K51Ro7J02k01L0o8Q3K11k73r5N5o9K36j45l1k22Q2K34
2987Fn3j11J09l0k66L54J00j36L9l1K12m26J60J41J38j36k66K56J42p8k13J37
3009D8oJ04j5o4J0l97L19J11P9N0m32O57o32O4J04L4j23k0L10M0l05q3J63J30
3033A46r0j41J68j73k1K28n2K98l07j31L20m23N3j0J74J28k59k13J85N50o96N58
3055B92j08l68K8J39P5r6l8K72k39k01K74M3k96K77p3P5j73k6K23n3J81l5l86
$$ plain form
3078 -213 -2 77 173 257 24 4 -271 66 7 -31 60 69 -197 -70 -124 -103 234 237 -195 135 40 -113 88 -190 106
3103 106 -180 46 -55 0 57 -59 -118 24 45 24 41 21 238 107 -43 46 -79 -227 -23 257 -266 -118 -171
3126 -171 127 -141 148 -165 -12 -24 135 -128 -133 59 -64 -191 -62 -199 -108 28 -16 146 220 116 -64 112
3148 112 -70 121 115 108 -15 -135 -93 137 -191 265 -182 -47 56 63 24 38 -1 28 -238 216 244 -170 23 41
3172 41 -10 82 -82 95 193 -174 78 281 -42 -188 -234 -255 259 134 -20 178 62 -139 -280 -201 161 178 -72
3195 -72 -109 155 135 -112 -113 321 215 125 75 161 -222 -132 -80 -186 84 -44 -21 -125 -240 -302 -148 48 277 5
3219 5 20 -69 -140 -55 43 167 51 293 -252 60 -130 -83 -53 205 -138 105 122 28 -59 -81 140 -77 -36 -147 -190
3244 -190 29 -65 64 -184 93 -20 136 169 -89 57 -186 -45 309 -147 78 -235 135 69 178 -148 193
$$ packed form
3078b13K11P9R6Q4k33k0k75L37n9l8R1Rk66J27n4K1L37Lm32L30r5j53K01k78K96
3103A06k86K26j01N5N7j16n9J42K1k1J7k0K17j31j50Q9j25j48K04K80n23J48n3
3126a71K98k68K89l13J53j2J59k63nJ92j23j27J29j37R1J36m4J62P4j04j80J76
3148A12j82J91opj23j20M2K30l28M56m47J35J03Pl9J4l9K9k66M54K8m14J93J8
3172D1n1R2j64J77R8l67K52K03l23j46m6k1N14j25j54J98j16k01j41P9L62J7k50
3195g2l7K64k0k47jM34j06r0n0Q6l83R0N2j06K70j28K3j04j15o2J54J96K29k72
3219EJ5q9p1Q5R8J24j16K42n45L12j90M7L0K58l43K43J7r4q7k2K21k17M1j11m3
3244a90K19r4J29k48K77j13J56L3k58J46k43J41L54m56K25l13L70o6J09l26L41
$$ plain form
3265 193 140 -290 66 -125 118 -221 167 6 -72 63 -174 35 37 110 -125 95 12 120 10 -95 -70 -88 74
3288 74 -59 97 -131 -155 -163 348 -174 13 -69 -364 100 180 -45 9 -10 -62 112 158 26 83 -47 -81 -50 121
3312 121 -91 13 -50 -100 88 126 152 -189 -83 -151 189 -23 225 -112 -50 -220 112 -84 330 6 6 -66 146
3335 146 226 53 3 -114 -176 -202 -91 -24 112 -157 -76 -41 247 96 -90 214 -147 156 205 190 -204 -157 62
3358 62 35 129 76 -86 160 68 -179 -137 -37 27 -174 -48 60 -115 -83 58 15 -76 -16 334 151 -52 5 -128
3382 -128 101 181 40 265 77 239 132 47 -160 27 108 177 253 -21 229 140 113 -71 -100 -72 175 152 -141
3405 -141 -171 -131 -34 -35 250 -42 243 124 -9 135 -179 15 -56 -83 5 131 170 67 50 59 -17 -130 64 -108
3429 -108 73 164 24 110 154 26 -300 -160 -139 -260 109 67 8 31 -112 228 -109 -195 197 -92 -105 -94 -1 258
$$ packed form
3265A93n3m30L56j91K43l39L88j61p8J35k37K09KP3k35K20q3J08j10j05K5j8J62
3288G4j33J56k28k4qN11n22J87q2k95M64Q0k25N4j9n2J74M6j32N7j30l4L1J71
3312A21k12J04o3n0J88L8K6l41J06o8L40k12K48l37O2j70L32j96M14l24%p2K12
3335A46Q0j73n0j17o2k6J11O7J36k69Q1L5K88j51j86L04l61L03M9j5l94M7K19
3358F2k7R4n3j62K46r2k47M2J00O4k01J26J08j75L2J41m3r1O0L50j83k03N7j33
3382a28K29Q0j41K25j88J62j07q5k07J87Q1O9P6k74K50q9k7j84k9K8K47k3k93
3405a41l0M0R7jK85k92K85j19j33J44l14J94p1k7Q8J26L9j03j7Rp6j13J94j72
3429a08J81R1j40Q6M4j28l26J40K1j21L69m2n9K3j43L40l37q6L92k89j3J1R3K59
$$ plain form
3453 258 -239 -51 0 -57 4 -20 15 -52 123 -144 121 126 -4 72 44 -73 -258 19 120 -196 240 135 23
3476 23 -99 174 -26 78 -159 12 98 -119 76 -7 109 38 -242 147 -201 -70 -32 -212 144 -80 56 -147
3498 -147 77 -47 74 130 -14 55 -5 228 -8 93 279 -85 47 167 84 -136 91 109 20 -48 81 92 35
3521 35 107 -39 68 100 183 -231 -252 -88 147 -104 -133 205 55 78 -57 29 -239 -104 59 87 76 -182 -89 -18
3545 -18 199 69 -115 71 -204 102 -169 32 -121 -109 -202 129 105 -29 100 129 291 82 37 -97 34 -36
3567 -36 37 82 42 -43 -46 198 258 234 -116 40 -14 -48 -41 -29 140 -103 -25 132 128 -148 -26 99 -124 60 -188 83
3593 83 -51 -31 -123 3 320 -55 123 -365 43 -96 -25 -65 -138 -94 3 -236 -71 344 -227 -178 -65 190 260
3616 260 -74 54 -74 156 -142 -117 -237 57 -29 224 -145 15 -205 95 71 -10 -178 136 130 339 -4 -16
$$ packed form
3453B58m97J88N1n7O1k4L5o7J75k67K65Nj30P6k8j17j85K77J01l16M36j05j12
3476B3j22K73k00J04k37J71Q6k17J95q3J16p1k80L89l48J31L8j80L56k24J36k03
3498a47K24j24J21N6j44O9o0K33k36J01J86l64J32J20q3k20K27J8q9o8J29J1n7
3521C5P2j46J07L2Q3m14k1J64K35k51k9L38j50K3j35Q6k68J35J63K8j1k58R3P1
3545a8K17j30j84J86k75L06k71K01j53J2r3L31k4j34J29K9J62k09m5j34J31p0
3567c6P3M5m0q5lK44O0k4l50J56n4l4PJ2J69k43P8J57mk76J22J25k23J84k48K71
3593H3j34K0r2J26L17l75J78m88M08j39P1m0p3M4R7k39J65M15n71M9J13K55P0
3616B60l34J28j28K30k98K5j20K94q6K53l69J60k20L00k4q1j68L14oK09l43j2
$$ plain form
3638 -16 -185 -89 14 111 -60 127 -270 4 189 122 -167 91 -45 132 -132 -180 -60 76 276 -69 215 -133
3660 -133 -119 -29 -186 -71 252 -65 -220 -75 -247 65 -39 -289 49 -313 220 -44 59 130 7 -247 -58
3681 -58 -47 -35 105 -327 20 48 104 95 180 -144 96 -192 77 -32 -84 -186 -103 -128 -80 12 204 -226 44 221
3705 221 11 26 4 33 -105 -159 -170 -183 -271 149 -81 41 -243 -154 113 79 -30 -150 -195 313 -81 413 46
3728 46 145 252 -101 -59 -82 -64 -13 0 -117 89 90 247 23 16 -384 -48 35 71 -198 -88 -210 54 -102 24
3752 24 -28 145 58 -74 -409 -168 -97 11 216 93 138 94 -150 104 34 -192 252 -223 125 75 33 237 28
3775 28 39 20 126 91 12 -308 -78 -36 89 156 13 30 -54 -321 -254 -6 224 -30 126 -290 -35 -24 125 105
3799 105 194 -231 -60 248 58 -61 -49 -16 -113 135 -254 120 -145 63 -93 -208 68 93 -213 -124 -104 51
$$ packed form
3638a6j69R6J03R7j71J87l97K74J85o7k89K58j36J77k64m8J20J36K00l45K84l48
3660a33J4R0j57J15L23l17j55J45j72L12j04k50L38l62N33k64J03P1j23k54J89
3681e8J1J2J40m32L47K8N6rQ5l24K40k88K69j09n2j02Q3k5M8R2J92m30K70J77
3705B21k10J5k2K9j38n4j1j3q8M20k30J22k84Q9K67l4j09j20m5N08l94M94l67
3728D6R9J07l53M2k3J8N1J3j17K06JJ57k24pm00L36Q3L6k69J10j22K64j56J26
3752B4n2J73q7j32l35K41P1J08K05j23M5m4k44K54p0k26M44m75L48n0m2K04k09
3775B8J1j9J06l5p9l20K30M2J25O7j43J7q4k67O7K48K30k54J56m16K55J1J49k0
3799A05Q9m25J71L08j90j19J2L3r7K48l89L74k65K08j56j15K76K5l06Q9K0J55
$$ plain form
3821 51 19 276 110 85 -223 -17 -262 17 32 -147 34 54 -272 -35 -101 -133 65 4 111 139 7 -65 94
3844 94 3 93 -51 38 95 -118 -101 96 22 54 -31 241 -102 -50 -170 159 -161 117 240 85 -34 -85 63 -182
3868 -182 51 -348 -277 99 141 17 200 -56 -3 -81 -50 111 -27 -161 -82 184 53 82 -134 269 -111 -66 -163
3891 -163 -118 -40 -13 132 -133 98 23 22 1 -56 32 -21 -129 -132 118 -19 20 -93 -27 -46 -20 -90 -43 -57 -129 -77 -66
3918 -66 76 -28 54 -22 -96 -112 -43 -13 114 -39 162 75 -202 -184 63 98 162 -37 -87 50 153 154 -32 69 95
3943 95 -63 -215 91 101 -155 22 46 30 -185 54 -16 13 200 -132 -27 8 -34 -24 -305 -120 162 61 -91
3966 -91 66 -19 -11 44 332 -4 -5 -38 -218 194 -121 -243 -32 93 221 71 -54 -247 -211 -183 -101 -53 22 -117
3990 -117 -28 219 4 -41 28 -19 -25 -40 72 -88 102 -147 149 -142 -259 154 -291 -33 299 -249 -98 31
$$ packed form
3821E1l2K57j66k5l08K06k45K79J5j79J81K0l26K37o6l2J98o1J07K8j32p2J59
3844I4r1R0j44Q9N7k13J7J97p4L2q5K72l43N2j20L29l20K78J23j55j19n1J48k45
3868a82K33l99P1L76M2j24J83k56N3p8L1J61j38j34P9K66j31K9k16M03l80M5r7
3891a63M5P8K7J45k65K31p5jk1n7Q8n3j08lK50j37L9j13O6j9K6p0M7j4p2N2J1
3918f6J42j04Q2p6p4j6O9L0J27j53K01q7k77J8K47L5O4j99n0J37J03Jj86J01K6
3943I5j58j52L06J0k56J77K4j6k15K39p0K9J87l32J05L5m2J0k81J85K82j01j52
3966i1J57q5QN5K88l36jl3j80M12l15j22K11J25J28j50j25j93L6K8Q2M8P5j39
3990a17Q9K47k15m5O9m7oj5J12j60J90k49K96k91j17M13m45K58L32n48J51J29
$$ plain form
4012 31 40 74 -281 -135 108 244 96 239 182 45 1 -187 175 -91 160 34 250 -2 212 131 291 108
4034 108 -289 13 -79 -126 -138 -113 -153 -107 44 115 -27 9 -105 62 1 -18 102 -107 19 -68 71 168 -24 125
4058 125 224 -12 4 35 97 64 170 175 113 -254 -154 132 -118 57 -145 -267 43 40 23 -178 33 -57 -8 -198
4082 -198 47 -51 -255 -17 -149 134 80 51 154 -96 -115 64 373 180 157 -312 75 325 -120 8 193 37
4104 37 -298 -191 92 130 -88 139 -163 74 -17 -86 -281 490 152 -4 46 4 189 17 214 -8 82 72 78
4127 78 5 -258 -62 -160 -154 269 43 21 -367 -37 -252 103 -46 60 -104 -125 94 121 -1 159 259 -75 -78
4150 -78 115 10 81 -383 -52 35 -63 65 -158 0 -247 129 108 2 -120 -184 -57 -34 -135 64 98 28 -36
4173 -36 -12 -180 -125 297 114 -151 131 -22 216 225 71 -37 -25 -247 33 49 -86 154 153 129 -174 79 -152
$$ packed form
4012C1RL4l55J46K43J36j48J43n7j37m4j88L62k66K51j26K16k52K14q1J60j83
4034A08l97L02r2m7j2K5m0M6J51P1j42L6j14J67o1j9J20k09J26q7J39R7j92J49
4058A25R9k36J6L1O2l3J06No2l67J00K86k50J75k02j22L10lj7k01K11r0M9j90
4082a98K45r8k04K38j32K83n4k9J03k50j9J79L09j93k3m69L87K50m45J28J85j56
4104C7l35J07K83L8k18K27l02K37r1o9j95P71l38j56N0m2J85j72J97k22R0j0O
4127G8p3k63J96r8OM23k26k2l88L30k15L55j49J06j64k1K19K7j22J60J00l34l
4150g8J93j05P1m64L31Q7r8J28k23J58k47L76k1j06j22o4J27K3j01J99L4p0o4
4173c6K4j68N5M22j83k65K82j53K38Rj54j08J2k22K80J6j35K40jk4l03K53k31
$$ plain form
4196 -152 251 -138 41 77 -94 -3 -184 218 6 -66 -113 111 -78 -52 94 -24 -97 -155 -145 21 -28 -5 76 -17
4220 -17 -23 28 -142 86 -43 112 99 126 203 76 -134 207 37 72 45 45 -94 15 -272 197 -44 -75 -118 69
4244 69 -140 -61 38 -201 -291 -16 155 -61 -216 -137 -260 127 192 -56 99 -28 -53 26 -9 -125 255 -170 -31
4267 -31 5 -111 74 -48 55 -40 -64 136 -57 58 -146 -2 170 -117 -103 151 -14 -12 -196 -240 -2 219 78
4290 78 7 16 -10 287 -4 -73 -29 -75 -128 -228 93 206 -24 -122 20 -53 -133 33 52 -40 142 200 -70 -79 -145 294
4316 294 -33 -22 57 42 172 141 1 -222 -112 193 -49 7 33 -71 132 -71 37 44 -310 -46 -33 -68 -141 177
4340 177 -355 118 -57 59 76 3 -82 163 80 91 134 198 -284 -95 141 -13 114 -74 -52 301 -86 -150 -84
4363 -84 134 237 93 -115 66 -298 3 -45 -83 267 -31 92 -372 80 166 -63 -1 157 -175 52 -161 130
$$ packed form
4196a52M03l89J79L6j71R1j81M02k12p2m7K24j89K6J46j18p3n8J0J66m9K3Q1r3
4220a7oN1j70K28j29J55j3K7P7j27k10L41j70L5k7%j39J09k87M69k41l1m3J87
4244F9k09P9R9k39r0K75J71k16j55P9j23L87O5k48J55j27k5P9l5j16L80m25J39
4267c1L6j16J85j22J03r5k4K00j93J15k04J44J72k87J4K54j65Kj84m4K38K21j41
4290G8p1Rk6K97k91o9M4m6n3j00L21J13k30r8J42p3q0J66J9r2J82N8k70ro6M39
4316B94l27J1P9j5J30l1j40k23J10L05k42N6K6j04K03k03J08Pl54K64J3l5p3L18
4340A77n32M73j75J16J7p3q5K45q3J1M3O4m82J89K36j54J27j88K2L53l87o4O6
4363h4K18J03j44k08J81l64L01m8l8L50k98J23m64M52Q6k29O2J58l32K27k13K91
$$ plain form
4385 130 53 -220 169 -278 -253 -11 -240 109 14 40 88 151 -113 -309 136 3 -155 116 35 17 2 -237 -76
4408 -76 9 -221 99 -251 -29 -52 -252 119 117 -139 13 -16 -199 -92 212 56 -91 -326 159 -323 -84 168
4430 168 13 214 37 189 61 27 -31 -52 151 3 -101 91 -106 -125 -88 32 -186 -18 27 160 -226 -124
4452 -124 31 -94 76 63 -1 42 79 -91 -182 16 154 -10 -219 276 91 -87 -5 428 122 -113 55 -231
4474 -231 -120 -123 135 58 -42 76 31 -163 110 179 90 336 16 66 75 -161 196 55 -269 17 60 -39 -52 -79
4498 -79 -129 142 -87 189 -25 -28 133 -201 63 -87 -10 -42 -106 -37 -62 64 -29 193 195 -138 -52 -14 185 25 -159
4523 -159 256 245 -81 -87 -178 -17 65 -213 156 -55 -330 172 -37 72 112 246 -125 -293 -3 -122 -138 -28
4545 -28 -83 122 -84 158 -150 151 102 -94 -13 -4 -25 203 92 -151 -110 -406 143 -64 -66 197 224 -12 -59 -183
$$ packed form
4385A30p7k73L89m47K5K42k29L49r5K6M8O3k64j96M45j33j58K71q1j8j5k39J61
4408g6Q5k30L20l50K22k3k00L71kk56J52k9j83J07L04j56j47k35M85m82K39K52
4430A68j55K01j77J52j28l4n8k1K03j48j04J92j97j9L7J20k18J68M5J33l86J02
4452a24J55j25J70j3o4M3L7j70r1J98J38j64k09M95j85j78Q2M33l06k35J68k86
4474b31J11lK58p7j00J18m5j94K73O9q9K46l20N0Rk36L57j41l24K86M3r9j3k7
4498g9n0K71k29K76k14lJ61l34K64j50P7l2o4O9k5J26r3K22Kl33Q6L8J99j60j84
4523a59M15j1l26or1J61Q2k78L69k11k75N02k09J09M0J34l71j68K90j19j6J10
4545b8n5K05k06K42l08L01m9j96Q1Rk1K28j11k43M1k96N49k07kK63K7k36m7j24
$$ plain form
4569 -183 -119 -33 -73 -92 137 -185 203 19 166 110 36 144 -39 -29 -17 -34 -183 -129 -24 133 87 94 -59 -45 -342
4594 -342 77 -109 186 103 -334 -28 -94 -52 210 -132 145 188 -64 323 -129 15 287 315 -213 -44 195 -341
4616 -341 59 53 -328 -8 70 95 163 110 -118 58 -124 39 -70 159 126 91 7 -2 157 -14 103 -76 -30 -65
4640 -65 -60 98 -59 69 70 157 -115 -102 25 74 10 85 40 -189 48 64 184 250 -219 34 -49 -152 -84 107 -158
4665 -158 52 -5 450 -88 31 -70 -37 -104 273 54 80 79 -143 209 -166 -101 65 28 -4 -94 -15 11 -125 39
4689 39 162 -221 51 22 64 273 111 24 -97 2 259 213 -162 158 162 -224 132 -35 -59 -101 -25 -81 -193 19
4713 19 -73 128 -52 73 0 -119 -70 -165 126 -18 72 32 39 60 -129 -76 127 -219 9 -81 -66 -142 -301 -199 76
4738 76 -24 109 -162 -350 27 152 -148 -40 -122 -63 25 -214 88 -283 -136 -145 -58 71 -4 149 -106 143 155
$$ packed form
4569a83O4Q6m0j9K29l22L88j84J47n6p4J08j83J0J2j7j49N4J05J57m6Pj53J4k97
4594c42M19j86K95q3m37L06o6M2K62l42K77M3k52L87m52J44K72K8n28J69K39n36
4616c41M00ol81L20P8K5O8n3k28J76j82J63j09K29l3l5q4rJ59j71J17j79M6l5
4640f5NJ58j57J28JQ7k72J3J27M9o4P5m5k29K37J6J20O6m69K53q3j03O8J91k65
4665a58K10n7M55n38J19j01L3o7L77k19K6jk22L52l75O5J66l7l2r0P9K6j36J64
4689C9J23l83K72k9M2K09j62q7j21R9K57m6l75L20Ml86L56j67k4m2P6n6j12K12
4713A9r2K01j80J25p3j19M9r5K91j44R0m0PK1j89N3K03l46K28r0J5p6j59J02K75
4738G6j00J33k71j88L77J25l00J08q2N9Q8k39L02l71J47rQ7J29p5J53k55K49J2
$$ plain form
4761 155 52 -37 175 -201 -107 120 -121 88 249 -73 -37 -117 -294 -389 -47 -30 126 -48 4 -91 -34 -273 42
4784 42 123 -222 -383 92 135 22 -28 -27 -165 155 -12 -44 116 -218 146 -72 42 98 229 30 -97 -69 -22
4807 -22 -107 -167 -114 -253 -208 -29 468 -346 -205 47 179 114 50 33 245 -60 -32 90 23 -8 -245 -104 -342 -208
4831 -208 -149 88 154 69 -136 -126 -105 -85 -223 -21 207 -357 208 234 30 169 -137 -112 40 -28 -130 122 143
4854 143 158 -149 -147 140 90 144 -115 -140 -89 -267 39 -6 251 -24 50 128 -122 190 71 -146 109 -51 -36 -102
4878 -102 -86 -282 -55 -257 -128 259 81 -4 -63 20 -137 27 160 26 -149 -135 -177 -16 -10 136 115 -109 -62
4901 -62 216 120 29 68 150 -8 77 88 206 33 197 -138 -199 -119 -185 -65 -223 -354 152 -64 261 36 34 262
4925 262 -168 141 141 133 133 32 -207 -107 -8 -10 -322 189 -140 -79 117 -196 -105 -47 -222 -305 39 -256 49 -45 235
$$ packed form
4761A55j03q9K12l76R4K27k41K09J61l22L6q0j77r5L42J7J56j74N2r5N7k39L15
4784D2Q1l45j61M75M3j13n0Jj38L20j67l2J60l34L64k18J14N6J31j99j27K8M7
4807b2q5o0N3j39M5J79M97q14J41K52J32o5o4j7K12l05K8J22o7l1k37J41k38J34
4831b08N9K37O6q5k05J0K1K0j38K02K28n64N65K6k04J39l06K5J52o8j02K52K1
4854A43J5l07KK87n0N4k59k5N1j78L06m5K57k75P4P8k50L12j19k17K55j60J5o6
4878a02J6j96K27k02J29L87j78q5n9Q3j57J64J33j34j75J4m2J61OJ46k1k24M7
4901f2K78r6r1L9Q2j58Q5J1J18j73J64l35o1Q0o6J20j58j31N06k16L25k25kK28
4925B62m30L09%q%j01k39J00R9kl12N11l29O1J96l13R1N8j75q3L44k95L05r4K80
$$ plain form
4950 235 245 62 -87 101 -44 15 -163 265 -156 -34 -3 -215 -203 185 -56 76 -52 23 376 74 92 -32
4972 -32 130 11 -130 -163 36 -44 209 -105 -96 77 -4 -29 27 151 -104 406 -20 9 7 -18 226 99 281 -124
4996 -124 149 166 179 -314 -314 -142 106 -79 199 90 94 76 84 249 -59 -176 144 -102 -80 41 109 290 -65 -45
5020 -45 -118 87 -101 54 63 3 92 86 127 112 -91 214 -6 -34 68 17 34 161 72 393 -181 -108 101 43 342
5045 342 -199 54 178 82 22 -36 -15 52 -159 36 -236 37 150 -178 -216 -35 -188 -187 124 -160 3 177 197
5068 197 -121 53 -177 -38 -20 12 -152 112 -151 -149 41 -283 -75 -41 -110 -511 -115 -179 117 58 95 -87 141
5091 141 6 219 157 203 -181 -78 19 129 152 17 -87 132 82 300 -219 -366 14 -39 -59 -77 124 -295 -40
5114 -40 -69 16 -156 217 210 -163 117 98 372 17 -119 141 4 97 -56 -11 8 353 -138 -96 -86 -120 116 -102
$$ packed form
4950B35J0j83j49J88j45N9j78M28m21J22L1k12J2L88k41J32j28P5L53l02J8j24
4972c2J62j19j41l3J99q0K53l14RJ73q1k5N6J24k55N10m26K9kk5K44j27J82m05
4996a24K73J7J3m93%J72K48j85K78j09Mj8QJ65l08j17L20k46K2J21O8J81l55K0
5020d5p3K05j88J55Ro0Q9oM1j5k03L05k20k8J02n1J7J27q9L21n74P3K09n8K99
5045C42n41K53J24r6o0n8K1O7k11J95k72K73J13l28l8J81j53JL11k84J63J74K0
5068A97l18J74k30J39J8L2j64K64k63KJ90l24K08L4o9m01L96o4K96n9L7j82K28
5091A41j35K13o2M6l84J03R7J10K3j35j04K19n0K18n19j47L80n3k0j8K01m19K55
5114d0k9Q5j72L73pl73K80j9K74l55j36K60j37R3j53M5J9L45m91M2J0l4K36k18
$$ plain form
5138 -102 67 -30 141 -340 -224 -36 9 9 -97 49 243 -52 103 93 -246 -91 53 127 33 177 -260 80
5160 80 -29 -229 -125 73 -97 48 0 -108 114 -146 -63 202 101 90 50 -81 -141 -12 -75 -61 36 -155 143
5183 143 -236 -59 -241 -192 -354 -176 -178 -30 162 -291 -59 114 226 188 188 -36 -57 -118 12 -23 5 -229 -135 37
5207 37 -7 137 -112 -160 57 -229 246 14 -80 40 96 51 -301 -34 -97 -96 302 241 49 253 -15 -65 134 -127
5231 -127 -215 60 -40 95 22 78 121 -58 -169 113 -104 331 -259 10 133 214 11 -79 27 -131 50 -91
5253 -91 -19 220 17 -36 -76 133 -34 -15 -65 153 201 -91 -192 33 -213 -55 -296 -65 30 -10 -178 -42 31
5276 31 -42 141 -244 133 170 124 -257 81 76 160 118 27 -43 186 -9 -85 -83 -32 -125 188 -127 -153 -1 -99 269 -142
5302 -142 17 -20 -11 57 -315 8 -1 -219 -261 227 92 67 -120 -348 -17 40 -31 100 178 346 273 -148 144 -135
$$ packed form
5138a02J69r7J71m81J16J88M5%j06J46J94k95J55j0l39J55J44P4r4J44m37L40
5160H0j09k00J04J98j70J45m8j08K22k60Q3K65j01j1m0j31o0J29o3J4R7j91K98
5183A43l79J77j82M9j62J78kJ48J92m53K32J73J12l8%k24k1o1J30l5K8k34R4J72
5207C7m4J44k49m8K17k86M75k32r4J20N6m5l52K67o3JL98o1j92K04k68n0J99k61
5231a27q8K75j00J35p3N6M3j79j11K82k17M35n90K69J23Q1k03r0J06j58J81j41
5253i1P2K39k03n3m0K09j67J9n0K18M8k92j01K25k46J58k41K31R5m0j68J36P3
5276C1p3J83l85L77L7m6l81L38nQ4m2r1p0K29j95p6KN1r3L13l15k6J52r8L68m11
5302a42J59l7RO8l72L23rk18m2M88j35k5j87k28L31N7p1J31P8J68p3m21K92k79
$$ plain form
5326 -135 25 -243 127 83 33 74 103 -56 -114 -241 167 -17 -168 -105 -3 -119 -204 -21 101 9 -17 -39 -96 183
5350 183 -26 195 123 191 -254 106 -81 -95 -150 472 -20 134 183 -72 -162 -78 131 -226 68 -176 -190 200 161
5373 161 -98 -131 -14 55 26 -188 -368 -131 102 -134 -260 -45 54 -359 -57 -117 287 -28 -80 -14 -59 -138 3
5396 3 -206 -109 162 -157 309 -89 77 -63 -279 -128 -53 -225 199 214 182 197 -197 -304 -42 -40 -95 -18 -119 291
5420 291 41 252 -16 -197 -46 -13 -23 96 -154 -163 169 -2 -285 136 -52 -94 5 208 -32 99 -8 124
5442 124 125 -158 -36 149 -143 -169 90 -75 -306 -42 31 86 -123 -150 76 -35 -93 -160 -75 -190 -123 38 409
5465 409 152 -84 -126 13 -178 -287 -51 -15 -64 138 227 99 2 -89 -71 130 -167 151 -10 69 324 -137 206
5488 206 76 -156 22 78 204 278 62 183 66 29 -193 -56 -73 1 -21 14 -158 39 61 227 -84 -254 166
$$ packed form
5326a35J60k68L70m4n0M1K9j59n8j27M08j84j51O3J02j16q5J83J22r2k6k2n7K79
5350A83k09K21p2O8m45L60j87j4n5O22m92J54M9k55r0Q4K09l57K94k44j4L90l9
5373A61k59l3J17O9k9k14j80K37K33k36j26K15R9m13L02o0M04l15n2O6m5p9J41
5396Ck09R7K71l19M66l98J66j40k16J51P5j72M24J5l2J5l94j07K62Kn5P7j01M10
5420B91k50K11k68j81J51L3j0J19k50rL32j71k83M21j88m2R9K03k40J31j07J32
5442A24Jk83J22J85k92k6K59j65k31K64P3N5k09k7K26j11n8o7Q5j15O7J61L71
5465D09k57k36m2J39j91j09K36L6m9K02Q9j28r7r1J8K01k97L18j61P9K55m61L43
5488B06j30k32J78N6J26P4k16J21j17l7k22J37j7P4k2L5j72J97K2J66l11j70M20
$$ plain form
5511 166 -16 -6 -108 5 7 42 249 8 132 -88 61 -54 -226 -24 200 -181 -28 48 38 -58 227 129 136
5534 136 -133 -281 105 31 98 57 -99 69 70 17 84 -154 96 48 52 -342 -17 190 240 17 44 -102 -2 -19
5558 -19 -171 85 27 -130 230 389 33 44 -23 -198 9 114 147 49 48 -25 38 -148 -203 276 -279 311 -127 -119
5582 -119 -100 86 -94 50 159 35 218 322 -23 74 64 -26 -111 77 -85 54 182 -100 -210 -96 153 -38
5604 -38 95 -21 140 -71 38 110 3 -57 -39 103 97 -188 2 49 39 91 37 -306 -15 209 -314 41 -125
5627 -125 -202 216 44 -150 -29 -8 45 -93 123 317 127 -161 134 -20 -65 -117 -212 216 -229 -216 -275 118 93
5650 93 244 331 277 -187 -97 86 -211 -77 131 36 -9 304 22 -204 -238 16 -278 70 -132 78 -103 13
5672 13 139 -121 -105 194 4 156 157 89 91 -122 -99 125 121 -220 -228 -57 83 235 262 -108 -26 -268 -108 -161 39
$$ packed form
5511A66j82J0j02J13KL5K07k41J24k20J49j15j72K02K24l81J53P6j0r6K85r8P
5534A36k69j48L86p4O7m1j56J68Jn3O7k38K50m8Ml94L25K07N0k23K7j46J00j7
5558a9j52K56n8j57L60J59l56J1o7j75K07J05L3r8jp3O3j86n5M79n55N90m38Q
5582a19J9J86j80J44J09j24J83J04l45R7j0r0q5J88j62J39J28k82j10J14K49j91
5604c8J33j16J61k11J09P2j07o0J8J42ok85J90M7j0N2n4l43K91K24n23L55j66
5627a25p7M18j72j94J21K1N3j38K16J94j90k88K95j54m5n2r5M28m45J3n9L93k5
5650I3J51Q7n4m64R0J83k97J34K08r5m5L13k82k26l4K54k94L48k02K10j81J16
5672A3J26k60J6K99j90J52Jo8Kk13K3K24ml41qJ71J40J52K7l70Q2k42J60n3K00
$$ plain form
5697 39 -188 -123 146 -14 -79 198 7 -287 83 5 -134 8 0 110 -53 -101 82 126 22 126 71 212 10
5720 10 -72 91 -228 49 -331 155 63 -91 -107 -207 -98 -67 -37 -180 -157 207 40 -52 -82 63 71 161 -103 27
5744 27 30 -46 -18 29 -109 51 -84 -28 131 -101 -383 -172 -212 -167 83 101 155 -2 82 134 -129 -205 81 -326 -40
5769 -40 -264 -154 93 -4 109 -87 -16 28 128 -73 63 -147 -42 -44 81 199 -32 80 -100 -225 -182 -16
5791 -16 -24 -7 -55 20 -46 16 -80 169 48 -255 278 -232 -125 -46 -16 -129 173 186 -1 173 117 57 -136 147 -13
5816 -13 -145 26 -203 48 7 75 -17 83 45 11 148 148 -138 -75 -37 -28 106 56 -134 -164 95 -182 -142 14 16 56
5842 56 53 -82 -116 -26 -216 -14 -28 -133 40 -204 149 105 170 -116 -2 -245 -149 -68 -15 -61 -178 -6 -28 103
5866 103 143 -203 -151 -131 -205 -163 -12 -278 -242 228 -43 -54 0 320 -121 -128 237 -294 -75 224 190 -82 -156 -89
$$ packed form
5697C9k27O5K69j60o5K77j91k94L70p8j39J42qJ10j63m8J83M4j04J04n5J41k02
5720A0q2J63l19K77l80M86r2j54j6j00J09L1L0j43K3L64j67r2l0J45QR0k64J30
5744B7Lp6K8M7j38J60j35N6J59k32k82K11m0M5K50J8N4j57Q4N2k63p6K86m07K86
5769d0k24J10K47r7J13j96P1M4J00k01J36k10J05kJ25J18k31J12j80j25M3J66
5791a6qJ7m8P5o6O2r6K49j21l03N33n10J07P9L0j13L02J3j87J74n6o0j93K83j60
5816a3j32J71k29K51m1O8r2J00l8l4J37%k86O3L8RJ34n0j90l0K59k77M0J56KM0
5842E6lj35l4R0j90K02j4j05J73k44L53m4O5k86J14k43R6Q1N3m6j17J72k2J31
5866A03M0l46N2K0p4M2J51k66L6M70k71j1N4L20m41pL65n31K19K99l4k72p4O7
$$ plain form
5890 -89 29 30 57 51 20 -113 14 29 -139 -25 -48 52 197 129 182 1 148 -38 -101 -192 -37 98 -244 43
5914 43 37 -107 -56 38 22 154 41 125 -73 26 30 25 97 328 -24 -274 -86 -102 -419 -154 -19 19 -40 12 -296 -21
5940 -21 -110 -6 -177 88 92 -58 99 115 -175 -148 -183 -36 -138 -36 143 42 -176 121 -47 -266 -105 401
5962 401 11 -55 -236 -179 -8 -17 56 211 184 -220 108 -121 7 60 137 -109 182 -68 37 -155 65 -46 104
5985 104 191 113 -15 75 -85 -36 143 -117 -15 -94 -281 189 45 226 -73 -15 -19 271 -5 218 129 29 226
6008 226 80 -128 108 151 -79 9 -361 85 -41 118 -134 -26 -39 69 185 29 233 173 37 -226 -129 -163
6030 -163 55 172 165 243 -236 -11 -25 -113 -50 53 -73 -34 122 -38 -181 50 -58 -240 -89 174 253 -101 -2
6053 -2 159 -128 -194 -82 66 -64 37 92 -40 -88 -130 -161 -100 -79 83 43 36 -113 156 -60 -124 -120 -120 -302 -195 128
$$ packed form
5890h9J18JK7ol1j33J27J5j68J14k3J00J45o8N3j81J47j86o3r1J55J35l42K87
5914D3oj44N1R4j6J32j13Q4j98R9MnP2K31l52k50J88j6l17K65J35L8n9N2l08K75
5940b1q9J04j71K65Mj50J57J6k90K7l5J47j02J02J79j01k18K97j68k19J61N06
5962D01l90o6j81N7J71rP3J55k7m04L28k29J28N3P7k46K91k50J05j92K20j11J50
5985A04Q7p8j28R0j60M9J79k60J02p9j87M70j44J81k99N8mK90k76K23q9j00J97
6008B26j46k08K36M3k30Q8l70M46j26J59k52J08j3J08J16j56K04o0j36k63R7l4
6030a63K18J17pP8m79K25j4q8O3J03j26L9J56j60j43K31j08j82J51K63P9l54R9
6053bJ61k87o6J12J48j30J01N5j32m8m2l1O1K1J62m0pj49K69k16o4M%j82J07L23
$$ plain form
6079 128 96 -53 -198 -123 -3 -23 -32 -72 86 -232 132 -22 -175 -215 75 173 -40 211 155 -162 -135 -327 -91
6102 -91 26 -53 202 50 307 -87 -390 -6 61 -96 -157 -79 29 76 54 -22 -6 81 -19 25 213 -346 1 60
6126 60 -476 198 -269 110 -301 272 -103 155 161 209 72 -98 182 -12 48 -99 74 21 117 -119 -151 155 259
6149 259 -192 356 -33 -131 58 227 145 -181 -57 -34 145 145 178 -232 92 9 103 131 -1 -404 17 -32 129
6172 129 -179 137 1 48 141 29 70 -93 -133 112 23 39 131 -256 33 -172 -28 -237 -141 191 -209 -36 271
6195 271 233 -70 162 -75 33 46 113 -86 64 47 -41 -51 44 -120 -127 -164 17 37 157 56 -14 -107 13 -21 -274
6220 -274 -223 -90 -120 -98 175 341 153 44 141 51 -33 -6 19 169 3 -146 90 -74 71 -130 208 -66 -64
6243 -64 178 -33 38 -213 19 -177 26 60 -40 -55 -65 -87 180 -110 -335 -120 -98 -138 11 -146 -114 -3 187
$$ packed form
6079A28l2j49j45P5J20k0rm0J58l18L64j54j53m0K90R8k13K51n6l17K7j92K36
6102i1J17p9K55j52K57l94l03L84O7j57o1P8J08M7k2p6J6Q7j00M4J88n59L47N9
6126F0n36O74m67L79m11N73l75K58OM8j37j70K80j94O0j47J73n3R6k36l2L06J04
6149B59m51N48l89r8J89J69q2l26J24K3J79%L3m10L24q3R4K8j32m03M21m9J61
6172A29l08L16j36M7R3j12M1j63m0K45q9J6R2l87K89k05J44k09R6L32m00J73L07
6195B71l8l03K32k37J08J3O7j99J50j7q8j0R5j64pl7J81K0J20j01p0r3J20l4k53
6220b74N1J33l0K2K73J66j88j09R7r0q4K7K5J50j66j49K36j64J45k01L38k74K
6243f4K42k11P1k51K32j96K03L4j00j5j0k2K67k90k25K15K2m0J49j57L2J11J90
$$ plain form
6266 187 251 -349 11 37 34 -283 -121 76 -19 137 6 -181 -175 180 -56 100 -359 -184 189 -189 209 74
6288 74 -256 -13 55 -155 4 23 -101 -74 -51 216 260 -29 -70 74 133 -217 282 89 -43 236 60 -15 9
6311 9 21 13 -198 110 -77 9 69 187 74 121 105 -11 -145 -179 13 -19 -182 172 126 -338 115 97 -17 147
6335 147 15 -221 -102 -130 145 -206 -203 16 -192 -144 129 40 93 -62 -73 -72 -56 167 -79 -101 -391 -268 127 -52
6359 -52 104 -154 53 -126 -56 447 60 -50 36 75 50 12 -11 -185 -198 122 49 -241 -97 184 143 209 -172 59
6383 59 299 36 -91 30 -22 311 11 -445 22 -123 142 29 -50 33 20 -67 -99 76 -94 11 132 151 -15
6406 -15 261 -17 -51 -157 241 65 54 -189 -15 -264 195 40 -41 61 -89 -86 -32 55 2 69 -136 -215 -262 120
6430 120 247 171 83 -46 48 -183 -4 54 -146 -193 60 13 -106 91 74 -119 -26 -67 210 50 -175 -28 -143
$$ packed form
6266A87O4o00L60K6ll17J62J97r5J56j31j87OL55k36J56m59J75L73l78L98j35
6288G4l30K43O8k10J59J9j24K7K3K67M4k89m1J44N9l50M99j93j32K79j76p5K4
6311IJ2qk11L08j87Q6O0J18j13M7j6j16j34l4J92l2j63L54m6m64M53j8j14J64
6335A47j32k36J19k8K75l51LK19k08M8K73q9N3j55j1JJ6K23k46k2k90J23L95j79
6359e2J56k58K07j79P0N03l87j10Q6L9k5l8k3j74j3L20p3k90J44K81m1O6l81K31
6383E9K40k63j27J21n2L33l00m56M67j45K65j13p9Q3j3q7l2J75j70J05J21J9j66
6406a5K76k78l4j06L98j76j1k43J74k49M59j55q1J02j50LN4Q7n3O7k05p9m7L82
6430A20J27p6q8j29R4k31J79N8k00m7K53m7j19J97j7j93R3m1K77j60k25J47j15
$$ plain form
6453 -143 -47 -147 65 -179 -188 140 133 -144 -50 -219 -175 -134 242 -166 -31 -35 195 172 69 -1 -127 151 -185 22
6477 22 -112 -100 -80 45 -65 42 -252 -109 -86 -185 -80 -253 -261 290 335 -7 -18 223 81 214 97 -123 -58
6500 -58 96 -50 309 -241 -81 32 23 296 -150 -27 -37 -314 -136 10 -181 167 -51 36 15 -131 152 26
6522 26 211 1 -322 168 -41 -118 -150 -143 -201 67 -168 -144 -53 48 -34 -141 -201 147 -33 -53 -93 77 -34 -69
6546 -69 88 175 -15 159 -4 109 72 158 -66 195 -183 -107 119 7 -293 58 -200 211 -208 -43 -144 -104
6568 -104 -79 -49 -74 -77 10 93 23 116 346 -123 -159 26 54 -51 13 -207 -144 -75 -14 -98 -98 85 -93 -122 -35 -4 165
6595 165 -146 -87 -33 155 -24 33 204 44 -209 26 -319 202 -53 -67 -215 -6 195 -194 62 52 -97 219
6617 219 -128 -50 -75 -130 -26 -318 -57 274 -118 -175 -327 156 117 66 -161 -69 -84 290 -76 -302 -73 -121 138
$$ packed form
6453a43R6j00K12k44rL28pk77R4j69M4M1L76m08J35mK30k3j03p0j26K78l36K07
6477B2j34J2K0J25j10J07k94J43K3r9J05j73qN51M5l42j1K41j42J33j17k20O5
6500e8J54j46L59n50J60J13rK73m46J23j0k77J78J46j91L48k18Q7k1j46K83j26
6522B6J85k10l23M90k09p7l2Pn8K68k35K4R1J01q2j07o0L48j80k0m0J70j11l5
6546f9J57Q7j90J74j63J13l7Q6k24K61l78P6K26j12l00L51k58M11m19J65j01M0
6568a04K5L0k5lQ7Q3p0R3K30m69l6J85K8j05O4k20O3O9O1q4%J83j78k9Q7L1J69
6595A65l11N9N4J88j79N7J71j60k53K35l45N21k55j4j48K09K01l89K56j0j49L16
6617B19l47P8k5n5J04k92K61L31l92n7j52M83l9n1k27R2j5L74l66k26K29m8K59
$$ plain form
6640 138 222 217 -103 -30 -182 -112 -39 -91 -304 -340 132 -46 -64 28 97 -105 332 306 -170 141 333 152 -86 179
6664 179 127 132 332 24 153 -143 -72 85 154 2 -239 49 47 -83 -57 203 175 115 61 -147 13 -64 -37 182
6688 182 -134 43 -126 259 203 -71 -126 -218 38 19 196 131 147 270 -144 -215 115 -45 -65 -140 -197 -74 -145 61
6712 61 79 48 -13 -41 199 -182 -38 -189 -2 -157 80 28 41 226 75 -118 -29 -181 -190 390 -88 -37 156 15
6736 15 307 -60 -174 22 16 217 -164 -39 -35 32 128 -110 -201 266 -62 -16 236 143 133 -388 -128 99 29 -85
6760 -85 124 -126 -67 7 -26 167 -67 -209 12 63 -99 -164 -40 26 -156 63 -56 138 197 -93 281 105 -121
6783 -121 -169 66 -170 -50 -41 38 -87 221 289 74 -70 26 -68 -153 81 -128 186 -240 -35 3 -47 45 -97 -95
6807 -95 -148 116 -65 149 -36 -51 -26 268 -204 -335 109 -34 13 117 95 69 26 180 -76 -189 -14 -75 88
$$ packed form
6640A38Q4nl20P3j52P0P3n2k13l6M72j78j8R2O9k02M37k6m76L11J92j81k38K65
6664A79n2NK00l08J29k96P1J57O9j52k41K88kj30K6K60k8o0n4k08J60p7K7K19
6688A82l16J77j69L85n6k74n5r2K56j9J77o5J6J23m14p1L30j60k0p5n7J23p1K06
6712F1J8l1o1k8K40l81J44j51J87j55K37n2J3J85j51j93Q9j52rN80m78N1J93j41
6736A5K92l67j14J96oK01l81J25MO7R6k38r1M67l28M6K52r3j0n21K60K27p0j14
6760h5K09k50N9P4l3J93k34j42K21N1j62o5J24O6j82K19j19J94N9k90L74j76k26
6783a21m8K35k36J20RP9j25L08O8k15j44R6r4q5K34k09L14m26K05L8n0R2j42K
6807i5n3K64j81K14j85j5K5K94m72j31M44j43M7J04k2k6m3J54k56j13J75o1J63
$$ plain form
6830 88 -39 -44 -130 -162 161 64 -119 9 -121 -125 39 -187 57 60 -18 -175 -32 29 237 -14 87 -128 -187 -34
6854 -34 -319 98 -166 258 86 -395 55 272 73 -14 -72 121 14 -100 48 316 455 -52 22 -133 105
6875 105 -26 -77 18 -268 -207 -196 291 -129 182 -44 9 107 31 109 107 51 186 -81 98 3 233 35 -184 59
6899 59 -51 -71 91 233 -77 -64 -86 134 -64 -249 -58 -279 -20 -174 70 242 27 -167 -61 108 -97
6920 -97 320 103 97 -75 26 119 7 -176 -62 -118 -16 -81 53 -85 -263 81 34 34 461 -82 -111 -16 152 5
6944 5 15 -73 -6 -192 50 -90 3 145 -50 -71 148 -42 291 239 18 -266 100 258 -166 -233 -109 147 -69
6967 -69 -195 209 89 -66 -311 93 215 237 -193 -140 19 57 -5 50 269 -11 13 138 -229 50 26 -200 -51
6990 -51 -174 185 -110 155 -245 -246 -12 -60 14 -18 -56 90 -43 38 86 18 27 327 120 -186 64 -4 41 13 -191
$$ packed form
6830H8j27nq6l2L23r7j83J28j30mJ64k26K44Lp8j57J43O1K08k51J01k15n9J53
6854c4k85M17k64M24j72m81M50K17j99q7n8J93j07j14J48K68J39n07P4j55K38
6875A05j31n1R5k86O1J1M87m20L11k26N3R8p6P8kn6J35k67J79r5K30j98k19K43
6899E9j10k0J62J42l10J3k2K20j98j85J91k21K59j54K44J72k15j94J06J69k05
6920i7M17k17oj72J01R3j12j83J14n6J02o5J34j38j78L44m7%M27n43k9R5J68j47
6944EJ0q8O7j86K42j40R3J42j95k1K19j90L33n2k21k84L66J58m24o7J24K56k16
6967f9j26M04j20j55k45M04J22K2m30N3J59L8o2N5K19k80K4J25l67K79k4k26J49
6990e1j23L59k95K65m00jK34m8P4l2l8J46j33Q1M8o8RL00k07l06K50o8M5k8k04
$$ plain form
7015 -191 -138 145 -59 -58 103 -52 14 50 -91 67 -8 -161 11 86 -77 -95 119 15 -141 81 -33 237 123
7038 123 128 41 -12 -514 -109 -6 54 34 218 18 -76 -100 413 7 -14 -103 133 86 -14 -85 36 52 125 179 -342
7063 -342 -34 -3 184 -34 249 49 272 193 150 55 29 -123 168 131 -272 -3 31 42 -162 -143 161 -33 137
7086 137 -106 -187 -102 2 -2 -63 86 90 -34 -138 -207 123 -224 103 221 104 -6 106 47 -273 -10 134 -64
7109 -64 -136 314 -138 -31 132 158 -26 112 -98 -188 107 250 -124 32 36 -30 -93 -72 -69 41 73 -30 88 146
7133 146 -40 -244 -173 160 -212 -41 -67 122 199 406 -427 -173 89 -6 -67 -99 23 45 28 -51 -37 4 -25 183
7157 183 -83 -6 -81 43 71 184 -9 -29 5 -119 -26 45 -20 -192 109 -134 66 -314 125 12 30 -178 10
7180 10 -59 -261 324 78 -2 177 -120 -329 -159 284 -78 115 -116 199 2 -272 104 -9 294 -111 131
$$ packed form
7015a91N3K83k04JJ61j55O6L6j41J58p5j53J72P5j63j8K14j04j56K22j14K70j14
7038A23Nq7n3n02M05J03O0k0J84k00r4k4N13m06k1q9K36m7j00p1J21J6P3N4n21
7063c42L08L1J87k18K83k00K23p9m3r5k6j52K91l7m03K69L4J1k04J9L04j94J70
7086A37k43q1Q5J04mo1J49Mj24j04o9L30l47L27J18j17j10J12n9l20K63J44j98
7109f4p2M50m52J07J63K6j84J38k10r0K95J43l74J56Mo6o3K1LJ10L2j03J18N8
7133A46j86k04P1L33l72J71k6J89P7K07q33K54K62r5o1l2J22K2j7p9J4M1k9K08
7157A83k66P7p5J24K8J13j93k0L4j24R3P1o5j72L01k43K00l80M39j13J8k08J88
7180A0o9k02N85k46q0J79k97k09J70M43l62J93k31L15j97k74L76j13L03m05K42
$$ plain form
7201 131 -159 18 -220 115 133 -343 252 -57 42 -153 -110 -45 -289 112 43 84 -21 78 159 350 -13 -121 -124
7224 -124 -93 51 25 -95 128 97 -10 -35 -112 94 -190 -32 52 -25 76 -241 15 -114 27 50 -270 104 376
7247 376 -39 -121 -172 64 -39 -96 24 -32 -35 139 5 106 9 106 82 -47 29 -179 -32 173 -79 -83 -188 -56
7271 -56 91 -22 112 -85 222 -39 13 29 -47 145 22 -277 102 46 -103 53 -54 140 -21 -32 -64 3 140
7294 140 -18 132 68 222 1 82 80 28 -1 111 63 44 62 148 134 -271 178 -166 31 12 -64 180 -168 270
7318 270 -36 -149 -65 -164 -10 -262 16 20 228 35 -121 -257 -178 151 -80 -195 -66 -84 -288 -75 221 125
7340 125 74 38 -155 -46 -331 -43 -16 -25 -100 -103 59 -40 -172 -132 -57 139 55 59 73 139 138 -107 22 -116 18 42
7366 42 65 125 254 147 32 69 57 -72 174 -103 -15 35 117 177 -47 -154 42 -152 38 -64 -54 -44 233 119
$$ packed form
7201A31k90J77k38L35J8m76N95l09R9j95M3O5k44M01o9M1j05R9Q1J91l63j08l
7224a24L1J44k6j20K23l1j07k5p7K06k84J58Q4p7J01l17K56j29J41K3l20L74K72
7247C76m15q2n1K36j03n7J20n6lJ74j34J01r7R7k4j29P6k08J47K05k52mj05J32
7271e6J47j13J34j97L07k61N2J6p6J92j23k99L79n6j49J56j07J94j61j1l2O7J37
7294A40j58J50o4J54k21Q1kn2k9J12m8j9J8Q6j4m05M49l44J97j9p6K44l48M38
7318B70l06j13Q4r9J54k52K78MK08j93j56j36P9L29k31j15J29j8k04K13K96r6
7340A25n1l6j93J09k85K88K7rp5lJ62r9j32M0P5J96q4MJ4O6jk45J29j38J34K4
7366D2K3O0J29j07j15L7j2j29K46k77Q8N0Q2O0k24j07J96j94J90j02J0J0K77j14
$$ plain form
7390 119 14 -94 134 -48 57 296 -101 55 93 -280 -8 25 117 16 46 237 51 26 -174 -122 -184 127
7412 127 -211 -62 396 85 111 134 158 109 93 -78 -36 190 24 36 -27 -120 7 288 35 -58 -176 40 49 2
7436 2 -217 163 208 312 -113 -341 118 128 -204 -392 -29 -83 -93 180 -32 -32 -158 -128 -1 1 108 22 110 -40
7460 -40 38 193 216 -78 -225 236 -69 34 151 -76 -225 -37 129 26 -133 -122 46 -285 273 60 -1 -81
7482 -81 58 -5 113 146 -183 64 35 21 174 170 -34 -76 33 179 312 5 -166 163 -61 47 -113 -30 -54
7505 -54 -27 131 91 121 -253 -100 -107 -23 -164 -40 28 201 -26 -245 121 144 -258 -93 -200 177 -32 -175 80
7528 80 -243 -25 104 -148 -9 -238 46 322 -23 25 116 11 -21 161 -125 -4 379 -20 -147 -21 -37 -27
7550 -27 55 -32 -244 -227 -43 97 -133 144 224 82 251 -159 -44 224 -65 118 139 39 51 108 -149 132 81
$$ packed form
7390A19j05j08K28j82J05K39l97J56L8l73K72L3R2j01L0J91j86k5k00N2o2L11
7412A27l38J49M58l11K6K3K4m9j6j71M2K26j66J2o3r3J27K81k53r3j18K16Rm7
7436Bk19L80M5J04m25k28M59J0l32j88L63n4j0K73k12%j26L0J27KJ07q6Q8j50
7460d0P8J55K3k94j47M61l05J03J17k27j49J88J66j03j59J1J68l31N58k13o1q0
7482h1J39o3J18L3l29K47k9j4J53mk04m2J09J46J33l07j71L29k24J08j60Q3k4
7505e4K7J58m0L0l74J53pQ4j41J24O8J73k27k19L66K3m02J65j07L77k09j43K55
7528H0l23K18J29k52J39k29K84K76l45M8R1j05l2J82k86J21L83l99j27J26j6J0
7550b7Q2q7k12J7J84J40k30K77Q0j42J69m10J15K68k89J83K1j00J2N7k57K81n1
$$ plain form
7573 81 -133 222 -25 -5 -289 94 266 -122 217 328 124 97 74 96 215 -34 -108 166 259 -187 91 251
7595 251 7 140 52 126 -21 -15 -77 -79 -88 100 -93 -166 -129 37 44 -78 -27 -39 -9 -126 -194 76 100 249 21 151
7621 151 157 86 232 9 291 -55 -332 -193 2 151 -176 -31 292 27 163 37 11 39 -87 41 -130 65
7643 65 208 -160 -76 -140 -42 98 97 11 110 96 40 195 -47 -182 40 103 -37 -171 -237 -114 -7 265 -117 37
7667 37 -74 -68 -160 -96 -311 74 -243 -147 57 -272 -104 -215 -36 87 252 215 -226 -96 -10 -143 74 -296 -14
7690 -14 105 -298 -88 35 -5 -70 139 18 9 -126 92 271 -160 -22 126 -20 147 93 -65 -177 -97 138
7712 138 -57 -78 -65 202 -58 93 -95 -53 -215 87 32 -135 -101 6 -215 142 -111 -77 -96 13 -199 -57
7734 -57 -152 -12 96 -283 -32 0 -144 -97 -45 232 14 -64 -108 -30 77 48 16 344 311 7 76 -81 -56 70
$$ packed form
7573H1k14L55k47K0k84L83J72l88L39J11k04k7k3K2J19k49p4K74R3m46K78J60
7595B51k44J33q8P4j47Oo2krJ88j93p3L7J66Pj22N1j2L0j17o8K70K4J49k28J30
7621A51Op1J46k23K82l46k77J39J95J49l27J45L23k65J36j26k6K8j26J28j71J95
7643F5J43l68Q4o4R8J40jq6R9j4n6J55k42j35K22O3j40j34o6J23J07K72l82J54
7667C7j11Or2O4k15L85l17R6K04l29J68j11J79J23J65l7m41J30Q6j33K17l70K82
7690a4J19m03K10J23m0o5K09j21rj35K18J79m31J38J48j46J67n4j58j12Q0K35
7712A38j95k1J3K67k60J51j88M2j62L02n5j67L4J07k21L57k53L4j9J09k12J42
7734e7r5J40J08l79K51L2j44M7N2K77k18p8m4P8J07k9l2L28l3l04O9j57K5J26
$$ plain form
7758 70 35 -136 -55 283 279 11 -91 237 -10 -187 120 107 -118 -283 142 -150 -125 15 140 -131 -92 329 138
7781 138 31 218 -371 -23 162 68 248 207 -69 141 -59 -62 -18 -262 103 125 -149 -41 -150 -28 -116 196
7803 196 -132 -160 -11 234 -81 -176 -12 -86 -289 -75 114 -65 179 -30 61 236 27 12 -435 48 98 -232
7825 -232 121 -63 398 91 -5 62 1 -83 95 -183 -269 -176 8 162 -9 -151 -160 -40 140 -14 -83 91 9
7848 9 -5 79 -93 -116 -51 -202 -89 273 -43 162 381 69 146 -209 147 -218 -76 -146 -22 245 65 -138 14
7871 14 -126 132 205 -206 26 29 70 439 99 106 -18 -9 -32 -26 -204 -143 32 -136 13 127 -142 -102 -21 -167 -20
7896 -20 -198 -24 -97 36 -52 -512 162 -7 43 196 -88 160 -286 34 197 26 1 -216 -52 -48 41 130 24
7919 24 -14 -127 140 138 -242 75 31 -8 71 23 60 27 -50 118 -7 6 -97 117 -132 54 20 -118 -234 -123
$$ packed form
7758G0l5j71Q1L38mk68j02L28k47j77L07j3k25j65M25k92K5J40J25k71L9M21j91
7781A38j07J87n89L48J85r4J80m1k76K10k00lM4k44L65K2k74J08j09J22q8L12
7803A96l28k8J49K45l15r5J64p4k03K14J89j79K44k09R1J75k09j5m47M83N0l30
7825b32L53j84M61l07r6O7o1q4J78k78q6R3J84J54j71j42rJ20J80j54o9J74q2
7848Ij4Q4j72k3O5j51J13L62l16K05K19l12P7l55L56l65J42p0J24K67j80k03J52
7871A4j40K58P3m11K32LM1L69l40Pj24Rk3Oj78O1J75j68J49J14k69M0Q1j46J47
7896b0j78J74p3J33q8m60O74j69N0J53k84K48m46L20J63j71k5k17J64MQ9Q9j06
7919B4l8j13K67kl80L17m4l9P9m8L7l3p7J68j25J3j03K14k49J86l4j38j16J11
$$ plain form
7943 -123 87 57 -184 -305 158 106 77 -11 101 -146 -113 205 -80 191 199 44 -80 107 471 52 101 11 -37
7966 -37 -72 94 -149 126 -37 -130 -92 153 -17 -195 23 80 -60 181 -26 -46 -28 -210 -130 124 124 -130 -14
7989 -14 151 -4 -276 305 -100 -81 145 -259 202 -158 151 -260 -125 -18 -63 50 144 7 -59 -207 -184 153
8011 153 -158 -6 42 30 86 154 -126 -226 258 87 -157 386 -53 -120 79 -73 -232 244 -130 -167 -135 -246
8033 -246 -277 36 -96 -27 13 59 -132 -10 67 -72 23 27 105 -168 38 170 -110 84 10 -10 -119 -133 -109 135
8057 135 234 8 49 91 280 158 -165 39 -143 145 -43 208 146 -124 -188 -60 -351 -28 -131 107 141 74
8079 74 263 103 116 161 -112 247 113 115 6 135 93 214 -88 122 23 -210 -139 -141 48 -139 249 22 236
8102 236 64 -61 -334 109 -59 55 50 194 -51 61 -182 -35 19 -81 156 0 56 -224 -135 118 320 -122
$$ packed form
7943a23K10l0k41j21M63n2k9q8J12k47L3L18k85K71Qj55j24J87L64m19M9r0m8
7966c7l5J66k43K75j63r3L8K45j70j78K18N7j40K41k07k0J8j82Q0K54%k54J16
7989a4J65j55k72N81m05J9K26m04M61l60L09m11J35J07m5J13R4j37o6j48K3L37
8011A53l11J52M8j2N6O8k80j00M84j71k44N43m39o7J99j52j59M76l74l7L2j11
8033b46l1L13j32O9M0M6j91J22P7j39R5MP8k73K06J32k80J94p4k0j09j4K4K44
8057A35R9k26M1M2J89j22l23K04j82K88j88K51o2k70o4J28k91L23j03K38L4o7
8079G4J89j60J3M5k73L59j34Kj09J29m2J21l02K10r9k33P1kJ89j87L88k27K14
8102B36j72j25k73M43j68J14nJ44k45J12k43J47N4j00K37j56N6k80Q9K53K02m42
$$ plain form
8124 -122 26 -25 234 -152 -67 268 62 151 83 -75 -120 -155 -177 -178 -156 -43 -214 193 20 111 86 94 -100 -4 188
8149 188 62 34 17 -74 -185 71 209 41 -203 -19 -443 -4 -9 156 55 124 -217 134 -44 -149 -162 -67 -214
8172 -214 -21 -23 148 124 -66 -119 -90 -293 -56 73 129 -113 77 -73 -83 -386 40 215 101
$$ packed form
8124a22J48n1K59l86Q5L35k06Q9o8j58m5l5k2jK2J13j71M07j73R1k5Qj94R6J92
8149A88j26k8j7r1j11K56J38j68k44J84m24M39nJ65j01O9l41L51j78j05j3R5j47
8172b14J93kJ71k4j90n3K9k03K37J29N6k42J90j50j0l03M26J75j14
8191A01
$$ Imaginary data points
##PAGE= N=2
##DATA TABLE= (X++(I..I)), XYDATA
$$ plain form
0 0 0 0 0 0 0 0 0 0 0 0 8 -8 8 -8 16 -16 22 -24 32 -40 48 -56 64 -72 88 -104 120 -136 159 -183 208 -238
32 -238 269 -304 343 -387 435 -487 545 -608 675 -751 834 -922 1020 -1127 1244 -1372 1511
49 1511 -1665 1835 -2021 2228 -2458 2714 -3007 3338 -3717 4158 -4680 5306 -6073 7039 -8301
64 -8301 10024 -12531 16529 -23943 42411 -193053 -236128 -13589 -210115 -113326 86066 104821
76 104821 72695 184828 165612 111486 112784 78497 -15529 -23478 -61388 -117094 -94980 -76334
88 -76334 -124508 -61664 22130 -4703 1388 88604 82818 55553 81049 55146 3582 21004 -3459
101 -3459 -72205 -56674 -23471 -68067 -64906 -355 -95 -7201 46491 51290 20909 48488 53345
114 53345 3485 -2423 2658 -32336 -35539 -21416 -44798 -37093 4518 -4929 -16692 27698 41245
$$ packed form
0@%%%%%%%%%%Qj6J6j6K4l2L8m6N6p2Q8j04J20j36J60j92K24k56K95l42L91m46
32b38N07n73O47p30Q22r22J032j153J283j426J585j756J942k147K371k616K883
49A511l176L500l856M249m686N172n721O345p055P875q838R986j1379J3112j5340
64h301J8325k2555K9060m0472O6354k35464m3075K22539j96526R6789J99392J8755
76A04821l2126J12133j9216n4126J298l4287r4026p949l7910n5706K2114J8646
88g6334m8174O2844Q3794k6833O091Q7216n786k7265K5496k5903n1564J7422k4463
101c459o8746J5531L3203m4596L161O4551K60p106N3692M799l0381K7579M857
114E3345m9860n908N081l4994l203J4123k3382P705M1611r447j1763M4390J3547
$$ plain form
127 41245 9902 21212 41650 13897 620 10801 -9275 -25442 -14219 -22643 -31366 -13619
139 -13619 -10549 -14132 7350 16156 4301 18282 31757 11259 4519 17979 5816 -13305 -6683
152 -6683 -7094 -18830 -12552 -7056 -12495 -3081 6203 -540 4348 15550 6216 2835 12502 4689 -6435
167 -6435 1729 1677 -10861 -8410 -717 -6120 -6383 1166 206 987 7403 3935 652 7878 4930 -4261
183 -4261 -404 2212 -6267 -6134 18 -3743 -5157 1919 2414 -571 2933 4421 1740 2488 2413 -833
199 -833 185 1006 -4067 -3891 288 -2163 -4543 -370 951 -983 866 2983 1999 2269 3277 1376
215 1376 723 1418 -1174 -1661 -433 -2385 -3341 -129 -403 -2772 136 2710 152 40 2123 1840 599
232 599 738 67 -766 -54 -206 -1453 -781 -114 -1144 -251 714 -357 -297 1139 816 -403 433 904 98
$$ packed form
127D1245l1343J1310K0438k7753j3277J0181k0076j6167J1223q424q723J7747
139a3619L070l583K1482Q806j1855J3981J3475k0498o740J3460j2163j9121O622
152f683m11j1736O278N496n439R414R284o743M888J1202r334l381R667p813j1124
167f435Q164n2j2538K451P693n403k63P549r60P81O416l468l283P226k948r191
183d261L857K616q479J33O152l761j414P076M95k985L504J488k681P48p5l246
199h33J018Q21n073J76M179k451k380M173J321j934J849K117r84K70J008j901
215A376o53O95k592m87J228j952r56L212k74k369K908K574k558j12K083k83j241
232E99J39o71q33P12j52j247O72O67j030Q93R65j071O0J436l23j219Q36M71q06
$$ plain form
251 98 -285 -471 -415 -323 -262 -635 -213 152 -41 -217 876 553 76 471 140 -190 -524 -19 -387 -297 -236 81
273 81 -23 -162 -42 112 775 -72 -16 874 752 -79 -453 205 383 -558 -535 -190 -199 -26 -122 265 243 148 90
296 90 691 125 -5 136 368 -202 -500 68 39 -448 28 86 24 -14 -267 309 91 -12 -87 180 85 -232 71
319 71 -40 -18 187 -101 -145 -136 -16 176 262 -189 -367 330 78 313 -524 187 145 -70 -135 116 193 -286 -19
342 -19 -80 -68 -251 -224 83 189 -80 -159 20 67 30 -31 -52 -21 -254 123 124 106 -205 62 288 -52 -24 -89 157
367 157 -136 5 -91 -183 -188 -61 4 -94 -274 134 33 -294 285 241 98 102 160 172 152 81 -164 -273 -291 83 83 -8
393 -8 210 -98 -339 -154 70 71 27 -91 -408 157 -61 -77 -184 -267 50 202 -103 302 -35 -120 -86 -2 -210 222
417 222 -74 -251 2 107 6 -108 -6 -41 111 185 1 59 -32 58 307 103 -148 34 -170 -34 -165 -162 40
$$ packed form
251I8l83j86N6R2O1l73M22L65j93j76J093l23m77L95l31l30l34N05l68R0O1L17
273H1j04j39J20J54O63q47N6Q90j22q31l74O58J78r41K3L45rJ73r6L87k2r5n8
296I0O01n66j30J41K32n70k98N68k9m87M76N8o2l8k53N76k18j03p5K67r5l17L03
319G1j11K2K05k88m4RJ20J92Q6m51j78O97k52K35q37P11m2k15o5K51P7m79K67
342a9o1J2j83K7L07J06k69p9J79M7l7o1k1L1k33L77Jj8l11K67K26l40K8o5K46
367A57k93J41r6r2nJ27O5r8j80M08j01l27N79m4j43MN8J2k0p1k45j09j8L74%r1
393hK18l08k41J85K24Jm4j18l17N65k18j6j07q3L17J52l05M05l37q5L4Q4k08M32
417B22k96j77K53J05j01j14J02l5J52P4j84N8r1R0K49k04k51J82k04J36j31LK02
$$ plain form
440 40 109 -323 -309 250 112 -128 -12 52 -110 -242 242 98 34 89 238 -16 -483 203 9 218 22 -247
462 -247 96 2 305 -124 -235 126 79 -2 -126 -105 -154 14 196 -284 -25 7 -57 -14 41 -77 46 -173 158
485 158 137 37 -309 -8 -71 -54 -286 64 107 1 -413 233 35 -359 204 83 -112 99 22 205 -31 47
507 47 -59 -56 35 244 -221 -96 8 -11 -7 117 39 -195 -336 -81 -53 53 127 -40 6 -293 -31 -12 -126 -14
531 -14 13 162 8 -59 -51 -10 63 -2 -83 -135 200 121 292 -3 137 -96 -334 -360 -62 -3 337 -217 -319 13 -10
556 -10 11 -69 86 -281 -151 255 -82 -93 -308 97 30 -125 160 -94 -78 102 3 -190 -88 89 -69 33 -246
579 -246 57 12 86 1 -98 -89 7 54 3 -13 -32 58 130 -97 -218 96 -167 41 15 -16 217 121 -23 -153 130 48
605 48 173 78 16 68 173 155 -94 204 76 -102 -185 228 230 13 -168 -224 288 -8 13 -46 263 -59 -104 17
$$ packed form
440D0O9m32J4N59j38k40J16O4j62j32M84j44o4N5J49k54m67O86j94K09j96k69
462b47L43r4L03m29j11L61m7q1j24K1m9J68J82m80K59L2o4M3N5j18J23k19L31
485A58k1j00l46L01o3J7k32L50M3j06m14O46j98l94N63j21j95K11p7J83k36P8
507D7j06LR1K09m65J25J04j9MJ24p8k34j41K55K8J06P4j67M6k99K62J9j14J12
531a4K7J49j54o7QM1P3o5q1n2L35p9J71k95J40k33k38k6K98N9L40n54j02L32k3
556a0K1q0J55l67J30M06l37j1k15M05o7j55K85k54J6J80r9j93J02J77j58J02k79
579b46L03m5P4q5r9RR6M7n1j6j9R0P2k27j21L14k63K08k6l1K33r6j44j30K83q2
605D8J25r5o2N2J05j8k49K98j28j78q3M13Kk17j81n6N12k96K1n9L09l22m5J21
$$ plain form
629 17 17 -64 -186 -161 1 246 -11 -63 143 -18 278 33 -277 -139 -42 -27 -424 113 -169 106 -34 123 13
652 13 64 -124 -74 133 143 -114 -19 -86 13 -10 -101 -211 -8 -129 -78 101 -84 110 -182 23 9 163 -184 -108
676 -108 -256 -139 -89 -123 47 -69 -181 -30 -148 149 48 50 -182 -77 224 -49 -256 94 73 -111 333 185
698 185 201 -69 -105 -130 14 -138 -94 142 284 93 124 -34 76 92 97 151 34 -236 -30 23 48 87 59 41 200
723 200 180 -212 52 -216 -102 62 -155 37 -82 -34 -10 -197 238 -364 32 -218 63 134 17 19 64 -201 138
746 138 149 103 -136 178 86 316 241 -7 103 -11 -33 3 331 -131 -232 -139 -79 -229 -12 -238 159 -123 150
769 150 203 49 4 -144 113 -68 85 -162 -57 188 -132 -225 -151 210 -33 -1 -56 -56 3 68 -71 55 297 81
793 81 -64 -177 -45 98 -249 55 -218 -2 -122 -193 54 16 25 -11 -159 265 -117 -2 78 -129 12 -129 139
$$ packed form
629A7%q1j22K5J62K45k57n2K06j61K96k45l10J38R7J5l97N37k82K75j40J57j10
652A3N1j88N0K07J0k57R5o7R9k3r1j10K03j21N1J79j85J94k92K05j4J54l47P6
676a08j48J17N0l4J70j16j12J51j18K97j01Kk32J05L01k73k07L50k1j84M44j48
698A85J6k70l6k5J44j52M4K36J42j91L1j58J10J6NN4j17k70K06N3K5L9k8j8J59
723B00k0l92K64k68J14J64k17J92j19M8K4j87M35o02L96k50K81P1j17KM5k65L39
746A38J1m6k39L14r2K30p5k48J10j14k2L6L28m62j01R3O0j50K17k26L97k82K73
769A50N3j54m5j48K57j81J53k47J05K45l20r3P4L61k43L2n5%N9O5j39J26K42k16
793H1j45j13J32J43l47L04k73K16j20p1K47l8Rl6j48M24l82J15Q0k07J41j41K68
$$ plain form
816 139 142 83 6 153 296 129 252 -166 135 58 -175 -44 127 186 17 19 -75 50 107 -137 -31 -76 -188 383
840 383 104 -26 -223 75 267 77 46 90 92 -308 -54 27 13 148 -193 257 -39 -11 -182 -238 -193 -67 -11 82
864 82 4 287 -187 157 -239 91 29 -107 14 108 349 46 151 19 -95 -53 37 -210 -28 14 -38 175 233
887 233 -154 190 27 43 7 -96 -272 6 -194 -196 18 -65 302 -100 17 230 87 214 109 -52 275 -64
909 -64 -224 32 -132 -245 -44 -135 195 -72 128 -22 120 -89 150 177 101 156 13 -45 20 -390 143 366 53
932 53 127 320 353 -97 42 25 88 -24 60 -43 44 142 116 -157 15 -47 -138 -60 -39 -15 -49 101 -141 -168 37 -56
958 -56 -425 104 135 176 67 -28 -79 345 -40 -204 73 -211 -14 -30 -107 -56 -90 116 -71 58 55 100 145 -202 -336
983 -336 -72 11 -122 -39 25 -209 -72 -119 -17 -25 -1 49 7 -76 -284 11 153 112 44 -30 -43 -138 -255 150 -172
$$ packed form
816A39Ln9p7J47J43j67J23m18L01p7k33J31J71N9j69Kr4J25N7k44J06m5j12N71
840C83k79j30j97K98J92j90l1M4Km00K54Q1j4J35l41M50k96K8j71n6M5J26N6R3
864H2p8K83m74L44l96L30o2j36J21R4K41l03J05j32j14M2R0k47J82M2n2K13N8
887B33l87L44j63J6l6j03j76K78k00kK14q3L67m02J17K13j43J27j05j61L27l39
909f4j60K56j64j13K01r1L30k67K00j50J42k09K39K7p6N5j43n8O5m10N33K23l13
932E3P4J93L3m50J39j7O3j12Q4j03Q7R8k6k73J72o2r1P8K1K4l4J50k42k7K05r3
958e6l69N29L1M1j09r5n1M24l85j64K77k84J97j6p7N1l4K06j87J29lM5M5l47j34
983c36K64Q3j33Q3O4k34J37m7J02qK4N0m2q3k08K95J42m1o8p4j3r5j17M05l22
$$ plain form
1008 -172 71 -91 458 260 -37 220 72 -22 25 -50 -10 141 223 116 27 -89 -63 -205 -87 172 168 136 -217
1031 -217 22 221 169 27 93 -170 251 -173 152 195 58 275 36 34 -223 1 -39 19 246 225 7 7 52 61
1055 61 -55 11 -126 -197 -131 -123 146 69 -172 -127 214 11 75 -212 133 -166 104 -44 60 88 -71 198 -136
1078 -136 33 69 114 45 -32 -36 188 29 -63 -137 -18 -3 98 107 138 72 -2 -54 38 185 -85 -13 216 88 142 -266
1104 -266 11 22 15 -89 72 200 162 146 -53 87 -169 14 -283 13 -27 -160 -51 146 89 -339 -105 319
1126 319 -38 -206 175 119 246 98 -145 144 -195 -13 36 175 104 38 -275 -281 142 -319 -205 175 99 -6
1148 -6 -319 -19 87 -7 79 -146 14 -87 -56 -197 91 4 -304 -17 16 -22 113 157 -7 227 53 -26 144
1171 144 -177 -3 -129 46 124 -164 121 313 -13 25 -4 -238 171 -38 -85 2 226 -201 56 -238 257 152
$$ packed form
1008a72K43j62N49j98k97K57j48r4M7p5M0J51Q2j07q9j16K6j42J18K59ml2l53
1031b17K39J99n2j42O6k63M21m24L25M3j37K17k39kk57K24m0N8K27k1k18%M5R
1055F1j16O6j37p1O6QK69p7k41M5L41k03O4k87L45k99K70j48J04K8j59K69l34
1078a36J69L6M5o9p7mK24j59r2p4J19J5J01RL1o6p4n2R2J47k70P2K29j28N4m08
1104b66K77J1pj04J61J28l8j6j99J40k56J83k97K96m0j33J09J97n7m28K34M24
1126C19l57j68L81n6J27j48k43K89l39J82M9J39p1o6l13oM23m61J14L80p6j05
1148fl13L00J06r4Q6k25J60j01L1j41K88q7l08K87L3l8J35M4j64K34j74p9J70
1171A44l21J74j26J75P8k88K85J92l26L8k9k34M09k09m7Q7K24m27K57k94M95j05
$$ plain form
1193 152 -63 65 -209 -229 -139 72 -158 -99 -222 -111 -120 -62 -244 91 -124 299 -96 112 -106 47 149 126
1215 126 102 74 -150 31 77 0 -93 178 -139 56 -130 -176 -39 -51 263 25 -94 211 165 71 -135 236 119
1238 119 128 181 -162 -479 -136 -208 -74 115 -110 -145 -9 212 -132 -17 59 -21 -178 -194 156 301 -406 -49 -15
1261 -15 -33 -116 49 -264 -118 -162 -23 60 207 134 -17 24 -131 -30 -11 147 -303 25 47 123 34 -46 -195 188
1285 188 20 177 44 72 162 -75 -26 197 -149 73 -158 -102 -74 237 68 37 205 -55 -52 194 -64 -69 -58 51
1309 51 252 21 -39 -79 45 -128 190 145 197 -74 88 132 29 -36 -82 169 11 -27 42 -33 172 -148 -32 11
1333 11 129 100 60 81 -157 133 -67 -219 -155 -11 -399 181 125 -69 86 127 102 -21 -69 56 -28 66 94 -106
1357 -106 -248 -26 144 152 -71 17 14 -225 -208 152 13 64 45 -43 191 167 33 123 235 56 101 -29 149 54
$$ packed form
1193A52k15J28k74k0R0K11k30N9j23J11rN8j82L35k15M23l95K08k18J53J02k3
1215A26k4k8k24J81M6p7r3K71l17J95j86m6J37j2L14k38j19L05m6r4k06L71j17
1238A19RN3l43l17L43p2J34J89k25l5J36K21l44J15P6q0j57j6L50J45p07L57L4
1261a5j8q3J65l13J46m4J39Q3J47p3j51M1j55J01J9J58m50L28K2P6q9q0j49L83
1285A88j68J57j33K8R0k37M9K23l46K22k31N6K8L11j69l1J68k60LK46k58nJ1J09
1309E1K01k31o0m0J24j73L18m5N2k71J62M4j03o5m6K51j58l8O9p5K05l20J16M3
1333A1J18k9m0K1k38K90k00j52O4J44l88N80n6j94J55M1k5j23m8J25q4R4K8k00
1357a06j42K22J70Qk23Q8lk39J7L60j39N1j9q8K34k4j34R0J12j79M5j30J78r5
$$ plain form
1381 54 -24 19 -38 -234 19 -16 -144 49 -128 -46 111 86 -331 52 71 -221 286 80 -251 94 -1 8 4 217
1405 217 15 186 -13 -160 122 72 -82 -59 -27 198 12 -198 381 62 85 137 -156 -86 89 -84 -45 134
1427 134 5 272 -127 6 107 -87 -114 54 -201 -29 84 186 8 -166 182 -7 143 -93 -25 177 -62
1448 -62 -42 -105 -158 73 -450 -59 113 -158 -53 -20 -169 -8 -86 -106 42 -285 -222 126 3 155 67 -21 -55 -137
1472 -137 137 -344 156 212 228 30 54 -120 -19 -119 333 -13 144 22 287 -55 -140 312 -313 105 299
1493 299 -64 -3 -1 -24 -42 12 79 -237 222 -194 24 -164 9 -222 -73 -45 48 70 159 55 151 44 49 -28 35
1518 35 179 215 119 -72 166 -127 -49 134 65 -186 -38 251 -14 3 15 -53 -125 -18 65 -203 -49 127 -30
1541 -30 107 34 -1 -28 -26 -76 -111 -138 -78 -135 -264 92 144 58 208 78 -54 293 -128 -325 -36 -230 -133 -58 -46
$$ packed form
1381E4p8M3n7j96K53l5j28J93j77Q2J57k5m17L83J9k92N07k06l31L45r5RmK13
1405B17k02J71j99j47K82n0j54K3L2K25j86k10N79l19K3N2k93P0J75j73L9J79
1427A34j29K67l99J33J01j94k7J68k55J72J13J02j78j74L48j89J50k36O8K02k39
1448f2K0o3n3K31n23L91J72k71J05L3j49J61p8k0J48l27O3L48j23J52q8q8l4q2
1472a37K74m81N00N6J6j98K4j74J01j00M52l46J57j22K65l42q5M52o25M18J94
1493B99l63O1Kk3j8N4O7l16M59m16K18j88J73k31J49K8R3K2Q9j04R6j07Np7O3
1518C5J44L6r6j91K38k93P8J83o9k51J48K89k65J7J2o8p2J07Q3k68J54J76j57
1541c0J37p3l5k7Kn0l5k7O0n7j29L56N2q6J50j30j32L47m21j97K89j94R7P5J2
$$ plain form
1566 -46 195 47 152 233 89 67 152 -497 123 -176 -185 -28 -272 73 -67 130 355 28 -40 -3 -135 -218 -46
1589 -46 37 226 -263 191 256 -398 197 52 -144 -9 -59 158 -276 -132 -81 42 63 251 4 126 -72 59
1611 59 109 133 -121 -85 -133 -211 98 104 -17 -64 124 14 6 -135 -411 -68 307 -83 109 139 128 -120 96 185 -60
1636 -60 -93 152 8 -131 -43 187 -70 -4 -49 191 -284 70 -96 -104 -64 112 -22 -23 -165 -203 -85 293 55 165
1660 165 20 -63 246 -74 -138 -72 177 -97 127 73 -6 -166 -19 -51 17 77 -26 -337 -2 -36 -108 -98 176 101
1684 101 161 -16 138 57 -58 -6 35 44 57 -49 -287 -216 74 90 130 -29 61 109 -44 48 -60 71 250 -74
1708 -74 23 132 190 -1 71 -54 -82 -23 169 56 26 -125 6 25 70 -38 194 -130 -107 54 -112 134 134 32
1732 32 68 -51 57 -85 -91 -169 105 -229 63 -23 130 127 -45 49 -300 -117 257 -7 -59 -70 -6 173 -292 -78
$$ packed form
1566d6K41j48J05Q1j44k2Q5o49O20k99rJ57k44L45j40J97K25l27o8L7j32q3J72
1589d6Q3J89m89M54O5o54N95j45j96J35n0K17m34J44N1J23K1J88k47J22j98J31
1611E9N0K4k54L6m8p8L09Oj21m7J88j10qj41k76L43L75l90J92L0j1k48K16Q9k45
1636f0l3K45j44j39Q8K30k57O6m5K40m75L54j66qM0J76j34jj42l8J18L78k38J10
1660A65j45q3L09l20o4O6K49k74K24n4p9j60J47l2O8O0j03l11L35l4p2J0K74p5
1684A01O0j77J54q1j15N2M1RJ3j06k38P1K90J6M0j59R0M8j53R2j08J31J79l24
1708g4R7J09N8j91P2j25k8N9J92j13l0j51J31J9M5j08K32l24K3J61j66K46%j02
1732C2L6j19J08j42op8K74l34K92q6J53lj72R4l49J83L74k64n2j1O4J79m65K14
$$ plain form
1756 -78 62 -29 45 204 166 -117 170 308 -39 187 69 -21 198 -97 85 17 -101 121 -75 -48 -155 -7
1778 -7 -234 8 101 -129 276 112 114 106 -35 218 -28 290 -113 251 33 -75 -149 177 -167 -59 187 -22 -156
1801 -156 44 -32 -26 64 45 109 -79 168 -183 -110 -113 211 -104 -251 -144 124 -224 47 30 225 180 83 61 -107
1825 -107 44 66 -79 -37 -383 106 100 -230 -303 344 -8 480 -128 42 -122 -174 211 224 -105 55 232 93
1847 93 232 -88 202 24 52 9 107 240 -154 128 102 2 68 -118 13 279 -48 -146 114 70 32 -163 -92
1870 -92 101 -57 -23 -136 -387 51 -34 212 -5 55 -58 35 71 4 -254 39 95 -103 130 -50 -94 -71 307
1893 307 48 -24 244 126 -129 -69 -73 -18 27 -192 -92 7 -40 163 -12 227 181 7 308 -3 272 -36 -264
1916 -264 140 132 -14 49 22 175 -145 -74 82 79 -36 253 -16 -65 -15 41 -23 -86 -44 16 -142 -10 -48 41 -192
$$ packed form
1756g8J40r1P4J59l8k83K87J38l47K26j18r0K19k95J82o8j18K22j96K7j07J48
1778gk27K42R3k30M05j64Kqj41K53k46L18m03L64k18j08p4L26l44J08K46k09j34
1801a56K00p6OR0j9O4j88K47l51P3lL24l15j47J07K68l48K71j7J95m5r7k2j68
1825a07J51K2j45M2l46M89ol30p3O47l52M88o08J70j64n2L85J3l29J60J77j39
1847I3J39l20K90j78K8m3R8J33l94K82k6j00O6j86J31K66l27r8K60m4l8j95P1
1870i2J93j58L4j13k51M38q5K46k17O0j13R3L6o7k58K93N6j98K33j80m4K3L78
1893C07k59p2K68j18k55O0mN5M5k19J00R9m7K03j75K39m6j74L01l11K75l08k28
1916b64M04qj46O3k7J53l20P1J56lj15K89k69m9N0N6o4o3M2O0j58J32l8Q9k33
$$ plain form
1941 -192 -161 -146 -46 87 161 -162 -14 -5 -148 206 36 -50 -93 65 -30 80 112 11 100 248 25 -209 -145 139
1965 139 -290 -51 -4 -8 106 -37 46 -186 93 81 77 -159 -46 40 -15 178 37 -28 114 4 14 124 -163 -48
1989 -48 -84 237 210 -56 162 -124 -60 119 -115 38 91 -100 6 -10 119 -69 239 -230 -42 -169 -48 111
2011 111 -155 -10 96 -87 -68 -3 102 -93 -142 186 -94 194 -4 -147 177 172 82 -160 0 -237 -33 -95
2033 -95 207 21 -164 133 281 2 -12 80 -39 240 49 -4 315 -53 36 -240 78 188 -81 198 106 24
2055 24 153 303 71 -25 -394 21 -107 76 -66 -302 63 -171 -140 -11 63 -182 -240 -50 24 -19 -4 32 -299
2078 -299 79 -79 204 -93 -188 -353 -29 114 237 134 -283 239 -43 -27 74 172 180 91 -74 71 -109 151
2100 151 87 9 291 59 -84 -175 -12 -180 -3 82 -240 108 -176 111 -128 116 -186 -198 60 8 92 -121
$$ packed form
1941a92L1J5J00J33P4l23J48Rj43L54j70q6m3J58r5J10L2j01Q9J48k23k34O4K84
1965A39m29K39M7mJ14j43Q3k32K79j2mk36J13Q6n5J93j41o5J42j10J0J10k87J15
1989d8l6L21k7k66K18k86O4J79k34J53N3j91J06j6J29j88L08m69J88j27J21J59
2011A11k66J45J06j83J9O5J05j95m9L28k80K88j98j43L24nr0k42J60k37K04o2
2033i5L02j86j85K97J48k79j4R2j19K79j91n3L19l68Q9k76L18J10k69K79r2q2
2055B4J29J50k32r6l69M15j28J83j42k36L65k34L1J29P4k45n8J90P4m3J5L6l31
2078b99L78j58K83k97r5j65L24J43J23j03m17N22k82J6J01R8Qq9j65J45j80K60
2100A51o4p8K82k32j43r1J63j68J77Q5l22L48k84K87k39K44l02j2K58n2Q4k13
$$ plain form
2122 -121 -18 -188 167 83 -308 39 -206 179 113 6 -93 -26 -208 100 -23 178 18 -18 143 31 34 11 180
2145 180 -188 -78 -189 -28 -31 -43 -261 135 177 8 333 51 62 -100 -92 -270 -83 214 -133 61 -62 -150 179
2168 179 -137 129 -286 223 -13 -180 -346 -89 230 234 4 0 -57 105 -138 -195 123 -93 -140 115 13 -49 120
2191 120 157 95 -323 -25 -24 -58 -28 217 24 122 -163 132 -7 172 38 -180 -24 37 -102 199 -123 -76 -10
2214 -10 50 35 -316 225 -39 20 -128 170 -58 -27 288 -17 -19 -90 179 255 96 -85 -137 -202 232 285 25 -85
2238 -85 102 177 70 -198 -178 -177 7 384 -21 -13 2 -233 90 -32 66 -211 272 -97 -197 65 -214 -149 136
2261 136 120 228 -40 26 -262 -75 -168 -146 397 -143 142 96 213 188 -81 168 -409 127 -170 -89 59 -42
2283 -42 58 251 -18 -104 1 -124 152 -159 -191 -55 114 154 -60 115 -70 -10 106 -147 -98 80 -157 82
$$ packed form
2122a21J03j70L55q4l91L47k45L85o6j07r9O7j82L08j23K01j60l6J61j12Lk3J69
2145A80l68J10j11J61lj2k18L96M2j69L25k82J1j62Qj78J87K97l47J94j23q8L29
2168A79l16K66m15N09k36j67j66K57L19Mk30mn7J62k43n7L18k16m7K55j02o2J69
2191A20L7o2m18K98Jl4L0K45j93R8k85K95j39J79j34k18J56O1j39L01l22M7O6
2214a0O0j5l51N41k64N9j48K98k28L1L15l05kp1K69P6j59j81n2o5M34N3k60j10
2238h5J87P5j07k68K0JJ84L77m05QJ5k35L23j22R8k77M83l69j00K62k79O5K85
2261A36j6J08k68O6k88J87r3K2N43n40K85m6J17k5k69K49n77N36k97Q1J48j01
2283d2J00J93k69q6J05j25K76l11l2J36J69M0k14J75j85O0J16k53M9J78k37K39
$$ plain form
2305 82 26 116 131 87 74 -194 9 51 -50 -147 -110 228 -19 104 -184 15 -53 -78 88 -160 -53 -18 97 -84
2329 -84 80 17 -193 36 213 -53 58 83 114 -107 114 -250 -248 -196 38 -125 99 -174 2 245 326 9 -136
2352 -136 69 90 -73 -1 -39 -20 80 114 -34 -95 146 35 -29 205 24 111 222 -73 -27 242 113 205 -186
2375 -186 -203 -77 58 -133 -107 114 -131 -59 -21 144 244 65 60 -62 260 -208 -64 91 -232 -42 -37 255 218
2398 218 63 226 -164 -39 -62 -48 69 37 -1 102 122 -42 126 -85 54 78 -350 -94 -10 -50 -150 141 272
2421 272 -27 -91 -158 -211 169 -215 2 -293 298 142 -113 25 186 -58 -24 64 144 -7 -1 77 96 79 -63 136
2445 136 -196 -161 -201 -92 -125 -96 186 -99 173 143 -247 -16 -72 -102 299 291 -14 50 43 96 -287 18 -117 -111 -51
2470 -51 -98 -46 41 -41 159 -13 6 -132 -92 114 33 -58 -135 176 203 88 -32 -154 -119 -147 30 -28 185 109 -195
$$ packed form
2305H2n6R0J5m4j3k68K03M2j01r7L7L38k47J23k88J99o8k5J66k48J07L5J15j81
2329h4J64o3k10K29J77k66J11K5L1k21K21l64KN2K34j63K24k73J76K43Q1l17j45
2352a36K05K1j63P2l8J9J00L4j48o1K41j11o4K34j81Q7J11k95M6K69j29R2l91
2375a86j7J26J35j91K6K21k45P2L8J65J00j79nj22L22m68J44J55l23J90NK92l7
2398B18j55J63l90J25k3J4J17l2l8J03K0j64J68k11J39K4m28K56Q4m0j00K91J31
2421B72k99o4o7n3L80l84K17k95N91j56k55J38J61k44L4Q8Q0j51OP8J9j7j42J99
2445A36l32L5m0J09l3K9K82k85K72l0l90K31n6l0M01ql05O4pN3l83L05j35OO0
2470e1m7N2Q7q2K00j72J9j38M0K06q1r1p7L11K7j15j20j22L5k8J77n8K13p6l04
$$ plain form
2495 -195 -9 152 68 -115 141 -108 -18 85 -164 -263 -29 74 -86 5 60 -264 -47 43 -133 -79 -125 77 99
2518 99 339 -82 -96 162 -5 245 -118 -87 74 -88 170 -40 95 -115 220 29 -144 140 49 156 203 63
2540 63 -57 -31 387 316 48 23 -26 78 -103 -98 248 16 124 293 -27 -69 109 90 90 -98 -61 -96 -165 48 -103
2565 -103 76 -113 -163 72 126 36 -25 154 -189 -203 124 -44 -87 76 181 -153 -296 -187 55 -147 -97 -40 -21
2588 -21 155 -131 -78 -131 285 124 84 111 -184 -138 -22 82 -59 -2 -34 176 -335 -86 -21 -84 83 -13 -86 -87 178
2613 178 48 -229 73 -31 104 324 -70 183 0 92 87 -229 -135 -60 145 -14 219 95 53 -110 254 164
2635 164 -124 170 -339 -2 33 370 -32 56 186 150 -68 -113 -52 -50 -99 78 -57 -14 8 -58 69 -122 267 1
2659 1 -80 91 -189 3 171 -178 -201 47 81 -129 19 166 -105 -71 -227 -150 1 24 256 -23 -87 55 -167
$$ packed form
2495a95J86J61q4j83K56k49R0J03k49r9K34J03j60R1N5l24K17R0j76N4m6K02K2
2518I9K40m21j4K58j67K50l63L1J61j62K58k10J35k10L35j91j73K84r1J07M7j40
2540F3j20K6M18p1k68k5m9J04j81NL46k32J08J69l20m2J78j9%j88L7l5o9K13j51
2565a03J79j89n0K35N4r0o1J79l43j4L27j68m3J63J05l34j43J09K42k02N0N7J9
2588b1J76k86N3n3M16j61m0K7k95M6J16J04j41N7l2K10n11K49O5o3J67r6p3jK65
2613A78j30k77L02j04J35K20l94K53j83R2nl16R4P5K05j59K33j24m2j63L64r0
2635A64k88K94n09L37L5L37m02Q8J30l6k18m5O1Km9J77j35M3K2o6J27j91L89k66
2659Aq1J71k80J92J68l49k3K48L4k10J48J47k71L4j56P7J51K3K32k79o4J42k22
$$ plain form
2682 -167 37 -93 -183 -118 246 -273 256 -69 -164 -156 102 83 -78 -41 81 37 -184 84 -23 -17 -190 123 30 -99
2706 -99 -6 -8 15 92 182 196 46 -55 29 -70 -36 -210 109 36 17 -73 58 -176 -95 116 304 -235 -69 113 68
2731 68 63 -116 89 -174 -46 -97 -99 -67 -148 104 -61 -69 37 -101 168 11 192 2 120 -11 60 -69 -95 74
2755 74 114 55 76 -145 -103 130 53 46 38 -78 -30 -120 81 -80 154 -33 184 -46 9 -70 162 72 5 38 106 161
2781 161 -42 -96 165 97 99 16 -68 -50 -193 -294 50 3 -322 -9 228 -47 91 -233 -152 64 -12 236 -147
2804 -147 -135 139 -179 34 -144 -61 64 -25 -104 75 131 -68 -217 -251 51 182 -88 -41 212 -47 84 -163
2826 -163 -78 -8 -174 130 -128 84 147 90 -138 -56 -231 57 150 71 -42 108 92 -218 -129 116 36 225 13
2849 13 152 23 208 53 -179 62 50 319 -172 -241 -171 -220 169 30 -103 94 142 75 -16 -64 -158 70 -78
$$ packed form
2682a67K04j30r0O5L64n19N29l25r5QK58j9j61L7J22m4k21K68j07Oj73L13r3j29
2706i9R3kK3P7R0J4j50j01Q4r9L4j74L19p3j9r0J31k34Q1K11J88n39J66J82m5
2731F8nj79K05k63J28n1kL2q1K52j65qJ06j38K69j57J81j90J18j31P1j29k6J69
2755G4M0n9K1k21M2K33p7pqj16M8r0K01j61K34j87K17k30N5p9K32r0o7L3O8N5
2781A61k03n4K61o8Kq3q4J8j43j01L44m7l25L13K37k75J38l24Q1K16p6K48l83
2804a47J2K74l18K13j78Q3J25q9p9J79N6j99j49l4L02J31k70M7K53k59J31k47
2826a63Q5P0j66L04k58K12O3n7k28Q2j75K88R3p9j13J50j6l10Q9K45q0J89k12
2849A3J39j29J85j55k32K41j2K69m91o9P0m9L89j39j33J97M8o7r1m8r4K28j48
$$ plain form
2872 -78 96 134 -114 15 74 -2 -90 180 -141 -71 -43 -219 77 -93 -6 344 40 -116 306 -18 -227 -152 -55
2895 -55 54 141 143 -6 177 80 189 -170 -213 68 19 49 229 94 288 184 -115 -49 201 236 -92 -181 134 -279
2919 -279 92 -47 137 -289 -132 37 42 72 105 45 20 165 -150 58 -122 179 -131 7 -116 -33 14 65 108
2942 108 -70 -169 -3 222 101 -4 194 -100 -98 -102 -107 -79 -24 -6 -75 -42 -295 -122 109 157 216 -116 -77 -74 -149 86
2968 86 -67 48 -17 -151 63 59 230 50 -41 253 278 236 144 -48 196 30 15 -142 -37 210 -185 0 98
2991 98 158 -127 -105 -94 -73 -153 82 -154 69 47 233 115 76 149 23 165 121 -259 228 31 -60 -368 -7 125
3015 125 -69 156 -103 -199 15 132 80 -48 -62 -110 -146 356 -73 0 189 -105 -74 86 58 42 -152 28 142
3038 142 123 64 204 -15 174 16 231 -171 -75 124 192 -87 -92 -48 185 -191 -69 113 -208 -135 -151 -3 -60
$$ packed form
2872g8J74L8k48J29N9p6q8K70l21P0K8j76K96j70Q7L50l04j56M22l24k09P5R7
2895e5J09Q7Kj49J83r7J09l59m3K81m9L0J80j35J94j04k99O6K50L5l28q9L15m13
2919b79L71j39J84m26J57J69NL0L3o0k5J45l15K08j80L01l10J38j23Q3M7N1M3
2942A08j78r9J66K25j21j05J98k94KmnK8N5J8o9L3k53J73K31M8N9l32L9Lp5K35
2968H6j53J15o5j34K14mJ71j80r1K94K5m2r2j92K44j66j5j57J05K47l95J85R8
2991I8O0k85K2J1K1q0K35k36K23k2J86j18l9P3j26J42m4l80M87j97r1l08L61J32
3015A25j94K25k59r6K14J17n2j28j4m8l6N02m29P3J89k94L1J60k8j6j94J80J14
3038A42j9n9J40k19J89j58K15m02R6J99O8k79nM4K33l76J22J82l21P3j6J48n7
$$ plain form
3061 -60 -149 28 -1 -39 162 -212 41 -123 133 -185 12 -36 124 22 161 89 -137 317 -108 -182 226 -95
3083 -95 -178 -1 -51 75 -64 -18 -180 -128 72 90 1 29 -317 -69 26 -176 -98 283 -209 379 14 -220 118
3106 118 -164 114 -362 186 339 -67 -89 -81 -147 96 255 170 23 230 -71 146 -51 34 118 60 58 92 78 -138
3130 -138 86 114 267 -307 -109 155 -176 203 12 -115 0 49 -76 336 -19 12 13 -20 -277 122 -199 -79
3152 -79 -125 59 -131 99 -109 -111 125 23 50 -103 -139 235 -6 -38 -58 204 88 -245 166 139 19 -168 57
3175 57 110 -46 165 -90 -11 -23 -142 216 -211 203 43 -199 -245 -65 135 187 -51 49 4 -186 11 -266
3197 -266 -71 -288 -17 -298 5 -60 45 94 -112 -144 11 -24 -14 109 48 -141 -49 47 26 -257 95 78 -72
3220 -72 -78 -77 -95 47 -57 186 -167 78 102 144 -90 241 -21 -41 -80 -175 114 10 140 -98 157 -206 80 417
$$ packed form
3061f0q9J77k9l8K01l74K53j64K56l18J97m8J60j02J39p2k26M54m25p4M08l21
3083i5q3J77n0J26j39M6j62N2K00J8q9K8l46K48R5k02P8L81m92N88l65k34L38
3106A18k82K78m76N48J53m06k2Qo6K43J59q5j47K07l01K17j97Q5Q4n8kL4j4k16
3130a38K24K8J53n74J98K64l31L79j91j27J15M9j25M12l55L1Jl3k57L99l21J20
3152g9m6J84j90K30k08kK36j02K7j53l6L74k41l2k0K62j16l33M11k7j20j87K25
3175E7N3j56K11k55P9j2j19L58m27M14j60k42m6J80K00N2k38J00m5j90J97k77
3197b66J95k17K71k81L03o5J05M9k06l2J55l5J0J23o1j89R2R6k1k83L52j7j50
3220g2oJj8J42j04K43l53K45K4M2k34L31k62k0l9r5K89j04J30k38K55l63K86L37
$$ plain form
3244 417 -33 173 79 -81 61 -184 280 -128 -118 -130 -107 81 -199 -107 -191 -7 -262 -5 197 185 162 -41 44
3267 44 -194 83 -7 -3 -285 105 183 48 14 -288 247 -149 -221 -209 -85 105 -104 -32 106 93 -16 93 -105
3290 -105 -94 -233 -38 -184 45 -202 19 76 -65 -41 37 97 23 -109 290 52 137 -11 75 -6 -231 -123 -65
3313 -65 48 -288 241 -308 -242 -82 -15 43 -256 -76 -67 -297 272 -85 69 -164 16 28 -139 394 -101 -10 257
3336 257 -167 152 116 -132 -161 19 327 -42 -14 95 94 6 58 185 248 -156 316 42 294 120 -157 324 229
3359 229 156 -182 53 -91 119 183 187 -106 -231 -326 -143 -6 -303 -22 43 238 191 -42 162 -7 54 60 342
3382 342 -93 209 239 80 -289 -125 -43 -8 75 59 93 -225 6 -97 213 169 138 -11 -99 -111 -96 32 -101 163
3406 163 165 -116 20 -81 80 -10 -344 -170 -77 -114 -98 -318 -17 -188 13 58 220 -60 185 -61 12 158 -43
$$ packed form
3244D17m50K06r4j60J42k45M64m08J0j2K3J88k80R2q4J84k55K57K02j2k3k03Q5
3267D4k38K77r0Mk82L90P8j35l4l02N35l96p2J2J24J90k09P2J38j3j09J09j98
3290a05J1j39J95j46K29k47K21N7j41K4P8O0p4j32L99k38Q5j48Q6q1k25J08N8
3313f5J13l36N29n49O6J60O7N8k99J80Rk30N69l57J54k33J80J2j67N33m95R1K67
3336B57m24L19l6k48k9J80L08l69K8J09jq8N2J27O3m04M72k74K52j74k77M81r5
3359B29p3l38K35j44K10O4Mk93j25r5J83J37k97K81O5J95m7k33K04j69O1OK82
3382C42m35L02L0j59l69J64Q2L5Q3j6L4l18K31j03L10m4l1j49q8j2J5J28j33K64
3406A63Kk81J36j01J61r0l34J74R3l7J6k20L01j71K01M5J62k80K45k46P3J46k01
$$ plain form
3429 -43 118 190 -263 -95 -153 136 -32 109 -54 -136 -4 -33 197 -49 88 -115 -34 -42 57 175 -41 -308 -123
3452 -123 76 154 113 89 57 -23 142 -227 -65 -112 3 93 -63 184 139 -199 -65 285 15 -42 69 92 -43
3475 -43 -145 111 -253 78 120 -26 85 54 140 -57 -189 -52 -106 162 128 9 77 -70 -24 76 -10 -89 -74 42
3499 42 -252 -21 -84 -110 5 -103 -46 90 -23 -346 69 -122 30 1 -24 -21 -86 -173 -323 69 -58 -291 6
3522 6 -106 75 -66 -303 249 132 35 47 145 -137 146 72 42 135 175 -187 -94 -35 -213 -173 157 104 -115 19
3546 19 -27 -66 444 -57 -44 174 68 207 -47 100 45 106 25 64 142 84 82 -193 226 207 -122 -137 327 122 -228
3571 -228 91 -101 92 -65 -41 -113 -29 -83 -196 -76 24 -33 227 145 -23 -258 -138 1 118 -191 -56 -4
3593 -4 -205 -135 -117 148 97 180 187 -188 -115 -122 -134 166 -59 -207 -369 59 -193 33 1 -49 181 -118 23 -270 38
$$ packed form
3429d3J61P2m53J68n8K89j68J41j63q2J32k9K30k46J37k03Q1qR9J18k16k67J85
3452a23J99P8m1k4l2q0J65l69J62m7J15R0j56K47m5l38J34L50k70n7J11K3j35
3475d3j02K56l64L31M2j46J11l1Q6j97j32J37n4K68l4j19O8j47M6J00q6p9J5J16
3499D2k94K31o3k6J15j08N7J36j13l23M15j91J52k9k5Lo5q7j50L92j27k33K97
3522Fj12J81j41k37N52j17r7J2R8k82K83p4l0R3M0l62R3N9j78M0L30n3k19J34
3546A9m6l9N10n01J3K18j06J39k54J47n5O1q1L9P8n8kk75M19j9l29j5M64k05l50
3571b28L19j92J93j57K4p2Q4n4j13J20J00n7K60q2j68k35J20J39J17l09J35N2
3593dk01P0J8K65n1Q3Pl75P3pj2L00k25j48j62M28k52K26l2n0K30k99J41k93L08
$$ plain form
3618 38 -134 -41 -119 81 211 182 -66 -218 0 -270 -118 165 -78 82 -3 -101 208 320 -215 -168 154 -187
3640 -187 44 110 -68 -227 53 -3 13 50 -21 128 -72 -61 63 -119 41 -117 -301 194 -83 123 -110 -49
3662 -49 -19 143 347 312 -79 45 -27 -116 267 -105 25 90 66 84 -138 -83 52 -73 169 192 164 233 102 213
3686 213 60 -99 37 -183 -107 -94 146 -370 173 60 264 -149 -75 -9 191 80 -163 192 -40 48 136 142 -105
3709 -105 -73 56 113 238 -83 -140 375 -56 -68 170 -193 -139 117 13 -14 -38 249 211 4 -67 -126 51 -286
3732 -286 21 -76 -64 -115 217 -96 15 192 54 -123 178 149 -212 154 -68 -78 -204 -116 -92 171 -285 -129
3754 -129 -66 58 59 137 154 -298 -66 246 61 -38 245 -39 -236 3 88 -155 123 75 215 52 -44 -139 118
3777 118 41 -190 -39 112 55 -221 -137 11 75 0 118 132 43 283 43 22 -116 -25 6 15 -16 7 39 -530 25
$$ packed form
3618C8j72R3p8K00J30k9k48j52K18k70J52K83k43J60q5r8L09J12n35M7L22l41
3640a87K31O6j78j59K80n6J6L7p1J49k00J1J24j82J60j58j84M95k77K06k33O1
3662d9L0J62K04l5l91J24p2q9L83l72J30O5k4J8k22N5J35j25K42K3k8O9j31J11
3686B13j53j59J36k20P6J3K40n16N43j13K04m13P4O6K00j11k43L55k32Q8Q8Ok47
3709a05L2J29N7J25l21n7N15m31j2K38l63N4K56j04k7k4K87l8k07p1n9J77l37
3732b86L07r7J2n1L32l13J11J77j38j77L01k9l61L66k22j0j26Q8K4K63m56J56
3754a29O3J24JP8J7m52K32L12j85r9K83k84j97K39Q5k43K78m8J40j63r6r5K57
3777A18p7k31J51J51n7k76Q4J48O4p5J18J4q9K40k40k1j38R1L1Rl1K3L2n69N55
$$ plain form
3802 25 -112 -50 136 174 -193 140 -152 -179 204 130 75 -16 -143 -163 35 48 101 156 -39 105 -176 -197 114 -38
3826 -38 32 209 -239 11 -12 -126 -44 -77 53 -150 -60 219 -136 -101 24 105 -148 -144 -302 -137 121 191 151 -55
3850 -55 -121 -73 -261 -369 294 75 303 318 -56 -75 -110 72 -127 -133 58 -121 68 -340 -54 87 10 -334 52
3873 52 -38 31 243 89 142 38 94 -37 -35 -28 85 39 -112 123 75 85 7 -30 -150 86 -49 -139 -72 -212 187
3898 187 183 15 141 216 203 138 -36 -45 90 -39 266 -270 239 -9 15 64 6 -3 65 -31 8 3 -217 -112 12 110
3924 110 -119 -276 -93 -36 254 59 -264 -7 -82 -3 65 33 -99 184 78 -190 21 17 128 60 -186 -57 -44
3947 -44 139 -375 16 -147 122 15 -236 52 -25 89 138 182 42 -76 95 -222 -73 159 -72 115 -35
3968 -35 3 -20 -62 194 -76 223 -81 -325 21 233 304 103 21 55 37 -244 49 49 192 -26 -52 -209 -134 -4
$$ packed form
3802B5j37O2J86L8l67L33k92k7L83p4n5r1j27k0J98J3N3N5j95J44k81k1L11j52
3826c8P0J77m48K50k3j14Q2l3J30k03R0K79l55L5J25Q1k53Mj58J65K58P0m0k06
3850e5o6M8j88j08O63k19K28J5l74j9l5J82j99oJ91j79J89m08K86J41p7l44L86
3873E2r0O9K12j54N3j04N6j31KPJ13m6j51K35m8J0p8l7j20K36j35r0O7j40L99
3898A87mj68J26P5j3o5j74rJ35j29L05n36N09k48K4M9n8rO8r6L9nk20J05J24R8
3924A10k29j57J83N7K90j95l23K57p5P9O8l2j32K83j06k68K11mJ11o8k46J29J3
3947d4J83n14L91j63K69j07k51K88p7J14M9M4j40j18J71l17J49K32k31J87j50
3968c5L8k3m2K56k70K99l04k44L46K12P1k01q2L4j8k81K93%J43k18k6j57P5J30
$$ plain form
3992 -4 82 279 -27 -133 109 233 -39 145 -32 -36 105 -177 -131 -26 -83 -159 13 -16 2 171 -134 363 242
4015 242 17 -33 -109 135 -165 -40 264 -94 63 -123 -72 45 102 64 69 -50 5 -255 -25 65 36 32 1 48 -190
4040 -190 -256 284 -218 -198 71 -52 188 -235 -132 8 130 -138 64 -203 150 26 -412 -31 177 -399 -145
4061 -145 29 -70 222 57 -11 230 -42 91 64 -67 -57 -87 -46 -73 154 -26 121 -153 -232 -66 -32 43 6 -233
4085 -233 -189 160 63 -21 -11 -36 16 154 -107 92 -40 -196 -6 197 37 91 -150 203 324 178 -104 188
4107 188 -138 -130 61 -271 65 139 -119 -40 -83 4 103 37 16 -360 7 -90 -99 43 97 -7 -26 128 86 98 -72
4132 -72 70 23 -75 148 152 -98 120 -117 69 -61 -352 -86 -85 -38 -145 -17 36 83 8 -195 -22 28 159 49
4156 49 82 129 62 83 232 -17 83 107 -375 109 84 49 -239 -83 0 -103 44 -71 1 -182 163 -30 134
$$ packed form
3992dQ6J97l06j06K42J24k72J84j77mJ41k82M6J05n7p6J72k9J8J69l05M97j21
4015B42k25n0p6K44l00J25L04l58J57j86N1J17N7l8Nj19N5k60K30R0k9ml1M7k38
4040a90o6N40n02K0K69j23K40m23J03J40J22k68K02k67L53j24m38L81K08n76K54
4061a45J74r9K92j65o8K41k72J33k7j31J0l0M1k7K27j80J47k74p9J66L4P5l7k39
4085b33M4L49r7q4J0k5N2J38k61J99j32j56J90K03j60N4k41L53J21j46k82K92
4107A88l26QJ91l32L36P4k58P9m3Q7R9o6k1l76L67r7rJ42N4j04j9J54m2J2j70
4132g2J42m7r8K23Mk50K18k37J86j30k91K66JM7j07J28N3M7p5k03J73N0J31j10
4156D9L3M7o7K1J49k49J00K4m82M84k5l5k88J56Q3j03J47j15P2j83L45j93J64
$$ plain form
4179 134 -61 219 -31 -300 132 -3 -257 90 94 17 -157 254 -175 51 110 3 159 -27 -225 -163 -5 103
4201 103 74 56 -247 -352 55 16 237 82 -127 -255 -127 145 198 -178 -55 42 -103 45 -185 -183 -28 -161
4223 -161 116 -43 46 -290 -31 100 -170 -87 -76 -215 77 59 -286 -113 -10 7 165 211 58 -46 42 -286
4245 -286 -77 150 174 -63 92 -86 39 10 -74 137 242 -128 63 -121 -79 40 -162 12 -41 -151 -134 56
4267 56 -93 53 -89 80 102 -106 -4 98 27 22 -95 41 22 298 133 -129 -181 155 22 -112 -140 181 208
4290 208 120 21 -48 -160 -63 49 -58 -66 71 26 154 -71 29 -172 169 105 6 155 -118 298 -318 -103 -552
4313 -552 99 -152 -48 99 160 34 147 -6 -182 -157 -145 120 213 -342 190 24 -27 40 243 -71 318 -279
4335 -279 -135 73 194 142 -123 -211 -71 -36 76 132 -1 139 168 175 -80 -119 -116 -211 97 -171 -148 291 110 -32
$$ packed form
4179A34j95K80k50k69M32j35k54L47Mp7j74M11m29K26N9j07J56j86j98O2J58J08
4201A03k9j8l03j05M07l9K21j55k09j28J28K72N3l76J23R7j45J48k30KJ55j33
4223a61K77j59Q9l36K59J31k70Q3J1j39K92j8l45J73J03J7J58M6j53j04Q8l28
4245b86K09K27K4k37J55j78J25k9q4K11J05l70J91j84M2J19k02J74n3j10J7J90
4267E6j49J46j42J69K2k08J02J02p1nj17J36j9K76j65k62n2L36j33j34k8L21K7
4290B08q8r9o9j12R7J12j07qJ37m5J28k25J00k01L41o4r9J49k73M16o16K15m49
4313e52O51k51J04J47O1j26J13j53j76K5J2K65R3n55N32j66n1O7K03l14L89n97
4335b79J44K08J21n2k65q8J40L5J12N6j33J40K9Pk55l9Lr5L08k68K3M39j81j42
$$ plain form
4359 -32 -57 -29 -46 -71 -18 233 96 161 21 -14 82 125 107 -87 82 -1 344 9 -36 -134 161 -196 -66 -238 -244
4384 -244 76 -152 3 44 3 -95 -86 -295 -369 -32 153 -70 299 1 -126 -36 133 -10 -82 -11 127 5 -57
4407 -57 97 -149 163 -263 -151 -36 -42 264 -45 93 58 -58 25 71 176 -30 -49 114 60 -4 5 25 76 120 315
4432 315 -242 -11 85 -101 175 -231 -75 58 62 -32 -329 -177 -36 -155 -93 -37 108 173 64 -303 -58 182
4454 182 212 121 -101 -142 -32 -87 -111 -84 -388 221 249 -234 280 93 -149 -70 -56 61 32 -15 326 -157 237 243
4478 243 128 -67 203 -74 57 -62 -18 113 -158 243 165 -94 256 -156 -18 24 -4 -17 -92 -104 -32 80 -20
4501 -20 -202 -42 -79 -5 109 64 -204 256 -78 43 63 -188 172 83 -51 -70 4 -91 180 -174 -47 165 71
4524 71 -31 45 -75 -238 136 141 8 401 -65 67 84 96 -137 163 129 -169 -58 -87 -75 -159 -109 63 135 106
$$ packed form
4359c2k5K8j7k5N3K51j37O5j40l5R6M3j8j94J69q3L45l35m5r8K95l57J30j72o
4384b44L20k28J55M1m1r8Rk09p4L37J85k23L69k98j27R0J69j43p2P1J38j22o2
4407e7J54k46L12m26J12J15oL06l09J38l5j16Q3M6J05k06j9J63n4o4RK0N1M4J95
4432C15n57K31R6j86K76m06J56J33Mr4k97J52J41j19O2N6J45O5j09l67K45K40
4454A82L0r1k22m1J10n5k4K7l04O09K8m83N14j87k42P9J4J17k9m7L41m83L94O
4478B43j15j95K70k77J31j19M4J31k71M01p8k59L50m12J38M2k8j3p5j2P2J12j00
4501b0j82J60l7P4J14m5k68M60l34J21K0k51L60q9j34j9P4r5K71l54J27K12r4
4524G1j02P6j20j63L74Nj33L93m66J32J7J2k33L00l4k98J11k9J2q4N0J72P2k9
$$ plain form
4548 106 94 -84 41 -112 -97 101 -94 75 -192 -58 37 116 130 136 268 -169 39 -90 29 203 124 71 7
4571 7 -209 29 -199 95 176 -184 -5 80 197 -330 -148 -94 193 -144 39 -70 30 17 -357 22 0 31 -16
4594 -16 -332 164 -360 10 -210 16 23 -123 50 139 253 43 -250 -25 -38 -193 54 -168 58 88 150 38
$$ packed form
4548A06j2j78J25j53J5J98j95J69k67J34R5P9J4OJ32m37K08j29J19J74p9n3o4
4571Gk16K38k28K94Q1l60J79Q5J17n27J82N4K87l37J83j09J00j3l74L79k2L1m7
4594a6l16M96n24L70k20K26Pj46J73Q9J14k10k93K25j3j55K47k22K26L0O2j12
$$ [...]
8191F7
##END NTUPLES=NMR FID
##END=
