##TITLE=1H_DE-13kTFA
 CDCl3
 8 sc, 
 7.9.2023
##JCAMPDX= 6.0         $$ Bruker NMR JCAMP-DX V2.0
##DATA TYPE= NMR FID
##DATA CLASS= NTUPLES
##ORIGIN= UXNMR, Bruker Analytische Messtechnik GmbH
##OWNER= root
$$ XWIN-NMR		Version 3.5
$$ Thu Sep  7 15:24:21 2023 Russian Standard Time (UT+4h)  she@DPX200
##.OBSERVE FREQUENCY= 200.13135
##.OBSERVE NUCLEUS= ^1H
##.DELAY= (6, 6)
##.ACQUISITION MODE= SIMULTANEOUS
##.ACQUISITION SCHEME= undefined
##.AVERAGES= 8
##.DIGITISER RES= 18
##SPECTROMETER/DATA SYSTEM= spect
##.PULSE SEQUENCE= zg30
##.SOLVENT NAME= CDCl3
##.SHIFT REFERENCE= (INTERNAL, CDCl3, 0, 15.7039)
##AUDIT TRAIL= $$ (NUMBER, WHEN, WHO, WHERE, WHAT)
$$ ##TITLE= Audit trail, XWIN-NMR		Version 3.5
$$ ##JCAMPDX= 5.01
$$ ##ORIGIN= Bruker BioSpin GmbH
$$ ##OWNER= she
$$ F:/spectra/data/she/nmr/H-F/1/audita.txt
$$ ##AUDIT TRAIL=  $$ (NUMBER, WHEN, WHO, WHERE, WHAT)
(   1,<2023-09-07 15:23:07.42 +0400>,<she>,<DPX200>,
      <created by zg, POWCHK disabled, PULCHK disabled
       configuration hash MD5:
       00 E9 B6 7A A2 85 ED C7 34 08 36 98 17 FE 4E 26
       data hash MD5: 16K
       9E EC 30 7F BB 88 CF 07 B2 22 D6 5B C9 0C D0 96>)
$$ ##END=
$$ 
$$ hash MD5
$$ F8 4E 22 DF A4 A5 1D A4 2B 65 95 FA AD 28 48 EC
##$RELAX= 
##$RELAX= 
##$RELAX= 
##$RELAX= 
##$RELAX= 
##$RELAX= 
$$ Bruker specific parameters
$$ --------------------------
##$DU= <F:/spectra>
##$EXPNO= 1
##$NAME= <H-F>
##$PROCNO= 1
##$TYPE= <nmr>
##$USER= <she>
##$AMP= (0..31)
100 100 100 100 100 100 100 100 100 100 100 100 100 100 100 100 100 100 
100 100 100 100 100 100 100 100 100 100 100 100 100 100 
##$AQSEQ= 0
##$AQ_mod= 1
##$AUNM= <au_zg>
##$AUTOPOS= <>
##$BF1= 200.13
##$BF2= 200.13
##$BF3= 200.13
##$BF4= 200.13
##$BF5= 200.13
##$BF6= 200.13
##$BF7= 200.13
##$BF8= 200.13
##$BYTORDA= 1
##$CFDGTYP= 0
##$CFRGTYP= 5
##$CHEMSTR= <none>
##$CNST= (0..31)
1 1 145 1 1 1 1 1 1 1 1 1 1 1 1 1 1 1 1 1 1 1 1 1 1 1 1 1 1 1 1 1 
##$CPDPRG= <>
##$CPDPRG1= <>
##$CPDPRG2= <>
##$CPDPRG3= <>
##$CPDPRG4= <mlev>
##$CPDPRG5= <mlev>
##$CPDPRG6= <mlev>
##$CPDPRG7= <mlev>
##$CPDPRG8= <mlev>
##$CPDPRGB= <>
##$CPDPRGT= <>
##$D= (0..31)
0 1.2 0 0 0 0 0 0 0 0.06 0 0.03 0 0 0 0 0.0002 0 0 0 0 0 0 0 0 0 0 0 0 
0 0 0 
##$DATE= 1694085787
##$DBL= (0..7)
120 120 120 120 120 120 120 120 
##$DBP= (0..7)
150 150 150 150 150 150 150 150 
##$DBP07= 0
##$DBPNAM0= <>
##$DBPNAM1= <>
##$DBPNAM2= <>
##$DBPNAM3= <>
##$DBPNAM4= <>
##$DBPNAM5= <>
##$DBPNAM6= <>
##$DBPNAM7= <>
##$DBPOAL= (0..7)
0.5 0.5 0.5 0.5 0.5 0.5 0.5 0.5 
##$DBPOFFS= (0..7)
0 0 0 0 0 0 0 0 
##$DE= 6
##$DECBNUC= <off>
##$DECIM= 32
##$DECNUC= <off>
##$DECSTAT= 4
##$DIGMOD= 1
##$DIGTYP= 9
##$DL= (0..7)
0 120 120 120 120 120 120 120 
##$DP= (0..7)
150 150 150 150 150 150 150 150 
##$DP07= 0
##$DPNAME0= <>
##$DPNAME1= <>
##$DPNAME2= <>
##$DPNAME3= <>
##$DPNAME4= <>
##$DPNAME5= <>
##$DPNAME6= <>
##$DPNAME7= <>
##$DPOAL= (0..7)
0.5 0.5 0.5 0.5 0.5 0.5 0.5 0.5 
##$DPOFFS= (0..7)
0 0 0 0 0 0 0 0 
##$DQDMODE= 0
##$DR= 18
##$DS= 0
##$DSLIST= <SSSSSSSSSSSSSSS>
$$ [...]
##$SUBNAM2= <"">
##$SUBNAM3= <"">
##$SUBNAM4= <"">
##$SUBNAM5= <"">
##$SUBNAM6= <"">
##$SUBNAM7= <"">
##$SUBNAM8= <"">
##$SUBNAM9= <"">
##$SW= 18.05172834244
##$SWIBOX= (0..15)
0 0 2 0 0 0 0 0 0 0 0 0 0 0 0 0 
##$SW_h= 3612.71676300578
##$TD= 16384
##$TD0= 1
##$TE= 0
##$TE2= 300
##$TE3= 300
##$TEG= 300
##$TL= (0..7)
0 120 120 120 120 120 120 120 
##$TP= (0..7)
150 150 150 150 150 150 150 150 
##$TP07= 0
##$TPNAME0= <>
##$TPNAME1= <>
##$TPNAME2= <>
##$TPNAME3= <>
##$TPNAME4= <>
##$TPNAME5= <>
##$TPNAME6= <>
##$TPNAME7= <>
##$TPOAL= (0..7)
0.5 0.5 0.5 0.5 0.5 0.5 0.5 0.5 
##$TPOFFS= (0..7)
0 0 0 0 0 0 0 0 
##$TUNHIN= 0
##$TUNHOUT= 0
##$TUNXOUT= 0
##$USERA1= <user>
##$USERA2= <user>
##$USERA3= <user>
##$USERA4= <user>
##$USERA5= <user>
##$V9= 5
##$VALIST= <valist>
##$VCLIST= <CCCCCCCCCCCCCCC>
##$VD= 0
##$VDLIST= <DDDDDDDDDDDDDDD>
##$VPLIST= <PPPPPPPPPPPPPPP>
##$VTLIST= <TTTTTTTTTTTTTTT>
##$WBST= 1024
##$WBSW= 4
##$XGAIN= (0..3)
0 0 0 0 
##$XL= 0
##$YL= 0
##$YMAX_a= 165974
##$YMIN_a= -140393
##$ZGOPTNS= <>
##$ZL1= 120
##$ZL2= 120
##$ZL3= 120
##$ZL4= 120
##$ABSF1= 10
##$ABSF2= 0
##$ABSG= 5
##$ABSL= 3
##$ALPHA= 0
##$AQORDER= 0
##$ASSFAC= 0
##$ASSFACI= 0
##$ASSFACX= 0
##$ASSWID= 0
##$AUNMP= <proc_1d>
##$AZFE= 0.1
##$AZFW= 0.1
##$BCFW= 1
##$BC_mod= 2
##$BYTORDP= 1
##$COROFFS= 0
##$CY= 11.3945322036743
##$DATMOD= 1
##$DC= 2
##$DFILT= <>
##$DTYPP= 0
##$F1P= 15.7292609196834
##$F2P= 12.9074282941183
##$FCOR= 0.5
##$FTSIZE= 0
##$FT_mod= 4
##$GAMMA= 1
##$GB= 0.15
##$INTBC= 1
##$INTSCL= 1
##$ISEN= 128
##$LB= 0.24
##$LEV0= 0
##$LPBIN= 0
##$MAXI= 10000
##$MC2= 0
##$MEAN= 0
##$ME_mod= 0
##$MI= 1.114404
##$NCOEF= 0
##$NC_proc= 0
##$NLEV= 6
##$NOISF1= 3.799351
##$NOISF2= 2.8
##$NSP= 1
##$NTH_PI= 0
##$NZP= 0
##$OFFSET= 15.70392
##$PC= 1
##$PHC0= -21411.43
##$PHC1= 18.45271
##$PH_mod= 1
##$PKNL= yes
##$PPARMOD= 0
##$PSCAL= 0
##$PSIGN= 0
##$REVERSE= no
##$SF= 200.130013532006
##$SI= 16384
##$SIGF1= 3
##$SIGF2= 2
##$SINO= 400
##$SIOLD= 16384
##$SREGLST= <1H.CDCl3>
##$SSB= 0
##$STSI= 0
##$STSR= 0
##$SW_p= 3612.71676300578
##$SYMM= 0
##$S_DEV= 0
##$TDeff= 0
##$TDoff= 0
##$TI= <>
##$TILT= no
##$TM1= 0
##$TM2= 0
##$TOPLEV= 0
##$USERP1= <user>
##$USERP2= <user>
##$USERP3= <user>
##$USERP4= <user>
##$USERP5= <user>
##$WDW= 1
##$XDIM= 8192
##$YMAX_p= 0
##$YMIN_p= 0
$$ End of Bruker specific parameters
$$ ---------------------------------
##NTUPLES= NMR FID
##VAR_NAME=  TIME,          FID/REAL,        FID/IMAG
##SYMBOL=    X,             R,               I
##VAR_TYPE=  INDEPENDENT,   DEPENDENT,       DEPENDENT
##VAR_FORM=  AFFN,          ASDF,            ASDF
##VAR_DIM=   8192,          8192,            8192
##UNITS=     SECONDS,       ARBITRARY UNITS, ARBITRARY UNITS
##FACTOR=    0.0002768,     1,               1
##FIRST=     0,             0,               0
##LAST=      2.2672688,     0,               0
##MIN=       0,             -140393,         0
##MAX=       2.2672688,     165974,          0
$$ Real data points
##PAGE= N=1
##DATA TABLE= (X++(R..R)), XYDATA
0@%%%%%%%%%%%%Qj6J6j6K4l2L2m0M8n6P2q8J04j20J36j53J77k07K38k70L04l44
$$ 0 0 0 0 0 0 0 0 0 0 0 0 0 8 -8 8 -8 16 -16 16 -24 24 -32 40 -48 56 -64 72 -81 96 -111 127 -143 161 -183
34a83L90m40M93n52O18o90P69q54R49j053J164j286J418j563J724j899K091k303
$$ -183 207 -233 260 -292 326 -364 405 -449 500 -553 611 -675 743 -820 904 -995 1096 -1207
52a207K539k802L095l425L797m224M721n302N994o840P897r258J1090j3703J7746
$$ -1207 1332 -1470 1625 -1800 1997 -2227 2494 -2808 3186 -3654 4243 -5015 6075 -7628 10118
67A0118k4887M1181j44264k2541K32152j10065K9914O6536j35280k9299J73907
$$ 10118 -14769 26412 -117852 -140393 91759 -18306 11608 78144 -57136 -86435 87472
78H7472j3839m3316L849j12759k7086J64559P802n5906L0784q7276p0542J62780
$$ 87472 73633 30317 34166 -78593 -105679 58880 66682 10776 41560 -45716 -116258 46522
90D6522L6868j18772L6513l815j20406J22792J52473j26780p5672O2566n8818
$$ 46522 83390 -35382 1131 -2684 -123090 -298 152175 25395 -50277 12289 -46529
101d6529N528J25723m2990r6112K3366j9815K3653J23940m4824j14335M6415K005
$$ -46529 -41001 84722 41732 -54380 -31014 -50829 -27176 96764 51940 -62395 -15980 -13975
113a3975k9334J21590Q267j49345K1650O1146n3015O7719O4449j44211m7185J03409
$$ -13975 -43309 78281 86548 -62797 -41147 19999 -33016 34703 99152 -45059 -92244 11165
125A1165o880J226O1441p7555o6479P2325J7704O40N1633p3087q1680Q6407L9580
$$ 11165 4285 5511 66952 -10603 -77082 -4757 12947 13587 65220 -7867 -89547 -3140 36440
138C6440m0004M5128k1831j02313N2431Q0871m0303O639J1352q6523J2689R9075
$$ 36440 -3564 41564 19733 -82580 -30149 50722 10419 17058 28410 -58113 -45424 53651
150E3651j7178l4848J1842n0853q721Q0923J756l7193Q689m2445k1270Q8281J8720
$$ 53651 36473 1625 13467 -37386 -46107 34816 36572 -621 8068 -34377 -55647 32634 51354
163E1354o4947N083l475l5660N9550M7071n8582k0348J1436k6556L7947N5976
$$ 51354 -13593 -8510 -11985 -47645 11905 58976 394 -19954 -8518 -35074 2873 58849
175E8849m9445m0608K1604q235J6644N0169l1452m5758J7959k511N664N3523k0324
$$ 58849 9404 -31204 -9600 -17835 -1191 48978 17526 -28232 -10273 -12784 -7120 46403 26079
188B6079o4042J7189K3470q887L1409K410n5893j734K9340p29K2341P380n3088
$$ 26079 -37963 -20774 2696 -6191 25218 27628 -28265 -29999 -659 -1388 20953 28333 -24755
201b4755r693L9402L070N313J1958l9618j8626L5563R048L04J3478l4006k9063
$$ -24755 -34448 4954 8024 13337 25295 -14323 -32949 2614 11662 11966 25444 -8562 -37625
214c7625L8886K1425j4287M845j5521k8665K4314K6144j0319J276j2762l1202
$$ -37625 1261 22686 8399 13244 -2277 -30942 -6628 19516 9197 10473 -2289 -33491
226c3491K2957L4253j5520q521J98k4294R349L5686p853j3794K615k0888K167
$$ -33491 -10534 23719 8199 -322 -124 -24418 -15069 20617 12764 -1030 1585 -19303 -17136
239a7136M0134l161k5903M440o760o363L0410N863k5075Q0l605r163K8828J3128
$$ -17136 22998 19837 -6066 -1626 -8386 -14749 15661 21524 -3551 -3471 -7076 -16239 12589 25717
253B5717l2262n310R814j0324J5155J9786k4614j3440J2031o332R259K3369k0938
$$ 25717 -6545 -11855 -2041 -12365 2790 22576 -2038 -15478 -3447 -9779 -520 22849 1911
266A911k1755J6656K623k415K0400q750k5090J1840P791n916J8307k353l0114
$$ 1911 -19844 -3188 -565 -2980 17420 8670 -16420 -4580 3211 -2705 15602 13249 -16865
279a6865Q057J8481j0813O448Q713k4792l443K0981n412m09J0922k0641j0242
$$ -16865 -8808 9673 -1140 5308 14021 -10771 -14214 6767 1355 946 11868 -8773 -19015
292a9015K5156J42j1024J2172q563j6409J8352Q976j2421P639k021j8468J4386
$$ -19015 6141 6283 -4741 7431 -1132 -17541 811 9787 -2634 5005 2984 -15484 -1098
305a098J6101j5632k94Q349j6033K173J9475q750p414Q142j0541l075J9289m980
$$ -1098 15003 -629 -923 7426 -8607 -6434 13041 4291 -3123 5019 -5522 -8597 10692 5712
319E712j3414R564k562j0318J4765M380j4242L532L195r578J0243Q086j4409L67
$$ 5712 -7702 1862 -700 -11018 3747 8127 -6115 -2583 612 -8966 1277 9363 -5046 -4679
333d679R282q940J497J2526q302o711Q737l399k312J0089m343r109Q527j15p593
$$ -4679 4603 -4337 -2840 9686 1384 -5327 3410 11 -2301 7788 3445 -5664 2863 2748 -4845
348d845Q231K717j0952K250M900n875L199M403p857J34N895n381l48P843l986
$$ -4845 3386 6103 -4849 -2599 2301 -3574 -375 4028 -3829 -3695 2200 -3181 -3529 4314 328
363C28n377N333O6k306M660l64m139K882K44k869M348K032n589r71L126q36L62
$$ 328 -5049 284 350 -1956 2704 2340 -1799 1083 1327 -1542 2806 4838 -751 -1722 1404 568 930
380I30J724k118k056l2K00J255K715k316m324M66K765J053OJ55j540k694J859
$$ 930 2654 536 -1520 -1552 -1352 -97 2618 302 -4022 -3556 -791 262 268 423 -1117 -3811 -1952
397a952L877J004j652k512j758K448M436n02k270l4k463j678O017K867n051k338
$$ -1952 1925 2929 1277 -1235 -2993 -545 3891 3389 1119 1085 -1378 -3056 2961 5828 777 -1561
413a561o14q89N446K729o086k016J282l144L484P791n008p124K251J176J593O175
$$ -1561 -2175 -3064 2382 5111 -975 -2991 -1709 -4853 -1369 6422 1414 -5710 -3459 -2283 -690 5485
429E485k985p423K581J925p74P547O90j1515p26O795j35L341J517r271k545O731
$$ 5485 2500 -4923 -2342 -417 -1191 6356 7046 -4469 -5195 1600 1465 4806 6323 -2948 -5493 1238
445A238l11J450M635r263p666Q962M232k196K054n014p441O761O174k602K349
$$ 1238 927 2377 7012 -2251 -9917 -955 3277 1081 3135 -1879 -9320 -2559 3615 1013 3362
460C362k330j0853N064J1566k256l177n23o737J572J0645j85m204K1p219j518
$$ 3362 1032 -9821 -4757 6809 4553 1376 853 -5884 -4312 6333 6148 1944 1965 -5254 -6772
475f772J2761K597q550j881j977k112Q559M754p168k982j813l247Q564Q607p827
$$ -6772 5989 8586 36 -1845 -3822 -5934 2625 7379 211 -2771 -4584 -7831 733 9340 1513
490A513p607J797J63M580P310m372p107m66J83N010R168m317j0601n63M178L566
$$ 1513 -6094 -4297 -4134 446 7756 3384 -3723 -4189 -4006 1004 10172 5855 -4746 -5309 -1131 2435
506B435M943j630q975k893L221L818N972r01j0868m314O099N673K351j746p189
$$ 2435 7378 5748 -3227 -6120 -2899 919 6891 5990 -4878 -9192 -3093 2580 4931 3185 -4004
521d004l404K540N845O054j668r818l442N282N715L623j884p478l333L665N122
$$ -4004 -7408 -4868 977 7031 5363 -4455 -7897 -2615 3100 6723 4839 -2639 -5972 -2307 2815
536B815M478n63r489n123N397N981L187j567q689m896O230M077K566J931r415
$$ 2815 7293 6730 -2759 -7882 -2485 3496 6683 5116 -3573 -8469 -2239 1838 4404 6335 -3080
551c080q833Q376Q107j064M83n326r147O092J0030q65r20k980r948L669J2604
$$ -3080 -11913 -3537 4570 3506 3989 -1337 -10484 -4392 5638 4773 3853 873 -9075 -5406 7198
566G198l73l754j681r283J595J4253o81o806J331p775m444J6466M612j2476n14
$$ 7198 6825 3071 1390 -7893 -6298 7955 7274 468 1799 -5976 -10420 6046 10658 -1818 -2332
581b332j376o797J2562R705j2835m163L708p082P463J4277j0643r555N191l337
$$ -2332 -3708 -10505 2057 11762 -1073 -5236 -1528 -8610 -1147 13130 2487 -7068 -1877 -5214
595e214L495J5756q603j4545Q366J7m001J6394n85k1074L125R273n503R282N272
$$ -5214 -1719 14037 5434 -9111 -745 -728 -4729 11665 11080 -9994 -6869 2404 -3099 6183 11455
610A1455k0079k107J3795m472K520J0947j6834j0649J6374K067l004R442j1058
$$ 11455 -8624 -10731 3064 -1408 1112 12059 -4775 -15424 950 3017 13 9455 -1603
623a603j3417J5857O045r005J0245k485k1416J1285J7209j0841j93M849j7258
$$ -1603 -15020 837 6882 -2123 8122 5637 -15779 -4494 12715 1874 1681 6530 -10728
636a0728K537J9990p497n883P780j4156n515K3488p21j4919P229n042r993J8808
$$ -10728 -8191 11799 4302 -1581 6199 -7957 -13472 10016 9295 -5624 1605 -3437 -13430 5378
650E378O599j7293M373J377j4438J5098J6449j9665n446J0641r849L269J9146
$$ 5378 11977 -5316 -943 434 -14004 1094 17543 -2122 -7568 3073 -6776 -3507 15639
663A5639j1627j3021J0620m762k363J9692n710k0168R109M564q187J4135L313
$$ 15639 4012 -9009 1611 -3151 -5514 14178 8468 -11700 -2591 1973 -6214 7921 11234
676A1234k1415K781J0091p972Q987R507k1279m639J7084m290j308J2849j3090
$$ 11234 -10181 -7400 2691 -5281 3706 13213 -8066 -12705 4379 89 -1219 11630 -1460
689a460j2597J6014K834n855J0892p336j7126J4313R724j0149N712J090j8500
$$ -1460 -14057 1957 4791 -1064 9828 2492 -14634 -321 9403 -746 4966 6056 -12444
702a2444O758J5717q239j161N311j6139p1K0065m604q923P446q930p211J8254
$$ -12444 -5686 10031 1792 631 5942 -10197 -10268 9797 5193 -3730 3716 -5214 -12425 5829
716E829L275j2520L912k584r060J4522Q654j3831m65L909r931P817J3670j1078
$$ 5829 9104 -3416 496 -2088 -11148 3374 12028 -1803 -2268 1641 -8290 -473 13197 2119
730B119p128N973n956K295J5081p905j2284O444o02k735J2918q42j4873K471M246
$$ 2119 -5009 964 -4992 -2697 12384 4479 -7805 -1361 -1963 -4698 8220 7378 -7495 -5024 -778
745g78l177R126L001j4882q49Q207k311M430O633j2233o361R982Q54L45O355q531
$$ -778 -3955 5171 8172 -6710 -7559 648 -1663 2767 9400 -2833 -9194 788 1642 1987 8342 -189
761a89r183Q755M813k752M522l905j0852M972Q827k514M88j204r476J850R939
$$ -189 -9372 -617 4196 1444 5966 2061 -8791 -3819 5008 2494 2982 1778 -7698 -5848 4091
776D091j206k102M21p365j009J0095K607m891l23m360k299Q798M154m760j848
$$ 4091 2885 783 1204 -6161 -7170 2925 5532 641 318 -4042 -6341 2457 6611 1851 3
791Ck381k724O230O414l943m978j261j583M530O079k807n726j259o84L156O231
$$ 3 -2378 -5102 1128 7542 3599 -1379 -2640 -4223 307 6386 3579 -2147 -3406 -4090 -934 5297
807E297j341o800k157J509K635M762p6n562l350J927L060M156R60n571m136J799
$$ 5297 3956 -2844 -5001 -3492 -857 3905 3829 -1733 -5083 -3156 -96 4060 5020 -551 -4687 -2888
823b888L977L363L40m559m135J439L918L039n24l886m176M24M384K807j33m153
$$ -2888 1089 4452 4792 233 -3902 -2463 1455 4494 3970 84 -4092 -3668 716 3523 3390 -763
839g63l600k5L989M020n07m209l312%M235M123m91m121l178M97L519L888N49m417
$$ -763 -4363 -4388 -399 3621 3114 -1095 -4407 -4407 -172 3951 3460 -661 -3839 -3342 177 4065 4614 197
857A97l437N14L234L666L28m132m046P86K916L312R14m397m356R28L208K642J106
$$ 197 -3240 -2726 508 4174 4502 370 -3676 -2890 26 3338 4252 -145 -4501 -3573 -365 2277 3383
874C383l762l985N07L667K705P92k990m334J19M204L148K51k680m132n72M297
$$ 3383 -379 -4364 -3857 -190 2515 3307 317 -4017 -3898 306 3454 3705 1025 -3107 -3679 618
890F18L062K50k608m037p24M118K994l14k753l890m96L135L397M01k856l980r23
$$ 618 3680 3930 1322 -2715 -3439 679 3673 3359 606 -3284 -3780 -645 2752 3153 297 -3683 -4606
907d606L781L825k80k537l281j145L579L674m7k138l117j478L253M368k20k446
$$ -4606 -825 3000 2720 183 -3098 -4243 -664 3010 2963 825 -2292 -3770 -517 3851 3631 1185
923A185k796j835L250L823O7k725k844j760K610M274n2k923k482j777J781M822
$$ 1185 -1611 -3446 -196 3627 3694 969 -1875 -3635 -1025 3249 3197 274 -2208 -3985 -2204 2618
939B618O75l561k070j309J106N375J256m324k171L8L30N035J804m424k737P49
$$ 2618 3293 -268 -2338 -3647 -2541 2834 4090 -234 -2405 -2367 -2037 2998 4802 378 -2359 -1610
955a610L3L896L285m601m127J648K05K177M231l671n473J432J379J076M127j961
$$ -1610 -1577 2319 5604 1003 -3124 -1476 -1271 906 5137 1466 -4007 -2575 -1196 -120 4007 2046
971B046o694J119L169pL247J94p093j34M750K46J825J294o299k315N952R24n15
$$ 2046 -4648 -3529 -360 -367 2880 3074 -4019 -4153 597 843 2668 3962 -2337 -4652 1300 2224 1709
988A709K484n160m140N862K568k206J615k996n622M820N134l547N45n91o480K802
$$ 1709 4193 -967 -5107 755 3323 1117 2732 -264 -5886 -1066 4068 521 1066 475 -6005 -3203
1004c203P301k631k223J408n191O8Q765r14m424J793k994k383Q075K251o711O80
$$ -3203 4098 1467 -756 652 -4539 -4471 4294 3380 -1044 749 -2245 -4628 3447 5698 -1013 -333
1020c33j30l697O173M594p100j394J882l787L574O735n946m500L436j922P32P117
$$ -333 -463 -4160 2013 6607 -493 -1887 -5 -3792 -218 6517 571 -3929 -493 -2415 -1683 5434
1036E434l550o816L279L47j067P003k95r042J609L589j945M481K230q338j003
$$ 5434 1884 -4932 -1653 -1306 -2373 4630 4335 -4707 -3098 491 -1454 3027 5257 -3081 -4084
1051d084N637j377J727L835o982m618O746O30j003L739m628n991N794K923k780
$$ -4084 1553 176 1903 5738 -1244 -5862 884 1514 511 4250 -378 -6369 -575 2348 -432
1066d32L355k129p567M338N645k941O41O91o647J338P245j309j878J641n368p46
$$ -432 2923 794 -6773 -2435 3210 269 910 1601 -5046 -3708 3537 2228 350 1991 -3377 -4123
1082d123P730L86l740J115k868k930O924K307m597j64j181l253M893M592m916
$$ -4123 3607 3993 253 1368 -1500 -4430 2494 4801 204 40 -1141 -4394 499 5091 175
1097A75k026N68k605K717N834l193m255J291j428J651N591j805m795K78O85M25
$$ 175 -1851 -1283 -3888 -1171 4663 1470 -2785 -1494 -2922 -1271 4320 2515 -2280 -2002 -1317 -892
1113h92M853m00n404k96J264M09L933J159n977j776K248R56K009J266l948l400
$$ -892 3961 3561 -1843 -2139 -875 -466 3467 4626 -1351 -3127 -879 77 2086 3352 -596 -3996
1129c996K127J596J918J409m105l209J709K917J496Q91l070l318J442K771J689
$$ -3996 -1869 -273 1645 3054 -1051 -4260 -2551 366 1862 2753 -317 -3635 -2193 578 2267
1144B267J141l040l566J126L610J487J7k486l454Q48K534K204K36k608m156J136
$$ 2267 3408 368 -3198 -2072 1538 3025 3042 556 -2898 -2050 484 2688 2924 316 -3840 -2704
1160b704L482J155K70j968m099N88L677J242N05j266m607L18M540J261o52p50
$$ -2704 778 1933 2203 235 -3864 -3276 401 1643 2148 882 -3725 -3407 1133 2394 1742 992
1176I92l581q64M659J740r51j17l712k399N984K511l090p02j357l206L912M178
$$ 992 -2589 -3453 1206 2946 1995 1878 -1834 -4233 1751 4262 1172 470 -887 -4093 -181 3997
1192C997k784j623p12l388L195N619k728l337P87k247J148O062j199m404P39j421
$$ 3997 1213 -410 -1122 -4510 -1315 4304 1576 -1761 -974 -3221 -2073 3989 2790 -1614 -875 -2296
1208b296J57O629J52p042R27J053j524M619K724o625j548K522j700L461M121o213
$$ -2296 -2139 4490 4642 -2400 -1473 -420 -1944 2675 5399 -1226 -2774 -252 -1952 1509 5630 -583
1224e83l992M474o46M04M883m158n950M138K026j321M600j761p876L462M962l340
$$ -583 -4575 -101 -747 -343 4540 382 -5568 -1430 596 -725 3875 2114 -5762 -2300 2662 -678
1240f78L097R38p310Q7O954j573%K445o941j878P902j77l248L107l687n027O516
$$ -678 2419 3357 -3953 -3866 3088 1515 1515 3960 -2981 -4859 3043 2866 -382 2725 -962 -5989 527
1257E27L415m445J871j889n797N672N740n424m81J703n919K603P796l441l582
$$ 527 3942 -503 1368 -521 -6318 -646 5094 -330 -811 892 -5027 -2424 5372 1931 -1651
1272a651K313l450k74Q421j777o147K951r02l003O947K102p674L08K090l452N089
$$ -1651 662 -2788 -3062 5359 3582 -2565 386 -516 -3519 3428 5530 -2144 -1836 254 -3198 1891
1288A891L758p574j710L750k496J866O106n659n296M713L48o22N521k891p084
$$ 1891 5649 -1925 -3635 115 -2381 -515 5591 -68 -5364 -651 -303 -925 4596 1705 -5379
1303e379M101K627k022L969J02p807J594N010j635J769J536p242p41O523q31r74
$$ -5379 -1278 1349 -673 3296 3398 -4409 -2815 2195 560 2329 3865 -3377 -4118 2405 1574 600
1319F00K619m860l749O211J736k433J642k844m522N533L477l384M85j85m973K939
$$ 600 3219 -1641 -5390 821 2557 124 1766 -1078 -5600 -67 3410 26 511 326 -4647 -1708
1335a708N730k655j579Q52l836J163O462j795l440J075k008r69O125N57n008j30
$$ -1708 4022 1367 -212 640 -3196 -2033 4429 2634 -806 269 -1739 -2708 3417 3974 -1034 -1164
1351a164J04j392M662J664m772j331J043j317K784L807l885l443J733L70J320
$$ -1164 -1060 -2452 2210 3874 -898 -2229 -1186 -2503 281 4088 203 -3240 -1507 -1137 183
1366A83L466k789l747J592J287J77L150r70m962N51K563M37J911p02m402m30L248
$$ 183 3649 860 -2887 -1295 -8 169 3319 2349 -2613 -2062 501 938 2849 2147 -2255 -2685 563
1383E63K35Q89K77l927k155L491K080R8p01k408j732K627K222k57l24j796k207
$$ 563 798 1687 1964 -1963 -4118 -627 1453 1551 850 -1558 -3290 -663 1559 1302 978 -818 -3025
1400c025J721L926l47j622j352j482J180L181K57j391j280j663O32L168J078k374
$$ -3025 -1304 2622 2275 653 -699 -2181 -1001 2180 2437 1046 -234 -1897 -1265 1903 2981 607
1416F07j891p35P35K360J016j569k077o82L95K365J899j607k608q26J792J884
$$ 607 -1284 -2019 -1284 1076 2092 523 -1554 -2236 -1841 524 2423 816 -1792 -2618 -826 1058
1432A058R21r45k292m54R14J815J909j008k889r75J454J856Q62r21k231j112P16
$$ 1058 1979 1034 -1258 -1712 -798 1017 2926 1918 -971 -1946 -492 1364 2226 1305 -926 -2038 -1322
1449a322K425P60o77k239j501J329K021P49p79j813j437Q00K360J211o93k093
$$ -1322 1103 1863 1186 -1053 -2554 -1225 796 1545 766 -1047 -2484 -1684 676 1887 1194 -899
1465h99j391J017K386J291j279j477j038J72K053J788q24k139j581M24K588J556
$$ -899 -2290 -1273 1113 2404 1125 -352 -1390 -1218 835 2623 1799 -340 -1921 -1497 1091 2647
1481B647j543j897j158K83J885J835r86j934j630N96K345J766j458j929n06K13
$$ 2647 1104 -793 -1951 -1668 217 2052 1066 -868 -2498 -1902 443 2209 751 -1178 -1684 -1471
1497a471J896J725n13k014j038lJ553K429o17k611q61R04Q55J596N7k171j767
$$ -1471 425 2150 1637 -377 -1415 -1418 135 2564 1947 -664 -1525 -621 234 1830 1887 -284 -2051
1514b051P26J307J795J28k883j479J403R25J014O69k116k059J320J577J202M99
$$ -2051 -1325 -18 1777 1905 -978 -2457 -1054 -129 885 1554 -562 -2621 -1301 276 1478 1977
1530A977k062k266J409K192r6O46o79l055N02K711M12j97n35l189L68L039K04
$$ 1977 -85 -2351 -942 1250 1154 1800 1121 -1934 -1432 1279 1691 1494 959 -2230 -1862 1177 1381
1547A381p63K48k642q48L212J130j164l94j725j228L256J622j545q26l30j918
$$ 1381 618 866 -1776 -2624 588 1718 554 160 -1565 -2793 463 2085 540 -286 -616 -2534
1563b534K336L017j549j451r3j971J659L882j662k340P03j506J41M563q30l491
$$ -2534 -198 2819 1270 -181 -274 -2245 -586 3296 1634 -706 -3 -1509 -1368 3195 2365 -1126
1579a126L12m71j87L310Q77m327j63J148j017K608K075l959k070K376j69J265
$$ -1126 -814 -1285 -1472 1838 2715 -1612 -1775 -627 -1644 964 3039 -920 -2990 -614 -783 482
1595D82K889l159l129K728N71m02L326j732m407J835K096r04J979p9n288J068
$$ 482 3371 212 -2917 -189 382 -20 3306 1574 -2833 -998 1098 194 2173 2094 -3194 -2126
1611b126L676j423Q19J192m410j264M803j16j161J311l031j903M457J234j959
$$ -2126 1550 127 946 2138 -2272 -3536 1267 1151 -10 1301 -1730 -3633 824 2058 99
1626I9J302j804l590M191L215l115p6Q2l245K327M038k172j720J098k961N97M974
$$ 99 1401 -403 -3993 198 3413 298 222 304 -2941 -614 3424 1252 -468 630 -2331 -1734 3240
1643C240j150l719J656j504r96M681N02m323L17M55j747L872K432m694j297K219
$$ 3240 2090 -1629 27 -1477 -2473 2208 2710 -1613 -1296 -841 -2588 1284 3716 -978 -2275 -56
1659e6j326J773L493l331k740K098m04M43L694k409m312K436J176o06K870r73
$$ -56 -1382 391 3884 553 -2187 -89 -493 -50 3644 1235 -3077 -641 535 -71 2799 1826
1675A826m951J205K755q29J426N59m590k77L819m39J14J197l256j925L698J032
$$ 1826 -3125 -1920 835 6 1432 1991 -2599 -2876 943 504 618 1815 -1441 -3366 332 1364
1691A364p36R74k390k425L437K280j504K51j032l084K535L071j598q08l70k770
$$ 1364 628 1602 -788 -3213 224 2504 1000 1251 219 -2865 -330 2741 1143 335 -35 -2805
1707b805J495M034j087k000q1j585l2L747L75k758l98o60M2L149J045k745j185
$$ -2805 -1310 2724 1637 -363 -444 -2029 -2061 1686 2061 -697 -1095 -1755 -1713 1436 2481 -264 -1449
1724a449L68j56K448J724k445k262O01N39J845J715k121k938J109N22J219J429
$$ -1449 -1081 -1237 1211 2935 490 -1772 -1171 -632 1213 2928 807 -2131 -1022 -500 719 2148
1740B148q97l172J20J400R50J026p61k742l02J845Q61R33o93k120n71J617J536
$$ 2148 1251 -1921 -1801 -401 549 1575 814 -1928 -2230 -385 476 1409 716 -1404 -1975 -358 1178
1757A178N95r66j631o52J073J851L23r14j661j046J084J745J250j709j825l62
$$ 1178 1773 807 -824 -1476 -403 1448 1771 857 -804 -1850 -766 979 2229 520 -1305 -1667
1773a667Q75J891O19j096j930o35Q20J868J239j405k394n3J710P23Q68m46j972
$$ -1667 -792 1099 1718 622 -1308 -1943 -1123 745 1984 579 -1815 -1868 -158 565 1433 987 -985
1790i85q43J623J323M83l77k392j184K125J646r2l50j166j836J176K180K58j211
$$ -985 -1828 -205 1118 1601 1224 -1168 -2352 -227 1419 1327 977 -189 -2025 -849 1331 1589 378
1807C78j159j705J357K471l06j051l29j491j48L044O73j684m53j070k17L059R39
$$ 378 -781 -2486 -1129 1342 1036 -15 -344 -1835 -1983 1061 1734 50 -403 -1473 -1690 1369 2308
1824B308k281m46j27o72K028K095k027j724j13j20J679J984k276j722N55N9J84
$$ 2308 27 -419 -546 -1218 810 2905 878 -846 -959 -1079 600 2584 308 -1414 -859 -800 -616
1841f16K950j062l207M20J003L00J840l95k818j76J834k79J167J037k938r93K069
$$ -616 2334 1272 -1935 -1515 -512 -212 1628 1233 -1585 -1761 73 -206 961 1998 -940 -1933 136
1858A36J79P75P17k151j621K199R54n52J020j353k742J449K390r50N18q13k390
$$ 136 315 1090 1807 -344 -1965 234 1188 636 1656 303 -2439 -990 1400 450 968 155 -2235
1875b235R23K387m59n96M09k376P3K859N01j432k3j077o85K745R91j972L7m25
$$ -2235 -1312 1075 616 20 429 -1947 -1874 985 1486 54 31 -1046 -1731 1014 2005 33 70 -355
1893c55j235K054J954j878j322M46j032J406K284j863j297J82m11L34K572q31
$$ -355 -1590 464 2418 540 -782 -336 -1368 38 2322 459 -838 -656 -1067 -733 1839 1008
1909A008k462M57K05L3K203j29k493p9P10J4J831P02k607j058J691J67P99P97
$$ 1008 -1454 -997 -792 -759 1444 1315 -1178 -1257 -547 -533 1298 2000 -607 -1665 26 193 992 1789
1927A789j690j809J202Q22L16Q29j309j828Q00J737k10J46p34j813L13J717K97
$$ 1789 99 -1710 -508 314 630 1459 150 -1678 -878 859 649 795 61 -1752 -1439 278 575
1944E75K37n23k134J05K191N01k51l48j375l85J556J301m31o90p77q16J379J659
$$ 575 812 289 -1845 -1740 451 952 701 353 -1022 -1407 149 1450 1019 329 -448 -1264 115 1774
1962A774q43j125n93m50J100J649m00j409p51n65Q77J764j52j324o16q4N55J724
$$ 1774 931 -194 -787 -1237 -137 1512 1112 -297 -1048 -1613 -736 1028 876 -448 -1064 -1148 -593 1131
1980A131L1j319r42L5P15J693L90j602j095R8Q65J053M9m85j622k34J168J042
$$ 1131 1162 -157 -1099 -1064 -349 1344 1734 132 -963 -865 0 1053 1102 617 -1005 -1239 -71 971
1998I71K26o95j811r6J174R58L50j068j345n43J723R29K60p29j341n90J407J532
$$ 971 1197 502 -1309 -1405 -231 727 1077 9 -1336 -1879 -156 773 1033 304 -1037 -1627 -220 1312
2016A312O1j082j001n27R86J387L86j267r88l30P01J610R8j115j185k66P26J279
$$ 1312 1373 291 -710 -1237 -251 1136 1522 255 -733 -1063 -362 1248 1346 231 -954 -1220 -494 785
2034G85O23j474j089m52J007J306N23j188j390K19M05J563M42p80j520j07Q74
$$ 785 1408 -66 -1155 -1607 -600 706 1229 41 -1349 -1130 -725 838 1280 500 -1020 -1127 -253
2051b53J304L98q98j286l16J047Q90N59o73j501n12Q04J443K46j016j271m22J214
$$ -253 1051 1449 551 -735 -1051 -4 886 1445 772 -729 -1241 -437 1006 1252 236 -1035 -1457 -243
2069b43J173J39q55j325l77P82J671J29r20j079m32R11J456M90r01j280l54J141
$$ -243 930 1069 214 -1111 -1488 -706 965 1094 174 -905 -1337 -426 1030 1520 619 -661 -1015 126
2087A26O92O77p92j347n98Q85J279M89p20j303j132J367J355K16j097j020q10
$$ 126 818 1495 703 -644 -1242 -357 922 1411 691 -612 -1744 -377 978 1194 97 -923 -1733
2104a733J099J411L49r17j062p32R84J507N19j093p69n50M06J781L58j154r63
$$ -1733 -634 777 1126 209 -853 -1585 -601 906 1425 332 -437 -987 -581 1200 1558 404 -559
2121e59j98j4J756J026j767j258n2J52J459J194j496j344J64M23P90J122j011
$$ -559 -757 -771 985 2011 244 -1014 -1066 -914 545 1739 243 -1101 -937 -514 276 1398 387
2138C87j988P57N66L74J406q79j855J74J043L76P97k82j684k43J290L77N34k1
$$ 387 -1601 -844 -278 96 1502 623 -1232 -1058 -15 361 1158 876 -808 -1051 239 616 1150 1129
2156A129j992o51J740M37J0L88j497j607J917J040m45J24r20j680J239K062p60
$$ 1129 -863 -1514 226 663 673 1061 -436 -2043 -126 914 469 593 -327 -2007 -768 1294 534
2173E34l34j11j990Q71K556n44n59k11j092l36K688l6j772O05j393j47K318Q04
$$ 534 200 89 -1901 -1030 1526 982 423 212 -880 -1216 1472 1436 -336 269 -1124 -1271 1047 1851
2191A851k250m9n5j052J919J445j842q31K11o91J233J944j584j668R13O3J43K126
$$ 1851 -399 -448 -503 -1555 364 1809 -33 -864 -653 -1344 -111 1833 249 -1419 -506 -443 -300 1826
2209A826q82k333R29M54m32J882K36k786J28J400k40R35N34k660m74J800k29J28
$$ 1826 944 -1389 -460 -6 -438 1444 1680 -1106 -978 422 182 1117 1651 -1009 -1483 317 88 216
2227B16J506k419j240K093K28l51J027j087j942J460J414n95K99r6k409J031K351
$$ 216 1722 -697 -1937 156 384 33 1060 -27 -1969 -509 905 310 609 513 -1896 -865 1486
2244A486p43n36L65j864J20K608P7j503L82j099q74K688O65k014rk00j112J814
$$ 1486 743 207 572 -1292 -1172 1436 1513 10 392 -707 -1581 1107 1772 -242 -251 -451 -1563 251
2262B51J556k251j61K37j165J372K056j587j225N55m36J31K427q99j934N81J46
$$ 251 1807 -444 -605 -368 -1533 -161 1895 308 -917 -362 -798 -667 1760 861 -1073 -492 -346
2279c46O4J789mk221Q9R57n64J238M93k350l57J217j84O01J056k130j212J423
$$ -346 -282 1507 1503 -718 -629 328 -236 1002 1495 -855 -1212 5 -179 422 1478 -652 -1864 -441
2297d41O89j84J060j217j656J072J408n40N92m50j923P84J780l73R3j62j594o8
$$ -441 248 64 1124 -93 -1749 -677 731 191 783 333 -1590 -806 974 601 694 532 -1062 -1130
2315a130J987J75m84j10j466k22J869O39j029j12q77o33J262J424j207k77n30
$$ -1130 857 1032 548 438 -1028 -1250 619 1258 229 117 -760 -1393 -131 1293 86 -191 -721
2332g21n61J236J187p24r90n2k58N93J572j01j599K4q8L68J158J54j372m33J12
$$ -721 -1282 -46 1141 417 -573 -625 -883 -290 1282 1181 -418 -394 -482 -114 1044 1198 -174 -607 -495
2351d95L69J087K68j624n54Q9R24N49M76j129j025L99K53P51N78r20j098J25J016
$$ -495 -126 961 1229 -395 -949 -860 64 613 1089 -40 -1065 -666 -413 338 916 -4 -1102 -977 39
2370C9P40K27p90j172L63J048L81mm45q97k18R93Q07k00p93p97l89J019P46P1
$$ 39 779 1006 216 -956 -593 455 836 832 387 -510 -728 265 1072 872 79 -718 -1107 -88 658 729
2390G29n84q98j84M66J301k68o45p50J82M61P82K06q42p09q2P61P17P16j370q28
$$ 729 145 -753 -937 -471 830 562 -83 -833 -651 -190 592 798 -44 -753 -835 -74 643 1359 -11 -839
2410h39N02N18L82L00o43j024K78O68N44Q9o20r59n2Q67O23j63l73r55k71P90
$$ -839 -337 181 563 863 220 -804 -526 142 686 775 155 -804 -856 11 634 471 98 -857 -1128 -338
2430c38R21J83m34j197m59J291Q56L5n30o30j041J251R94k2n91n05m17M42J202
$$ -338 583 766 332 -865 -1324 -33 823 858 328 -302 -1343 -92 902 880 289 -216 -633 -191 1011
2449A011J31j237m00n82O68J097K19r20o74l7Q2J122N46r97j077L41N25M02Q00
$$ 1011 1142 -95 -495 -1077 -409 688 907 -13 -687 -724 -642 480 1026 29 -1048 -707 -182 220 1020
2468A020r47r69L90M66P07M80o50j274L62L99N08N80p45j276k9R09O27J23l44
$$ 1020 73 -896 -506 -40 667 1147 497 -777 -415 -16 492 1072 327 -949 -978 -69 558 681 337
2487C37j100l50Q51R72J61n17j189k56O82R33J00k24p60p31J098Q19P1n82m07
$$ 337 -763 -1113 -262 710 871 354 -835 -1091 -409 524 624 400 -360 -1091 7 826 897 315 -92
2506i2n92K25J079N24j085m44l14L85J197r1p18m66m76M06J078L96q78n84m60
$$ -92 -684 -459 620 1144 59 -385 -699 -314 883 792 74 -392 -868 -462 616 1012 134 -450 -910
2525i10L75R50K76m44p67n28N15J046K25m72o06n46O55P92N74p05r29l46L50R73
$$ -910 -535 415 691 247 -520 -1048 -533 513 738 266 -340 -886 -231 561 1135 430 -499 -845 -495 478
2545D78M25m43p41n95M31Q15L57k00r92n34M19P05O63j70j054m52K23Q78Q26p07
$$ 478 903 460 -281 -876 -445 370 727 527 -465 -999 -580 125 788 618 -436 -888 -665 213 1039 332
2565C32o03m21L97P73N27n73q51j72J64Q91M71l54q73k37K48M30Q67o10q32m42
$$ 332 -271 -692 -295 478 1005 432 -419 -591 -427 464 935 581 -292 -529 -281 149 1016 406 -426 -868
2585h68O22N48K67j58q34m42K80Q46L96L4r81n42N59P50L31m7j247m41N74Q64
$$ -868 -246 302 569 411 -423 -865 -585 261 657 691 -290 -832 -273 477 808 761 -486 -927 -353 511
2605E11L32l44k53j274O53P97M19l78m66j089L69J075K60l92o30l48Q3R49O14
$$ 511 843 499 246 -1028 -375 422 841 463 -3 -1092 -723 352 612 220 -410 -758 -675 274 888
2624H88m76o04m76j36J052O82m47o50m05j56P77Q92l34r42j95L49L91O26j99p22
$$ 888 412 -192 -668 -804 248 930 483 -167 -572 -728 49 941 607 -335 -530 -181 210 836 637 -85
2644h5o05L12N71P40l51r45l70J11O15P04j57q57p01L60P37K83K83q13o61R1J163
$$ -85 -690 -378 193 933 582 -363 -733 -622 -7 697 540 -317 -1018 -658 79 362 645 -168 -829 -738 425
2665D25K62on57j024N50R24L19l20m50q81K68P63L86O0p00q60qR77N93l17n20
$$ 425 687 681 124 -900 -350 574 893 573 123 -758 -490 273 659 719 19 -841 -849 128 721 404 -116
2686a16p08J1Q25P61n65o10j42j45O99O60j92n71o59L53N57M78K17r46n56L13
$$ -116 -824 -813 12 773 208 -402 -544 -689 10 670 478 -93 -752 -399 158 636 853 -93 -649 -336
2706c36L92N64K28j198m80L02O64O27k02n82p30O4Q14K46J36l53j153O58N19L21
$$ -336 56 620 848 -350 -830 -528 136 763 561 -21 -751 -687 127 373 509 156 -997 -339 180 501
2726E01K58n56p52j31O62O38q3k97n09n83O98R06k16n24k69l60O35Q71n02q56
$$ 501 759 203 -549 -680 -18 620 537 240 -269 -852 -154 752 536 12 -257 -617 18 889 387 -469
2746d69J65k39L24Q26P0j245O0o8O7R05K06p97l54L06j34Q05L58q12p69O48K80
$$ -469 -304 -543 -219 607 677 -568 -508 -576 -509 396 602 -195 -549 -243 -377 428 786 -26 -795 -147 133
2767A33K65P31j011j033O30N46k9N69n61j428O60Q06j36M37k76j407J90J224l39
$$ 133 398 1129 118 -915 -285 261 232 801 240 -1188 -528 278 142 579 303 -1104 -914 310 -29
2786b9M39R3j196k41J133K24k00L45j074m29J086O27n55J86m23j051J161P59p00
$$ -29 410 503 -693 -934 199 423 223 568 -506 -935 151 778 223 409 -14 -1065 96 855 155
2805A55p8J40j059N12J361m52r62K72o14J47J515k37q32qm49k17J359K33j213
$$ 155 77 217 -842 -330 1031 579 -383 -111 -725 -578 937 700 -132 -140 -589 -806 553 786 -427
2824d27J41K23n66Q69P36j000n57M65j42M35Q87p62j117N73l8K77Q65l95j421
$$ -427 -286 -63 -629 240 976 -24 -581 -116 -258 177 1064 302 -815 -242 -280 -3 862 467 -954
2843i54N75N16m88O67J88j391N9J078o8L21K46j346m00J101L74j17J79p22n39
$$ -954 -379 137 -351 316 504 -887 -828 250 182 503 749 -597 -997 104 478 361 540 -182 -721
2862g21P97O68l68N9o66m99M77P83m77o2K66j274N42J230l07m40O3q15k8J406
$$ -721 76 744 376 435 -231 -730 -253 530 53 -9 257 -1017 -475 755 448 8 71 -744 -772 634
2882F34j71o08J13m11k04J032N56j127r6J6k56J176L91j126l09M74k60M12P53
$$ 634 463 -145 -32 -443 -647 385 941 -186 -282 -266 -522 654 1045 -81 -390 84 -176 236 989
2901I89q51r01K75J14L30R78o04j055L33L36j1O24j86r39j74O59Q9M21K20j125
$$ 989 138 -763 -488 -374 -44 934 330 -725 -392 -56 -67 557 371 -568 -742 -83 6 427 647 -478
2921d78O5O33J65J51R3p80p00O56N27K40j65l66r03O19N91m9j00l13o83M49O92
$$ -478 -413 220 385 536 629 -151 -851 -195 332 572 407 41 -862 -243 348 299 199 -114 -797 -348 344
2942C44J51l47m06l70P1Q76J04j77k81m52p5Q80L74n49l62k50n9P20O27m70n23
$$ 344 495 148 -258 -628 -557 319 423 246 -35 -487 -562 318 692 143 -219 -469 -528 192 819 349 -174
2963a74K66n38N68L39o6o03k93J00J61P91l4q35n8N6J85K37K98p60j96K84M14
$$ -174 92 -446 122 461 395 -208 -501 -401 -240 551 517 -318 -376 -320 -135 102 400 -360 -556 -272 142
2984A42L91j83p71J08J21K26O09k8p36l69J94N07O07l51m25p78J01J062K70m50
$$ 142 533 350 -421 -313 -192 34 643 615 -121 -490 -296 211 818 467 42 -736 -635 427 697 247
3004B47k80o14J6P55K67L4n97m88J30R44l1k73j98k25M6M85M82p0p44n73O45M22
$$ 247 -33 -647 -631 124 391 425 -172 -660 -530 414 383 110 -88 -313 -267 218 700 630 -114 -687 -42 380
3026C80M11o44l40l88J51P10M47j45p12l62j50N35L67q0m34l63L25J36N64o7n94
$$ 380 791 147 -193 -581 -430 280 727 582 -130 -492 -642 -107 260 180 -254 -617 -292 -156 408 341 -253
3047b53j72oM99M49J4m82n55P0N47P09o15k23n65K09M64O34l75j75o12j12N58
$$ -253 -425 -431 68 517 531 49 -506 -436 111 820 205 -18 -583 -374 90 724 349 174 -438 -550 8
3068HM86N2o50m37n0P19K42K69r87l08K96O24K00j61k34p39L37M71M29j49j16
$$ 8 494 546 -104 -541 -591 128 370 639 -348 -656 -360 264 464 303 69 -670 -333 138 567 418 302
3089C02n27k28O99L03k7n32l58K7N50K88m14l85k69M0N10M71k36m56k73o8M16
$$ 302 -225 -453 246 549 522 -10 -368 -341 209 497 83 -302 -571 -531 -21 450 214 -242 -515 -583 -167
3110a67L87L17n24m25J23K04O02M3o32j79M9K93L04J34n41o65L36L27L64L11o44
$$ -167 220 537 13 -412 -289 -85 517 560 -72 -251 -202 91 395 529 -12 -677 -341 -14 350 661 17
3131A7n33L11R4M41jj70q95L93K43K88L33n62p33M84M30r5L21l50o28L97K56M90
$$ 17 -516 -205 -111 330 329 159 -736 -343 -100 188 521 -41 -774 -290 140 45 366 16 -612 -215 41 531
3153E31m6m45l87J41N91M6j22l88j19m37P54J44r4j35k10m78O56M98l56l52k3
$$ 531 485 40 -347 -206 385 431 309 -79 -198 -635 119 263 169 34 -176 -654 2 500 144 -208 -231
3174b31k4j96P03J6j97n42R6J06O29L79q39m2j33J09O00K6o18j55J11K21K14M28
$$ -231 -255 -451 252 268 71 -471 -375 -269 360 739 -100 -142 -275 -166 434 460 -158 -313 -202 19 233 661
3196F61n76n97J41K44L94K73m54n17L93J33j81M87l80m91K84L21J61K20k51o54
$$ 661 85 -512 -371 -127 267 540 86 -431 -38 95 -86 401 21 -470 -186 135 296 516 265 -389
3216c89j50P52N1l1K03o26m12P21L99j99J81q24l59P59K98r1J6m76m62L81M79
$$ -389 -539 213 264 233 436 -190 -602 119 518 319 500 -324 -683 76 374 283 299 -177 -639 -258 221
3237B21k19L3r3p17N91M35J16l22k40j48P7O12N21p83K2m01L5N27J90j70l95J70
$$ 221 2 35 -58 -775 -184 251 367 45 -195 -343 -266 346 867 84 106 -295 -260 267 457 287 -108 62
3259F2l40L92N51l56p31J24Q9J76M03j90l90k54K24K90L33j08m99J9l3N20M7J24
$$ 62 -278 114 665 309 -422 -298 -209 -33 370 180 -210 -464 -240 50 383 275 -224 -205 -238 282 329 453
3281D53p38j72L71J13R2K65p44k18K28M98K43j55k25m22K93J90K68j95l98j89
$$ 453 -285 -457 -86 27 119 384 -360 -578 -350 148 391 236 11 -411 -118 72 340 145 -253 -442
3301d42K0P58j67L6j78k62k22M88L17k06j98k22j36O73M21m64n1m02M9M12K11
$$ -442 -422 336 169 205 27 -235 -457 31 348 142 -56 -278 -414 259 680 216 165 -237 -188 224 435
3322D35j17n29k24L72o8M07j99l70p6j09N71L35K07q27l11L47J79J38J12m38l07
$$ 435 318 -211 -435 -63 -131 276 77 -293 -369 -478 93 428 635 -192 -503 -156 23 161 273 -165 -472
3343d72J73P56j58n1r7p85N22K76L69l45j96n14J23P00O2j83l66J07m06O85L38
$$ -472 -299 457 299 248 151 -634 -112 164 533 188 -8 -522 -399 301 363 180 -186 -79 -485 200 538
3364E38m32m27j6L5M93M90m52l97o3l10N03M45j8o36j48K68J57N82k12o65m6J99
$$ 538 106 -321 -337 -302 191 681 229 -168 -231 -541 -38 407 389 -247 -395 -127 30 612 400 -265 -311 -112
3386a12N1L64J19p28M3p7M34L78p0n13k95K26K53L64j09m26l12K69L60r4M3j72
$$ -112 -61 303 422 -306 -263 -340 94 472 402 -111 -406 -180 73 437 328 -98 -410 -141 219 125 168 -4
3408do47O63L03K28k72j43m89KO01L11k30l15n28N0O45p1N3k39k71k44P71M05
$$ -4 -651 12 315 543 271 128 -361 -359 242 553 323 8 -520 -470 175 104 157 -82 -353 -597 174 579
3430E79o29j40j17l3N79N92p21k00m63K71L80O09j12n54j41k69M23M12k38l79
$$ 579 -50 -190 -307 -340 239 831 110 -90 -553 -282 98 707 595 41 -100 -369 54 466 228 -151
3450a51j64J77J08J62K88o41j67J45P1M41m9n96j49K89K21L54J1p13r0J90O42
$$ -151 -315 -138 -30 132 420 -221 -388 -243 -172 269 220 -376 -525 -236 -15 339 350 -363 -453 -263 379
3471C79j45R8l02l70L7L79K49O0k30n06J20L03J83j04L9n17L4J90N07j6k07m38
$$ 379 234 332 30 -340 -303 76 325 385 155 -351 -231 72 255 151 190 -327 -293 -103 404 388 181 -257
3493b57k95M57R9j97p7J94k85L06M66j91j39q9n11O56M17l83j14l03j42L74N40
$$ -257 -552 -95 4 -193 -270 -76 -361 -55 411 220 81 -8 -519 137 554 171 57 -246 -388 -14 526
3514E26K7o22l4j8j79O94l06j43k07k9L17J58K70n49n84L50N03J38J54o21j33
$$ 526 553 -69 -103 -121 -300 394 88 -55 -262 -291 26 184 454 -95 -679 -329 174 312 466 -155 -288
3535b88k46O92K21j02j5o64L11L49J03j59n9m46p3L87K55k1j85m90J76L22K35
$$ -288 -534 158 379 277 262 -402 -91 258 361 202 143 -303 -376 11 266 245 60 -430 -254 68 303
3556C03n4k36j87r0L37K64k58J0l67k87O59K71K7j24k45k78L40j8J80j14j82k48
$$ 303 249 13 -174 -264 73 337 79 89 -278 -565 94 365 392 268 23 -255 85 67 247 133 -49 -297
3578b97K03N55k69J36l81r3J46L25j34k49l80l0M79M1K17j82l22o7L32J13K72
$$ -297 -94 461 192 328 -53 -146 0 325 191 -58 -438 -468 11 52 269 87 -235 -302 30 143 415
3599D15l50k30P2r8L95K43n37j35J50K4M14J2l14K9k21l03O97j72Q0n55j2J23
$$ 415 65 -165 -93 -191 204 447 -90 -225 -75 -51 363 375 61 90 -131 -434 263 91 171 -384 -396 -273
3621b73L74J77p0m05l50M28M37o5K3l11k36J33N08po0k47k37L4J91L46j78n59
$$ -273 101 278 208 -197 -547 -119 318 253 276 -35 -271 -138 370 363 303 56 -181 -147 44 390 212 -347
3643c47R1K14K48J82j04n93R9Q1K98K72l04j10n03L78L63l1j26k33k09L20J46
$$ -347 -256 -42 206 388 284 -309 -210 -129 169 441 137 27 -476 -98 265 234 108 -125 -334 -14 132
3664A32L37n68K96n56J44N27J0j83l77j54J30L33J91l02k7j93j2M07K73p6n78
$$ 132 469 -99 197 -359 -215 312 322 139 -238 -392 -262 71 262 -40 -67 -260 -272 135 408 332 -246
3685b46m3J38J66K12K05n65r1J45L54L05l38m01l5j5M79k15K81l01k10J2L25J15
$$ -246 -289 -151 15 227 432 -133 -224 -79 275 580 242 -159 -194 -209 270 55 336 35 -175 -163 162 277
3707B77j53l03j91K47M25j40p0m2n37J03M26J90k05l15L2Q2L12J80k50M6l12k77
$$ 277 124 -179 -370 -123 302 162 92 50 -487 -384 42 232 27 -288 -256 -174 138 318 68 114 -198 -475
3729d75M48J55q5o9j18l07O63m0Pl16q9k1L59K70k98R7n15J42J94K88P7m04m73
$$ -475 -27 128 43 -26 -144 -451 212 172 179 -137 -226 -247 112 382 84 181 -334 -192 2 290 367 -37 -510
3752e10M54n6M08K34q61n7L60L86r8J36m37l40M53n9J5M31m97m00L73J19o1K34
$$ -510 -56 -112 296 530 -331 -388 -28 358 260 396 -41 -381 72 13 28 459 -38 -438 -65 54 -7 227
3774B27j57k53j75O18L3k72k3m06Q5M57K64l96L6m56L05K02K66N9l00l95M1L75
$$ 227 70 -183 -358 260 293 21 -2 -408 -323 134 398 2 38 -418 -113 89 355 414 114 -281 -240 135
3796A35K00j20j10j86j07K90K56rk95k13j39M30J55K16o93k17L58k3N53j67n89
$$ 135 335 215 105 -81 -188 102 358 349 54 -159 -298 132 287 503 -190 -407 -49 -72 481 314 -275
3817b75j48K91Q3K39K2m67o3L45q8J36K81k19k25O3L32j6J82n17k46K84P7K22
$$ -275 -423 -132 -49 190 212 -255 -318 27 -61 75 356 137 -88 -25 307 291 473 -44 -290 -6 71 293
3839B93n1k97l13M25N1L7J89m87m65J79L56J83J68l11m01J91L28K39k31ll56K
$$ 293 242 -55 -368 57 108 145 334 -153 -618 -439 -83 100 268 -43 -444 -253 75 314 83 80 -276 -274
3861b74K64O27m80l83MmM58J65q8m34j09J73M4L72R0n77j53J29l6M75l08j56J05
$$ -274 -10 617 137 -246 -242 -246 212 377 289 -145 -254 -81 -37 335 425 -152 -305 -176 -212 263 -45 -201 -96
3884i6j61M90r9o1kk95J84J65j21L35j90l14J01j4PN92l99m59L0L43M57m39J11
$$ -96 -257 233 134 73 71 -224 -40 125 4 339 149 -165 -64 -78 -71 521 122 -337 -307 36 493 54 165
3907A65l23n5J25J96nj45l13l5M32J6Q0k41L2l16M56K58l80l9J6l20M83K17%j49
$$ 165 -158 -213 -88 108 103 -42 -355 -390 42 58 138 -103 -71 -387 69 327 -53 -92 -76 -396 87 304 304 155
3931A55n53L8M60J11J52o08J21j87K48K45O1j45n76K97n9J93M18k34l31k4K44
$$ 155 -398 -360 100 211 363 -245 -124 -311 -63 182 243 98 -478 -181 -240 -47 371 137 -194 -218 26
3952B6P6o7j49j82R0K23m8K70j17m38j19N98j8J11N7o28j17L50L52j51n3J05n37
$$ 26 102 35 -114 -296 -206 17 -31 239 122 -316 -435 163 145 256 313 -315 -432 -82 270 119 66 171 -366
3975c66M12O1L7P6j77j11O7K89j28k55l4n6R6M00k12j73r9O8K02K09K16o38l3
$$ -366 46 107 144 220 43 -68 -1 288 160 -95 -129 -185 -89 311 99 -74 -173 -105 97 306 522 -116 -149
3998a49l7J05M06j64r2k34r5m4N66P7n70k48K29J43L9L30j08n16K92l0K00R4N9
$$ -149 -186 -81 325 161 69 -165 -260 -304 262 339 -231 -479 -250 -107 -68 262 154 -362 -70 -100 100 194 253
4021B53m75o4L5L87P3o8k4l61m8L63P5J16j90l25oN66j38J63l36k44p2L73L9M85
$$ 253 -222 -286 -251 136 209 141 117 -244 -292 71 146 262 72 -253 -259 307 169 332 -4 -248 -320 53 92 577
4045E77n93j38NK69J31j62n00L8K93J56L67k16k70l5L8K10J45k75M0k11q0J67
$$ 577 -16 -154 -149 120 251 89 -411 -373 -80 76 443 227 -43 -78 -40 170 315 40 80 -131 -211 -44
4067d4M80l25l22M4o0J42J77j89j5O7OK7M61m44l7k53j54N17M7K25m44l04N34
$$ -44 436 111 -211 -167 -227 -85 92 -97 -112 -45 -39 -12 449 5 -32 -285 -439 78 125 350 -94 -398 136
4090A36j79M67k97q8J53j79K26mj86l29j52L04j2L40Lq3k16j22L62j37J71l48
$$ 136 -43 424 127 39 192 13 239 235 49 -280 -432 -128 -140 200 203 120 -96 -218 144 7 178 -170
4112a70j00O3K88m3O6o8j90L14jl0J57k64k46J24L69q6J45m94k1o8J14J71N2m50
$$ -170 -270 -207 81 38 104 36 -154 160 159 129 286 22 -224 -100 269 183 328 -166 -187 -255 -141 30 82 -368
4136c68J09r9L73K77j98j28l14K07j28K13M4J2j19j74K29N13j50l00k92J66K39
$$ -368 -259 -358 15 292 94 -34 -348 -141 -269 -56 -12 0 -119 -293 -64 449 299 -1 -293 -127 112
4157A12Q3k25k0O2k33K13L76j57k24k46J72O5K30R0j78m39J15N8L10J65n92J89
$$ 112 195 -30 -50 12 -221 -8 368 211 -13 -259 -87 -22 208 298 120 -319 -204 -146 164 329 -263 -74
4179g4J1r2K31J64k09l04O0M83J14j64l21j37K19M4K05m3q5n07k0N38J72R1m43
$$ -74 -63 -155 76 240 31 -273 -213 270 384 220 -101 -238 -19 25 230 187 102 -405 -425 113 285 376 -67
4202f7j96OL38K5J06k51n4k69L63K01K9m8o33KN10Q2K42m10q3Jj31M83j00l34
$$ -67 -263 -257 81 106 212 -39 -93 -362 1 202 231 183 -450 -448 62 144 386 -24 -107 -106 -237 246 146 -188
4226a88R5o0K51J2K8J43o15K30p8M38o2Jk80l03M47N3O6j70l80J69j10O19k45
$$ -188 -93 -153 98 110 138 281 -334 -104 -182 256 194 195 -85 -388 59 112 178 8 -372 -203 -313 306 61
4249F1l59PK05j08K79M10o05p0J9K20N6P2j68j16j96L95K47m11L1k21j58O56K3
$$ 61 -298 -291 -86 -194 85 495 -110 -180 -161 59 115 187 19 -97 -293 102 349 -62 -31 -252 -410 246 269
4272B69l68O5Q1l85M0N43j28L5l35O3N1K94j44j04l5l37L17L29kj61j86R1k7J85
$$ 269 -99 -34 47 -338 -298 245 117 152 -183 -120 -69 225 81 -23 -58 -395 -78 251 249 88 -98 -7 -34 151
4296A51K36l25j06l2K4J86P1o4k73M8J76J83k74J29j62m6N5O2K90k87l4k33N33
$$ 151 387 62 -44 -76 -52 134 205 141 -132 -84 92 275 1 130 -32 -78 -23 39 329 42 8 -225 308
4319C08j69O9k13k0l55L57M8J79j39l00p7K40K05k34K30l32j25M13J88j49R7l53
$$ 308 139 208 -5 -25 -380 -23 25 204 65 -235 -312 -72 133 -101 129 -203 -328 85 273 124 221 -132
4341a32m4RK72o0j21K39n72M33K56r1k69O1k32N5M90p4l57K8o2j79M49M01n62
$$ -132 -176 -167 105 45 -76 163 -409 24 280 189 -80 -19 -251 -196 294 220 -137 -109 -171 -350 99 500 -62
4364f2r7Q7L14P6l01M3Nj90Q9J45K65l70r7j43K84p6M64k84l37J21J51K03k40
$$ -62 -159 -72 242 318 17 60 65 -125 -36 109 374 4 -93 -236 48 -28 436 152 -185 -64 87 290 50
4387E0J26j56p5R2K11k13K01m43l9K83K1j4o0k08j43L08L89j29o7l96L7k9M63
$$ 50 176 20 -55 37 248 35 236 -207 -246 37 58 44 -16 -224 -367 -59 330 201 134 -262 -225 -254 209
4410B09l1j45j44o9J86J71o4k03k9K6o0K04J58k44o4K3l2K09m1K6j25j94M5J7
$$ 209 178 33 -111 -180 6 177 113 -90 -119 -93 -153 51 209 -35 -99 -76 -108 101 60 86 -39 -233 -188 -171
4434a71K33q1l0n0k09K76J84O7m17J19l5MN08k40l76J4M6J99n6M7j25L8J46j93
$$ -171 62 -19 -49 -99 -308 -32 152 219 -198 -79 -114 -110 398 158 -218 -204 -158 41 -15 32 -93 -55 91 -102
4458a02J32J11k14l22L30j21K40k39J07j30K72J00l43M17j02j92l58O70j07J1
$$ -102 30 141 -73 -395 -65 -186 54 -185 -78 -208 64 164 -179 238 136 -56 -414 256 149 160
4478A60r4l72M39o3K06n8j48p9n6L73j32q0j70j38K8L24J09j82q4k3Nq8R0J71
$$ 160 66 -306 133 70 276 218 70 -9 -65 308 176 96 -74 -212 -184 140 249 67 -17 -40 -35 -123 -33 138
4502A38j13m4p4Q2J43K70m95r5Q9N2J46J96m31J9Q7j93L70j68k51n9N54m49N98
$$ 138 25 -19 -93 -11 132 402 -93 -188 -99 -47 99 295 -136 -117 -30 -223 147 -21 -272 -331 223 -226 372
4525C72l87m6j7j54M26r3Jk70N2j35L01J98k45l33J64k7K56K05j60m0k78J02L76
$$ 372 -15 -61 -78 -232 194 101 102 -168 -116 -251 50 248 3 -330 -166 -193 63 268 108 68 -210 -108 268
4548B68j88O6J43m83K8j6J77n3PmO7k6J55o2K4k37m7K47J02K0j25j67L05l54M33
$$ 268 80 146 289 -194 -166 -182 -5 -58 -51 -55 12 -14 141 79 103 -134 -181 66 168 188 63 -104 201 -153 280
4573B80k31j14Nj88J76J99nJ28l88j22K31L82l01r6l83J34M10M1k76J25k72J87
$$ 280 49 -65 -60 -248 -72 127 122 250 -138 -260 -29 353 52 -44 -427 -293 117 158 -118 7 -265 -78
4595g8J71j43K36k22k53j6K15K28k55K21k84n2J87L22j56j50J8LO5J88q0j40l15
$$ -78 93 -50 186 -36 -289 -305 -90 138 -117 104 -180 -232 -45 277 121 -29 -11 -8 57 245 165 25 -290
4618b90J20K7K81ok5l07j35K80K8Q2j11k22J40L08j01J83n04J51j67K57K33J06
$$ -290 -170 -143 138 132 107 -200 -335 -55 -27 55 -56 -278 -138 170 69 252 -252 -101 -268 -11 222 328
4640C28k31j65m21L37K21k4n7J04k52j27L58j56J15j08j87J74oL05j9l34J6R5
$$ 328 97 -68 -489 -152 69 45 -12 92 -160 -287 71 -85 30 -78 -265 -91 -97 208 189 -145 -129 -34
4662c4J31o3j09J73l9J50Q7k43L5m35K22p4K61O9r3JRq9K95J81n93N8N0J46j63
$$ -34 97 34 -75 98 59 209 296 53 88 -347 -125 -199 62 131 38 39 48 -41 254 435 -158 -100 -50 96 -67
4687f7L66k81L0k2k58J62L76l25Ok26J52L20k72j78J66j29J41K19k16O4q3q2l6
$$ -67 299 18 48 26 -232 -70 306 -19 -13 -239 -87 233 -39 -217 -51 -180 -39 180 -36 28 -55 -137 -173
4710a73M64k28kj84l0K93j56J84k44j10J03j30K84k0P1k08J13k15L54j86j10k94
$$ -173 291 63 61 -123 -153 140 -16 168 -76 -186 -83 -213 71 51 122 -86 27 -188 166 -20 -130 -424
4732d24K87K0K82j13J48j79l66L62O2J63j25ok57L4K13K58k23l67J35K26l71L53
$$ -424 -137 -117 165 52 200 21 -345 17 79 242 117 111 -146 -112 101 359 136 -231 -96 130 -241 112
4754A12K0k39j47L58k3j86J56k32J91j8j30L68k75j83q2L93J28o0j07l6p0o6L30
$$ 112 132 -107 -254 104 81 -105 51 -181 10 -8 -138 230 -45 -228 -310 83 211 151 44 8 -62 -128 202
4777B02l0l0j83l41J19N81j94j71o7k1n5L51r7L3j75p9J37M6j22Q9q1L1N4K77
$$ 202 172 142 -41 -382 -263 318 124 -47 -114 -135 -190 161 64 97 -78 -157 -20 26 -96 -7 -88 -57 -3 274
4801B74k99o2K24k41N2J28K13k58j81p6J82J17k2j5j83j52K29J44J89q2l42o5
$$ 274 -25 -87 137 -104 -52 76 289 31 -150 -226 -44 73 51 36 -147 -299 -70 74 263 181 -161 -226
4823b26J87j5J18J92l06K2k66J78N2J74J57l35p3J64L71k63r0k91J7J44K60k27
$$ -226 -39 -54 64 256 -50 -28 -294 -116 -64 110 267 -68 -141 23 394 131 41 -250 -233 -89 171 -56
4845e6L29m11k76L57J35j34J31r4l22L18L04k49n2J23j93J05K68k34M3k66K05
$$ -56 273 -138 -414 -57 78 -56 75 -19 -341 -23 281 32 -20 103 -90 15 283 49 92 -174 31
4866C1j0L39m1n40J31r1O0J28j20m7J63R9k7j41J67pk80o7J55mK88l18p3o0M16
$$ 31 21 360 319 -221 -90 -181 -121 7 -113 -160 3 102 75 -66 101 94 -186 -253 -98 -102 186 -132 -205 -265 151
4891A51J2k60m1OJ13n7K77k67j0k44J59J57J61J1p1j85L8J23R3j74j3k22O6J12
$$ 151 163 -97 -138 -132 -19 -76 201 -66 -76 -320 -161 -4 157 168 97 -88 -50 73 166 -8 -21 -243 -177 -65
4915f5K4L94l89k95K01R5J6m7j22j44L18O6L54l30o3k00K33KK14j23l01K51j78
$$ -65 -41 353 -36 -331 -130 -35 -19 -66 -188 -332 -14 52 406 76 13 -187 46 48 262 139 -162 89 -89
4938h9qJ5P2P8k48J15J14p6k65L16p9k95L69O1l56K91j67l5L45M6Q2j95k77P7
$$ -89 -97 -82 -10 68 -180 -65 49 -27 -292 24 -55 -350 19 80 -276 15 -152 -187 158 204 286 91 -186 -109
4962a09K58o1P2k28K16k03J78K29l33j19j65R9K68P8j7k11j40P8q6K96K10o03
$$ -109 149 88 160 -68 148 -55 123 352 19 -100 -265 -166 102 180 163 -48 -188 -110 -196 100 310 -293
4984b93M7M07l48J24J0J41j94O9l07M53p6P8q9r0K23j25k2j19j57K95K20m09L53
$$ -293 -246 161 -187 -63 -53 88 -106 -37 -344 109 33 111 22 -68 155 30 8 -111 -268 27 247 -162 191
5007A91k09o1o3j67P15j87l54q0q6L8L62L2n8Jj68J33K8j4J6q7j71P8K78O8k20
$$ 191 -18 -79 -142 -309 406 219 -135 -215 -301 -263 99 131 73 74 -94 39 67 53 69 -18 -189 -111 167 235 15
5032A5j9k99J64K46M9j6l10j37J77K56K6k24MPq6J52K25p8k25l6m6L58Q7k75K53
$$ 15 -4 -303 -139 107 156 140 -170 -307 -130 126 152 -72 -68 -61 -147 5 230 152 -73 -109 -155 203 290 15 268
5057B68m28K04N7J1o6j2l76K90K8M46m95k75J31K33O4k1r2R4L1k87J48Q2j06J26
$$ 268 -160 44 101 112 46 34 -342 -52 -24 422 -73 -348 -217 16 80 59 -33 61 92 -195 -47 35 -71 55
5081E5j73RK01j15O0L8k7m6J62j74L01m40K00P3l42O22n66N7J9j6K08J64l55L52
$$ 55 -118 -109 92 -23 37 75 48 2 164 -10 291 -149 51 124 -218 404 -162 -105 -86 -102 106 270 -85 267
5105B67n28l7L54K62l47j21l0Q7M19k45j31J7k66K47J40m6K7m45L02o3K93J21
$$ 267 -261 -298 56 318 -29 -150 -180 -93 326 81 -50 -33 -299 -52 88 42 69 -376 -74 -137 156 277
5127B77j70k48P7j60K84o2J93j74j93O4J66Q4k56O4J12q6J62j73Pk1r8L46n8l52
$$ 277 107 -141 -64 -224 60 -2 191 17 -176 -112 54 138 -118 -54 58 -28 134 -39 -32 -53 -151 195 137 -215
5151b15L09l50J10M2rJ88k78K39l27l3K29K49k5k13j83N37j88j5K32l30j17K44
$$ -215 94 -256 -146 -104 -113 75 -203 36 -291 -324 -95 154 129 -84 -267 270 82 67 299 -31 -148 96
5173I6j27K38m07p9L74k2J31n2n6k01J99l02J91J25N0l17K9r4k82O68k09ll4P6
$$ 96 -31 207 -200 -279 95 73 204 152 96 -105 94 -208 -17 108 158 -159 -130 -224 -506 162 -47 -50 -84 -8
5197hJ02r2J12l62K31K57l24M00l30o1Q8j62J05J58P5l19K07q1J98J8K1k86k5
$$ -8 94 2 114 -248 -17 240 -84 316 -14 -75 13 -149 -44 114 189 -130 77 -4 194 212 233 -53 -78
5220g8J50kQ4Q6j84k84J53J2J59j03j55j68L45P6J21qj23m63J19L83p1Qn1J11
$$ -78 72 70 154 240 56 -228 -75 -63 96 -7 -162 -330 15 91 212 204 81 -382 -263 120 49 57 6 117
5244A17k26L3K6K26j78j1o8J48R1Kl84L44j67l6J54P4O4l90J20k25L70k5P9m62
$$ 117 -109 -76 -50 176 -2 -13 -81 67 158 160 -224 120 -47 -83 71 145 209 -181 -61 -286 84 59 138 -324
5268c24J7M33J46k63Jk9m2R7K65j97l8k33O3M8J88j19k54L33Q1q7j14j5k9M1J10
$$ -324 -307 126 272 9 10 -19 -61 36 301 104 66 -167 -104 -56 132 13 -241 92 173 86 -28 -43 -72 -31 79
5293G9j68L70j17j72j63k43M37J70J5k38q0QL44l07jj1j15N3J86k27J70q2m3j63
$$ 79 -89 281 164 -8 -171 -414 23 193 208 -30 -110 -102 242 -65 -66 -77 -192 -139 47 -180 -10 -92 -135 -298
5317b98L94J12R2k14k17n6L48J21n56L23k65O0K55K05j72m9k70L8O9k8M8R2l13
$$ -298 96 208 300 86 -131 -187 161 282 -274 49 -216 -156 99 304 132 83 -187 -149 -80 -108 -60 32 -281
5340b81K52j59L85M1l47L9j06K44m2K0L23l68K32k55J62k89P3k59J65J90k14M94
$$ -281 -29 -188 197 238 -109 -70 -176 68 26 46 369 1 233 -22 140 -149 -76 -335 -170 20 -194 300
5362C00m79J81M7n8R5q9p7q8r1j4L26lQ7j25P2r4L3j90K16p4J11M9rj26J26l12
$$ 300 -179 2 49 -9 86 -3 -80 -168 -259 -273 53 50 137 12 84 -10 23 -167 49 -25 86 135 126 0 126 -186
5388a86J32nK42J03l54J23o5J50K28M0m27lp9J12M6M4j93P8j96J39K31L7O0j50
$$ -186 -54 -59 183 286 -68 55 -10 140 368 408 -19 -22 -101 11 57 101 -92 -14 -210 -71 160 197 257 107
5412A07k99J94L20k51J12l81L79N4k44L89m20K31j34J1K55k47j21k58O2K14J42
$$ 107 -192 2 322 71 183 -198 181 235 -9 380 -40 191 57 68 323 76 -45 -303 -241 -27 115
5433A15k7L1l06J09J33j58K53k4k73J34K27p1O1K04k64l42L13j00Q7k28P5J59
$$ 115 88 119 -187 -78 55 -103 150 126 -147 -13 214 143 204 408 144 -198 115 15 102 -126 -51 108
5455A08j00l9O1O7l32J85J39n9j05K2q3j98K27j39K34o9j2J99p4P3j96M7L0j13
$$ 108 8 -31 30 97 -235 -50 89 30 -75 -53 -136 -334 -107 -246 -12 -81 -93 106 32 105 -91 -44 -14 -127
5479a27P1j26J85R1j39p9O3O6J97j01n8j98l5J66N0o4n3J40j22K07J29km58O9
$$ -127 -56 -182 3 94 -45 -124 -61 5 202 101 43 -155 -190 -24 26 -38 -91 49 -73 134 263 261 -197 -128
5503a28K7K9J33J18k31j78J69K58M7m10K42J6j05J72l12J17P6k66oJ05K22K2l03
$$ -128 -101 -72 61 179 -52 -230 -61 197 244 -166 76 92 -13 159 -153 -36 40 -226 -232 -127 95 117 -186
5526a86K72j64J12J55j07m15N3J44L45L5k21k03P3Ml5J76M4j54J2q1K96j42j7
$$ -186 86 -78 34 189 82 -333 -280 -136 209 244 23 -180 -107 -103 -138 38 82 -72 -60 -141 155 13 -4
5549dn6j46K31K4K98k48p7j0k16M7K19K40k60j91N5K78j17J46j85j86q3K66j04
$$ -4 -60 -206 25 49 347 99 22 12 -204 -157 62 302 42 -149 -94 184 67 213 28 -158 -241 25 -79
5572g9K41k7j27j00K84k97J39J93l29M2r8J31J73l9k6j49Q2J53Ql05j29O6K51
$$ -79 162 135 8 -92 192 -105 34 227 -102 -60 -158 -27 146 107 81 -68 14 167 175 -130 -259 -193 58
5595E8J21J9r5R9k44Q6n8J26n5j96j34K80r5J11M4k54q6K49O1K04k41l0j55J03
$$ 58 179 198 103 202 -42 44 -14 112 57 -139 -273 7 -88 23 67 -187 -273 -24 37 241 0 -30 -185 -82
5619h2L85j75l38K5P3J52J47Q2l00J0p0j1J78ro7j74J59J1n4M38m92K08j8j78
$$ -82 303 128 -210 -185 -112 40 187 269 -31 -21 -91 -102 76 67 0 -174 -15 -4 -58 380 -112 96 78 -100
5643a00Q8k0K36j13j08K37m51K98J43k81K57q7j00j13j23pJ03O6j29k2J15j82
$$ -100 -12 -32 204 91 -17 220 -231 67 210 -71 186 99 -1 -114 -237 -244 -141 -75 -204 -226 -111 -293
5665b93J33M12q3q1m2P5j28J92Ro1k12J70Mk51m4L95j28k96M32J25k9l35R4j06
$$ -293 -160 252 169 88 46 121 -7 185 194 133 -79 91 95 -156 -200 195 67 -229 203 328 299 -36 58 -48
5689d8N2n7p2J03J45l69K77q8m6L25j87J5k59J62R2J42j94K8%J69l05K62m28L51
$$ -48 4 -53 -125 -22 123 -246 31 -57 -103 222 35 50 -209 -47 45 187 -7 21 21 190 -115 147 -281 70
5713G0j53J28N0P1r1j12q5O6N33n14R5k43R2rL01Nl51J36j01J21j19J41O9Q8k03
$$ 70 -83 45 95 166 75 -37 -122 -56 477 -37 58 -185 -93 -102 199 204 -147 -11 -112 9 -110 31 100 188 -15
5738a5R6r7L4LL0qp7J22Q5M4P2k33k15L36j89J03l75J73K41p5q5j03k2j28L06
$$ -15 81 -16 18 21 51 43 -34 88 173 217 289 56 -159 177 -12 91 -284 -111 130 55 -30 -133 -155 -283 23
5763B3j18J71r9P0n4J12P8r1N1j77r0K83p7j72J43p4q2K0k43K34K40m08O2J85
$$ 23 -95 76 -23 47 -7 105 183 92 143 -34 -124 159 82 -90 53 -21 -103 -83 -326 -92 148 -260 -198 -13
5787a3M9K69k68J24m03k31N97n2j42K23k45K76j6k13J05p9r6O3K21l29K49L5j67
$$ -13 36 305 37 161 -242 -473 124 72 -70 153 -92 184 168 -45 60 -19 -115 -52 169 -160 89 124 -43
5810d3r3N0o1M3L5K30k53j5J89r2J88j52k59N26k85J21j79p3K5K13k02K60j33
$$ -43 -136 -86 -147 -104 -69 161 -92 -107 82 -10 178 26 -233 293 8 129 -50 -123 -98 115 -87 173 40
5833D0j66L04j97J02j26j40j5K45P6J07k40P6n6j06L94p0k82J6J12Rj37J97j3
$$ 40 -126 178 -19 83 -43 -183 -198 47 123 230 -10 66 10 -96 298 228 -54 -38 74 83 -54 143 130
5856A30j47p5K17l1l11M68m98K90j24R6l8J20j65L2l5K5J24j1j07r1K74j56j72
$$ 130 -17 -92 125 94 -217 251 -247 43 -81 15 -23 97 -68 -36 -71 -46 78 67 -40 -131 143 -13 -185
5879a85J78l2k64J28K81j2o4m4r6%l2J24q5J46J65m19J76J43q8k10M4J54n8O1
$$ -185 -7 -39 -303 -175 106 94 30 -14 -110 -110 -142 -18 -103 43 208 -211 -35 108 20 -190 -146 8 -50 11
5903A1O2j14m0lK8%Q0j66L91l74J6Q7L9j48J75mq5J52R4k51k48L57lJ14j25l1
$$ 11 73 -41 -81 -84 -56 -56 24 -142 249 -125 -109 -22 17 -131 44 40 -45 107 201 -50 -298 59 56 170 45 14
5929A4r7q6K77J34k71K30k94K02r1P2j40L0m5k45M63k08J78Rj8j82k0K93k45J03
$$ 14 -83 -169 108 242 -29 201 -93 109 18 90 -50 -20 -65 -310 153 -55 123 132 114 -68 -88 205 -40 63
5953F3j66n5J44m3rO8J15j70J13J8q5n4l18L16K52k64M76l98j68K80M5k26L14
$$ 63 -103 -158 -14 -57 -66 2 117 -53 60 78 -7 -61 -379 -63 189 -75 401 3 -165 115 160 -66 248
5976B48l79Q0j20JL68k47k00JK62j32L10j69j13J77j78K69j01j0j6j61K20N9j22
$$ 248 -131 -51 -171 -170 198 -49 -249 -248 14 -118 192 23 -90 87 -91 178 77 67 51 -110 110 169 47
5999D7J40r7j19k3j3J84Qk92J05n5K14k03jK16k19p9n4K62J75j89k06Q9K40j91
$$ 47 187 90 -29 -52 -65 119 127 -165 -60 -115 99 -104 -105 111 -108 -187 -241 21 196 7 -199 -110 130 -61
6023f1K9l01L26P0L1Q0j56J67m56L1J79J36q8o5r7K11N5k96L42l16j39R3M5L66
$$ -61 -32 -333 -7 63 94 174 18 185 -271 -240 -61 75 -13 -78 -175 36 91 -205 137 -179 -318 -225 -180 186
6047A86m77J09L01L3j14J20j22k74L73l35K15Q4j78J04Q0k75K29Q6P2k37k59L32
$$ 186 -291 -182 119 152 38 158 36 -238 135 -200 15 99 -79 25 105 -170 59 145 217 -20 -279 53
6069E3k07J94r3Q9n2j90L77p7J93m73N1j72K98P7J5q9k75J02M3M9K29j96k29R4
$$ 53 -154 40 -53 36 -16 -206 171 94 287 -186 -135 -307 -9 68 83 -6 -281 -179 -136 -87 142 -54 -283 -189
6093a89J25K35k96p8K93k63K83l6L1M7l05K46N7M1k49J68j25L0k05K29j63J30
$$ -189 -64 171 -125 -203 90 -173 110 74 105 152 -153 93 150 191 -58 110 -15 15 -190 39 -124 6
6115Fj47J68r5K5j73L49n6j46M2P8N7k13J2q1J09p1K85l4n23N64k64N6K27j00
$$ 6 -141 27 -68 -43 -216 133 77 -69 -27 51 108 -105 -93 -174 -65 -136 149 115 -408 156 -108 -52 175 75
6139G5p7l2j96Q7J41L7j37M0J90p5Jk0k0l3P2j5RN0j16l62K80L5M23m66K48l48
$$ 75 -2 -34 -230 -143 -2 35 -102 -62 128 53 54 34 14 -19 53 38 47 97 -19 -381 -101 -66 357 -109 139 -209
6165b09j2M83j87L4l33K54k57J51K45k21J81l14L42k04k1q1K02j63K8j04J29K79
$$ -209 -221 262 75 109 -224 30 -227 -76 169 -52 129 -185 157 -47 -68 -149 53 -110 -82 -186 -57 222
6187B22j69j84j3J79j5j85j31J99J8K31k56J45j92J50n8R3J76j58J05k57L84l14
$$ 222 53 -131 -144 35 20 -165 -296 -97 -79 152 -104 41 -151 -1 -59 34 210 52 157 -100 284 -30
6209c0J68l24J18J4m7J37K44l46J95j62J63j65J1J73J3l40J32J28j65o8K49l29
$$ -30 138 -186 -68 -54 -101 36 280 -66 129 -33 130 -35 -24 149 162 -178 -46 82 -83 -151 98 -231
6231b31J08O4P1Q9K3j62K5p2p3K19k67K84j57M5K43j40k8P5j42J33J91k39j14
$$ -231 -123 -59 12 101 124 -38 -13 -85 -158 61 -206 78 -79 -34 209 69 41 116 -26 107 298 59 -55
6254e5J32j9P7j34J47n9k28K52j71M23l29L4k51Q5K88Q4r4k78k21K16j01J70J15
$$ -55 77 58 135 1 148 89 -139 113 -58 365 36 70 -181 -96 192 276 182 -96 -317 -101 -202 -32 83
6277H3k99J81J04n2LJ1j96J51k8P1N9k59J40j01K25k8M5R4j17k08J55J69k91K20
$$ 83 -216 -35 69 17 20 31 -165 -14 -42 29 88 -171 -31 -132 93 65 110 204 87 -121 34 203 -88 132
6301A32O3l99j0K41j52J7lk42K18J25N6N6j35j34J12M5K7L04l31j33J06J84j39
$$ 132 195 -204 -214 27 -125 -108 -111 -353 -135 -10 46 102 -33 -167 -55 -10 17 321 -10 -143 -37 147 8
6324Hj48K48k9N6k85K31j35J16k79k9K26Q5k15L4J02j31M7L61l96K23l73l9L71
$$ 8 -140 108 79 135 -150 81 -54 62 -217 -246 -20 65 -150 -116 -14 -145 -98 263 -133 90 -283 -322 49
6347D9j20J51m0k15K5J32J14K46l29j50P0M5j62J55K97j44k10K35j11o3j38J58
$$ 49 -71 80 40 -175 -150 -18 96 342 13 -137 -67 -22 -184 -29 268 124 -86 149 38 -25 -163 -5
6369ej25K02p5k4j15J90Q1j17N9j88K64l31J2J06O7K33k16l6Kj1K60j89Ol35L27
$$ -5 -130 72 -3 -27 -142 48 129 12 71 -117 147 -184 -172 -66 1 234 18 -18 -16 -27 233 44 50 -285 42
6394D2j00Q6j04J21l31J76P4Q3J53k62j01J14j9q8J50q0q8J28L7J13N3k33j81
$$ 42 -58 28 -76 45 -286 -110 -36 47 200 -62 -163 -49 -68 -156 -6 -86 -174 -46 -9 104 157 -76 -257
6417b57J39J6K65j61K2J3J26j69q8J04j4Q3p0J01m7J06m56L04n1J33k12J73N8
$$ -257 -118 -102 163 2 24 37 163 -6 -94 10 -4 79 9 110 63 169 -287 17 -34 99 -113 60 118
6440A18l13L73k13J68R4l41j17J88J34n9P1%J18j20nK92k42k68K58l05K74r0K91
$$ 118 -195 178 -35 133 227 -114 -231 -43 91 32 103 103 221 101 96 388 146 -122 136 -169 105 15 306
6463C06j65r3j0q1J32j16j70J42j87K96N8J39p1j68j39K7N5r6J44o2j43K06K31
$$ 306 141 48 38 -43 89 -27 -197 -55 -242 54 112 251 180 12 -127 -100 -45 -141 3 -59 -202 4 235
6486B35j61k1J27k34J59k24J44qr3k4Q0K45k62q8o6K13k45R9L15l12N8l8j76M10
$$ 235 74 53 180 -54 105 -119 25 17 -76 -100 -20 225 -37 -125 -191 22 -223 -124 191 -121 -63 -101 -277 133
6510A33j3o2k47P7J54j91J4J28l0J02q1J01J07j53k35P9L37k5l91K99m96L21j45
$$ 133 120 58 -189 -112 42 -149 -135 -7 -37 65 -16 85 192 39 -196 -117 220 195 -196 103 -393 -72 -217
6533b17K96o2k27R5RJ9Q2J59k72j39L01L4J33M9m94N4j6M37j91m0p2M4r8K18K8
$$ -217 79 17 -210 -115 -106 -87 -5 154 -118 -257 44 78 211 260 -234 -180 -196 241 50 10 -62 -18 -116 102 130
6558A30k64K90j36k27J38K19o0m4j55k2J44R1k59J76j86J11L30n25L54J40l19
$$ 130 -134 156 20 -207 -69 150 90 46 -109 -131 13 104 -155 21 -165 -54 276 -249 105 245 -74
6579g4K6k92J75J56K69k51O3j61J05K53l57L9K19k76J61r5o9L4O7p6p5J10l1m
$$ -74 -48 -340 -165 -9 260 9 72 -89 16 269 -88 -49 170 -106 55 -40 -109 -75 -8 -84 -159 -49 -80 -84
6603h4j06L90p9j45K86m98K50k4O1J57l42R4Ml1n9K70j51j23K32k78K52k72J9
$$ -84 -190 200 121 -24 262 -236 14 -10 51 208 -134 -40 -36 -67 -126 144 -7 -130 102 -176 76 -196 -177
6626a77J63p7q4J98p9j09L90l06K02j71mj07K04j57J14j54P5M2j87K69j39m5K03
$$ -177 -14 -91 -175 23 -56 -165 225 -81 121 -50 -54 -161 43 -114 0 -154 -79 -37 -224 45 -94 -139 64
6649F4l2k03Q5J1J50J14l16K1m1L80j44J9j1j15r9J81k32M40m05J24j12j03K7
$$ 64 32 -171 -86 -75 75 189 -127 -106 -147 233 89 108 97 -18 -117 64 -168 272 -133 -9 -121 -224 -197
6672a97M34j67J55l96K79L7j60J54l05J27k7J82l00q5L03j8j30L49j39j89P9k9
$$ -197 237 70 225 -171 108 145 -15 139 -166 -39 -66 116 -184 -269 34 16 -114 235 96 -93 -14 -43
6694d3j71L55n0J14l64L5K04J77k00Lo7n0J69Nr4J38Q7k96ql8J70P3j31j60p7
$$ -43 -214 141 91 205 -159 -124 80 257 57 60 -7 -57 112 117 23 161 248 -48 -56 -94 76 149 18 -142 -219
6719b19K95k00K18m2j15k81K15K86k8j77j46J97k03K63jj97K42l79J87O4r4J53
$$ -219 76 -124 94 52 -63 -344 -129 157 129 -48 -194 3 -200 63 62 -135 107 -272 -85 -21 -115 38
6741C8M9J27m51M20m6j5j20J47j89M7K8Ok5J33l76L21j6K00l65J28Q0n0J7j33
$$ 38 87 214 -237 183 137 122 2 149 -40 7 35 41 16 149 -227 94 78 278 -87 41 121 71 88 -45
6765d5Oj38L48m81M48k00k8J13j95J98N4m9o4Q2J60l00l7J41J24k23k9M59l61
$$ -45 -39 -177 171 -310 138 -62 -90 23 -172 26 80 31 -33 49 209 -91 -128 13 137 -86 -115 344 -17
6788a7p3k50J72L04j87l27N13j67j6N4m0L59l07j77rL85k56N6l6nj26N8K59m38
$$ -17 -90 -340 -168 136 -51 -378 135 -32 -48 6 -34 325 18 -159 -168 217 -39 17 -19 -24 -150 -92 167 -271
6812b71L67k14K89l51L65o1k17j24L10j35J94q7Q6j39j09J67J06J87m75L91k04
$$ -271 96 -118 171 -180 185 124 -93 -217 93 -42 152 65 151 12 -97 70 176 363 -112 279 75
6833G5l1K86l82o6J61j36j22L20n8J08Q7L2l32j12J48J06r9j52K23j14M3j43K4
$$ 75 44 330 -52 -118 43 -93 -215 105 47 155 242 274 -58 -170 -22 84 -15 -167 56 -58 -15 -158 -134
6856a34M0J0J35k8j09K2j23K77j45Ok08O8J32J7K6Rl2o4K95k03J04m9O0l10N4
$$ -134 -94 -84 51 23 -86 -64 -187 90 -55 -49 -257 -189 -57 -40 -14 -5 -37 -101 194 -9 95 46 106 -204 -150
6881a50j5M08o8j36k23n0L46l20J48j26J90Q8k89Q6K69k59n1p5L74p4j1k20J52
$$ -150 -165 243 175 39 -184 -234 112 -208 -60 -186 4 92 -197 -111 158 -101 -152 -227 147 73 62 -158 -6
6904fJ00p3j71L00k34K2R6J2J47p7j98K69m1j78k4k96K93Nj44J60J73k00J02j34
$$ -6 94 21 -150 150 -84 -62 34 46 193 116 -82 187 146 -32 -56 -352 -59 -54 -198 -38 135 -65 37 -97
6928i7O3K32l98K62r5j55L92k12l9j13L93l87R8j97L09P0N8j23j65L07j86J4j08
$$ -97 -34 198 -200 62 -33 -188 204 -8 -47 -160 233 -154 -56 -253 56 126 184 61 -104 203 17 31 -77
6951g7L13l65j60J80O4J72k47J67j77M0LJ42q6J4JoQ3L34k38j19Kj22J60Q3k80
$$ -77 236 -129 -289 -109 -45 127 -120 47 -130 -90 -87 55 -31 -17 -16 -22 61 395 157 38 40 -82 78 161 -119
6976a19J51K68l72J51LJ39k03j73N99l14j39o6K03j79j25K06l1M5j98J8J85M7
$$ -119 32 300 -72 79 82 221 18 -155 444 130 -9 -75 128 -51 -176 30 -1 44 -154 -136 49 96
6998I6Lj12J02j31P3j62K77k39O6O8k7o3J59nj24j55K22J3r1l68K29L1M1J82m4
$$ 96 99 -13 89 -42 31 -131 146 -93 -27 41 14 -49 110 105 -19 -174 48 61 -30 -398 -169 -138 -97 85 41
7023D1j11J07l17L94K36l85o4P3N9OJ22o7r3r1J81l48J81P6l7L4k8j29R5J36l9
$$ 41 -70 37 -280 114 350 -35 -99 -26 33 39 161 94 1 -90 91 -257 -76 0 -37 -3 -31 -160 -65 71 32
7048C2r2l2j5K34K5m11L35j89K03j37l4J3J53N4o2N3k53J54L6l13L80n3j05N1
$$ 32 -60 -92 -107 127 152 -259 76 -113 90 -47 -81 -68 85 139 77 130 -123 31 67 -246 134 81 -24 27
7072B7k11l3L09J73k65j19J02j39L21j66po5L14l23K33l02O2J0J27K4k40O28n03
$$ 27 -184 -217 92 265 0 -119 -17 -156 165 -1 -8 -73 241 -82 151 -151 -89 -79 48 72 -168 460 -43
7095d3J25j75L2m1J40o7q1J45l06J0K45Q1j96m5N0M9K94k10k78J16K14J06l34
$$ -43 82 -93 -61 -102 38 -29 -110 35 -271 -261 -16 65 -131 -176 -126 -77 217 7 -271 -155 59 165 -169
7118a69K74m07K08K09M5k09K81j55l0q9O1Q3J15l40Kp1K35J63k79J13k00K60k77
$$ -169 105 -302 -94 115 160 -49 232 77 47 -42 19 102 217 -123 -121 -192 43 206 -73 40 -160 100 -177
7141a77K43J72j10j60J9P8j24JP2j35J84M4J15l50N4K02J98l01K5J90k05j54L39
$$ -177 66 238 128 -32 -13 65 -59 -58 14 -121 63 107 222 -128 -74 128 326 25 50 240 35 -119 220
7164B20k8j35Q8k36N3Q5k3N6J54m73n3R5J22k43K44n1P7p9L9R0k4L6k49L94k17
$$ 220 192 57 145 -91 -38 47 24 80 234 -239 -292 -197 -75 -318 -74 -125 -48 -127 -88 2 -22 14 -235 159 -58
7189e8J0K88j36l37J38L7RK05ol81M2J63k89J35J58m2L0M6J29j37J90k84J62N2
$$ -58 -48 240 104 -233 -95 -58 -49 156 150 -231 -189 -26 -315 -180 -22 -64 -34 12 141 4 194 -90 72 124
7213A24o5P5J66j83j51L1K66Q3m23Q8l08L30J0J65l61OOL10Jk80K47k37j97K71
$$ 124 59 134 300 117 -34 -3 263 346 -77 11 -297 33 43 208 -153 -147 -141 169 170 -110 137 -100 -297 -26
7237b6N4M5j28j67K17K43l09k0J52Q7j76pK20n1m7j10O3L4J20M3j15k99J76JO2
$$ -26 28 73 -55 -222 -5 238 -71 -91 61 148 -28 -35 185 134 87 -23 40 74 194 237 122 -177 -1 0 62
7262F2l53K22L23l07K34j52J24j31J43k26Q5N2k31J93k24J00M1J52J1l22J16J61
$$ 62 -291 -69 254 -53 181 29 153 22 165 -61 24 76 -155 38 -186 -86 -45 107 118 -204 -88 73
7284G3j26ON8R6j74q1K6J93j1J04j54k41K9L08J31n80N75n75L77J30l25J67k28
$$ 73 -53 -47 11 107 -67 -148 -122 71 60 164 10 -231 -202 106 237 -343 232 -343 34 164 -161 6 -222
7307b22K19r4m7J05K01k03J7J18l44K17p1m1J16p0J22J37j62j46o9P3J50j07k6
$$ -222 -3 -97 -144 -39 162 -41 -24 94 -250 -33 -104 -145 -29 -99 23 160 -2 -148 -217 -144 6 -101 -127
7330a27K1K04m53O65m13M6p7R5K9p7K32j31l01J56J72K27J47n18J67j95J09K26
$$ -127 -106 98 -355 310 -103 -57 -134 -39 -10 -87 145 14 -287 -131 41 268 415 -103 64 -131 -22 204
7352B04q9k02J3m4o9L67l12P8J58l33K83J5k66K20j58K1J54j26l7K61J01m96R0
$$ 204 115 -87 -74 -118 -187 180 -132 -54 104 -229 54 69 -197 23 -135 -114 40 -86 -123 138 239 -257 -167
7375a67J78J63j23j45L7J34J12L4m11J74j34o1J77O6N9j02j47j11M79k09N5M1
$$ -167 11 174 51 -94 -57 77 189 223 -188 -14 -148 -209 -32 34 93 -9 -156 -267 212 3 58 99
7397I9o6l6n4K5P8l2j02J15J63o6L7m26K56o1P9K74k20j0J16k84K45O2l11N0j82
$$ 99 33 -3 -57 -32 46 14 -88 27 190 124 161 -265 -9 -70 9 283 63 53 169 -115 130 192 -119 -69 -251
7422b51N7J51P1K9k27J41Q3Q4j88J56j41j56K24J62L0j04j42j01Q1k82M66q3r8
$$ -251 -194 -43 28 57 -170 -29 54 138 -50 106 -35 -191 33 195 225 121 -21 -122 -41 -323 143 60 -38
7445c8j07K91j77K47j79Qj36oM5q2n0K59m2j29K30J18R2n10K65p9L6o6P4l35K32
$$ -38 -145 146 -31 216 37 45 -91 -97 -52 -134 -184 75 33 -96 134 252 344 -166 99 20 56 -10 64 -271 -39
7470c9k05K04P5R8k53k11L65n5j5j57J1J14J61l43K90N8o8j43%J33k54M95k98
$$ -39 -244 -40 35 133 -120 -331 34 -21 -36 -193 -182 -68 93 -250 40 98 30 -113 -113 20 -234 261 -37
7493c7r0p0JK67j04J5n3j2j0K6Q4j10M6Q9p5J70j68K9m7K89l35J80j02K6j84K12
$$ -37 -127 -197 -196 71 -33 -18 -71 -83 -93 -67 17 -93 -47 42 -33 137 -31 -2 -49 240 -95 85 -17 9 -175 37
7519C7k65K46J02k1j95J95j42P3j30J10k04N12l56OQ4k97R7j5j35J92J97J20J08
$$ 37 -228 18 120 99 -96 99 -43 30 -100 10 -194 318 -38 -32 52 -245 -148 -163 -298 -106 91 211 319
7542C19m35L30q4j96m1j99J62J6QJ18Q0q1o0l0K3K24k85J33r0Q8k37L17j68k6
$$ 319 -116 214 130 -66 -107 -306 -144 -128 -120 -2 78 -3 -63 -93 -70 154 -131 2 -88 0 -237 80 -88 -114
7566a14O4L7Rj27L42k29j20K65q6O1j1R1k31R0L5k56o6J55J54k77L19q7j04o9
$$ -114 -50 -13 -4 -131 211 -18 -138 127 41 102 91 182 -49 41 76 -180 -246 -91 63 -214 105 18 -86 -155
7590a55J92j89o0L61m5Qj70M3m7J41k6n6j84M27m47P1Q0K09j52M8J37k30J59j81
$$ -155 37 -152 -212 149 104 112 -58 -15 -62 79 53 -3 -187 240 -207 -136 -56 153 1 49 186 -44 115 -66
7614f6m3qM5K25j00j54m8P1M8j7J77J45n87J07J34Q1J6k19R2K05j42j7k6M64m10
$$ -66 -109 -117 -72 153 53 -101 -149 -78 -30 -47 130 275 -312 -205 -71 10 26 -193 -101 104 -38 -55 -81 383 -27
7639b7mj7J61k55K0J21J27Q0j00j57J57o9k21L14j00K64n43k4M77k04J4j34K1
$$ -27 -31 -48 113 -142 -122 -1 126 206 106 -51 106 37 -184 130 30 294 -249 -273 204 0 14 -120 -99
7662i9q2J82k2q5j6J74l44J87L27m83M00l66K74m9K36j15j41%j01K04k46K32J18
$$ -99 -181 1 -21 -106 -122 52 -292 -105 222 -261 139 -227 47 -2 234 119 -22 -22 -123 81 -165 67 185
7685A85m26M27k74M31j23k46j26n8K81k33J89J21k41m4J36L6J07j70l3M7L3j5
$$ 185 -241 186 -88 343 220 -26 -152 -210 71 -162 27 148 -93 -137 -1 35 142 -28 -61 -14 19 4
7707DJ72M4l64Q8J23O1k90J1J77o5J31k92K93k58J01J68Jj66L6L11l04o8o6N1
$$ 4 176 220 -144 -56 67 128 -162 -151 26 -39 92 -200 93 -165 -64 104 105 -61 -25 286 -18 -86 -152 -101
7731a01K76l87J88j01L94j32j48L9k33L04L6N0l9k38M9kJ25k20J06q9M7o7K87
$$ -101 175 -212 -24 -125 269 137 -11 28 -205 99 135 185 146 -92 -43 -45 80 -140 -34 -123 -76 -143 144
7754A44j33j15K66j74K14j38L0k33K11k18J42j08N3q8K24k24R9K40j05J50j77
$$ 144 11 -104 162 -12 202 64 94 -139 72 -146 -4 -112 -59 -147 77 -147 -48 192 87 237 60
7775F0j19J73m07K07J36K4k29p9J91oo2Q5j50j41O04l35O3j90J4L30k27J67J93
$$ 60 -59 114 -293 -86 50 74 -155 -234 -43 -49 -111 -26 -176 -317 287 -48 15 -175 -161 169 -58 109 302
7798C02k45j67n1L76q4M8l01L67j38l99L90k22J20o4Rj92J46M43n00M23k48k0
$$ 302 57 -110 -161 215 131 179 -122 245 107 -292 98 -124 -4 -68 -59 -251 -105 338 -162 261 13 -7
7820gJ81j93q9L48k58m9nj53L31j58JK9n0K30j47J59l26L38m00J50l8J19J43k61
$$ -7 174 -19 -108 240 -18 -67 -72 -225 106 -52 -51 -22 -72 158 11 170 -156 182 -218 -68 -106 13 156 -105
7844a05M2P7K47k71O8o1m5K67q4l34L95m56L65O5p0p4OLJ44l2j61J26j94k5q3
$$ -105 -63 14 261 -10 58 -3 -48 219 135 -199 196 -260 105 170 100 26 32 35 179 147 -14 112 -82 -107 -190
7869a90j0K25J26j11j0k83J88O3M0l1k73J59P7K04qK5k17M5j07j67M30j52j02
$$ -190 -200 25 151 40 30 -253 -65 -2 38 7 -266 -107 -30 174 166 191 -26 19 -88 -255 175 23 -79
7892g9j62K70K15j83L1k64L00M7j01L02l30M2q0k98L80J6l65L53O4k41L49l62
$$ -79 -241 29 244 61 92 -172 128 175 74 376 46 88 8 -290 90 106 -259 94 158 -83 266 -96
7914i6J30k11J4J00K1J06j97Q1j0K70k70R9j1K58k90J67K08q6k61j36JKL43k19
$$ -96 34 -177 -163 -63 -42 64 -133 -52 -62 208 -62 37 26 284 -6 161 369 283 22 -114 -113 -111 232 13
7938A3J16l0k0j66N7p6q3J6J17P6j88J23K08j83K11k56Oj3K8j77J79K56r9P1k72
$$ 13 129 99 79 -87 -30 -106 -189 -173 -56 20 -168 -45 163 -20 191 -65 -59 -72 -44 -221 -42 214 115 186 -86
7963h6k9J38j08M0m3k8nK44j18lk8k08K50m3j11K95J06m73K38m0n0Q6j28k32N10
$$ -86 -115 23 -85 -45 -88 -116 -121 123 5 2 -26 -234 16 -27 -138 157 263 -210 28 -12 -62 24 -104 -336 174
7988A74l92L20k57%K13q3P4j70Q6Q4k87L78j2k1J30j77r8L25k60k83N52m33L07
$$ 174 -218 102 -155 -155 58 -25 49 -121 -35 49 -238 140 128 107 237 60 -38 287 27 -256 296 -137 170
8011A70j35j34j15L18l06K96N8k74M0K85l48J14J42N0j86O2j93QN1q7K84k12J61
$$ 170 35 -99 -214 104 -202 94 152 -122 -82 203 -145 -31 111 161 -25 37 -156 -148 -97 -184 100 -112 49
8034D9l83M29j85K00j33Q5j98J21L38l32M3m3k29K9J45J22l5R7R0j64J18J81j67
$$ 49 -334 95 -90 110 -23 62 -136 -15 323 -9 34 -9 -238 -209 -64 58 23 120 210 46 164 345 178
8057A78l61L19o2L3j35k05L53k76K04o3R8K31j78l35N8q0K51M6j41q2J19N9q5
$$ 178 -183 136 74 107 -28 -233 120 -156 48 -15 83 314 136 -199 -141 -221 30 76 -65 -147 -28 31 -54
8080e4k30K96l3%k9L6Q6j00J24j12r8P5L9Pq0j2K00j54L7j27L21k11j55P1K07
$$ -54 -284 12 -21 -21 -50 -14 72 -28 96 -16 -114 -39 0 7 -73 -85 115 -39 -2 -129 192 -19 -174 -103 104
8105A04l90M30r1K07r4l21J36j1M3J45l85R7j83J32j25J53L5J01j85J88j6j70
$$ 104 -286 144 53 260 166 -155 -19 -30 13 158 -227 -130 -313 -181 -306 -153 -118 -17 -202 -14 -30 -200
8127b00J13O3K47j33j78j40J11J84RJ7j87m4l3K02j77J74J25j65k8J71J17k50
$$ -200 -87 -24 223 90 -88 -228 -117 67 76 93 -94 -138 -171 31 -146 28 153 -12 -40 131 248 -2
8149bL49n08J61M9j59K12k03N8j02J62L2ro3l3J96Mo0j23j46N4J7J27n0L22l88
$$ -2 347 -161 0 49 -110 102 -101 -43 -145 17 49 40 -23 -56 140 144 84 -39 -185 -131 -114 13 -37 285 -103
8174a03O0L49q2j05k29J18j74O1L59m8l40J33J1l8J22J47k03
$$ -103 -43 306 224 119 -110 8 -166 -105 254 206 -134 -1 10 -28 94 241 38
8191C8
$$ Imaginary data points
##PAGE= N=2
##DATA TABLE= (X++(I..I)), XYDATA
0@%%%%%%%%%%%%%%%%Qj6J6j6J6k3L1l2L9m7N4o2P1q4R7j11J26j43J62j84K07k31
$$ 0 0 0 0 0 0 0 0 0 0 0 0 0 0 0 0 0 8 -8 8 -8 8 -15 16 -16 23 -24 30 -32 39 -45 52 -59 67 -76 86 -98 109 -122
38a22K59k90L25l63M03m48M96n46O04o69P38q13Q95r86J087j198J320j457J611
$$ -122 137 -153 172 -191 212 -236 260 -286 318 -351 387 -426 469 -517 570 -628 692 -765 846
57H46j787J989k220K491k816L208l697M326n161O335q113J1163k4710J49370m5482
$$ 846 -941 1048 -1172 1319 -1497 1711 -1986 2340 -2821 3514 -4599 6564 -18146 131224 85742
72H5742j16784R6745q3994o8840J59782K3690j36819J0229k9359l1923J53511
$$ 85742 -31042 65703 -18291 -87131 72651 96341 -40478 -30249 -59608 -91531 61980
83F1980M2429j31252J1588q725p1090J35300P9140j59521r21P0925r4200O9331
$$ 61980 104409 -26843 -15255 -23980 -95070 40230 119370 -40151 -41072 29853 -64347 4984
95D984J60990j44340j28096J01974p578k9431J15448l3618j23106M3545L2995
$$ 4984 165974 21634 -106462 -4488 -12066 -41497 73951 40333 -82773 -39228 -6233
106f233J81R2252l8972j34429N0236N6806l9481P5557J8993j50742O554J08576
$$ -6233 -6052 86200 47228 -87201 -36965 19841 -19640 55917 74910 -75832 -69278 39298
118C9298l8750J2539O2128j18470o0353J30338K4183m5635L8320m8089p3446P9266
$$ 39298 548 13087 75215 -43255 -103608 26730 50913 5278 43598 -4491 -77937 1329
130A329M7827l5357J8126m2904p7325Q2297O9659o2729K884O499q3592L8358J04325
$$ 1329 49156 13799 31925 -10979 -88304 -6007 63652 923 3807 10306 -73286 -34928 69397
143F9397m4730l9722K6003n4068j154J05384j1759p3017J3643j3344j3708P7265
$$ 69397 24667 -15055 10948 -43120 -44274 61110 49351 -23666 -10023 -23367 -37075 40190
155D0190J1507o6452J326n462j8919P5177K6461q4383j0988K9521k4116L8330
$$ 40190 51697 -14755 -13429 -18891 -37810 37367 63828 -20555 -31543 -2022 -26138 12192
167A2192M9602o6504m0512L4993m793J7799M9975m7694n6056L6210J7192J300
$$ 12192 61794 -4710 -45222 -10229 -15022 2777 52752 5058 -50998 -14788 2404 3704
179C704L7618k6926n6800K4868K4293l567L4704j4725o7705J7351M7429j0601
$$ 3704 41322 14396 -42404 -17536 6757 3190 37894 23169 -44536 -27185 20244 9643
191I643Q360N252n2548n327M7055L345m32L705m5686j2679N1279J0296j6016M344
$$ 9643 18003 23255 -29293 -34620 12435 15780 15348 19053 -26633 -39312 11967 22263 6247 10591
205A0591k8669j9890M2760J9628j7048J668k1580k5506M1171L1557k6441r231
$$ 10591 -18078 -37968 4792 24420 7372 9040 -12540 -38046 3125 34682 8241 -990
217i90m332k1308K3694L4115j7154j5417m741j9979K0246L9346j9121k5323M874
$$ -990 -5322 -26630 -2936 31179 14025 -1392 -6133 -26112 -5866 33480 14359 -10964 -6090
230f090j1341O180L6610p823k9580K794n236L67L7315q85l8081R73R319l785K4196
$$ -6090 -17431 -11251 25359 17536 -12044 -9250 -14486 -14119 23196 22311 -15770 -14797 -5478 -9263 14933
245A4933Q896l2481o536J1209l112K0989J4146l5467j3399K1922j212N652J8001
$$ 14933 23829 -8652 -15188 -3979 -7091 13898 28044 -7423 -20822 1100 -112 5540 23541
258B3541k4438k1612J9116N389R05J7196j8592k8348K0079J5154q211J0974n412
$$ 23541 -897 -22509 -3393 1996 2901 20097 1505 -26843 -6764 8390 179 11153 5741
271E741k8026J0846K0488o683O516p9k8834N776K9116p611n986Q597j9870o509
$$ 5741 -22285 -11439 9049 2366 8882 8803 -20031 -14255 14861 7250 1264 9861 -10009 -16518
285a6518K7611J058j1378O719j3658j2241K7052P635j9903M037j324j5911J6807
$$ -16518 11093 12151 773 7492 -6166 -18407 8645 16280 -3623 414 -910 -16821 -14
298a4J6099j7180l440L823j4051J1224K1112j6577j0495J1010q297l71K1709o407
$$ -14 16085 -1095 -4535 -712 -14763 -3539 17573 996 -9499 1511 -6786 -7157 14552 8145
312H145j6819P969j203l612J8184j679k0003O017O199q419J0708O941j8543j841
$$ 8145 -8674 -705 -1908 -5520 12664 10985 -9018 -3001 3198 -5221 5487 12428 -6115 -7956
326g956R850n037M539R086j5614n983J3627k867l122J0792p027j1843J0662M108
$$ -7956 1894 -3143 1396 10482 -5132 -11115 2512 -355 -3477 7315 288 -11555 -893 3215
340C215m804P134l044j1449Q191P314p446L553L557j1047O47J0654l982j966L531
$$ 3215 -1589 5545 2501 -8948 -757 6557 -889 2664 6221 -4826 -4179 6475 2493 527 4058
355D058p279j379R096k385n155N251k970n674O708L248n755P23N46l299L409L017
$$ 4058 -3221 -4600 4496 2111 -3044 2207 -763 -6437 271 3519 -2236 -1513 -967 -4266 -857 2160
371B160l874J055K445l951L1N143o68k752J384P7q83J478J08j012J218q93k426
$$ 2160 -1714 -659 1786 -2165 -2134 3009 2341 -411 973 1050 167 1645 1753 741 1959 1066 -1360
388a360J091K360j446j525Q95l02k021O14K212J43k175m57l94J174K896j038k464
$$ -1360 -269 2091 645 -880 15 -287 -2308 -1694 518 661 -1514 -1971 -2365 -1191 1705 667 -1797
405a797J467l12j830M306K961m662k048J798R0K485K652m836k447L143j866N29
$$ -1797 -330 -642 -2472 1834 4795 133 -1915 -117 -27 2458 5110 274 -2173 970 -896 -367
421c67O558m070p684L285K877j296L694j642p251K503L933k649M505J770r679
$$ -367 6191 2121 -5563 -2278 599 -697 2997 1355 -5896 -3393 540 -2109 2396 4166 -5513
436e513r26Q741qp65K279o558l016Q178J524k495L790n673p485R099O285n283
$$ -5513 -6439 2302 2294 1529 3808 -2750 -5766 2412 3936 1441 5231 -442 -7927 1172 7457 2174
452B174p60j742o768N589P614m730j305j72q184L245J2193l076p141Q90l174O28
$$ 2174 1414 -328 -7096 -1507 6107 1377 72 -100 -8284 -5039 7154 4078 -3063 -2173 -5347 -4719
468d719J0425m43p183M13k313j461J1636L385j0759l175K597o25O396N080q718
$$ -4719 5706 5263 -1920 -1507 -3820 -5281 6355 9740 -1019 -4194 -1597 -2222 4174 9254 536
483E36m950J916j056O270P212q954r402L869L934K110M636m776q494J430L901
$$ 536 -4414 -2498 -3554 2716 9928 974 -8428 -4559 -625 1485 6121 1345 -7149 -5719 -1818
498a818L627N691m541j1173J187Q262K835J939k737q091j498O795M565K422k793
$$ -1818 1809 7500 2959 -8214 -7027 1235 4070 6009 3272 -4819 -6317 478 5043 7465 4672
513D672j0052k473Q801N919j072m371o051k169M901N953K396m343r301k210Q439
$$ 4672 -5380 -7853 948 6867 5795 1424 -4627 -6796 -1895 4058 6454 2111 -7190 -9400 -961
528i61O105m40l813p211j526O838N872J109k636q528l469Q858P164o13m062p442
$$ -961 5144 4704 891 -6320 -7846 -1008 4864 5973 3337 -5191 -8660 198 7362 6749 2687 -4755
544d755k627Q754N361j319j715p519o651R658J0067m619m737l362o238O531J1459
$$ -4755 -7382 1372 6733 5414 3699 -3820 -10471 -813 9254 4635 -102 -3464 -9702 -3171 8288
559H288l657o023k149n598M223J3958j972r389j378l097K037J4276l54j2204O24
$$ 8288 4631 -1392 -3541 -9139 -4916 9042 7070 -2319 -3697 -6794 -4757 9519 9165 -3039 -2415
574b415p48l132J4269N545j6344m138O023l443Q082R699j4725r084Q502o56K610
$$ -2415 -3163 -6295 7974 13519 -2825 -6963 -940 -4383 3699 13398 -1327 -10411 -1909 -2565 45
589D5J2248j0973j3902Q367M134n21J0974o895j7128Q949R110n647Q736J867k1018
$$ 45 12293 1320 -12582 -4215 -81 -602 10372 3477 -13651 -4702 4408 -1239 7497 9364 -11654
604a1654J872J7447m231K48N149j6660m341J9192m49o146P494j1682j1908J8848
$$ -11654 -9782 7665 3434 3682 8831 -7829 -12170 7022 6573 427 7921 -3761 -15669 3179
618C179O980j0914L458m979j3007J5330J1615j3527J607K733j7150Q571K1790
$$ 3179 10159 -755 2703 -2276 -15283 47 11662 -1865 -258 2475 -14675 -6104 15686
631A5686j1727r967Q325r724l57K1182n334j4632P844m533o629K0782L085k1586
$$ 15686 3959 -6008 2317 -7407 -7764 13418 8084 -6548 1296 -3237 -9866 10916 14001 -7585
645g585L369N138q978J3606R055k0616k290J0277r742P967J6524j9310j2545J6358
$$ -7585 -4216 922 -8056 5550 14605 -6011 -8301 1976 -7766 201 16725 -2585 -15130 1228
659A228j587l417J6296q929j8269J2552N172o364J4021k326k2469Q349J4242q993
$$ 1228 -359 -3776 12520 3591 -14678 -2126 3046 -3318 10703 8377 -14092 -5743 8499 -494
673d94N114N861k0177k15J7900n835j149R074j7090p870K1799K9j0456Q961p145
$$ -494 4620 10481 -9696 -9911 7989 2154 1005 10079 -7011 -14881 6918 6947 -3509 5452 -1693
688a693j3857J6640Q888j2250M306j009j5036J2186J5342j3533j992N870j3460
$$ -1693 -15550 1090 9978 -2272 2034 1025 -14011 -1825 13517 -16 -2008 3862 -9598
701i598L789J9395q524r486P247q237k298J9494k678j6213O466l04p731J4799
$$ -9598 -5809 13586 5062 -4424 2823 -5414 -7712 11782 9104 -7109 -643 -947 -8678 6121
715F121N528j7367o3N538p006R722R875j6252n333R842m477L172J2349j0699j1276
$$ 6121 11649 -5718 -5781 -243 -7249 2473 12348 -3904 -9237 605 -3872 -700 11649 950 -10326
730a0326R753R29j651J1509n460j4919P416O702m886P553N71j5571J791J0776
$$ -10326 -573 356 -1295 10214 4754 -10165 -2749 3953 -933 6620 7191 -8380 -6589 4187
744D187l145K594K652j3247k598J2921l11k637M601r084p052J2157M469n281K853
$$ 4187 1042 3636 6288 -6959 -9557 3364 3053 416 5017 -4067 -11119 1038 5507 226 3079
759C079m829q295R639Q067o127j57o55q344N101J1039m145m564L79n883K116J1028
$$ 3079 -1750 -10045 -406 7661 1534 1377 722 -7622 -2521 8518 4373 -191 188 -5695 -3579 7449
775G449k095o638L49l404p70R743J860q282j790k76p87P303L938p602l781J681
$$ 7449 5354 -1284 -935 -4339 -5109 4634 6494 -1788 -3578 -3854 -4641 2662 6600 -1002 -4783 -3102
791c102LM946N278n722o282J766K027L151M768m347o703R68L215K093L688k296
$$ -3102 -3099 1847 7125 1403 -4879 -3113 -1086 2065 6833 2486 -4217 -3249 -34 2059 5747 3451
807C451p341p47M294K400K298j697o785j427M140L516J403j552n780k051L973
$$ 3451 -3890 -4637 -343 2057 4355 2658 -4127 -5554 -1414 2102 3505 1953 -3827 -5878 -1905
822a905M401J066j534m526k433L154M732J568k334m144k394L008M869J618k650
$$ -1905 2496 3562 2028 -2498 -4931 -1777 2955 4523 2189 -1955 -4349 -1341 3528 5146 2496
837B496m502j920J979M496K144k680m811j861K434L858K376k589m585j985K677
$$ 2496 -2006 -3926 -1947 2549 4693 2013 -2798 -4659 -2225 1633 4009 1420 -3165 -5150 -2473
852b473L947K332j763n124j814L242L645K197j559m906j872K889L918J741j275
$$ -2473 1474 3806 2043 -3081 -4895 -1653 1992 4189 2630 -2276 -4148 -1259 2659 4400 3125
867C125m313k856K897M106J204j841l810k944K182M298J773k270l442k902J895
$$ 3125 -1188 -4044 -1147 2959 4163 2322 -1488 -4432 -2250 2048 3821 1551 -1891 -4793 -2898
882b898M816J578k207l203k597J277M927K095j820l387k327J192M717K456k362
$$ -2898 1918 3496 1289 -1914 -4511 -3234 1693 3788 1968 -1419 -3746 -2554 2163 4619 2257
897B257l334k104Q59M689K390k141l814k181Q94L989K706k152l656k217P71L769
$$ 2257 -1077 -3181 -2322 2367 4757 2616 -1198 -3379 -2485 1504 4210 2058 -1598 -3815 -3044 725
913G25K844j928l698j797N84L913L356j903l877j577M59L746L595j764l588j610
$$ 725 3569 1641 -2057 -3854 -3270 643 3999 2096 -1781 -3358 -2899 847 4442 2678 -910 -2520
929b520n0L419L974j671m406j407N60K649L662j027n146j088N81J918L653jn470
$$ -2520 -2570 849 4823 3152 -1254 -2661 -2101 548 4210 3183 -1963 -3051 -2470 -552 3101 3100 -2370
946b370j942K062J565K869J402n538k466K886J695K311J810m767m411L956K547
$$ -2370 -4312 -2250 -685 2184 3586 -1952 -4418 -1532 163 2474 4284 -483 -4894 -938 1609
961A609L92K042l026n508K785M058m08J370j966o070J586N664o08k20l17n795
$$ 1609 2001 4043 1017 -4491 -1706 2352 1944 3314 1348 -4722 -3136 2528 1920 1700 1383 -4412
977d412k53O550M61j890P32m758k074P314J955l340P48k535l791O280M687m673
$$ -4412 -4665 1885 2346 456 1188 -3570 -5644 1670 3625 285 1033 -1502 -5293 987 5674 1001
993A001p16m19m557M590O312m536k833J590m053J571P948l030n586J973j972l21
$$ 1001 285 -134 -4691 -101 6211 1675 -1158 432 -3621 -2050 5898 2868 -2718 -745 -2717 -3038
1009c038P150o08p154J372O21j994O774K345q365p27L519j940L845M639p304l554
$$ -3038 4112 3504 -3650 -2278 -1657 -3651 3123 5468 -2897 -3624 -105 -2045 1800 6439 -865 -4419
1025d419N048j104J158N494n164n932M471J655j263N089k817q107L507M193k490
$$ -4419 629 -475 683 6177 1013 -4919 -448 1207 -56 5033 2216 -5891 -2384 1809 -681
1040f81L858k6q829R93P328k362O29K363p162j884P655N20j884K644n130m269
$$ -681 3177 3151 -5678 -4685 2643 281 910 3273 -3889 -5773 1882 2402 518 3162 -1968 -6237
1056f237P832L001m154J876k268n443N918N150m648l39j30n650L409P110l631
$$ -6237 1595 4596 442 2318 50 -5393 525 5675 1027 688 558 -5092 -1683 5427 1796
1071A796l394J732m098M48P742j280n137R88j621p48P173J101p021N40N55k006
$$ 1796 -1598 134 -3964 -3516 4226 2946 -2191 -1203 -2824 -3572 3601 4702 -2319 -1779 -1224 -3230
1087c230O023L106o583k150K440j412L308M743n955m129L156q2J183M823l871
$$ -3230 2793 5899 -684 -2834 -394 -1806 1502 6245 290 -3839 -683 -765 418 5241 1370
1102A370n817K489J586M19L589k123o188J290L581Q6K503q78n847J99M424N86
$$ 1370 -4447 -1958 -372 47 3636 1513 -4675 -3385 196 282 2785 1907 -3940 -3741 683 1269
1118A269J151M35n285j587M809J687n76N66l796k348L604K833j41o96l389k805
$$ 1269 2420 2855 -2430 -4017 792 2479 1903 2469 -1327 -3675 -71 2762 2621 1925 -1464 -4269
1134d269L444L439m57j358k566k500K761L524j15j259k381k639K792M456l22j767
$$ -4269 -825 2614 2157 799 -1767 -4267 -1506 2018 1903 644 -1737 -4376 -1584 2872 2550 783
1150G83k309j461J833L652N19j266k734k496K702L961j18k029j723k308J387M500
$$ 783 -1526 -2987 -1154 2498 3017 1751 -983 -3479 -777 3184 3066 1037 -686 -2994 -1607 2893
1166B893j67k155j373k797R63M862O17k902j307j504J58M556J071k968j077j274
$$ 2893 2726 571 -802 -3599 -2636 2226 2843 -59 -1366 -2870 -2712 1844 2915 -53 -1130 -2404
1182b404o80N023K856m678j966J006j026L142L935l872l782J664r71J874M897
$$ -2404 -3084 1939 4795 117 -1849 -843 -1869 1273 5208 1336 -2446 -782 -1753 121 5018
1197E018l456n146J947Q09r9M543j533o095J620J570n04M331N6p153L96M676j298
$$ 5018 1562 -3584 -1637 -828 -927 3616 2083 -4012 -2392 -822 -1326 3005 3061 -4092 -3696 980 -318
1214c18J922K600o460j933N213K27K0L069n368l981O158J596k565K773k200n896
$$ -318 1604 4204 -2256 -4189 1024 1251 1271 4340 -1028 -5009 1149 2745 180 2953 753 -5143
1230e143M360L960k932J425l86p073L084O802l738r25K276n523n87P955q09l820
$$ -5143 -783 3177 245 1670 1284 -5789 -2705 4097 359 -566 1710 -3813 -4400 3555 2746 -1074
1246a074K056l015k521P914J379o263J990k83m398N954L890o016o23J620m351
$$ -1074 982 -2033 -4554 3360 4739 -1524 466 183 -4215 1739 5629 -387 -1010 610 -3741
1261c741L739N937n991l301L993k959j40P458l205n944L395m62j187O286o40p702
$$ -3741 -2 5935 -56 -3357 636 -2323 -2463 4995 1790 -4154 -759 -1221 -2408 3878 3238 -4464
1277d464K471L076l174M301K624p607o92M948j666J403M004o513l441O309p88
$$ -4464 -1993 1083 -2091 2210 4834 -2773 -3465 1483 -183 1220 5224 -1289 -4730 1579 791
1292G91j267N017l940o362N342K745l055L234j581o530L622N032l439J242J357
$$ 791 -476 4541 601 -5761 -419 2326 -729 2505 924 -5606 -1984 3048 -391 851 2208
1307B208o496M73P353j794j786K134m411j648P036K8l659K182k238l750N942K847
$$ 2208 -4288 -3815 3538 1744 -42 2092 -2319 -3967 3069 3097 -562 1620 -618 -4368 1574 4421
1323D421m720N06k91l789M284M323m738j692J750l458J775N985l208l891J853
$$ 4421 -299 207 -84 -3873 411 4734 -4 -1696 54 -3404 -1629 4356 1148 -2743 -890
1338h90j097J53N317j220m978J534N82j281M550J488n754n36K033n51K737J792
$$ -890 -1987 -1834 3483 2263 -2715 -1181 -599 -1880 2670 4158 -1596 -2132 -99 -650 2087 3879
1354C879m929j863L149l01R88K766l683m031K693J855r2J959j938m499K269K552
$$ 3879 -1050 -2913 236 -65 923 3689 6 -4025 -1332 523 431 2390 452 -4047 -1778 774
1370G74k39J184m86m726O88L809N71l1l22l543m95M062J086q76j43k634j755L745
$$ 774 535 1719 1233 -3493 -2805 1004 1575 1544 1222 -2321 -2816 1246 2332 1456 1313 -1321 -3076 669
1388F69K590j798j473j354j486K789K646j377j450j140j672J900L898q68k981
$$ 669 3259 1461 -12 -1366 -2852 -63 2583 1206 -244 -1384 -3056 -1156 2742 1874 -1107
1403a107r48J2J340K880J40k670j247l07R17L516Q35l346j984O09J278K106Q58
$$ -1107 -2055 -2043 -703 2177 2317 -353 -1600 -1907 -990 2526 3361 15 -1969 -1360 -82 2024 2882
1420B882k676k121J53J435K031J039k459l059M83K014K035M34k076k515j88J840
$$ 2882 206 -1915 -1762 -327 1704 2743 284 -2775 -2292 -278 1757 2191 115 -2400 -2588 -748
1436g48K302O18j774k657o17K856K271j22j691j723p84K053K416L11j828k643
$$ -748 1554 2172 398 -2259 -2876 -20 2251 2129 438 -1285 -2069 -16 2400 2711 883 -1760
1452a760o78K200K630L2k215j949m39J382K166R05k251k358m41J905K825M46k598
$$ -1760 -2438 -238 2392 2424 209 -1740 -2179 -797 1369 2274 23 -2335 -2776 -871 1954 2400 -198
1469a98j832j20J767K055O56j499k793j94J711K756R98k686k321j81J569J944
$$ -198 -2030 -2150 -383 1672 2328 829 -1964 -2158 -447 2309 3307 621 -1700 -1881 -312 1632
1485A632J330k046k654m21J540K252P51k178k609p6J791J696J016j527k985k10
$$ 1632 2962 916 -1738 -2159 -619 1633 2384 206 -2403 -2479 -688 1008 2024 497 -2488 -2698
1501b698J702K346R83j643l005k12K145K265N46j010k773q71K020K107P67j325
$$ -2698 -996 1350 2333 690 -2315 -2527 -382 1883 2429 1419 -1354 -2225 -205 1902 2669 1344
1517A344k963j147K827J511J08n30k596j525K230K462k64q12k484j550K687K802
$$ 1344 -1619 -2766 61 1572 1680 1150 -1446 -2971 -741 1721 1457 645 -1839 -3389 -702 2100
1533B100p78j193j035k002J402L950k30j774j187j477J215L593J35k800o29o37
$$ 2100 1322 129 -906 -2908 -1506 2444 2214 440 -747 -2224 -1009 2584 2719 -81 -710 -1347
1549a347j98L391J325k969j418m67n0L223J466l403j837J072n72K317K470k670
$$ -1347 -1545 1846 3171 202 -1216 -1683 -1733 1490 2956 -447 -2284 -1212 -1784 533 3003 333
1565C33l114J332M16J156L015k068l814J626J207L9K846m69m875P57K529j72J385
$$ 333 -2781 -1449 -1033 123 3138 1070 -2744 -1118 89 128 2974 2505 -2370 -1613 916 744 2129
1582B129lm379m95L735m35J97J549l749k304L930J245j260J336k472k887L541
$$ 2129 2126 -2253 -2748 987 552 749 2298 -1451 -3755 175 1420 160 1496 -976 -3863 -322
1598c22K582k032O54m46m045K741M011k292m55K10l302J443M301j286k031J167
$$ -322 2260 228 882 436 -3609 -868 3143 851 396 606 -2696 -1253 3048 1762 -269 898
1614H98k553o48M742L3l299N82o27j945M390J329m157k28J036k217K856L536m276
$$ 898 -1655 -2303 2439 2472 -827 -245 -872 -2817 1573 2902 -1255 -1483 -447 -2664 192 3728 -548
1631e48j659K076j488J112M016k768l128K453m04l34M006j179m957J691J895j197
$$ -548 -2207 -131 -1619 -507 3509 741 -2387 66 -338 -672 3334 2155 -2802 -1111 784 -413
1647d13K681O39n331N09K545j269J655J837m800j429L858j63p46K446k721k740
$$ -413 2268 2907 -2424 -1915 630 -639 1016 2853 -1947 -3376 482 319 -427 2019 -702 -3442
1663c442L393J361j484J857j474l503K593K819j789O55M53l930J017M034j358
$$ -3442 -49 1312 -172 1685 211 -3292 -699 2120 331 986 1439 -2491 -1474 2560 1202
1678A202j051J238l343o12N005n87k464J095j672j554L755J214k857P44p71k205
$$ 1202 151 1389 -1954 -2566 2439 1852 -612 483 -1189 -2743 1012 2226 -631 113 -658 -2863
1694b863L164K312k779q42P48j720J271L768k026k139Q65o82M59L354j072l281
$$ -2863 301 2613 -166 -1008 -260 -1980 -709 3059 1033 -1106 -241 -923 -464 2890 1818 -1463
1710a463J019K22n23K628L86l575l0R60j83K078L50k781j131J496K12J019J543
$$ -1463 -444 -222 -745 1883 2269 -1306 -1336 -376 -559 1519 1869 -912 -2043 -547 -335 684 2227
1727B227k389k324J709J183J60J313j541k315J296J401L18N23r46k232L49K118
$$ 2227 -162 -2486 -777 406 566 1879 338 -1977 -681 720 1038 1561 615 -1617 -1268 850
1743H50N08r8q08j828j48K029P95p08l60j516o62K146J307r58q08j105m07J495
$$ 850 1358 1260 452 -1376 -1524 505 1300 592 232 -1284 -1946 200 1507 549 -259 -1364 -1771 -276
1761b76J581J02j318j107k82R72K213j41j665j280K92J180J219J58j477j326n2
$$ -276 1305 1407 89 -1018 -1300 -328 1885 1744 79 -1201 -909 271 1490 1648 171 -1155 -1207
1778a207J191J018N29j123k047j42J710J138j78j012j331o44J897J373j24o53
$$ -1207 -16 1002 1531 408 -1639 -1781 -71 1067 889 -123 -1454 -2098 -201 1172 1048 395
1794C95j665q45J978J908r65o41q90q04J169K382k09j233j262j042J204K828q57
$$ 395 -1270 -2115 -137 1771 806 165 -725 -1529 -360 2022 1813 580 -682 -1724 -520 2308 1451
1811A451j763n57k52k28K724N28k392o75l47K15K531R17k664j230J018n1J441
$$ 1451 -312 -869 -1121 -1349 1375 1903 -489 -1164 -1511 -1296 1235 2152 -512 -1742 -724 -775 666
1828F66J686k057k198J172N44R08J689j756k905J460R92j28K049q06l368K84K254
$$ 666 2352 295 -1903 -731 -187 721 2410 654 -2251 -791 201 73 2122 1316 -2052 -1768 486
1845D86J19Q71l77l148j18K677j06L32N32k582j445K813J437r07J36j567j692
$$ 486 605 1476 1099 -2049 -2167 510 404 736 1268 -1314 -2759 54 1491 584 720 -847 -2539
1862b539K926J647j366L04r37k455J914L025j121r06p26j632J058L052j038j300
$$ -2539 387 2034 668 972 35 -2420 -506 2519 1398 492 -234 -1866 -808 2244 1206 -94
1878i4p4j598O2L342L68k626p18L68p51K525J329k423j018M65k58J766J941k494
$$ -94 -168 -1766 -1704 1638 2006 -620 -1338 -970 -1721 804 2133 -290 -1308 -843 -1101 665 2606 112
1896A12j782J095K7J016K315k027k430J036O58J18K373j353l059L37J655L84J089
$$ 112 -1670 -575 -548 468 2783 756 -1674 -638 20 138 2511 1158 -1901 -1564 91 475 1564
1913A564m52k868l07K228K74N38J90k530j140K138J455l16J36j780j080J787J458
$$ 1564 1112 -1756 -2063 165 439 977 1167 -1363 -2503 -365 1090 774 910 -870 -1950 -163 1295
1930A295o9k20j067j875J333K524m73j127o88j180P50K168k17r46j005p29J88
$$ 1295 1226 1006 -61 -1936 -603 1921 1448 321 -367 -1547 -797 1371 1154 208 -797 -1526 -1338
1947a338K623L69j671r49k38j00K195R65j540j026n93M76J616J279j452j549J01
$$ -1338 1285 1654 -17 -966 -1204 -1304 891 1856 316 -710 -1303 -827 789 2068 616 -933 -832
1964h32L79J445P63p98j903j69N91J405R08p33k306l61J091R72O02l52j785o30
$$ -832 -453 992 1755 957 -946 -1115 -524 881 1789 1056 -1250 -1611 -520 452 1054 702 -1083 -1713
1982a713J081J246O02p75j380r77J367J486M36n21j528q02R93J336P09o20j507
$$ -1713 -632 614 1216 441 -939 -1916 -549 937 1373 852 -676 -1478 -485 851 1560 940 -567
1999e67p98Q24J800J44q21j343m39M24J200R21q63j335q82N97J575N81l61j590
$$ -567 -1365 -541 1259 1403 582 -761 -1200 -776 424 1345 482 -853 -1735 -1138 437 1018 657 -933
2017i33m77N39J196J101p33j491m26R11J175N06l86j467n98Q85P82Q54j58j703
$$ -933 -1410 -871 325 1426 693 -798 -1224 -313 862 1368 982 -485 -1083 -198 584 1438 1280 -423
2035d23o82J38J380R48n59j469p29Q24Q25P06o26r76o81K45J386J031p85r85q33
$$ -423 -1105 -967 413 1361 802 -667 -1396 -572 253 959 333 -643 -1324 -1079 307 1338 553 -432 -1265
2054a265M79J238J091p91q56o97K4J503R02o02j235p88L8J602P14k05j723m87
$$ -1265 -786 452 1543 752 -104 -801 -777 726 1628 1026 -209 -997 -959 643 1357 1152 -571 -1058
2072a058K84J059Q70n08j395q42N61J179Q59n31j205p17N41J343O48k76j124q90
$$ -1058 -774 285 1155 647 -748 -1590 -1029 150 1009 478 -727 -1444 -903 440 1088 812 -312 -1202
2090a202O16R36J024m05j137m55q4J051R65k75j124q95j20J442J094n09j565l11
$$ -1202 -586 350 1374 969 -168 -623 -707 344 1309 1034 -90 -985 -1105 337 1431 922 -643 -954
2108i54o4J095J134n42j244n58L90M98J461m55j260p48M74P35J162O6j430r13
$$ -954 -1018 77 1211 669 -575 -1133 -743 -245 1216 761 -499 -1247 -773 -38 1124 1190 -240 -1153
2126a153R00L02R78O02j839j145R57R71J36L27q41j840P32J196K07M11q03j792
$$ -1153 -253 49 1027 1629 -210 -1355 -398 573 709 1036 195 -1645 -913 283 490 901 98 -1694
2144a694M17J487L68j64Nj854K02J684M68k23l89j148l81J858Q18q36j05r97j012
$$ -1694 -1277 210 578 414 419 -1435 -1233 451 919 696 307 -841 -1222 636 1454 618 513 -484 -1496
2163a496J739J394j093o18k84j062J289J823j105j018P7j063N36K363p91j494
$$ -1496 243 1637 544 -74 -358 -1420 -131 1692 587 -431 -354 -1417 -881 1482 691 -803
2179h03N53o57j53K209L65k146k08P93p84K123O47k565k03Q47k61J084J303k141
$$ -803 -250 -907 -1060 1149 1514 -632 -840 -47 -831 1292 1939 -626 -829 18 -243 841 2144 3
2197Cj446J378j74L90J678j614k236J552O97n40J479p36k464P96J572n01J004
$$ 3 -1443 -65 -239 151 1829 215 -2021 -469 228 -312 1167 431 -2033 -1237 335 -166 838
2214H38K51k837O9K303n8j79P65j996p54K457M34j027P46j117j677K296J158j443
$$ 838 1089 -1748 -1679 624 566 387 1152 -844 -1598 859 1293 266 1012 -105 -1782 514 1672 229
2232B29J70n94j803J633J918j256r21O46j529P08K235p09j523N89o92l51K725
$$ 229 399 -195 -1998 -365 1553 297 -624 22 -1507 -799 1436 727 -796 -207 -899 -1250 1475
2249A475q5k144L58k19k46J783R93k400l12O65p34J626J338k160j050Q49RL46
$$ 1475 1390 -754 -396 -615 -861 922 1915 -485 -797 -132 -866 760 2098 -62 -1112 -263 -254 92
2267I2J620j401j657P56N51j95J633q79k370R51R22n9J073p9k584K95J786j90
$$ 92 1712 311 -1346 -590 -39 -234 1399 520 -1850 -899 23 -36 1037 958 -1626 -1331 455 265
2285B65N21L54j844r05K125K54n35Q33j528j175J623J142r41K62n44j652J497
$$ 265 786 1140 -704 -1609 516 770 235 1068 -460 -1635 -12 1130 189 451 -93 -1745 -248
2302b48J211p02k00j82j460P00K257p61q74l4r53L63K124j10j466J56n84q9J865
$$ -248 963 261 61 -121 -1581 -881 1376 615 -259 -293 -1246 -883 1241 1131 -335 -179 -763 -852 1013
2321A013P34j747p18K42j16J506P91j526j174J89P2J027J216j107j717L36L22
$$ 1013 1747 0 -718 -476 -592 914 1705 179 -995 -806 -734 293 1509 402 -1315 -979 -657
2338f57P67Q53l86j740J81O81N82P21n50j330K11R49L44N82k29j291o30J005P63
$$ -657 110 963 577 -1163 -982 -301 281 1002 452 -878 -667 282 626 1208 979 -312 -942 63 826
2357H26R1k06j210r00J170R38J35k60r23o01K00J497J03n19p12p58M21J187L66
$$ 826 917 711 -499 -1399 -229 709 844 584 -339 -940 -740 757 860 341 -371 -1129 -708 479 845
2376H45p09l73m37K05Q27P69o80j082j92M32Q07Q30l42j227o04O41O00N33l01
$$ 845 136 -237 -674 -469 358 1127 447 -635 -827 -395 412 1242 900 -327 -931 -290 310 843 542
2395E42j103m37N05P70M94j38r44r55O44J077K68r6p83j153Q52J018K39l39m57
$$ 542 -561 -998 -493 277 771 633 -311 -1266 -622 455 723 627 -156 -1309 -457 561 800 461 4
2414Dq65K40J336J53l65n25p84j1J234M92m78l79q62j38J393N12o63q63k67J34
$$ 4 -861 -621 715 868 503 -22 -806 -817 417 909 431 52 -810 -948 445 957 294 -569 -836 -702
2434g02Q30R49q39o30m64K9R19J031n68r07q5M1N82J118o75r65l44K24P26O76
$$ -702 128 1077 238 -392 -856 -827 92 1123 555 -352 -437 -396 186 1304 629 -336 -680 -456 270 946
2454I46k0j192m01K85Q16L81j42j133q21O58J033J45J70j234o32O01P92Q3N02
$$ 946 926 -266 -667 -382 434 815 673 -460 -1281 -623 410 555 725 -509 -1141 -540 252 335 837
2473H37p36j285M49J220K16M3p07r83L78R90P02l15o68p70l0Q91M71K9q33m73
$$ 837 101 -1184 -735 485 701 744 37 -946 -568 422 1124 809 141 -629 -659 232 703 732 -101 -574
2493e74k82R31P80m27o70o71j28J020Q67l40j080l41K54M87J214k94r01n46L52
$$ -574 -856 75 855 428 -242 -913 -1041 -21 846 506 -574 -915 -661 -174 1040 746 -155 -701 -349
2512c49L46J037j59j006n95K51N06P71m6p89o69P5N96M32N36j082r66K12Q87Q78
$$ -349 -3 1034 875 -131 -726 -475 31 802 756 -33 -702 -627 -31 401 937 -145 -1111 -899 -12 866
2532H66k13p27r56Q4Q28R16k15m65q22L62L92Q22p4o34o20j48R17P55l31r66n18
$$ 866 653 -74 -1030 -946 -118 798 583 118 -704 -342 50 872 798 164 -456 -604 313 1068 737 -229 -747
2553g47j67P90J035j52q54p88K55M96O50L2m88j129K83M23Q66M19r48o49j52R89
$$ -747 -914 -124 911 759 -95 -883 -628 -132 518 550 62 -1067 -784 -361 505 924 -24 -673 -825 164
2573A64L40K63n20q77K53M10N63J23o38n00k17Q50N14R4n53q52l59Q40N22J23
$$ 164 504 767 247 -630 -377 33 596 719 81 -419 -636 214 728 822 269 -583 -942 -102 420 543
2593E43m32q96m3Q44M57K5k29j086j34N43J204p9o02m16n28Q26Q17M2r10m23L
$$ 543 111 -785 -828 16 473 498 269 -817 -951 -408 796 717 115 -301 -829 -3 814 856 -54 -477 -474
2614d74L85R69j45p67l68k24M80Q27K7o36o63j81M05Q09M81j058p17R6M09J003
$$ -474 -89 880 735 -32 -400 -624 -144 683 710 74 -589 -770 -365 444 925 -133 -850 -754 -345 658
$$ [...]
8191a32
##END NTUPLES=NMR FID
##END=
