##TITLE=1H_DE-13kFiltTFA
 CDCl3
 8 sc, 
 7.9.2023
##JCAMPDX= 6.0         $$ Bruker NMR JCAMP-DX V2.0
##DATA TYPE= NMR FID
##DATA CLASS= NTUPLES
##ORIGIN= UXNMR, Bruker Analytische Messtechnik GmbH
##OWNER= root
$$ XWIN-NMR		Version 3.5
$$ Thu Sep  7 14:54:26 2023 Russian Standard Time (UT+4h)  she@DPX200
##.OBSERVE FREQUENCY= 200.13135
##.OBSERVE NUCLEUS= ^1H
##.DELAY= (6, 6)
##.ACQUISITION MODE= SIMULTANEOUS
##.ACQUISITION SCHEME= undefined
##.AVERAGES= 8
##.DIGITISER RES= 18
##SPECTROMETER/DATA SYSTEM= spect
##.PULSE SEQUENCE= zg30
##.SOLVENT NAME= CDCl3
##.SHIFT REFERENCE= (INTERNAL, CDCl3, 0, 15.7039)
##AUDIT TRAIL= $$ (NUMBER, WHEN, WHO, WHERE, WHAT)
$$ ##TITLE= Audit trail, XWIN-NMR		Version 3.5
$$ ##JCAMPDX= 5.01
$$ ##ORIGIN= Bruker BioSpin GmbH
$$ ##OWNER= she
$$ F:/spectra/data/she/nmr/H-F/1/audita.txt
$$ ##AUDIT TRAIL=  $$ (NUMBER, WHEN, WHO, WHERE, WHAT)
(   1,<2023-09-07 14:52:51.29 +0400>,<she>,<DPX200>,
      <created by zg, POWCHK disabled, PULCHK disabled
       configuration hash MD5:
       00 E9 B6 7A A2 85 ED C7 34 08 36 98 17 FE 4E 26
       data hash MD5: 16K
       6F AD B9 D5 A8 F7 82 2F D8 7D A1 63 7C C8 20 2D>)
$$ ##END=
$$ 
$$ hash MD5
$$ 15 EB A8 31 74 61 15 08 26 5F 4C D3 7F 39 DE F3
##$RELAX= 
##$RELAX= 
##$RELAX= 
##$RELAX= 
##$RELAX= 
##$RELAX= 
$$ Bruker specific parameters
$$ --------------------------
##$DU= <F:/spectra>
##$EXPNO= 1
##$NAME= <H-F>
##$PROCNO= 1
##$TYPE= <nmr>
##$USER= <she>
##$AMP= (0..31)
100 100 100 100 100 100 100 100 100 100 100 100 100 100 100 100 100 100 
100 100 100 100 100 100 100 100 100 100 100 100 100 100 
##$AQSEQ= 0
##$AQ_mod= 1
##$AUNM= <au_zg>
##$AUTOPOS= <>
##$BF1= 200.13
##$BF2= 200.13
##$BF3= 200.13
##$BF4= 200.13
##$BF5= 200.13
##$BF6= 200.13
##$BF7= 200.13
##$BF8= 200.13
##$BYTORDA= 1
##$CFDGTYP= 0
##$CFRGTYP= 5
##$CHEMSTR= <none>
##$CNST= (0..31)
1 1 145 1 1 1 1 1 1 1 1 1 1 1 1 1 1 1 1 1 1 1 1 1 1 1 1 1 1 1 1 1 
##$CPDPRG= <>
##$CPDPRG1= <>
##$CPDPRG2= <>
##$CPDPRG3= <>
##$CPDPRG4= <mlev>
##$CPDPRG5= <mlev>
##$CPDPRG6= <mlev>
##$CPDPRG7= <mlev>
##$CPDPRG8= <mlev>
##$CPDPRGB= <>
##$CPDPRGT= <>
##$D= (0..31)
0 1.2 0 0 0 0 0 0 0 0.06 0 0.03 0 0 0 0 0.0002 0 0 0 0 0 0 0 0 0 0 0 0 
0 0 0 
##$DATE= 1694083970
##$DBL= (0..7)
120 120 120 120 120 120 120 120 
##$DBP= (0..7)
150 150 150 150 150 150 150 150 
##$DBP07= 0
##$DBPNAM0= <>
##$DBPNAM1= <>
##$DBPNAM2= <>
##$DBPNAM3= <>
##$DBPNAM4= <>
##$DBPNAM5= <>
##$DBPNAM6= <>
##$DBPNAM7= <>
##$DBPOAL= (0..7)
0.5 0.5 0.5 0.5 0.5 0.5 0.5 0.5 
##$DBPOFFS= (0..7)
0 0 0 0 0 0 0 0 
##$DE= 6
##$DECBNUC= <off>
##$DECIM= 32
##$DECNUC= <off>
##$DECSTAT= 4
##$DIGMOD= 1
##$DIGTYP= 9
##$DL= (0..7)
0 120 120 120 120 120 120 120 
##$DP= (0..7)
150 150 150 150 150 150 150 150 
##$DP07= 0
##$DPNAME0= <>
##$DPNAME1= <>
##$DPNAME2= <>
##$DPNAME3= <>
##$DPNAME4= <>
##$DPNAME5= <>
##$DPNAME6= <>
##$DPNAME7= <>
##$DPOAL= (0..7)
0.5 0.5 0.5 0.5 0.5 0.5 0.5 0.5 
##$DPOFFS= (0..7)
0 0 0 0 0 0 0 0 
##$DQDMODE= 0
##$DR= 18
##$DS= 0
##$DSLIST= <SSSSSSSSSSSSSSS>
$$ [...]
##$SUBNAM2= <"">
##$SUBNAM3= <"">
##$SUBNAM4= <"">
##$SUBNAM5= <"">
##$SUBNAM6= <"">
##$SUBNAM7= <"">
##$SUBNAM8= <"">
##$SUBNAM9= <"">
##$SW= 18.05172834244
##$SWIBOX= (0..15)
0 0 2 0 0 0 0 0 0 0 0 0 0 0 0 0 
##$SW_h= 3612.71676300578
##$TD= 16384
##$TD0= 1
##$TE= 0
##$TE2= 300
##$TE3= 300
##$TEG= 300
##$TL= (0..7)
0 120 120 120 120 120 120 120 
##$TP= (0..7)
150 150 150 150 150 150 150 150 
##$TP07= 0
##$TPNAME0= <>
##$TPNAME1= <>
##$TPNAME2= <>
##$TPNAME3= <>
##$TPNAME4= <>
##$TPNAME5= <>
##$TPNAME6= <>
##$TPNAME7= <>
##$TPOAL= (0..7)
0.5 0.5 0.5 0.5 0.5 0.5 0.5 0.5 
##$TPOFFS= (0..7)
0 0 0 0 0 0 0 0 
##$TUNHIN= 0
##$TUNHOUT= 0
##$TUNXOUT= 0
##$USERA1= <user>
##$USERA2= <user>
##$USERA3= <user>
##$USERA4= <user>
##$USERA5= <user>
##$V9= 5
##$VALIST= <valist>
##$VCLIST= <CCCCCCCCCCCCCCC>
##$VD= 0
##$VDLIST= <DDDDDDDDDDDDDDD>
##$VPLIST= <PPPPPPPPPPPPPPP>
##$VTLIST= <TTTTTTTTTTTTTTT>
##$WBST= 1024
##$WBSW= 4
##$XGAIN= (0..3)
0 0 0 0 
##$XL= 0
##$YL= 0
##$YMAX_a= 163791
##$YMIN_a= -151094
##$ZGOPTNS= <>
##$ZL1= 120
##$ZL2= 120
##$ZL3= 120
##$ZL4= 120
##$ABSF1= 10
##$ABSF2= 0
##$ABSG= 5
##$ABSL= 3
##$ALPHA= 0
##$AQORDER= 0
##$ASSFAC= 0
##$ASSFACI= 0
##$ASSFACX= 0
##$ASSWID= 0
##$AUNMP= <proc_1d>
##$AZFE= 0.1
##$AZFW= 0.1
##$BCFW= 1
##$BC_mod= 2
##$BYTORDP= 1
##$COROFFS= 0
##$CY= 11.3945322036743
##$DATMOD= 1
##$DC= 2
##$DFILT= <>
##$DTYPP= 0
##$F1P= 15.7292609196834
##$F2P= 12.9074282941183
##$FCOR= 0.5
##$FTSIZE= 0
##$FT_mod= 4
##$GAMMA= 1
##$GB= 0.15
##$INTBC= 1
##$INTSCL= 1
##$ISEN= 128
##$LB= 0.24
##$LEV0= 0
##$LPBIN= 0
##$MAXI= 10000
##$MC2= 0
##$MEAN= 0
##$ME_mod= 0
##$MI= 1.114404
##$NCOEF= 0
##$NC_proc= 0
##$NLEV= 6
##$NOISF1= 3.799351
##$NOISF2= 2.8
##$NSP= 1
##$NTH_PI= 0
##$NZP= 0
##$OFFSET= 15.70392
##$PC= 1
##$PHC0= -21409.81
##$PHC1= 18.45271
##$PH_mod= 1
##$PKNL= yes
##$PPARMOD= 0
##$PSCAL= 0
##$PSIGN= 0
##$REVERSE= no
##$SF= 200.130013532006
##$SI= 16384
##$SIGF1= 3
##$SIGF2= 2
##$SINO= 400
##$SIOLD= 16384
##$SREGLST= <1H.CDCl3>
##$SSB= 0
##$STSI= 0
##$STSR= 0
##$SW_p= 3612.71676300578
##$SYMM= 0
##$S_DEV= 0
##$TDeff= 0
##$TDoff= 0
##$TI= <>
##$TILT= no
##$TM1= 0
##$TM2= 0
##$TOPLEV= 0
##$USERP1= <user>
##$USERP2= <user>
##$USERP3= <user>
##$USERP4= <user>
##$USERP5= <user>
##$WDW= 1
##$XDIM= 8192
##$YMAX_p= 0
##$YMIN_p= 0
$$ End of Bruker specific parameters
$$ ---------------------------------
##NTUPLES= NMR FID
##VAR_NAME=  TIME,          FID/REAL,        FID/IMAG
##SYMBOL=    X,             R,               I
##VAR_TYPE=  INDEPENDENT,   DEPENDENT,       DEPENDENT
##VAR_FORM=  AFFN,          ASDF,            ASDF
##VAR_DIM=   8192,          8192,            8192
##UNITS=     SECONDS,       ARBITRARY UNITS, ARBITRARY UNITS
##FACTOR=    0.0002768,     1,               1
##FIRST=     0,             0,               0
##LAST=      2.2672688,     0,               0
##MIN=       0,             -151094,         0
##MAX=       2.2672688,     163791,          0
$$ Real data points
##PAGE= N=1
##DATA TABLE= (X++(R..R)), XYDATA
$$ [...]
2143F89p19j590o42K507K458j734j131n64j081J928K840j183k499j14o00P09L026
2160B300l10l007k73q6M64K444Q48l309p99Q54j00J801J800l010j895J156N66
2177e56J164K131k055l058J427J302K20J752j194l217P29J759P1J561n22l419
2193a905l75K646M17Q4P68k956j599K928R67j97O48j874k448K259K224m81j4j051
2211D1k783J593L307p14o22l15k520L84L557J76j765k41j848m95L527J020k003
2228B99p97o30j152K781K187k202j425o6r27J486K822j240k208M15q28Q91L151
2245B557p81k921K17J35J06K579M86l109r36J055J07J986R38k824j686J140M71
2262d80R38K068k567k596J369J286K91J592j246k860N75K107O5J148l23k952k20
$$ y = [689, -30, -1620, -2262, 245, 2703, 969, -162, -726, -1807, 121, 2961, 1778, -721, -835, -1435, -726, 2300, 1990, -1017, -1290, -1376, -912, 1532, 2380, -929, -1728, -874, -974, 827, 2627, -383, -2278, -1122, -556, 608, 2739, 684, -2374, -947, 355, 575, 2327, 1133, -2084, -1355, 404, 475, 2036, 1514, -1905, -2280, 366, 783, 867, 1635, -1321, -2920, 8, 975, 778, 1426, -448, -2896, -637, 1587, 1106, 1092, 41, -2742, -1149, 2158, 1444, 822, 507, -2013, -1629, 1928, 2104, 339, 98, -1750, -2245, 1282, 2302, 299, -498, -1128, -2280, 501, 2688, 486, -939, -1005, -1932, -446, 2376, 1136, -1072, -657, -1485, -594, 2557, 1776, -1145, -928, -793, -687, 1892, 2378, -731, -1667, -612, -505, 1481, 2419, -405, -2091, -951, -480, 458, 2526, -41, -2637, -1268, 18, 309, 1901, 655, -2205, -1630, 477, 542, 1690, 1367, -1585, -1805]
2279a805K477M07L16M11k990r84K331J120l52K84j945j856K126K162q33j48j287
2296e66j806J332K429k34p16m95k141N05L051M39j415m75j422j70K513J389j499
2313G19j175m77o54K072J768j388j644p8l12J264K143j144j931m18j25J079J982
2330A681J68k845p47O83O43J665N97k093j542Q14J195R41Q21j896j569Q78Q48
2347B42P52Q36j356j992K38J583O60L49j006j847k12J598R47N14o19k109r16K441
2365A03J085q2m43j566j095J496K144j95r87j141j023R38K454J04j326r99j000
2382a533O61K087L48j403p94r10K03K140Q90j270j202n32O6J444J687j218j766
2399a102j89M98P35J895p08j829n18N19J113J550l99j941j079J003N62J259K87
$$ y = [-1805, 672, 1079, 1395, 1806, -1184, -2168, 163, 1283, 931, 1215, -730, -2586, -460, 1702, 869, 721, -566, -2372, -1040, 1389, 1155, 439, -56, -2197, -1692, 1359, 1798, 383, -92, -1514, -1684, 829, 2218, 719, -456, -933, -1587, 485, 2253, 865, -779, -857, -1169, 95, 2238, 1094, -837, -1255, -1380, -301, 1681, 1849, -996, -1743, -1060, -417, 1248, 1845, -248, -1790, -976, 219, 1160, 1981, 85, -1484, -606, 242, 994, 1830, 474, -1518, -1280, 303, 963, 1312, 306, -1541, -1753, -155, 792, 1306, 687, -1422, -2338, 103, 1188, 1106, 663, -903, -1998, -502, 1642, 1447, 460, -681, -1704, -766, 1688, 1792, 466, -533, -1533, -872, 1215, 1563, 160, -634, -1544, -1341, 799, 1689, 419, -783, -1315, -1249, 195, 1882, 664, -1102, -1291, -793, -58, 1837, 1129, -700, -1218, -699, 414, 1964, 1565, -376, -1455, -452, 110, 1369, 1656]
2416A656k053j164P24J121R60M32k241j232J054Q50P28L52j108j870K67J752O33
2433H61K42q88j925K67K321K78n5n94j525o05J656J305k93p78j146j067J829J654
2451A537l93q63j277r92J675J552r0j193q68p72J075J714M11j622l13r61M27K231
2469A278N74j644j303J10K91J763P11j476r98p8k80J671J030p73j929j91O63Q86
2487C05J142o06j866j61K99R81J194j61k278n52R75R36J109j83j672j090Q61J206
2505D39Q65Q0j506j340L09J673O64J28j539j088K96J413O13j50q18j499J95J517
2523B52R64m38j079r72L7J003J367m6j093r60l99J447J255%j041j280N1O67J672
2542A407K3j213j148k33R33J275J95r81j319k17P26J291M39p87j516l65J045J202
$$ y = [1656, -397, -1561, -837, 284, 1244, 1676, -565, -1797, -743, 107, 835, 1187, 79, -1791, -1524, 228, 861, 1103, 215, -1710, -1443, 878, 1156, 1101, 507, -1018, -1623, 33, 1338, 1045, 267, -879, -1946, -117, 1537, 1144, 281, -996, -1988, -313, 1239, 1149, -44, -912, -1684, -609, 1105, 1516, -106, -419, -1380, -953, 1278, 1852, 208, -1095, -985, -694, 1069, 1780, 304, -694, -772, -1052, 619, 1649, 876, -1053, -1244, -581, 305, 1447, 841, -1025, -1186, -887, 94, 1288, 1127, -1151, -1703, -728, 208, 1317, 1134, -538, -1628, -767, 439, 1304, 1384, -122, -1462, -1153, 520, 1184, 1312, -227, -1315, -1019, 394, 1007, 857, 39, -1460, -1265, 252, 1216, 778, -301, -1273, -1236, -233, 1134, 1088, -5, -965, -1364, 83, 1338, 1338, 297, -983, -932, -265, 1407, 1430, 217, -931, -1164, -231, 1044, 1239, 258, -1061, -1278, -552, 739, 1178, 391, -1125, -1490, -445, 757]
2560G57L98p08j549j55Q67J093Q02q41j288n09P66Q58J362j180j237n95N40J552
2578I33L71n52j122j072Q06J250O10n42j345q35L79J514P73l48j052j014K05J350
2596C09J247o57j240p96J81J309J213n88j101r92L14R27J248m43j173j032L49
2613i25Q71J151M8j310j160J53J201R47J53j061j347J85J243M74M16r76j157Q3
2631a011J035Q57K21l16j750k06J094J047K75o98j433n33J267J102k9n97j144
2648h19n63R07J292M6p17p25r13R08J291M10p45q89p14M09J360N57k93j092o36
2667i26K51J677M99j049o97n03q5J137J243r33j002q00M21R09J093l13j854l12
2685a244N02O26J173p2j557p56L06J163Q22K65j360j097O64Q70P09J40r70j505
$$ y = [757, 1155, 447, -1102, -1257, -390, 703, 1505, 664, -624, -1133, -367, 491, 1853, 673, -564, -1159, -619, 933, 1304, 752, -370, -1442, -636, 614, 1224, 682, -663, -1498, -1119, 395, 1168, 820, -232, -1246, -1041, 309, 1556, 899, -341, -1137, -956, 353, 1566, 978, -123, -1115, -801, 126, 1374, 931, -242, -1274, -925, -54, 1097, 1145, -165, -1325, -1172, 29, 976, 1129, 68, -1279, -1094, 149, 623, 1039, 63, -1094, -1011, 24, 881, 1102, 786, -964, -1170, -76, 971, 1246, 548, -885, -1418, -151, 951, 922, 325, -819, -1382, -475, 817, 863, 146, -579, -1492, -584, 707, 1117, 372, -517, -1231, -822, 538, 1095, 802, -290, -926, -675, 1002, 1501, 452, -245, -748, -833, 304, 1547, 614, -388, -1188, -767, 142, 1235, 922, -932, -1244, -742, -116, 1057, 985, -572, -1328, -1022, 141, 963, 1228, -132, -1229, -565, 305, 1014, 1154, 184, -1321]
2703a321M64J200M24L58j080j367N9J464N10k3l60j379k68J528M30l8n17r38p90
2722a644J612J119m63l58q95o27R09J691k99n24q07r38O88J773k40q66m33q62
2740a164M37J727N24j556q02n7j03J471J108j560p79j93J83J252R65r67j396K65
2758f45Q4Q57J152p88j413N9K94O40R38L4j942j54P71R6Q56L75j860q16J125M33
2778I6N52M56j602q98Q58Q89J76M03p29j696O54J379Q6L87q41j554L43J730J47
2797H36k3j81j868P7J632M73k30l43q06j056J844N96q22L3o65r55J122J587o59
2816E92r87j04j068Q75K018k90j309p2n56J27J853J73j320k29m1k42J172R56j592
2835d4p95K25l2R93J047j093j476M28K58L29J332p41j306J50N39J78J141k65j979
$$ y = [-1321, -857, 343, 767, 1125, 45, -1322, -1263, 201, 711, 688, 328, -1051, -1319, 209, 639, 601, 84, -854, -1644, -32, 1087, 624, 266, -629, -1256, -347, 1344, 1045, 521, -286, -1224, -536, 1237, 997, 131, -302, -1164, -727, 1000, 1524, -32, -834, -891, -994, 477, 1585, 25, -754, -947, -764, 488, 1453, 486, -910, -645, -561, 296, 1448, 660, -753, -694, -400, 240, 1178, 1212, -730, -884, -113, -17, 839, 1214, -646, -1462, -337, 96, 648, 1104, -498, -1396, -538, 351, 527, 930, 201, -1495, -841, 538, 624, 1011, 170, -1384, -1041, 689, 836, 813, 632, -1236, -1159, 473, 946, 716, 373, -433, -1489, 355, 951, 129, 162, -503, -1458, -336, 1251, 592, -395, -499, -1567, -692, 1326, 1036, -273, -345, -901, -774, 1079, 1252, -68, -297, -338, -580, 592, 1548, -44, -839, -614, -646, 347, 1394, 301, -1175, -747, -489, -160, 1172, 431, -875, -725, -186, -8, 1133, 868, -1111]
2854a111L6Q92j8J135R4j674o02J315N51K40J54j228j262J310O74J6K20p96j333
2873a387P18J378l00L60o91j152K87J180M67l01k21j190m37J831M24o85j82n71
2891d72o73J067R83l62m36n63o19J032J167n58p11l45q30R40J256n6q60m40l48
2910h28L56J224K97j377n19P7L94R33O86j290p87K80J29R03P73q33r67J43K85
2929a21K80J192q52j334J86N04M60P60j61j483l76N47R07K63j46j144p53Q50P48
2948C27K87R0j018r67O60J013J46J50q97q06L99J253K39j69q54q32L39J175L67
2967I02k78n89o75j61J069P99m71r28m20k27J036J065m81q72l68m46R61J022P2
2986A010j273o47J68Q19Q80J16j182n59K46K91Q52M19q83p54j79L17J262O7p65
$$ y = [-1111, -1075, -183, -201, 934, 1028, -646, -1248, 67, 618, 858, 1012, -216, -1478, -168, 506, 522, 742, -54, -1387, -669, 709, 409, 769, 78, -1074, -787, 393, 860, 559, 338, -852, -1289, 542, 966, 281, 99, -472, -1145, -78, 905, 543, 107, -456, -1075, -43, 1124, 566, -145, -490, -1320, -380, 876, 820, -40, -480, -828, -472, 752, 1049, -328, -847, -770, -376, 557, 1243, -47, -834, -554, -425, 478, 1251, 418, -549, -406, -121, 159, 1351, 499, -835, -649, -145, 315, 1075, 914, -569, -945, -398, 509, 772, 626, -518, -1271, -421, 327, 614, 704, -314, -1281, -621, 392, 538, 688, -209, -1015, -616, 637, 876, 707, -147, -979, -640, 535, 902, 624, 35, -640, -801, 268, 1067, 596, -332, -752, -979, 57, 1122, 641, -231, -599, -1045, -84, 938, 1010, -263, -910, -742, 77, 957, 1073, -109, -668, -422, -131, 721, 1140, 257, -497, -676, -359, 903, 970, 205]
3005B05j106J51L98P29O56n87j192q6O14J121j50m94r36j56N72R03K55k74j190
3024e67l48P57P96L18o28q57o03Q78O82L68m04p29p61O41J034L05q53l98o57L55
3044f71R94N15n66o01j81QQ93O86m88q71n75K38J020N55k60p66o75K34P30O30
3064H49q8j222k93K08M44O56o5m23r61l8R78K86K87o86q90K86M31P82J78o58p63
3085g02Q5N88O17M86r45q99N8Q30Q18o3p99m79k79O59O25j11m28o29l34O90M38
3106B26L21n89m55l05N99O69K24o57o20J65O5R41K55n59j002K02O3P69N84k46
3126F50j109K5J99P24K96m93q34l87M74L38P12q5r75l59K38J129J54j71q03o28
3146i05M77P99J94L7p42p04M20P06O67k77o29o99K83Q07J66j73l02o75m26J026
$$ y = [205, -901, -750, -352, 377, 1033, 446, -746, -832, -218, 903, 753, 259, -677, -833, -261, 642, 897, 623, -567, -915, -158, 638, 956, 328, -529, -1132, -254, 428, 796, 392, -337, -1098, -457, 577, 882, 29, -369, -1026, -671, 323, 838, 272, -329, -510, -502, 391, 1077, 589, -282, -857, -619, 401, 956, 696, -70, -745, -511, 219, 849, 761, -461, -754, -546, -102, 554, 489, 66, -895, -933, 45, 331, 618, -68, -958, -672, -241, 541, 719, 61, -702, -617, -29, 588, 1074, 129, -770, -712, 118, 936, 873, 74, -405, -684, -25, 600, 489, 61, -568, -902, -212, 226, 547, -42, -497, -802, -203, 466, 690, 33, -587, -422, -357, 584, 839, 280, -722, -520, -457, 312, 896, 650, -459, -434, -235, 489, 785, 292, -542, -929, -455, -117, 595, 510, -465, -824, -586, 543, 697, 526, -277, -905, -428, 371, 565, 602, -140, -844, -424, 282, 949, 672, 43, -656, -373, 434, 600, 427, 125, -550, -976, 50]
3166E0O56k59m42p60j57J108P56m29n65n36j86L02J194k96k14o68j68M63P10J42
3186G01p78k49j94J68J194k34m42q02O3J13R43J23m94q08K57L31M68L24m81p76
3206e73k04O17N23L85j08r46m49Q26K96M18j52q38l71O32K33M41j2q84n80M85
3226b61O99J66J41j024n00K06R42K48K9n94r34K1J191L50l9o05o19J29O36N70
3246G52j08l65q50k58J024Q58n35o64k80k27Q65N11j23n65l84m62P56R65k84p90
3266a64m81K7K22J011K17j053o85N28O7R14K94r13o53J40M31O81L02q60o47K70
3286c52K67M03O81p89p78l36J077K30J13m2j334N9P95L38J21j3r17k95P91P12
3306G31j57k29n28n64L11J024j03o2p34m96L32J046J01l84l43p08K44R97K77o47
$$ y = [50, 706, 447, 5, -755, -912, 196, 952, 523, -42, -578, -764, -462, 732, 436, 222, -446, -614, -151, 559, 701, -77, -326, -520, -352, 842, 608, 166, -636, -573, -460, 483, 606, 112, -696, -439, -108, 360, 684, 203, -573, -777, -160, 363, 748, 640, -306, -755, 71, 367, 785, 633, -205, -576, 56, 289, 730, 718, -166, -746, -261, 438, 604, 745, -279, -779, -573, 369, 617, 646, 52, -882, -861, 330, 680, 641, 36, -583, -454, 182, 752, 644, 279, -571, -829, 195, 1053, 518, -146, -426, -653, 212, 723, 600, 35, -349, -811, -55, 910, 626, -164, -645, -618, -396, 615, 832, -221, -906, -378, -311, 603, 897, -16, -669, -529, -98, 583, 885, 25, -622, -352, -85, 318, 999, 210, -568, -904, 173, 403, 516, 474, -860, -801, -6, 332, 453, 440, -477, -772, 19, 731, 574, 345, -183, -747, -436, 588, 485, 423, -311, -807, -475, 571, 672, 288, -55, -763, -519, 478, 755, 108]
3326A08k07k85l45J146N69o47o46k00l10O37Q37l89p77Kr2O92O64j39j294M8L46
3347b82K4R16J05j101j94J21K66O85K97j007m16L79jN87M38r80p14M90K97L79
3367B89L49o42p14L7R01N9N2K62j349r1J128M24l04J56q51m27R71O9K22j55o64
3388b78k45K91Q04j29j47m36o59K88J039l05K7m43o96K1J808m02m25j79l49l02
3408g17R61J83j59j86o20j09R30M91m26m90k57j45N81O74n99n88L39ll1P46m57
3429A18m99k5J22L78L17L36r78k47K65J26N18K65o91n40K79L93R8N12n66q50O30
3450c9M6M66p2m92m10j40N41J85N70n12r77M7N76O74m1o0n88m13Q15J51K79j52
3472D54p81m78O86O07k0K2q48j94L41P98j40k24l53k79J63Q17O2l56n72n67L67
$$ y = [108, -99, -384, -729, 417, 986, 339, -307, -507, -817, -180, 657, 268, -509, -507, -599, 93, 757, 618, -676, -628, -282, -258, 658, 763, -338, -532, -411, -145, 540, 837, -170, -586, -207, -208, 379, 817, -163, -877, -387, -90, 289, 638, -4, -718, -681, 220, 279, 331, 593, -756, -847, 281, 705, 401, 557, -294, -721, 250, 319, 541, 386, -278, -523, -232, 572, 443, 296, -140, -799, -511, 528, 223, 250, -193, -889, -868, 940, 538, 113, -66, -415, -717, 244, 427, 268, 82, -538, -647, 283, 774, 348, -142, -399, -544, 37, 711, 112, -476, -137, -140, -171, 575, 118, -381, -406, -284, 94, 411, 747, -231, -478, -213, -87, 431, 696, 5, -535, -256, 137, 235, 747, 181, -669, -39, 7, 473, 401, -91, -501, -641, -100, 85, 655, 143, -834, -787, -211, 463, 422, 362, -226, -639, 176, 327, 606, 454, -327, -805, -119, 488, 468, 490, -358, -552, -211, 587, 447, 223, -130, -409, -246, 571, 633, 277, -295, -862, -495]
3493d95O54K58j34m99j91j79Q02O00o67p58J12K63K84M99k26m37l61J98K27P47
3513F97j57o80k55K99j10O17Np53l52M88K20L96%n73l78K3O92K80J1o53n44K36
3535d91N31N62j22k54o06o6O86K28J79n60n40J27K36M67nk71l16k39M26P20k65
3556D27m68n28l41Q99N49N4n25m73k29O39L70l8j30n47j93N58K63N22n92m16J11
3577h8o6M73L63n11o51K0L84K80K89k27o66j49L02M44K58j75q07j85J84P60J01
3598C33J6n01j06j08N16N94m63k90n16OP38L72k90m92j40k5M95M07p6n95l95Q8
3620d32O47N78n28o12l11L46J74N68j63m07k18j19L57O62j39m21l03k05N70L04
3640C48J32m86o31L6N58O38Lm49n67r5K69K69L65l64m90j43O90J76m2j54l82j9
$$ y = [-495, 159, 417, 283, -216, -407, -586, 216, 816, 149, -609, -497, -234, 50, 549, 323, -114, -475, -277, -50, 697, 540, -140, -395, -96, -206, 411, 416, -337, -689, -201, 19, 415, 415, -158, -536, -513, 179, 459, 470, -183, -727, -491, 40, 602, 480, 226, -380, -446, 240, 468, 647, 87, -453, -326, -90, 377, 372, 101, -215, -454, -28, 692, 427, -41, -569, -910, -11, 538, 592, 67, -406, -635, 4, 374, 336, 206, -341, -534, 24, 287, 809, 217, -199, -88, -154, 319, 682, 171, -480, -460, -76, 204, 493, 266, -400, -549, -247, 197, 455, 280, -527, -712, -528, 232, 333, 349, -152, -258, -366, 150, 744, 281, -9, -525, -519, 219, 591, 301, -191, -331, -356, 139, 546, 470, -125, -520, -432, 215, 793, 265, -347, -658, -312, -138, 430, 267, -140, -358, -477, -120, 542, 403, -18, -321, -526, 44, 348, 480, -6, -637, -601, -43, 595, 598, 149, -418, -513, -244, 25, 390, 26, -464, -607, 83, 259, 217, 63, -319, -338]
3662c38O3M91K89p31J89l50L3Q56j19j65k94k93K48L95j81P0o8l22q9N51J13k64
3684H4k03o31L50M36J77M2n30J23l64P18Q1p8m4o17Q8M64L29L1o05k26J96K93
3706A14L18j27l28l60kM24M84j45n88k99J64L59L74J2o77n13J94O67R9Q1m3o37
3728d29k52P35L90n4l32k45j73K96O51j35k86o34J63J41L67L93o30m4k72J10Q51
3749F11m88l77j05j06J62N53L63m38n7m70J89M18Q7k65j11k79m3R77j85k61k14
3770c9j85l37R17K74n37l54j53J25M74K48k2p48L3J7L03M81l24l74m38N16j03
3791b26P24K02j200J40j3K66L70J05o72k32M26M17J08l7m27n52L53L73N42m53
3811B14J48q82J02L59M42n4n16k26O4N21J28q7j7o72j09L71P24l00l29j75j70
$$ y = [-338, -275, 216, 505, -226, -37, -387, -354, 502, 383, 218, -76, -369, -121, 274, 93, 163, 95, -227, -316, 235, 348, 84, -119, -750, -400, 36, 213, 255, -275, -152, -516, 202, 283, 205, 161, -456, -368, 96, 425, 456, -149, -375, -179, 114, 432, 305, -23, -383, -385, 39, 523, 378, -210, -509, -345, 14, 388, 400, -277, -790, -596, 71, 170, 251, 208, -429, -681, 54, 444, 390, 58, -187, -360, -64, 587, 452, 166, -468, -305, -164, 203, 596, -34, -78, -350, -240, 611, 123, -254, -359, -465, -303, 250, 613, 175, 118, -352, -163, 255, 342, 77, -34, -313, -356, 621, 436, 175, -39, -224, -561, 356, 630, 93, -261, -414, -289, 185, 433, 411, -337, -304, -287, 16, 497, 173, -201, -639, -123, -226, 498, 700, -500, -360, -373, -107, 263, 368, -304, -536, -110, 307, 415, 378, -49, -601, -248, 125, 667, 214, 362, -520, -418, -59, 383, 329, -187, -413, -349, 172, 300, 213, 196, -476, -585, -214, 510, 210, -119, -294, -464]
3832d64L62N00j47k55j30m3j98N36L54o57r7k12K8P78J76m01l43q3j08N99K62
3853D57l50j99j66J65M03O0r8n27M6j61M93J40j68j87j08K27K17K16O4r18k41
3874f35O09K65O6L61p92k96M93M1J35J58p46j34K79M26J8J01l94m28K01M16R9
3895B43R1k65n97L67K94N09k94k06n20J66M58J59j14r2p92K65K99M92j83j78m69
3916c67j45M48M98Q3p26M0k54M12N04l72j12o4l02J2P08O9l47k43ol21O98L40
3938E53m35m95k59J37N16O05n52n18j31N70J79M90q72k87mK86K51L72j86n42K7
3959b95L3M72M3n7l91k60M42K99J01rm16l39k03P55mJ56l79n58K78O97N6p1m19
3982f9n41M93N5N18m16k37M4k49N12L02j52k03l08n1L67M38j34k51k31J8K57L86
$$ y = [-464, -102, 398, 251, -4, -134, -177, -375, 161, 515, -142, -239, -451, -423, 355, 531, 130, -213, -296, -404, 195, 457, 107, -92, -258, -93, 310, 370, 272, -255, -209, -370, 123, 263, 95, -92, -200, 27, 244, 460, 524, -394, -635, -26, 239, 305, 666, -126, -422, 71, 112, 247, 405, -341, -475, -196, 230, 248, 349, -45, -473, -272, 144, 243, 334, 69, -528, -161, 133, 642, 348, 142, -378, -212, 246, 405, 291, 199, -593, -328, -29, 463, 280, 102, -367, -512, -64, 434, 517, -209, -169, -423, -11, 493, 121, 9, -55, -357, -345, 363, 432, 85, -158, -164, -485, 213, 553, 118, -377, -636, -499, 17, 622, 70, -448, -579, -9, 170, 660, -212, -499, -503, -217, 34, 406, 220, -322, -295, -262, 210, 253, 196, -195, -455, -13, 286, 387, 378, -38, -377, -580, 175, 171, 327, -52, -610, -332, 365, 421, 350, -69, -610, -117, -62, 456, 40, -197, -153, -402, 110, 412, 260, 57, -251, -302, 65, 503, 369, 118, -113, -95, 162, 548]
4004E48m09r0k87N6j02P13k75k28l53p1J66N18K71n16j22j75K99J77L13m21l85
4025c73M49o5lO06m03o83K57j66N24K09j86n32L3J93L20J74q4n26j59L94J13K70
4047C62n2n73k59K59P09k42k24q3m49L16N49k8j04j75m20L94K11J77n44K14l24
4068b86q4M60M30k58k08k59j9K59L11j04o14M1R0L43L54l23p5l66J70J72K42o7
4090B09j69o0m8J88l1L54k40n45R7O0K32M01l78l58j47N99K20J22l05p19kM69
4112e1K60o8j68n66M31O6L18j55K23n71j98N36K76o9j60n44J43K00K17L2k23p0
4134a41k08K08K92J43j14m41j75L88Q6K74m80j0k57L60L46Q5k98j62j00n1L89
4155A34L61j60m78k47K50M23j91M2l63r2R5J60K76k31r7l77J89J30L68o0k30l98
$$ y = [548, 139, 49, -238, -182, -284, 429, 154, -74, -427, -498, -332, 186, 457, -59, -181, -356, -57, 120, 433, 12, -373, 76, 11, 8, 614, 211, -472, -215, -381, 143, 352, 166, -366, -333, -140, 180, 354, 270, -256, -415, -21, 92, 362, 310, -263, -522, -263, 446, 204, -20, -103, -552, -236, 313, 285, 181, 6, -414, -20, 191, 368, -176, 38, -286, -370, 90, 520, 262, 54, -205, -224, 35, 346, 242, -372, -331, -241, 102, 456, 133, 58, -308, -138, 34, 276, 209, 40, -20, -68, 120, 89, 443, 203, -342, -245, -185, 47, 448, 70, -288, -435, 164, 384, 506, 201, -518, -520, -51, 209, 141, -27, -593, -162, -96, 222, 67, 290, -281, -479, 57, 333, 264, 104, -440, -297, -97, 120, 152, -71, -141, -349, -141, 151, 294, 180, -261, -436, -48, 38, 312, -168, -178, -435, -75, 271, 356, 58, -104, -204, -255, 134, 495, 335, -143, -390, -140, 283, 92, 134, -229, -321, -226, -66, 210, -21, -118, -495, -306, -176, 192, 132, -98, -496]
4177d96K03L40J77J85m54p9q2K80L12m8l28k32J15p6O57k83j32m32p4J85M79P
4199B24j26k77Q4l6M24R6k40j80j59K39Q0J57k63k88k18M99L73j82l9l30l8R1
4221a09K20L65j86m45J31j69L16J67k02k18j69q7M91J98l03l87j40N02N9K3K17
4242B74k99m18N6K92Q9J80Ll46L96J26J0j4m80k71J02M32Q8l03J36j39k68O00
4264B46J74l01K51n54j21L91L42l08j81jk57L90L15r7m96j2q5J30L04O65p75j00
4286h0J44p7J88J00k18k26J89K1J04K81l59l57J0P6L51J08k61kk61Q7K21L51l6
4309C54n01j22j41O92K39l95l27L6m7j31O06j59j40n47M50M00l29L53m32l46L60
4330a27p8J00L96m23j02O3L80pj95j93p5k71N52L95k31m03j34j24M59M69l24n8
$$ y = [-496, -293, 47, 224, 409, -45, -124, -206, 74, 386, 338, 10, -222, -107, -183, 474, 191, 59, -373, -447, -262, 217, 224, 98, -179, -95, -131, 293, 389, 149, -31, -190, 49, 129, 286, 23, -265, -483, 16, 389, 207, 168, -162, -200, -109, 111, 476, 290, -155, -24, -193, 123, 290, 88, -130, -299, -386, 105, 303, 0, -387, -527, -25, 34, 57, 274, -25, -443, -387, -95, -6, 174, 177, -169, 227, 353, 363, 349, -131, -402, -300, 132, 220, -83, 53, -86, -354, 246, 420, 119, 370, -184, -305, 86, 428, 120, -61, -62, -319, 71, 386, 289, -207, -219, -304, -174, 130, 795, 20, -80, 64, -13, 175, 275, 57, -169, 20, 41, 145, 426, 67, -290, -280, -204, 147, 255, -6, -8, -269, -182, 39, 390, 354, -147, -269, -410, 282, 521, 126, -201, -165, -212, -343, 263, 104, -36, -583, -133, 267, -62, 291, -141, -487, -127, -205, -105, 291, -132, -234, -171, 209, 202, 7, -186, -261, -532, 20, 415, 184, -219, -353, -477, -18, 451, 127, 69]
4352F9k94J78p0N11j22l60l1l10L80J59l8p9l49O9M00J60O4l23m15J15K49L00
4374B63l7k38j13N5J7M12J3m34q4K41j28q9M68l16m13K70K16J04M1j44n05M2L84
4397B5O0j97J72k90j81M46Jj2J46j85J3q8OJ18o9R7k97J92L61N4l51j37Q0j36
4421a72L82J5j31l86K7kL88P3K6j96j76L8J52J98l5l39j36J01L28R0j15m43K39
4444g4j09K16L80k07m92L16j4J84nK51o17p1M5K63K81n6o28k3K85K09J44J8m2
4467B54n38J94J31K0J99J3n25j49K14J35K24k49k99K41L3K98o3r3p6j58R0L64
4489B60n8l0l84j26P2N12j82j0j8o25M53K12L26l00j09j79P3K28L4k06j68J03
4511a22q4L50K4n48J77Jn7J83L45k71K8M7k82J34M45k94p3k52K08r2N34l08k27
$$ y = [69, -225, -47, -117, 394, 272, -88, -119, -429, -49, 110, 72, -7, -356, -287, 113, 273, 337, 14, -401, -286, -37, 263, 226, -12, -125, -70, -53, 359, 372, -62, -146, 95, -33, -122, 346, 30, -383, -113, 103, 207, 248, 104, -401, -359, 25, 85, -112, 60, -230, -411, 35, 36, 24, 170, -15, -2, -90, -84, 34, -35, 62, -235, -43, 318, 372, 21, -116, -36, -172, 210, 225, 94, -292, -265, -267, 121, 194, 220, 24, -152, -114, 38, 236, 201, -138, -274, -173, 155, 245, 130, -313, -74, -183, 33, 413, 206, -286, 30, 16, 200, 195, 446, -171, -242, -197, 66, 347, 291, -337, -360, -75, 134, 278, 296, 254, -284, -90, 41, 61, 260, 273, -252, -401, -187, -52, 172, -77, -376, -135, -102, 196, 133, 40, -36, -194, -104, 260, 202, 172, -212, -338, -266, 246, 64, 54, 36, -589, -136, 76, 402, 102, -7, -186, -113, 115, 149, -57, -225, -122, -206, 144, 168, -380, -203, -202, -259, -76, 269, -2, 26, 73, -209, -75, 370, 76, 3, -249, -41, -133, 401, 93, -134]
4534a34j3J57n1K24J27o9m17L9L58k76L12k21k43RK04K31O9q4m66M1K37K07o3
4557A78j42k64M0R9R6Q0r3l19J64L30j15J64k02j87J41O3l7J87r2j60k35M12m0
4580F8L07n01L77k45j64K84q0k71j21N0K46J58J49j49j08n07M71K60P2J3l14k94
4602b99N4L17K60l9n32k57M48K87N9p4l13k75L11P3K84j68p6m11J61J79o4J52
4624G7m4l96K31Q1L20j81k17oJ64j21J87J03k50Q6n5P4J64P7j95k04o8L80K03
4647D10n18K37j59k05J08L59j19o3k84J51j7R6L72k26l78J50J48JJ77l50j93K5
4669b78L03R1M13m43l03M4J40M17k86j05op8lK57M3m8m78oK96K41j35q7j73o0
4693b44r1M80M4j86j50k86L73K05J33l36m3P2m7k31M31j66n0j29L10k18K29j55
$$ y = [-134, -147, 10, -41, 183, 310, 241, -176, -137, 221, -55, 257, 36, -207, -198, 6, 237, 306, 222, -244, -203, 34, 241, 178, 36, -228, -188, -89, 7, 87, -6, -325, -161, 169, 54, 218, 16, -171, -30, 33, -4, 183, 91, -69, -304, 108, 68, 375, -126, 251, 6, -158, 126, 46, -225, -346, -296, -50, 108, 257, 108, 0, -507, -36, 224, 296, 309, -5, -299, -245, 72, 332, 293, -239, -496, -48, 239, 298, 224, -89, -364, -53, 20, 304, 136, 60, -351, -190, -11, -75, 77, 33, -363, -132, -51, 269, 88, -129, -135, 29, -92, 95, 198, -52, 34, -21, 53, 217, 294, 99, -105, -173, 207, 410, -108, 129, -30, -235, -127, 232, 113, 50, -234, -83, -100, -4, 368, 142, -236, -86, 62, 63, 240, -110, -303, -278, 25, 116, 529, 86, -217, -173, -33, 384, 98, -7, -13, -91, -94, 163, 206, 158, -320, -326, -30, 211, 76, -11, -184, -244, -335, 145, 189, 3, -147, -433, -60, 145, 278, -58, -101, -29, -76, -307, 124, -42, -92, -221, 89, -129, 100, -55]
4715e5q7j46O3L06J30j00l01K22J3m43N63p1k33n6R9KK61r2q9l15J45J08L6l5
4739g5J5l63N24q9J18k00Lk30J53J11J89p3R2j34l45K10J88o7J7l90k6K65K35
4762A28J08k85J69j73J88j52K06k8k09k24J04N21l81J73j68j18J80Q6J28k10l05
4783b62j37K47K21L08l56l01K19o8%L10Q4k05j8k63L86Q7r9o8j70P2j07M94m57
4806h3Pq4L78l65L18J28l23j69J14J47k45M78k67l19K55j09M16p7l34j12k0L83
4828A17J95j08l4k60K9K79j94J7p2j44J47K69K0m00K37k41kJ92l8j19J33k45k8
4851b50L26P5K9k65j54K92o8k67O73j70k45j59J57J20Q8j57m4q7K03O2j4l8l1
4874G6l52K57r2K74M6k43j12p4K08L17j96j76Oj97K43J64j3l70M9J02J71J64q
$$ y = [-55, -142, -288, -225, 81, 211, 111, -190, 32, 45, -398, 165, 94, -139, -195, -96, -94, 167, 75, -14, -329, -184, -76, -40, -75, -60, -423, 101, 12, 130, -70, -67, -297, -144, -33, 156, 83, 175, 41, -304, -94, 94, 27, 44, -346, -372, -107, 128, 236, -49, 120, -53, 135, -17, 189, 161, -48, -272, -168, 353, -28, 145, -23, -141, 39, 125, 253, 43, -262, -399, -152, 69, 377, 21, -280, -61, -129, -129, 181, 265, 60, 42, -221, 165, 252, 153, 85, -85, -13, -120, 374, -83, -76, -160, 218, -147, 171, 299, -24, -193, -79, 68, -177, 301, 34, -285, -30, -139, 277, 200, -134, -246, -266, 117, 312, 204, 170, -90, -61, 218, 24, 41, -31, -175, -28, 241, 261, -139, 98, -143, -145, 47, 9, -110, 23, -222, -250, 76, 151, 180, -85, -239, 53, -15, -282, 391, 221, -24, -183, -26, 94, 182, 25, -19, -106, 97, 159, 145, 107, 76, -276, -19, -111, 163, 209, -34, -146, -220, -12, 305, 109, -67, -61, -258, -15, 149, 136, -234, -185, -83, 88, 252, 244]
4897B44l64N3k05L78J59k54j26l60N96r6J48j58J23m05K59p5J99J81l87j14K53
4918D9j62J52J60k54r8j1L03l3J29j76j8m15P50j43P4j90j24l26J66K71l0m4l
4941B7m18M62k6Q5k45M6j42J17L27q9k36j26J17o3J57J25l9k58R9Q4J85Pk07p9
4965i0j82K03Q6K71N3m16p9J08j95M84J9m91J15K94k63M6M6l7j76K59O0J70j26
4988A59o1k91K38j15K35j00l12J85k01P49k83pN8k83J91L75l85K30l50k50q1K74
5010b5M58l47n2J15k65J20K02k17j07JM2o5L13J88m93J33j25O7K02j26M3q5j62
5033a85J64M7J11j20J53j00q5K82l2j98lJ61Kk37J93j97j56O0J02j14M84j73m64
5056c05J64j4M63k34M9k53k45M27N1P8j89nj6J9kJ09l00j09J53K12j95K34j26
$$ y = [244, -120, -67, -272, 106, 265, 11, -115, -475, 121, 25, 173, 15, 138, -267, -8, -83, 116, 297, -90, -204, 49, -113, 39, 199, -55, -153, -164, 139, 106, 235, 59, 41, -374, 376, 233, 307, 117, -7, -333, -167, 104, 74, 30, 27, -391, 71, 45, 130, -115, -69, -211, -94, 233, 144, -92, -218, -101, -164, -7, 118, 79, -179, -80, 4, 189, 196, -11, -90, -272, -69, 17, 288, 341, -75, -154, -46, -241, 243, 262, -229, -114, 180, -83, -37, 9, -28, -204, 55, 115, 285, 159, 98, -193, 45, -70, 165, 65, -247, -62, -263, 486, 203, 196, 254, -29, 162, 537, 152, 382, 32, -218, -299, -25, 433, 86, 34, 149, -116, 4, 206, -11, -118, -117, -75, -140, 173, 361, -132, 1, -124, -57, 145, 19, 62, -23, -185, -21, 26, 137, 17, 170, 70, -15, 267, 235, 37, 34, 195, 197, -40, 153, -44, -200, -140, -38, -152, 332, 159, -305, -141, -155, 308, 74, 123, -130, -375, 52, 103, 181, -8, -13, -29, -10, -12, 97, -203, -312, -159, 53, -142, 92, -34]
5079c4l0K07l91N4M95o6j12q7pj5K25Lk23j35l8L10R5J06j32k01k53K36k7k42
5103b62M98q15L34N0J06J59r8RJ01j10L53l42q1k48K54l1K88k65Q5j5j16M7p4
5126a73K42K5M6k76K88R8P3k36j26K36j75n3L07j54l49K93j90K05p9J6k90R4K93
5149A15R8m5j65j44k7k9L62N0L7k39M8k07J64Q7j06K13l91K17j08K73L1j77l84
5172c27L30J64j45K16l19L55m45M9j63M33n7l28J77o3J90j30K11j44k56J81J39
5193F8J58j65m6k90J02K79j26n2l17l5L86o2K89k46Kl75P20j43j82j67n0J24K96
5216A68Jj27J06k61j06J74J02p6N2j50j06K58l1k3j68J15k47K54J00P2M7k95J1
5239a30K8K12L9j73N4j58J8L29j58o5r6j32J27K88l41M95j50j59J34k25K7K25
$$ y = [-34, -64, 143, -248, -194, 301, 235, 123, 36, 29, 14, 239, 242, 19, -116, -154, 156, 251, 357, 225, 24, -229, 7, -20, -262, 236, -579, -245, -195, -89, 70, -28, -19, 82, -28, 325, -17, -98, -346, -92, -123, 165, -100, -15, -30, -146, -99, -173, 69, 94, 140, -136, 152, 250, 323, 87, -39, 197, 22, -31, 276, 122, -227, 66, -124, 81, 2, 18, -272, -178, 115, 213, 168, 3, -141, -168, -197, 165, 215, 252, 13, 61, -146, 18, 105, -1, 212, -179, 38, -70, 203, 234, 57, -327, 3, 167, 22, 238, -81, 274, -171, -122, -285, 148, 91, -237, -60, -123, 67, -63, 148, 4, -252, -71, 68, 226, 61, 15, -275, -173, 106, -20, -72, -389, -424, -38, -100, 189, -57, -55, -430, 290, 147, -35, -202, -252, -128, 168, 169, 42, 148, -113, -219, -45, 57, -19, 33, -117, -223, 35, 4, -19, -187, -72, -319, -65, 35, 107, 154, -141, -130, -102, 110, 149, -24, 30, -128, -110, 219, 61, -4, -100, -232, -105, 183, -158, 337, 187, 28, 162, -63, -36, 189]
5261A89J10k82J98l05K10k5p9k73J16J47j52O0L61m10J35K70l67j82J88J94l98
5282b95J52K0M1j54j0J57K36r4l8J50J40n70K65p9PO4j31q3K56k70J69L2Nm0P9
5307IJ7l5P1p6j07P8J04J34l41M5N5n8K00n1j50r5O8Q2J14J6k28n3R3k7J54J49
5333A68r3J72m62K04O8J45K6j97p7k85K99J13j13J59k67J60J05J54k24j89O9j58
5355b23K24L55k88k2j9J58K23l01O4j16J10j14K22j78j35m0p0P3J12J85o7n8R4
5378A89k77K19m6J84m61K71j67J46K28k79p3j52L59l37K07K63k32l8K08k70J68
5399A10k34j4M3j40M00k71L01l76Q9k7j5J09J38O5m33l8K92lL46l68J5j50M30
5422B69j14r8O8k21J82Q4k4m9o5l54M09r9K77l17J00j25L0P2p5K83j92o7k39M8
$$ y = [189, 299, 17, 215, -90, 120, 95, 16, -257, -141, 6, -146, -86, 275, -135, 0, 270, -97, -279, -91, 103, -295, -143, -123, -82, -236, -246, -89, 147, 53, 15, 165, 305, -265, 0, -79, -72, -8, -139, -222, 34, -236, -67, -35, -30, -70, 9, 26, -9, 62, -14, -121, -43, 61, 195, -146, -101, -46, -104, 96, 45, -105, -200, -132, -50, 64, 80, -148, -201, -108, -135, 19, 168, 75, 247, -215, -11, 57, 202, 228, 31, -46, -331, -32, 81, -32, 127, -140, 20, 125, 279, 55, -134, -65, -223, 1, 356, 68, 46, 27, 185, 408, 107, 171, 55, 165, 51, 273, 95, -40, -80, -150, -77, 35, 220, 153, 95, 189, -88, 131, 85, 269, -192, 79, -88, 58, 286, 7, -66, -218, 141, -196, 11, 274, 42, 4, 212, -58, 110, -124, -138, -95, -235, 165, -106, 195, -181, -92, -119, -134, -25, 113, 178, -255, -293, -1, -4, 342, -26, -11, -161, 269, 155, 57, 125, -96, 86, 170, 146, 97, 32, -322, 87, -12, 265, -52, 48, -77, -47, 25, -50, 233, 41, -26, -265, -217]
5446b17K40k2Q1j07k48J99J41Lk01j18J90O2L12j47k59Q6j35q2K79K40k57k7j26
5469a13p1J77K18j72o0NJ42K30l36M73m88M4j44K21k17LJ26K9P3Q4l6j85O4N0
5493A17p8j25J79j82L81j08m1j47j7J15J85j70J36k27p4j90O32m75l8O4K18m1
5515A14J19j89M1p4j6j18J50n2%p7K07L23n58K43K8k83J51P2j46J07j7k37L14
5538A02N1r8%k21J54L2M11l35j10L0j79J17N0j97K69j51K09M2K62n26Q7K0krJ04
5563A12M1k59O4J56q7j22J29Rj33J40P1K8J51j86k69kK62p0k7q8j38mL63j00o8
5588b7J89j62j67L42R1n7k04J48l43R1K70j55J63k83r4J03P7N2O9k16J8k3J98
5611H0MJ30k48k9k67O01O5r4k64k02K89O9r1J3k50P8qQp6j09J81j27J22o8K03
$$ y = [-217, 23, 1, 82, -25, -273, -74, 67, 70, -131, -249, -59, 3, 315, 168, -91, -5, -140, -222, 57, 297, 40, 13, -113, -184, -7, 211, 39, -21, -16, 126, 356, 20, 493, 5, 49, -95, 126, -91, -88, 38, 67, 140, 224, 188, 3, 67, 117, 39, -86, 93, -89, 292, 184, 143, -4, -21, 94, 279, 109, 245, 18, -56, -246, 386, -89, -127, -63, 155, 114, 233, 44, 85, 11, -5, -123, 27, -25, -25, -102, 105, 428, -130, 113, 141, -142, 9, 81, -65, 42, 25, -212, 102, 153, 55, 55, -166, -12, 20, 431, 96, -14, 16, -163, -46, 4, -193, 76, -75, 134, 176, 438, -88, -1, 19, 17, 8, 112, 153, -106, -42, 114, 27, -95, 34, 43, -90, 50, 121, 149, 300, 114, -155, -157, 105, 35, 8, -80, -218, -222, 141, 41, -27, 162, 0, -167, 175, 266, 209, 5, 153, -190, -99, 171, 16, 179, -104, -198, -95, -18, 34, 103, -113, -95, -118, 80, 84, 214, -34, -63, -330, 271, 336, 242, -22, -224, 65, 134, 43, 56, -194, -116, -124, -116, -192, -301, -120, -247, -125, -193, 10]
5636A0O1l0P3K18k80J41l21K33k5j78J28o1K32l16Q0K8J38J26m7l02o3J93k02
5659a64J57R2j27J59k37J63k2K22j85j78Q8J63j22k6J7J68o6k88M79j75q6O7j1
5682H8k33K7K74N5k46R0l9j7K92l18l0n0q8J45K12J55k67k21j7J99J5j06q2J04
5706e8l51M05j48J37j79K7J5R5K38J40l85q7jK14P3j15j17J79j18n0n1L8K91m75
5730b83O7M32L8k89L46l78K3L49j85k7p9m1Q2J92j68R3k40n0J9N3K01j56K27j32
5754I4k22K21j44J30k22K54K6q6J45l61L24j93n8o3L61j68l3k4k29L00P4Q0l06
5777a00j53K74nj4j91N54k99k54J26Q2M00pm47K44r4k86K99p1j63j59K72n0J31
5800H9p3j21r8L23O1k46R2L9m68N57j13j94J1K6k3o2K49k3j71N5K4J10J72K6L9
$$ y = [10, 71, 41, 114, 332, 52, 193, -128, 105, 80, -98, 30, -31, 201, -115, -35, -7, 131, 257, 210, -92, -155, 38, -164, -7, 85, -42, 117, -120, 43, 21, 243, 58, -120, -32, 131, 9, -17, 0, 168, 102, -186, 293, 118, 32, 99, 88, -145, -118, 156, 211, -35, 55, 16, -1, 291, -27, -57, -107, -195, -50, 162, 317, 50, -171, -188, 11, 26, -80, -162, -58, -409, -4, -152, -15, -194, -167, -152, -57, 181, 321, -64, -151, -152, 62, 135, 20, -97, 82, -36, -86, -137, -99, 192, -283, -216, 216, 254, -35, 311, -67, -44, 305, 120, 93, 14, -27, 55, 247, 79, 172, -68, -118, -99, -46, 155, -1, 226, 94, -128, 93, -51, 79, -143, 111, 137, 51, 196, -165, 159, -34, -92, -155, 206, 38, 5, -19, -248, 52, 126, 206, -100, -253, 21, 16, 2, -189, 365, 66, -188, -62, 20, 420, 413, -34, 210, 116, -170, 129, 58, -105, -264, 8, -42, 89, 16, -105, -203, 120, 181, -65, 27, 66, -402, 155, 42, -152, -141, -115, -138, -200, 49, 26, -145, -90, -66, 44, 216, 242, 281]
5825B81l75J51k19M35l72K7J55k02o6K14o0j9j59J90O6K00k17J82l62k2J26L34
5847B88k88k3O8k13K43l0JJ31j75j64J7N4Q5Q9J6k23K24r6K27j62j04j34M52p0
5871B13l05L26j28j20l4K21k08q4L0J3k81M29K5j3j94K8J34j17k4M0K50k91K61
5894A71p6Q0p5l24K47K8l0r9pJ34r3M2J27l32K17K2l18M46j11r5J31L8j05l45
5918c27M25j8O3k84J23k7j30N7J39pk01K67q9J34l9l4R6l52K10j19L06l1k67R5
5942a0n8L08l43K53j89K14j23p2j22J56J02k26J98J77j83j15M96m30K81j90j42
5963a8J98j78j33J59K1k9r0j7K87l82K17o6p4J12n2K23j69J67k4P1r6j92K31j70
5987dk11L20j74J60j0K07k05j80j81K53k05M64J4l56M0j2M18m57p1K3K20j2o5
$$ y = [281, -94, 57, -162, 273, -99, -72, 83, -119, -185, 29, -31, -50, -209, -19, 47, 247, 30, 212, -150, -172, -46, 288, 0, -23, 45, -168, 75, 45, 46, 177, 2, -162, -145, -91, -6, 83, 99, -124, 100, 4, 231, 69, -35, -169, 283, 213, -92, 234, 106, -14, -48, 173, -35, -119, -89, -76, -357, 72, 97, 84, -110, -82, 52, -65, -89, -49, 201, -90, 171, 95, 175, 100, -224, 23, 51, 21, -78, -85, 49, -44, -2, 125, -207, 10, 32, -286, 160, 49, -46, 85, 123, 18, -327, 98, 80, 143, -141, -18, -45, -175, -118, 21, 14, -187, 80, -9, 125, 86, 52, 148, -204, 6, -113, 193, 162, -105, -10, -68, 240, -103, 150, -39, 175, 52, -20, -142, 14, 116, -110, 88, 265, 82, -33, 463, 33, 314, 124, -18, 180, 2, -131, 28, 49, 20, -70, -87, 200, -182, 35, -31, -105, 7, -45, 178, 9, 176, 152, 223, 127, -65, 166, -4, -215, 105, -69, 91, 81, 288, 83, -97, -278, -25, -230, 234, 248, -108, -68, -80, 338, -119, -190, -167, 53, 41, -24]
6010b4O6Q0j87K60l74n9K20j23n3J58L2J09j98J3J68N8j93O7k2m2Q4M2j26J09
6034F5n7k7q8q2L38m7k45L06N6k52n1O7j28K30k12RK07M1j18k37J81jP1k08K53
6059G1l20K19j05k5L83r2k42NJ76j01L47l08j68K37j21J07p7Q6Qr6J14j8m4j08
6083g2R4l75M06R6l19K06j11j47L37j76M4j04K09m3J52r2j65K1K90l66J67k23
6105a71M74l21q9j0j45L45J09j16k25k1K60j69J34N2j33j81J53J02j07k4P0K03
6127A90J4k69nK8j56K20j11L26O2k03o5N2m5M5l68J88J16j29RJ89l70M05j55j84
6151b16J13J98k89K33j00J32q6N6K32l08m2K79N7l24Q5j52J97l3K4m0k86K90J80
6174B00n6n7m4q9L9o9J24m0j24J38l14L03J52j82J13N3k71Q3J42ok98L08l6N5
$$ y = [-24, 42, 122, -65, 195, -179, -238, -18, -141, -194, -36, -4, 105, -93, -80, 88, 146, -47, 20, -2, -44, 40, 82, -44, 65, 8, -19, -107, -189, 149, 102, -143, 163, 219, -33, -84, -17, -145, 85, -127, -118, 89, 130, 12, -225, -44, -45, 26, -182, 71, -249, -30, -135, -160, 223, 131, -111, -106, 70, -31, 316, 8, -160, 77, -44, 63, -14, 72, 80, -16, 98, 80, 36, -72, 22, -353, 53, 149, -170, 36, -75, -222, 115, -61, -17, -121, 88, 45, 197, 105, -60, -39, 251, -115, 52, -171, 303, -18, -107, -117, -262, 83, 192, 76, -149, -170, 90, -79, 55, 107, -26, -207, -54, 48, -59, -83, -13, 190, 204, -65, -70, -42, -198, 22, -89, 237, 299, 96, 31, 83, 38, 83, -285, -97, 19, -110, -101, 88, -282, 123, -32, -216, -103, 95, -194, 39, -61, 71, -15, 41, 273, -35, -77, 202, 259, -65, 20, -132, 65, 32, 56, 16, -270, 20, 200, 144, 87, 43, -46, -7, -76, 48, 8, -116, 22, -292, 11, 163, -19, 94, 147, -124, -41, 101, 95, -203, 105, 69, 124]
6198A24q9L3p2k17L50k48L56k11R3k43L84l53J06l31K40J68m45J27M81j91J55
6219B17k45oJ44j47L65m43N5J26k26L8P1L0J44o7j39N7k75N01L3k30J58J15j31
6242A45k41J22k47M76k82L4j78p7O6j07K81NN3M6%n8j85K0J80J65l03K8j25K55
6266G3m3J75l89K47j22j00K0N0M1l8j5%J30n7j53K71L4k11K20K8j91j92J3M32
6290B23L2k70j40r2L98l36j23L41p2J56J2j56j4Q3p7k7J35Q9q3k58J92q1N7J00
6314H9J56k25j67J28P3n5Q0q2m5K53k18j3M6j2K1l05K06J98J62l49j91J36J33
6337A9m2k4p8J96R9k20J09K1k5Q2%l29J70o4J13J20J51j28l45R1p5L39l21K56
6361A15j65qM9J2j58J57J7j4J51r4m3k5o1N03m18k44K09o5ml1P0J7M5r7J42J41
$$ y = [124, 35, 68, -4, -221, 129, -119, 237, 26, 119, -124, 260, -93, 13, -318, -78, 90, -355, -228, 253, 62, 217, -28, -34, 110, -37, 328, -115, -60, 66, -160, -122, -51, -21, 123, 56, -83, -26, -301, 200, 233, 3, 161, 276, 145, -96, 26, -221, 255, -27, 7, -171, -248, -182, -289, -8, -3, 50, 96, 96, 38, -147, -127, 53, 218, -85, -57, -182, 73, 30, 205, -184, 63, -59, -159, -139, -89, -48, -86, -101, -101, 29, -28, -181, 90, 124, -87, 133, 161, -30, -222, -209, 223, 255, -15, -155, -247, 151, -185, -308, 33, -39, 117, 129, -27, -41, 42, -35, -62, 73, 162, 79, -179, 13, -68, -11, 89, 245, 20, -147, -19, 54, -1, 79, -3, -48, 205, -13, -26, 20, 8, 29, -276, -70, 128, 290, -59, -250, -114, 19, -23, -47, -125, 71, 170, -50, 59, 80, 55, 137, 137, -192, -22, -86, 27, 147, 298, 170, -175, -84, -159, 180, -141, 115, -50, -58, -9, 3, -155, 2, 19, 5, 156, 62, 19, -6, -67, 436, 18, -226, -17, -82, -86, -117, -47, -30, 15, -82, 60, 201]
6387B01l27jP4J54j78nK61k26M4n5K8r1r2K52l7j41K35k07r9K25K5l87L00K30
6411A83N9j64R1o8nO2q7J3k22J97Q4j49n2l6L47l61J44n8K19j15k28L08m0p7k2
6436B3J32J5j80NJ84n2j5l5l00J91K19k44J64k41K05j23J24j19J45J07r8k15N8
6459e0K16j9r2j32M2j46L80l1l2j57j5K00j62j50L88l48j38j16L28QJ50j81K78
6482B21k99K68k05j65L34j63J64j72n1k4O6R7P7nO2j30j61O9l4J18k06K8j6J9
6506a08L35o5l56J75l7K26k99M53k32j65l3L1O8k01M65j62j15K29j41j47O6J8
6528EJ32l01K4J55P7J28k20M0j22OP5J71l3k91Q7j02L23m83L32j17j04J80J10
6551G2k15L0J36k66J67L7N8m0j5O7n2pK5n7r1J79l1J51n8N0k15j48L40j78L33
$$ y = [201, -126, -127, -53, 101, -77, -82, 179, -47, -3, -58, -30, -121, -213, 39, 2, -139, 96, -111, -210, 15, 40, -347, -47, 183, 242, 78, 169, 101, 96, 158, 71, 84, -138, 59, 143, -6, -58, -94, 253, -108, 36, -22, 197, 82, -146, 162, 122, 45, 23, 155, 170, -10, -5, 179, 127, 112, 77, -223, -32, 187, -57, 107, -134, 71, -52, 72, -47, 98, 205, 107, -108, -50, 166, 147, 55, -77, -35, -181, 199, 168, 136, -21, -36, 164, 2, -148, 240, -108, -246, -362, -34, -26, 124, -57, 221, -78, 190, -15, -180, 154, -9, 155, -17, -68, -92, -26, 71, 148, 143, 205, 75, -86, -17, -51, 67, -139, -111, -127, -108, 227, 162, -194, -19, -56, 170, -129, 324, 92, -73, -106, -75, -7, -208, 257, 95, -20, 209, 68, -79, -13, 5, 137, -164, -140, 15, 92, 220, 0, 40, -82, -76, -1, 170, 137, -154, -67, -169, 154, -329, 3, -114, -218, -38, 72, -143, -113, 23, -243, -76, -39, 19, -21, -36, 31, -21, -28, -3, -60, -151, 28, -3, 148, 90, 140, -75, -223, 117, -61, 272]
6576B72l12J17l3K50n22K25J56l05rK88q7q1mK00L7%k31J08j0l22K56N9j80K87
6600A59k87K0M4K00j69K5k0J36j01J9n9K67l98J74O3K32m28q9L10O9l87J41n1
6623a30K11k1j2Qk47K12M6l76L69k53L28j06j81K55k4j74m5K92O1j56N4j00L5
6646D6R5l4j10p9K62n55N59j61J33q1K6k72J74r2K0J03N6j17k15K82j8k4J52j34
6670A6K9J09n8Q5l3k64J11R6K11m66K44%j93L81l14J92l5k41K43k09J0o9L2J73
6694E0j45L24j88j87L12j78M8k71K70k5j51P2J39r7N4j43J91R6l78L73k78K73
6716A61r2J1R7l85NK79l6J3L0M6j73j42J70j22R4m08M67j90R1J40j97J21J64l4
6740A10l23L64k39K91j5Qk57R4J21j54q7P5O7K12L3m28J60K02l22L6j5J38P7k48
$$ y = [272, -40, 77, 44, 294, -228, -3, 153, -152, -161, 127, 40, -41, -45, 155, 192, 192, -39, 69, 59, -263, -7, 52, -128, 159, -128, -108, -64, 136, -33, -8, -28, 108, 7, 26, -33, 234, -164, 10, 73, 305, -123, -212, 98, 167, -220, -79, -130, 81, 60, 48, 56, -191, 21, 67, -309, 60, -193, 135, 29, -152, 103, 79, -95, -140, 152, 213, 57, 111, 11, 46, 141, 107, -3, -82, 180, -375, 184, 23, 156, 75, 101, -171, 3, -89, -69, 34, 90, -27, -242, 40, 22, -2, 150, 16, 45, 154, 96, 181, 148, -116, -5, 91, 302, -164, 80, 80, -113, 268, -46, 146, 111, -130, 113, -96, -86, -155, -123, 50, -95, 229, 41, -146, 166, -12, 36, -235, 35, 10, -141, -69, 70, -27, 27, -116, 75, 171, -207, 166, -112, 161, 69, 80, 177, -208, -203, 76, 40, 53, 83, 129, -44, -186, -16, -138, -44, -452, 15, -175, -84, 56, -141, -20, 144, 110, -213, 151, -88, 203, 188, 196, -61, 33, 154, 0, -87, -12, 55, 267, 300, -128, 32, 234, -88, -52, -67, 71, 148, -100]
6764a00L58k64o0K57l03K25j96J10k8L5J9q7k06J78o9j3L6k3J84J12n6k07J08
6787A0k2J97k59r1J81M5j14j03K98l47K64k8L1Mm8o9j12K14m2o4k2l5L65l77J88
6812F4K45l49oK05j31J22j10j96K14K47m14j03J39L18k48J8L4J7l3o5pk11J90
6835f0J53q1l58L81K6J22k97j09J43J95q2m3K9j93J36k3J18J30j46O8j74L7J2
6858a6k7j20K07K26m04l7J46L4j08M1m2K8M46m84J05J8n7J41M0k28K13j38L2K4
6882D0j2k5N7m4k8j1O4Nj11K2P7n4J04O1j26j3Qj9p3K44k06j69m4R5k8L60l72
6909a98M4O1K49r0pJ58l17J72k07N6J04j9p9n0P8r7n2L70l07K52n70N15j21J28
6933G3j84N6M8O2l0O9j98M5k2O3n1O2J61n9n46K73K54K1R7l20L1K11k82Q2L74
$$ y = [-100, 258, -6, -66, 191, -112, 113, -83, 27, -1, 34, 53, -34, -240, -62, -131, -144, -108, -131, 53, 165, 109, -98, 10, -12, 185, -74, -165, 16, 61, -53, -156, 142, -205, 59, 31, 62, 66, 18, -51, -163, 51, 9, -55, -77, -112, 253, -124, 64, 309, -40, -46, 159, 28, 150, 40, -156, 58, 305, -109, -212, -73, 245, -3, 15, 49, 66, 33, -32, -39, -250, -60, 93, 12, -346, 35, 61, 183, -114, -223, -80, 115, 33, -10, 19, -174, -38, -61, 57, 187, 41, 109, -65, -28, -16, -43, -163, 44, 270, -134, -171, -25, 9, -99, -58, -100, -72, 374, -110, -5, 13, -44, 97, 137, -91, 122, -16, 16, 40, 28, 3, 60, 16, -12, -23, 41, 46, -65, -43, 34, -20, 84, 145, 19, 6, 14, -5, -78, 166, -40, -209, -253, -158, -186, 174, -198, -154, -93, 156, 66, 59, 217, -100, 72, -135, -79, 25, 6, -73, -123, -45, -142, -194, 176, -131, 121, -449, 66, -55, 73, -111, -55, -7, 55, 25, 94, -104, -59, -81, -18, -69, -7, 154, 95, -451, -178, 76, 97, 194, -126, -95, 116, -166, -84, 290]
6958B90l39K66l77J41P4j41J70k38J60j09L56j07o0j90K04k40NL42l40J72J20
6979A59k68J05p6L61k57m5m6j38M03m36N00k11o2j8l6J11J51k17j75J82J65j69
7001a7q2K69k94J80n0j59J02J48k71O0J80J21j21k41J00j36K41LJ44j63l1j67
7023a84P4r3L92j05j4R9n7O3j75kj73M27l62K10m27N52j00k60O1K1k7L04j51l56
7047b83L49R0J64l08M4j19m8j05k0J32J48j11M07l48J03k42J96K46l58K71k63
7068e5Q0K73j74k34K94k47O6o5j15L11K3j25o7M3k15K83j83P7R7k24rP8n0L03
7092A65r9j35K38m55L26kJ64j23j54J50r4j9q6J70J04m65M72j5o4J44l60L9k5
7115a24j44L35o5Ko7K18j14j50K02k82M52k38m7J35j8k38J23L7j67J64lR8K2j3
$$ y = [290, -49, 217, -160, -19, 55, -86, 84, -154, 6, -103, 253, 146, 86, -104, 100, -140, -135, 207, -133, 39, 159, -109, -4, -80, 281, 24, -21, -67, -205, 198, -238, 262, 51, -11, -29, -65, 46, 197, -20, -195, -13, 152, -17, -99, 170, -124, 56, 6, -153, -51, 97, -174, -114, 66, 187, 66, -175, -75, -211, 30, 33, 177, 14, -17, -184, -110, -203, 189, 84, 70, 169, 112, 175, 0, -2, -175, 252, -110, 100, -327, 225, 125, -135, -74, -53, -80, 224, 73, -283, 66, 156, 320, 12, 56, -63, -111, -216, -236, -104, 44, -67, 340, -8, 95, -147, 49, 295, -63, 208, -55, 25, 298, 124, -110, 184, -63, 3, -62, -177, 134, 157, 32, -35, 8, -207, 76, -107, -30, 67, -157, -166, -88, -138, 165, 66, -69, 169, -286, 40, 38, 202, 79, -75, 75, -19, -38, -124, 46, 150, -315, 157, 142, 78, 222, -138, -99, -124, -268, 67, 2, 4, -63, 155, 41, -109, 93, -189, 263, 25, -22, 113, 95, -143, -20, 17, -150, 14, 11, 109, 131, 118]
7139A18q1r2j92L52l44K32K00l39L42o8k16K37j23r4J18l64J14j1J65j99K53k10
7161b02L70k55l02L37J41k00m5L42k41j1j77J28J31n08N48k16L42k15P8L6j5p6
7183a0l7j2j15K74k79L43j33l80N48l69K26pk55O2o5J91j95K75j01j86K16k00
7205b09J04J63q8pJ54J17k41r2R9j9o6J93q6l6K82m02l7Q9K13l62J79M8K9jN6
7230H0K73k17k6k31J15j02L87k66J02k03K71j86l3J15q3N6m4J17p9k08j00M68
7252B06k90J48J13o1J66l16j14J70J18o6p3K08l94k4L00j09J15j31Q6j90J52q6
7274g2J42j3l07K02nJ57o4j22J47q8K8Q1l54J83NK9K28k54O0j19Q9J41j84K80
7298A90l09l27M25l5r7J85P9j37J81m55L16J26j81K35l25K01O0j83j0k51K59j2
$$ y = [118, 37, -55, -247, 105, -239, -7, 193, -146, 196, 128, -88, 149, 26, -68, 50, -314, -200, -211, -46, -245, 8, -202, 168, -87, -389, -52, 89, -111, -156, 186, -55, -66, -243, -115, 16, -492, 56, -160, 182, -33, 45, 81, 66, -10, -47, -59, -174, 100, -179, 164, 31, -349, 199, -170, 56, 49, -206, -144, -209, -18, -213, 62, -39, -225, -9, -209, -105, 58, -30, -37, 117, 234, -7, -99, 0, -19, -85, 108, 22, -14, 268, -134, -171, -82, 131, -231, -52, -4, 25, 24, 80, 353, 136, 110, -121, -6, -108, 279, 13, 115, -88, 183, -3, -36, 79, -4, 52, 8, 125, 46, -162, -262, 206, -84, 64, 177, 116, 282, -34, -148, 22, 140, 74, 1, 209, -185, -209, 91, -18, 97, -34, 52, -138, 14, -72, 70, 57, -250, -48, -53, 104, 40, -82, 65, -23, 5, 86, -268, -85, -80, -51, 177, -77, -17, -136, -47, 94, -90, 190, -119, -446, -21, -56, -153, 32, 111, -26, 155, -300, 16, 142, -39, 196, -129, 72, 132, -51, -61, -312, -53, -65]
7320f5J12p5j81M04j80J8o3J41k5J15l90K20j11J0N4j15r9M48l62J48k39K71r9
7343f3J86N3q3j57K88l1N0m31J29j93q0J95K8j7j43M00l1J4p8j99K27j75m3J67
7367A3J58j23q5J02J82k60J3j09L15j07k32K94p5q4R5j18m3J90K4k50O7O9j69
7390a33K24r6j23J34l3j11N5J44P0j41J00p3j15N6l8K0J2J13J4n44J72L14qO6
7414G9r7K02n26K12K17r7N4p2J5r1k7J67lr0n2K31j53mJ49n9k18J23n1R4j29L33
7440B07j95j22Q3J26j73Q9J96Q5l47j55K77K9q1N2Jj28J77J38m20L14j91p1J00
7463ip1n2Q8J30m98N69j94J05J83k2m03J08k1K07n3j31J85k02K04k20q9K80K9
7486A23m1j64pO0j18K84Q9m13J78N9m5k7K4j56j65K18K5K71l46K38j60J35o3J25
$$ y = [-65, 47, -28, -209, 195, 15, 33, -30, 111, 86, 201, -189, 31, -80, -70, -16, -131, -230, 218, -144, 4, -235, 36, -63, 123, 176, 93, -64, 224, 193, 243, -188, -59, -252, -332, -137, -109, -126, -269, 131, 100, 114, 36, -163, 64, -111, -154, 13, 171, 48, -37, 65, 247, -13, 0, -109, 206, 99, -133, 161, 86, 2, 97, -21, -64, 126, 150, -100, -33, 36, -133, 91, -5, -128, 6, -27, -138, -83, 61, 131, -10, 90, 17, -98, -42, -80, -60, -48, 65, 79, -465, -293, 21, 13, 79, -18, 184, -342, -130, 87, -10, 44, -28, -13, -104, -131, 36, 33, -57, -109, 122, -31, -35, 114, 55, -163, -40, -91, 3, -126, 207, 12, -110, -27, 99, -74, 15, 211, 296, -51, -206, 71, 100, 19, 71, 72, -56, 121, 259, -161, 153, -38, -109, -9, -80, -132, -44, 86, -412, 157, -37, 68, 251, 229, -174, -66, -87, 120, 67, -64, 121, -81, 123, -97, -186, 94, 123, 82, -82, -89, -29, -147, 137, 226, -187, -9, 50, 5, -22, 2, -154, -319, -101, -76, 195, -151, 87, -73, 62, -1, 124]
7510A24l62K40J36j36M4o3j6K08k22Mj4P9r1o7O5j52K58l3P5j64l7J64j82J70
7534B8P1l36L54j57NP4k4M4l34L03q1L42l38M7J8J74J08k98Q6j1K4lm91O44j43
7559A06j43J77l03J14J5QK91q1j74N4mJ77m4j74k63J47K33j83j7M6l5K66p2l37
7583a96R8K14j99n4J85k22m6M06j17j05K65j87o6k48J93K69J37j03l36q1P1MQ8
7606c0L59j39m27M59l1k75M52l10k38K32j30k49M66Q1l68J92p4L3J08k34P5K35
7628A87k88o0J16N0l16L99m6j12K19k3J7m38J85J24K0J6J72n04K48N6Q5J58l23
7651e8P8n1l3J60k24R5K01r9j45P9J46k34Q5P1J83l10J51k0J9k15J02r2N0O3J41
7676A43j1n9P5K8k08Ll3n8K22j72J05jN0kj64J49j44r1J1K05M2p5R3k48J41l6
$$ y = [124, -238, 2, 138, 2, 46, -17, -33, 175, -47, -43, -57, 22, -69, -136, -71, -223, 35, 2, 77, -87, -124, 40, -142, 28, 99, -237, 117, -40, -35, 39, 15, 59, -275, 28, -53, 289, -49, -2, 16, 190, 298, 0, 86, 75, 99, 96, -395, 249, 106, -37, 140, -163, -49, -34, -26, 265, 184, 10, 64, 60, 237, 193, 19, -244, -97, 136, -47, -64, -18, -53, 213, 141, -196, -98, 116, -83, -137, 48, -174, -220, 186, 69, -36, 229, 42, -24, -272, -79, 190, 327, 224, -112, -193, -122, -118, -30, 329, 190, -237, 222, 191, -84, 368, 58, -180, 52, -78, -327, 139, 220, -148, 44, -30, 3, 111, -123, -48, 187, -101, -161, -45, 5, -311, 88, 42, -70, 149, 126, 143, -295, -110, 14, 34, 50, 222, -282, -34, 22, 107, 265, -58, 20, -31, -64, 96, -128, -33, 168, 69, -76, 3, 149, -85, 0, 71, 254, -56, 95, 75, 94, -121, -19, -111, -61, 2, 143, 132, 73, 148, 176, -32, -29, -62, -120, 102, -70, 35, 34, 84, 82, -82, 67, -77, -168, -157, 48, 90, 15, 108, -140, 1, -35]
7702c5J28j92J95j78J92j69j63L60k39L2j15K09K26kk08L24n49K12j24J7k44K68
7724e5k44N22l40L89jj01k53K45j3j13j29J75l16L01m17L75R6k80K34j05j30J18
7746d2J37Orrj43J92q9j28R7q6m7J66k27OJ58N5l18K1L14q9J14j60J25m4l0n7
7772h7m0J26M8q1P4J50j85L4L36o90K89J90Km53N09j08k25P2J89j59p0K79m9k4
7796A27j74J01j17M7k08L56q0J8o3O3K3m56K28J5K38k67J27J39J7k15m7L01j55
7819A8N2k7r3P8J34j76nl3l8O4pJ53J98k77l75L10j2K26LL3l16L7l4J77J0j26
7845b6k2j6j0k22L15J03j00J5K6Op9K19k89p8K3J02K11l20J07n7J23j53j83K97
7869hP7j08M9J24r5q6M18n86P0K70q9k27M11k16k04J82k43OK20m8J28j45J42M4
$$ y = [-35, 93, -99, 96, -82, 110, -59, -222, 138, -101, -69, -184, 25, 251, 249, 41, 365, -184, 28, -96, -79, -323, -55, -299, 223, -117, 272, 271, 170, -83, 162, 149, 36, -93, 82, -234, 67, -350, 25, 121, -159, 75, -30, -160, -42, 95, 101, 92, 83, -60, 132, 43, -85, 12, -74, -121, 45, -182, -176, -18, 37, -281, -260, 54, -35, 79, -81, 44, 0, -30, -87, -127, -1, 47, -34, 40, 190, 5, 39, 375, -315, -26, 164, 166, -287, 222, 114, -111, -39, 150, -9, -79, 200, 151, 127, -47, 54, -63, -16, -224, 132, 52, 70, 7, 70, 93, -363, -135, -120, 118, -149, -22, 117, 134, -81, -128, 173, 18, 70, 43, -50, 28, 162, -14, -19, -52, -90, -26, -33, 120, 318, 41, -334, -24, -36, 190, 193, 226, -90, -53, -87, 90, 100, -26, -48, -64, -74, -296, 19, 122, 22, 37, 63, 69, -10, 209, -80, -158, -135, -33, 178, -142, -35, -92, 31, -122, -305, -8, 69, -39, 10, 134, 39, -47, 371, -215, -145, 125, 36, -191, 220, 4, -200, -18, -261, -255, -35, -83, 45, -100, 42, 86]
7893H6p4j33K4M28m17O1k5J15j7L4m17L78j03m2R4N3q3QL6J42k05j09P1l8L93
7918B60l06q6N78m78p7K11r4q1P1k7j24J48n3k7R8l1j78K07j63L18j33k7P1o6
7942A1J42j47K0j30p7K86K61m62K45l40J71K35j54j32j6K69o0p5j91K92j69J28
7964A07R1l04j3j9J5J2J76N5j25n6k2J11Q1J00k08O3j6K06k24j50J80n6j66K25
7988F3j27r7J59K50l63k6K42Nj40l0Q6J2r8J80j82K01k16J65J62m09L39k91J16
8011Ao5J49j02j7k2Qk2o0Q1k01K11L72n9n37K68m7%J57l60K15K62o7l25N6o6N6
8037a14J42j92K15j61J61M2k87J85k13O1J83j6N9k30K94N8k80RJ3J36j69j05J82
8060b7Q5J5P3j76n2K29k34P6l7K10j64L6j50K76j16K08q8j31L1J29k46J39K65
$$ y = [86, 12, -121, -97, 331, -86, -25, -50, 65, 48, 82, -335, 43, -60, -102, -8, 45, -38, -30, 6, 148, -57, -166, -95, -133, 260, -46, -132, 446, -32, -109, 102, 8, -73, -2, -29, -153, -5, -58, -85, 13, -18, -196, 11, -152, 166, 33, 6, 77, 11, 153, 6, 26, -104, -181, 105, 366, -96, 149, -191, -20, 215, 61, -71, -87, 182, 122, 47, -144, 148, -21, 107, 198, -106, -119, -138, -123, -111, 65, 120, -5, -61, -83, 28, 109, 209, 1, 64, 48, 254, 30, -120, 60, 4, -162, 63, -64, -161, -2, 248, -115, -141, 101, 106, -34, -64, 22, 34, -64, 116, -66, 135, -81, 84, 246, -163, 176, -115, 1, -64, 85, -17, -34, -56, -48, -70, -130, -49, -250, -39, 333, 274, -263, 5, -42, -42, 115, -245, -30, 232, 165, -160, -104, -170, -114, 28, -164, 51, -110, 51, 93, -194, -9, -222, -161, 22, 6, 65, -165, 129, 187, -93, -84, -71, 65, -104, -209, -27, 58, 73, 146, -30, -82, 147, -87, -11, -48, 162, -2, 34, -116, 160, 44, 252, 164, 33, 64, 193, -53, 86, 351]
8083C51m91L15k61J87j00L07l94P3J37j72K84k55r0j2Q6N0K4l51J35K27j6j49
8105a15J06m4J3%J29K1j01j47K43j40O3n9p0L60Q4n32R6K87k08M7J5q4M0O0J27
8130A91k51J84m06M34j28R8k84M13k16P8j37q1o5N1J7k1J39m9R6j43J77J35k29
8153CJ9J03j37J3J73o2J64j66j00j50J57J7m5J34n1K8j23J17J73m35K19j3r3J47
8177I2j24q3K28k50J59j98J94Oj33o0J58J17k16K12
$$ y = [351, -140, 175, -86, 101, 1, 308, -86, -13, 124, -48, 236, -19, -109, -121, -35, 15, 39, -312, -177, 50, 34, -115, -9, -53, -40, -40, 89, 110, 9, -138, 105, -35, 28, -31, -101, 259, 343, -189, -93, 194, -14, 33, 48, -36, 4, 64, 191, -60, 124, -282, 152, 24, 122, -162, 251, 35, 113, -24, -105, -170, -119, -102, -123, 16, -33, 63, -80, 97, 232, 3, 22, 125, -12, 1, 174, 112, 276, 110, 10, -140, 17, 34, -11, 123, 72, 100, -23, 94, 267, -168, 51, 38, -55, 92, -32, -115, 113, -137, 22, -176, 18, 24, -109, -169, -11, 106, -110, 102]
8191A02
$$ Imaginary data points
##PAGE= N=2
##DATA TABLE= (X++(I..I)), XYDATA
0@%%%%%%%%%%%%%%JrJ6j6J6j7K5l2L3m1M9n7O7p6Q9j04J21j38J56j76K00k27K55
37A35k87L23l59L99m46M96n49O08o73P43q21R05r98J099j211J335j471J622j790
56i40J983k201K451k740L077l483L977m593N393o474Q019j0423J4783l5488J64128
71A37469l9506j50018J28818r3653r7595K08510K0940j56015M6432o3348o0636
82a18602J87115M4628j30570J5184k3128o8071J24551R0477j30514k8467N1679
93A4282r4249N1904J91854j18964j47131J06574j9138m8654J53473j6702j47470
104g4221L2616J8090j5591J12152p64j37605J0303N3741k8451P0121N4091j32164
116c7682l9083R0708k6468K1390R5888j12750r8266J11732K2226l5078P1703m0683
$$ y = [0, 0, 0, 0, 0, 0, 0, 0, 0, 0, 0, 0, 0, 0, 0, 1, -8, 8, -8, 8, -9, 16, -16, 17, -24, 25, -32, 35, -41, 48, -56, 65, -73, 83, -93, 107, -120, 135, -152, 171, -188, 211, -235, 261, -288, 320, -353, 390, -431, 474, -524, 575, -636, 699, -772, 850, -940, 1043, -1158, 1293, -1447, 1630, -1853, 2124, -2469, 2924, -3550, 4469, -5954, 8829, -26659, 137469, 97963, -52055, 76763, -16890, -114485, 94025, 114965, -41050, 5382, -57966, -118602, 68513, 113141, -17429, -2245, -25373, -93444, 31107, 121584, -8930, -37397, 14282, -79967, -28063, 163791, 44827, -102304, 4270, -14868, -63522, 89951, 73249, -74221, -41605, -23515, -39106, 73046, 72282, -65323, -55020, -1279, -29730, 40391, 94482, -37682, -76765, 13943, -12525, 8865, 104753, -7997, -106263, 5469, 27695, -7383, 64320, 23637]
128B3637j06293N3932N4821j5478L9147k3731r9463L4010P6520k5205R951J3570
140C5418r1905l149R4015j2749j4184L0851p5593l5239J00530J7344m5714J8411
152A8036k9944m5934O3195M2470l3453k868k0699m5958N0651N8230m0713j9246
164f233N013m1287K2186O6313k4667l1738Q230l4358P586P2762j1202n1316Q502
177a0209o165r267N0509J3249m4638p350p21r185M5145K3505n0356j6165J6584
190e064r563K2688L0947l4498k6109J1802m490J8226L3320k9825l6556J5590R029
203d503L575K5078j0697l5159L361J1748O513K4759p141m0070K813K1377P24J4409
217A6787K635l1784p101J7875M373J4105N157l3612j2200K4379N750J565Q421
$$ y = [23637, -82656, -28724, 26097, 10619, 49766, 26035, -73428, -39418, 37102, 11897, 21848, 35418, -56487, -59636, 34379, 21630, 7446, 38297, -37296, -72535, 27995, 45339, -375, 18036, -11908, -57842, 5353, 47823, 14370, 11502, -9197, -55155, -4504, 53726, 13013, -6233, -1220, -42507, -20321, 45992, 21325, -10413, -2183, -36541, -28955, 43807, 32605, -18711, -10209, -16374, -25641, 24868, 38117, -6521, -13871, -14592, -23777, 21368, 44873, -5483, -21648, -5064, -14627, 8061, 39008, 4510, -21599, -9797, -14287, 3939, 37259, 7434, -29122, -13532, -4503, -928, 24150, 13453, -21706, -18345, -6597, -84, 24675, 17534, -22536, -19723, 1654, 2378, 16787, 19422, -12362, -19463, -1588, 2785, 16890, 22047, -11565, -23765, 614, 6364, 7929, 16350]
230A6350k0986j7614J6863R186K660J0473j9696k3746K0374J5368n783O969p200
243C218k3231J0549J7533l322P393m012k7299O956K5350n485k673M503k0055m822
257a5397K3082P70m343N489j8879j1204K6289O413j4287O527o757j6774J6771
270b300J4289j1025K121k480j9422J3693K1883j4229m660P990j5940p51K3795
283A2964l603j0671O656j2411n987K4670Q83j7584O906k075j4437J6803J2533
296A4647j5883j571J610j3128J1717J8048j4953p471Q655j1114O58K1938m690
309H463j4780N352m552k617J9879N44j7383L495R30q082J4840R939j6876n620
323f468M702m869R007J2111j4044r500O641l671L144J5364p002j5963L662L275
$$ y = [16350, -4636, -22250, -5387, 3799, 6459, 16932, -2764, -26510, -6136, 9232, 3449, 10418, 3218, -20013, -9464, 8069, 4747, 12140, 8128, -19171, -12215, 13135, 7650, 4977, 9480, -10575, -15397, 7685, 8455, 4112, 9601, -9278, -20482, 5807, 12220, -2067, 4460, -2297, -19071, -2300, 11989, 964, 3085, 605, -18817, -5124, 16759, 2530, -2130, 5860, -10080, -10831, 12964, 9361, -1310, 5346, -7065, -13052, 11618, 12501, -5083, 1823, -252, -14689, 2114, 14647, -1236, -2807, -1197, -14325, -2608, 15440, 487, -6984, 1671, -9443, -8785, 13153, 8463, -6317, -965, -5517, -8134, 11745, 12289, -5094, -1599, -669, -8751, 6089, 16028, -848, -6468, -1766, -6635, 2372, 14483, 439, -9061, -2420, -6091, -2947, 12417, 5415, -10548, -6886, -3611]
337c611J146J2663k272j6435J181N917n58J0216M225j6760o222Q849L405N456
351G200M026j2819q893P707M228L581N902j0034j4057N238J0870K997R10o689
365A67j1177J368J0415M938J715n211j2250j480J2584Q723k132n911q342k243
379h836P967R595J438o764r847l763Q806J1370M27r358q412r67M648R479M783
394A0566p455j2067k667P371J0109M572p849j2171n59P464O719N832l035j4378
408g548m963R961R668L699l594j3173n528J0065Q070J769l6j1152j1270Q744J3512
423H224R21l804r033j0224O859J3920M18l470m791j1990J942J7960M805q705n320
438b288p414K3J5413O731q715m577n673m364J3929J3176r680j0786k418j888R201
$$ y = [-3611, -2465, 10198, 7926, -8509, -7328, -1411, -1969, 8247, 12472, -4288, -10510, -1661, 1744, 7200, 11226, -1593, -10486, -2779, 1449, 5030, 10932, 898, -13159, -7921, 2949, 5946, 6856, 167, -11010, -9642, 773, 5711, 7426, 2215, -10035, -11515, 1069, 9792, 7660, 1749, -6593, -8836, -869, 8726, 10164, 3400, -6447, -10210, -1404, 9966, 10393, 1035, -7377, -8344, -3696, 5783, 10566, 3111, -8956, -11623, -4252, 5857, 10429, 2580, -9591, -10150, -2686, 4033, 9865, 6830, -7548, -12511, -2550, 7118, 10817, 7223, -5950, -11478, -1413, 6657, 8426, 8390, -2762, -14032, -5288, 8224, 9145, 5341, -3692, -13916, -7057, 6863, 7281, 3811, -980, -12970, -11028, 6932, 11737, 3032, -2288, -9702, -9679, 5734, 12465, 3750, -827, -6500, -10864, 3065, 16241, 6561, -4225, -6643, -8531, 670]
453F70J2960o314j1914j737l063N749J6272k142j7185l657L870L899J1785J622
467A0815j4923n371L754K523J0921O698j5295j1449P275O470M765N791r421j2676
481a0123L548O873M727P109p330j7139K078J2685L013J073k448j2439l905J1182
495a096O492J639k131j2595o193J2642R876k492l530o073p220O785J2284J190
509I578m942p428q015O219J4825p1q661m036m708J13J2256O397q598p864l077
524h012L04J0789Q505q610j0580M39J780N209R926k680j2457l478M418N601Q801
539I955q83j3838l994O895L503N300L706j1877r679O922O730K664M070r459j3504
554a3489P774J0404j137J842k144j4094q1J4235L117j646j677j2688j741J6309
$$ y = [670, 13630, 7316, -4598, -6335, -9398, -3649, 12623, 10481, -6704, -10361, -6491, -2592, 9193, 10815, -4108, -9479, -5725, -3202, 7719, 14417, -878, -12327, -5052, 1418, 6183, 11974, 2553, -10123, -6575, 298, 5025, 12134, 4804, -12335, -10257, 2428, 5441, 6514, 4066, -8373, -12278, -1096, 5396, 7035, 4904, -7691, -13884, -1242, 8634, 6142, 2612, -3461, -10681, -3896, 8388, 9578, 4636, -2792, -10807, -4588, 10237, 10166, 1505, -2531, -7239, -7126, 5130, 11527, 2929, -4935, -8012, -7708, 3081, 11586, 2976, -7604, -7165, -5385, -176, 9750, 7070, -5387, -8865, -4447, 1154, 9955, 9072, -4766, -8760, -1865, 1638, 6938, 10644, -1233, -10912, -3990, 2740, 5404, 9474, 15, -13489, -5715, 4689, 3552, 5394, 3250, -10844, -10925, 3310, 6427, 4781, 3104, -9584, -11325, 4984]
568D984K781n700K697q246r762J4422J1210q117j861m151j0890J1464J5191j0352
582C670n603L819j1543O16K1053k111j4445R78l945j346J8177Q72j5916K757l13
597c280q447J6391J2161j8770o852P746n206P768J4937j4461j2122J0950m423
610c608o62K0528o389k3480P399Q485n447J2387J159k1000J909J0364o030R969
624E584R245k3544p143J9358k042j401J2574j4618j4488J7183M613o345J2766
637A1742o859k2986J4120J5727j0906L989L377k0982K824K0234o448k146O536
650H222j8843m702K4550p22j2151Q994r311j3727K0841R507j4823L644j652j6136
664a6309J4881J8423j5713m501O417j3408L899K1770q011j2358O776q362k851
$$ y = [4984, 7765, 2065, 4762, -3484, -13246, 1176, 12386, 4269, 2408, -1743, -12633, -1169, 14022, 3670, -1933, 1886, -9657, -9041, 12012, 9901, -4544, -3566, -7511, -8857, 9320, 10192, -5724, -2967, -3280, -11727, 4664, 16825, -1945, -8797, -1051, -6257, 1511, 16448, 1987, -10135, 815, -3608, -4270, 16258, 9869, -13611, -6212, 2273, -3174, 9213, 10372, -10628, -8719, 1645, -4385, 5584, 14829, -8715, -15858, 3500, 1458, 57, 12631, -1987, -16475, 708, 5321, -1024, 11742, 4883, -18103, -3983, 11744, 838, 4827, 8204, -12778, -9954, 10280, 3832, 1686, 8222, -10621, -15323, 9227, 8505, -3646, 5348, -3963, -17690, 3151, 12658, -2165, 1479, -173, -16309, -1428, 16995, 1282, -3219, 3198, -10210, -6311, 15459, 7448, -4910, 1866, -6496, -9347]
677i347K2431j786j8554N619n30q530J7386Q067k0186j367O167q726J0589J4861
691A6094j8028r419J1141m396K438J6907j0492j6185R863J581k428J5220l492
704H804k0232O003Q530n646J0309L925k0258j835J3457k898L382P558j6463q656
718a4020J5158J690k468Q383r409j4111J1911Q451m769N506l756j5331P474J2972
732G681m757Q33R28j3680O45J5655j093m037K247j0425m410J5475L663p821R26
747A830n446p614J2308Q489q097k474j761p463Q259J2028o500o231O25n501L833
762c715J3294k670r266j31k392O19J2222J409j0949k089P95j484R051N514j0169
777C9o123K536n6N928O684p948q319K248K338L660O960m621j0364N65M891L044
$$ y = [-9347, 13084, 11298, -7256, -1637, -2167, -10697, 6689, 14756, -5430, -6797, -630, -9356, 1233, 16094, -1934, -11353, -212, -4608, -2170, 14737, 4245, -11940, -2077, -496, -2924, 12296, 8804, -11428, -5425, 3105, -2541, 7768, 11693, -8565, -10400, 3057, 159, 3541, 11099, -5364, -14020, 1138, 2828, 360, 8743, -666, -14777, -2866, 5585, 816, 6322, 2566, -12765, -5291, 7681, 2924, 3757, 4685, -8995, -8350, 7305, 6212, 2175, 4422, -6003, -10413, 5062, 8725, 904, 1830, -3616, -11230, 1078, 9567, 1470, -1004, -2765, -10228, -1969, 10059, 3559, -2672, -2047, -7548, -3715, 9579, 6909, -2357, -2488, -4880, -4261, 7961, 9370, -1579, -3668, -2873, -4357, 4694, 10208, 39, -6084, -3548, -3604, 2324, 9008, 1060, -7259, -5011, -2673, 987, 7947, 3326, -7038, -6473, -1582, 1462]
793A462N505j986j0051k029O288L877L195l91q571m760N969N237J718J80p036
808a393o933M923P036J401j064n337o902K922Q011K440k085m144n877O89Q212
823A899M150k504m528m343o52P138N963k514n229l757q53N977O609j744o173l915
839d476k18M082P128n78o721m849L35L973O285J119o912n306O58L833N626K269
855F248n657o564M96M642N017K492m507p420j36N133M610K493l596p638j284M951
871g20M827J942l298o697k745M934N113J763k619o203l827M571N861J949k418
886B433n945l584L649P102J954k541n262m046L147O636K808k577n448m258K595
901c337O567L403k800n663m114J729O359L834k351n297m397R07O449L949j601
$$ y = [1462, 6967, 4981, -5070, -7099, -811, 3066, 6261, 5870, -2701, -7461, -1492, 3745, 5463, 5643, -1393, -8326, -3403, 3633, 5034, 3970, -1367, -8269, -5347, 2664, 5104, 3019, -1125, -7002, -6313, 1899, 6049, 3545, -983, -5326, -5978, 1160, 7123, 4609, -620, -4377, -5230, 747, 7356, 5612, -561, -4476, -4694, -612, 6516, 5938, -783, -5632, -5297, -1324, 4961, 6080, -832, -6138, -5480, -1647, 3979, 6248, 591, -5973, -5477, -835, 4182, 6674, 2167, -5253, -5389, -256, 4354, 6847, 3251, -4387, -5671, -720, 4107, 6049, 2751, -3946, -6691, -1757, 3356, 5119, 2500, -3703, -7530, -2959, 2902, 4851, 2433, -3512, -7096, -3447, 3655, 5609, 3068, -2194, -6240, -3093, 3543, 6351, 3774, -1674, -5932, -3337, 3230, 6633, 3833, -1830, -5944, -4215, 2144, 5978, 3627, -1670, -6067, -5160, 1289, 5238, 3637]
916C637n309m322M46O268M366j042m590m719J78O188M563j191m317m469o98O098
932A087M821j171l849m997j432N547O033j496m717l783j769L805P295r24n258
947h08l358j867L589P583P4o036k812j242J778P754K342o669m054Q6J387O327
963D074L856o695n465J128R84M456N720n614p514R69K207K740N806l295r323P16
979e250L645J480N225j83j0070j637O072J742L305J508q919m469P209K851J177
994C686K738p042p276O503N289r93K334m459q834M366P933j373K05j342r029Q86
1010f408J0043L59k618L0p053j951J0363K631m305L81m517m934R219O452n666
1025B026j775j826n060O145Q539m537m650L97m527K272J0520k076p957K85k055
$$ y = [3637, -1672, -5994, -5548, 720, 5086, 4044, -546, -5265, -5087, 1101, 5664, 4473, 156, -4313, -5011, 1087, 5908, 4737, 888, -4109, -5541, 6, 6039, 4543, -174, -3957, -5726, -1921, 5374, 4450, -808, -4166, -6033, -2444, 5139, 5213, -823, -3635, -4877, -3099, 4655, 6997, 328, -3726, -3640, -2253, 4074, 7930, 1235, -4230, -3102, -2118, 2338, 8058, 2444, -5070, -4101, -1894, 846, 6652, 3357, -5966, -5250, -1605, -125, 5100, 4917, -5153, -6790, -718, 1024, 4329, 5837, -3082, -7551, -342, 2509, 3686, 6424, -618, -7894, -1391, 3898, 2905, 5239, 780, -8054, -3688, 4245, 2872, 3077, 1735, -7294, -6408, 3635, 3994, 1376, 1406, -5647, -7598, 2765, 5396, 1091, 1472, -3045, -7979, 1240, 7692, 2026, 251, -1575, -6635, -490, 8049, 3512, -1138, -741, -5268, -2996, 7524, 5448, -2509, -2224, -4279]
1040d279J83R504J003q982j199N79j602Q314M084q835l952K616J3M712O003o812
1056A350o812K951P79K808O898m335r125J949L637O77N154j588q952m82M344J079
1072C32M001O00r112k899O248K338J170J853o704n043M934M686R14J049m617o945
1088g195M367O881m06k71k673n792J130P216J240j034k484o423P5Q035K258l018
1104A906j989m054j796N893N192k710l180l168j547M871N933j868m347k205r65
1119d034K950N821K89m809l155j117L004N941M90n150l355n9J909M179K706m294
1135A316n745R1L010L880K060k985o164l53L673L129J922r35o390k439M934M255
1151C259P86r37n464k968M102M473P27p72m157m905L273O667q6k177k197m712
$$ y = [-4279, -4096, 5408, 6411, -2571, -3770, -3191, -4793, 3521, 7605, -1230, -5182, -2566, -2553, 2159, 8162, 1350, -5462, -2511, -1732, 1076, 7974, 3639, -5486, -3537, 100, 777, 5931, 4343, -4609, -5091, -747, 332, 4333, 4933, -4179, -7078, -830, 1508, 2678, 4531, -2173, -7216, -2282, 2404, 3318, 4367, -250, -7195, -2828, 4053, 3647, 3376, 703, -5089, -3959, 3257, 4497, 3463, 979, -5444, -5369, 2666, 4924, 1906, -83, -4137, -5933, -40, 5152, 2442, -738, -3906, -5453, -582, 5351, 3483, -864, -3069, -4034, -1084, 4737, 5026, 217, -2938, -4055, -1051, 4890, 5380, 230, -3125, -3184, -1275, 2904, 5610, 1316, -4429, -4338, -1328, 2552, 4612, 1627, -4537, -4890, -1217, 1912, 3834, 2899, -3491, -5930, -996, 3259, 4045, 3108, -2356, -5324, -1222, 3251, 3978, 3206, -951, -5856, -2583, 4084, 3998, 1821, -376, -5088]
1167e088Q51P242J357l455j553l822j193P458L938m770k880j427j627N764N507
1182F302m207l988l72k069L593P874l140o795L25k88J370P282n33q153k99J325
1198a773n89O828K216q931l472L924J44L518M551p452n431M492J204J481O035
1213F745n279q832M671M263q89M384j368r514J910O335j008K653J027j0005j596
1228f503R225L81j668K404o359n390Q252L183k459K165m877o997P329P020m618
1243A088m32m3p377L222R314k556k860P11o432L57J1456r14o508J640l017l032
1259e383Q809L167o779j018j018l592P539N708p826l399K537l241K965Q557m876
1274B150o703K398j403J686R289l328q967K476J638j310P001J498q987j573L866
$$ y = [-5088, -4237, 3005, 4362, 907, -646, -4468, -5661, 1797, 5735, 965, -1915, -3342, -4969, 795, 6302, 2095, -1893, -2265, -4334, -741, 7133, 3993, -2802, -2477, -2765, -1395, 5887, 5354, -2799, -3098, -1773, -2362, 4466, 6682, -2249, -5721, -1797, -1653, 1865, 6416, -1036, -6467, -1975, -771, 710, 6745, 1466, -7366, -2695, 1568, 679, 5063, 3695, -5819, -3909, 2426, 1418, 4071, 5098, -4907, -6503, 2722, 3103, 1435, 3839, -2520, -7910, 342, 3525, 1066, 3231, -1646, -8643, -1314, 5706, 1088, 656, 613, -6764, -3542, 5772, 3216, 356, 1067, -5365, -5008, 6448, 5534, -974, 666, -2351, -5383, 3426, 6593, -186, -1204, -2222, -5814, 1725, 7433, -393, -3792, -1255, -4496, -1531, 7026, 2150, -4553, -2155, -3558, -1872, 7417, 4089, -4878, -2402, -764, -2074, 4927, 6425, -2562, -4135, -269]
1289b69r84N069L161r370l420N936k20J326N303o622p061N195K904J3M156m246
1305H71q281M294N671k157L030j65q528k2P558M75J17N01p284j590Q018R08k199
1322A217J848m929m641O605M823l193l14k752m891N173N887l277j434l81n251
1337e510K000P689n48l999p47k918O06P223N97m786j63j639j676O259L747n149
1353I86l050J04p84M188L929l894l759K25j240K879N628k216o387q1J214J436
1369h22M370o02n178j122J670P18M331J243o008k926L160J978J720J525m016m017
1385c976J956K674J720K038l490n390J154M364J374N00k133m419j82L571K426
1400B187M26j245m912j117M615L054n92j552k915j903K930L995L04j501l435k397
$$ y = [-269, -1253, 3816, 6977, -2393, -5813, 123, -97, 1229, 6532, -90, -7151, -1956, 948, 961, 5117, 871, -7410, -3116, 2555, 398, 3428, 3263, -5265, -5287, 2271, 2746, 2863, 3364, -3920, -5510, 2508, 3416, 1217, 3065, -1864, -6505, 100, 4923, 1730, 1416, -1336, -6227, -1054, 4833, 1556, 122, -259, -5510, -3510, 4179, 3631, -368, -1115, -4033, -3427, 3796, 4393, -393, -556, -2195, -3871, 2388, 6135, 986, -2064, -1960, -2744, 1444, 5373, 1479, -2280, -2055, -3295, -416, 5212, 2996, -3391, -3472, -2258, -822, 3548, 2946, -2232, -3354, -1684, -966, 3365, 4608, -1400, -4326, -1166, 812, 2532, 4057, 41, -3976, -2020, 654, 2374, 4412, 922, -4468, -3314, 1050, 2424, 2924, 791, -3628, -3810, -239, 2187, 2613, 1368, -3544, -4661, -46, 3008, 2416, 864, -2051, -3954, -1024, 2971, 3275, 1774, -1661, -4058]
1416d058K844M705O01k818k588k085J730M432J059k460l018k015J318M072K025
1431C744k861l056j137R63L472K462j670l501k018Q17M080L057j928m097j378
1446c051J374K802K634m89l843k937R06L516L165q94m336k430J215K960K394l08
1462B678l478l101N39L299L239k6l712l421J066K871K899N46k987l663l9L349
1478E9L607M13l501m084O26L210K661N37k794l493p82K979L355J195l440m178
1494c630l52L356K882Q80k355l768j313L269L653R51k080m327j284L515L503M65
1510C365j592l441k241K672M197P68j592l557k769K657M755J63k051k669k397
1525c732Q93M801J567k454k613k484Q09N396J877l422j716j867o0M299L493l242
$$ y = [-4058, -1214, 3491, 4092, 1274, -1314, -3399, -1669, 2763, 3822, 1362, -1656, -3671, -2353, 1719, 3744, 883, -2173, -3310, -2347, 1125, 3587, 1917, -1584, -3602, -2785, 1295, 4352, 2424, -1673, -3051, -1677, 1125, 3759, 3270, -573, -3510, -2604, 912, 4077, 3183, -1153, -3583, -2368, 592, 2986, 2678, -800, -3901, -3362, -63, 3176, 3150, -562, -3983, -2917, -46, 2853, 3399, 412, -3251, -3290, 59, 3666, 4079, 578, -3506, -2880, 330, 2991, 3528, 734, -2759, -3541, -562, 2793, 3988, 548, -3630, -3982, -626, 2256, 3136, 781, -2987, -4300, -1031, 2622, 3573, 1493, -2834, -4118, -603, 2900, 3365, 1773, -1668, -3909, -1237, 2960, 3728, 2136, -1421, -4190, -1533, 3222, 3385, 1334, -1335, -3732, -2839, 1962, 3529, 1075, -1538, -4022, -3213, 2183, 4060, 638, -1078, -2945, -3005, 1294, 4787, 1545]
1541A545l080r20j10L966L603k777m132M6l19K298M699j743n273q38J167J136
1557g32M462k16n936j010J857M31L303J901n475k843K789J372K190K135m557l876
1573d205L209J850M38K990l020n463J670M410j54J335j605n432R71M452J15K50
1589A811M15n455j622N806J487j352M86l638l100N337K635j896L53k049l762L499
1605a045N390k490j127n32l683J785N715j370k840P06l343j32O104M98m395K7
1621g32j361j290N047K260m587p78l8k100L817M591m354k918J320q81J438N004
1637D438k251m513J336j99K55N224o01o298L19J869l68L285J228n202j860K548
1653g90q1K046K592m711l381K981J486L58K917k888m943K396K459L08K396j500
$$ y = [1545, -1535, -2455, -2565, 1401, 5004, 2227, -1905, -1859, -2178, 120, 4819, 3076, -2197, -3035, -1868, -732, 3730, 3514, -2422, -3432, -1575, -1144, 2159, 4060, -1415, -4258, -1469, -97, 2093, 4228, -329, -4205, -996, 854, 1292, 4282, 1262, -4201, -2531, 1879, 1725, 3060, 1455, -3977, -3006, 1446, 1561, 1811, 2226, -3229, -4851, 955, 2442, 1090, 1576, -2062, -5162, 175, 2810, 914, 1267, -782, -4544, -1045, 4345, 1855, 728, 196, -3487, -1702, 4013, 2643, -197, 509, -2834, -2966, 3138, 3636, -759, -732, -2093, -3383, 1664, 3924, -663, -1441, -1479, -3579, 238, 4829, 475, -2443, -1123, -2004, -566, 4438, 2187, -2326, -990, -1189, -934, 4290, 3689, -2609, -2290, -421, -789, 2496, 3724, -1478, -3338, -790, -871, 1175, 3767, -944, -4325, -1344, 142, 500, 3417, 529, -4414, -2018, 441, 749, 3145, 1645]
1669A645n279J063M184k67O43K56m780j394M854J285m77M38m001k310M381J988
1685B229j326N98k383l452K992L911r16q21j581l206J709N123n48j832o37k646
1701b786K43M995J235k806j241j510m51M204K104l204j639r23p49L155L024k095
1717A556l019p03k48K194L825j586m038o96Q39J168L438L33m563j629J526J695
1733I2K579O45l825k426J628J647J906J215k979l555R54L115J133N78k075l885
1749c253N80L087J389K40j302l524j015L594K692q72j106k364j705L059L439r67
1765A972j547j677k149K558M375p49k719j377j077J061M090O43l047j761j094
1780b498K68M468J616l756k348K32K82K708K563k937l266M82L95K076L474k147
$$ y = [1645, -3634, -2571, 1613, 1346, 1989, 2245, -2535, -3929, 925, 2210, 1733, 2171, -1830, -4140, 241, 2229, 903, 1501, -882, -4334, -1342, 2569, 1653, 832, -749, -3955, -2246, 2877, 2329, 497, -140, -2786, -2543, 2452, 3687, 881, -360, -1870, -2321, 1883, 3987, 783, -856, -1779, -2528, 627, 3651, 1556, -1463, -2166, -2414, -220, 3605, 2019, -2019, -2715, -1876, -708, 2730, 3063, -1500, -3129, -1603, 92, 2671, 3316, -509, -2935, -1307, 340, 2246, 3461, 482, -3073, -2119, 996, 2129, 2707, 632, -3253, -2673, 414, 1803, 2043, 741, -2783, -3798, -204, 2488, 1616, 510, -1854, -3559, -500, 2939, 1972, 425, -1252, -3401, -843, 3532, 2783, 64, -1313, -2390, -1329, 2761, 3404, 357, -1404, -2498, -2230, 2238, 3854, 98, -2250, -2018, -1736, 972, 3535, 598, -2668, -2186, -1791, 285, 3759, 1612]
1796A612m466O73J745P40K730j88n110m31K201J185J878P54n095j943L535J344
1812A164N09J110l296l431K605K540O7R62k634m094K819L422m75R9p05l753M40
1829b651M434P17r21q80l343k79M997N67j836j46j843j899L626K731k071r64j476
1846a237k038L375L387k563j883K51k013J002M886p51l547l10p35M56M560r6l632
1863h88o6m8o79L525K254l858k294J160j95K408K237l054l157J686O9J169K951
1880C220k053m091Q18J820N33J884n32m244J92K356L64J806K7l533j800L108J266
1897A141M28P39l243k003K447J999Q1R23k188l497J789K622L65m74p58l112M85
1914b256L219M06m00n41k997k41L671J114j229m78k049o41K970J873j000j098
$$ y = [1612, -2854, -2181, -436, 304, 3034, 2846, -2264, -2695, -494, 691, 2569, 3323, -1772, -3715, -180, 1164, 1673, 2783, -513, -3944, -1339, 1201, 1268, 2230, -404, -4498, -1679, 1743, 1268, 1367, 662, -3091, -2651, 1783, 2500, 1579, 699, -2644, -2923, 2074, 2641, 805, 659, -1184, -3083, 543, 3274, 1203, 239, -1237, -3275, 100, 3487, 924, -959, -708, -2721, -1719, 3167, 2416, -1131, -1441, -2176, -1720, 2840, 2744, -888, -954, -1002, -1681, 1844, 4098, 240, -2054, -894, -1089, 1319, 3556, 502, -2655, -969, -900, 269, 3220, 1167, -2924, -2106, -286, 247, 2131, 1599, -2645, -2453, -97, 267, 2073, 2100, -1433, -3233, -125, 1141, 1569, 2308, -935, -2938, -491, 1508, 1589, 2512, 324, -3173, -1384, 1238, 1603, 1129, 371, -2741, -2256, 963, 1369, 969, 428, -2569, -2810, 861, 1975, 746, 268, -1781, -2422, 548, 2421, 1421, 323]
1930C23j606j276K413L144q60k061j355q59J869K921o56k241j009q88R55L137
1946A951N09k930j441j16J006K267J059k101j832k59M56K613J854k280k591O5
1962a770J191J785J388j479k575k57J114J561J722j274k981j010J713K055Q36
1977B019p62k506j470J295K171J324n55k729j616J304K464J131o54j900j581L05
1993a760K751J479o25k189j708M49K609J604q97j931j499j27K351J532m05k036
2009d02j598l55K259K394q85k033j445r5K072J862P2j893j963q3J683K758k83
2026B065k044k034K46J673J997J66j834j825l96J927K177R8j759k405j17J544
2042e21K154K30j332k428o83J721K251O21j424k038q53J583K058Q01j417j905
$$ y = [323, -1283, -2559, -146, 2998, 2138, 77, -1278, -2137, -268, 2653, 1997, -244, -1253, -2141, -1186, 1951, 2460, -470, -1911, -2027, -1021, 1246, 2305, 204, -1628, -1887, -1431, 1182, 3036, 756, -1835, -1770, -579, 1206, 2594, 1115, -1460, -1717, -603, 958, 2680, 1406, -1575, -2585, -872, 1183, 2019, 1257, -1249, -2719, -1424, 747, 2071, 1516, -1213, -2829, -1525, 939, 2070, 1416, -484, -2065, -1760, 991, 2470, 1845, -344, -2052, -1603, 1006, 2610, 1713, -218, -1717, -1844, 507, 2039, 1634, -402, -2000, -2355, -96, 2298, 1413, -620, -2065, -2160, -88, 1774, 1846, -47, -2010, -2093, -410, 2348, 2065, 21, -2013, -1767, -94, 1903, 2069, 235, -1590, -1986, -59, 2118, 2216, 457, -1948, -2065, -521, 1633, 1863, 531, -1897, -2580, -859, 1392, 2013, 589, -1449, -2302, -719, 1339, 2140, 723, -1182]
2058a182n68P97K417J208j655k242r16J474K408M14q94k333j107J345J954J003
2074B123j019k285j046J249J385J298l92k302j307R37J692J671o91k122j390J112
2090a087J914J040j22j762k003O57K213J106r8j830k166O98K425P48n94j134k124
2107b119J30K575J166p79j182j466q76K655K034j101j073j303q13K031K429r06
2123A402j082j188j021J587K710l71k134o25o42N63K821K85k628r17m09M25K511
2140A287R60k432j682M83L32K003J366k085k104O96N31J069K120j606k937Q37
2156a162Q65O00J912m78l287k6J259P63J286J60l356j034K243Q74N03P28k852
2173a002j975K446J342k00J014j897k418J601K480p70N10n55l066R42L119j70
$$ y = [-1182, -1750, -953, 1464, 2672, 1017, -1225, -2141, -667, 1741, 2155, 1261, -1072, -2179, -834, 1120, 2123, 1104, -1181, -2227, -978, 407, 1705, 1313, -989, -2296, -1359, 333, 2004, 1313, -809, -2199, -1087, 827, 1867, 1745, -17, -2020, -1363, 850, 1956, 1858, 28, -2138, -1440, 985, 1733, 1139, 5, -2119, -1989, 586, 1752, 973, -209, -1675, -2551, 104, 2138, 1037, -36, -1339, -2152, -121, 2308, 1402, 320, -868, -1889, -302, 2408, 2037, -97, -722, -1364, -801, 2020, 2305, -323, -1240, -1649, -1224, 1287, 2247, -185, -1867, -1384, -1052, 951, 2317, 232, -1872, -1176, -645, 424, 2544, 938, -1999, -1162, -297, 303, 2215, 1737, -1550, -1576, -317, 446, 1732, 1892, -1464, -2498, -255, 619, 1122, 1850, -1002, -2977, -531, 811, 611, 1625, -272, -2690, -1089, 1391, 621, 1131, 576, -2490, -1548, 1571, 1401]
2189A401m67j33k463m18L476M92j453K48k015r62K948J854j997j41j295j567K308
2206a84K698j935j146m30j354J645K963q61k173K03j117P23L359k79k859l1k34
2223a012l9K734J251l294j127Q81l63J815K139l012j895J146N5J158K321k239
2239E19k707Q16Q22M93K018n90l506L38J587M03J457M5l251p50K431K83M83R91
2257A882k732j731K371J340k25Q94k295k004J782K025k65q5r99k551J097K672
2273A176l71o9p59j940NL099L21j117j95j465r42L026J506j572p46p97q50J930
2291B40K302j426j471o76p66J403K607q56j977k80p31Q15K635l50k179n57RM26
2309h32K081O85k455q78K65M57J705J275k107j682N27R43Q18J331j099k443R9
$$ y = [1401, 934, 801, -1662, -2080, 1396, 1888, 435, 683, -1332, -2294, 654, 2508, 511, 370, -925, -2492, -184, 2514, 579, -567, -997, -2351, -706, 2257, 1396, -777, -574, -1691, -968, 2391, 2112, -747, -778, -1012, -1051, 1683, 2934, -360, -1487, -606, -969, 846, 2985, -27, -1922, -776, -721, 437, 2758, 519, -2188, -1372, -550, -57, 1961, 1371, -2135, -1797, -210, 193, 1650, 1695, -1556, -2306, 125, 408, 891, 1882, -850, -2581, -210, 1130, 905, 1799, -496, -2500, -718, 1307, 1042, 957, -42, -2593, -1496, 1176, 805, 736, -23, -1963, -1958, 1141, 1462, 345, 150, -1315, -2257, 769, 2275, 703, -43, -840, -1690, 240, 2542, 1116, -355, -1031, -1797, -394, 2213, 1357, -620, -900, -1631, -816, 1819, 1469, -710, -1267, -1258, -832, 1249, 1934, -521, -1399, -1134, -677, 1028, 2303, 196, -1486, -959, -16, 802, 2133, 1034, -1409, -1310]
2326a310J370O49J178o99k657j51J614P41L84k83k274p48J782J358J86k79j414
2343e53j724J689J502K41j21j275j610R63K333l3p36o98j542P85J957N38j104
2360F12o40j483j47K218J279j357r88o48m52J931J620j337j209l05o38J484J939
2377A879o09j964k00M1P73J759L07k046j260Q38O67J486L52k291j242P75N26R46
2395G37J191j610k097M86R10J111N56q97k128K00J384Q76M39l29k208k50J702
2412G3Q60M37p93j812m23J536J383j75j72j495j570J892J645l19n11j160j055
2429a659O28K143Kn41j030j491Q00K235L69j129q06r74L00J848J275j009j536
2446e75o86j83J705J778j127j406l85k30J234J812p91j724q12O06M20J869l39
$$ y = [-1310, 60, 709, 1887, 1188, -1469, -1620, -6, 735, 1119, 836, -1438, -2186, -404, 954, 1140, 861, -553, -2277, -588, 914, 1155, 1034, -241, -1851, -888, 1445, 1412, 676, -22, -1564, -779, 1178, 1716, 612, -28, -1511, -1658, 560, 1839, 482, -506, -1154, -1606, 325, 1945, 608, -601, -906, -1544, -60, 1879, 1270, -694, -894, -853, -80, 1679, 1986, -60, -1320, -482, 185, 1671, 2023, -268, -1510, -735, -209, 737, 1928, 318, -1779, -1293, -383, 728, 1284, 387, -1741, -1541, -157, 719, 1158, 829, -1379, -1629, 73, 933, 1370, 577, -1235, -1658, -122, 1261, 1086, 914, -581, -2151, -259, 1386, 1067, 556, -604, -1659, -1031, 1112, 1114, 573, -457, -1948, -1148, 1087, 1456, 327, -479, -1453, -1153, 695, 1970, 961, -575, -1261, -1444, 261, 2039, 912, -494, -879, -1109, 125, 1937, 1146, -578, -1390, -784, -364, 1505, 1166]
2463A166j642r42M58O94J445K62k141j050O97J159Q74N42j703j445R06P97Q93
2480I70P00j554j395K72J409O61L81j130j633M2J111R93L18p76j739j18J303J336
2498A151l85l91j529p79J576J461l7o70j267q82J262J765J22r49r63p84R39J591
2516A231J09n85j382n52M69J659O30r37j375n80M06J682O50q11j403n02M96R17
2534A22J418n92j625q09P40J251R35n00j416p37L45J308J232r41j089q88N13J042
2552C09J025l67j080j299L79J289J051j52j598j139N80R60J471n42j106j167J12
2569a274J370Q90O7r66j217J40R68J461l44j187r19J00R97J000L48j169j258k85
2587a278Q81J281M09j294j256j68J064J152O31j343j217l23J048J172M20j056
$$ y = [1166, -476, -1418, -960, -266, 1179, 1441, -700, -1750, -1053, 106, 980, 1522, -181, -1626, -720, 77, 970, 1670, 116, -1279, -1007, 402, 1063, 1444, 314, -1319, -1277, -166, 827, 1145, 369, -1370, -1488, -185, 1151, 766, 375, -1154, -1933, -357, 1104, 1067, 397, -870, -1752, -490, 1275, 1397, 448, -515, -1299, -360, 1231, 1340, 755, -627, -1179, -710, 949, 1579, 642, -733, -1313, -907, 775, 1425, 614, -789, -1291, -795, 122, 1540, 948, -677, -1486, -746, 505, 1440, 940, -476, -1213, -868, 440, 1672, 731, -358, -1246, -733, 309, 1334, 967, -113, -1412, -1033, 256, 1307, 1155, -443, -1582, -1002, -42, 1429, 887, -219, -1386, -1274, 96, 986, 1053, 87, -1130, -990, -22, 1439, 1095, -92, -1011, -911, 86, 1086, 1434, 265, -993, -1278, -397, 884, 1293, -1, -1257, -1425, -361, 791, 1422, 79, -1138, -1461, -413, 759, 1179, 123]
2603A23j198k75R90Q76R60o11j549o20J126P53P30m53j508l90O43J002N91l25
2621H65j619o95N81J623K92o46q58r69L32J711L63k43r67j132Q9J694Q64o17p51
2640h3p74k9J411J025o43j005o89k73J282J030n70q84o72n6J030R67j23j343n53
2659i52j75Q06J388Kj128r06j76Q95J115M31j530j062N00P05P93Q31j266j619
2677a348N21P37J014M82r08j355j01P93O71P11p62j796k23J362O90K49k22j233
2695g18r75J249J248j13l86q37q88Q94J377J01l71j005r54N72J834m9p03m33j212
2714a369M77J791N33j122o45p07N1J123J364j152r32l91j08J134J378j015j154
2731g44l4j11N96J588m51j142l91J30O33J148J54j834n97M16O21Q57N24j521j187
$$ y = [123, -1075, -1350, -360, 516, 1476, 865, -684, -1304, -178, 575, 1305, 852, -656, -1046, -403, 599, 1190, 865, -754, -1449, -868, 755, 1047, 401, -457, -1426, -1094, 617, 980, 737, -230, -1362, -1273, 421, 1285, 668, -83, -857, -886, 525, 1550, 907, -98, -787, -1060, 222, 1252, 682, -202, -874, -930, 100, 1067, 944, -399, -952, -1127, -321, 1067, 1069, -59, -965, -1141, -246, 869, 1300, -230, -1292, -792, -87, 706, 1537, 271, -1348, -827, -90, 924, 1406, 498, -857, -958, -165, 506, 1217, 455, -1341, -1564, -202, 488, 737, 515, -718, -1693, -444, 804, 691, 305, -532, -1420, -526, 851, 952, 581, -424, -1378, -806, 1028, 979, 276, -157, -1369, -892, 899, 1432, 310, -335, -1042, -991, 132, 1496, 344, -588, -979, -1087, 47, 1425, 410, -744, -778, -889, -293, 1295, 844, -298, -689, -559, 74, 1222, 1376, -458, -1055, -639, -18, 839, 1363, -158, -1345]
2750a345Q60L43Q41P99j622j236N08R00J26Q43p90j781M08J348L57K92k51j460
2768h60k66J268L36L31K19j635p85J697N54Q9j72j315j200J898J138p91k43p78
2786e15j167R66J711j38p66l46j153N10J731J68j089j55p95R9J796L69j127l86
2804b87r1o83J498J257j319q75k2l86J173J347j055j439J02m6Q16J573q73j761
2822a071J41L87J5J556l7j671m83P95Q1J046M40j236j350J102N28N55M16j157
2840E7j153N92R02k3P77q73j774M33J301J0O04o82j330k0J533R6P2j32j388n61
2860a559J831K65p4k00q59q54J369J288l47l21q87j143J269J588n20p94n64o05
2878a117M59J728j27r11n67q39M77J671L72j209l89l62M1J312Q27j353n41l8k47
$$ y = [-1345, -485, -142, 699, 1498, -124, -1360, -852, 48, 174, 1017, 227, -1554, -1146, 202, 559, 851, 600, -860, -1126, 142, 478, 809, 1028, -607, -1392, 305, 859, 948, 776, -539, -1739, 159, 1297, 506, 263, -515, -1682, -716, 995, 857, 91, -255, -1408, -898, 833, 1001, -88, -243, -1038, -939, 857, 1226, 99, -287, -378, -1061, 437, 1694, 375, -500, -522, -908, 265, 1612, 557, -882, -780, -826, -10, 1563, 690, -1071, -930, -543, -528, 1028, 991, -680, -1163, -368, -287, 759, 1199, -37, -1387, -285, 243, 798, 1214, 57, -1096, -504, 398, 375, 1152, 279, -1495, -1062, 239, 249, 853, 171, -1159, -1179, 354, 450, 522, 390, -998, -1559, 272, 537, 463, 263, -596, -1450, -81, 1207, 860, 539, -348, -1491, -222, 1366, 846, 52, -512, -1117, -658, 1070, 943, 32, -535, -1374, -897, 774, 1146, -63, -452, -814, -773, 539, 1366, 13, -528, -566, -813]
2897h13J165J289r78j332K26m9M95J268k24j684j27L61O14Q03p8j501p28J105
2915a88J34P38R7j399o39O85O55N06J92j248q17N56J156M52Q4p37j305K12J174
2934C08N81m9o13j139J84J036P27j40q38o71k33R74M71k60m12o90l29R63R05l64
2954D11n72k34o09Q00P84L63j091o12P8L18J235J38q91o82j3K98Q32N39q39j020
2974g67K30L86P24N08r34r12J16K54N60M96m58p98n68M61R79M79k74r96m85Q85
2994a14K85P63k46q14n57K67Q76M73K4j346o15N85N37M46K84q57q71K90Q39N75
3014H24l89n73r71k2R84P00L8p42o33p3J112P79l41o73p09J42O84N11N5p67m44
3035e08k91O65Q75j9o66p95j53Q45O14L03q45n96k88O23O32M35p73q11k43Q24
$$ y = [-813, 352, 1641, 663, -669, -443, -492, 3, 1271, 1047, -637, -764, -403, 211, 1014, 936, -565, -1293, -188, -54, 684, 781, -618, -1257, -572, 83, 589, 781, -467, -1284, -728, 428, 880, 964, 227, -1078, -866, 308, 889, 840, 227, -912, -728, 308, 1035, 895, 57, -614, -847, 127, 598, 338, -74, -764, -1093, -130, 775, 411, -161, -395, -1004, -204, 580, 943, -148, -760, -682, -364, 871, 1009, 118, -564, -577, -279, 553, 1092, 253, -767, -537, -151, 573, 1081, 147, -765, -649, -395, 165, 661, 203, -595, -1163, -702, 277, 756, 482, -514, -999, -114, 171, 934, 688, -126, -683, -416, 460, 933, 957, -389, -1004, -419, 118, 564, 848, -9, -880, -590, 249, 824, 435, -138, -1109, -1131, -147, 553, 591, -151, -784, -857, 255, 1034, 693, 20, -689, -547, 137, 648, 703, -64, -508, -799, -134, 741, 722, 56, -739, -892, -47, 567, 870, 25, -571, -859, -236, 396, 831, 58, -753, -996, -172]
3055a72P93O0l51q64j79L75J029J96m59r49l6L92N65L43j70j079r7J17Q02O80
3075I96n26j093m50N51O70O29n29p46k12K16O47P63l36r67m03N8R69L52l25l15
3095e1q28P07L31M53L6q81m27j15J009P30j17j209j19k76R68O38l17m59j163J14
3115i76J060M08K20q56p43J29J094K61Q0k85j313M7R05P23K30p26q77r7J163k3
3135D24K22m38q72k16N66R38M5l35r68l15P00J085k43m82m37m89P40P58L4k30
3155D87r19k11P53O10L57r12n68r9N4J058L61q62m51r9J91N26L71m03q32j38K43
3176d83P29Q41q04q20m05M30Q26M65m85q09l02P82J24P81k39p72r29J052O45j00
3196E27K55r30q21P46N32L76j99o63q81O60P34J06K9m04q13J45Q26J81k47N1p66
$$ y = [-172, 621, 681, 330, -534, -713, -338, 691, 887, 428, -521, -557, -165, 400, 743, 573, -506, -603, -486, 316, 996, 470, -623, -1073, -522, 148, 777, 248, -498, -710, -494, 153, 916, 580, -387, -790, -732, 237, 589, 264, -51, -879, -172, 159, 612, 648, -233, -660, -775, 234, 964, 847, -362, -481, -757, 211, 849, 532, 73, -1090, -976, 84, 492, 712, -144, -887, -758, 336, 597, 677, 392, -921, -874, 31, 754, 984, 258, -619, -716, 447, 424, 646, 208, -664, -880, -314, 624, 669, 334, -634, -949, -249, 836, 593, 111, -326, -815, -75, 683, 717, 487, -432, -643, 110, 720, 1077, 165, -403, -502, -448, 610, 971, 109, -342, -441, -250, 276, 647, 244, -588, -726, -483, 246, 1087, 283, -537, -942, -512, 314, 779, 294, -515, -817, -35, 89, 870, 631, -141, -1070, -18, 627, 527, 782, -148, -969, -223, 309, 685, 486, -177, -1058, -398, 336, 442, 471, 67, -746, -601, 225, 406, 159, 210, -556]
3217e56n3O61L49o4l91m99j49R38Q96n05m87l87p10Q98R47k88p38l67j39L83J101
3238H40l5j102k62l8j5Q75O19r69m66K52j44P83L74r47m36J71J07N69P61o76o65
3259d04l8K39O25N02p91n00l48M78K58L63K12r70n65O61N60L2Po76o86R47M78
3280C84J37q8n28o67K88R53n5Kj42j010K70M21N64K6o76o08k04R25Q07l92m77
3301g0n46o8P66N38l67l49k65l96L68J014j90p22n7l58O07O34J72r10l32j05L86
3322b50P97L57j089j72qK1P99M41q05m34P5J6M85Q35q53j127M04l7L50Q34l63
3343B76j044J93L82K08N32j04o73n36O03N48KK75q39p23M35Q52kK39o38r00O45
3364b69N51O1P5l81p38K23J034M4l93k88q56j54J549kp1m11p02J00Q87O17p06
$$ y = [-556, -609, 52, 401, 337, -54, -553, -702, 236, 1132, 627, 140, -247, -957, -59, 888, 600, -138, -505, -644, -261, 840, 805, -297, -559, -597, -612, 263, 882, -87, -553, -301, -445, 338, 712, -235, -671, -500, -393, 176, 937, 261, -404, -442, -203, 422, 924, 133, -367, -715, -237, 21, 384, 596, -374, -939, -278, 282, 314, 321, -355, -1041, -94, 384, 521, 433, -95, -762, -474, 479, 424, 426, 284, -726, -456, -35, 529, 555, -121, -729, -933, -8, 799, 407, -70, -616, -684, 82, 620, 253, -96, -361, -757, -389, 625, 435, -287, -344, -702, -95, 539, 711, -199, -531, -636, -250, 547, 904, -185, -357, -365, -344, 455, 896, 91, -343, -268, -252, 233, 1068, 215, -912, -508, -545, -195, 639, 276, -768, -575, -193, 15, 547, 443, -230, -766, -163, 385, 387, 662, -177, -900, -465, 387, 385, 624, -14, -914, -269, 282, 343, 418, 37, -701, -478, 556, 600, 207, -81, -937, -1091, 458, 456, 385, -26, -728, -628, 259, 876, 170]
3385A70o2m59m04J021M84m40k60l90l24O64Q46j97p83m08j67K04J190r7r11l46
3405f69J40m5O64O83j209L4n6L92M88K06q32o21M89L0O70M69n38r32L02L29K52
3426B46N95m09j101J9M86M10M45l17r75k70R25J28J14K70j131j98M15O43q9N1
3446B57l49o25M51N43N27l67n22n23K60J119q4l29n22k28nR27J58k89o17m34O7
3467e85P16N99o62k86m02J46N24M97k37m49o3l18O54P60k91q73j49J22M79O70
3487H52j95q63k32J44P3O36K05p74l32L83L0L41L02m61q64J93M70N51J17o79o19
3508g22L63L81N43k22j79n20k00O78K79L9k36q14J58N82K32o3j65m04m67N56L51
3529A70K53l59n04l03O30N30r4k72n17j8J26O95J68k1o74j15j80R82K89m67j45
$$ y = [170, 108, -351, -755, 266, 750, 310, 50, -340, -664, 0, 846, 649, -134, -542, -709, -505, 685, 588, -323, -669, -529, -574, 90, 773, -436, -402, -458, -66, 422, 628, -204, -825, -336, -306, 364, 833, 295, -637, -335, -6, 246, 841, 432, -669, -650, -164, 246, 691, 374, -601, -871, 54, 182, 296, 566, -565, -763, -348, 295, 206, 257, -92, -717, -266, 277, 804, 437, -85, -608, -348, 771, 687, 358, -164, -392, -397, 530, 688, 399, -218, -652, -585, 131, 730, 68, -218, -620, -474, 50, 547, 310, -139, -202, -520, 134, 894, 603, -270, -419, -297, 182, 852, 657, -206, -438, -294, -221, 415, 620, -154, -486, -103, -73, 268, 570, 109, -755, -562, -92, 459, 576, -103, -722, -359, 22, 565, 343, 164, -356, -556, 122, 401, 440, 204, -610, -452, 130, 362, 299, 134, -270, -737, -181, 170, 423, 64, -440, -743, -113, 417, 323, 51, -466, -484, -358, 337, 505, 484, -190, -305, -485, 497, 786, 319, 174]
3550A74p69K57L16P03k83m76l25m3M17N00J5j012K3L06J48N37j1q45l58M00L98
3571G2O47j29n94m13n1M15N89J1p48m80K91M84L86j03k60l24l7L32O52l28o22
3592b10l69M7M55K97J99l96m41j16J76O50J68j06q05jL08N67M77o13m85l16N56
3613D2K92K83m27m46j03L39L29L26l90o51j83K76O51O3j48n83l87O46K72R4P0
3634C65n71j53J90K94M27k48m14k87J00O85K64n97k22k11L9N35K27j94j26n19
3654d16J6Q61R9l65k47n96J10M48M02j7l04m44j36N67O21k88m47k31k5L99O35
3675F42q8p83j00pM18L07l3m61k79j09O38L72Q5m99n89l6N61J94M30n85m36K75
3697h3j82L82J56j53n64k55N49N94j51k12m94j03N72J27L89m6p89k15O19K78j21
$$ y = [174, -595, -338, -22, 681, 398, -78, -403, -446, -29, 471, 486, -526, -503, -197, -49, 488, 477, -368, -726, -326, 72, 719, 590, -4, -417, -468, -53, 536, 547, -201, -681, -390, 94, 480, 377, 117, -207, -244, 88, 740, 412, -210, -579, -532, -77, 220, 419, 23, -418, -534, -358, 292, 460, 354, -451, -452, -144, 423, 900, 287, -198, -514, 42, 334, 617, 190, -256, -359, -20, 309, 635, 245, -406, -589, -313, 338, 401, 253, -330, -717, -71, 201, 295, 365, -206, -359, -169, 125, 552, 304, -110, -397, -297, 388, 652, 55, -167, -378, -339, 196, 423, 229, 103, -416, -400, 461, 560, 195, -52, -648, -538, -90, 312, 295, -9, -453, -589, -22, 599, 311, -136, -367, -392, 7, 642, 554, -229, -329, -336, 82, 389, 356, -105, -384, -493, 145, 517, 602, 103, -486, -522, 39, 233, 663, 78, -358, -83, -265, 117, 273, 120, -444, -699, -150, 444, 293, 81, -413, -516, 56, 183, 572, 526, -263, -478, 141, 419, 298]
3718B98k72k50l32L73N98J33n37r3n78L76K33M78j95n11m36K74R05j78j34m16
3738b64j1J3N79M48l65p24j08k0N55L82k33m14n4o8L33O74o00k63j15k97M85P65
3760F98m74m14k03j03N26N82k7o39o64M92K2N11K42p78o1P2N7N36J44o09m69L56
3782b03L76O8L51l58q17J00O04J1L42k43o23k89P64M43r5l52j68m48M11L21K0
3803B15K02n68m02O01P63l83p9k57o59L83M12M24n23j99k53L5P38K5m88j62n95
3824g70N93K27K85j90l78j85j73O86L76l98k42n2R0q1P91l79j29k63K38M1N30
3845F17j67o35j97N4M41K68k75k56j54m3L82R4K15n10k30j41N25J35J35n48j02
3866c92r1M56K91L7O2o88q6M62L82J0j33n01o0M57%k1l15l42j80O27M26m0j23
$$ y = [298, 26, -224, -556, -183, 415, 548, 11, -82, -660, -284, -51, 427, 232, -279, -715, -441, 464, 286, 152, -264, -275, -262, 317, 765, 400, -324, -432, -452, 103, 485, 252, -162, -216, -284, 49, 723, 123, -140, -255, -552, -67, 698, 224, -190, -393, -496, 30, 612, 585, -54, -718, -226, -204, 307, 549, -229, -290, -218, -161, 375, 519, -90, -559, -203, 173, 241, 592, 234, -583, -483, 121, 132, 474, 231, -392, -681, 83, 526, 431, 79, -89, -537, -126, 195, 215, 417, -151, -553, 48, 811, 428, 349, 92, -567, -184, 228, 652, 129, -70, -323, -288, 450, 475, -13, -175, -770, -177, 50, 335, 145, -233, -418, -591, 95, 471, 73, -169, -221, -131, -212, 579, 200, 71, -192, 46, 87, 617, 450, -185, -382, -328, 113, 381, 106, -150, -304, -347, 35, 129, 344, -166, -396, -537, -12, 123, 258, -290, -392, -483, -27, 264, 301, 363, -325, -411, 51, 433, 443, 310, -191, -251, 206, 206, 185, -130, -472, -652, -25, 401, 361, 238]
3889B38p54p7M40L25K5k91k67j33K41N21O2l23j28l00L29L08M01n57k58K6R9L12
3911B39K27k09o10J20L0K44O19o43l90n1K57P1L99j16n16p5J42L96J94J10l43
3932I5k38r3M73J35P0k98k22j11L93J4M04l95o28J20M05J73j97r2o84K10N01L27
3954C62M0k58o04K04L31L15j67j0o03J12J78N45m40J57l74l7O2N56lk59l71R1
3976a73l0O87j26j58j15p22O32O2J43l78l64J44P1N00K54k66j00n63M19K74L99
3997E90l52p64M19J3M28j09k61k46j88K86K62K92j27m77m6K00P4M48L7m12l36
4018b69P7K87J55lm13m20L43M70%M14o00m23M06K57J20Q9k89n78j04O12J52l3
4040B50k83k29J23K39K10k9l16k43l35O24K49j39p4m91j9M95M90k24j23n78o1
$$ y = [238, -516, -593, -153, 172, 197, -94, -361, -494, -253, 268, 330, 7, -121, -421, -92, 216, 617, 60, -198, -172, -73, 239, 466, 257, -353, -233, -203, 41, 660, 17, -373, -424, -167, -96, 303, 187, -329, -404, -262, 134, 328, 438, 95, -143, -236, 237, 372, 442, 144, -78, -189, 204, 218, 622, 227, -401, -281, 124, 297, 100, 8, -676, -466, 35, 362, 402, 144, -460, -256, 75, 390, 223, 213, -390, -278, -100, 445, 5, 162, -212, -249, -187, 369, 366, 107, -264, -173, -203, 484, 358, 200, 85, -637, -5, 57, 200, -178, -542, -398, -327, 173, 427, 161, 61, -502, -83, 191, 590, 238, -526, -107, -94, 334, 225, -36, -282, -470, -184, 78, 370, 243, -234, -280, -80, -6, 442, 479, 67, -269, -192, 95, 250, 247, -166, -586, -243, 227, 227, 641, 41, -382, 24, 281, 401, 490, 201, -377, -481, 131, 283, 250, -33, -262, -139, 100, 310, 281, -35, -278, -613, 11, 260, 121, 47, -444, -463, 32, 522, 298, 175, -403, -464]
4061d64M22J37O53p04r2k79J02N56kj47m24K62n5J67K93n11k76J92n1L00L31k12
4083A98m95j23J04M40L34j76o67o5M06J82L40m85l11q1K1M66K21Ro05k26K64L68
4105A19M1P4l55l3R5K74O6l4j02m32L17K43J48l76n08K93j15J96N21l83N0n83
4127d84J68J64L35nq7k56l04K69M49J5j65p21J18J73N98K11m09l70J44J55J94
4148A92Q1m28oj27K34K60Rq3k43j67L10K88j89J12o07P9J79L40J30l6n57p2L25
4171B4J63QL1j87p73M46Q04l11l76l72J44mN02n0R5k69L6J2J41J83j36k80q7O3
4195a93K63L56k78k50q9r5M77J02L1p17J53J54Q4L20j63k82l40J94J6L34q4J02
4217I5k24k24N67q6j70J45k71n9M21J2n4l8n24M9M33M84l69jn79R3L03J77j77
$$ y = [-464, -42, 95, 748, 44, -48, -327, -225, 331, 329, 182, -242, 20, -35, 132, 425, -86, -362, -170, -221, 79, 410, 198, -297, -420, -316, 124, 458, 282, -385, -450, -44, 138, 478, -7, -318, -399, -378, 88, 309, 318, -287, -513, -249, 119, 160, 234, -121, -154, -59, 215, 281, 247, 145, -287, 30, 273, 421, 45, -463, -170, -285, -89, 432, 49, 99, -484, -316, -152, 183, 178, 91, -165, -469, -200, 249, 264, 99, -622, -504, -331, 267, 478, 69, -301, -157, -2, 192, 273, -155, -161, -288, -54, 206, 215, 132, -111, -278, 32, 320, 131, 243, -364, -285, -106, 234, 364, 328, -229, -301, 24, 187, 195, 226, 39, -734, -288, 516, 205, -171, -543, -399, -403, 99, 49, 144, -125, -89, -77, 64, 247, 111, -169, -256, -193, 70, 426, 148, -102, -191, -286, 191, 293, 324, -393, -240, -86, -2, 318, 155, -127, -467, -273, -257, 77, -7, 95, -129, -353, 214, 128, -42, 103, -168, -227, 194, 206, 152, 114, -410, -361, 72, 556, 187, 186, -393, -300, 3, 180, 3]
4240CK83p81J94K21N18r6l35k17K4q8N94j27l57Rk27J57N56J47j99n67J69p1L54
4263A64l9J28l25j67J1L51J77l15j49j48K11Q0J64N7m37n5K05K16K65j73l72l16
4285d67O31J08j83n5j24l21M07j1L50l6n37J56K91j47K95r6l18n66L51K87M13
4306D28l47k73Q1j71N36O2k31lk24p7M36J48k01j52k65J29J51K76k85K71l09l54
4328c74K77K67R0om45K3J0N57r2k42k59k69L16K93K7l29k03K05m6M08j16l8k79
4351b25J28J27J81K53j28m05m5J71k08M76l7l61pJ82j51K17J33n08j49K42r8L97
4373A85R4j96n46M90l9K86j18l46p8J90mK24p6k76j72K47K61q9L75k09m30J23
4395a04M30j54j05j91j36p5M65J23r7j68l60LO58L91l95M2p41J80J54M49m02K18
$$ y = [3, 286, -495, -301, -80, 438, 342, 7, -210, -186, -274, 320, 193, -164, -155, -382, -225, 331, 478, 279, -288, -119, -190, 164, 125, 253, -72, -239, -228, 123, 300, -15, -164, -312, -101, -21, 143, 200, -237, -292, -87, 129, 394, 221, -151, -467, 164, 272, 89, 34, -90, -411, -4, -15, 335, 299, -238, -82, 209, 62, 357, 261, -57, -623, -272, 15, 428, 81, -192, -111, -282, 254, 316, 85, 82, -142, -219, 217, 365, 164, 12, -253, -124, 27, 303, 18, 289, -20, -374, -97, 170, 260, 254, -191, -168, -158, 399, 307, 65, -194, -463, -147, 146, 173, -156, -359, -154, -200, 208, 92, 54, -225, -97, 30, 211, 464, 336, -69, -114, 57, -151, 325, 288, -73, -80, 102, -49, 168, 301, -207, -356, -114, -212, 185, 279, 83, -463, 27, -12, 274, 156, -190, -268, -78, -82, 142, 66, -210, -382, -135, 126, 37, 412, 203, -227, -104, 326, 172, 67, -124, -260, -335, 130, 253, 156, -12, -372, -369, 289, 680, 285, 327, -414, -234, -80, 369, -33, 185]
4417A85k32J32k12L35j7j99n7j72J34K60J60l61k03K6K05R0L79n22k2n5j7L72
4439B09P4m47q4o2N9K02L21k77l93L2K12M2M77j69l32n5J71J37M3q7m35J79Q3
4462a00J43j4K46l96j33L52K03J13l95L9k25j23K05N1j52K65k43%L10N0L02m31
4484F7k6l82L79RN8J33m04j5J83K16j16Q5j97l76M07M57m06j05j89O2OK93j36
4507Cj26k31J28j68N18K6l43j90J92j87P04j5k81l39JN59k95J87k53j14j1L88
4529A53j8J05n0p10J57K93J72N3o2q0k78K83qM16k21j42qJj26L43q7m88r4J71
4553b25K64M3p4q5l59J77L47R7l66L40p1l68L45jk16L1k38J69L04O2j72k32k56
4576d84N25r5J78J79l66k53K21L28K42m48K12l70j09M23q6j47k8j04PJ88j63L02
$$ y = [185, -47, 85, -127, 208, 191, -8, -65, -237, -103, 157, 317, -44, -247, -221, -16, 74, 453, -69, -91, -146, -163, 209, 283, -164, -248, -310, -251, -49, 272, -5, -398, -366, -154, -112, 365, 196, -136, -191, -20, 117, 160, 73, -362, -183, -100, 43, 29, 275, -121, -254, 98, 301, 414, 19, 58, -167, -290, -85, -34, -186, 79, -164, -164, 146, 196, 498, 67, 41, -341, 38, 47, 105, 238, -166, -181, 2, 218, 102, 187, -10, -386, 21, 478, 72, -33, -222, -160, -154, 139, 3, -123, -354, -226, -394, 124, 150, -193, -383, -191, -378, 326, 311, 30, -309, -308, 251, -44, 143, -110, -224, -235, 153, 135, 240, 190, -520, -363, -70, 102, 155, 93, 13, -265, 18, 10, 426, 205, 63, 55, 56, -70, 273, 186, -302, -396, -225, 39, 82, 8, -77, -436, -259, 88, 185, -181, 159, 88, -280, 65, 64, -152, -121, -359, -190, 114, 176, 4, -228, -484, 41, -54, 124, 303, -63, -316, -95, 233, 475, 27, 239, -131, -240, 183, 97, -50, -78, -182, -175, 13, -150, 152]
4598A52k25j38J11J18K49j05p4k24l91M22K55j05M3j20j01L41j63m6R7l19k07
4619d30O07j98Q1R2l89j83K56K82K1n8k42K4R8J70K64k45l45k97L79J61M82n48
4641a8j62j1J89K72L5k13k91M6jL38K49l47%j26l37L48K21j67q6k29n6K97J54
4664A05Q9k79k55Q2K07R5J03j44l93J45O28j29LR8l45j87K35L70k42k29k53j7
4686c13N71j26j65P5p7l55K09M23j25j63j07j11J0N94j27k19l7n1Q6K41P0k07
4708I6l21j8J77J03P9J5l20J04R2K32%l63k34RK62L38mk26j37p9L35j8J00j13
4732A09k94m30K78O54m4k96l8j78K62J49kj13j41o8j6L89J46k90j31k06J56K8
4754g6J76J06j61l46K03J94j2j2p5m59K81K45Q6j51q9r4J28K73R2p2k89j63k9
$$ y = [152, -73, -211, -100, 18, 267, 162, 88, -136, -527, -105, 150, 45, 88, -32, -133, 208, 45, -1, 96, -223, -430, 177, -21, 60, 152, -237, -420, -164, 118, 139, 81, -161, -137, -39, 131, 395, 150, -195, -492, -113, 48, 530, -18, -180, -191, -2, 270, 305, 92, -199, -153, -154, 184, 433, 86, 86, -40, -377, -29, 192, 25, -61, -290, -346, -49, 105, 194, -85, -340, -258, -51, 44, 147, 3, -390, -245, 383, 254, 257, 355, 10, -177, 58, 428, 186, -43, -296, -313, 258, 132, -33, 42, -35, -390, -181, 242, 117, -46, -153, -264, -254, 340, 213, -6, -43, -94, -8, 233, 303, 96, -225, -243, -66, 37, 116, 131, -189, -85, 7, 239, 239, -124, -358, -349, -87, 251, 247, 21, -116, -195, 140, 122, 222, 109, -185, -615, -337, 317, 273, -23, -61, -239, 23, 172, 170, 57, -84, -152, -168, 221, 367, 77, -54, -260, -104, -76, 100, 206, 45, -301, -98, 96, 84, 72, -3, -462, -181, 64, 150, -1, -90, -184, -56, 217, 309, 237, -52, -215, -244]
4777b44L50J80q3k36k7l1O9J75J1m84K35k84M64J14L5l84N5j00K68q7K45k20k70
4800b49j17j39O55nk43L2j54K19K32k32Q2m20J78K84P2m9l7l59J03J55J89j6L8
4823B19m10N9J7K14K14k79K1j75l6L05l7N2k40j33j21K11K89j87j18J09k29M04
4845A49j27J3m0k76Q9M80Q1n27K3j29J81J41K90k64k42J33j61J14K05J4j92k32
4867b77Q3L58L5k91J2P6n41N10R3N8j01k48J83N2J77r9J06m73M6K27J87J02m80
4890b05k08L79J27K39k13M3j54l89K21M09J76l33j19l38J12N45j07l8k50J9q0
4911a64K18K1k1r0j62L9K66L7o6l93J64j30M20K04k35p0j17j12LL75j42k13l2
4934b00K37l2J77j33j53j68J30J82M19m11l26K5J51n0K73k58j3L6J10r2M58j22
$$ y = [-244, 106, 286, 203, -33, -60, -91, -22, 153, 164, -320, -85, -369, 95, 209, 244, -140, -85, -185, 83, -4, 241, 21, -249, -366, -505, 150, 145, -98, -66, -220, -1, 231, -1, 81, -339, -161, 123, 195, 146, 109, -250, -147, 8, 197, 181, 219, -191, -132, -115, 99, 313, 34, 55, -120, -156, 149, 112, 164, -76, -209, -330, -119, 170, -17, -135, -26, -255, 149, 22, 35, -5, -281, -192, 288, 369, -158, -135, -264, -83, 58, 348, 84, -158, -25, -186, -72, 133, 147, -45, -277, -194, 164, 199, -92, -80, -4, -545, -35, 58, 116, 15, -233, -50, 2, 179, 80, 186, -287, -241, -14, 173, 275, -205, -413, -34, 93, 332, 119, 162, 8, -381, -160, 249, 425, 92, -27, -365, -253, 292, 185, 147, -103, -84, -164, 54, 75, 54, -36, -198, -159, 107, 144, 78, -315, -151, -281, 139, 343, 108, 38, -79, -191, -188, 187, 45, -168, -200, 37, 5, 182, 49, -104, -272, -142, 40, 459, 48, -278, -253, -102, -152, 121, -137, -150, -114, -4, -96, 362, 240]
4956B40l10k7j86J64K6L74l42k64M0L23J08P2j78k37j59L38N7j02J23j1j59k3
4978a33K88Q0l28k11K59j21J92J56p1j69p0RJ68J2n4j95j3O3M47j47r5k31o2J31
5002i5K83K40m47j36j42K28K51k8N7k72j35J7J95M3j68N5J47k9J29M6k89j8N4
5025a4j02J83N0J25l70qJ58k0M9K56k84k08n6K61J76p6j75m6j37K00K77L5l24
5048e0k27J45L42r3n5j00n1l37P58k92L16l20n30N29k5J82j49J78j07j84J4M08
5070C52k17J86k90l78J10L15J0q8l4j24K52Q8M3j70j56K8L05O4k09q4k44J49M9
5093d3K38NL5k65k65K77J73n1Kj56O9OJ53J4N0l08j25J7K24J18r0j74K5j50JK70
5119E0p5j92J32R8N4J38j05J94o77K38L74q9p5k6l9K94l11J12j26J13m42K93K4
$$ y = [240, -70, -97, -283, -119, -93, 281, -61, -325, -285, 38, 146, 218, 40, -197, -356, -18, 39, -63, 60, 49, -110, -133, 155, 235, -93, -304, -45, -166, 26, 182, 111, -58, -128, -119, 49, 61, 7, -188, -201, -138, 309, 162, 67, -164, -226, -95, 188, 428, -19, -155, -297, -69, 182, 154, 211, -61, -196, -179, 16, 59, -109, -54, 93, 64, 193, 239, -50, -68, -14, -116, 67, 117, 242, -128, -136, 22, 2, 51, 307, 23, -185, -241, 20, 196, 120, -55, -101, -238, -38, 239, 274, -50, -277, -132, 210, 117, 62, -38, -89, -426, 332, 40, 356, 36, -494, 35, 10, 192, 43, 221, 114, -70, -56, 352, 135, 321, 31, -347, -237, 78, 88, 0, -34, -158, 94, 182, 225, 55, -101, -73, 232, 296, 87, 3, -241, -92, -43, 195, 200, 235, -30, -295, -18, 155, 104, 106, -50, 19, 25, 178, 192, 242, -66, -191, -174, 50, 168, 78, -96, -71, -221, -220, 50, -25, -217, -85, 13, 67, 205, 100, 294, -383, -145, 229, 140, 65, 39, 0, 294, -17, 95, -31, 82, -360, -67, -43]
5142d3P3P6j08q2J38Nn3n3m3J51l25L21n2K57j81k39o7K87J06j58l2j14O6j03
$$ y = [-43, 30, 106, -2, -84, 54, 59, 6, -47, -90, 61, -264, 57, 5, 262, 81, -158, -225, 62, 168, 10, -22, -136, -70, -173]
$$ [...]
8191I1
##END NTUPLES=NMR FID
##END=
