##TITLE=1H_DE-139m2_TFA
 200.13Hz, CCl4.
 8 sc
 
 15.4.2026
##JCAMPDX= 6.0         $$ Bruker NMR JCAMP-DX V2.0
##DATA TYPE= NMR FID
##DATA CLASS= NTUPLES
##ORIGIN= UXNMR, Bruker Analytische Messtechnik GmbH
##OWNER= pz
$$ XWIN-NMR		Version 3.5
$$ Wed Apr 15 16:02:26 2026 Russian Standard Time (UT+4h)  she@DPX200
##.OBSERVE FREQUENCY= 200.1313
##.OBSERVE NUCLEUS= ^1H
##.DELAY= (6, 6)
##.ACQUISITION MODE= SIMULTANEOUS
##.ACQUISITION SCHEME= undefined
##.AVERAGES= 8
##.DIGITISER RES= 18
##SPECTROMETER/DATA SYSTEM= spect
##.PULSE SEQUENCE= zg30
##.SOLVENT NAME= DMSO
##.SHIFT REFERENCE= (INTERNAL, DMSO, 0, 14.3821)
##AUDIT TRAIL= $$ (NUMBER, WHEN, WHO, WHERE, WHAT)
$$ ##TITLE= Audit trail, XWIN-NMR		Version 3.5
$$ ##JCAMPDX= 5.01
$$ ##ORIGIN= Bruker BioSpin GmbH
$$ ##OWNER= she
$$ F:/spectra/data/she/nmr/H-C/1/audita.txt
$$ ##AUDIT TRAIL=  $$ (NUMBER, WHEN, WHO, WHERE, WHAT)
(   1,<2026-04-15 16:00:47.89 +0400>,<she>,<DPX200>,
      <created by zg, POWCHK disabled, PULCHK disabled
       configuration hash MD5:
       00 E9 B6 7A A2 85 ED C7 34 08 36 98 17 FE 4E 26
       data hash MD5: 16K
       B8 CE 28 F2 57 B7 B5 66 66 AF E0 73 4E 3B 35 58>)
$$ ##END=
$$ 
$$ hash MD5
$$ C4 7B 7F BA DB 89 F2 3F C5 56 8F FE 45 29 E1 AB
##$RELAX= 
##$RELAX= 
##$RELAX= 
##$RELAX= 
##$RELAX= 
##$RELAX= 
$$ Bruker specific parameters
$$ --------------------------
##$DU= <F:/spectra>
##$EXPNO= 1
##$NAME= <H-C>
##$PROCNO= 1
##$TYPE= <nmr>
##$USER= <she>
##$AMP= (0..31)
100 100 100 100 100 100 100 100 100 100 100 100 100 100 100 100 100 100 
100 100 100 100 100 100 100 100 100 100 100 100 100 100 
##$AQSEQ= 0
##$AQ_mod= 1
##$AUNM= <au_zg>
##$AUTOPOS= <>
##$BF1= 200.13
##$BF2= 200.13
##$BF3= 200.13
##$BF4= 200.13
##$BF5= 200.13
##$BF6= 200.13
##$BF7= 200.13
##$BF8= 200.13
##$BYTORDA= 1
##$CFDGTYP= 0
##$CFRGTYP= 5
##$CHEMSTR= <none>
##$CNST= (0..31)
1 1 145 1 1 1 1 1 1 1 1 1 1 1 1 1 1 1 1 1 1 1 1 1 1 1 1 1 1 1 1 1 
##$CPDPRG= <>
##$CPDPRG1= <>
##$CPDPRG2= <>
##$CPDPRG3= <>
##$CPDPRG4= <mlev>
##$CPDPRG5= <mlev>
##$CPDPRG6= <mlev>
##$CPDPRG7= <mlev>
##$CPDPRG8= <mlev>
##$CPDPRGB= <>
##$CPDPRGT= <>
##$D= (0..31)
0 0.7 0 0 0 0 0 0 0 0 0 0.03 0 0 0 0 0 0 0 0 0 0 0 0 0 0 0 0 0 0 0 0 
##$DATE= 1776254447
##$DBL= (0..7)
120 120 120 120 120 120 120 120 
##$DBP= (0..7)
150 150 150 150 150 150 150 150 
##$DBP07= 0
##$DBPNAM0= <>
##$DBPNAM1= <>
##$DBPNAM2= <>
##$DBPNAM3= <>
##$DBPNAM4= <>
##$DBPNAM5= <>
##$DBPNAM6= <>
##$DBPNAM7= <>
##$DBPOAL= (0..7)
0.5 0.5 0.5 0.5 0.5 0.5 0.5 0.5 
##$DBPOFFS= (0..7)
0 0 0 0 0 0 0 0 
##$DE= 6
##$DECBNUC= <off>
##$DECIM= 32
##$DECNUC= <off>
##$DECSTAT= 4
##$DIGMOD= 1
##$DIGTYP= 9
##$DL= (0..7)
0 120 120 120 120 120 120 120 
##$DP= (0..7)
150 150 150 150 150 150 150 150 
##$DP07= 0
##$DPNAME0= <>
##$DPNAME1= <>
##$DPNAME2= <>
##$DPNAME3= <>
##$DPNAME4= <>
##$DPNAME5= <>
##$DPNAME6= <>
##$DPNAME7= <>
##$DPOAL= (0..7)
0.5 0.5 0.5 0.5 0.5 0.5 0.5 0.5 
##$DPOFFS= (0..7)
0 0 0 0 0 0 0 0 
##$DQDMODE= 0
##$DR= 18
##$DS= 0
##$DSLIST= <SSSSSSSSSSSSSSS>
$$ [...]
##$SUBNAM0= <"">
##$SUBNAM1= <"">
##$SUBNAM2= <"">
##$SUBNAM3= <"">
##$SUBNAM4= <"">
##$SUBNAM5= <"">
##$SUBNAM6= <"">
##$SUBNAM7= <"">
##$SUBNAM8= <"">
##$SUBNAM9= <"">
##$SW= 18.0517328524113
##$SWIBOX= (0..15)
0 0 2 0 0 0 0 0 0 0 0 0 0 0 0 0 
##$SW_h= 3612.71676300578
##$TD= 16384
##$TD0= 1
##$TE= 0
##$TE2= 300
##$TE3= 300
##$TEG= 300
##$TL= (0..7)
0 120 120 120 120 120 120 120 
##$TP= (0..7)
150 150 150 150 150 150 150 150 
##$TP07= 0
##$TPNAME0= <>
##$TPNAME1= <>
##$TPNAME2= <>
##$TPNAME3= <>
##$TPNAME4= <>
##$TPNAME5= <>
##$TPNAME6= <>
##$TPNAME7= <>
##$TPOAL= (0..7)
0.5 0.5 0.5 0.5 0.5 0.5 0.5 0.5 
##$TPOFFS= (0..7)
0 0 0 0 0 0 0 0 
##$TUNHIN= 0
##$TUNHOUT= 0
##$TUNXOUT= 0
##$USERA1= <user>
##$USERA2= <user>
##$USERA3= <user>
##$USERA4= <user>
##$USERA5= <user>
##$V9= 5
##$VALIST= <valist>
##$VCLIST= <CCCCCCCCCCCCCCC>
##$VD= 0
##$VDLIST= <DDDDDDDDDDDDDDD>
##$VPLIST= <PPPPPPPPPPPPPPP>
##$VTLIST= <TTTTTTTTTTTTTTT>
##$WBST= 1024
##$WBSW= 4
##$XGAIN= (0..3)
0 0 0 0 
##$XL= 0
##$YL= 0
##$YMAX_a= 219912
##$YMIN_a= -163403
##$ZGOPTNS= <>
##$ZL1= 120
##$ZL2= 120
##$ZL3= 120
##$ZL4= 120
##$ABSF1= 10
##$ABSF2= 0
##$ABSG= 5
##$ABSL= 3
##$ALPHA= 0
##$AQORDER= 0
##$ASSFAC= 0
##$ASSFACI= 0
##$ASSFACX= 0
##$ASSWID= 0
##$AUNMP= <proc_1d>
##$AZFE= 0.1
##$AZFW= 0.1
##$BCFW= 1
##$BC_mod= 2
##$BYTORDP= 1
##$COROFFS= 0
##$CY= -3
##$DATMOD= 1
##$DC= 2
##$DFILT= <>
##$DTYPP= 0
##$F1P= 0
##$F2P= 0
##$FCOR= 0.5
##$FTSIZE= 0
##$FT_mod= 4
##$GAMMA= 1
##$GB= 0.15
##$INTBC= 1
##$INTSCL= 1
##$ISEN= 128
##$LB= 0.25
##$LEV0= 0
##$LPBIN= 0
##$MAXI= 10000
##$MC2= 0
##$MEAN= 0
##$ME_mod= 0
##$MI= 1.114404
##$NCOEF= 0
##$NC_proc= 0
##$NLEV= 6
##$NOISF1= 3.799351
##$NOISF2= 2.8
##$NSP= 1
##$NTH_PI= 0
##$NZP= 0
##$OFFSET= 14.38212
##$PC= 1
##$PHC0= -3707.024
##$PHC1= 11.19231
##$PH_mod= 1
##$PKNL= yes
##$PPARMOD= 0
##$PSCAL= 0
##$PSIGN= 0
##$REVERSE= no
##$SF= 200.129724274929
##$SI= 16384
##$SIGF1= 3
##$SIGF2= 2
##$SINO= 400
##$SIOLD= 16384
##$SREGLST= <1H.CDCl3>
##$SSB= 0
##$STSI= 0
##$STSR= 0
##$SW_p= 3205.1282051282
##$SYMM= 0
##$S_DEV= 0
##$TDeff= 0
##$TDoff= 0
##$TI= <>
##$TILT= no
##$TM1= 0
##$TM2= 0
##$TOPLEV= 0
##$USERP1= <user>
##$USERP2= <user>
##$USERP3= <user>
##$USERP4= <user>
##$USERP5= <user>
##$WDW= 1
##$XDIM= 8192
##$YMAX_p= 0
##$YMIN_p= 0
$$ End of Bruker specific parameters
$$ ---------------------------------
##NTUPLES= NMR FID
##VAR_NAME=  TIME,          FID/REAL,        FID/IMAG
##SYMBOL=    X,             R,               I
##VAR_TYPE=  INDEPENDENT,   DEPENDENT,       DEPENDENT
##VAR_FORM=  AFFN,          ASDF,            ASDF
##VAR_DIM=   8192,          8192,            8192
##UNITS=     SECONDS,       ARBITRARY UNITS, ARBITRARY UNITS
##FACTOR=    0.0002768,     1,               1
##FIRST=     0,             0,               0
##LAST=      2.2672688,     0,               0
##MIN=       0,             -163403,         0
##MAX=       2.2672688,     219912,          0
$$ Real data points
##PAGE= N=1
##DATA TABLE= (X++(R..R)), XYDATA
$$ plain form
0 0 0 0 0 0 0 0 0 0 0 0 0 0 0 0 0 0 0 -3 8 -8 8 -8 8 -8 12 -16 16 -16 23 -24 28 -32 36 -40 44 -52 59 -64 70 -80
40 -80 88 -98 108 -119 133 -145 162 -177 195 -216 236 -260 287 -317 351 -389 434 -485 545 -617
60 -617 702 -811 950 -1138 1401 -1797 2454 -3736 7087 -32989 -37705 114761 20491 -136014
74 -136014 38163 219912 72698 -59043 12191 67432 69997 74182 -39571 -123305 16144
85 16144 79659 -100257 -163403 -22029 45502 -6043 -49521 -55559 -14588 45549 36139 -33473
97 -33473 -32929 49594 79222 25326 -18968 -844 58370 73066 14113 -26233 -12992 6263 5443
110 5443 -37433 -80975 -36010 26680 -8742 -69224 -37059 24047 20384 -3286 -4313 -7613 15377
123 15377 48024 9016 -31392 15737 48985 12977 -5496 9228 6782 504 5750 -18277 -40976
$$ packed form
0@%%%%%%%%%%%%%%%%%lJ1j6J6j6J6j6K0k8L2l2L9m7N2o0O8p6Q4r6J11j23J34j50
40h0J68j86K06k27K52k78L07l39L72m11M52m96N47o04O68p40Q23r19J030j162
60f17J319j513J761k088K539l198M251o190J0823m0076m716J52466r4270j56505
74a36014J74177J81749j47214j31741P1234N5241K565M185j13753q3734J39449
85A6144O3515j79916o3146J41374O7531n1545m3478o038M0971O0137r410o9612
97c3473N44Q2523K9628n3896m4294J8124N9214J4696n8953m0346J3241J9255q20
110E443m2876m3542M4965O2690l5422o0482L2165O1106l663k3670j027l300K2990
123A5377L2647l9008m0408M7129L3248l6008j8473J4724k446o278N246k4027k2699
$$ plain form
136 -40976 -7823 14346 -22748 -35138 -7527 1008 2006 7666 -3539 -6243 17914 21434 -5149
149 -5149 -10653 13038 18097 3568 -975 -1878 1349 10921 1797 -15704 -10168 3136 3 -10521
163 -10521 -15491 -6809 3404 3232 -2499 -3470 4610 8233 2933 -1678 -1365 3317 8919 1794 -7724
178 -7724 -743 5365 892 -1767 -545 -2803 714 2692 -3668 -7370 1003 5833 -3241 -3969 3996
193 3996 2710 851 3369 -1224 -4488 3154 3082 -3940 -3489 1557 170 -2119 575 999 -1641 1673
209 1673 3138 -2049 -1138 3649 1952 -231 -232 569 659 1052 790 -1121 -2049 105 54 -2163 -1888 -61
227 -61 161 -1027 -1189 255 1762 1165 844 830 117 1226 1776 146 -791 565 562 -878 -1113 -117 -195 -1159
247 -1159 -509 -774 -1405 -159 815 -602 -597 1160 1167 346 748 1451 1172 469 712 267 -812 -88 65 -1594
$$ packed form
136d0976L3153K2169l7094j2390K7611Q535R98N660j1205k704K4157L520k6583
149e149n504K3691N059j4529m543r03L227R572r124j7501N536J3304l133j0524
163a0521m970Q682J0213j72n731r71Q080L623n300m611L13M682N602p125r518
178g724O981O108m473k659J222k258L517J978o360l702Q373M830r074p28P965
193C996j286j859K518m593l264P642p2p022M51N046j387k289K694M24k640L314
209A673J465n187R11M787j697k183jQ01R0L93k62j911r28K154n1k217K75J827
227f1K22j188j62J444J507n97l21j4p13J109N50j630r37J356lj440k35R96p8r64
247a159O50k65o31J246R74j417NJ757Pq21M02P03k79p03K43m45j079P24J53j659
$$ plain form
267 -1594 -1678 -826 -571 -728 -457 291 338 231 765 633 677 1391 740 -63 364 1017 284 438 -494 -204 -106
288 -106 -1157 -851 -648 -1363 -1050 -1234 -927 9 237 575 621 592 1472 1667 961 1138 1391 -247 -1 115
308 115 -336 -392 -504 -558 -1055 -1311 -676 -1085 -1222 -760 -960 -1115 -205 289 526 838 1229 1474 1415 1432 1926 1241
330 1241 421 408 -275 -687 -496 -673 -1121 -1302 -1190 -884 -587 -714 -635 -1337 -1018 -128 -522 -185 750 1028 667
351 667 1140 1536 1704 1402 788 359 -229 44 -166 -1023 -880 -626 -1127 -946 -1105 -804 -29 -1003 -1089 -431 -194
372 -194 -104 196 345 422 499 893 1674 1088 1194 910 -333 -98 219 -462 -606 -720 -1092 -844 -1094 -402 -666
393 -666 -999 -648 -160 -964 -276 361 0 78 379 999 1025 1220 1485 932 444 780 255 -134 169 -390 -1012
414 -1012 -1067 -941 -475 -746 -1021 -330 -530 -826 1 244 -27 737 801 117 814 1382 1561 722 496 1208 148
$$ packed form
267a594q4Q52K55j57K71P48M7j07N34j32M4P14o51q03M27O53p33J54r32K90R8
288a06j051L06K03p15L13j84L07R36K28L38M6k9Q80J95p06J77K53j638K46J16
308A15m51n6j12n4m97k56O35m09j37M62k00j55R10M94K37L12L91K45n9J7M94o85
330A241q20j3o83m12J91j77m48j81J12L06K97j27P9p02L19Q90l94L37R35K78l61
351F67M73L96J68l02o14m29n88K73k10q57J43K54n01J81j59L01P75r74q6O58K37
372a94R0L00J49P7P7L94P81n86J06k84j243K35L17o81j44j14l72K48k50O92k64
393f66l33L51M88q04O88O37l61P8L01O20K6J95K65n53m88L36n25l89L03n59o22
414a012n5J26M66k71k75O91k00k96Q27K43k71P64O4o84O97N68J79q39k26P12j060
$$ plain form
435 148 -229 283 -532 -945 -501 -821 -1395 -845 -225 -807 -1284 -133 308 -454 89 1035 433 594 1310 1137
455 1137 939 1168 620 16 355 408 -88 -594 -370 -741 -1054 -773 -563 -754 -841 -425 -565 -202 -48 250 536
476 536 326 784 844 992 918 868 718 142 176 106 157 -454 -84 -508 -1050 -760 -465 -835 -708 -184 -331 -409 247
499 247 413 20 571 680 356 409 1228 471 -290 728 147 -119 -130 -14 -229 -773 -497 -464 -670 -363 283
520 283 -546 -374 -90 53 -102 257 209 298 125 287 655 163 497 422 147 -86 101 -178 -197 -170 10 -482
542 -482 -251 196 267 -368 -220 222 -244 -315 603 171 -113 -79 676 -25 44 842 315 -443 338 386 -429 -146
564 -146 317 -336 -440 81 -6 -426 -173 378 -241 -608 193 183 -393 -154 110 -83 -167 324 -46 -181 297
585 297 388 -39 -89 78 -80 -418 -140 187 -204 -103 -43 -105 -247 -78 228 -328 -70 218 53 -217 80 84
$$ packed form
435A48l77N12q15m13M44l20n74N50O20n82m77J151M41p62N43R46o02J61P16j73
455A137j98K29n48o04L39N3m96n06K24l71l13K81K10j91q7M16j40L63J54K98K86
476E36k10M58O0J48p4n0j50n76L4p0N1o11L70m24n42K90K95l70J27N24j47p8O56
499B47J66l93N51J09l24N3Q19p57p61J018n81k66j1J16k15n44K76L3k06L07O46
520B83q29J72K84J43j55L59m8Q9j73J62L68m92L34p5k75k33J87k79j9K7J80m92
542d82K31M47P1o35J48M42m66p1R18m32k84L4P55p01O9P98n27p58P81M8q15K83
564a46M63o53j04N21q7m20K53N51o19l67Q01j0n76K39K64j93q4M91l70j35M78
585B97R1m27n0J67j58l38K78L27l91J01O0o2j42J69L06n56K58K88j65k70K97M
$$ plain form
607 84 245 67 60 57 -45 128 28 -500 -485 -115 -412 -568 -181 148 -231 -199 75 168 38 205 448 -116 164
630 164 309 136 -313 -92 196 -215 64 4 -277 -312 7 -183 -553 -106 85 -412 -35 379 117 -157 -158 53
652 53 668 446 -102 169 135 324 584 -587 91 717 -388 -399 -549 103 45 -845 -724 -549 -913 -363 237
673 237 366 -177 -317 45 -696 443 211 -203 -267 199 -550 262 -311 -145 -271 -127 311 -841 -908 73
693 73 -155 -989 -271 215 -224 50 278 21 302 167 422 -29 729 581 67 -553 79 -406 -108 -500 -274
714 -274 -480 -563 240 -194 -468 -212 -84 -197 -187 240 237 172 250 1018 198 -13 -193 -318 116 -334 681 -112
736 -112 -137 9 -47 -424 95 -607 -708 166 143 96 -448 -349 585 63 61 435 423 756 672 736 -577 622 602
759 602 -466 -139 -225 -413 336 -408 -243 -345 -562 -98 -147 -504 256 -30 22 -169 -339 390 137 -369 149
$$ packed form
607H4J61j78plj02J73j00n28J5L70k97j56L87L29l79L2K74R3j30J67K43n64K80
630A64J45j73m49K21K88m11K79o0k81l5L19j90l70M47J91m97L77M14k62k74jK11
652E3O15k22n48K71l4J89K60j171O78O26j105j1j50O52n8q90J21J75l64N50O00
673B37J29n43j40L62p41J139k32m14o4M66p49Q12n73J66j26J44M38j152o7R81
693G3k28q34P18M86m39K74K28k57K81j35K55m51P58j48n14o20O32m85K98l92K26
714b74k06q3Q03m34k74K56J28j13J0M27lo5P8P68q20k11j80j25M34m50J015p93
736a12k5J46n6l77N19p02j01Q74k3m7n44R9R34n22kL74j2L33q4O4j313J199k0
759F02j068L27q6j88P49p44J65j02k17M64m9l57P60k86N2j91j70P29k53n06N18
$$ plain form
780 149 -79 294 699 122 363 272 185 -291 303 -414 -447 -283 -317 -343 -672 -87 35 -86 -720 130 -262 258
802 258 108 577 -97 -256 -381 -589 -1053 398 441 -160 36 -80 -695 -184 289 164 204 -431 530 -502
822 -502 -148 576 32 126 129 521 118 166 379 278 -262 -286 165 -439 -320 -283 28 -212 198 -20 -682 412
844 412 -497 77 184 -54 -428 384 197 647 -369 119 116 -247 447 421 370 -426 -467 -233 -220 49 -328 -502
866 -502 -314 -204 -637 218 -372 125 573 295 263 -94 177 96 77 -126 469 51 213 -221 302 108 -55
887 -55 -150 -61 -286 115 31 -544 -140 465 -595 -36 92 187 -7 158 120 39 670 -276 11 -40 -908 -126 -16
910 -16 -68 13 439 -218 -156 25 47 594 -537 400 -1126 411 32 214 14 359 82 600 330 375 33
931 33 -26 693 -383 -7 -279 -28 -47 -434 196 -289 -1091 -243 -49 -287 -160 295 -37 -153 208 -281 279
$$ packed form
780A49k28L73M05n77K41r1q7m76N94p17l3J64l4k6l29N85J22j21o34Q50l92N20
802B58j50M69o74j59j25k08m64J451M3o01J96j16o15N11M73j25M0o35R61j032
822e02L54P24n44R4LL92m03M8K13j01n40k4M51o04J19L7L11k40M10k18o62J094
844D12r09N74J07k38l74Q12j87M50j016M88ll63O94k6n1p96m1K34J3K69l77j74
866e02J88J10m33Q55n90M97M48k78l2l57K71q1j9k03N95m18J62m34N23j94j63
887e5r5Q9k25M01q4n75M04O05j060N59J28R5j94J65l8q1O31r46K87n1q68P82J10
910a6n2Q1M26o57O2J81K2N47j131R37j526J537l79J82k00L45k77N18k70M5l42
931C3n9P19j076L76k72K51j9l87O30m85q02Q48J94k38J27M55l32j16L61m89N60
$$ plain form
952 279 -267 -558 71 327 163 385 -56 -90 542 -249 -101 18 79 -127 4 -560 -35 -270 -24 149 -736
973 -736 -205 -148 133 131 143 678 400 -198 -36 403 -976 141 -105 600 -314 -23 209 398 157 385 177
994 177 259 -17 168 -95 156 764 -111 663 -205 554 -513 516 255 -638 -133 333 -417 162 -485 111
1014 111 190 -559 -262 -849 -366 -637 -70 502 -479 25 761 -533 101 -226 613 725 -510 -318 598 458
1034 458 149 -258 -410 574 -307 -31 -349 -378 59 -476 83 -1007 -43 537 -276 -154 -121 248 63 765
1054 765 900 186 -168 311 109 -137 361 105 -420 -256 -245 -67 -263 -354 91 -543 -259 38 -256 -19 14
1075 14 17 -140 267 283 230 334 149 248 -76 284 118 -118 -79 -90 -93 229 -287 370 -28 -198 38 19 -89 -10
1099 -10 121 236 61 219 112 5 147 167 -31 -12 167 -6 -162 -93 -189 -153 75 -24 -144 -14 168 -88
$$ packed form
952B79n46k91O29K56j64K22m41l4O32p91J48J19O1k06J31n64N25k35K46J73q85
973g36N31N7K81kJ2N35k78n98J62M39j379J117k46P05r14K91K32J89k41K28k08
994A77Q2k76J85k63K51O08q75P74q68P59j067J029k61q93N05M66p50N79o47N96
1014A11P9p49K97n87M83k71N67N72r81N04P36j294O34l27Q39J12j235J92R16j40
1034D58l09m07j52R84q81K76l18k9M37n35N59j090R64N80q13J22L3L69j85P02
1054G65J35p14l54M79k02k46M98k56n25J64J1J78j96r1M45o34K84K97k94K37L3
1075A4Lj57M07J6n3J04j85R9l24L60j66k36L9j1lL22n16O57l98j70K36j9j08P9
1099a0J31J15j75J58j07j07J42K0j98J9J79j73j56O9r6L6K28r9j20J30J82k56
$$ plain form
1121 -88 -1 234 129 -333 -204 83 12 -198 102 -21 59 49 96 235 -259 144 39 -16 67 156 241 68 28 -129
1145 -129 -193 -30 -48 -165 292 -220 283 34 -32 82 -105 -44 -97 41 189 1 10 48 152 -108 -54 -118 87
1168 87 -211 50 137 1 -163 -18 271 132 -235 156 40 8 136 38 -36 -217 255 159 133 113 223 154 23
1191 23 14 103 -35 192 52 -111 -131 -175 110 -132 -3 -71 169 -103 66 65 -20 307 172 19 165 357 156
1214 156 -31 -65 243 -91 -177 -279 -218 -291 31 -71 99 -165 255 -71 -170 -325 -32 95 -200 245 -129 165
1236 165 162 34 91 -26 -65 -196 77 54 -85 -315 -134 -42 -119 266 128 -42 -230 -178 49 -75 -128 -209 -178 -45
1260 -45 50 128 259 -15 245 183 214 210 -47 -22 122 33 142 19 5 65 259 133 83 155 -160 58 -212 -11
1284 -11 94 101 -293 173 196 -5 -285 137 348 -5 -174 -25 -7 -46 -82 26 -45 82 -27 76 -17 -41 -281
$$ packed form
1121h8Q7K35j05m62J29K87p1k10L00j23Q0j0M7J39m94M03j05n5Q3Q9Q5j73m0j57
1145a29o4J63j8j17M57n12N03k49o6J14j87O1n3J38J48j88RL8J04k60N4o4K05
1168H7k98K61Q7j36j64J45K89j39l67L91j16l2J28r8p4j81M72r6k6k0J10o9j31
1191B3rQ9j38K27j40j63k0m4K85k42J29o8K40k72J69jq5L27j35j53J46J92k01
1214A56j87l4L08l34q6j02O1p3L22j02J70k64M20l26r9j55K93J27k95M45l74K94
1236A65lj28N7j17l9j31K73k3j39k30J81R2p7L85j38j70j88N2K27j24n3q1L1J33
1260d5R5P8J31k74K60o2L1mk57K5J44q9J09j23j4O0J94j26n0P2l15K18k70K01
1284a1J05Pl94M66K3k01k80M22K11l53j69J49J8l9l6J08p1J27j09J03r3k4k40
$$ plain form
1307 -281 75 3 -224 -148 178 116 -130 281 72 -159 269 87 240 73 305 22 39 280 306 -178 -150 -140
1329 -140 157 112 35 79 -120 -111 79 -114 187 161 -121 38 -67 -62 51 7 -119 -67 -73 -212 232 -13 -135 -38
1353 -38 -90 -143 104 -109 75 37 -192 115 -122 -116 -180 -67 56 -87 -288 -72 118 260 53 -129 -215 14 -12
1376 -12 38 294 93 153 238 112 129 -21 49 26 187 -180 164 -308 -153 -3 -67 -93 95 -11 5 114 325
1399 325 -62 -309 -194 -123 -192 -41 115 -75 51 16 -172 -55 190 362 64 156 -169 -214 -80 -5 -1 146 -109
1422 -109 52 207 278 123 254 276 21 177 223 -103 -7 -58 -119 10 -234 -189 -120 102 69 -168 -5 119 -11
1445 -11 7 -234 -26 -60 39 275 57 -159 -43 160 -77 91 -79 -128 102 28 1 -170 -138 -343 102 10 -24
1468 -24 3 -76 57 33 -102 -4 39 117 201 -54 119 -45 168 52 33 138 -49 -219 14 -181 199 -175 94
$$ packed form
1307b81L56p2k27P6L26o2k46M11k09k31M28j82J53j67K32k83J7K41K6m84K8J0
1329a40K97m5p7M4j99RJ90j93L01k6k82J59j05NJ13m4j26N2oj39M44k45j22R7
1353c8n2n3K47k13J84l8k29L07k37Oo4J13J23j43k01K16J90J42k07j82q6K29k6
1376a2N0K56k01O0Q5j26J7j50P0k3J61l67L44m72J55J50o4k6J88j06J6J09K11
1399C25l87k47J15P1o9J51J56j90J26l5j88J17K45J72k98R2l25m5J34P5MJ47k55
1422a09J61J55P1j55J31K2k55J56M6l26R6n1o1J29k44M5O9K22l3k37J63J24j30
1445a1J8k41K08l4R9K36k18k16J16K03k37J68j70m9K30p4k7j71L2k05M45r2l4
1468b4K7p9J33k4j35R8M3P8Q4k55J73j64K13j16j9J05j87j70K33j95L80l74K69
$$ plain form
1491 94 -96 -83 46 2 28 -30 -90 131 -118 -130 21 47 117 -45 128 144 16 123 94 123 -29 22 -26 -45 -224
1516 -224 -86 142 229 -44 -56 100 147 -200 -67 -209 -109 30 -96 1 7 -82 239 -86 106 37 176 -16 -30
1539 -30 -268 68 102 -98 -424 -72 -53 -64 98 -342 -48 166 52 -62 113 -57 -95 227 172 46 145 -152
1561 -152 37 -71 -213 -246 60 -1 -96 -224 168 -63 -358 -143 -46 -122 66 -239 177 44 23 -317 -82 29
1583 29 -132 17 240 31 -134 9 460 -137 -69 155 -230 -205 -285 -76 49 96 -77 63 57 32 72 51 174
1606 174 -74 75 -20 -74 -158 32 128 -263 -136 -23 -108 60 -88 -16 -143 -125 47 44 38 -79 -95 102 -59 -81
1630 -81 -85 427 -87 189 -248 155 158 -117 114 82 44 -320 -234 -200 -143 43 -145 -395 -66 -156 -57 -185 -32 -252
1654 -252 24 -150 95 16 -141 111 -139 61 18 193 132 -177 77 150 -98 -55 -139 44 9 -74 -71 -64 -309 166
$$ packed form
1491I4j90J3J29m4K6n8o0K21k49j2J51K6P0j62J73J6j28J07k9K9j52N1m8j9j79
1516b24J38K28Q7k73j2J56M7l47J33j42J00J39j26R7Oq9L21l25J92o9J39j92j4
1539c0k38L36L4k00l26L52J9j1J62m40K94K14j14j14J75j70l8L22n5j26R9k97
1561a52J89j08j42l3L06o1r5j28L92k31k95K15R7p6J88l05M16j33k1l40K35J11
1583B9j61J49K23k09j65J43M51n97O8K24l85K5q0K09J25M7j73J40ok5M0k1J23
1606A74k48J49r5n4q4J90R6l91J27J13q5J68j48P2j27J8J72loj17j6J97j61k2
1630h1mN12n14K76m37M03Lk75K31l2l8l64Q6L4N7J86j88k50L29r0R9j28J53k20
1654b52K76j74K45p9j57K52k50K00m3J75o1l09K54P3k48M3q4J83l5q3LPk45M75
$$ plain form
1678 166 -163 -137 7 31 142 -123 -223 -244 14 -69 241 67 173 -9 -97 -112 155 130 -249 -11 105 -287
1700 -287 102 -27 -137 -75 -178 59 -211 186 105 -135 27 6 307 -183 -39 131 34 95 38 -180 229 -95
1722 -95 -190 -59 -3 -31 -324 44 148 146 94 -111 -357 373 26 -54 159 71 -282 170 -157 -137 -4 -42 16 -80
1746 -80 34 92 258 -212 -107 -128 -77 213 181 128 51 -40 13 326 -17 75 11 -109 148 144 77 -161 54 147 12
1771 12 -134 -68 203 -16 -250 -26 -90 -111 111 32 296 -179 -60 -48 -139 40 -136 35 -137 97 197 226 -203
1794 -203 -4 100 273 -59 69 -131 25 -149 -200 -168 58 187 229 16 -155 33 100 -38 143 119 -156 -168
1816 -168 -547 187 -32 -140 96 118 -64 -119 40 143 11 -90 -51 -52 58 70 67 210 18 -288 13 113 86
1839 86 -28 275 -47 -38 273 106 -21 -197 43 226 -119 88 -131 -209 -98 138 152 89 -153 -185 -135 -181 87
$$ packed form
1678A66l29K6J44K4J11k65j00k1K58q3L10j74J06j82q8j5K67k5l79K38J16l92
1700b87L89j29j10O2j03K37k70L97q1k40J62k1L01m90J44J70r7O1n7k18M09l24
1722i5r5J31N6k8k93L68J04kn2k05k46P30l47q0K13q8l53M52l27K0J33l8N8r6
1746h0J14N8J66m70J05k1N1K90l2n3p7r1N3L13l43R2o4j20K57mo7k38K15R3j35
1771A2j46O6K71k19k34K24o4k1K22p9K64m75J19J2r1J79j76J71j72K34J00K9m29
1794b03J99J04J73l32J28k00J56j74n1L2K26J29M2k13j71J88O7j38J81k4k75j2
1816a68l79P34k19j08K36K2j82n5J59J03j32j01L9jJ10J2lJ43j92l06L01J00k7
1839H6j14L03l22RL11j67j27j76K40J83l45K07k19p8J11K36J4o3k42l2N0m6K68
$$ plain form
1862 87 113 -5 -28 -80 -305 -125 -124 41 76 -5 220 231 108 -1 66 43 125 -266 209 -193 114 2 -230 75
1886 75 141 -34 -72 -42 -25 -60 -37 264 -63 21 116 197 175 -261 31 4 326 -89 -95 54 -124 249 -140 164 -90
1911 -90 -101 -258 -80 124 140 -8 -43 -264 -147 -74 -15 170 136 57 -126 130 -42 103 0 317 138 -158 -38
1934 -38 132 -44 -19 95 41 56 53 -163 92 116 198 115 73 -83 -146 -210 231 -45 202 45 -133 -155 -77 -69 -81 272
1960 272 -43 -175 -169 4 -121 100 -17 99 -161 201 -167 69 -256 -14 168 2 167 313 256 248 -99 -29
1982 -29 -44 165 190 -71 151 -24 -95 336 -44 0 -383 -199 121 -57 36 -122 -235 -106 2 197 13 175
2004 175 210 -23 59 121 19 199 247 254 170 112 -133 15 -150 267 -39 -16 240 -140 -132 21 0 -170 49 -112
2028 -112 -86 -86 210 40 155 -120 277 -60 64 -19 86 -59 -83 183 -146 -146 128 68 44 -168 4 109 70
$$ packed form
1862H7K6j18k3n2k25J80JJ65L5q1K25J1j23j09O7k3Q2l91M75m02L07j12k32L05
1886G5O6j75l8L0J7l5K3L01l27Q4R5Q1k2m36K92k7L22m15oJ49j78L73l89L04k54
1911i0j1j57J78K04J6j48l5k21J17P3N9J85l4p9j83K56j72J45j03L17j79k96J20
1934c8J70j76K5J14n4J5lk16K55K4Q2q3m2j56o3o4M41k76K47j57j78k2P8Qj2L53
1960B72l15j32OJ73j25K21j17J16k60L62l68K36l25K42J82j66J65J46n7ql47P0
1982b9j5K09K5k61K22j75p1M31l80M4l83J84L20j78R3j58j13J29J08J95j84J62
2004A75L5k33Q2O2j02J80M8Pq4n8k45J48j65M17l06K3K56l80QJ53k1j70K19j61
2028a12K6%K96j70J15k75L97l37J24q3J05j45k4K66l29%K74o0k4k12J72J05l9
$$ plain form
2051 70 70 -103 1 37 82 123 266 39 -6 -50 -40 -40 -105 -6 -103 -281 35 -79 137 -126 -210 -23 -265 -38 104
2076 104 67 -86 -18 -51 -215 127 -211 -81 40 -44 38 -68 226 19 -8 -85 21 25 -3 -101 120 -216 -26 -20
2100 -20 -65 45 123 153 -121 156 119 16 46 -143 -73 -33 -103 198 -28 75 -132 -24 -16 88 -240 112 -13 13
2124 13 40 -91 -125 -67 -42 -325 -117 307 -291 -233 19 -116 41 34 23 71 -183 77 70 -56 -198 -299 -80 -30
2148 -30 -61 -556 119 155 -226 277 370 -239 331 -496 769 317 -26 346 310 43 -119 303 319 -200 59 90
2170 90 -4 -8 -203 490 501 -288 35 649 338 -14 -203 -293 238 158 170 -368 -12 130 465 -114 367 -190 256
2193 256 395 564 90 942 -243 665 -157 -111 495 577 449 -232 -135 -369 -33 155 -110 -468 -206 -255 493
2214 493 96 -353 -241 285 422 373 129 157 -395 -385 604 199 470 -314 -315 -141 649 124 -238 105 -309 6
$$ packed form
2051G0%j73J04L6M5M1J43k27m5m4J0%o5R9r7j78L16j14K16k63q4J87k42K27J42
2076A04l7j53O8l3j64L42l38J30J21q4Q2j06K94k07k7p7J06Mk8r8K21l36J90O
2100b0m5J10P8L0k74K77l7j03L0j89P0M0p0L01k26J03k07J08QJ04l28L52j25K6
2124A3K7j31l4N8K5k83K08M24n98N8K52j35J57pj1M8k54K60pj26j42j01K19N0
2148c0l1m95O75L6l81N03R3o09N70q27J265m52l43L72l6k67j62M22J6n19K59L1
2170I0r4mj95O93J1p89L23O14l11l52j89r0N31q0J2n38L56J42L35n79M81n57M46
2193B56J39J69m74Q52j185R08q22M6O06Q2j28o81R7k34L36J88k65l58K62m9P48
2214D93l97m49J12N26J37m9k44K8n52J0R89m05K71p84jJ74P90n25l62L43m14L15
$$ plain form
2236 6 161 903 584 -337 832 -175 -329 -35 381 84 57 589 -164 -568 -284 -502 227 -32 -490 507
2256 507 -466 588 -165 192 111 -462 729 308 -400 41 369 -439 -461 256 840 -573 -219 135 26 236
2276 236 462 -513 -226 101 256 -231 -867 317 202 -364 427 580 28 375 113 247 -12 -446 231 615
2296 615 108 239 504 -178 392 316 -433 279 369 4 157 85 103 -132 -140 -41 73 -200 -114 -244 144 -151 -179
2319 -179 -16 35 202 268 152 -83 -77 -216 307 -125 -131 124 63 -27 -80 -115 177 39 48 -53 52 -82 40 55
2343 55 -214 -194 287 -94 439 -155 265 -29 75 135 -27 -280 43 150 139 263 -69 256 -23 128 137 -66
2365 -66 99 44 -264 -131 34 -135 -65 131 204 -155 -122 18 -26 66 -110 204 -10 43 -25 -154 -246 101 -56
2388 -56 -54 -25 -101 -56 -132 185 119 164 -58 240 375 -28 -52 37 -12 132 267 -85 -49 -46 -55 125 -24 -126 104 -128
$$ packed form
2236FJ55P42l19r21J169j007j54K94M16k97k7N32p53m04K84k18P29k59m58R97
2256E07r73J054p53L57q1n73J191m21p08M41L28q08k2P17N84j413L54L54j09K10
2276B36K26r75K87L27J55m87o36J184j15n66P91J53n52L47k62J34k59m34O77L84
2296F15n07J31K65o82N70p6p49P12R0l65J53p2J8k35qR9J14k73Q6j30L88k95k8
2319a79J63N1J67O6j16k35Oj39N23m32oK55o1r0n3l5K92j38Rj01J05j34J22J5
2343E5k69K0M81l81N33n94M20k94J04O0j62k53L23J07j1J24l32L25k79J51Rk03
2365f6J65n5l08J33J65j69P0J96P3l59L3J40m4R2j76L14k14N3o8j29r2L47j57
2388e6KK9p6M5p6L17o6M5k22K98J35m03k4Q9m9J44J35l52L6LrJ80j49j02K30k32
$$ plain form
2414 -128 303 22 -237 48 183 -77 130 31 61 -4 -113 11 134 13 -206 370 -65 15 -167 -50 -75 90
2436 90 99 171 -50 104 -79 -236 127 -71 -231 37 -25 58 -257 -62 102 -40 318 46 -140 -186 235 -17
2458 -17 -69 -34 191 -21 -265 -64 -15 31 8 -53 -117 -86 -191 150 52 11 206 -76 53 192 -148 83 233 -39
2482 -39 -22 -81 51 50 50 43 -236 199 114 -124 -280 125 55 212 -102 39 -91 -217 81 192 5 -41 182 31
2506 31 -316 32 -66 -52 -57 45 -83 -264 -156 -269 -17 33 -88 157 -90 34 -238 -10 -34 -114 19 273 -107
2529 -107 90 87 267 -51 167 105 -17 -96 -114 82 -262 72 -478 -113 167 -254 -120 113 63 -147 -136 102
2551 102 -323 34 -201 284 -81 -77 -111 52 169 121 140 -267 92 -219 -40 4 -156 -101 26 86 -73 -175 -57
2574 -57 -3 -25 77 128 2 -11 58 112 292 280 -202 304 191 -185 -290 -66 -99 -89 -88 205 102 101 -320 -115 245
$$ packed form
2414a28M31k81k59K85J35k60K07r9L0o5j09J24J23j21k19N76m35Q0j82J17k5J65
2436I0RP2k21J54j83j57L63j98j60K68o2Q3l15J95J64j42L58k72j86m6M21k52
2458a7n2L5K25k12k44K01M9M6k3o1o4L1j05L41r8m1J95k82J29J39l40K31J50k72
2482c9J7n9J32j%pk79M35q5k38j56M05p0J57l14J41j30j26K98J11j87m6K23j51
2506C1l47L48r8J4nJ02j28j81J08j13K52N0j21K45k47J24k72K28k4q0J33K54l80
2529a07J97lJ80l18K18o2j22p9j8J96l44L34n50L65K80m21J34K33n0k10J1K38
2551A02m25L57k35M85l65Ml4J63J17m8J9m07L59l11J79M4j60N5J27O0j59j02J18
2574e7N4k2J02N1j26j3O9N4J80j2m82N06j13l76j05K24l3J0JK93j03jm21K05L60
$$ plain form
2599 245 169 -31 -60 -97 194 137 -116 -151 31 179 0 36 150 225 -23 68 11 -144 59 299 -306 -17 -67
2622 -67 103 -32 -204 -62 19 -107 98 36 147 45 -134 108 5 -78 -178 155 99 -18 -77 213 279 -104
2644 -104 102 -253 -76 -102 -196 110 29 -28 -128 -73 74 -67 141 -163 -33 95 82 -69 -167 -89 -258 162 61
2667 61 102 -94 -15 -21 31 -62 73 59 169 -139 -109 -200 24 233 38 -95 -147 142 152 0 -167 234 -164 -75
2691 -75 163 181 323 -35 -122 -95 -103 -194 -180 -153 -13 -45 -252 -95 19 96 105 101 88 45 69 49 -49 -144 55 222 -37
2718 -37 -41 133 -48 163 15 -154 269 146 364 109 -175 -146 199 -10 81 377 84 -82 -228 181 264 -178
2740 -178 -276 58 -104 58 27 -73 82 218 -76 -149 -109 243 -100 216 -112 62 30 61 -88 -360 105 217
2762 217 48 94 -34 162 -8 -95 -48 -274 77 34 0 233 -178 -108 -64 23 247 163 -30 404 25 -348 -104
$$ packed form
2599B45p6k00k9l7K91n7k53l5J82J48j79L6J14P5k48R1n7j55K03K40o05K89n0
2622f7J70j35j72J42Q1j26K05o2J11j02j79K42j03q3j00L33n6j17n9K90O6l83
2644a04K06l55J77k6r4L06q1n7j00N5J47j41K08l04J30J28j3j51r8P8j69M20j01
2667F1M1j96P9oN2r3J35j4J10l08L0r1K24K09j95j33n2K89J0j52j67M01l98Q9
2691g5K38J8J42l58q7K7qr1J4K7J40l2k07J57J14P7Rmj3m3K4k0r8r5J99J67k59
2718c7mJ74j81K11j48j69M23j23K18k55k84K9L45k09R1K96k93j66j46M09Q3m42
2740a78r8L34j62J62l1j00J55J36k94p3M0L52l43L16l28J74l2L1j49k72M65J12
2762B17j69M6j28J96j70q7M7k26L51m3l4K33m11P0M4Q7K24q4j93M34l79l73K44
$$ plain form
2785 -104 53 -198 200 1 104 -151 -103 207 94 -25 71 62 163 53 64 84 345 70 -17 73 -55 -21 -83
2808 -83 -48 16 -169 -67 22 39 -129 -32 -13 182 -184 46 -54 26 -17 138 12 38 -21 31 -241 -182 -106 -68 -63 -145
2834 -145 -2 54 214 -54 82 51 -299 69 -123 147 30 139 83 138 86 23 112 -160 27 136 99 246 264
2857 264 -364 84 219 -72 -101 20 -44 -38 -172 214 -152 -62 -89 249 -126 95 106 -16 351 171 -39 135
2879 135 226 -143 168 -67 105 10 173 429 115 115 106 -152 -177 190 -316 -45 122 150 164 100 75 131 15 -254
2903 -254 18 87 -116 30 -181 280 14 319 41 14 -64 53 -314 15 130 -61 -65 61 49 -145 -425 -96
2925 -96 95 -287 69 -44 123 365 290 121 164 101 129 -280 172 -193 -176 279 133 38 -339 43 180 -52
2947 -52 -115 -153 -48 -66 -129 196 130 216 -35 -105 -151 -124 13 -293 -52 119 63 -33 -154 188 -9 -156 -107 2
$$ packed form
2785a04J57k51L98j99J03k55M8L10j13j19R6rJ01j10J1K0K61k75q7R0j28L4o2
2808h3L5O4j85J02Q9J7j68R7J9J95l66K30j00Q0m3J55j26K6n9N2k72N9P6L8Nq2
2834a45J43N6J60k68J36l1l50L68j92K70j17J09n6N5n2o3Q9k72J87J09l7J47J8
2857B64o28M48J35k91k9J21o4Oj34L86l66R0k7L38l75K21J1j22L67j80k10J74
2879A35R1l69L11k35J72r5J63K56l14%rk58k5L67n06K71J67K8J4o4k5N6j16k69
2903b54K72O9k03J46k11M61k66L05k78k7p8J17l67L29J15j91mJ26j2j94k80L29
2925i6J91l82L56j13J67K42p5j69M3o3K8m09M52l65J7M55j46r5l77L82J37k32
2947e2o3l8J05j8o3L25o6Q6k51p0m6K7J37l06K41J71n6r6j21L42j97j47M9J09
$$ plain form
2971 2 -94 108 -53 159 -50 -137 -63 -8 258 -85 163 173 -55 -135 206 67 -21 98 14 -190 41 -104 16
2994 16 -153 263 -56 -67 33 -33 -26 -117 -145 199 165 -180 85 -248 -203 108 103 145 -209 16 34 -6 -38 52 -65
3019 -65 7 -84 -381 16 -23 -71 48 -18 31 161 157 299 10 -440 100 13 -154 24 338 -130 60 -3 -95 -12
3043 -12 104 -132 -166 -99 -82 -173 273 -295 -4 -47 -179 -18 -2 122 169 136 -7 267 -205 -46 94 -56 -220
3066 -220 -29 250 -93 -6 -115 -169 116 -210 110 18 -54 97 60 80 38 24 99 218 37 9 -233 -88 -269
3089 -269 -143 225 -354 13 426 -243 72 212 -206 164 -70 -39 -177 -54 10 -99 -13 132 148 155 -28 -90
3111 -90 133 -136 104 -45 -9 126 -61 -347 -32 -112 -83 -211 -34 177 62 -151 -73 62 106 112 344 40 -88
3134 -88 -254 -243 210 -112 -25 -136 -134 214 57 55 -137 -242 -30 -328 199 -51 -20 69 -4 319 -208 54 -82
$$ packed form
2971Br6K02j61K12k09q7P4N5K66l43K48J0k28q0L41j39q8J19q4k04K31j45J20
2994A6j69M16l19j1J00o6Pr1k8L44l4l45K65l33M5L11nM2l54K25J8m0l2R0j17
3019f5P2r1k97L97l9m8J19o6M9J30mJ42k89m50N40q7j67J78L14m68J90o3r2Q3
3043a2J16k36l4O7J7r1M46n68K91m3j32J61J6J24M7l3j43K74m72J59J40j50j64
3066b20J91K79l43Q7j09n4K85l26L20r2p2J51l7K0m2j4P5J19j81k8k42J45j81
3089b69J26L68n79L67M13o69L15J40m18L70k34L1j38J23O4j09Q6J45J6Pj83o2
3111i0K23k69K40j49L6J35j87k86L15q0K9j28J77K11j15k13P8J35M4OK32l04j28
3134h8j66J1M53l22Q7j11KL48j57kj92j05K12k98N27k50L1Q9p3L23n27K62j36
$$ plain form
3157 -82 -291 -3 47 20 -62 -36 107 40 102 102 -441 -188 196 -59 152 -240 -51 -11 -206 -214 9 111 -29 43
3181 43 -162 128 -119 186 -97 -163 203 118 -36 -134 180 -111 -231 -104 -154 -189 146 -56 354 -47 -230 -81
3203 -81 281 58 39 11 30 -16 159 143 -5 -107 -16 20 55 -166 -69 101 -68 -30 -70 -148 -67 -4 -80 -136 -328 -25
3229 -25 170 294 13 -41 -97 -123 12 221 -66 -264 82 50 -32 29 57 -272 -26 -82 13 -288 -105 124 -293
3252 -293 141 -19 269 -20 16 20 -291 -251 76 208 224 -1 78 186 -37 32 171 -73 87 64 -69 39 90
3275 90 -213 -65 86 33 21 45 88 -57 63 -174 -78 160 -127 186 -294 17 63 76 31 109 -2 -30 206 99
3299 99 72 56 -30 -206 -219 -124 -200 -436 246 -124 -22 19 -272 321 -62 -132 73 -6 92 -119 -53 -229 53 144
3323 144 40 180 -15 314 109 28 -4 148 219 54 -72 -10 -99 -202 -39 -10 101 -186 -147 -216 -152 189 116
$$ packed form
3157h2k09K88N0k7q2K6J43o7O2%n43K53L84k55K11l92J89M0j95qK23J02j40P2
3181D3k05K90k47L05k83o6L66q5j54r8L14k91j20J27n0l5L35k02M10m01j83J49
3203h1L62k23j9k8J9m6J75j6j48j02R1L6L5k21R7J70j69L8m0p8Q1O3p6n6j92L03
3229b5J95J24k81n4n6k6J35K09k87j98L46l2q2O1K8l29K46n6R5l01J83K29m17
3252b93M34j60K88k89L6Ml11M0L27J32J6k25P9J08k23O9J39k44J60k3j33J08N1
3275I0l03J48J51n3j2K4M3j45J20k37R6K38k87L13m80L11M6J3m5P8j11k8K36j07
3299I9k7j6q6j76j3R5p6k36O82l70J02M1k91N93l83p0K05p9R8k11O6j76K82R1
3323A44j04J40j95L29k05q1l2J52P1j65j26O2q9j03J63K9J11k87L9o9O4L41p3
$$ plain form
3346 116 217 -19 14 -72 -69 -114 1 -198 85 -99 -78 -129 -11 76 -106 280 160 11 -92 -49 164 253 -29
3369 -29 -191 153 -127 -75 -14 -53 -73 -175 -98 38 -134 52 158 26 58 -230 -64 178 93 -2 48 38 155 62
3393 62 134 -238 -194 34 -25 31 -51 19 6 -140 46 132 -49 -48 60 194 246 -111 12 -7 170 -114 -59 193 102
3418 102 -197 -259 -35 164 305 -218 -40 -82 -352 -223 -23 50 168 -67 117 269 -14 14 -2 -42 208 -4
3440 -4 4 -117 52 137 16 -255 -5 2 -320 170 -51 -196 172 252 -38 191 -10 -90 -9 -217 84 229 -121
3463 -121 90 21 135 38 -50 -12 130 -86 -22 -162 208 -78 -234 -62 -381 -45 7 -62 -153 -29 56 -102 -73
3486 -73 166 -25 33 -193 -8 -70 -143 155 14 -218 40 -13 -276 25 -145 -202 -4 72 96 -258 -111 23 142
3509 142 -154 103 -53 -72 307 15 -26 142 -44 73 19 -85 -31 -94 -111 -123 105 61 146 -185 -122 -202 -23 -224
$$ packed form
3346A16J01k36L3q6Lm5J15j99K83j84K1n1J18Q7j82L86j20j49j03M3K13Q9k82
3369b9j62L44k80N2O1l9k0j02P7J36j72J86J06j32L2k88J66K42q5r5N0j0J17r3
3393F2P2l72M4K28n9N6q2P0j3j46J86Q6j81JJ08J34N2l57J23j9J77k84N5K52r1
3418A02k99o2K24J99J41n23J78m2k70J29K00P3J18k35J84J52k83K8j6m0K50k12
3440dQj21J69Q5j21k71K50Pl22M90k21j45L68Q0k90K29k01q0Q1k08L01J45l50
3463a21K11o9J14r7q8L8J42k16O4j40L70k86j56J72l19L36N2o9r1J24Q5j58K9
3486g3K39j91N8k26J85o2p3K98j41k32K58n3k63L01j70n7J98P6K4l54J47J34J19
3509A42k96K57j56j9L79k92m1J68j86J17n4j04N4o3j7j2K28m4Q5l31O3q0J79k01
$$ plain form
3533 -224 63 -178 221 -268 -26 96 161 48 182 -15 107 -129 -91 -107 260 -105 -176 112 -247 48 79 56
3555 56 -12 -28 -51 -51 80 -42 130 265 -9 -13 -101 -1 92 -71 63 -354 73 18 5 196 297 55 44 -89
3579 -89 50 -65 -78 80 95 16 123 4 27 113 -24 241 130 -32 55 38 13 85 -99 -308 -4 77 -97 -48
3603 -48 -124 -69 -82 203 242 -366 -117 -60 124 -31 -243 78 -21 -46 -191 -151 -181 -155 -111 68 84 -24 -17 165 -6
3628 -6 208 1 -20 -121 176 3 66 -154 72 -8 51 -120 -163 -44 104 -331 -338 297 81 28 -60 219 24 180
3652 180 72 101 -62 71 122 -26 -52 150 -146 13 78 -124 -178 78 -16 34 3 -109 99 132 16 -18 33 63
3676 63 42 52 -62 -435 74 3 -231 -26 -397 239 -161 -26 54 -182 114 106 -68 39 102 95 -165 81 -150
3699 -150 -132 35 -61 80 -178 137 -34 100 -313 -55 -136 -1 178 -89 102 -100 47 250 132 212 -83
$$ packed form
3533b24K87k41L99m89K42J22O5j13J34j97J22k36L8j6L67l65p1K88l59K95L1k3
3555E6o8j6k3%J31j22J72J35k74mq8J00R3j63J34m17M27n5j3J91J01k42j1j33
3579h9J39j15j3J58J5p9J07j19K3Q6j37K65j11j62Q7j7k5P2j84k09L04Q1j74M9
3603d8p6N5j3K85L9o08K49N7J84j55k12L21r9k5j45M0l0K6M4J79J6j08PJ82j71
3628fK14k07k1j01K97j73O3k20K26q0N9j71m3J19J48m35pO35k16n3q8K79j95J56
3652A80j08K9j63J33N1j48k6K02k96J59O5k02n4K56r4N0l1j12K08L3j16l4N1L0
3676F3k1J0j14l73N09p1k34K05l71O36m00J35Q0k36K96qj74J07O3pk60K46k31
3699a50J8J67r6J41k58L15j71J34m13K58q1J35J79k67J91k02J47K03j18Q0k95
$$ plain form
3720 -83 -246 216 130 -106 -14 -90 -186 -60 -53 288 80 -77 259 12 -140 160 55 -52 61 33 -335 -168 -22
3743 -22 66 -298 13 -99 -341 136 124 149 -267 -103 -193 -475 25 -42 -25 214 493 -226 137 22 34 498 189
3766 189 -635 -314 215 -128 165 225 19 -109 -219 -374 -95 271 -61 323 185 -99 40 -215 -56 54
3786 54 -55 -208 797 -211 211 34 -104 -89 150 -122 -206 402 -304 -12 242 -400 -2 28 135 -107 -323
3807 -323 -481 314 -151 -213 138 -8 -22 -175 -131 -254 86 -132 38 -90 -70 325 61 -357 383 -145 86
3828 86 -63 150 21 -48 182 -3 -81 -76 166 -69 -206 -169 -7 -133 186 -424 74 157 237 -92 3 60 -158
3851 -158 -75 133 -78 103 -55 29 195 144 14 -68 132 -7 61 -190 -1 5 -59 -59 -82 81 194 87 10 109
3875 109 166 -83 226 -121 -109 -181 -52 48 -204 -70 -99 239 -34 -21 128 170 -35 34 45 -76 -133 140 -32
$$ packed form
3720h3j63M62q6k36R2p6r6J26PL41k08j57L36k47j52L00j05j07J13k8l68J67J46
3743b2Q8l64L11j12k42M77j2K5m16J64r0k82N00o7J7K39K79p19L63j15J2M64l09
3766A89q24L21N29l43K93O0k06j28j10j55K79L66l32L84j38k84J39k55J59J10
3786E4j09j53J005j008M22j77j38J5K39k72q4O08p06K92K54o42L98L0J07k42k16
3807c23j58P95m65o2L51j46j4j53M4j23L40k18J70j28K0L95k64m18P40n28K31
3828H6j49K13j29o9K30j85p8NK42k35j37L7J62j26L19o10M98Q3Q0l29R5N7k18
3851a58Q3K08k11J81j58Q4J66n1j30q2K00j39O8k51J89Oo4%k3J63J13j07p7R9
3875A09N7k49L09l47J2p2J29J00k52J34k9L38k73J3J49M2k05O9J1j21n7K73j72
$$ plain form
3898 -32 86 6 233 -30 7 88 -77 58 67 -35 175 -132 -154 -216 -31 40 -56 -26 79 -40 -55 -117 -212 -86 141
3923 141 117 65 121 -26 -31 -239 95 -324 158 39 8 103 106 145 -10 29 -208 -102 -135 46 106 94 -71 193 -31
3948 -31 90 34 28 -50 -129 195 -8 128 173 -13 -236 364 -148 -42 171 89 -161 201 175 -131 84 77 -123 -356
3972 -356 -73 -22 106 159 -65 125 105 -71 71 -21 -253 101 -26 167 -34 -191 229 45 -97 97 -81
3993 -81 -127 52 -31 58 -43 -30 16 34 -98 -2 21 -4 -51 38 108 -5 218 55 -104 6 3 216 -8 77 -77
4018 -77 163 123 131 -171 122 275 66 141 83 -85 8 309 -198 -59 -169 -112 145 116 -1 -176 -307 -62 28
4041 28 366 226 41 -348 46 -239 203 182 8 106 41 -482 -78 -52 56 -17 -217 -148 -93 -202 -134 -28 22
4064 22 12 -147 48 -175 -135 -122 8 102 155 -120 77 -171 161 -44 -216 -216 127 97 279 110 15 -118 -84 -143
$$ packed form
3898c2J18q0K27k63L7Q1j65J35Rj02K10l07k2o2J85P1r6L0J05j19j5o2r5J26K27
3923A41k4n2N6j47nk08L34m19M82j19l1R5LL9j55L9k37J06l3J81O0j2j65K64k24
3948c1J21n6op8p9L24k03J36M5j86k23O00n12J06K13q2k50L62k6l06K15pk00k33
3972c56K83N1J28N3k24J90k0j76J42r2k32L54j27J93k01j57M20j84j42J94j78
3993h1m6J79q3Q9j01J3M6J8j32R6K3k5m7Q9P0j13K23j63j59J10lK13k24Q5j54
4018g7K40m0Ql02K93J53k09P5n8j68R3L01n07J39j10N7K57k9j17j75j31K45R0
4041B8L38j40j85l89L94k85M42k1j74R8o5n23M04K6J08p3k00O9N5j09O8J06N0
4064B2j0j59J95k23M0J3J30R4N3k75J97k48L32k05j72%L43l0J82j69r5j33L4n9
$$ plain form
4088 -143 155 281 -124 -143 -25 -104 -104 53 -67 -109 127 -455 -168 -101 88 25 83 130 -151 -131 -42 68 -23 -13
4112 -13 -137 100 192 -36 -196 -38 -34 -56 -35 141 -25 -173 -86 -88 59 -131 -244 37 42 190 -12 -74 -31 -8 -40
4137 -40 -27 44 -80 234 -16 179 192 -21 -12 3 -188 72 80 -33 -203 191 392 193 -72 39 -18 -169 5
4160 5 101 -15 -230 -148 79 95 162 34 36 47 -149 -190 -45 144 59 -274 110 57 103 -180 84 -150 120 85 -45
4185 -45 -71 -131 -34 80 -153 5 5 19 121 177 -145 -49 -177 -139 77 -8 86 163 179 191 132 -282 -146 -13 51 186
4211 186 -11 -36 -143 126 -109 107 9 -132 -11 86 5 -175 -54 106 46 77 274 258 -203 40 -114 -273
4233 -273 -330 80 11 138 134 -144 -28 133 73 -75 -98 -150 -242 -227 -47 53 97 -125 41 -142 153 -3 91 79
4257 79 215 -67 89 -67 137 -134 21 34 -186 -17 39 -388 316 -75 -61 57 5 57 24 -134 270 36
$$ packed form
4088a43K98J26m05j9J18p9%J57j20m2K36n82K87O7J89o3N8M7k81K0Q9J10r1J0
4112a3j24K37R2k28j60J58Mk2K1J76j66j48Q7kJ47j90j13K81NJ48k02o2M3K3l2
4137d0J3P1j24L14k50J95J3k13RJ5j91K60Qj13j70L94K01j99k65J11n7j51J74
4160ER6j16k15Q2K27J6O7j28KJ1j96m1J45J89q5l33L84n3M6k83K64k34K70l5j30
4185d5k6o0R7J14k33J58%J4J02N6l22R6j28L8K16q5R4P7J6J2n9m14J36J33O4J35
4211A86j97k5j07K69k35K16r8j41J21R7q1j80J21J60o0L1J97j6m61K43j54j59
4233b73n7M10o9J27mk78J16J61o0j48k3n2r2J5J80J00M4k22J66j83K95j56R4j2
4257G9J36k82J56j56K04k71J55J3k20J69N6m27P04l91J4J18n2N2l3j58M04k34
$$ plain form
4279 36 -236 -32 -86 248 -158 71 -119 118 21 -55 -101 8 27 -255 -156 8 -159 -44 -108 407 -46 179 18
4302 18 -220 295 -257 36 26 -18 69 -53 -145 42 -149 -92 -78 106 -220 -14 112 -223 148 199 58 -55 26
4325 26 191 193 4 -78 150 -237 -40 -120 48 5 -129 138 26 -191 51 -52 73 -211 -60 -136 -410 330
4347 330 -67 136 -95 -247 70 212 24 -72 -281 -150 2 -151 -326 38 195 -208 -42 -79 64 -176 86
4368 86 -15 166 244 -111 154 79 -105 -138 203 -18 -48 -55 80 171 22 248 -24 287 46 -142 -101 -221 -84
4391 -84 -162 129 -140 142 -1 -81 358 -47 -72 118 -42 -10 173 -19 -86 -6 329 49 -32 -41 31 -126 -75 26
4415 26 69 -12 52 -158 62 130 -149 58 20 205 -229 -106 233 75 -199 65 150 -192 123 -12 -26 152 38
4438 38 157 36 -3 -34 -23 -133 86 1 149 239 208 21 -65 20 -38 -11 165 -19 -42 149 -161 19 -320 121
$$ packed form
4279C6k72K04n4L34m06K29j90K37r7p6m6J09J9k82R9J64j67J15o4N15m53K25j61
4302A8k38N15n52K93j0m4Q7j22r2J87j91N7J4J84l26K06J26l35L71N1j41j13Q1
4325B6J65Kj89q2K28l87J97q0J68m3j34K67j12k17K42j03J25k84J51p6k74P40
4347C30l97K03k31j52L17J42j88r6k09J31J52j53j75L64J57m03J66l7J43k40K62
4368H6j01J81P8l55K65p5j84l3L41k21l0pJ35R1j49K26k72L11k41j88M1j20J37
4391h4p8K91k69K82j43q0M39m05k5J90j60L2J83j92o7Q0L35k80q1rP2j57N1J01
4415B6M3q1O4k10K20O8k79K07l8J85m34J23L39j58k74K64Q5l42L15j35j4J78j14
4438C8J19j21l9l1J1j10K19q5J48R0l1j87q6Q5n8K7J76j84k3J91l10J80l39M41
$$ plain form
4462 121 -127 164 -113 -56 107 -284 273 -11 -13 -103 -68 121 26 -70 -1 -123 84 -184 209 359 -146 111 -47
4485 -47 -216 186 -196 -98 -15 -232 -21 31 77 9 -69 -186 -6 -85 48 -9 -55 135 -87 -93 -144 205 -67 32 -18
4510 -18 136 -68 23 121 -140 99 98 67 -161 -206 -259 49 39 -116 -38 143 -10 75 21 -138 -149 15 173 -129
4534 -129 10 -23 130 -113 360 3 37 9 31 15 34 204 -16 -127 143 181 64 -87 -319 -54 -67 96 12
4557 12 93 185 -195 3 68 -45 86 99 -75 88 56 123 -32 -97 114 91 -275 120 -55 41 -91 50 70 -84
4581 -84 -269 41 98 119 57 -135 -19 70 -29 -61 -153 -29 34 -234 221 179 -125 -160 85 -39 -171 -162 36 50 -117
4606 -117 -115 -79 31 70 33 -140 79 -178 -4 -85 -4 162 145 160 198 -291 77 37 236 21 -18 187 155 -103
4630 -103 -151 -41 43 -94 65 92 70 -19 29 -122 -78 -40 184 -111 71 223 -189 13 -22 303 28 -97 -113
$$ packed form
4462A21k48K91k77N7J63l91N57k84kr0L5J89r5r6O9j22K07k68L93J50n05K57j58
4485d7j69M02l82R8Q3k17K11N2M6o8p8j17J80p9J33n7m6J90k22on1L49k72R9n0
4510a8J54k04R1R8k61K39jl1k28m5n3L08j0j55P8J81j53Q5n4j59j1J64J58l02
4534a29J39l3J53k43M73l57L4k8K2j6J9J70k20j11K70L8j17j51k32K65j3J63q4
4557A2Q1R2l80J98O5j13J31J3j74J63l2O7j55o5K11k3l66L95j75R6j32J41K0j54
4581h4j85L10N7K1o2j92J16Q9r9l2r2J24O3k68M55m2l04l5K45j24j32RJ98J4j67
4606a17KL6J10L9l7j73K19k57J74q1Q1J66j7J5L8m89L68m0J99k15l9K05l2k58
4630a03m8J10Q4j37J59K7k2q9M8j51M4L8K24k95J82J52m12K02l5L25k75j25j6
$$ plain form
4653 -113 86 10 -38 -19 287 -68 -13 78 163 -54 -137 50 -74 -5 235 67 192 -75 15 -208 24 153 -99
4676 -99 188 -85 -141 -236 93 221 -26 -9 66 118 -100 -174 42 3 22 35 84 -4 -109 -91 60 -93 212 47
4700 47 173 -293 -91 88 -104 -182 146 48 -251 185 -219 38 287 56 177 -251 23 288 -226 -244 -30
4721 -30 135 9 52 -89 -128 -233 -32 -52 216 -68 145 90 -10 -22 37 -80 -136 34 -11 47 -80 60 376
4744 376 28 102 190 234 18 61 -217 163 -51 -23 -98 -107 -69 19 259 297 -123 84 -197 -133 44 251 -406 250
4768 250 -29 -45 -67 -139 -231 -76 105 -3 125 -23 -33 158 154 -114 -131 150 46 0 -64 42 141 30 261 -84
4792 -84 72 -145 149 61 -56 -7 -134 -105 140 74 -33 41 -382 -65 200 231 -8 -131 59 -3 336 -6 114
4815 114 -183 107 161 377 176 11 37 -69 -88 -80 31 -76 33 287 47 168 -281 180 -17 9 41 -89
$$ packed form
4653a13J99p6m8J9L06l55N5R1Q5k17q3J87j24O9K40j68J25k67R0k23K32J29k52
4676i9K87k73n6r5L29J28k47J7P5N2k18p4K16l9J9J3M9q8j05J8J51j53L05j65
4700D7J26m66K02J79j92p8L28r8k99M36m04K57K49k31J21m28K74K65n14j8K14
4721c0J65j26M3j41l9j05K01k0K68k84K13n5j00j2N9j17n6J70m5N8j27J40L16
4744C76l48P4Q8M4k16M3k78L80k14K8p5rL8Q8K40L8m20K07k81O4J77K07o57O56
4768B50k79j6k2p2r2J55J81j08J28j48j0J91mk68j7K81j04m6o4J06R9j11K31l45
4792h4J56k17K94q8j17M9j27K9K45o6j07P4m23L17K65L1k39j23J90o2L39l42J20
4815A14k97K90N4K16k01j65K6j06j9QJ11j07J09K54k40J21m49M61j97K6L2j30
$$ plain form
4837 -89 -193 -248 -74 100 148 211 -42 79 -209 -213 164 78 18 -5 126 102 -18 -245 -274 -129 70 132 195 -68
4861 -68 -65 22 -162 55 -90 112 247 -61 150 201 -16 -51 -147 20 -238 -31 -47 234 -12 56 180 37 -164
4884 -164 -118 69 -89 -91 -57 -14 134 -88 -153 -203 -85 181 43 79 -282 -54 -66 68 41 42 -177 -93 -153 -229 -151
4909 -151 -150 214 -98 -145 -85 388 164 -57 57 22 66 45 13 117 353 117 209 -251 -46 -288 -65 -175 73
4932 73 85 -83 -217 -134 111 -445 74 57 160 -42 -104 88 205 77 120 -188 137 5 -72 -42 -93 -53 -124 -29
4956 -29 -316 -80 -111 32 -44 -163 73 244 58 -39 -100 133 -88 113 35 275 -355 125 253 -1 -91 60
4978 60 65 103 -61 -51 21 175 -135 28 -66 -40 -48 -30 -134 -60 199 203 -168 -2 67 61 -15 -42 27 8 78 -5 -109 34
5006 34 -210 112 41 -107 -145 -115 2 199 79 275 134 -63 -4 -15 143 -188 -118 -14 -123 -174 90 141 -246
$$ packed form
4837h9j04n5J74J74M8O3k53J21k88mL77q6o0k3J31k4j20k27k9J45J99O2O3k63
4861f8LQ7j84K17j45K02J35l08K11N1k17l5r6J67k58K07j6K81k46O8J24j43k01
4884a64M6J87j58kL4M3J48k22o5n0J18K66j38L6l61K28j2J34k7Jk19Q4o0p6P8
4909a51JL64l12m7O0M73k24k21J14l5M4k1l2J04K36k36R2m60K05k42K23j10K48
4932G3J2j68j34Q3K45n56N19j7J03k02o2J92J17j28M3l08L25j32p7L0n1M0p1R5
4956b9k87K36l1J43p6j19K36J71j86r7o1K33k21K01p8K40o30M80J28k54r0J51
4978F0NL8j64J0P2J54l10J63r4K6qJ8j04P4K59Ml71J66O9op6k7O9j9P0q3j04J43
5006C4k44L22p1j48l8L0J17J97j20J96j41j97N9j1J58l31P0J04j09n1K64N1l87
$$ plain form
5029 -246 -26 3 -71 75 213 0 -165 -4 -9 0 35 64 232 -158 -192 -76 -195 -73 -175 -282 -304 -77 48
5052 48 -242 -191 -351 -174 -128 -42 104 60 26 196 -137 -321 -384 -1 -174 273 -113 -202 -75 -100 294 92 121
5075 121 -149 -197 146 -53 10 -56 166 -207 645 -3 -438 248 -211 136 230 -57 255 175 -37 -790 -403 -166
5097 -166 -253 388 -212 -374 46 312 261 -204 191 -334 -66 139 98 -84 223 -82 -6 255 -117 -52 -28 66
5119 66 -9 -161 406 142 71 201 252 49 -164 -366 -259 -138 -142 -107 -115 42 58 265 -98 -242 -161 -64 35 -46 93
5144 93 -95 25 -88 50 -147 176 119 -2 -113 -20 -51 337 45 142 -30 -252 -167 -154 -54 150 -140 29
5166 29 -86 -27 302 -161 -179 87 311 -50 49 -182 -315 -97 109 -98 0 6 29 -14 130 19 -85 60 -58
5189 -58 -202 156 116 69 -178 -229 -72 -23 -27 234 -14 -145 -9 -33 -69 -33 304 89 189 302 58 -95 93
$$ packed form
5029b46K20K9p4J46J38k13j65J61nRL5K9J68l90l4J16j19J22j02j07k2K27J25
5052D8k90N1j60J77M6Q6J46m4l4J70l33j84o3L83j73M47l86q9J27k5L94k02K9
5075A21k70m8L43j99O3o6K22l73Q52o48m35O86m59L47R4k87L12q0k12p53L87K37
5097a66q7O41o00j62M20K66n1m65L95n25K68K05m1j82L07l05P6K61l72O5K4R4
5119F6p5j52N67k64p1J30N1k03k13k02J07J21mL5qJ57J6K07l63j44Q1R7R9q1J39
5144I3j88J20j13J38j97L23n7j21j11R3l1L88k92R7j72k22Q5J3J00K04k90J69
5166B9j15N9L29m63j8K66K24l61R9k31j33K18K06k07R8OK3m3J44j11j04J45j18
5189e8j44L58m0m7k47n1J57M9mK61k48j31J36k4l6L6L37k15J00J13k44j53J88
$$ plain form
5212 93 74 79 41 -192 7 64 -27 -4 175 237 117 180 -165 16 230 156 -64 -190 -95 59 188 -97 -181 22
5236 22 70 18 80 -42 -142 112 212 56 -90 -172 -55 -58 -68 73 -103 1 238 238 -113 -244 72 -186 -141 -37
5260 -37 -66 149 -133 16 -33 128 283 -132 17 60 101 -121 27 -90 60 -33 -131 -316 97 80 15 55 5 181
5284 181 -33 323 -42 -136 147 -222 124 180 152 -185 94 223 -179 -71 -212 -51 -27 166 -18 8 -76 -75 197
5307 197 -16 395 -170 144 134 -275 24 54 -106 -146 251 75 245 -14 -75 -31 -96 14 -274 -51 -14 -173
5329 -173 21 -29 48 -61 106 -194 -89 -165 144 94 95 30 96 5 -62 -144 179 143 289 69 -144 72 -296 61
5353 61 274 -75 56 20 -31 -42 -205 5 -29 134 59 -157 50 113 -137 112 -58 53 23 3 77 100 8 -139
5377 -139 32 -4 74 -62 23 117 -8 -77 -108 -411 -163 125 -122 6 -355 -103 -125 70 -139 -41 -61 -356 22
$$ packed form
5212I3j9Nl8k33J99N7r1K3J79O2j20O3l45J81K14p4k20j26R5J54J29k85q4K03
5236B2M8n2O2j22j00K54J00j56j46q2J17lj0J41j76J04K37%l51j31L16k58M5J04
5260c7k9K15k82J49m9J61J55m15J49M3M1k22J48j17J50r3r8j85M13j7o5M0n0J76
5284A81k14L56l65r4K83l69L46N6k8l37K79J29m02J08j41J61K4J93j84K6q4JK72
5307A97k13M11n65L14j0m09K99L0j60m0L97j76J70k59o1M4o5J10k88K23L7j59
5329a73J94n0P7j09J67l00J05p6L09n0Jo5O6r1o7q2L23l6J46k20k13K16l68L57
5353F1K13l49J31l6n1j1j63K10l4J63p5k16K07O3k50K49j70J11l0k0P4K3r2j47
5377a39J71l6P8j36Q5R4j25o9l1l03K48K88k47J28l61K52k2J95k09R8k0k95L78
$$ plain form
5400 22 280 173 11 311 -222 -125 25 -44 151 -198 -140 68 48 -57 -64 106 -68 -37 24 151 110 151 59 -54
5424 -54 155 -154 -99 -115 -92 66 -41 -122 -153 -65 -109 -167 18 86 187 247 129 141 46 -109 -40 7 234 13 394
5449 394 -179 85 -19 -20 -10 -170 21 -9 -113 -109 121 115 -17 42 165 69 170 -135 24 58 -80 142 41 162
5473 162 -149 10 -18 -91 2 177 -36 -39 -213 150 -240 -35 94 -19 9 148 35 -113 -34 -71 157 -201 56
5496 56 144 179 -168 185 353 74 -132 60 -54 137 -136 108 46 64 -541 -174 189 8 -141 -55 -53 -237 -43
5519 -43 25 28 74 19 30 479 80 172 124 113 -164 -43 -35 -97 147 16 -8 -206 446 198 327 90 14 -168 108
5544 108 -43 68 175 25 19 186 -4 -201 -213 -118 -79 16 -94 -134 -26 32 -152 -183 -120 140 143 -134 57 -20
5568 -20 -85 -22 -136 45 -265 -189 76 94 -178 -117 -272 4 71 70 -197 28 26 20 116 126 -88 64 -15 142 -111
$$ packed form
5400B2K58j07j62L00n33R7J50o9J95l49N8K08k0j05pJ70j74L1O1J27m1M1r2j13
5424e4K09l09N5j6K3J58j07q1l1Q8m4n8J85O8J01O0j18J2r5j55O9M7K27k21L81
5449C94n73K64j04jJ0j60J91l0j04MK30oj32N9J23r6J01l05J59L4j38K22j01J21
5473A62l11J59k8p3R3J75k13lj74L63l90K05J29j13K8J39j13j48P9l7K28l58K57
5496E6Q8L5l47L53J68k79k06J92j14J91k73K44o2J8o05L67L63j81j49Q6Kj84J94
5519d3O8LM6n5J1M49l99R2m8j1k77J21Qo2K44j31k4j98O52k48J29k37p6j82K76
5544A08j51J11J07j50oJ67j90j97j2R5L9R5j10m0J08N8j84l1O3K60Lk77J91p7
5568b0o5O3j14J81l10P6K65J8k72O1j55K76O7jk67K25koR6J0k14J52p9J57k53
$$ plain form
5593 -111 135 199 63 28 -153 81 -105 85 -29 -35 -171 -161 -73 -47 194 -65 -142 63 13 98 323 45 166
5616 166 -98 225 58 -1 -112 -136 -59 27 255 -87 -44 -187 -155 -24 -19 8 142 134 38 52 -90 171 9 294
5640 294 0 107 -7 134 88 66 22 -147 142 -131 -2 194 190 -132 -6 -40 103 -13 -174 162 -186 -9
5662 -9 43 181 -121 42 14 97 -80 -171 48 -97 215 87 37 74 126 -144 188 249 -264 194 -51 212 -319
5685 -319 -171 90 218 508 -270 -128 53 87 -35 222 -189 -55 196 -195 151 72 -223 39 -93 -114 -7
5706 -7 105 -163 -126 29 123 -9 159 -122 93 -146 -41 -116 -236 -243 116 64 -285 123 46 -105 30 -165 -37
5729 -37 192 103 -364 -136 23 62 116 -140 8 152 250 -13 -78 74 59 -190 -49 387 -30 51 11 84 -267
5752 -267 -155 -7 -304 144 -130 -27 -136 202 131 31 -205 -79 32 34 -7 -187 233 -246 -151 92 -97 218
$$ packed form
5593a11K46O4j36l5j81K34j86J90j14oj36J0Q8K6K41k59p7K05n0Q5K25k78J21
5616A66k64L23j67n9j11k4P7Q6K28l42M3j43L2J31NK7J34qr6J4j42K61j62K85
5640B94k94J07j14J41m6k2m4j69K89k73J29J96ml22J26l4J43j16j61L36l48J77
5662iN2J38l02J63k8Q3j77r1K19j45L12j28n0L7N2k70L32O1n13M58k45K63n31
5685c19J48K61J28K90p78J42J81L4j22K57m11J34K51l91L46p9k95K62j32k1J07
5706gJ12k68L7J55R4j32J68k81K15k39J05p5j20pL59n2l49M08p7j51J35j95J28
5729c7K29q9m67K28J59L9N4k56J48J44R8k63o5J52j5k49J41M36m17Q1m0P3l51
5752b67J12J48k97M48k74J03j09L38p1j00k36J26J11Km1j80M20m79R5K43j89L15
$$ plain form
5774 218 49 -286 125 119 55 60 -276 107 -110 61 53 -7 -35 57 -61 -199 -37 -134 53 -19 80 -95 113 189 -57
5799 -57 159 41 198 50 179 63 26 -382 -46 313 -23 -23 -26 -33 165 -75 58 -153 60 -1 -90 -88 -65 8 -354
5824 -354 255 18 59 -39 -135 -134 -18 -137 101 -37 30 232 105 -73 -91 -35 -198 -239 -251 122 -331 -261 -253 -121
5848 -121 -107 160 191 -11 -116 -45 -259 59 -58 84 34 -263 199 173 114 206 -67 75 -211 -164 210 -223 89
5871 89 191 280 -200 -80 -40 -100 -61 94 -13 84 190 -180 198 -77 -8 -38 -22 -8 -57 63 404 -3 -3 180
5895 180 -22 -112 -45 215 1 -67 153 170 -47 100 -138 -44 -176 6 -21 -23 13 -54 211 -151 -79 33 41 367
5919 367 10 -421 133 154 -42 -147 189 -97 -65 116 -82 100 -3 18 21 -306 -111 144 124 -231 -96 26
5941 26 74 -236 -51 44 158 124 139 72 -151 120 222 -41 112 -192 -108 -295 -54 -20 -120 162 -106 -187 71
$$ packed form
5774B18j69l35M11oo4Nl36L83k17J71qo0k8R2j18j38J62r7J87p2R9j75K08P6k46
5799e7K16j18J57j48J29j16l7m08L36L59l36%lpJ98k40J33k11K13o1q9KK3P3l62
5824c54O09k37M1r8r6JJ16j19K38j38O7K02j27j78j8N6j63m1j2L73m53P0QJ32
5848a21J4K67L1k02j05P1k14L18j17J42n0k97M62k6n9R2k73J42k86M7L74m33L12
5871H9J02Q9m80J20M0o0L9J55j07R7J06l70L78k75O9l0J6J4m9J20L41m07%J83
5895A80k02r0O7K60k14o8K20J7k17J47k38R4j32J82k7kL6o7K65l62P2J12QL26
5919C67l57m31N54K1j96j05L36k86L2J81j98J82j03K1Ll27J95K55k0l55J35J22
5941B6M8l10J85R5J14l4J5o7k23K71J02k63J53l04Q4j87K41L4j00K82k68q1K58
$$ plain form
5964 71 10 29 -63 153 105 -26 127 66 -42 -31 40 -100 -58 107 -51 325 -85 326 175 -140 26 31 259 -5
5988 -5 -55 168 -179 173 -113 67 -156 -88 -7 -33 36 -72 -370 112 92 202 -18 68 159 -38 38 113 57 -16 -86
6013 -86 -131 130 -153 185 144 81 201 -154 -172 -69 -96 -160 71 -225 -125 253 -135 -125 -39 -229 -31 -13 6 41
6037 41 -65 30 37 -28 40 -40 188 0 -44 105 -126 103 -27 -228 144 146 161 -59 171 -144 20 74 -63 -12
6061 -12 72 -319 -114 -152 190 61 3 -90 -90 113 -118 -138 -22 93 -135 -14 -43 42 -111 -25 187 -120 124 -221
6085 -221 1 43 60 239 -35 -166 117 140 119 5 -144 -139 -77 24 -18 -222 67 5 60 94 217 -42 -115 -177
6109 -177 -233 -70 -136 -101 -131 193 12 -24 -127 -50 33 -8 46 -87 -170 -175 506 -108 28 23 129 -77 259 125 -138
6134 -138 58 -117 111 -126 -133 99 196 215 -13 -141 -102 29 22 -214 47 3 106 32 -176 3 -45 108 1
$$ packed form
5964G1o1J9r2K16m8j31J53o1j08J1P1j40M2J65j58L76m10M11j51l15J66NK28k64
5988en0K23l47L52k86J80k23O8Q1k6O9j08k98M82k0J10k20Q6R1j97P6P5n6p3p0
6013h6m5K61k83L38m1o3J20l55j8J03k7o4K31k96J00L78l88J0Q6j90J98J8J9L5
6037D1j06R5Po5O8q0K28j88m4J49k31K29j30k01L72KJ5k20K30l15J64N4j37N1
6061a2Q4l91K05l8L42j29n8r3%K03k31k0J16J15k28J21k9Q5j53Q6K12l07K44l45
6085b21K22M2J7J79k74j31K83K3k1j14j49NO2J01m2k04K89o2N5L4J23k59p3o2
6109a77n6J63o6L5l0L24j81l6j03P7Q3m1N4j33q3nO81o14J36nJ06k06L36j34k63
6134a38J96j75K28k37pK32R7J9k28j28L9J31pk36K61m4J03p4k08J79m8J53j07
$$ plain form
6157 1 -209 -127 19 108 5 -114 78 126 -8 31 -238 183 379 -120 60 -166 -170 -25 52 160 245 62 326
6180 326 134 61 138 -2 103 -437 -124 -156 13 -207 -254 92 -232 33 -156 45 -321 37 124 -30 -17 146
6202 146 78 -24 84 6 -225 1 33 35 122 35 -206 128 123 -124 97 -55 -47 -67 -2 -270 151 173 33 -152 38
6227 38 -19 18 50 74 62 298 30 64 235 3 90 -26 89 64 -137 198 -16 -166 -33 -104 314 -109 -79 135
6251 135 20 -59 -47 246 -11 -162 177 12 171 -9 -229 142 26 128 -87 -173 197 -37 129 -22 -129
6272 -129 -164 26 -175 -23 -130 -29 267 -88 -35 -220 172 -306 117 -144 55 -149 145 -28 225 316 -342
6293 -342 -105 -253 -39 113 -134 24 70 197 -272 -160 -85 93 -67 21 -122 26 -134 26 187 248 -44
6314 -44 -239 -252 -68 48 -15 -91 18 178 -6 201 -155 -177 -50 -139 -208 102 122 143 3 -23 -219 286 261 -37
$$ packed form
6157Ak10Q2J46Q9j03j19J92M8j34L9k69M21J96m99J80k26mJ45P7J08Q5j83K64
6180C26j92p3P7j40J05n40L13l2J69k20m7L46l24K65j89K01l66L58Q7j54J3J63
6202A46o8j02J08p8k31K26L2KQ7q7k41L34nk47K21j52Qk0O5k68M21K2j40j85J90
6227C8n7L7L2K4j2K36k68L4J71k32Q7j16J15k5k01L35k14j50J33p1M18m23L0K14
6251A35j15p9J2K93k57j51L39j65J59j80k20L71j16J02k15q6L70k34J66j51j07
6272a29l5J90k01J52j07J01K96l55N3j85L92m78M23k61J99k04K94j73K53R1o58
6293c42K37j48K14J52k47J58M6J27m69J12P5J78j60Q8j43J48j60J60J61O1k92
6314d4j95j3J84J16o3p6J09J60j84K07l56k2J27q9o9L10K0K1j40k6j96N05k5k98
$$ plain form
6338 -37 -118 -120 99 26 -133 95 222 -333 212 210 -368 -59 278 78 89 -24 -131 119 1 -68 47 24 73 6
6362 6 -128 -88 124 161 165 -306 159 -341 -320 -5 349 -248 92 -95 -107 -7 -139 -105 31 150 -291 205 10
6385 10 248 308 152 78 -122 181 -87 193 -39 49 -172 -164 126 -30 -273 -80 -130 -30 54 -108 -51 -160 -180
6408 -180 24 -43 8 187 121 5 68 179 -226 70 -93 268 91 -138 -158 186 -9 75 -267 -40 183 61
6430 61 -151 30 2 -95 44 -36 58 -94 -89 -227 66 -98 -184 -17 -106 92 43 61 -77 82 285 28 -58 -205
6454 -205 -223 -26 -202 -88 231 -91 111 21 -47 122 -163 198 -99 134 25 -77 -137 155 -132 152 111 -184
6476 -184 -60 257 77 -4 -40 158 -44 100 72 69 -85 -334 7 101 -12 140 153 -37 -113 233 43 -34 40
6499 40 -75 325 -146 90 125 110 -110 127 -240 165 -170 58 -139 157 88 -110 -199 -117 6 101 -22 -47 292
$$ packed form
6338c7q1kK19p3j59K28J27n55N45kn78L09L37k00J1j13j07K50j18o9J15k3M9o7
6362Fj34M0K12L7Mm71M65n00K1L15L54n97L40j87j2J00j32L4J36J19m41M96j95
6385A0K38O0j56p4k00L03k68K80k32Q8k21QK90j56k43J93n0J00Q4j62N7j09k0
6408a80K04o7N1J79o6j16O3J11m05K96j63L61j77k29k0L44j95Q4l42K27K23j22
6430F1k12J81k8r7J39q0R4j52Nj38K93j64q6J67q9J98m9J8j38J59K03k57q6j47
6454b05j8J97j76J14L19l22K02r0o8J69k85L61k97K33j09j02o0K92k87K84m1k95
6476a84J24L17j80q1l6J98k02J44k8lj54k49L41R4j13J52J3j90p6L46j90p7P4
6499D0j15M00m71K36L5j5k20K37l67M05l35K28j97K96o9j98q9Q2J23R5j23k5L39
$$ plain form
6522 292 -49 -109 -215 -108 -11 7 -285 195 37 157 -160 144 49 114 -85 51 -89 125 177 48 38 -137
6544 -137 62 144 -180 -227 -88 -211 68 -141 -57 33 -147 86 238 -246 46 -18 37 -108 -81 292 -7 -72 -162
6567 -162 63 -169 -280 -190 -102 -165 -40 -145 84 -169 -151 127 2 29 -49 180 -18 227 108 122 183 -184 271
6590 271 114 -164 -150 -160 -176 -103 -106 -90 -92 -180 -65 54 -109 -187 -31 -192 21 -167 141 -60 -141 -79 -287 105
6614 105 -226 -94 100 166 74 -27 356 -157 -122 -65 276 190 81 24 -136 113 -30 228 -111 41 245 109
6636 109 194 -255 35 104 103 -223 67 -61 -33 -56 47 -95 -80 -189 -95 119 95 101 126 -155 -112 127 177 -230 -145
6661 -145 89 78 -192 -230 -84 59 -106 189 -121 105 223 -30 -69 118 -7 -403 68 -178 58 -81 -293
6682 -293 195 145 -199 126 -121 208 118 -42 98 92 180 62 72 150 -74 -75 -14 -114 33 -138 -66 -36 110 9
$$ packed form
6522B92l41o0j06J07R7J8k92M80j58J20l17L04r5O5j99J36j40K14N2j29j0j75
6544a37J99Q2l24m7J39j23K79k09Q4R0j80K33J52m84K92o4N5j45K7L73k99o5r0
6567a62K25k32j11R0Q8o3J25j05K29k53J8K78j25K7p8K29j98K45j19J4O1l67M55
6590B71j57k78J4j0j6P3lJ6kq8J15J19j63p8J56j61K13j88L08k01q1O2k08L92
6614A05l31J32J94O6r2j01L83n13L5N7L41q6j09n7j60K49j43K58l39J52K04j36
6636A09Q5m49K90O9jl26K90j28K8k3J03j42J5j09R4K14k4OK5k81M3K39N0m07Q5
6661a45K34j1k70l8J46J43j65K95l10K26J18k53l9J87j25l96M71k46K36j39k12
6682b93M88n0l44L25k47L29r0j60J40oQ8j18J0P8k24jO1j00J47j71P2L0J46j01
$$ plain form
6706 9 32 3 -69 -70 1 60 -95 129 307 -91 160 176 -265 -18 47 165 -5 23 -193 -29 -42 -51 4 -37 43 170
6732 170 63 -144 71 -22 23 56 99 -111 18 -91 -23 10 -122 -419 15 -56 153 60 62 184 -33 65 259 3
6756 3 -311 10 150 12 -229 -41 82 56 125 102 4 188 56 435 38 48 119 4 114 -266 156 52 93
6779 93 -242 221 -164 -10 -7 180 105 112 -276 -67 -50 -18 -11 -16 164 -125 -90 103 -185 -227 10 35 74 -176 230
6804 230 278 -49 -21 212 -101 -104 -136 -164 240 56 -66 300 -26 47 -98 -64 46 -126 138 -118 -28 -316 -41
6827 -41 -8 147 -165 10 -223 -70 -171 180 15 281 21 111 -92 -171 285 260 173 -174 219 -52 49 -78
6849 -78 50 -13 -219 61 115 239 0 -180 -125 54 202 98 -343 -223 143 -122 134 46 -32 217 468 212
6871 212 -86 -82 301 64 66 32 -63 -114 -72 105 113 99 36 -46 -66 -81 133 39 40 -54 -109 41 -234 -189 -120 183 61
$$ packed form
6706IK3k9p2jP1N9j55K24J78l98K51J6m41K47O5J18j70K8k16J64j3rN5m1Q0J27
6732A70j07k07K15r3M5L3M3k10J29j09O8L3j32k97M34p1K09r3KJ22k17R8J94k56
6756Cl14L21J40j38k41J88J23k6O9k3r8J84j32L79l97J0P1j15J10l80M22j04M1
6779I3l35M63l85J54LJ87p5Pl88K09J7L2PnJ80k89L5J93k88m2K37K5L9k50M06
6804B30M8l27K8K33l13ll2k8M04j84j22L66l26P3j45L4J10j72K64k56R0k88K75
6827d1L3J55l12J75k33J53j01L51j65K66k60R0k03p9M56k5q7l47L93k71J01j27
6849g8J28o3k06K80N4J24k39j80N5J79J48j04m41J20L66k65K56q8p8K49K51k56
6871B12k98ML83k37Kl4r5n1M2J77Qj4o3q2k0j5K14r4Jr4n5J50k75M5O9L03j22
$$ plain form
6898 61 -120 -15 214 -192 71 189 11 200 -224 -73 121 221 -11 57 -209 194 -8 -88 52 194 -37
6919 -37 25 37 -124 -6 19 22 -130 87 111 -201 -100 64 308 -69 -45 56 29 24 201 -168 109 -69 113 -468
6943 -468 -155 273 -44 189 -52 -158 -270 -70 178 83 -23 45 -1 1 148 173 98 -14 -133 -71 -110 -133 51
6966 51 129 -174 33 27 55 11 154 83 -25 -226 133 24 -31 -119 68 156 36 -75 -348 -228 19 -132 -192 -61
6990 -61 216 -176 -183 257 -77 -80 -103 -209 -195 -24 86 130 13 -146 -62 24 153 230 15 107 5 -82 -27 89 2
7015 2 -172 -265 11 -63 -51 230 202 -57 -214 124 -151 -183 34 -3 -16 -180 98 -56 -13 -125 167 80 -179 149
7039 149 -57 104 8 32 -67 -85 -32 -168 -45 -61 87 -2 -30 -56 98 58 50 -261 42 4 106 131 123 68 -194 -32
7065 -32 16 -239 -242 86 -126 132 -202 -362 4 -180 177 -52 103 138 -7 3 -186 66 -241 87 -139 108
$$ packed form
6898F1j81J05K29m06K63J18j78J89m24J51J94J00k32O8k66M03k02q0J40J42k31
6919c7O2J2j61J18K5Lj52K17K4l12J01J64K44l77K4J01k7nJ77l69K77j78J82n81
6943d68L13M28l17K33k41j06j12K00K48r5j06O8m6KJ47K5p5j12j19O2l9k3J84
6966E1P8l03K07oK8m4J43p1j08k01L59j09n5q8J87Q8j20j11k73J20K47j51o0J31
6990f1K77l92pM40l34lk3j06J4J71J10M4j17j59Q4Q6J29P7k15R2j02q7N5J16q7
7015Bj74r3K76p4J2K81k8k59j57L38k75l2K17l7j3j64K78j54M3j12K92q7k59L28
7039A49k06J61r6K4r9j8N3j36J23j6J48q9k8k6J54m0ql11L03l8J02K5qn5k62J62
7065c2M8k55lL28k12K58l34j60L66j84L57k29J55L5j45J0j89K52l07L28k26K47
$$ plain form
7087 108 -57 144 -149 197 -58 48 152 -126 90 101 4 -3 -5 -96 -79 -196 137 213 29 -206 54 -112 21
7110 21 111 -194 -45 51 -8 -94 -235 73 99 265 -125 -283 107 -163 -220 18 63 95 147 100 -23 -117 158 -236
7134 -236 95 241 -85 -257 -132 67 269 -34 39 -89 -227 -94 -207 20 84 155 -91 4 45 137 90 265
7156 265 -293 -88 -106 -104 -82 -45 -113 -21 -213 -74 -20 -75 88 -72 -28 142 10 43 -34 -139 -119 -34 47 -129 520
7181 520 56 58 -47 95 -119 -116 215 73 -239 93 26 -245 302 -171 115 131 46 -25 -119 -80 93 149 -50 18
7205 18 161 -163 230 135 46 -76 265 2 -190 356 -40 -76 140 -56 -239 -113 -140 -16 -82 278 41 36 266
7228 266 -72 -5 -85 -8 154 -65 32 178 -6 -100 -85 47 -144 181 117 -92 -207 -166 23 -33 -123 6 161
7251 161 -124 -160 66 100 254 -275 37 -3 -25 -276 68 116 92 -105 -36 -79 -216 -181 2 -47 -59 -24 163 -171
$$ packed form
7087A08j65K01k93L46k55J06J04k78K16J1r7pkr1J7j17L33P6j84k35K60j66J33
7110B1R0l05J49R6n9q6j41L08K6J66l90j58L90k70n7K38M5L2N2m7j23r4K75l94
7134b36L31J46l26j72J25J99K02l03P3j28j38J33j13K27O4P1k46R5M1R2m7J75
7156B65n58K05j8KK2L7o8R2j92J39N4n5J63j60M4J70j32L3p7j05K0Q5Q1j76O49
7181E20m64Kj05J42k14LL31j42l12L32o7k71N47m73K86J6q5p1r4L9J73N6j99O8
7205A8J43l24L93r5q9j22L41k63j92N46l96l6K16j96j83J26k7J24o6L60k37nK30
7228B66l38O7q0P7J62k19R7J46j84r4J5J32j91L25o4k09j15M1J89n6r0J29J55
7251A61k85l6K26L4J54n29L12m0k2k51L44M8k4j97O9m3j37L5J83m9j2L5J87l34
$$ plain form
7275 -171 163 207 86 99 114 -19 -65 8 12 -28 -32 77 -69 13 -125 71 -216 -164 275 -3 -74 -84 351 164 -7
7300 -7 -139 -150 -89 105 -304 -151 -122 -118 -92 86 48 -32 -16 65 42 -45 -68 -162 194 128 113 40 12 -143 256 69 119
7327 119 -280 136 200 -122 -191 -54 -27 0 22 27 113 94 92 23 -312 -93 291 103 244 -174 89 -160 -323 221
7351 221 21 -290 -81 16 23 20 -336 37 -39 -180 -66 -111 -270 195 10 153 -157 -288 -261 117 182 -39 91
7374 91 149 150 43 -109 -339 108 155 56 -202 223 42 113 156 -111 -3 -14 -115 -14 101 270 105 -1 19
7397 19 93 2 -34 -66 203 -59 459 -18 -130 19 106 109 -236 -213 -97 62 71 115 113 -123 -200 -89 22 -135 55
7422 55 9 -41 224 -221 170 73 16 -129 -55 -41 -2 143 -160 -33 -63 -139 -76 103 9 228 14 144 162 138 217
7447 217 -261 105 -41 -29 -187 14 -41 64 95 -481 -28 -195 93 26 -37 -43 -10 -142 -100 -98 55 237 -28 124
$$ packed form
7275a71L34M4j21J3J5j33m6P3Mm0mJ09j46Q2j38J96k87N2M39k78p1j0M35j87j71
7300gj32j1O1J94m09J53K9MK6J78l8q0J6Q1k3q7k3r4L56o6j5p3k8j55L99j87N0
7327A19l99M16O4l22o9J37K7K7K2NQ6j9ko9l35K19L84j88J41m18K63k49j63N44
7351B21k00l11K09R7Pll56L73p6j41J14m5j59M65j85J43l10j31K7L78O5k21J30
7374I1N8Jj07j52k30M47M7r9k58M25j81P1M3k67J08j1j01J01J15J69j65j06K0
7397A9P4r1l6l2K69k62N18m77j12J49Q7Ll45K3J16J59RM4kk36p7J11J11j57J90
7422E5m6n0K65m45L91r7n7j45P4J4L9J45l03J27l0p6O3J79r4K19k14J30J8k4P9
7447B17m78L66j46J2j58K01n5J05L1n76M53j67K88o7o3oL3j32M2KJ53J82k65J52
$$ plain form
7471 124 -248 115 -71 143 -27 165 99 203 -108 -122 74 -165 220 -83 -94 -74 109 -399 -177 -261 115 261
7493 261 257 -157 33 77 -139 13 -43 -251 -104 -131 42 -155 140 -131 -18 -57 -28 -53 232 22 61 30 213
7516 213 210 127 -89 -54 -205 -128 -7 91 38 -97 12 8 134 -114 164 0 112 150 136 2 214 171 32 -30
7540 -30 175 162 142 -193 19 -58 283 -68 170 112 159 20 -119 -69 39 265 -5 54 -237 33 -195 15 57
7563 57 98 39 -96 -228 103 -135 -77 -149 -26 279 73 110 -20 -129 36 -89 44 88 -229 -124 -61 36 144
7586 144 55 -117 176 8 -157 29 -222 105 22 35 -129 -46 180 75 -35 130 -258 233 -92 -221 81
7607 81 90 145 -106 104 2 36 -172 4 -158 -113 53 66 8 -148 -217 114 -1 78 -59 -197 9 87 58 -246
7631 -246 184 -8 53 53 182 -38 133 -294 -45 -94 157 60 17 -317 29 126 -52 243 -112 94 166 -272 104
$$ packed form
7471A24l72L63j86K14j70J92o6J04l11j4J96k39L85l03j1K0J83n08K22q4L76J46
7493B61mm14J90M4k16J52n6k08J47k7J73j97K95k71J13l9K9k5K85k10L9l1J83
7516B13lq3k16L5j51P7J21R8n3j35J09mJ26k48K78j64J12L8j4j34K12m3j39o2
7540c0K05j3k0l35K12p7L41l51K38n8M7j39j39N0J08K26k70N9k91K70k28K10M2
7563E7M1n9j35j32L31k38N8p2J23L05k06L7j30j09J65j25J33M4l17J05O3R7J08
7586A44q9j72K93j68j65J86k51L27q3J3j64Q3K26j05j10J65l88M91l25j29L02
7607H1RN5k51K10j02L4k08J76j62M5J66J3n8j56o9L31j15P9j37j38K06P8k9l04
7631b46M30j92O1%J29k20J71m27K49m9K51r7m3l34L46R7j78K95l55K06P2m38L76
$$ plain form
7654 104 -60 -9 352 -137 158 102 -365 -195 138 -67 256 178 -218 169 318 40 -234 -145 -13 -94 -149 -4
7676 -4 -204 171 -242 -175 206 -113 265 40 156 15 -104 -113 -147 85 68 144 160 -17 -99 64 -139 -253 4
7699 4 76 127 -40 -136 -203 101 -19 46 -55 22 -33 -6 48 72 19 -96 -98 34 -247 -45 -62 -60 165 -17 -198 147
7725 147 -53 289 -179 -42 134 -5 15 -262 -252 157 -1 74 46 -183 68 -92 148 -69 -177 -76 4 -308
7747 -308 234 -150 -100 -276 72 88 -101 105 -35 192 -64 139 93 275 105 141 -16 178 -22 -244 191
7768 191 -67 126 188 -71 -44 -121 -29 -24 -18 -104 -34 59 61 68 -199 -135 229 -159 -13 -11 22 21 -69 15 73 140 -136 129
7796 129 -362 -132 173 -288 16 192 -301 69 193 -21 100 280 -52 -170 39 -124 -127 219 3 -184 -38
7817 -38 -151 98 -68 -103 -97 -212 -274 162 -18 136 109 297 0 -143 123 -89 -17 79 249 -115 -43 -190 -45
$$ packed form
7654A04j64N1L61m89K95n6m67J70L33k05L23p8l96L87J49k78k74Q9J32q1n5J45
7676dk00L75m13O7L81l19L78k25J16j41j19rl4K32j7P6J6j77q2J63k03j14K57
7699DP2N1j67r6o7L04j20O5j01P7n5K7N4K4n3j15kJ32k81K02j7KK25j82j81L45
7725A47k00L42m68J37J76j39K0k77J0M09j58P5k8k29K51j60K40k17j08J01Q0l12
7747c08N42l84N0j76L48J6j89K06j40K27k56K03m6J82j70L6j57J94k00k22M35
7768A91k58J93O2k59K7p7R2NOq6P0R3KPk67O4L64l88J46KL3jr0Q4N8O7k76K65
7796A29m91K30L05m61L04J76m93L70J24k14J21J80l32j18K09j63lL46k16j87J46
7817c8j13K49j66l5Oj15o2M36j80J54k7J88k97j43K66k12P2R6J70l64P2j47J45
$$ plain form
7840 -45 -248 177 -93 -53 45 110 160 -189 72 -375 107 104 -141 107 -42 -71 -37 -179 -95 125 21 46 -105 21
7864 21 -15 181 -106 199 -152 -157 273 -157 337 -25 173 99 -130 -51 -2 -88 -281 -103 -2 -208 -31 -21 -324
7887 -324 -89 22 -203 -16 -141 112 -170 316 65 4 143 -12 -40 69 326 19 65 -217 -254 -154 -77 73
7909 73 -44 -55 -71 -153 91 59 -98 -111 -10 -44 160 -34 -186 -185 76 75 106 -119 -436 406 91 -82 181 -11
7933 -11 -19 -168 -87 -153 -122 -9 29 -2 -131 326 158 -11 179 -110 -56 -71 -169 82 -199 -145 -93 -120 -86 150 160
7958 160 -66 -51 103 24 -67 -5 45 116 -30 159 -29 -298 -88 -220 -314 -128 -141 94 201 116 12 42 -50 317
7982 317 -115 189 -13 -33 82 104 93 -108 94 -154 -107 -344 81 -12 -100 -138 136 -13 -152 85 -122 -170 -207
8005 -207 10 -172 -36 64 -176 -157 -78 18 243 -77 -25 6 27 165 -162 -269 -145 -81 186 248 -103 413 -21
$$ packed form
7840d5k03M25k70M0R8O5N0l49K61m47M82lk45K48j49k9L4j42Q4K20j04K5j51J26
7864B1l6J96k87L05l51nM30m30M94l62J98p4k29P9M9q6j93J78J01k06J77J0l03
7887c24K35J11k25J87j25K53k82M86k51o1J39j55k8J09K57l07M6k82l7J00P7J50
7909G3j17j1j6q2K44l2j57j3J01l4K04j94j52JK61jL1k25l17Q42l15j73K63j92
7933a1qj49Q1o6L1J13L8l1j29M57j68j69J90k89N4j5r8K51k81N4N2k7L4K36J0
7958A60k26J5J54p9r1O2N0P1j46J89j88k69K10j32r4J86j3K35J07q5j04L0r2L67
7982C17m32L04k02k0J15K2j1k01K02k48M7k37M25r3q8l8K74j49j39K37k07m8l7
8005b07K17j82J36J00k40J9P9R6K25l20N2L1K1J38l27j07J24O4K67O2l51N16m34
$$ plain form
8028 -21 122 145 11 1 -153 4 -144 -71 -170 153 -27 41 113 -269 -84 112 -145 -106 -14 466 177 170 -174 -138
8052 -138 138 20 -83 -3 -24 138 70 116 -76 29 310 -165 125 133 -37 178 59 -294 -116 -94 -50 -233 -139
8075 -139 137 -201 167 93 146 -83 -158 -106 -209 82 -164 26 203 81 136 -54 58 -91 -139 129 -136 180
8097 180 -18 121 -43 -34 118 47 52 34 7 41 -139 135 -93 -8 -88 127 15 -415 105 12 270 -36 -181 224
8121 224 53 -235 103 -36 13 -139 -29 13 -42 22 205 92 -99 -134 -86 24 -112 -41 -130 -124 54 259 24
8144 24 53 -91 -72 -176 75 -40 -25 100 -63 -98 48 5 -341 228 126 66 -97 29 181 149 -142 -17 139
8167 139 115 -129 46 100 22 -190 -424 -68 33 -39 281 -93 93 -165 -54 -117 -263 -101 -21 -154 232 -51
8189 -51 -107 5
$$ packed form
8028b1J43K3j34j0j54J57j48P3r9L23j80O8P2l82J85J96k57L9R2M80k89pl44L6
8052a38K76j18j03Q0k1J62o8M6j92J05K81m75K90Qj70K15j19l53J78K2M4j83R4
8075a39K76l38L68p4N3k29p5N2j03K91k46J90J77j22N5j90J12j49m8K68k65L16
8097A80j98J39j64RJ52p1Nj8k7L4j80K74k28Q5q0K15j12m30N20r3K58l06j45M05
8121B24j71k88L38j39M9j52J10M2n5O4J83j13j91l5M8J10j36P1q9OJ78K05k35
8144B4K9j44J9j04K51j15J5J25j63l5J46m3l46N69j02o0j63J26J52l2k91J25J56
8167A39k4k44J75N4p8k12k34L56J01p2L20l74J86k58J11o3j46J62Q0j33L86k83
8189e1n6J12
8191E
$$ Imaginary data points
##PAGE= N=2
##DATA TABLE= (X++(I..I)), XYDATA
$$ plain form
0 0 0 0 0 0 0 0 0 0 0 0 5 -8 8 -8 8 -16 16 -24 24 -32 40 -47 54 -64 72 -86 97 -113 132 -152 173 -197 224
33 224 -253 286 -321 360 -405 454 -504 563 -623 692 -765 848 -938 1034 -1139 1258 -1385
50 -1385 1526 -1680 1852 -2043 2259 -2501 2775 -3092 3460 -3895 4414 -5053 5857 -6908 8343
65 8343 -10432 13760 -19918 35150 -156793 -140506 154141 -11129 -93845 -61053 -16015 43479
77 43479 110715 -31587 -93879 88952 178980 -8005 -72806 26714 62564 56618 58446 -34940
89 -34940 -62727 38576 54081 -76427 -126603 -43734 24589 -10210 -67559 -72262 -6135 54984
101 54984 29421 -25497 -2751 55716 70978 18680 -34582 622 65248 40881 -11521 -10177
113 -10177 5080 9341 10800 -15412 -53503 -31200 18525 -11812 -63003 -30389 9987 1843 4035
$$ packed form
0@%%%%%%%%%%Nj3J6j6J6k4L2m0M8n6P2q7J01j18J36j58J83k10K45k84L25l70M21
33B24m77N39o07O81p65Q59r58J067j186J315j457J613j786J972k173K397k643
50a385K911l206L532l895M302m760N276n867O552p355Q309r467J0910j2765J5251
65H343j8775K4192l3678N5068j91943J6287K94647j65270q2716L2792M5038N9494
77D3479O7236j42302o2292J82831R0028j86985o4801R9520L5850n946J828r3386
89c4940k7787J01303J5505j30508n0176Q2869O8323l4799n7349m703O6127O1119
101E4984k5563n4918K2746N8467J5262n2298n3262L5204O4626k4367n2402J344
113a0177J5257M261J459k6212l8091K2303M9725l0337n1191L2614M0376q144K192
$$ plain form
126 4035 4155 -9299 23911 53016 9367 -26545 11163 40804 10303 -10193 1529 753 3882
139 3882 11851 -16643 -27245 8185 12525 -21880 -28310 -7990 315 176 -404 -5293 -2211 19048
153 19048 18924 -2095 -1077 13742 11770 4402 -1535 -4852 1938 5792 -2210 -8956 -4568 5154 3931
168 3931 -6111 -10695 -5405 3378 2535 -4672 -3581 3159 3760 4015 1662 -2355 4558 8382 -281 -7435
184 -7435 -272 3813 -905 -1731 -1092 -2365 194 6164 -557 -6041 3336 4838 -2823 -1660 1522 -17
200 -17 835 2313 -1854 -3362 3863 4026 -4414 -4053 1913 -193 -2074 -112 -666 -569 1909 1318 -675
217 -675 724 3216 2099 -1261 -574 1278 281 -109 -350 -1261 -889 -288 -320 -918 -1270 -613 411 -912
235 -912 -886 927 1391 34 772 1051 665 1089 1529 510 -848 152 619 -1310 -1307 54 -866 -1184 -391
$$ packed form
126D035J20j3454L3210K9105m3649l5912L7708K9641l0501k0496J1722p76L129
139C882P969k8494j0602L5430M340l4405o430K0320Q305j39n80m889L082K1259
153A9048j24k1019J018J4819j972p368n937l317O790L854q002o746M388R722j223
168C931j0042m584N290Q783q43p207J091O740O01K55k353m017O913L824q663p154
184g435P163M085m718q26O39j273K559N970o721n484R377J502p661J163L182j539
200a7Q52J478m167j508P225J63q440L61N966k106j881J962n54R7K478n91j993
217f75J399K492j117l360O87J852r97l90k41r11L72O01l2n98l52O57J024j323
235i12K6J813M64j357P38K79l86M24M40j019j358J000M67j929LJ361r20l18P93
$$ plain form
254 -391 -227 -562 6 685 242 -93 803 1170 37 526 1236 319 -64 490 156 -385 -258 -713 -930 -1022
274 -1022 -702 -914 -1060 -780 -158 -284 413 1016 1150 1077 968 1055 919 816 629 379 -330 -884 -895 -903 -808 -913
296 -913 -941 -1084 -1235 -837 -308 -1112 25 502 -131 75 1109 1634 1608 1392 1223 1059 833 746 134 -1369
316 -1369 -693 -1094 -2205 -1739 -704 -937 -936 -759 -624 -307 156 529 122 -140 928 1268 1079 1609 1478 1206
336 1206 1084 558 408 252 -77 -870 -1649 -2128 -1121 -1319 -1293 -866 -679 -445 -242 -119 554 685 -102 586
356 586 771 1077 1354 746 840 1463 995 744 604 324 -424 -978 -1604 -849 -887 -1151 -918 -1274 -487 -517 -400
377 -400 774 262 187 528 317 637 1683 959 678 981 1115 1004 658 761 413 -653 -680 -698 -1579 -890
397 -890 -567 -1069 -1291 -207 -201 -34 273 431 269 50 696 1063 306 1062 988 310 819 1069 925 121 -372
$$ packed form
254c91J64l35N68O79m43l35Q96L67j133M89P10r17l83N54l34n41J27m55k17r2
274a022L20k12j46K80O22j26O97O03J34p3j09Q7j36j03j87k50p09n54j1qR5j05
296i13k8j43j51L98N29q04J137M77o33K06J034N25k6k16j69j64k26q7o12j503
316a369O76m01j111M66J035k33JJ77J35L17M63L73m07k62J068L40j89N30j31k72
336A206j22n26j50j56l29p93p79m79J007j98K6M27J87K34K03J23O73J31p87O88
356E86J85L06K77o08R4O23m68k51j40k80p48n54o26P55l8k64K33l56P87l0J17
377d00J174n12p5L41k11L20J046p24k81L03J34j11l46J03l48j066k7j8q81O89
397h90L23n02k22J084OJ67L07J58j62k19O46L67p57P56p4o78N09K50j44q04m93
$$ plain form
418 -372 -407 -630 -1064 -1030 -868 -1209 -1146 -581 -884 -304 529 216 -158 84 1279 829 646 1356 1202 486 967
439 967 962 56 406 386 -198 -908 -437 -579 -954 -1078 -548 -970 -704 201 -282 -125 486 294 317 880 1002 1031
461 1031 683 800 999 149 577 619 -180 -351 -635 -636 -864 -885 -897 -577 -910 -605 -131 -314 12 160 336 523
483 523 490 799 885 664 809 735 -135 427 557 -188 -628 -404 -572 -805 -599 -476 -747 -640 -237 -424 -270
504 -270 722 437 -405 302 777 67 256 929 528 -10 283 538 -126 -3 170 -489 -732 -172 -157 -738 -224
525 -224 -328 -379 -358 132 429 70 99 282 109 -175 366 601 197 417 309 211 -265 571 97 -379 -383 108
547 108 -233 -419 129 -80 -421 -287 275 52 -335 234 94 -542 153 649 55 -209 815 103 -355 140
567 140 472 -381 -4 210 -403 -400 -236 139 -558 -34 121 -124 -251 336 199 -133 -18 361 -260 214 329
$$ packed form
418c72l5k23m34L4J62l41O3N65l03N80Q33l13l74K42J195m50j83P10j54p16M81
439I67nr06L50k0n84p10M71j42l75j24N30m22K66R05m83J57O11j92K3N63J22K9
461A031l48J17J99q50M28M2p99j71k84jk28k1j2L20l33L05M74j83L26J48J76J87
483E23l3L09Q6k21J45p4q70N62J30p45m40K24j68k33K06J23k71J07M03j87J54
504b70R92k85q42P07M75p10J89O73m01n38K93K55o64J23J73o59k43N60J5n81N14
525b24j04n1K1M90K97l59K9J83j73k84N41K35m04K20j08r8m76Q36m74m76mM91
547A08l41j86N48k09l41J34N62k23l87N69j40o36O95M96n94k64J024p12m58M95
567A40L32q53L77K14o13LJ64L75o97N24J55k45j27N87j37l32J15L79o21M74J15
$$ plain form
588 329 143 -450 190 373 17 62 54 -121 -318 -163 85 -502 -249 -62 -198 -304 -70 154 145 -175 -42 131
610 131 -182 389 527 429 -167 402 362 -223 121 80 -344 -79 -3 -125 -303 -122 -67 -356 -213 397 56 -226
632 -226 164 420 82 204 351 165 109 307 6 -545 97 435 -244 -280 -306 -51 -162 103 -110 -347 -33
653 -33 506 -399 534 507 334 -16 305 409 489 210 865 621 -310 -457 -374 872 -165 -603 -472 -151 -990
674 -990 -297 -13 -793 -183 -301 -7 253 758 332 328 623 -180 -132 279 219 224 -623 35 117 -464 -338 555 18
697 18 -642 -372 34 -743 171 239 479 -204 445 281 -211 243 712 339 171 371 -166 -362 224 445 -260
718 -260 375 -139 -69 -546 -108 225 -875 -29 903 -148 -126 -201 -98 -550 116 647 -99 422 -88 339 502
739 502 -240 778 -419 -101 -266 211 -533 -383 -522 -13 -188 -366 273 287 -181 79 -339 -184 442 -249
$$ packed form
588C29j86n93O40J83l56M5qj75j97J55K48n87K53J87j36j06K34K24rl20J33J73
610A31l13N71J38r8n96N69m0n85L44m1m24K65P6j22j78J81N5k89J43O10l41k82
632b26L90K56l38J22J47j86n6J98l01n51O42L38o79l6k6K55j11K65k13k37L14
653c3N39r05R33k7j73l50L21J04Q0k79O55k44r31j47Q3J246j037m38J31L21q39
674i90O93K84p80O10j18K94K60N05m26mK95q03M8M11o0Nq47O58Q2n81J26Q93n37
697A8o60K70M06p77R14O8K40o83O49j64m92M54M69l73j68K00n37j96N86K21p05
718b60O35n14P0m77M38L33j100Q46R32j051K2p5J03m52O66N31p46N21n10M27J63
739E02p42J018j197L18j65M77p44J50j39N09j75j78O39J4m68K60m18J55O26o91
$$ plain form
759 -249 235 953 -61 -475 -151 -98 390 -497 86 202 -99 159 423 500 -322 -469 -365 -241 36 530 -33
780 -33 -303 -791 -578 498 342 368 369 250 321 223 274 448 -203 -140 132 105 -239 -581 -58 -5 -51 -105 63 -409
804 -409 287 -31 -47 771 667 555 465 13 34 292 269 -33 48 197 -702 260 -432 -221 -301 -188 -391 -116
826 -116 -21 328 420 654 -243 -21 404 -45 831 134 227 724 -656 -409 -157 17 -95 341 225 -122 -162
847 -162 -259 -347 -173 -204 798 189 -360 -35 -161 -252 -265 564 61 350 361 597 -21 -175 -431 -90 -212 231
869 231 -40 -53 81 -10 460 24 398 243 -116 -156 106 -218 46 389 -272 254 -362 100 750 431 -45
890 -45 -165 24 103 146 -122 -392 -254 -120 34 490 1094 -168 446 -24 183 771 158 166 -71 723 -92 167
912 167 -61 269 -74 -177 385 -265 29 -156 -86 -408 -67 -84 248 -258 1030 -182 178 -162 -342 536
$$ packed form
759b49M84P18j014m14L24N3M88q87N83J16l01K58K64P7q22j47J04J24K77M94n63
780c3k70m88K13J076j56K6Jj19P1r8N1J74o51O3K72k7l44l42N23N3m6n4J68m72
804d09O96l18j6Q18j04j12r0m52K1K58k3l02Q1J49q99R62o92K11q0J13k03K75
826a16R5L49R2K34q97K22M25m49Q76o97R3M97j380K47K52J74j12M36j16l47m0
847a62r7q8J74l1J002o09n49L25j26r1j3Q29n03K89J1K36o18j54k56L41j22M43
869B31k71j3J34r1M70m36L74j55l59m0K62l24K64L43o61N26o16M62O50l19m76
890d5j20J89P9M3k68k70J38J34J54M56O04j262O14m70K07N88o13Qk37P94q15K59
912A67k28L30l43j03N62o50K94j85P0l22L41j7L32n06J288j212L60l40j80Q78
$$ plain form
932 536 404 356 180 140 294 -7 242 -120 -95 -51 201 -156 -836 -197 183 336 -87 -135 34 521 -138 120
954 120 -617 327 647 -204 -65 853 -373 269 -286 -273 -286 74 -323 103 -20 68 -80 -112 365 19 -105
975 -105 380 -24 72 232 493 -54 -340 261 183 101 -714 196 5 48 -125 63 31 -37 -517 -103 296 -248
997 -248 -65 -123 32 -322 -366 -605 540 -40 -159 -460 -1010 982 103 -254 426 -22 449 646 -10 459
1017 459 345 -210 -551 160 -55 388 -365 -535 62 -580 -591 -561 231 -113 278 166 292 553 494 494 223 -31
1039 -31 -166 373 78 -668 -172 -95 -12 -23 115 59 -121 352 -115 -708 192 65 72 297 272 252 317 551 545 389
1063 389 -38 135 -58 60 91 351 -11 115 -261 169 -14 93 27 -304 -328 55 60 114 181 55 408 174
1085 174 83 11 135 477 -63 -15 -49 -72 -164 -145 12 -148 -133 -35 30 -59 237 88 -312 -18 15 3 -96 144 85
$$ packed form
932E36j32m8j76m0J54l01K49l62K5M4K52l57o80O39L80J53m23m8J69M87o59K58
954A20p37R44L20q51J39R18j226O42n55J3j3L60l97M26j23Q8j48l2M77l46j24
975a05M85m04R6J60K61n47k86O01p8q2q15R10j91M3j73J88l2o8m80M14L99n44
997b48J83n8J55l54m4k39J145n80j19l01n50J992q79l57O80m48M71J97o56M69
1017D59j14n55l41P11k15M43p53j70N97o42j1L0P92l44L91j12J26K61n9%k71k54
1039c1j35N39k95p46M96P7Q3j1J38n6j80M73m67n93R00j27PK25k5k0O5K34oj56
1063C89m27J73j93J18L1K60l62J26l76M30j83J07o6l31k4L83NN4O7j26L53k34
1085A74r1p2J24L42n40M8l4k3r2J9J57j60J5R8O5q9K96j49m00K94L3j2r9K40n9
$$ plain form
1110 85 265 258 -86 -31 146 -4 -27 -157 -241 -30 -265 67 -119 -276 -230 68 -178 -132 186 166 156 22 247
1133 247 216 1 234 176 101 -54 162 -71 -143 65 -179 -296 -93 -36 48 -104 157 66 -103 -133 55 -259 -18
1156 -18 102 85 -31 -167 79 -192 -62 -249 200 179 79 -188 -48 -184 -258 -119 -150 -169 103 -65 -148 168
1178 168 212 -198 -173 357 107 -62 28 -87 21 206 107 -240 28 373 -87 44 -68 -1 15 59 -230 -185 179
1201 179 -107 -31 -76 -125 138 -67 287 135 69 132 30 -67 241 23 118 -21 -153 -52 60 13 -160 -44 121
1224 121 -169 74 -121 -118 -124 -6 40 -117 -76 0 181 132 37 -153 48 -44 -40 140 27 109 256 -98 63 42 -226
1249 -226 266 -143 45 25 102 -2 -172 296 -61 -53 -98 22 171 4 -56 52 44 -197 244 -75 -102 272 79
1272 79 326 314 -123 -57 18 -137 -138 -250 14 133 -77 64 15 -192 -279 -108 194 -111 88 -63 -111 114 106 118
$$ packed form
1110H5J80pl44N5J77j50k3j30q4K11k35L32j86j57M6K98k46M6L18k0j0j34K25
1133B47l1k15K33n8p5j55K16k33p2K08k44j17K03N7Q4j52K61r1j69l0J88l14K41
1156a8J20j7j16j36K46k71J30j87M49k1j00k67J40j36p4J39l1j9K72j68q3L16
1178A68M4m10K5N30k50j69R0j15J08J85r9l47K68L45m60J31j12O7J6M4k89M5L64
1201A79k86P6m5m9K63k05L54j52o6O3j02r7L08k18R5j39j32J01J12m7j73J16J65
1224A21k90K43j95LoJ18M6j57M1P6J81m9r5j90K01r2MJ80j13Q2J47l54J61k1k68
1249b26M92m09J88k0P7j04j70M68l57Qm5J20J49j67o0J08qk41M41l19k7L74j93
1272G9K47j2m37O6P5j55jj12K64J19k10J41m9k07q7J71L02l05J99j51m8K25qJ2
$$ plain form
1296 118 65 -234 -30 226 53 -254 -235 259 193 -117 18 47 -248 -3 27 -103 -145 16 -41 188 48 -72
1318 -72 -369 97 27 -138 162 86 146 171 29 224 42 -238 130 -83 246 12 -92 -224 115 -32 92 70
1340 70 -8 -45 -24 -226 -201 -137 -115 64 200 17 13 -203 103 111 176 218 -106 135 -113 170 69 -168 -8 -86 43
1365 43 15 -189 47 -287 152 -250 -53 -65 43 -14 369 98 -85 25 85 -16 -94 169 33 70 38 111 -228
1388 -228 158 86 42 -148 58 173 -213 -54 62 -190 20 6 82 90 11 326 -99 -265 -145 132 -17 76 191
1411 191 70 -49 172 -79 -159 98 81 -55 -125 -185 -45 -161 85 38 -240 -109 -58 -19 164 -56 18 168 261
1434 261 17 -29 133 56 71 -135 -103 -5 -22 -36 -197 -102 2 -49 44 -201 147 86 -170 182 55 79 119 132 54
1459 54 -13 144 -30 52 -8 163 204 129 -22 -127 -151 -197 194 170 -118 -113 2 -108 122 36 221 -117 -254 96
$$ packed form
1296A18n3k99K04K56j73l07J9M94o6l10J35K9k95K45L0j30m2J61n7K29j40j20
1318g2k97M66p0j65L00p6O0K5j42J95j82k80L68k13L29k34j04j32L39j47J24k2
1340G0p8l7K1k02K5O4K2J79J36j83mk16L06QO5M2l24K41k48K83j01k37J60p8J29
1365D3k8k04K36l34M39m02J97j2J08n7L83k71j83J10O0j01p8K63j36L7l2P3l39
1388b28L86p2m4j90K06J15l86J59J16k52K10j4P6Qp9L15m25j66J20K77j49R3J15
1411A91j21j19K21k51q0K57j7j36p0o0J40j16K46m7k78J31N1L9J83k20P4J50R3
1434B61k44m6J62p7J5k06L2R8j7j4j61R5J04n1R3k45L48o1k56L52j27K4M0J3p8
1459E4o7J57j74Q2o0J71M1p5j51j05k4m6L91k4k88NJ15j10K30q6J85l38j37L50
$$ plain form
1483 96 368 -41 91 -69 -281 -23 165 217 93 132 96 -123 13 -4 -121 143 -29 -15 4 -18 137 -152 -126
1506 -126 -19 -209 3 110 279 -157 103 -50 111 251 28 159 -230 85 -78 -40 -357 22 -98 -30 98
1527 98 50 -61 -30 -204 -85 144 210 -37 126 274 -60 318 -13 114 -384 -107 -123 -45 23 175 -121 -143 -26
1550 -26 106 83 -82 -114 -289 2 83 330 65 -37 166 -204 22 -37 53 36 -29 355 -48 -76 -286 -56 -325
1573 -325 67 129 -37 178 -309 -48 -205 -33 -313 202 -162 -26 134 -139 205 -31 -220 265 -220 47
1593 47 -18 -136 6 167 57 63 -12 -112 4 66 -328 51 148 166 -23 138 -29 76 -9 29 -71 17 180 -49
1617 -49 -175 253 77 -10 11 37 -322 -30 52 -69 -270 218 37 -214 -117 -144 -80 119 -171 -37 -51 -31 -150
1640 -150 -167 -218 72 125 201 -16 25 -69 93 -48 -228 -73 -116 -106 -236 -16 -6 -102 117 -154 -77 -88 75 60
$$ packed form
1483I6K72m09J32j60k12K58J88N2j24L9l6k19J36j7j17K64j72J4J9k2J55k89K6
1506a26J07j90K12J07J69m36K60j53J61J40k23J31l89L15j63L8l17L79j20O8J28
1527I8m8j11L1j74J19K29O6k47J63J48l34L78l31J27m98K77j6P8O8J52k96k2J17
1550b6J32k3j65l2j75K91Q1K47k65j02K03l70K26n9R0j7o5L84m03k8k10K30k69
1573c25L92O2j66K15m87K61j57J72k80N15l64J36J60k73L44k36j89M85m85K67
1593D7o5j18J42J61j10Op5j00J16O2l94L79R7J8j89J61j67J05q5L8j00Q8J63k29
1617d9j26M28j76q7K1K6l59K92Q2j21k01M88j81k51R7k7O4J99k90J34j4K0j19
1640a50j7n1K90N3P6k17M1r4J62j41j80J55m3J0j30K20J0r6K19k71P7j1J63j5
$$ plain form
1664 60 -182 -68 -18 82 116 167 189 -135 -74 33 165 -245 -240 8 -184 182 80 120 45 -126 -455 167 44
1687 44 289 -61 37 71 349 282 -9 200 -120 64 -15 -208 157 1 5 269 -328 -149 -132 27 265 -150 -145
1710 -145 61 31 -26 61 82 -143 83 136 175 162 -73 -24 -102 -143 152 20 179 -95 -125 -122 -117 -192 58 -12 -129 -16
1736 -16 -105 -15 307 -150 135 324 -71 132 356 53 143 15 59 42 -118 -252 -327 -161 -213 123 -77 -246 -93
1759 -93 -11 293 -44 12 -57 93 -157 116 -100 11 28 -73 -45 -19 -21 34 386 38 211 134 -34 -32 -100 -283 -62
1784 -62 -2 40 -72 -203 -130 19 42 -366 -121 177 138 -178 34 102 -1 -55 50 41 148 -180 -185 185 76 -124
1808 -124 -29 -145 -82 -241 -216 -87 -39 -71 -309 -3 69 15 34 -1 -111 -160 -120 254 -19 -140 -172 50 85 -100
1832 -100 -56 -221 70 74 3 -152 -53 229 -35 135 -75 -145 78 94 -110 137 32 61 -130 67 -52 -173 -66
$$ packed form
1664F0k42J14N0J00L4N1K2l24O1J07J32m10NK48j92L66j02M0p5j71l29O22j23
1687D4K45l50R8L4K78o7k91K09l20J84p9j93L65j56MK64n97J79J7J59K38m15N
1710a45K06l0n7Q7K1k25K26N3L9j3k35M9p8m1K95j32J59k74l0LNp5K50p0j17J13
1736a6q9R0L22m57K85J89l95K03K24l03R0j28M4j7j60j34p5J66n2L36k00j69J53
1759i3Q2L04l37N6o9J50k50K73k16J11J7j01K8K6kN5L52l48J73p7j68Ko8j83K21
1784f2O0M2j12j31P3J49K3m08K45K98l9l16K12O8j03n4J05rJ07l28nL70j09k00
1808a24R5j16O3j59K5J29M8l2k38L06P2n4J9l5j10m9M0L74k73j21l2K22L5j85
1832a00M4j65K91Mp1j55R9K82k64J70k10p0K23J6k04K47j05K9j91J97j19j21J07
$$ plain form
1855 -66 4 -12 -250 83 -58 117 91 -294 140 -360 -19 -271 -422 -26 -231 119 -134 131 128 10 -56 -90 218
1878 218 10 -44 -125 29 -122 88 -142 -206 -86 34 104 134 -158 -61 -51 -138 -101 247 -184 63 150 222 -20 211
1902 211 106 -43 -14 4 -176 -234 21 -111 -54 16 17 197 71 35 12 190 -233 -9 20 -190 27 77 -95 -98
1926 -98 313 -229 288 148 168 -187 167 165 48 50 -277 -14 87 459 -17 26 -195 -65 -49 -58 -34 -97 -141 -102 184
1951 184 -51 179 50 -179 -60 -136 -7 45 27 -79 114 89 -216 -117 -116 311 -21 -125 94 -68 -338 21
1973 21 -49 -47 11 81 -86 -42 -167 -55 -252 -50 5 -36 146 -76 -43 66 78 -127 102 190 223 195 -64 -40 -19
1998 -19 201 -191 -75 175 46 -334 142 99 85 -2 -19 -23 97 105 68 243 23 189 166 -217 -106 140 68 -162
2022 -162 139 92 147 -154 33 -49 -329 101 -161 145 77 76 152 -241 577 -5 119 45 16 -139 -32 -112 66
$$ packed form
1855f6P0j6k38L33j41J75k6l85M34n00L41k52j51L96k05L50k53K65lj18o6l4L08
1878B18k08n4q1J54j51K10k30o4J20J20P0L0k92R7J0q7L7L48m31K47Q7P2k42K31
1902B11j05j49K9J8j80n8K55j32N7P0JJ80j26l6k3J78m23K24K9k10K17N0j72l
1926i8M11n42N17j40K0l55L54kj17Kl27K63J01L72m76M3k21J30J6rK4o3m4L9K86
1951A84k35K30j29k29J19p6J29N2j8j06J93k5l05R9JM27l32j04K19j62k70L59
1973B1p0KN8P0j67M4j25J12j97K02N5m1J82k22L3J09J2k05K29Q8L3k8k59K4K1
1998a9K20l92J16K50j29l80M76m3j4q7j7mJ20Ql7J75k20J66k3l83J11K46p2k30
2022a62L01m7N5l01J87q2k80M30k62L06o8jP6l93Q18n82J24p4k9j55J07q0J78
$$ plain form
2045 66 -83 21 -110 183 -70 -123 15 -78 -32 42 27 -172 95 -124 221 31 -114 -166 -19 -31 -154 -22 6
2068 6 103 99 -156 267 -151 95 -64 -96 305 -263 -67 -168 -17 -132 161 -66 -209 55 101 395 315 379 38
2091 38 195 -46 168 87 114 -373 -110 4 -62 -156 -123 -147 126 -72 -28 -14 -126 -75 20 -59 122 183 -112 11
2115 11 47 -10 -91 7 -189 263 -44 149 13 -114 -100 210 -307 9 -235 -128 180 -121 61 157 90 27 -72
2138 -72 -89 -237 82 -43 255 -21 51 179 -460 127 -674 16 362 -330 -198 -218 224 256 -92 -440 -487 58
2160 58 -56 -329 474 556 74 -16 -27 -784 107 -312 133 -227 22 529 -161 -484 35 -118 -23 73 -155 190
2182 190 -513 -224 84 222 -243 277 -609 92 521 -75 -234 305 2 87 -505 -267 -73 212 53 -31 293
2203 293 149 -260 -272 96 116 -261 24 -6 -217 462 280 125 -457 356 1015 64 8 339 292 185 179 235 -48
$$ packed form
2045F6j49J04j31K93k53n3J38r3M6P4j5j99K67k19L45j90j45n2J47j2j23J32K8
2068FR7mk55M23m18K46j59l2M01n68J96j01J51j15K93k27j43K64M6K94q0O4l41
2091C8J57k41K14q1K7m87K63J14o6r4L3k4K73j98M4J4j12N1R5p9J81O1k95J23
2115A1L6n7q1R8j96M52l07J93j36j27J4L10n17L16k44J07L08l01J82R6o7o3r9
2138g2j7j48L19j25K98k76P2J28o39N87q01O90L46o92J32k0M42L2l48l48m7N45
2160E8j14k73Q03Q2m82r0j1p57Q91m19M45l60K49N07o90l23N19j53R5R6k28L45
2182A90p03K89L08J38m65N20q86P01M29n96j59N39l03Q5n92K38J94K85j59q4L24
2203B93j44m09j2L68K0l77K85l0k11O79j82j55n82Q13O59r51n6L31m7j07oN6k83
$$ plain form
2226 -48 588 -428 400 -253 -27 171 -81 68 399 464 -452 -9 297 -245 -109 135 -28 -439 -305 414
2246 414 -189 576 402 129 -443 -49 -107 -216 790 -238 -730 784 -483 255 643 -177 301 67 731
2265 731 278 159 336 -611 -241 -142 996 490 -61 343 254 117 1065 54 -133 -288 516 -89 -417 -84
2285 -84 308 -418 -432 -234 368 -206 68 364 -88 -322 158 240 -497 437 -101 -370 -24 136 515 101 -270
2306 -270 -286 238 -272 -13 37 -99 125 26 -99 -110 127 116 -206 -183 6 95 43 57 80 19 89 163 -39 94
2330 94 235 161 149 5 318 -199 273 -90 -350 -49 -11 -50 19 -233 18 -87 -141 -143 -62 -61 204 225 277 128 153
2355 153 159 -263 148 160 294 -130 43 -28 -224 -74 -38 -88 -142 250 -246 -205 337 -347 43 69 -159 332 19
2378 19 -54 75 3 284 66 -34 -15 -71 -21 -115 -85 -274 156 -101 54 -91 -166 -23 -215 -13 94 95 -65 74
$$ packed form
2226d8O36j016Q28o53K26J98k52J49L31O5r16M43L06n42J36K44j63m11J34P19
2246D14o03P65j74k73n72L94n8j09J006j028m92J514j267P38L88q20M78k34O64
2265G31m53j19J77r47L70R9J138n06n51M04q9j37R48j011j87j55Q04o05l28L33
2285h4L92p26j4J98O02n74K74K96m52k34M80Q2p37R34n38k69L46J60L79m14l71
2306b70j6N24n10K59N0j36K24r9j25j1K37j1l22K3J89Q9n2J4K3o1P0P4k02J33
2330I4J41p4j2j44L13n17M72l63k60L01L8l9O9k52K51j05n4kQ1JK65K1N2j49K5
2355A53Om22M11J2J34m24J73p1j96J50L6n0n4L92m96M1N42o84L90K6k28M91l13
2378A9p3J29p2K81k18j00J9n6N0r4L0j89M30k57J55j45p5J43j92K02J07Jj60J39
$$ plain form
2402 74 -257 280 -30 111 42 133 221 -2 112 -88 188 65 70 80 -23 -99 -302 200 25 63 -159 -235 213
2425 213 70 285 147 -331 -124 125 -26 -37 -210 36 -10 -19 -137 214 29 114 275 -187 -145 -121 -153 -180 -171 -105
2449 -105 -122 287 -141 -1 12 -205 -210 178 -56 -88 194 119 -63 35 -19 150 -209 -12 -69 -6 -177 -21 75 -5
2473 -5 -216 218 -8 217 5 -48 11 -154 52 -199 72 -111 153 -191 200 31 -38 28 -126 12 94 -44
2495 -44 55 88 -162 -173 -162 -99 -79 46 38 -75 -63 -184 61 -81 -96 -77 -41 -59 105 218 -4 -44 127 265 -100
2520 -100 104 -216 -29 -111 -166 120 87 43 -104 12 72 115 203 -141 17 0 195 139 175 6 -197 -240 -71 308
2544 308 -152 -116 -386 -13 -303 137 82 131 -91 -87 173 -84 -131 84 -72 122 195 -134 12 -70 -11 -122 31
2567 31 15 -82 -220 56 -40 169 -10 4 8 58 -248 -102 62 126 -80 -14 -70 181 -48 -103 -5 19 276 23 83
$$ packed form
2402G4l31N37l10J41o9R1Q8k23J14k00K76j23NJ0j03p6k03N02j75L8k22p6M48
2425B13j43K15j38m78K07K49j51j1j73K46m6rj18L51j85Q5J61m62M2K4l2k7RO6
2449a05j7M09m28J40J3k17nL88k34l2K82p5j82R8n4J69l59J97n7O3j71J56R6q0
2473ek11M34k26K25k12n3N9j65K06k51K71j83K64l44L91j69o9O6j54J38Q2j38
2495d4R9L3k50j1J1O3K0J25qj13J2j21K45j42j5J9L6j8J64J13k22m0J71J38l65
2520a00K04l20J87q2n5K86l3m4j47J16O0M3Q8l44J58j7J95n6L6j69k03m3J69L79
2544C08m60L6k70L73k90M40n5M9k22MK60k57m7K15j56J94P3l29J46q2N9j11J53
2567C1j6r7j38K76r6K09j79J4MN0l06J46J64O4k06O6n6K51k29n5R8K4K57k53O0
$$ plain form
2592 83 214 20 18 159 -194 44 -108 -58 15 -42 -94 -104 -42 -196 218 81 243 62 -43 78 -27 204 -202
2615 -202 38 245 -16 133 57 -71 -64 12 155 -231 -103 -167 84 -176 -59 83 53 176 -152 194 96 -70
2637 -70 -113 -14 -35 77 47 -117 186 81 -81 99 -120 111 -37 -255 -172 71 -115 -195 45 -13 -55 -175 -170 72
2661 72 43 -62 -98 -42 -120 189 26 -50 -69 -327 16 203 -33 52 -202 144 -155 -85 -508 -112 183 55 -166
2684 -166 97 -35 -17 -48 -142 102 190 336 72 268 177 95 183 191 93 160 223 115 72 199 -148 -116 40 -209 47
2709 47 -63 235 -62 -90 -207 -174 -165 168 -50 -367 16 114 -19 37 133 74 -50 -122 77 -137 138 -98 98
2732 98 4 82 -122 -34 -324 -260 -182 -2 151 81 293 -29 197 209 112 115 -125 38 -17 -26 14 -294 29 110 -65
2757 -65 -142 129 76 -56 250 -129 180 -205 -43 -14 -166 155 -13 -142 -74 -124 -98 -195 -62 12 51 143 166 -65
$$ packed form
2592H3J31j94kJ41l53K38j52N0P3n7n2j0O2j54M14j37J62j81j05J21j05K31m06
2615b02K40K07k61J49p6j28PP6J43l86J28o4K51k60J17J42l0J23l28L46r8j66
2637g0m3R9k1J12l0j64L03j05j62J80k19K31j48k18Q3K43j86q0K40n8m2j20NK42
2661G2k9j05l6N6p8L09j63p6j9k58L43J87k36Q5k54L46k99P0m23L96K95j28k21
2684a66K63j32J8l1r4K44Q8J46k64J96r1q2Q8Qr8O7O3j08m3J27l47L2J56k49K56
2709D7j10K98k97k8j17L3RL33k18l17L83R8j33N6R6n9j24p2J99k14K75k36J96
2732I8r4P8k04Q8k90O4P8J80J53p0K12l22K26J2r7Lk40J63n5rM0l08L23Q1j75
2757f5p7K71n3j32L06l79L09l85J62K9j52L21j68j29O8n0K6r7J33P4L9R2K3k31
$$ plain form
2781 -65 -203 -200 -40 12 -24 -18 30 -15 -141 -53 -154 -10 122 197 -46 0 -69 -237 -193 272 -144 117 -242 13 -41
2806 -41 -38 127 174 9 221 89 -85 -137 -266 72 -59 -11 -15 101 49 -39 27 -212 -7 -85 -106 -56 132 47 113
2831 113 11 -159 -102 -126 90 298 198 183 107 158 -110 -19 -101 139 -9 -42 -21 172 -30 -95 24 -192 -129 -29
2855 -29 110 48 46 50 97 380 -257 -26 -61 112 2 -247 -275 -43 151 -101 -16 110 -55 -92 -74 83 -8 43 -21
2880 -21 -39 13 -106 170 75 208 -34 -73 -45 99 -72 -22 203 53 -128 -80 -225 36 -70 -76 101 220 -181
2903 -181 -52 -176 -84 9 20 29 4 23 -194 31 103 -230 244 -137 144 232 -222 -126 57 -295 -183 -212 -120 -276
2927 -276 -106 -205 -437 -234 -45 9 379 121 195 131 96 116 74 83 119 275 -51 174 196 18 22 -112 -266 -203 -11
2952 -11 -183 -385 88 313 -126 -76 46 -280 -81 112 -57 -21 31 -83 -68 230 -18 -215 -18 245 95 -81
$$ packed form
2781f5j38LJ60N2l6OM8m5j26Q8j01J44J32P5k43M6o9j68M4M65m16K61l59K55n4
2806d1LJ65M7j65K12j32j74n2j29L38j31M8mJ16n2q8O6k39K05p8k1N0J88q5O6
2831A13j02j70N7k4K16K08j00j5p6N1k68R1q2K40j48l3K1J93k02o5J19k16O3J00
2855b9J39o2kMM7K83o37K31l5J73j10k49k8K32J94k52Q5J26j65l7J8J57r1N1o4
2880b1j8N2j19K76r5J33k42l9K8J44j71N0K25j50j81M8j45K61j06oJ77J19m01
2903a81J29j24R2R3J1Rk5J9k17K25P2l33M74l81K81Q8m54R6J83l52J12k9R2j56
2927b76J70r9k32K03J89N4L70k58P4o4l5K0m2RL6J56l26K25K2j78Mj34j54O3J92
2952a1j72k02M73K25m39N0J22l26J99J93j69L6N2j14J5K98k48j97J97K63j50j76
$$ plain form
2974 -81 2 38 -34 -51 -39 13 -94 -51 -1 42 29 -148 -142 51 -132 -53 -76 -127 -135 -47 161 -110 163 -33 236 -4
3000 -4 35 75 11 -37 121 -72 241 -103 -35 145 -31 333 45 98 32 14 -42 -142 -172 77 61 30 141 55 -330
3025 -330 120 -134 -242 -182 -355 41 83 141 -31 352 132 -43 126 52 90 202 -141 80 328 -199 -56 291
3047 291 -59 212 -321 -60 5 -24 63 -4 12 16 -130 -123 -56 0 -42 44 17 138 79 -139 199 -101 -181 26 488
3072 488 122 -180 132 -397 100 46 -30 17 24 -279 -78 3 -53 -87 140 170 -396 133 57 -180 -102 17 64 140
3096 140 30 -169 85 2 -81 -274 -62 86 -78 -111 57 4 -66 281 77 139 -35 242 145 117 142 128 71 -92
3120 -92 -106 -19 98 -3 -161 -146 17 3 89 -162 -166 -154 -202 -110 -96 -179 -6 153 72 5 -40 169 172 -47 9 168
3146 168 -64 156 88 -98 45 -202 -46 -100 110 -17 11 -49 -62 -167 -13 95 188 11 258 317 198 -103
$$ packed form
2974h1Q3L6p2j7J2N2j07M3N0M3j3j77OJ93j83P9k3n1qQ8K08k71K73j96K69k40
3000dL9M0o4m8J58j93L13l44O8J80j76L64k88N3o6j8n6j00l0K49j6l1J11q6l85
3025c30M50k54j08O0j73L96M2N8j72L83k20j75J69p4L8J12l43K21K48n27J43L47
3047B91l50K71n33K61O5k9Q7o7J6Mj46PO7N6m2Q6k7J21n9k18L38l00q0K07M62
3072D88l66l02L12n29M97n4p6M7Pl03K01Q1n6l4K27L0n66N29p6k37P8J19M7P6
3096A40j10j99K54q3q3j93K12J48j64l3J68n3p0L47k04O2j74K77r7k8K5j4n7j63
3120i2j4Q7J17j01j58J5J63j4Q6k51mJ2m8R2J4q3J73J59q1o7m5K09Lk19N6J59
3146A68k32K20o8j86J43k47J56n4K10j27K8o0j3j05J54J08R3j77K47N9j19l01
$$ plain form
3168 -103 -112 -181 -41 -23 130 205 -103 187 -104 -226 -130 -18 99 157 -116 106 29 170 82 143 -288 185 76
3191 76 153 -15 -2 69 92 160 175 -23 214 -128 0 138 -39 198 -221 -118 71 88 -459 176 191 -203 26
3214 26 162 161 69 21 141 196 46 -58 16 -429 283 120 192 250 -36 36 152 -165 -148 223 86 -31 29 151
3238 151 -146 188 121 91 -41 -167 79 -175 7 81 -307 65 -290 -325 12 -33 -105 -179 -142 39 -177 -261 169
3261 169 -19 64 -132 7 -201 -61 62 386 53 29 19 47 312 147 109 204 -140 -135 -163 -69 -5 153 78 -133
3285 -133 62 -140 16 -8 44 72 96 28 -219 -140 -324 8 -26 22 -83 71 -144 82 118 -34 -303 96 -197
3308 -197 102 67 -190 104 57 62 23 -87 -141 262 -45 -139 -102 150 -40 236 -29 -45 -69 218 -12 16 -191 -236
3332 -236 -3 157 232 -120 -26 -44 54 173 -286 80 -16 -323 147 132 15 38 65 -277 80 37 170 233 43
$$ packed form
3168a03ro9J40J8J53P5l08K90k91j22R6J12J17N8k73K22p7J41q8O1m31M73j09
3191G6P7j68J3P1K3O8J5j98K37l42J28J38j77K37m19J03J89J7n47O35J5l94K29
3214B6J36jr2m8J20N5j50j04P4m45P12j63P2N8k86P2J16l17J7L71j37j17O0J22
3238A51k97L34o7l0j32j26K46k54J82P4l88L72l55l5L37m5p2p4L7J81k16q4M30
3261A69j88Q3j96J39k08J40J23L24l33k4j0K8K65j65l8R5l44Nk8R4O4J58p5k11
3285a33J95k02J56k4N2K8K4o8k47P9j84L32l4M8j05J54k15K26L6j52k69L99k93
3308a97K99l5k57K94m7Nl9j10n4M03l07r4L7K52j90K76k65j6k4K87k30K8k07m5
3332b36K33J60P5l52R4j8R8J19m59L66r6l07M70j5j17K3K7l42L57m3J33O3j90
$$ plain form
3355 43 -176 159 68 27 119 -42 91 36 282 123 -146 152 -42 -41 -222 -117 -137 -138 -279 -10 83 -209 184 -106
3379 -106 -198 -41 110 19 278 72 347 78 203 -151 8 224 81 -87 -371 -86 358 -27 84 81 28 191
3401 191 67 138 -89 20 145 -22 -44 64 14 -187 -118 269 167 -43 33 75 -10 -122 -79 46 34 7 -88 156
3425 156 -192 -176 -230 -232 -72 132 64 173 102 -13 101 54 -211 178 45 -50 -80 -131 80 249 149 156 -134 -90
3449 -90 15 -269 -64 206 -192 -155 134 90 47 74 236 2 -87 157 39 -134 -39 197 -45 21 130 264 117
3472 117 -82 -1 -130 215 11 -127 41 -32 -51 -77 147 -22 7 29 -188 1 -72 119 99 50 120 43 -177 162
3496 162 -66 68 -52 -212 -77 -89 -81 -179 -66 166 -15 2 -32 -93 31 -308 81 291 -191 69 75 179 206
3519 206 -62 -65 224 -94 -26 -40 -15 22 -207 -198 -107 61 -102 253 -86 -42 -45 -351 158 -300 296 219 14 -32 -35
$$ packed form
3355D3k19L35r1m1R2j61J33n5K46j59k69K98j94Jj81J05k0jj41K69R3k92L93k90
3379a06r2J57J51r1K59k06K75k69J25l54J59K16j43j68k84K85M44l85J11ln3J63
3401A91j24P1k27J09J25j67k2J08n0k01O9L87j02k10P6M2q5j12M3J25j2k7r5K44
3425A56l48J6n4kJ60K04o8J09p1j15J14m7k65L89j33r5l0n1K11J69j00Pk90M4
3449i0J05k84K05K70l98L7K89m4m3K7J62k34q9K44j18j73R5K36k42O6J09J34j47
3472A17j99Q1j29L45k04j38J68p3j9k6K24j69K9K2k17J89p3J91k0m9P0p7k20L39
3496A62k28J34j20j60J35j2Qr8J13K32j81J7l4o1J24l39L89K10m82K60OJ04K7
3519B06k68lK89l18O8j4K5L7k29RR1J68j63L55l39M4ll06N09m58N96p7k05m6l
$$ plain form
3544 -35 181 27 -84 28 -218 -323 75 117 -54 99 279 142 -46 30 -22 -139 229 22 -49 -123 121 -113
3566 -113 -25 40 -120 72 -16 186 -44 188 -127 41 -260 -50 29 -168 -63 16 -23 35 98 91 2 -126 178 144
3590 144 98 10 -1 214 -28 20 -135 -165 163 -218 174 -74 0 100 -55 218 -119 3 139 116 -102 -65 -151
3613 -151 -74 116 65 -26 98 -84 -93 254 -59 233 230 130 -90 157 67 64 108 -232 15 60 55 -23 184 -23 149
3638 149 -266 -74 8 194 -79 -113 -367 154 -108 -383 205 214 -8 -80 -79 -139 228 148 120 92 31 -38 -112 292 -9
3663 -9 -276 -137 44 110 -98 -62 -277 351 -89 110 141 -112 -68 117 -194 21 -342 -84 -259 60 -168 -100
3685 -100 172 24 101 82 169 -187 -103 172 -116 -242 333 229 -65 -213 241 137 -222 200 -173 136 -62
3706 -62 -14 -305 238 25 -36 -137 -203 210 -43 154 4 -62 -27 18 1 -75 343 -362 362 -10 -134 -95 -57 -193
$$ packed form
3544c5K16j54j11J12k46j05L98M2j71J53J80j37j88P6n2j17L68k07p1p4K44k34
3566a13Q8O5j60J92q8K02k30K32l15J68l01K10P9j97J05P9l9N8O3pq9j28L04l4
3590A44m6q8j1K15k42M8j55l0L28l81L92k48P4J00j55K73l37J22J36k3k18L7q6
3613a51P7J90n1r1J24j82rL47l13K92lj00k20K47r0lM4l40K47M5np8K07k07J72
3638A49m15J92Q2J86k73l4k54N21k62k75N88Rk22p2Jo0L67q0k8k8o1o9p4M04l01
3663ik67J39J81O6k08L6k15O28m40J99L1k53M4J85l11K15l63K58j75L19k28O8
3685a00K72j48P7j9Q7l56Q4K75k88j26N75j04k94j48M54j04l59M22l73L09j98
3706f2M8k91N43k13o1j01o6M13k53J97j50o6L5M5j7p6M18p05P24l72j24L9L8j36
$$ plain form
3730 -193 30 16 -472 -182 -199 305 154 -13 -2 65 -53 -172 115 161 36 263 -147 74 -144 -267 -81 130
3752 130 -112 51 71 40 -37 208 53 -353 -59 68 234 -273 322 -170 424 45 10 54 -220 29 -50 201
3774 201 -530 -599 -360 -113 -353 -454 -48 56 128 117 -175 -709 60 17 -157 -86 -23 306 5 284 190 126 -97
3797 -97 -203 145 63 -201 -356 106 97 -107 -298 18 -282 30 147 -216 -149 103 8 -253 416 -80 186 64
3819 64 85 97 133 -145 -141 -38 146 -371 232 115 146 366 2 -343 88 156 -50 -335 -212 218 -211 -53 83
3842 83 -145 127 -45 51 -122 -93 -29 -14 118 151 -17 68 -1 -110 302 -65 23 52 103 192 74 2 48 -151 86
3867 86 -20 -128 -277 -223 -106 -64 178 -16 -225 15 -43 65 -9 -169 173 -159 63 -17 168 -220 -162 -55
3889 -55 22 118 -70 -82 77 -170 171 -36 184 3 -29 -125 116 102 248 -256 81 -247 -210 50 -151 -172 190
$$ packed form
3730a93K23j4m88K90j7N04j51j67J1O7j18j19K87M6j25K27m10K21k18j23J86K11
3752A30k42J63K0l1p7K45j55m06K94J27J66n07N95m92N94l79l5M4k74K49p9K51
3774B01p31o9K39K47k40j01M06J04P2j1k92n34P69m3j74P1O3L29l01K79r4o4k23
3797i7j06L48q2k64j55M62rk04j91L16l00L12J17l63O7K52r5k61O69m96K66j22
3819F4K1J2L6k78MJ03J84n17O03j17L1K20l64l45M31O8k06k85J23M30m29J58J36
3842H3k28K72j72R6j73K9O4J5J32L3j68Q5o9j09M12l67Q8K9N1Q9j18p2M6j99K37
3867H6j06j08j49N4J17M2K42j94k09K40n8J08p4j60L42l32K22q0J85l88N8J07
3889e5P7R6j88j2J59k47L41k07K20j81l2r6K41j4J46n04L37l28L7K60k01k1L62
$$ plain form
3912 190 -54 -236 -48 -338 -185 -204 -3 -83 220 63 -28 55 52 -325 -166 84 -224 1 -133 144 36 -210
3934 -210 149 2 278 231 90 -92 -52 120 -44 4 -95 142 -229 -19 63 -35 -254 271 183 234 -115 152 66
3957 66 -37 126 184 22 -154 -134 -215 -25 -143 -138 -79 -171 -71 15 -175 128 246 -27 86 154 -222 132 -6
3980 -6 77 -73 170 134 -242 122 -18 -71 63 1 -4 -324 8 75 103 240 -69 -89 53 -26 -159 44 137 -144
4004 -144 -33 97 61 133 -63 60 -116 230 9 -124 36 82 50 187 117 72 -65 112 86 -23 -239 -35
4026 -35 -29 -94 -41 -110 254 -12 -158 -65 -115 -83 -24 337 14 -330 -158 91 -1 -110 -179 23 -75 259 99 278
4050 278 -109 -289 181 27 -29 -34 24 97 -1 32 -197 100 -50 64 11 59 -248 -42 58 -142 227 -99 -145
4073 -145 48 -170 -19 -231 28 -14 162 -18 -164 151 -121 195 -66 -2 -195 -111 -62 -43 182 -84 -69 33
$$ packed form
3912A90k44j82J88k90J53j9K01q0L03j57r1Q3ll77J59K50l08K25j34K77j08k46
3934b10L59j47K76m7j41j82M0J72j64M8r9K37l71K10Q2r8k19N25q8N1l49K67q6
3957F6j03J63N8j62j76K0q1J90j18NN9r2J00Q6j90L03J18k73J13O8l76L54j38
3980fQ3j50K43l6l76L64j40n3J34o2nl20L32O7K8J37l09k0J42p9j33K03R3k81
4004a44J11J30l6P2j96J23j76L46k21j33J60M6l2J37p0m5j37J77k6j09k16K04
4026c5Oo5N3o9L64k66j46R3n0L2N9L61l23l44J72K49r2j09o9K02r8L34j60J79
4050B78l87j80M70j54n6nN8P3r8L3k29K97j50J14n3M8l07K06J00k00L69l26m6
4073a45J93k18J51k12K59m2J76j80j46L15k72L16k61O4j93Q4M9J9K25k66J5J02
$$ plain form
4095 33 -6 -160 60 121 -90 -175 81 -60 129 -95 -223 -3 85 -14 -209 191 -200 -250 -59 -212 79 122 59
4118 59 110 -153 -121 82 38 55 262 -57 -117 64 76 -3 -43 145 165 218 188 -59 -187 -231 69 201 -81 -7 2
4143 2 134 -176 95 82 -251 92 129 -28 -41 -81 22 -155 -317 160 245 458 -63 -10 -157 391 156 232 172
4166 172 -386 51 -56 -159 -39 -140 222 -157 70 79 -134 126 -43 307 -16 -142 71 253 63 -62 -65
4187 -65 -4 67 334 41 149 -173 -38 -68 -21 113 -22 82 122 77 -38 -152 252 -175 84 -227 165 -191
4209 -191 16 -120 -33 196 513 -32 -81 37 -173 52 -163 46 86 201 84 -90 -223 99 -73 23 -42 78
4231 78 -228 -97 0 25 -137 -24 166 -49 23 194 238 82 31 -109 -5 136 -38 -130 -165 64 -70 131 111
4254 111 393 111 104 -367 17 116 -331 -5 16 76 -168 -13 -66 197 -160 -104 12 -68 114 76 -109 -49 -119 143
$$ packed form
4095C3l9j54K20O1k11q5K56j41J89k24j28K20Q8r9j95M00l91n0J91j53K91M3o3
4118E9N1k63L2K03m4J7K07l19o0J81J2p9m0J88K0N3l0k47j28m4L00J32k82P4R
4143BJ32l10K71j3l33L43L7j57j3m0J03j77j62M77Q5K13n21N3j47N48k35P6o0
4166A72n58M37j07j03J20j01L62l79K27Rk13K60j69L50l23j26K13J82j90j25l
4187f5O1P1K67k93J08l22J35l0M7J34j35J04M0m5j15j14M04m27K59l11L92l56
4209a91K07j36Q7K29L17n45m9J18k10K25k15K09M0J15j17j74j33L22j72R6o5J20
4231G8l06J31R7K5j62J13J90k15P2J71M4j56n1j40J04J41j74r2l5K29j34K01k0
4254A11K82k82pm71L84R9m47L26K1O0k44J55n3K63l57N6J16q0J82l8j85O0p0K62
$$ plain form
4278 143 -59 -138 -78 -203 44 33 -181 104 -53 55 225 73 149 148 272 -257 -37 145 146 -19 -140 101 -111
4301 -111 -126 104 366 46 405 -3 155 -118 -222 17 90 -92 316 -122 -242 -133 21 -58 177 -232 -8
4322 -8 73 -103 -44 273 205 208 -114 196 259 34 107 269 167 -97 84 12 111 -418 101 107 -163 172 -61 180
4346 180 35 -42 152 -353 -7 80 187 57 64 250 308 183 -6 63 -186 -164 10 -52 187 -242 -40 181 96
4369 96 -55 6 180 -42 151 -99 -142 -327 101 23 203 -99 39 113 116 339 23 86 -73 123 -80 83 101
$$ packed form
4278A43k02p9O0j25K47j1k14K85j57J08J70j52P6jJ24n29K20J82Jj65j21K41k12
4301a11j5K30K62l20L59m08J58k73j04K39P3j82M08m38j20J09J54p9K35m09K24
4322hQ1j76N9L17o8Ll22L10O3k25P3J62j02k64J81p2R9n29N19Ok70L35k33K41
4346A80j45p7J94n05L46Q7J07j30PJ86N8j25j89O9k49K2J74o2K39m29K02K21q5
4369I6j51O1J74k22J93k50m3j85M28p8J80l02J38P4LK23l16O3j59J96k03J63J8
$$ [...]
8191g1
##END NTUPLES=NMR FID
##END=
