##TITLE=1H_DE-139km_TFA
 200.13Hz,CCl4.
 8 sc
 
 9.4.2026
##JCAMPDX= 6.0         $$ Bruker NMR JCAMP-DX V2.0
##DATA TYPE= NMR FID
##DATA CLASS= NTUPLES
##ORIGIN= UXNMR, Bruker Analytische Messtechnik GmbH
##OWNER= pz
$$ XWIN-NMR		Version 3.5
$$ Thu Apr  9 13:23:45 2026 Russian Standard Time (UT+4h)  she@DPX200
##.OBSERVE FREQUENCY= 200.131
##.OBSERVE NUCLEUS= ^1H
##.DELAY= (6, 6)
##.ACQUISITION MODE= SIMULTANEOUS
##.ACQUISITION SCHEME= undefined
##.AVERAGES= 8
##.DIGITISER RES= 18
##SPECTROMETER/DATA SYSTEM= spect
##.PULSE SEQUENCE= zg30
##.SOLVENT NAME= DMSO
##.SHIFT REFERENCE= (INTERNAL, DMSO, 0, 14.3821)
##AUDIT TRAIL= $$ (NUMBER, WHEN, WHO, WHERE, WHAT)
$$ ##TITLE= Audit trail, XWIN-NMR		Version 3.5
$$ ##JCAMPDX= 5.01
$$ ##ORIGIN= Bruker BioSpin GmbH
$$ ##OWNER= she
$$ F:/spectra/data/she/nmr/H-C/1/audita.txt
$$ ##AUDIT TRAIL=  $$ (NUMBER, WHEN, WHO, WHERE, WHAT)
(   1,<2026-04-09 13:21:59.79 +0400>,<she>,<DPX200>,
      <created by zg, POWCHK disabled, PULCHK disabled
       configuration hash MD5:
       00 E9 B6 7A A2 85 ED C7 34 08 36 98 17 FE 4E 26
       data hash MD5: 16K
       CD E4 A8 E5 7A 60 3B 21 DB AD EC F0 CB AF 88 66>)
$$ ##END=
$$ 
$$ hash MD5
$$ 0D 6E 46 21 85 8B E8 82 07 E0 60 3A 74 39 79 7B
##$RELAX= 
##$RELAX= 
##$RELAX= 
##$RELAX= 
##$RELAX= 
##$RELAX= 
$$ Bruker specific parameters
$$ --------------------------
##$DU= <F:/spectra>
##$EXPNO= 1
##$NAME= <H-C>
##$PROCNO= 1
##$TYPE= <nmr>
##$USER= <she>
##$AMP= (0..31)
100 100 100 100 100 100 100 100 100 100 100 100 100 100 100 100 100 100 
100 100 100 100 100 100 100 100 100 100 100 100 100 100 
##$AQSEQ= 0
##$AQ_mod= 1
##$AUNM= <au_zg>
##$AUTOPOS= <>
##$BF1= 200.13
##$BF2= 200.13
##$BF3= 200.13
##$BF4= 200.13
##$BF5= 200.13
##$BF6= 200.13
##$BF7= 200.13
##$BF8= 200.13
##$BYTORDA= 1
##$CFDGTYP= 0
##$CFRGTYP= 5
##$CHEMSTR= <none>
##$CNST= (0..31)
1 1 145 1 1 1 1 1 1 1 1 1 1 1 1 1 1 1 1 1 1 1 1 1 1 1 1 1 1 1 1 1 
##$CPDPRG= <>
##$CPDPRG1= <>
##$CPDPRG2= <>
##$CPDPRG3= <>
##$CPDPRG4= <mlev>
##$CPDPRG5= <mlev>
##$CPDPRG6= <mlev>
##$CPDPRG7= <mlev>
##$CPDPRG8= <mlev>
##$CPDPRGB= <>
##$CPDPRGT= <>
##$D= (0..31)
0 0.7 0 0 0 0 0 0 0 0 0 0.03 0 0 0 0 0 0 0 0 0 0 0 0 0 0 0 0 0 0 0 0 
##$DATE= 1775726519
##$DBL= (0..7)
120 120 120 120 120 120 120 120 
##$DBP= (0..7)
150 150 150 150 150 150 150 150 
##$DBP07= 0
##$DBPNAM0= <>
##$DBPNAM1= <>
##$DBPNAM2= <>
##$DBPNAM3= <>
##$DBPNAM4= <>
##$DBPNAM5= <>
##$DBPNAM6= <>
##$DBPNAM7= <>
##$DBPOAL= (0..7)
0.5 0.5 0.5 0.5 0.5 0.5 0.5 0.5 
##$DBPOFFS= (0..7)
0 0 0 0 0 0 0 0 
##$DE= 6
##$DECBNUC= <off>
##$DECIM= 32
##$DECNUC= <off>
##$DECSTAT= 4
##$DIGMOD= 1
##$DIGTYP= 9
##$DL= (0..7)
0 120 120 120 120 120 120 120 
##$DP= (0..7)
150 150 150 150 150 150 150 150 
##$DP07= 0
##$DPNAME0= <>
##$DPNAME1= <>
##$DPNAME2= <>
##$DPNAME3= <>
##$DPNAME4= <>
##$DPNAME5= <>
##$DPNAME6= <>
##$DPNAME7= <>
##$DPOAL= (0..7)
0.5 0.5 0.5 0.5 0.5 0.5 0.5 0.5 
##$DPOFFS= (0..7)
0 0 0 0 0 0 0 0 
##$DQDMODE= 0
##$DR= 18
##$DS= 0
##$DSLIST= <SSSSSSSSSSSSSSS>
$$ [...]
##$SUBNAM0= <"">
##$SUBNAM1= <"">
##$SUBNAM2= <"">
##$SUBNAM3= <"">
##$SUBNAM4= <"">
##$SUBNAM5= <"">
##$SUBNAM6= <"">
##$SUBNAM7= <"">
##$SUBNAM8= <"">
##$SUBNAM9= <"">
##$SW= 18.0517599122864
##$SWIBOX= (0..15)
0 0 2 0 0 0 0 0 0 0 0 0 0 0 0 0 
##$SW_h= 3612.71676300578
##$TD= 16384
##$TD0= 1
##$TE= 0
##$TE2= 300
##$TE3= 300
##$TEG= 300
##$TL= (0..7)
0 120 120 120 120 120 120 120 
##$TP= (0..7)
150 150 150 150 150 150 150 150 
##$TP07= 0
##$TPNAME0= <>
##$TPNAME1= <>
##$TPNAME2= <>
##$TPNAME3= <>
##$TPNAME4= <>
##$TPNAME5= <>
##$TPNAME6= <>
##$TPNAME7= <>
##$TPOAL= (0..7)
0.5 0.5 0.5 0.5 0.5 0.5 0.5 0.5 
##$TPOFFS= (0..7)
0 0 0 0 0 0 0 0 
##$TUNHIN= 0
##$TUNHOUT= 0
##$TUNXOUT= 0
##$USERA1= <user>
##$USERA2= <user>
##$USERA3= <user>
##$USERA4= <user>
##$USERA5= <user>
##$V9= 5
##$VALIST= <valist>
##$VCLIST= <CCCCCCCCCCCCCCC>
##$VD= 0
##$VDLIST= <DDDDDDDDDDDDDDD>
##$VPLIST= <PPPPPPPPPPPPPPP>
##$VTLIST= <TTTTTTTTTTTTTTT>
##$WBST= 1024
##$WBSW= 4
##$XGAIN= (0..3)
0 0 0 0 
##$XL= 0
##$YL= 0
##$YMAX_a= 124587
##$YMIN_a= -159722
##$ZGOPTNS= <>
##$ZL1= 120
##$ZL2= 120
##$ZL3= 120
##$ZL4= 120
##$ABSF1= 10
##$ABSF2= 0
##$ABSG= 5
##$ABSL= 3
##$ALPHA= 0
##$AQORDER= 0
##$ASSFAC= 0
##$ASSFACI= 0
##$ASSFACX= 0
##$ASSWID= 0
##$AUNMP= <proc_1d>
##$AZFE= 0.1
##$AZFW= 0.1
##$BCFW= 1
##$BC_mod= 2
##$BYTORDP= 1
##$COROFFS= 0
##$CY= -3
##$DATMOD= 1
##$DC= 2
##$DFILT= <>
##$DTYPP= 0
##$F1P= 0
##$F2P= 0
##$FCOR= 0.5
##$FTSIZE= 0
##$FT_mod= 4
##$GAMMA= 1
##$GB= 0.15
##$INTBC= 1
##$INTSCL= 1
##$ISEN= 128
##$LB= 0.25
##$LEV0= 0
##$LPBIN= 0
##$MAXI= 10000
##$MC2= 0
##$MEAN= 0
##$ME_mod= 0
##$MI= 1.114404
##$NCOEF= 0
##$NC_proc= 0
##$NLEV= 6
##$NOISF1= 3.799351
##$NOISF2= 2.8
##$NSP= 1
##$NTH_PI= 0
##$NZP= 0
##$OFFSET= 14.38212
##$PC= 1
##$PHC0= -3704.783
##$PHC1= 12.39231
##$PH_mod= 1
##$PKNL= yes
##$PPARMOD= 0
##$PSCAL= 0
##$PSIGN= 0
##$REVERSE= no
##$SF= 200.129724274929
##$SI= 16384
##$SIGF1= 3
##$SIGF2= 2
##$SINO= 400
##$SIOLD= 16384
##$SREGLST= <1H.CDCl3>
##$SSB= 0
##$STSI= 0
##$STSR= 0
##$SW_p= 3205.1282051282
##$SYMM= 0
##$S_DEV= 0
##$TDeff= 0
##$TDoff= 0
##$TI= <>
##$TILT= no
##$TM1= 0
##$TM2= 0
##$TOPLEV= 0
##$USERP1= <user>
##$USERP2= <user>
##$USERP3= <user>
##$USERP4= <user>
##$USERP5= <user>
##$WDW= 1
##$XDIM= 8192
##$YMAX_p= 0
##$YMIN_p= 0
$$ End of Bruker specific parameters
$$ ---------------------------------
##NTUPLES= NMR FID
##VAR_NAME=  TIME,          FID/REAL,        FID/IMAG
##SYMBOL=    X,             R,               I
##VAR_TYPE=  INDEPENDENT,   DEPENDENT,       DEPENDENT
##VAR_FORM=  AFFN,          ASDF,            ASDF
##VAR_DIM=   8192,          8192,            8192
##UNITS=     SECONDS,       ARBITRARY UNITS, ARBITRARY UNITS
##FACTOR=    0.0002768,     1,               1
##FIRST=     0,             0,               0
##LAST=      2.2672688,     0,               0
##MIN=       0,             -159722,         0
##MAX=       2.2672688,     124587,          0
$$ Real data points
##PAGE= N=1
##DATA TABLE= (X++(R..R)), XYDATA
0@%%%%%%%%%%%%%%%%%%%%JpJ4j6J6j6J6j7K2k8L1l4L9m3M9n7O1o7P6q4R3j05J14
43E8j24J38j52J70j88K05k26K49k73L03l37L73m14M59n11N77o56P52q72J026j233
64f76J525j967K693m067P447k7939j2005J32349p8547j26368O4144P2037M4432
77G3058J3427r7432m8825N2197P41M6369Q5052r9625p3493P7351J8927O983K08
90E4938o1627K47M4800K4396K9039j1790p8999k3460N7293K4522J1632k007l9711
103B9273P793J1151k214K0285k2157l0609J6592L7922J8107k2105j9373j1457
115C3208j1376O913L1368K1311l7701k0385K4439J356k155j0357j0341L747r639
128B0388K4959L1754k8552l9305Q45K0469J089J49O643q188o862o096J7767M661
$$ plain form
0 0 0 0 0 0 0 0 0 0 0 0 0 0 0 0 0 0 0 0 0 0 1 -6 8 -8 8 -8 8 -9 13 -15 16 -18 21 -22 27 -30 31 -36 40 -44 49 -56 58
43 58 -66 72 -80 90 -98 107 -119 130 -143 160 -177 196 -218 241 -270 307 -349 403 -469 557 -676
64 -676 849 -1118 1575 -2492 4955 -22984 -34989 97360 18813 -107555 -43411 28626 73058
77 73058 86485 -10947 -59772 -7575 -6834 39535 124587 24962 -48531 28820 47747 54730 54938
90 54938 -6689 -6442 38358 62754 91793 80003 1004 -22456 34837 59359 70991 68984 29273
103 29273 37066 48217 46003 66288 44131 13522 30114 68036 86143 64038 44665 33208
115 33208 21832 28745 60113 81424 43723 23338 47777 49133 46978 36621 26280 30027 20388
128 20388 45347 77101 48549 9244 10089 30558 31647 31796 38439 30251 23389 17293 35060 39721
142C9721m3712K216K6815m420O057m37j1377r382j1490M485K0458m72k4524J4358
156H296J2260l0302J0848R774k1712L765l78Q883J6491k0457j4652J2346k941
169g779j3233K0957O016k7456P266Q881j672O110k2261K32K0150j3260O20J6256
183H27q176j7561Q233J1819r245j863r11P437O794j9140Q043J4264j8092k120
197a9691J0237M541n437l793J0359j038q960o29J5444L612k1898O184J4251o852
211c670j95K438M794m931q184J3622L510j0219l445J2235J0814j3919k693R220
225I377l900l856K306J2410k187j0142J0460J907o206n650K371J5022o199o067
239I646J1150J190p775m729P973o58n741Q496M963K506r968o907J6159o691j1500
$$ plain form
142 39721 -3991 -1775 25040 20620 26677 26240 14863 5481 -6009 -1524 18934 18462 -6062 8296
156 8296 20556 -9746 1102 10876 -10836 -7071 -7449 1434 17925 -2532 -17184 -4838 -7779
169 -7779 -21012 -55 5961 -21495 -14229 -5348 -7020 -910 -23171 -22939 -2789 -16049 -15429 827
183 827 -7349 -24910 -16677 -4858 -14103 -15966 -16877 -9440 -2646 -21786 -13743 521 -17571 -19691
197 -19691 -9454 -4913 -10350 -14143 -3784 -4822 -13782 -14411 1033 4645 -17253 -11069 3182 -3670
211 -3670 -3865 -1427 3367 -1564 -9748 3874 7384 -2835 -6280 5955 16769 2850 157 9377
225 9377 5477 1621 3927 16337 14150 4008 14468 16375 10169 4519 6890 21912 15713 9646
239 9646 20796 21986 14211 9482 17455 16797 11056 19552 24515 27021 17053 10146 26305 19614 8114
254H114J1378O101j766k263L166j924j0018j447N246J1107p231o245J7280n437
268B6061j4739J868K179J847k359N958Q686p599r233R07O405j0590o347J8730
282B1774K476p006r93k929L26r243j768J2178q48m926M139P848j0934j4165P743
297C672K803j464J864K393P326r174p543N169m795n578K954J2513J788j0459J151
312B620m02m826n927o55J2284p89k360O644l219q975p554O097O453o472M089O756
328C764J537q283q606N541k075m047R106O319j543q619K244L926j1105k748O528
343h061Q558k56n115O775l348j0667J782M753K564m198M667R922o859q312p69
358h564L909j216l425J0269L397m880o12j255N33q046o31J2708J760l620m80L743
$$ plain form
254 8114 19492 25593 23827 21564 24730 22806 12788 11341 16587 27694 20463 14218 31498 26061
268 26061 11322 13190 15369 17216 14857 20815 29501 21902 12669 13576 19981 9391 3044 21774
282 21774 24250 17244 16251 13322 13648 4405 2637 14815 13967 9041 13180 21028 10094 -4071 3672
297 3672 6475 5011 6875 9268 16594 7420 -123 5046 251 -5327 -2373 10140 11928 1469 2620
312 2620 2218 -2608 -8535 -9190 3094 2305 -55 6589 3370 -5605 -13159 -7062 -609 -7081 -2992 3764
328 3764 5301 -2982 -11588 -6047 -8122 -12169 -3063 3256 1713 -6906 -4662 -736 -11841 -14589 -8061
343 -8061 497 241 -4874 1901 -1447 -12114 -10332 -5579 -3015 -7213 -2546 7376 517 -7795 -8564
358 -8564 -4655 -5871 -9296 973 4370 -510 -1122 -2377 -1844 -9890 -10521 2187 3947 327 -153 3590
374C590l346q083L506K754N94K559J528N412p943q047P324J022l718L34O510L445
390G441n826j005m00j610k077k1J0711k512o768O458J013n560m647K742M934k130
406G43J230K077L54m433n029P132r86o960N719N148q57o007p60L920m338j154
422d201K509L200r91m496N640L03r118O55M967J845l954n56M390k181k545j600
438f133K704O18o484O689L895p893o58L303Q04l134j721K287J444l8l766L593
454d490J944r468M738N802p049n10K762J583J66l026j253L338J00n905N165L721
470b382q954L909N291n839m09m55J443L134l506j724N135J252p325L956M184r065
486a1355K373N675k035M05k232J395L349m467k161L416K664m542K854N237o482
$$ plain form
374 3590 244 -7839 -4333 -1579 -985 1574 3102 8514 571 -7476 -152 870 -2848 -2514 3996 7441
390 7441 1615 610 210 -1400 -3477 -3498 7213 4701 -2067 4391 5404 -156 -4803 -2061 2873 743
406 743 1973 4050 4404 -29 -5058 2074 1088 -5872 -153 4995 4138 -1869 -2629 1291 -3047 -4201
422 -4201 -1692 1508 517 -3979 1661 1964 -7154 -6499 -1532 313 -3641 -4197 193 -1988 -4533 -6133
438 -6133 -3429 -2811 -9295 -2606 1289 -6604 -7262 -3959 -3155 -6289 -8010 -5723 -4279 -4317 -8083 -4490
454 -4490 -2546 -12014 -7276 -1474 -8523 -9033 -6271 -4688 -4522 -7548 -8801 -5463 -5363 -11268 -6103 -2382
470 -2382 -11336 -7427 -2136 -7975 -8384 -8839 -7396 -4262 -7768 -9492 -4357 -3105 -10430 -6474 -2290 -11355
486 -11355 -8982 -3307 -5342 -4937 -7169 -5774 -2425 -6892 -9053 -5637 -2973 -7515 -4661 576 -5906
501e906j344L010o03O18k451K617M516k770k781J667J489m382R90N790l046l46
517b932K467p54o7m271m07M972L95j680J314L128m397j935M462l896n00L393O77
534c1L050k486l833K638J19l658R69N828k827q31M467m155k186N18j831M826J47
551G24l671M643K344o849j869M715l349r18O832j874o6r23l938M151j459n341
567f848N116M844m136q26L685m416l254L865j697J844R06k022M891j867o181J827
583d269K313j901M20L396m46j434kj493J09j620j827O286P64l133Q02l21p51k284
601e391P02J838P1N86L53K155k955m460L448R65j089Q47J580J450k548j460J116
618b792r68r41Q30L731M6l775K274R34k711j505J616K464m91M21R12q32j147k452
$$ plain form
501 -5906 -7250 -4240 -4843 -4225 -6676 -4059 457 -2313 -5094 -3427 -1938 -6320 -5330 460 -2586 -2932
517 -2932 -465 -1219 -1286 -5557 -5964 -992 -597 -2277 -963 2165 -2232 -4167 295 -3601 -4101 -708 -31
534 -31 3019 533 -3300 -662 -543 -4201 -3232 2596 -231 -1062 3405 -750 -2936 -2418 -4249 577 724
551 724 -2947 1696 4040 -2809 -4678 37 -3312 -4230 2602 728 662 -261 -4199 -48 -1507 -6848
567 -6848 -1732 3112 -1024 -1850 1835 -2581 -5835 -1970 -3667 -1823 -917 -2939 1952 85 -6096 -4269
583 -4269 -1956 -3857 -3437 -41 -487 -1921 -1923 -3416 -3307 -4927 -6754 -468 296 -2837 -2035 -2356 -3107 -5391
601 -5391 -4689 -2851 -2780 -2194 -1841 314 -2641 -7101 -3653 -2688 -3777 -2930 -1350 100 -2448 -3908 -2792
618 -2792 -3760 -4701 -3871 -140 -94 -3869 -1595 -661 -3372 -4877 -3261 -797 -1288 -867 45 -787 -1934 -4386
636d386K692J341l539K499L537j851j828j91K65p12R64Q15J197J006l019J561
652C51J453m573J013K942L4m27J01K66m36k99j302J038J444k315K259K608l752
669D05j96J092k31K43o58R39J070j02j421Q16K76k777J326K641k071K22M76k5
687B025N23k305M25J670o29p22J723N32k584N01J374j223M1m47J251J152k423
704H84M34J041j186o88J260O14j612L83J386q53m33j003O92J356j447j83R34l18
722A261p77J43J522j986k22J257k25j0q68L05J286j051n02M21J86o66J44J141
740A359r44r05J016k0J79j081k74J720p49o17N44O96r76p60J589p47q00J055L24
759F09L42j316m97J333k89r39O45P44o36N7N47m18o78j93N89J250r47q74J489
$$ plain form
636 -4386 -1694 -353 -3892 -1393 2144 293 -1535 -1726 -1461 -2173 -1209 -394 803 1809 -1210 351
652 351 1804 -2769 -1756 1186 1220 793 894 1160 724 425 -877 161 1605 -710 1549 4157 405
669 405 209 1301 1070 1313 655 1594 2664 2562 1141 1957 2233 -544 782 3423 1352 1574 2050 2025
687 2025 2548 243 668 2338 1709 987 2710 3242 658 1159 2533 1310 1351 904 2155 3307 884
704 884 1318 2359 1173 485 1745 2359 747 1130 2516 1663 1230 227 919 2275 828 645 1579 1261
722 1261 484 627 2149 163 -59 1198 973 963 95 400 1686 635 133 554 740 74 218 1359
740 1359 415 -490 526 506 685 -396 -670 1050 301 -316 228 924 -52 -812 777 30 -770 285 609
759 609 951 -365 -862 471 182 -757 -112 632 -4 53 600 182 -496 -689 -100 1150 203 -671 818
778H18j12r24n0M00kk16J006o3l3q30m05J283r20l52J507K3j64l14R8J1q58M37
800C40P56J53j39l03J096q72j207O29M17K88k78P80K66j287r9M76j9l52j70J518
820A993j34q43P9Nm0o97P66N97n28M20k21P9m68j039J411O5j52L41K50N9j030
841I13J72J9k33J30K81L87J32j119P02m9o44Q3K65P49n94P0K23o57j42L39M32
862A459j48m83Q06J45n61m54l20P84j61j66O37n24K8l02L40j43p22Q32N11M8o88
883I18j93M23p85k03O26j2j45J80M19O7j010j78M80j5J50j68M46m80k35J84l97
904G2K28j24L62K42l65l41N67m7m30k28P05j55p8J2J2k95l62J31L93l79o5M73
926C28K46l77m51K22p9J5K13K26p8m08O4M28m70l34N27M65m18l00N05k76q0j45
$$ plain form
778 818 706 -218 -268 132 130 -86 920 857 824 -6 -411 872 -48 -400 1107 1130 966 652 750 761 -97 340
800 340 1096 1249 1110 807 1903 1031 -176 453 870 1158 880 1660 1926 639 540 1016 997 645 475 1993
820 1993 1859 1016 1095 1100 1060 363 1129 1726 1198 1618 1397 1476 1008 -31 1380 1445 1293 1634 1884 1943 913
841 913 1085 1104 871 1001 1282 1669 1801 682 1384 1335 691 774 1039 1788 1194 1264 1487 830 688 1027 1459
862 1459 1311 828 1634 1779 1218 764 444 1228 1067 901 1538 1014 1042 740 1080 937 215 1047 1558 1606 918
883 918 725 1148 363 160 786 774 629 809 1228 1295 285 107 587 572 722 554 1000 520 285 469 72
904 72 300 176 538 780 415 74 641 594 164 -64 641 486 408 420 432 137 -225 -94 299 -80 -145 328
926 328 574 197 -254 -32 -111 -96 117 343 265 -143 -79 349 -121 -455 72 537 119 -181 324 48 -32 -177
948a77L7K63j39j50N16j51n53J36O63n01j77L94r8M41L4p72M99l08m13J188n57
969A75k59J15K36j43lL7k53N97k39o6O50o62J3Q58m14n90R4L54J25j24J89k85
991D05R2p6j80P46m42j04M92k3j83k58K86J85l38J59j04P53m53j85P42o70l53
1012D91O11j86J94m19O01j6l46j54j55P56l76m36R82n17k63M05k9j53k80K17K60
1033A187K6o4l41P04o51n51J108k07n81M44M18j09n09k01rL28J41n36O28j09p71
1054C45Q25j08q40L73N7Q64n34n00L5N37o14m06L67K71m06Q45j97q24l2l35N98
1075C21k97m4J21Q51j25r65L02J20q71J092l62j0qm06N05j02n30l72Q37q0k46
1096b69N53j77o14lP2mj44j57R11M29r67m69L73j17n96P44L05m13L59m23J60o2
$$ plain form
948 -177 -140 123 -16 -166 350 199 -354 -218 445 -56 -233 161 63 504 538 -234 265 -43 -456 732 175
969 175 -84 31 267 124 121 158 -95 502 263 197 847 185 198 1056 642 52 146 500 625 501 690 405
991 405 497 421 241 987 545 441 933 910 727 469 755 940 602 761 657 1410 957 772 1514 844 491
1012 491 1102 916 1110 691 1292 1276 930 776 621 1377 1001 565 1547 1030 767 1172 1143 990 710 927 1187
1033 1187 1213 1149 808 1512 861 310 1418 1211 630 1074 1492 1383 874 673 664 992 1133 597 1225 1116 345
1054 345 1170 1062 222 595 652 1516 982 482 517 1054 440 34 401 672 266 1111 914 90 58 -277 321
1075 321 24 -20 101 952 827 -138 164 284 -587 505 143 133 125 -281 224 122 -408 -780 57 -23 -269
1096 -269 284 107 -507 -510 -438 -442 -586 -743 168 597 -370 -839 -466 -583 -1179 -435 -130 -543 -184 -607 -447 -509
1118e09j145J007O20k40l46N65J64p72M2L50q18Q99j72k8M30r43N7N92n20k13
1138i80Q82L75m43J87k48n51L37j62L67L12l98P0O70m44r71M08N16k39N05R3n79
1159b93M04l85k29Q54p09j43P32K50m75j9O0m57M81k74J4P29n19N5Q27j035n25
1180f57P30K41J14n00K62j36O2k83j35R16r60J39J170j048k81K66J50k32k48J80
1200b50Q4M35l47j48L17q60J54P42m77k4K29J10J65m73k22Q5M53m35qP27p04o04
1222a051R23k43k44r3K46J52l31k7RK11k84n56J081n45l26N84J27m86p1N3M00
1243d71m22j60J33M83n03l27R59p70l11M57K33k04J1n63M32J41j28m6J70r1n50
1264a527J081m57l70K89J06K11m36j51J90J23N6K4M65k26m35L72q2m13J44J32
$$ plain form
1118 -509 -1654 -647 -27 -267 -613 -48 116 -656 -614 -264 -1082 -183 -355 -383 47 -896 -839 -247 -767 -980
1138 -980 -98 277 -166 21 -227 -778 -441 -603 -236 76 -322 -252 418 -26 -997 -589 -73 -312 193 286 -293
1159 -293 111 -274 -503 351 -358 -501 231 481 6 -13 47 -410 71 -203 -189 540 21 76 903 -132 -657
1180 -657 73 314 428 -72 190 54 116 -167 -302 614 -346 -207 963 -85 -366 -100 50 -182 -430 -250
1200 -250 -166 269 -78 -226 91 -769 -615 127 -350 -374 -145 -35 130 -343 -565 -480 -27 -462 -470 257 -447 -1051
1222 -1051 -128 -371 -615 -708 -462 -310 -641 -668 -659 -448 -732 -1288 -207 -752 -1078 -494 -367 -853 -924 -871 -471
1243 -471 -893 -1053 -920 -437 -940 -1267 -308 -1078 -1389 -932 -699 -903 -892 -1455 -1023 -882 -1010 -1056 -886 -977 -1527
1264 -1527 -446 -903 -1273 -984 -878 -667 -1103 -1254 -1064 -941 -885 -861 -396 -622 -1057 -685 -767 -1180 -1036 -904
1284i04P07n8p30R2M84m49m5K80O6k61N14j95l40N3O0J97P3m12M57M53l22m50
1306g30M8J00k39L82K18J21k27l46L69J01o42J93K92K84J9j74M60j087K80J30
1326d48M8L09k59M82m3l62l39K22K00j63j5N69m07P5j2J23m38p21R63N17l77M0
1348c6k10K21m23m41P48l90J36L37J95q9r76K09O20m85k07K72M56R8l64o9k33
1369f31p9j77M62N66o04J8M50k52n13l10M04J35J51L83j23k89l32M19j14l55J
1390g90Q02j93J30o36L42m03j9L49j50L1K2L10J67m93k73r2P47Q5m20N06j38l89
1412e05o5J39J42l8J81K98j14m40O2J41R6r97R46J73j90K54r7k18n7K4N91j50
1434A76m2j44J58L91j059M44L2n13O68J54R3j82J08p9o1j39k82M21N48n91L73
$$ plain form
1284 -904 -197 -255 -985 -893 -409 -858 -903 -623 -557 -818 -304 -499 -839 -786 -726 -529 -456 -868 -411 42 -280 -730
1306 -730 -682 -582 -821 -439 -221 -100 -327 -673 -304 -203 -845 -652 -360 -76 -57 -231 229 -858 -578 -448
1326 -448 -400 -91 -350 132 89 -273 -612 -390 -190 -353 -368 201 -206 -131 -143 -20 -458 -1179 -216 301 -76 -36
1348 -36 -246 -25 -448 -889 -141 -531 -395 -58 137 48 -928 -719 -99 -584 -791 -519 -63 35 -329 -398 -631
1369 -631 -710 -887 -425 141 -463 -445 5 -247 -760 -1070 -666 -531 -380 3 -120 -409 -741 -322 -436 -791 -790
1390 -790 12 -181 -51 -687 -345 -748 -767 -418 -568 -537 -515 -205 -38 -531 -804 -896 -149 -64 -484 22 -116 -505
1412 -505 -570 -431 -289 -327 -146 152 38 -402 -340 -199 -103 -1100 -154 19 -171 83 -14 -232 -289 -265 326 176
1434 176 134 -10 148 539 -520 -76 -44 -557 111 265 358 176 284 205 144 5 -277 144 692 101 474
1455D74Q9l85K00m00L77J03k91K63J45K59q84K62O27o16L09Jk51K55r8k01K73
1476E11l27N8N46K8n40L38n0m14mK33K00P1oj65M05l19l75L37J59l36N2J28j73
1499C57K80l8l48K4K36P7K77p65J29j02Q29l05o87Q12m46j49L10k99M78k44o25
1520a99N17n2n48K27L24R9j90M6J6L50l8o90O07j79k66P13l99R6j19K15j4o16
1542a00M99k33nQ8lPn1k80N10L94o55J5K91o4k39R6k02Q8M19n37M72q9l20L92
1566D93q1m72p1M16R4J71J45n55J43L30n77M34L5n67N14J76l43J04j64K00j17
1587C08k02J20L23L90k95k14j4k55k8O01l40P1q8j5K05l19j63M13N2L7M7L52n12
1610D74k60R5j88lJ96J34K62J76q97N27J7n66P04Jj74L50k12n30K79k95J92K2
$$ plain form
1455 474 563 178 378 -22 355 458 167 430 575 834 -50 212 839 223 532 533 282 537 439 238 511
1476 511 184 242 788 816 276 614 564 150 146 379 579 650 644 479 884 565 190 527 686 350 402 530 357
1499 357 637 599 251 275 511 588 865 100 229 127 956 651 -36 776 330 181 491 192 670 426 -199
1520 -199 318 266 -282 -55 269 368 178 224 240 590 552 -138 469 290 24 737 338 434 315 530 516 -100
1542 -100 399 166 161 249 246 253 202 -78 432 826 171 186 477 413 174 270 68 156 575 38 510 421 101 493
1566 493 412 -60 -131 285 379 550 695 140 283 613 36 470 505 -62 452 628 285 389 225 425 308
1587 308 106 226 549 939 644 430 416 161 133 734 394 465 377 362 567 248 85 498 550 587 634 986 474
1610 474 214 309 121 118 314 448 710 886 -11 516 533 -33 671 672 498 848 636 106 385 90 282 304
1632C04M68m23J53j6l35r0K90k19L7K42k19K24K23m45m3K97n12o1O60l82L92J80
1654G25o60Mj27K01l0J02l4MQ2j73j66M4k45L21M51m12J06k03j24J46j47o7K04
1677BK69k13q7K26k54q4ql4N62l97j65J85P4l67k9J96k1K43k80R2l78N71m13J63
1701a47j28l59O40K94l45j26J9K80l19K89l88J23K28k84K51P6m83J14kJ14J39
1722a4Rk79J15J33j24Q2k95J7L16j3r1j81K55J70l97n9K63L3J13m77L23Q2j56
1745a75M87p6l24k21M21m5m22L55q1j43R5k85L61Q6m35M68K5l25j03K64M7k00
1767b26N78l27k23J27l23K71K88m16L7j5J17l24L3K98k05j69K45j23P2n3M7K60
1789c1m86J34K70%j57K2L05l79L01l19k01J14k5L57j38k22J68K16k18m13O8M48
$$ plain form
1632 304 772 349 502 486 151 61 351 132 169 411 192 416 639 194 151 448 -64 -125 535 153 545 725
1654 725 65 69 -58 143 113 215 181 185 267 94 -72 -28 -273 48 499 87 193 -10 -134 12 -135 -202 2
1677 2 271 58 -29 197 -57 -141 -149 -183 379 -18 -183 2 76 -291 -320 -124 -145 98 -182 -90 -468 103 -310 -147
1701 -147 -275 -634 6 300 -45 -171 -152 128 -191 98 -290 -167 61 -223 28 104 -379 -265 -267 -153 -14
1722 -14 -5 -284 -169 -36 -160 -78 -373 -356 -40 -53 -144 -325 -70 100 -297 -356 -93 -60 53 -424 -101 -19 -175
1745 -175 312 236 -88 -309 112 67 -355 0 -81 -224 -129 -414 -53 33 -402 66 91 -234 -337 -73 -26 -226
1767 -226 352 25 -198 -71 -394 -123 165 -251 -214 -229 -112 -436 -403 -105 -310 -479 -234 -357 -285 -338 -291 -31
1789 -31 -517 -383 -113 -113 -270 -248 57 -322 -21 -340 -541 -427 -452 -95 -233 -455 -287 -71 -289 -702 -634 -186
1811a86r8j30L9j17K84m13J52K65m26K8L16m9M35l79k32L5J78k00K75p2k65K40
1833c20J46j45k49L52J19j07l79nJ96L59k07k89K38k73K38L06j96r9K6Q8J36l24
1855c89j6J49j48L56j41K40n34M4L00J3k18j23J72L15R5m65p3L17k35j68L24J25
1877f0J53L0k58K92k68j0QK33j36k53K16j25l8Q0J47l68K71K55P4l32J46l6l6
1900a5k31j69M10J17PJ93j48l39j06J82M9K01m22L47K14l20k66K46J03j7J23j01
1922E8Q0O0k53RL0k72M35k5K08l18k61J60p2j62J63J14N3k80L72j18Q1k86j18
1945c42M05j67k71L85J01n3k50j09K60k88L13M79m43j24K34r4Q5l16K45k37K65
1966G8j35M1j89P0K99L71m92J05lM6P5k92l0K7o0L30l6k33J32P5j2j82K61j99
$$ plain form
1811 -186 -284 -414 -375 -492 -208 -621 -469 -204 -630 -602 -286 -335 100 -279 -511 -476 -298 -498 -223 -295 -560 -320
1833 -320 -174 -319 -568 -216 -97 -204 -583 -588 -392 -33 -240 -529 -291 -564 -326 -20 -216 -315 -289 -201 -65 -389
1855 -389 -405 -256 -404 -48 -189 51 -483 -439 -139 -126 -344 -467 -295 20 115 -350 -423 -106 -341 -509 -185 -60
1877 -60 93 123 -135 157 -111 -121 -113 120 -16 -269 -53 -178 -216 -136 11 -357 -86 169 243 -89 57 21 -15
1900 -15 -246 -415 -5 112 119 312 164 -175 -281 -99 -50 151 -271 76 290 -30 -296 -50 53 36 159 58
1922 58 138 198 -55 -46 -16 -288 147 122 330 12 -249 -89 -161 -323 -160 -46 7 -273 99 -19 62 -224 -342
1945 -342 63 -104 -375 10 111 58 -192 -301 -41 -329 -16 463 20 -104 130 36 121 -195 50 -187 78
1966 78 -57 -16 -205 -135 164 535 43 148 145 191 266 -26 -56 -29 -89 241 205 -28 104 179 167 -15 246 47
1990D7J86K27l44L23j41j06l3Q2J38k36j4o5P7K41n30O09M5m84K67J85k93L77
2012E58l18k00J95Q4M0k2J49k93N1K74O7k25J45j90N7J14k72o3Lq3K94m5m7q7
2036A86L29k20o4J15N6J43k41J95j19p7j60J39J06l29M00P5l27J52n1j02L41k67
2058B80K71k13Pj87J30K38k19j27L50j33j5j56J22K33m61r8L58P1k23j61K17j23
2080A61k89M68m69L46J3O1L09n75L31r3j41J0l9L36m19Q9L7nJ09j02j95N4N4r7
2104d6N75o65J38J52J09p6p2J01J71n1k82k33K46M9k79L32l81K65j65K76l04J50
2126A0n5J02K02k3q7L1M8l17O6L06P0l26M51j08l0l53p0J65J51k41K04O5l51J32
2150D2K88k63l54M41N9M1L3k65J10K6n08P47k51n5R9J12J99o24J63j06K15m1k18
$$ plain form
1990 47 233 460 116 439 298 192 159 241 379 143 129 64 141 382 -148 461 506 22 289 474 181 558
2012 558 240 40 235 319 359 337 486 193 244 518 585 360 505 315 372 486 214 151 154 71 365 320 273 186
2036 186 515 295 231 346 402 545 304 499 380 303 143 282 388 59 459 534 207 359 308 206 547 280
2058 280 551 338 345 158 288 526 307 180 530 397 382 226 348 581 120 22 380 451 228 67 284 161
2080 161 -128 340 -129 217 230 291 600 25 356 263 122 132 93 429 10 99 136 131 240 138 -57 -3 51 -46
2104 -46 529 -136 2 154 263 187 115 216 387 336 54 -179 67 116 -163 169 -212 53 -112 164 -140 10
2126 10 -45 57 259 236 149 180 228 -89 -23 283 353 27 478 370 340 -13 -83 82 233 -8 196 261 -90 42
2150 42 330 67 -287 154 213 254 287 22 132 158 -350 397 146 91 190 302 501 -123 40 -66 149 108 -110
2173a10L38j57j02J36l2k78J82p7K31N7j23o3L30on99K72J04J93m1Q5k28k23K51
2196A40k35J74j00Rl11K99O0m23M03n94N14q3r6J31j45Q5P0Jl91L06J88k80K46
2219c2J32l69L31k33N9nl24J07K68J13m06J42J29q8j15K92m16L29j40J07j90J33
2241a76j68J88J85m20M5K42j40j59K73m30O76n36L43n0n62L39n6K66k19j5L45
2262b9j59Q9k33j40K70N7k30M43j48j76j38J95Q6J22k94k62L31J27j19J57J34
2283H3l98L64k57o9o9J80l4J83k56j41K30j83Q6K04j23k27J7L01k80L53n9Q4k6
2306c7J42k05m7j90l56M15O7l56N65l57M10k93O3K48l20mQ4j38J10o3J94j74j46
2329c88M77k62n7j05K81q7j86j40J46p3L73l33m8L20k62J66R5q5l57K70J68k21
$$ plain form
2173 -110 228 71 -31 105 73 -205 -23 -100 131 188 65 2 332 326 -273 -1 103 296 255 340 112 -111 140
2196 140 -95 79 -21 -12 -323 -24 36 -387 16 -578 -64 -147 -243 -112 -257 -172 -102 -101 -492 -186 2 -278 -32
2219 -32 100 -269 62 -171 -112 -117 -441 -334 -66 47 -359 -217 -88 -176 -291 1 -415 -86 -226 -119 -309 -176
2241 -176 -344 -156 29 -391 -346 -104 -244 -403 -130 -560 116 -420 -77 -127 -689 -350 -406 -140 -359 -374 -29
2262 -29 -188 -99 -332 -472 -202 -145 -375 68 -80 -256 -394 -199 -113 9 -285 -547 -216 -89 -208 -51 83
2283 83 -315 49 -208 -277 -346 -166 -200 -17 -273 -414 -184 -367 -281 -77 -200 -427 -410 -109 -389 -36 -95 -11 -37
2306 -37 105 -100 -147 -337 -693 -278 -211 -567 -2 -359 51 -242 -179 69 -251 -255 -171 -309 -199 -262 -68 -242 -388
2329 -388 89 -173 -230 -335 -54 -141 -327 -467 -321 -394 -21 -354 -402 -82 -344 -178 -83 -168 -525 -255 -87 -308
2351c08J69p8qN9j7L9n7l42LN20P5m38J01J44k94L39o07K20L05k20K35m4J25j27
2375b06q2r6j74LL13j63N12n14R1jJ20J15k14M52l07j13L9N5k09j43L66p6R8m22
2399e56L98J01j33m8r2J24l1K20j53k32J62J88J66j83j06k8m8K45j72J49jk3k33
2422b86Q5k12K39K66k7r1k0Q3l71K64m5P2L84l13l4J99Rm05J71R7O9l27L49j07
2446D9l19J39K93k47J38J10j18j05O7j38n1P3j8J56K50k39P0J64R4m87J80m7J82
2469A96P2l58J47J38k35l4N5K45K9K5K46o12J20K43j81J43k26j36M21j88m5O7
2491A32J41k76J47j9n7m8J8J84q4j16J96J37j24J68k50J9k16J39rQ3j71L66N0
2514D10j80j2M2Jj77L33l09l9k71M13J54r2l35J8J72M56n02l99M28j14J96J18
$$ plain form
2351 -308 -139 -217 -225 -166 -183 -144 -201 -543 -540 -20 55 -383 -282 -138 -432 -93 -700 -480 -175 -395 -160 -204 -79 -206
2375 -206 -288 -384 -558 -555 -242 -405 107 -407 -316 -317 -197 -82 -296 156 -151 -264 -225 -170 -379 -522 -156 -232 -134 -556
2399 -556 -158 -57 -190 -238 -330 -206 -237 -17 -170 -402 -240 -52 114 -69 -175 -203 -251 -6 -178 -29 -30 -53 -286
2422 -286 -201 -413 -174 92 65 -26 -46 37 -334 -70 -115 -43 341 28 -6 193 202 -203 -32 65 134 -193 156 49
2446 49 -270 -131 162 -85 53 163 45 -60 7 -131 -182 -109 -127 29 279 40 110 274 368 -119 61 14 196
2469 196 268 -90 57 195 -40 -74 -19 226 255 280 526 -86 34 277 96 239 13 -123 298 110 65 132
2491 132 273 -3 144 125 68 20 38 222 138 22 218 355 231 399 149 168 -48 91 82 165 -6 360 410
2514 410 230 218 260 261 84 417 108 69 -202 211 365 273 -62 -44 128 584 82 -317 111 -3 193 311
2536C11nk48J7J68l12J43J94q6P7j39j73J85J2R4j26o3J93p7j57L8M44l46j82
2559c8N88l04q2o5rJ23Q7K45k09j74J18j48L30k03j14K12j35j62R6l8N2k5J9Q3
2583B47p1L9K6J4P1p7J21l4k32o1J17J5L6k06K93k32r0l25O97m97p2P72l1l25
2607A95j99L10L02l30l36L16Q0Q8k46J55Q4l94J24Q9k16L85m62J86j16J78k31
2628c8K88J86j46k07K33l73J29L09m31K05j49J67P4l80M60l18J43p3r8r8L06j31
2650E8j52L40j32r3l4J47K2J10k25K80k42K34k2M1n15K07m2L68k75OJ3j82J76
2673H8J05O8k30q5J81m20K54K68k31Q3k1k47M40r5j88l1j23K4R1J24O1K16L2o39
2697b75O51L8m58J78o3K23r1k6l52K05M38m03R9j33j0L1J42k3n9O9k36J46p6P3
$$ plain form
2536 311 306 58 75 243 -69 74 268 182 259 120 -53 132 144 238 112 49 242 165 8 46 490 144 -38
2559 -38 550 246 164 99 90 213 300 545 336 162 280 132 462 259 145 357 222 60 156 118 170 145 164 247
2583 247 176 215 241 255 326 249 370 336 104 43 160 175 211 5 298 66 -24 -349 348 -149 -221 551 520 195
2607 195 -4 306 608 278 -58 258 338 426 180 335 419 25 149 238 22 407 -55 131 15 193 -38
2628 -38 250 436 290 83 316 -57 72 381 -50 155 6 173 247 -133 327 9 152 79 -19 -117 189 58
2650 58 -94 246 114 21 -13 134 156 266 41 321 79 313 291 332 -183 24 -18 350 75 81 94 -88 88
2673 88 193 261 31 -54 127 -293 -39 229 -2 81 60 -187 253 158 -30 -61 -184 -160 -69 55 116 332 364 -275
2697 -275 376 414 -44 134 71 294 203 177 -175 30 468 65 164 31 21 52 194 171 112 181 -55 91 15 88
2721H8j33L1N7o5o4k51K22J17o7K66j37j28J3J88k1k85j70L84j47J46k78M18k54
2744g0l27K08K23j58J45J42n9k87R6K8RJ77l57K84q3J64k94nJ24J06j83K00k21
2767a38J29l09L72M1k09k20R7K17J42l02K34j81j72K05k04K49k3m5m9L6m0J32
2789c8m4J47j33j71J62l26M13l46K19j7Q8j01p3K05j23o8J9R4j95L33l05o7K34
2812i3j98R4P6J33k87K34q2k27k42O72k44J16p2j96L47q9j36O8J39j00r3J29o5
2835a16j2N5j71J59p5J30K70k74k42j9J56L41k53k37L01O5l17K05j82O4l4l8L13
2858H9j42j40K17j77q8N2L1L45j8k63j34j15K22P6K6L74n48L21m02J34M5J38k50
2881b07K34J79k38R4k87K25J29l53K44K38k39M2j34O6o8m5M13m88n6L42q7k72
$$ plain form
2721 88 -45 -14 43 -22 -86 -337 -115 2 -65 201 64 -64 -51 137 116 -169 -339 45 -102 44 -234 184 -70
2744 -70 -397 -189 34 -124 21 163 104 -183 -87 -59 -50 127 -230 54 -29 135 -159 -164 -40 66 -117 83 -138
2767 -138 -9 -318 54 95 -114 -334 -237 -20 122 -180 54 -127 -299 -94 -298 -49 -72 -117 -166 -130 -170 -38
2789 -38 -82 65 -68 -239 -77 -403 10 -336 -117 -134 -46 -147 -220 -15 -138 -206 -187 -93 -288 45 -260 -327 -93
2812 -93 -291 -197 -121 12 -275 -41 -123 -350 -592 80 -164 -48 -120 -316 31 -58 -194 -126 13 -87 -180 -51 -116
2835 -116 -128 -73 -244 -85 -160 -30 240 -34 -276 -295 -139 202 -51 -288 13 78 -239 -34 -216 -152 -186 -224 89
2858 89 -53 -193 24 -153 -241 -189 -158 187 169 -94 -228 -343 -121 -45 -19 355 -193 128 -274 -140 -95 43 -207
2881 -207 27 206 -32 62 -225 0 129 -224 20 258 19 61 -73 -7 -75 -120 293 -195 -251 91 4 -268
2903b68M19j37j07J77j89j50Q3K43J14j32M6J64k46j57M1o6q0M58k86k4L3K42
2925A78m27R7J61J18rj25Kj24K17k27J83P8j86K17l39J38n0K24rj83P0J00p8J07
2949A33k45J07k39J52j91J50J1O2K7j10K95Q7m74K87j78J61j02j26L46j65J60
2970A48p9k05k28L29K23r5l03K08K55k06j33J46p1O4k02K47k2l40O21l47%M0j6
2993C4j16j58K27K82k66mJ03L3p5M2J82m49M41m7J94n40Q9k1K51N8n65L07K99
3016C01k26J06m7j94M4Q4r1j3j05J48K14j01P0p5j48J46j05j38K42J2QK09k45
3039I6K6j88J04m3q3j6K4k5K55j43LL62k44j40O9J48p8k51L75j32j35J30k08R4
3063@N7J26l9j09K25n4k57J38L0L2l9q1l78K74K06J55k32j76K93J1k67P6J90j79
$$ plain form
2903 -268 151 14 -93 84 -105 -255 -172 71 185 53 99 263 17 -140 -99 -165 -245 213 -73 -97 -64 178
2925 178 -249 -152 9 127 118 -7 -5 -129 88 -139 44 122 -64 153 -186 -48 -98 126 117 -66 4 104 26 133
2949 133 -112 -5 -244 -92 -283 -133 -122 -60 -33 -143 152 239 -235 52 -126 35 -67 -193 153 -12 148
2970 148 69 -136 -364 -35 188 93 -210 -2 253 47 -86 60 -11 53 -149 98 76 -264 357 10 10 50 34
2993 34 -82 -240 -13 269 3 -1 102 135 60 102 284 -165 276 229 423 -117 -28 -49 202 260 -305 2 301
3016 301 75 181 134 -60 -16 68 -23 -36 -141 7 221 120 190 115 -33 113 8 -130 112 124 132 341 96
3039 96 122 -66 38 -5 -88 -104 -80 -105 150 7 10 372 128 -12 57 205 127 -124 251 119 -16 114 -94 0
3063 0 57 183 144 35 260 206 -51 87 117 149 110 29 -349 -75 131 286 54 -122 171 182 -85 -9 181 2
3087BL16l51J88k78mO6K17k3m0l18L43K0j94M18k52j06L48k07K13j53K5j48K56
3110C38l88q2N7p0L64k08K05j84R1j00N7%n0l4J41j23k9q2N8K33j59J9r4l85L73
3135e2N3K76k86l17M69l07K91O1k52j6j8J67nm0k09J83j40L00j93n2K5L16M2k35
3159F1N2n33L22oJ09K31l09l0K24p8p2J78l3rk36j52P4L35k82K22k65L5K06n94
3183e50O08l41L22J20l1j12l0p9O2k4j04J62j25Kk7q8L42j04J01k10l25N01k47
3206a77L4K56m50L9J21K05J9j34L9P4Mk73K1J81o3L0m8K99k43j49K81l9j28J11
3230A0J5j18k11N46l59J45k69N80m77K14j74N4N6n3J97l22M50k12j3l4l54L95
3252F6P2q5m3j01J64R8l27j30n2J64j7K33m8r9L0j25R9J71j58k03J92K35r3j12
$$ plain form
3087 2 318 -33 155 -123 -127 -61 156 133 93 -225 118 138 -56 362 110 4 352 145 358 205 230 82 338
3110 338 -50 -132 -75 -145 219 11 216 32 123 23 80 80 30 -4 137 14 -15 -97 -39 194 35 54 -40 -425 -52
3135 -52 1 277 -9 -326 143 -164 127 188 -64 -80 -98 69 64 24 -185 -2 -142 158 -35 -87 -62 254 296 61
3159 61 113 -420 -98 -104 5 236 -73 -103 121 43 -29 149 116 107 -129 -281 -207 128 -154 68 -197 -162 44 -550
3183 -550 58 -283 39 159 128 16 -14 -93 -31 -55 -159 3 -122 -120 -147 -235 107 3 104 -106 -431 70 -177
3206 -177 -143 113 -337 -298 -177 28 47 -87 -48 26 30 -243 -222 -41 -104 -74 -122 177 -66 -215 66 27 -101 10
3230 10 25 -93 -304 242 -117 28 -241 339 -138 76 -98 -44 12 -41 156 -166 284 72 59 25 -329 66
3252 66 138 53 10 -91 73 171 -156 -286 -338 -174 -191 42 -6 -105 -75 -200 -101 70 -88 -291 -99 136 43 -69
3276f9l8N2J63l27L59k17L16l01j14j0N7K62j49N9m8k47R1r5K56j29L30j08j02
3299ij83k4jJ18J22J60j94m9R5j03j49J71K42m69M12j09o9l2n1N6m8Q6j35qp5
3324b46K25O4L3m49M49m43RJ26K94k26n9J16k04K90j89Q6K09n3n4j44L26j09J0
3347F1k83K38l33J33K32k86L09j9K7J28m06q3L17j45K11k52J20L77l48K61l18
3368e9k35L77m04K96K01j01k49j99L12J83j20K47j27k88l3L19Kq2k29l0M58k11
3390B8k04N2K83N0q8j18j46J20n8j3L15L1j52q4O7J12J30k09j4l26L01J05j50
3413C2J29O3k22j35M0o5J37Q8J51j52j28k64M10j13N8P1k7J32j37J92k77L9Q7
3436A09K1j03K08k3l62L84k03p7ROL7l2j6M5J58n0J6q1n6K95m56K52l00O34n28
$$ plain form
3276 -69 -107 -55 108 -219 140 -77 239 -62 -176 -186 -129 133 -16 43 -5 -252 -161 -256 0 -129 201 93 -9
3299 -9 -192 -216 -217 -99 23 183 -11 -60 35 -68 -217 -46 196 -273 139 30 -39 -71 -122 -66 -114 -28 -163 -171 -246
3324 -246 -21 43 76 -373 76 -367 -358 -232 62 -164 -223 -107 -311 -21 -210 -124 85 32 -22 -166 160 51 61
3347 61 -222 16 -317 -184 48 -238 71 52 79 207 -199 -282 35 -110 101 -151 -31 346 -2 259 -59
3368 -59 -294 83 -321 -25 176 75 -174 -373 -61 122 2 249 122 -166 -199 120 122 40 -189 -219 239 28
3390 28 -176 -124 159 209 121 3 -143 -23 -81 -94 221 252 100 16 83 195 325 116 102 -224 77 182 32
3413 32 161 224 2 -133 -93 -158 -21 67 218 66 -62 -326 84 -29 29 100 73 205 68 260 -17 22 109
3436 109 130 27 235 212 -150 234 31 -46 -37 -31 6 -26 -42 3 161 111 127 46 -10 285 -171 81 -219 415 -113
3461a13K98J32k47k90n0M41k20K33N0k63j80L20q5j54L12k28j12L52k79O4L%o2
3484g8J53k01M42k80L16k96Q4j33L2r4O8L63l35j39PL71j2j67o8J96j38K6j58
3507d1K5J11m8J70l81K42J21n2k25J40k39K57l70K03L17l86N3K35j23j5k8j04
3529a38M82j44j78j39L85k4p6r5J24k89R5Mk28K58K51r8no2p6l3J1%j58J34p6
3554g5K27o6m1P0k3j80N2L23J65l66k22K06q4n1J80J02j20L4j00L40l74m7k8P
3578g1Q9K27k38j26J01o5r2K80l1P6%q5J82m4Q3m19Q8o2L03m29Q5p7N98k59k62
3603a48J85jk6J76l06P0J34j34K16Nk34M32m09L7J39j32q2J76N8j44K33j55j09
3626a9L6L93l62m69L28R5R6k65J71J41q9j40J47l07K22j37K9Q6j15K19J62k31
$$ plain form
3461 -113 185 317 70 -220 -270 171 -49 184 234 -29 -209 111 26 -128 184 -44 -156 196 -83 -19 -16 -16 -78
3484 -78 75 -126 316 36 352 56 140 7 39 -55 13 376 41 -98 -91 280 268 101 33 229 91 117 -41
3507 -41 -16 95 47 217 -164 78 199 147 -78 62 -177 80 -290 -87 230 -156 -103 132 9 -6 -34 -138
3529 -138 344 200 22 -117 268 244 168 73 197 -92 3 7 -221 37 288 190 185 123 47 14 25 25 -133 1 -75
3554 -75 152 86 45 115 92 -88 -36 287 452 86 -136 70 -14 -65 115 217 97 131 31 371 -3 -50 -78 -71
3578 -71 18 245 7 -119 -18 -83 -175 105 74 150 150 65 247 203 286 -133 -45 -107 196 -233 -148 -225 373 114 -148
3603 -148 37 36 10 186 -120 -50 84 -50 166 171 -63 369 -40 -3 136 4 -78 98 156 12 245 90 -19
3626 -19 17 410 48 -421 -93 2 98 -167 4 145 56 -84 63 -244 -22 -159 -130 -44 -159 60 222 -9
3648iK70J30l57K74k47k21K54q3O3j11M5J66K4l49L25k01l39N00k41L19J15l28
3670aK32j35j59P8J6j84J29O2k62K76m1k24R8P7J52j21lj34L9L27l89P6P6j33
3694a48K0J10j74N4J38r5M7o4j49J3n5J72K85J82l57L7n7L2j0O4l20L94r6m4Q2
3719F1j33J03Q2J05j08p4j92J2J88Q1K09l46Lk24K17q0o9J15k52J20J19M7k42
3742b58J15O7j46N0L0J11k11K4K90k1j76p1J61J4k5J6J6j34J01k0J10K42j8j78
3766H9k76P0O2k04L75m9L0p9r4J0r6p6J34J80j70J10m2q3J6j03N6N5K4n3r9M3
3792a70M59k84R2Q5k24J8J1J99k02J08o19L74R0K0j51K51o8m98O40k42r7K10o5
3815f3j23M11j56n9l8J74l53L3K09j03K26l15k6J39J82j09M4k01J49j11L48l13
$$ plain form
3648 -9 261 391 34 308 61 -160 94 11 74 -37 8 174 198 -151 174 -27 -366 134 -107 212 327 -1
3670 -1 231 96 -63 15 31 -153 -24 38 -224 52 11 -213 -115 -38 114 -7 -10 -144 -105 222 -167 -91 -15 -148
3694 -148 -128 -18 -192 -138 0 -95 -48 -112 -261 -248 -303 -131 154 336 -21 16 -41 -9 -19 45 -275 119 23 -21 61
3719 61 -72 31 113 218 110 36 -156 -144 44 125 334 -12 -9 -233 -16 -96 -165 -50 -302 -182 -63 -16 -258
3742 -258 -143 -76 -222 -172 -142 -31 -242 -218 72 51 -125 -196 -35 -21 -46 -30 -14 -148 -47 -67 43 285 267 89
3766 89 -187 -117 -55 -259 116 67 97 18 -76 -66 -162 -238 -104 76 -94 16 -26 -109 -93 -196 -140 -85 -61 -114 -213 -170
3792 -170 289 5 97 182 -42 -24 -13 186 -16 92 -527 -153 -63 -43 -194 57 -11 -509 131 -111 -208 2 -63
3815 -63 -186 225 69 10 -28 146 -207 -174 35 -68 158 -157 -183 -44 138 29 73 -128 21 -90 258 -55
3837e5j23K18p3n3j02K91l60L33J44O9k93j26J93K44l44K27l45l6J55J5r5J00
3859a6R3l45J45L02l53J61p8K56L2n0k12K2J44k12J20j15J75m89O8J20L15J82
3881B65l87J38k9j45rK35O4j91J46k28R3rK8K76k18K00j69N1J04k29O6l29M00
3904A23m12M92l06k03M22l74M02k47R5k09K92p2k9o1J72k90J32j29K87k9k14K33
3926G5k37J86q1N8k11J94m0j3J29l5J36j72M9L9k62M9K83j73l0k9K15l6j83N4
3950c5J99k18R5j6k57K43N9n4J17n7N6N1k79L04n23J45L79r1l43J69J36R5J20
3973B95j75l44K31k9j6n4L52k61k0j40L15N1k05k3J35k33K21j43K1k9QO5j07K09
3997A24k15K56Rq6j71m2k1P7jL06k72J10j02qO9k17O5R5J11p4P5q5r5J78j25k
$$ plain form
3837 -55 -178 40 -33 -86 -188 103 -257 76 220 289 -4 -130 63 307 -37 190 -155 -191 -36 -21 -116 -16
3859 -16 77 -268 -123 179 -174 -13 -91 165 197 147 -65 -43 101 -111 9 -106 69 -420 -352 -232 83 265
3881 265 -122 16 -13 -158 -167 68 132 -59 87 -141 -48 -57 -29 247 29 229 60 111 215 -14 52 -277 123
3904 123 -289 203 -103 -306 116 -258 144 -103 -8 -217 75 3 -26 -87 85 -205 -73 -202 85 56 -158 75
3926 75 -162 24 -57 1 -210 -16 -56 -69 60 25 161 -11 38 77 -185 -136 147 -26 -56 -85 130 94 -89 -35
3950 -35 164 -54 41 25 -232 11 70 16 133 76 132 183 -96 208 -315 -170 209 118 -225 -56 80 175 295
3973 295 120 -224 7 -22 -38 -92 260 -1 -21 -161 154 205 0 -23 112 -121 100 -43 -22 -51 -43 22 -85 124
3997 124 -91 165 174 88 -83 -125 -146 -69 -70 236 -36 74 -28 -36 33 -184 -119 -24 87 13 88 3 -92 86 -39 -41
4023d1J26K4l20J91J56j74K05k86J10K3P2j67m8M9Jk99K30K44j01j72Q1Q9L83
4046C76j80l34J98k16J95o3r0J11J08q1J18k26J9k4K75J50k73k08K65o1q8M35
4068D06n50K98J74k43K6ll46M97k86k38J69L92l94J23k79K08J70n6q3J9K54n70
4090c12M42r0L30l47L3R2j10j51J49q6M6q3k15J66M2M26k33j72K12q4M6j44p7
4113a20L39q8j09P1j40K54k00J64m04K33l6J36O1j7l45O1J67l8j98K42p4K45k95
4136i1m3J33j79J30j54J03K23Q1o3k82J74q5j61K88ok24M16l07L99k12j95M0O1
4159D6O3k58K60nk55j44M19j73j18O3n8K50J85l41j50M18n17R3R3o7J68j65J62
4182c1n1J03K11l78K88j54k01K91j53k4o1K71j23Q7o2K45j91l04K10j88M54j85
$$ plain form
4023 -41 85 109 -211 -20 136 -38 167 -119 -9 14 86 -81 -129 -80 -79 -378 -148 96 -5 -177 -96 -7 376
4046 376 196 -138 60 -156 39 -24 -114 -3 105 24 142 -84 -65 -89 186 336 63 -145 120 59 -29 406
4068 406 -144 154 328 85 111 108 -238 259 -27 -265 -96 296 -98 25 -254 -46 124 68 -15 4 258 -312
4090 -312 130 40 370 23 56 148 38 -113 36 -50 -4 -87 -302 -136 -94 332 99 -73 139 55 101 -43 -120
4113 -120 219 131 22 93 -47 207 7 171 -233 0 -36 100 161 144 -201 -140 27 -11 -209 33 -41 204 -91
4136 -91 -134 -1 -180 -50 -204 -101 122 203 140 -142 32 -53 -214 74 68 -156 260 -47 352 140 -55 -15 46
4159 46 109 -149 111 106 -149 -293 126 -47 -165 -102 -160 90 275 -66 -216 202 -315 -222 -129 -196 -28 -193 -31
4182 -31 -82 21 232 -146 142 -12 -213 78 -75 -99 -160 111 -12 75 13 258 67 -237 -27 -215 239 54
4204E4j19j86L80j05j62J99j28p7O2N3j61K53k16P4J05K06Q8m29j90M49j43R6
4226A03l18L84M2r9m7j91L22m09K8J70M1L3J05m62K66m0J4J75q7O8j67o6L5J28
4250B8k81J09K84m0j27K4o8J16j22m6J40J24k64L16m14L36k79K42J0r4n23M79
4272e0l9o0J31J86J76k36l27J30J06J10j03J28j65n7L5K62k10jJ5J40o3j51k5
4295f8R6l0N1k38p1K13J72J00l21K52k39p9K41j68j15K86o5J15k45O6R1l07K97
4318C4P1p8j44R9k0M2k1J31n2P5k78J30k44L10o5j73K62o8n4j90J92J46j73N1
4342a7j06M38j00l13J00q9Nm9M25j23K05l55j44M8J23j27R1K93l68M4J6k4l7R
4366e5K26K76l57l2QR7j25l49N51r2k4j68k7J51N9j23J44j01k33nJ55k3K6l43
$$ plain form
4204 54 -65 -251 129 24 -138 61 -67 -144 -82 -29 -190 63 -153 -79 26 232 320 -109 -299 150 7 103
4226 103 -215 169 211 112 65 -126 196 -213 -185 -15 26 59 164 -298 -32 -72 -58 117 30 98 -69 -135 -100 28
4250 28 -253 -144 140 100 -27 -3 -71 45 -77 -123 17 141 -123 193 -221 115 -164 78 88 -6 -529 -50
4272 -50 -89 -149 -18 168 344 108 -219 -89 17 127 24 152 -13 -70 -35 227 17 16 31 171 108 -43 -68
4295 -68 28 -2 49 -189 -260 -47 125 225 -96 156 -83 -162 79 -89 -204 82 17 132 -113 -47 44 -263 34
4318 34 105 27 -117 -18 -38 4 -17 114 62 137 -141 -11 -255 55 -10 -183 79 11 -43 -233 -41 105 -68 -17
4342 -17 -123 315 215 -98 2 -87 -82 -131 294 171 376 21 -123 -75 48 -79 12 305 -63 -19 -3 -27 -64 -55
4366 -55 171 447 90 58 66 163 38 -311 240 148 124 -44 -71 80 139 16 160 59 -174 -179 -24 -47 -21 -364
4390c64L47q2J53m82L21L24k82N8j67L87j76p0R4k82J23K54j48L9l5q0J03J24
4412A59j05j02K64o0J25k85j14L5J54p2r1J83O1j78L7J04l8j49O7k11K89l23M31
4435A81k27K8J85j49J28l8m02O36k43Oj25K03j47p8M3K37k21M6J7m57L86p4r6
4458a61J24O2q1j21J1J20j31L54j90l12K51q0J33k60J94p5l9L12q0j77L36j79
4480A1r4J20K3L52m64j18J81m7k30K08J77k92L5K9K24j16p2K53j87l4K7r1J57
4503E2J76k02l1Q0j68p4J18J1O0j12l25L76l25L94p9Q1J7r0K17n2k39J43p6M6
4527bNk58q6L13N7k60R7LJ21L9k49J92P6l11L15p2j32J6J6L34l63J94K2k45K08
4552C0j2K3k48J42q5J17k34J43ok7J53R9k46k06M34k48L18k0p9k55M27j77k31
$$ plain form
4390 -364 -17 -99 54 -428 -107 217 -65 -7 -174 213 37 -33 61 -221 -98 156 8 47 12 -68 35 159
4412 159 54 -48 216 156 281 -4 -118 -83 71 -1 -92 91 152 -26 11 115 77 -72 -5 -216 73 -250 181
4435 181 -46 -18 167 18 146 108 -294 342 99 105 -20 183 36 -42 1 238 17 63 80 -377 9 -65 -161
4458 -161 -37 25 -56 -177 -166 -46 -177 177 -13 -325 -74 -154 -21 -281 -87 -162 -201 111 31 -146 190 11
4480 11 -83 37 60 412 -52 -170 11 -36 -266 -58 119 -173 -138 -109 115 -1 -73 180 -7 -41 -14 -105 52
4503 52 228 26 -5 75 -93 -167 -49 -38 22 -90 -415 -39 -364 30 -49 32 49 -41 176 124 -115 28 -48 -2
4527 -2 3 -255 -341 -28 29 -231 -134 -131 -10 29 -220 -28 48 -263 52 -20 -152 -136 -120 214 -149 45 67 -178 30
4552 30 18 41 -207 -65 -150 -33 -267 -124 -130 -157 -4 95 -151 -357 77 -171 147 127 48 -207 220 43 -188
4575a88N1L22m3l98Q9K19j96j72j29N08l38M75q4q3r3N2l0R0j0l11N31k85m7j0
4599h0K2n9k5M4j68L35Q9k38J36r8q4K83k95J75L2n0R7Q3n09M3M49k43N8j57J12
4624d8k21M04j67J02J32J2l91l7J12P0k00K55k09j1J19m7L8l17N68k26l48L95
4646a5l73M87o4l35L1K78O9k29N0j29k0K99j05R6J77k80M6K28j73k1n4J74l94
4669b57j9L22J85m25J53K16j33J81l22J20m3M5j18K4J5q7L10l03J77p0M8J57q0
4692I6j21M9j85L05m6j53J90j14M3k7J21P1k96J56J6L7Q5m44J10P5K6K55JJ12
4716C62l08k45K70j47o9R0Q0L2j13k80M08l80J46K05j21K51k21J78m7r3M3J24
4738A65j84P5N7k15M6nJ73j16q7N7k48L8J10N1M0n6N0J82j9K9k76J22l4J73J27
$$ plain form
4575 -188 -137 185 142 -256 -167 52 -144 -316 -445 63 -275 200 116 33 -60 -8 -38 52 42 -269 262 -23 -70 -80
4599 -80 -58 -117 -142 -98 -266 69 158 -80 56 -42 -126 157 -138 37 69 19 116 199 -310 -267 182 -61 -3 -160 -48
4624 -48 -269 135 -32 70 202 214 -177 -214 -102 -32 -232 23 -186 -197 -78 -125 -87 -404 164 -62 -410 -15
4646 -15 -388 99 35 -300 -269 9 78 -151 -101 -230 -250 49 -56 40 217 -63 -17 211 38 17 -37 137 -257
4669 -257 -276 46 231 -194 -41 175 42 223 -99 21 -22 23 -95 -71 -56 -143 167 -136 41 -29 19 176 96
4692 96 -25 24 -161 144 98 -55 135 21 64 37 158 229 -67 89 105 142 227 -217 -107 -32 -6 249 250 362
4716 362 54 -191 79 -68 -137 -47 33 65 -48 -328 80 -300 -154 51 -70 181 -40 138 91 -2 41 165
4738 165 -19 56 113 -102 -56 -61 112 -4 -91 -34 -282 -244 -134 -83 -43 -99 -49 133 114 143 -133 -11 -45 128 255
4763B55m04L5L8l1K4pQ8Q5L9Mk37L31k62Lqo8J48jJ26j72l2op3j4L12P6k40J4
4791B3Qj77P4J89m62K36M8Q3M8K2k01J92P7j37N4Nl5J83l46M03l13N8j7k13K05
4816Gj79J72j82K03k47L91j62O8l43J99J98ok4l81L20q8K81m65L05o1m2L81m01
4839e6Q3k04J03J13p4k8R8k6rM4M1o8l4kP8Q9m5j32J9o3K00j30J03k27m9O7R0
4866a9p2K61p5j73P0J66j86J94k62J37j82J51j37K85o9k83L10m0j61N4m7j36L30
4889A16j84qJ0j1k5L28k21k86K10L1n5J14k45K74j36K98K0l21J42J82m11K6r8
4912b50K81j5K9k00J21j77M44k54L97j33o38M04M2j05j63L61j82o4m0J81j07k7
4934i5j25J17K41j74j37J77K97l8o1jj60J49p8j47J80l67J63K03j50J60N0m05
$$ plain form
4763 255 -149 -114 -76 -107 -83 -90 -2 83 122 126 -111 220 -42 -39 -47 -115 33 32 158 -14 -46 -52 -125 -139 173 249 9 23
4791 23 31 -146 -72 117 -345 -109 -61 22 70 92 -109 83 160 23 77 82 47 230 -116 287 -26 32 15 -198 7
4816 7 -172 0 -182 21 -226 165 3 71 -272 -73 125 119 95 -286 34 -54 227 -238 67 6 -36 345 -56
4839 -56 27 -177 -74 39 -35 -63 35 9 0 44 85 17 -17 -19 59 148 103 -29 -10 -73 127 -3 100 -127 -176 -109 -19
4866 -19 -91 170 95 -78 -8 158 -28 166 -96 41 -141 10 -127 158 89 -194 116 76 -85 -31 -78 -214 116
4889 116 -68 -76 -66 -77 -102 226 5 -281 -71 -40 -95 19 -226 48 -88 210 230 -91 51 233 -178 -152 -250
4912 -250 31 16 45 -155 -34 -211 233 -21 376 243 -395 9 51 -54 -217 144 -38 -102 -142 39 -68 -95
4934 -95 -220 -103 138 -36 -173 4 301 263 202 201 41 190 112 -35 145 -222 -59 144 -6 154 204 -201
4956b01L69p2m21l8K75L8N7p9k15N37m37J61J3K24r3n4j27m7k0L41J17l18j27
4979a17PL23k28K12n8j12k32J02K01n8k26K37Q6mp1j15p9m4L9J92k01K01r9l8
5003h2J02p7L32j92l01J07K16J42l37N0k76K38L34k23K7k57R8J97j62L79j15p0
5025A30K15n56K75r7R8k41K32q0k10oL48j20M2J5L3l21j89K75m3K56k01R5J88
5048A38k75K72j28J34p4R9K4j68m67N91k63o1K33o9k4j9j68L5J06k1n5kL01j81
5072d2LJ32j52O2j0j1n2J5J45qp0m8k21M48k20J06J19k62RJ31K62n6l31j6K09
5097A42j62J87k3k86K26m22K24m8L02jm0k32K0R5J03J41k69k54L77J67J3k81K44
5120B23p5k40m6J57j5k12K00J41k06O0Q2l4r5j70K83p1N5k9p6L00j42j23qj60
$$ plain form
4956 -201 168 96 -325 -363 -88 -50 7 -72 -287 250 -187 -26 -13 211 118 64 -63 -110 -130 211 328 10 -117
4979 -117 -110 213 -15 197 139 27 -205 -103 98 40 -186 51 137 133 62 -53 -132 -176 -137 55 -146 55 -44 -82
5003 -82 20 -57 275 83 -218 -111 105 247 -90 -40 -316 -78 256 33 60 -197 -99 98 -64 315 200 130
5025 130 345 -211 64 -33 65 -176 56 -24 -234 -240 108 -12 30 45 78 -243 -432 -157 -200 56 -145 -50 138
5048 138 -137 135 7 141 67 166 190 22 -445 146 -117 -178 55 -14 -38 -57 -225 -190 -84 -105 -160 -162 139 -42
5072 -42 -39 93 -59 3 -7 -18 -70 -55 90 82 12 -36 -257 191 -29 77 196 -66 -57 74 336 280 -51 -67 142
5097 142 -20 167 144 -142 84 -338 -114 -162 140 139 99 -133 -113 -18 85 226 -43 -297 80 247 260 -21 223
5120 223 148 -92 -138 19 4 -208 -8 133 -73 -13 69 35 -60 -230 53 -18 37 8 -68 232 90 -33 -41 -201
5144b01K28Ll35M72m56M12K12l18j53J76n9l38M70m2n5K4PN2r5j71J29K5J56k95
5168a52r2L43j08k77K94J73k61k8L88l90n9J90k66J48O6J14K49k34j83M2J25R9
5190A81R1k24k42K33m4Q7k90J92j21J06J60k73O6m7J83j06K20l53K86j30J34K
5212A11k78L63j23J15m23K10J50k47L7J87J77k46K72k98J21j41j19mL51l01J8
5233f8m9K90k43K06j27P9n2n5j5k1J97mj39j58J96j69Q1M34j06l68J22l19M42
5256A54Jj02j8O4j84J77j2N8K11m67K55Qn13J97j29L78L6j73J03j36K85k58n6
5279a21J65Pj61J7L36k48J59j43L8m9J37n8j09j75K60J02j95RK53Qr0m69L34j15
5303a08K28N3m8L1j85j58L96J7q6k27K43j75N2J44l18L63k33N4O9k54P2j0J00
$$ plain form
5144 -201 27 30 -305 167 -289 123 335 17 -136 40 -19 -357 113 71 16 40 47 99 4 -167 -38 -13 143 -152
5168 -152 -244 99 -9 -286 8 181 -80 -108 280 -110 -169 21 -245 -97 -31 83 332 98 -85 -43 82 181
5190 181 272 48 -194 39 -5 82 -208 -16 -137 -31 129 -144 -78 -125 58 -48 172 -181 105 -25 109 111
5212 111 -167 196 73 188 -235 -25 125 -122 -85 102 279 33 305 7 128 -13 -132 -136 215 -86 -68
5233 -68 -117 173 -70 136 9 88 36 -19 -34 -55 142 138 -1 -159 37 -132 -51 383 277 -91 31 -288 154
5256 154 155 53 35 99 -85 92 80 138 349 -118 137 145 -368 -171 -300 78 114 -59 44 -92 193 -65 -121
5279 -121 44 51 -110 -93 243 -5 154 11 49 0 137 79 -30 -205 55 157 -38 -29 224 232 142 -327 7 -108
5303 -108 120 173 125 156 -29 -187 209 226 140 -87 156 -19 33 177 -141 222 -11 43 112 -142 -70 -80 20
5326B0J2q0J13p3K79l08J58l44K20J8J59j78M1N6r3K97m32J57j82J05K84k41j65
5349a77P6J63k36J1L49l52O6J80j93K49q7o0P3M8j49R4o1J46j13j55J20j21j1
5372a40j20K18l5j5R9Pj43L13k95K11j57J19K1L0J77k65j70J29n3J66P0l94J21
5395a06J09J64j16J28k42P7l1R6j59o5K23L2j91l6O7M4J30J95m25K8J73l20J51
5418g4J67M2om0k13M6L16k18o1m6M99n44J11J60k0o0l62M48o5M7l65L02Q7j15
5442C6O6n1J70k94K1K14j21r9L4j98L14q5k3k00J73Nk64K69N0k23N7K8J50q4j72
5467b27R2J98J46o0j16m23M03j06J07J05p7P0n7j0j73K45l14K31j6k6J07j75j3
5490h9J89k63Q2K60k69K73m17M1J86j3m2J39n6j40L24l06J42J82m8p6q6o1L0J03
$$ plain form
5326 20 32 -48 65 -8 271 -37 121 -223 -3 15 174 -4 37 93 0 297 -135 22 -160 -55 229 -12 -177
5349 -177 -101 62 -174 -163 186 -166 -100 80 -113 136 49 -11 62 110 -39 55 -6 140 27 -128 -8 -129 -140
5372 -140 -260 -42 -77 -92 7 14 -129 184 -111 100 -57 62 83 113 290 25 -145 -16 -69 97 167 -227 -106
5395 -106 3 167 51 179 -63 14 -17 79 -80 -145 78 110 -81 -117 -50 -6 124 319 -106 -78 95 -225 -74
5418 -74 93 135 129 89 -124 -78 238 20 -41 -87 412 -132 -21 139 119 59 -303 145 80 127 -238 64 151 36
5442 36 102 51 221 -73 -52 162 41 -58 -24 -222 92 7 -16 -216 -43 -38 -302 -33 17 -206 -149 -121 29 -55 -227
5467 -227 -135 63 209 149 33 -390 13 -93 14 119 42 112 55 45 -128 117 -197 34 18 -8 99 -76 -89
5490 -89 100 -163 -81 179 -90 183 -234 -193 -7 -20 -62 77 21 -119 205 -101 41 223 175 99 13 -48 -18 85
5514H5r2K5k83M55j18M5k86JK66k41K68j16RR8q5Q1J08k27k00J49j1J64k09l8
5538a52J68L00k14J53l77n8M57k96pP7l27L31J8Jj09K74j7k35J11j34N1o6%oj70
5563b27L47o6n4K58m65L7J30N7ok80N15k85k14M14l33R9K87j30j64J69j03K87
5585B73l19J76J47m60O5P5j42Q1K54r2j09P1n1L36j56j7l2j98M4P6j50J88n1R
5609A8m3P3l02K41M1q7K51k78M03k56j05j65J29L34j59j22m3j62J21J69R4m01
5631b49L20n8j36J25J53j39J54k2j76L05k37o6J35n8p8K21J78o71M89k11K9m6
5653c8R6O7k08J88J69j51L9j38k50M34Nj75L4J06m93M12j22MM9J02k80L07J68
5676C25l79J66k78J30L8r1J24k80J66J00n3J2J6k88J23J02j4j34K99J06k23p2
$$ plain form
5514 85 -7 18 -265 190 72 117 -169 -168 98 -143 125 9 18 116 31 112 220 -7 -207 -58 -69 95 -114 -152
5538 -152 16 316 102 255 -122 -180 277 -19 -26 51 -276 55 73 74 -35 239 222 -13 98 -36 15 -51 -51 -57 -227
5563 -227 120 54 0 258 -207 -170 -40 17 11 -269 246 -39 -253 161 -172 -73 214 84 -80 89 -14 273
5585 273 -46 130 277 -183 -118 -43 -185 -104 150 58 -51 20 -31 305 149 132 100 -98 -54 22 -128 60 9 18
5609 18 -25 48 -254 -13 28 -59 192 -86 317 61 -44 -209 -80 254 95 -27 -70 -232 -111 58 152 -249
5631 -249 71 13 -123 2 155 16 170 148 -28 277 40 -26 109 51 -27 194 372 -299 190 -21 8 -38
5653 -38 58 125 -83 105 274 123 162 24 -226 208 213 38 72 178 -315 97 -25 -21 28 130 -150 157 325
5676 325 -54 112 -166 -36 2 -89 35 -245 -79 21 -32 -20 -4 -292 -169 -67 -81 -215 84 190 -33 -105
5698a05M9j12J89k66K00k06L87J04j19L2n5j56K05j05j5J6K1o8j03K27q5Q7j48
5721b6J29k78J15J4K5j2L07n41K92j78N2o0M29k98QJ97k68JL2j2mj08K92j64r1
5746a47O3P4Ok30M20q4j40J26k29o0K55k21K87K8k26m9P1j4J13R0J15k41m7M4
5770Dj25J93P1p5o8j82P7J39Nj71J54j09lO6J27L2j90J62j73K7k5O3j79L6P4L1
5796c9k2q6j81K28k3K62q6J74l92k11L33p7K37k97J73q8L1j91K09J46j13p5j2
5819a00J30p5j9K76k20M3J30k49J6M2K45j47k08P8k06J77K74Q4k29pmq6J23k84
5843b16J92M6N1j28J62J25l89J83j77L6r6K64j15O1P0q7L8n4J07m5j79RM2K47
5867A47M8k65Q9KpN7j67l6l0J12J81l98M54j63M30l12j94K77l16P3K8j90K42k66
$$ plain form
5698 -105 -56 -168 21 -245 -45 -251 136 240 121 153 98 -58 147 42 27 43 64 -4 -107 120 35 122 -26
5721 -26 103 -175 -60 -46 -21 -33 274 -267 25 -153 -101 -161 268 -30 -22 175 -93 -92 -60 -72 -76 -184 108 -56 -147
5746 -147 -84 -10 -4 -234 186 102 -38 88 -141 -201 54 -167 120 148 -78 -127 -56 -70 43 133 248 7 -40 4
5770 4 -121 72 143 68 0 -182 -105 34 39 -132 22 -87 -90 -24 103 135 -55 107 -66 -39 -64 -1 -180 -144 -70 -39
5796 -39 -61 -147 -328 -100 -123 139 53 227 -165 -376 -43 -120 117 -180 -7 -95 -64 -255 -46 100 -13 -88 -100
5819 -100 30 -45 -64 212 -8 35 165 -84 -68 -26 219 72 -136 -58 -264 -87 187 271 42 35 31 -55 68 -216
5843 -216 -24 22 73 -55 107 232 -157 26 -151 -115 -211 53 -62 -1 69 -18 20 -34 73 28 -151 -142 -100 147
5867 147 195 -70 19 21 14 71 -96 -132 -162 -50 131 -267 187 24 454 142 -52 225 -91 -18 10 -180 62 -204
5891b04J11J23J67j41k56L10j81j31M87j13M7l49j04L77r9r5P6Ok94N30J4m88
5913b07K59J30l11J82J02m78L56m0n4j85M94l67R3K59q0r5M9l54P8K09l1j23K69
5936A55j10K23k15J86k59K2J44l3o5J1n7L5q9O4L09k10k23p6L1j05J10J01K44
5959A93k83M3J69o2j82mK04l25J57Q6k7m1J67M5j2k48J50J8R1O4Q6l56j3j16K35
5984C9j3J78k29k6J11k42J71j79M28j6k15k4k37J81m9K14l5J6K36m08j54O7J81
6007eq3J01Q8j38P8N7J1p3K1k47K71j30L78k44Q4j8j34Q5k26l2k3K1K08mn6L20
6033C10m83J84N7j7l10J35K02J66j38p6o3K23j95l1K5J59Q6m59L57l58LQ0P7R1
6057B5k22Q3K48k12J32P4M2lj46J34n1j74Q2L46m07J7j3k95L99n8j30J4q5j40
$$ plain form
5891 -204 -93 30 197 56 -200 110 -71 -202 285 172 219 -130 -234 143 44 -51 25 31 -263 267 281 -207
5913 -207 52 182 -129 53 155 -323 33 -7 -61 -246 248 -119 -26 233 153 58 107 -247 -169 40 9 -114 155
5936 155 45 268 53 239 -20 2 146 113 48 59 2 37 -52 12 321 111 -112 -188 -157 -262 -152 -51 193
5959 193 -90 -47 122 60 -122 -126 78 -247 -90 -4 -31 -72 95 140 128 -120 30 48 139 203 289 -67 -80 -196 39
5984 39 26 204 -25 -51 60 -182 -11 -190 238 222 7 -17 -254 -73 -122 92 57 73 309 -99 -253 -186 -5
6007 -5 -88 13 101 -37 41 98 109 36 57 -190 81 -49 329 85 169 151 17 102 -124 -156 -179 -158 50 46 -10 310
6033 310 -173 11 68 51 -259 -124 78 244 106 30 -33 190 -5 -36 -11 148 234 -225 132 -226 -223 -143 -66 25
6057 25 -197 -114 134 -78 54 128 170 167 21 155 104 -70 12 358 -49 -32 -45 -340 59 1 -129 -115 -200 -340
6081c40M70k12K0p5j51K67m9L4r5J34P4k61M26l26L3K05k31kJ62lj69N4Pj00K73
6106A45K2k00j03K35O4p6J94l21L4r6K14M6k09Q3j27J1J51k86K78n7n1R8q4p8
6130a13J91k06J68q5J22k32m2Q4j1K72j7k27J08M3m45M15Q8k55j92J77J51n5K42
6153A81j28M0j41L19k28K01n01K26L4K10j9k58K40l03l1K78k86K81o0k90K05L09
6175B79l63Q0j42M4L51k90K72l44K01j19m34K46J12J31O4r7J94Q5l46o5J56j10
6197i5J9m3m3J09N6k3k68J51P5J3j6L2J9j69K58j07O2K06q1q8n6j77K22p6Q2k04
6223a42K30k1K7k08K55Q2l04L17k30J69k48m0N8P9J04Ml7Q8L0j92L4o7K3O1p6
6248dk49Q8J79J96j75N0p0k45L03j63J22l77M36k0j69L1k5J31k11L61k53J05J34
$$ plain form
6081 -340 130 -82 -62 -137 -288 -21 -70 -36 -131 3 77 -184 242 -84 -51 154 -77 -79 83 80 -89 -35 -28 -128 145
6106 145 167 -33 -136 99 163 87 281 -40 -6 -102 112 158 -51 32 -95 -84 67 -219 59 2 -49 49 -35 -113
6130 -113 78 -128 40 -45 77 -155 -197 -113 -124 148 131 -96 12 55 -390 25 113 -142 -334 -157 -6 -61 181
6153 181 53 93 -48 271 43 244 -257 -31 3 213 194 -64 176 -127 -158 120 -166 115 55 -235 -30 279
6175 279 -84 -4 -146 -102 249 -41 231 -113 88 -31 -465 -219 -107 24 88 -9 185 270 -76 -141 15 -95
6197 -95 -76 -119 -162 -53 3 -20 -288 -137 -62 -49 -65 -33 -14 -183 75 -32 30 236 155 67 11 -166 56 -20 62 -142
6223 -142 88 67 94 -114 141 223 -81 236 6 175 -73 -113 -55 24 128 132 95 183 213 21 55 -12 11 72 -4
6248 -4 -253 -165 14 210 35 85 15 -230 73 -90 32 -345 91 71 -98 -67 -92 39 -172 189 -64 41 175
6271A75j50j86j63r0L96L02m36N7L0j17L35j21K5n1k91J15K05M1l48K45K25l59
6293a61k81K92K20j99K65k93Q5K70k44P1j00J19o8K50k17o4K33j39M8K4k53K78
6315A36O5l47Q5l1k32J76L08l08r3K18P6j85L07k73J25j85J60N1q2N1n4j6O5O
6339B3K5j24J1N9J73j20k22N92n31J22k30M5j7J45K64l44K13j1J08J5l43J41Q0
6362G4k37J51KO6j47J99j10k62M34m9j72L66k12p0k37Q6J98j10J76k9lj41J80
6385A53j79K3k5P5k5j16k1J3O9M9j21k3L10k77J04K25j31j24j66L99k23k9O3r5
6409g2J3J74p0l78L87j48L41j06k39j27K80k17J51j22K25j16Q2j29J63n7j18j7
6431a00J66k62J86j49K59K2K04k07j56p1k87L96k98L81k7k90L67m13Q7K63K05
$$ plain form
6271 175 25 -161 -324 -414 -18 284 -152 -95 -65 -182 153 32 57 6 -285 -170 35 76 -272 -27 198 -161
6293 -161 -442 -150 70 -129 136 -157 -72 198 -46 25 -75 44 -24 226 9 -55 178 39 87 111 -142 136
6315 136 201 -146 -61 -92 -324 -148 160 -148 -241 -23 53 -132 175 -98 27 -158 2 53 -29 22 -32 -48 17 23
6339 23 48 -76 -65 -6 167 47 -175 417 -114 8 -222 -177 -194 -49 215 -129 84 73 181 196 -147 -6 74
6362 74 -163 -12 -10 56 -91 108 -2 -264 170 121 -51 315 103 33 -204 -118 80 -30 146 117 114 -27 153
6385 153 -26 -3 -28 47 22 -94 -115 -102 -33 16 -105 -128 182 -95 9 234 103 -21 -187 212 -11 -40 23 -72
6409 -72 -59 115 45 -333 54 -94 247 141 -98 -225 55 -162 -11 -133 92 -24 58 -71 92 35 -83 -100
6431 -100 66 -196 -10 -159 100 122 326 119 -37 -108 -395 1 -297 84 57 -233 134 -279 -192 71 276
6452B76m33K45l2k17J75j19j78L2K13J68r5k50M05q4%k91j18M72J84l08j30k11
6474b96K12j58J08L45j93N4m69O19j99N5k19o7J41KK36Pl45J91J28j40K06k97
6496g9lK65j16J85m58J82M9J11j50n5J06K7m2nj88L58j92k8k0J46p2o7j75K71
6520E0J47l38n7K67K93l26L6P7J13l95K7k4J90RK8j67j6K7K41j26J15l54K74l3
6544E8J79k36K23k39j59P4LK77l52L54l75j30L78J61Mk94J97p9j02j41L65p2Q0
6567A74k7M4k32o9J46OJ18j52K39l57P9J34K10m92L24l95K88n4j3j86K85m2R9
6590A27k76K41L3R1l48M63k44k11K29k24N4M39j70k14O9Q2k18K35p8j40LO9R5
6613A07k20K32k3j21J04l0j21K45j4j58K80j44l5k59K78k6Jl01L51j81M6j52K07
$$ plain form
6452 276 -157 88 56 -161 14 -105 -283 -251 -38 130 35 -215 190 106 106 -185 -303 169 353 45 -85 -296
6474 -296 -84 -242 -134 211 18 72 -397 222 23 78 -141 -208 -67 -65 171 178 -167 24 152 12 218 -79
6496 -79 -82 183 67 252 -206 -24 25 136 -14 -69 37 64 22 17 -171 187 -5 -33 -53 93 21 -46 -221 50
6520 50 197 -141 -198 69 362 36 72 149 262 -133 -106 -130 60 69 97 -70 -86 -59 182 56 171 -183 91 58
6544 58 237 1 224 -15 -174 -100 -97 180 -172 182 -193 -323 55 216 220 -74 123 44 -58 -199 166 94 174
6567 174 147 191 -41 -110 36 42 160 8 247 -110 -31 103 313 -179 145 -250 38 -16 -29 -215 70 28 127
6590 127 -149 92 125 216 -132 331 87 -124 105 -119 -65 374 204 -10 59 141 -77 158 80 -60 -57 12 107
6613 107 -113 119 96 -25 79 49 -72 173 159 1 281 137 102 -157 121 95 96 -205 146 -35 11 -141 66
6636F6J84k28J22R8k71J06J01J18n04L44k06L35j57j71J07k06K29k66J21K8Ko3
6658a11L7j07J47J01k81j93N01m33M22k5K4j45M2Kj93L62m4N3k62R7q4N0M0K03
6682B03O5k45J47m4k31M31l48J03l4J36J3m38K41p5M7o8K32k98J25J19J58n4r5
6705I0P7j40l6KK07j28l4K16k25M2J18k54M4j27J61j13K30k13J37qKL9J60l25
6729g8P9K01k44N0K91l26j08K22J60k29J19Pl48L04%kk30K06j98J24M4j02k9k9
6753a16J7K38k19K44j71Q0j08J82r7n2j96K03R8k01q1J76J36m38L31J13j50K24
6775B13Jj26P3M9n72M40r3k04J75k0k37K26J84k12o1M3J98l2q5J89n4k18j21O0
6799a84j2J1J16M4q0n4K50j15k17K29j80K73l21L06J4p1J42k97K02r5J20l50M6
$$ plain form
6636 66 250 22 144 242 -29 77 178 296 -208 136 -70 265 108 -63 44 -162 67 -199 -78 -50 -48 -111
6658 -111 -74 -181 -34 67 -214 -407 94 -339 83 58 82 -63 -21 -19 -212 150 106 159 -103 -6 -90 -40 0 203
6682 203 268 23 170 126 -105 326 -22 81 47 183 196 -242 -1 -76 -29 -97 135 -163 -38 81 239 185 90
6705 90 167 27 -9 -7 200 72 38 254 29 71 189 -65 -21 -148 13 -100 130 -83 54 46 48 87 247 -78
6729 -78 1 202 -42 8 299 -27 -135 87 247 18 137 144 -204 100 100 98 -132 74 -124 0 44 -58 -87 -116
6753 -116 -99 139 -80 164 -7 73 -35 147 50 -2 -198 5 103 -98 -179 -3 133 -305 26 139 -11 213
6775 213 214 88 161 210 -362 78 -15 -219 -44 -64 -301 -75 109 -103 -164 -121 77 45 -40 149 95 -123 -244 -184
6799 -184 -196 -185 -69 -25 -105 -159 91 -24 -241 -12 -192 81 -240 66 80 9 151 -146 56 -39 81 -269 -223
6822b23M27l42j06K09pN4P8n7m5J79N4l31K11m01K98j82J66J5l4R1m8r9J39P6
6846A22j15J08k9R4j64N3k87J18J6K1J26j36P1J55j76K5J13j63m3m2K19j47j99
6869b60K66P5N4k90K74m02K11J39J12m1Q8m08lJ82M6j16j60K65r6J83l15J96J21
6892A21p2j29J63q7K52j08l51M53J95n72J80J00l2N5p0j76J66l0p0J19l87N14
6914B34l71Jj33K70j83J47j68J81J24o3n2j10Lj21R1qK03J03k19L6K29k66K68
6937A96l12M6j5r9K48j08j29K80l58P0K1M8M77l25Q3o8j83M32l92O0k12J95N3
6960Hj56QL2J68j9q7j20NL25lj59R8R8l64R9N8jN3Q2%J12m67K41J27k58J1N5J47
6988I3r0J41k56K88l95J67l5j6k2J85k7R2j27K5N1j4K9k03J5K79j32j18j18P0
$$ plain form
6822 -223 204 -138 -244 -35 -42 12 90 33 -12 167 221 -110 101 -300 -2 -184 -18 -3 -37 54 6 -93 46 122
6846 122 7 115 86 180 16 69 -218 -100 -84 -63 63 -73 -2 153 -23 2 115 -48 -91 -133 86 -61 -260
6869 -260 6 81 135 -155 119 -283 -72 67 179 138 226 -182 -185 -3 43 -73 -233 32 -64 119 -196 0 121
6892 121 49 -80 83 -4 248 140 -211 242 437 -135 45 145 113 168 98 -78 88 58 -12 107 -280 234
6914 234 -137 -136 -269 1 -182 -35 -203 -22 102 39 -13 -123 -120 -241 -150 -158 45 148 -71 -35 194 -72 196
6937 196 -116 -70 -85 -184 64 -44 -173 107 -251 -181 -160 -112 365 40 123 55 -128 304 -88 -28 -240 -45 8
6960 8 -148 -140 -108 60 41 -46 -166 -161 164 161 2 100 198 -166 -67 -9 -10 43 125 125 237 -230 11 138 -120 -109 -54 93
6988 93 3 144 -112 176 -219 -52 -87 -103 -125 60 33 125 -2 23 74 60 89 -114 -99 180 48 -70 -188 -118
7012a18J59ON2J02k34l4O1M5J24l10Q2Q9j22K59q0K10q5k26j06j32M45j97J0j32
7036a32K22j79l3L47m56K45J09N8k46J94M8k92Q8P6j66J07Q9l09L53k64K19l31
7058b53K51k6N1J10o2J19km05J15K03j38P6m4J56j25qK88k25K71m91m4K73q2J2
7082B0OJ71j15j26M8j43L14k97K4K02k7j09L4R3j48q7L58m05J36J00j8M4Jj07
7106c1J23r9K28j98N7j11J18K5j82j9r5j16M51r3k38K66j73K47k09o1OM3Q5k00
7130a76p7L25P9J65l94J03o4OL7l9P8R3k01k71L65l1j11K73j51n2J55J78j97J73
7154B66m00j6J13J96K9j10j92L56j04j20L4J55k78j17M66l36J00j42K90m22K71
7175C9j3J25l69LJ8M36k44J62k33L21l66J34J86j09O6k20L0J00j62J06K68j79
$$ plain form
7012 -118 41 47 99 201 -33 -67 -6 39 163 -147 -65 24 -98 161 81 291 206 -20 -126 -258 187 -10 0 -132
7036 -132 90 -89 -122 225 -231 14 123 181 -65 129 177 -115 -27 49 -117 -10 79 -230 123 -141 78 -253
7058 -253 -2 -28 23 133 71 190 188 -217 -102 101 -37 39 -5 151 26 18 306 81 352 -139 -183 90 8 20
7082 20 26 197 82 -44 4 -139 175 -122 -98 104 77 -32 2 95 -53 -140 218 -187 -51 49 31 75 76 -31
7106 -31 92 -7 221 23 80 -31 87 112 -70 -89 -184 -300 151 58 -180 86 -87 160 -49 -110 -104 -61 24 -176
7130 -176 -253 72 151 316 -78 25 -39 -33 4 -35 43 136 -65 -336 29 -2 -113 160 9 -43 112 290 93 266
7154 266 -134 -150 -37 159 188 78 -114 242 138 18 52 207 -71 -188 278 -58 42 -100 190 -232 39
7175 39 26 151 -218 -215 -197 239 -5 157 -76 245 -121 13 199 90 156 -64 -34 66 -96 10 278 99
7197I9k45Q6l5N0N6j4O8j96N1n9M32l19k47L56M5o6jo3O3J20k22o8N02m65K9k17
7223b60j5K71rQ4J92k43J20k87J53n5j89J58J11L3l6pqj62K75n6j54j5k50N81
7247B32m3n11L30Q7P3l70K18M7K8q0q5O6l6J15k21K08q3J34P3m95K06J15k77J43
7271a26j78M51k21K69k57R7k9k1K25m80L20k29J85q9J97j46o2L17r4l3M0l43J87
7294b0J65j13J7k44J38J52k00k2R4j5j42n5L42j02j3k22M44k12n2J15N6j29J29
7317A11j74NJ15j17J71j68L9J5k3l2jn8K82m6m7j06oJ64j66L10j27l07L39r7r3
7342a7n5Q8j83J08P3j15J09J42q8n9l04L68j05l9QJ30p5L3J56j90j05M93n73K10
7366A0j5J11j77M9Q0n2p5R2R6j79q1J49j28J07Q5j62J97j32j95J27R6K8j5l61
$$ plain form
7197 99 -146 -60 -95 -45 11 -3 65 -131 -80 -139 293 -26 -273 83 128 62 61 -2 61 181 -41 -109 393 -72 -43 -260
7223 -260 -275 -4 -13 71 263 20 140 -147 6 -49 -238 -80 31 64 28 21 13 -149 126 70 -84 -99 -349 232
7247 232 189 -322 8 95 168 -202 16 63 91 11 -74 -8 -44 71 -150 58 -25 109 182 -313 -107 8 -269 -126
7271 -126 -304 147 -74 195 -62 35 6 -15 210 -270 50 -179 6 -83 114 -32 -94 223 129 96 136 -207 -20
7294 -20 145 32 49 -195 -57 95 -105 -127 -33 -48 -190 -245 97 -5 -18 -240 204 -8 -60 55 111 -18 111
7317 111 -63 -58 57 -60 111 -57 -18 -3 -26 -58 -59 -117 165 119 72 -34 -40 124 -42 268 141 -166 173 76 -17
7342 -17 -72 16 -167 -59 14 -101 8 150 62 3 -301 67 -38 -77 -69 61 -14 19 175 -15 -120 373 -200 10
7366 10 -5 106 -71 -22 58 6 -69 23 119 -60 -141 8 -120 -13 72 -90 107 -25 -220 -93 3 31 16 -345
7390c45K94J63k18K28q0J06l17J86K9j09L8j56J55J59j44J02k90J74j95M92n0
7411B22j55m5j51N2J11q7O5k3p9r7L6K04r8R7J58k21j6J86J26j48J2lk07j5p0
7436a46K03j34J29o8j02j64O22m46L83j98K32m14J57J25k36lJ71m5m9Q5j78J11
7458C5J65k17p8K00j40Q5k87L79k58Q5Lk08J34P8l6r3P5J94j13q7J56n8K02k55
7482c9nj8K69m9l03N5K4qRJ27j46J80q1l8L6j47N24m62L5J61j62R4l3K18k73k
7508c4O3k6k19L53j28o3m9K85l82M1K91j10m9nj20J7K33k9N5j85K0N7j7j65M37
7533B71n58J45K59q0j25j79M71k80l4J56K15k17k5j11P6j59M8m8K48o5j3l3Q2
7556D4K8pj85Q9o3K4j45J33r8K95l41K82J02L6k0l58M46m70R4K34p5k16l0L38
$$ plain form
7390 -345 -51 112 -106 122 42 148 -169 17 46 -63 -25 -181 -26 133 -11 91 -199 -25 -220 272 222
7411 222 67 22 -129 -77 34 -53 12 -11 -90 -187 -151 53 -45 52 210 -11 -27 159 285 137 149 146 -61 -76 -146
7436 -146 57 -77 52 -16 -118 -282 340 -106 277 79 311 -103 54 179 -57 -60 111 66 17 102 -76 35
7458 35 200 -17 -95 105 -35 50 -237 142 -116 -31 -28 -236 -102 -24 -60 -153 -78 116 3 -84 72 14 216 -39
7482 -39 -44 -62 207 158 -145 -90 -66 -74 -65 62 -84 96 15 -23 13 -134 390 -72 -37 124 -38 56 23 241 -32 -34
7508 -34 29 3 -216 137 9 -54 -103 182 -200 -159 132 22 -27 -32 -152 -135 98 69 124 -61 -41 16 -1 -166 271
7533 271 -287 -142 117 37 -88 -267 204 -76 -110 46 261 44 19 -92 -16 -175 -127 -175 73 8 -5 -38 44
7556 44 72 65 -120 -31 -94 -70 -215 -82 -180 115 -226 56 158 194 174 -184 262 -208 -114 120 45 -171 -201 137
7580A37Q3l92O6M3j19L97p4k62O5J33J68k32J23j39K33m9k53L15j69%j83M6pK30
7604A60l4k21L05K2m90L12k21J31mj98K13J10J87k10O1n6n1O9l01N9J56K26n8
7627A67k78J51K55k27J05j81O1J38k24K06l29L49j80K26j41k87k9J58M9o7J92
7648A14j0l1j17J73J58j54l92L27K9j47J77l5k32R8J40q3N3j73j50J26K22j24
7670c1l6R1L0j18J41k19K40j88J75k56L80j45r9J53k81L92l19K31m9N0k08J1Q5
7693C0k24J80k26l4K97n5j27K59K48l38K42l15j21K89L9l63q8%L73j28r5K96k07
7716f8N5K12k22l13P5K47L73k81l17K00P3n3J09O1n80P11j56l36O9J24r9J02k8
7739d2l60M80j13j68O8J87r5j25Q4J00m5K05k01J02l3j59L38n78K86rM50l77k97
$$ plain form
7580 137 220 -172 -106 -63 -182 215 141 -121 -56 77 245 13 136 -3 230 181 -72 243 74 74 -109 -63 -70 160
7604 160 126 -95 210 232 -258 54 -167 -36 -40 -238 -25 85 272 62 123 67 16 85 -216 -157 -1 225 167
7627 167 -111 40 295 68 173 -8 53 191 -33 173 -156 193 13 239 98 -189 -218 -60 -11 -78 114
7648 114 104 73 -44 129 287 133 -259 68 97 -50 127 92 -140 -42 98 15 68 -105 -255 -129 93 -31
7670 -31 -67 24 54 -64 77 -142 98 -90 85 -171 209 64 -35 118 -163 229 -90 141 92 142 -66 -55 30
7693 30 -194 -14 -240 -274 23 -32 -159 100 348 10 252 -63 -184 105 144 -219 -307 -307 66 -62 -157 139 -68
7716 -68 -13 199 -23 -336 -261 -14 359 78 -239 -39 34 -19 90 151 -429 282 126 -210 -141 -17 -116 -14 -42
7739 -42 -402 78 -35 -203 -135 52 -43 -168 -84 16 -29 176 -25 77 44 -115 223 -355 -69 -78 372 -5 -302
7762c02O22m49o1K55Q6m31M73k32K07j6k54q8L36n03N06k70KqmL59k64j81K09
7785hJ12l03K56K15l46J35m4J34j35k8O0k3J91N6l17m2L82n09K98J47j32k30J77
7808D6j6j00L6M2m19N43o8l5k57J37P1Mn7J46j71K26J15l90J49K13j72m08L34
7831c1J11J69l06j84L65o4k65J06J44J00m8k1l48L05n9Q2m10L77M2l0J76k57k80
7854c26L26J30j72J4J7J25j63P1K18l58l22L49J98J8k61R2j51L73l6n7j70J98
7876A13j04r7rJ97l05L06k10J93o0K9M72m99r6k9K59l80L37k8o9J40o2j52K50
7899A96k09LJ55p5n4l6O8N4j52Jm0j11R3Q3Mm6O6J28k83K25J7j27Q6J6k86K37
7925A3j01J3j15J14K16q8k2J53q2k67L71m45K24L67o07K96J9j12p3K74j64J64
$$ plain form
7762 -302 320 -129 -190 65 151 -280 193 -39 168 152 -102 -190 146 -357 149 -121 -119 -127 -131 228 -36 -217 -8
7785 -8 104 -199 57 272 -74 61 17 151 16 -12 48 25 216 272 -45 -87 295 -214 84 231 99 -131 46
7808 46 30 -70 -34 8 -411 132 64 29 -228 -91 -20 -16 -73 73 -98 128 243 -147 2 215 43 -365 -31
7831 -31 80 249 -57 -241 124 60 -205 -99 45 145 97 76 -272 33 -26 56 -354 23 65 35 211 -46 -326
7854 -326 0 130 -42 -28 -11 114 -49 22 240 -118 -440 -91 107 125 -136 -44 -195 178 142 85 -85 113
7876 113 9 -88 -97 100 -205 101 -109 84 24 53 525 26 -70 -99 160 -220 117 89 20 160 98 -54 196
7899 196 -13 -10 145 70 16 -20 48 102 -50 -49 -89 -200 -107 -24 -20 -66 0 128 -155 70 87 -40 46 62 -224 13
7925 13 -88 -75 -190 -76 140 52 30 183 101 -166 205 -240 -16 351 -256 40 59 -53 -126 148 -16 148
7947A48k11J42rj47j83K17O9J22p3j10J63j11M1j86K91j98N1M3k09J44K27m01
7969a80K83k62J85J35k5n4P1Q8j4m00L03J80o46K39O5L8j20M02k78Q3k65J31J80
7992A39nl0n1k25K97j32J17n4J20l84J08k03J74o6K84k92J34Kr5K1L48j19J7J19
8016B24k24Q8o2M5J46k71m1m3K53l21L53k54J91R7j87K19k95j1L9n9k05M80k35
8039g3p2R3j33J28K7L0j86J91j46L36k19r0k16K31j16%L65j84r9J99j91K33j90
8062h2K16l43K06j45K96k37J38j01j69K42O7l8k25K44j61K77o3j12J0P0k79O9
8084a20J92k44j03J44J76j13p1K37k19J16N5j9r8K20m63J16L99L9l79J07L0M5
8106D7P1j42L4M5J20l52L89k39L29l04J58m0j14j23RL26k29j11J97j23Q9k32L45
$$ plain form
7947 148 -63 79 70 -77 -260 -43 26 148 75 -35 128 17 58 -128 163 -35 16 59 -150 -6 221 -180
7969 -180 103 -159 26 161 136 82 153 241 227 -173 130 310 -336 -97 -32 6 -114 288 10 93 -172 -41 139
7992 139 134 104 53 -172 125 -7 110 56 176 -208 -100 -303 -129 -195 89 -203 -69 -67 -162 -141 207 88 105 224
8016 224 0 88 26 71 217 -54 -95 -138 115 -206 147 -107 84 181 -6 213 -82 -93 -54 -113 -318 162 -73
8039 -73 -145 -52 -185 -57 -30 0 -186 5 -141 195 -24 -114 -330 -99 -215 -215 150 -34 -133 66 -125 108 -82
8062 -82 134 -209 -3 -148 148 -89 49 -52 -221 21 88 50 -175 69 -92 185 122 10 20 90 -189 -120
8084 -120 72 -172 -275 -131 45 -68 -139 98 -121 -5 50 31 -67 153 -310 -194 205 244 -135 -28 2 47
8106 47 118 -24 10 55 175 -177 212 -27 302 -2 156 116 2 -121 -112 214 -15 -126 71 -52 37 -195 150
8129A50O7j52l8K2k34J71O8j31j5q5R8j2M5o8J87K74l92j73K47k78N02j73n2Q2
8153A10j21K18k00j06K11k58K88q3J51q9k42qJ30k9N7J19k50M7P8rk68J6L51p3
8177D0J25l30J42n3OJ42P2l11J75J57k12K31k3k62
$$ plain form
8129 150 217 65 27 49 -185 -14 54 -77 -92 -177 -79 -91 -46 -114 73 347 -45 -218 29 -249 253 80 28 110
8153 110 -11 207 7 -99 112 -146 142 59 210 121 -121 -129 1 -28 29 148 -102 -55 23 14 -254 -238 113 40
8177 40 165 -165 -23 -76 -70 72 144 -167 8 165 -47 184 161 -101
8191a01
$$ Imaginary data points
##PAGE= N=2
##DATA TABLE= (X++(I..I)), XYDATA
0@%%%%%%%%%%%jRj6J6j6K4l2M0m8N6p2Q8j02J18j36J57j82K09k41K75l14L60m08
34b16M60n17N82o54P31q16R11j014J124j246J379j523J683j857K045k252K482
51A302k735L013l325L671m060M501n005N587o267P081q070R299j0878J2993j5989
66h882K0596k8667M6921j65852k3838J90079o4492L8097p2755p9147L6228O8051
78d3661P732J1048r4706l0864J34622M0847p3937J0240o5597m7101Q5326N8827
90g224Q761j6285o9544n086N3284R466j9133N868k6708p9O4232J9354j8962l8159
104d0215n2662L2011N3554J2773L995j5460k3336o092K3393K1320k4241k7254
116d2214J6158M4542R091j5951j0l1204j9870K8845K9728J9142k2240j6747K1596
$$ plain form
0 0 0 0 0 0 0 0 0 0 0 0 0 -1 8 -8 8 -8 16 -16 24 -24 32 -40 48 -54 64 -72 85 -97 112 -129 146 -168 192 -216
34 -216 244 -273 309 -345 386 -430 481 -533 591 -655 724 -799 884 -973 1072 -1180 1302
51 1302 -1433 1580 -1745 1926 -2134 2367 -2638 2949 -3318 3763 -4307 4992 -5886 7107 -8882
66 -8882 11714 -16953 29968 -135884 -159722 30357 -34135 3962 -68793 -147940 -111712 -43661
78 -43661 -35929 -24881 -119587 -150451 -15829 25018 -48919 -38679 -104276 -151377 -66051 -7224
90 -7224 1537 -14748 -84292 -89378 -36094 -26628 -45761 -39893 -66601 -66680 -2448 16906 -2056 -40215
104 -40215 -92877 -60866 -7312 5461 9456 -6004 -29340 -35432 -12039 9281 -14960 -42214
116 -42214 -26056 18486 27577 11626 11616 -19588 -39458 -10613 19115 38257 16017 -730 20866
129B0866p124j4713J1510P588j3642j287L0761J0706j5008k2673o864J6404j0381
142F143J2076L3640k3577j7582J1252L598K022j1958q323J2626J1699o729J0330
155C5217R608m1129n642L1253r604K123N110q154J0486r695j2078J2578m280j9336
169c543J5321K2156k0101k585Q736j6598K391m261J41K2851j4694j4063J6882
182A2633j889j5875L094R251j1887k823J0493K384J823j9706l246K1717j2837
195f868p505J0683j436n501k225J0460l19j5866k751J0917P280j6078O06J6756
209a847j1827o524N506J683k337r645J0127P889j1349k405P441N648j3760n757
223b7157J5479m10o544J393O544j69j0965P946M558j0362j762M475J3614l481
$$ plain form
129 20866 13742 -971 10539 18127 4485 3198 33959 44665 29657 6984 120 16524 6143
142 6143 18219 51859 28282 10700 21952 25550 27572 15614 7291 19917 31616 24887 35217
155 35217 44825 3696 -1946 29307 19703 21826 26936 18782 29268 19573 7495 20073 15793 -3543
169 -3543 11778 33934 13833 11248 19984 3386 5777 1516 1657 24508 9814 -4249 12633
182 12633 10744 -5131 -2037 7214 -4673 -7496 2997 5381 7204 -12502 -15748 5969 -6868
195 -6868 -14373 -3690 -5126 -10627 -12852 -2392 -2711 -18577 -21328 -10411 -3131 -19209 -18603 -1847
209 -1847 -13674 -20198 -14692 -13009 -15346 -24991 -14864 -6975 -18324 -20729 -13288 -7640 -21400 -27157
223 -27157 -11678 -12088 -18632 -17239 -10695 -10864 -21829 -13883 -9325 -19687 -21449 -16974 -3360 -6841
237f841j2749R313K302q296j185P723L670o868P266O178m022p335p409J4782K789
252f82j2685J3010P596p414n153J458K461o178K672Q706O823m020j0492J3362
266I464l14j7403O912R200J886r9Q28N715p608q780M907Q065l813p030J7153N848
282B4931j4277q57r42N33j862j43J3521J210q620K309M127p098j2471J0279J0297
297B0937l318J992j31J908p084r853Q006K097l719N995P986l49j4300j486M709
312A3390l839q68K054J0866N22r175L083k521q740j752P697Q803o875r02O493
327A8236l944p768p122O699M329m760P823M470o121q619r23N942p213k104J0350
342I275O178k632q864J742j43j0372M094P733J858l486J19O366q507j0451L473
$$ plain form
237 -6841 -19590 -10277 -7975 -16271 -17456 -9733 -6063 -12931 -5665 513 -3509 -10844 -18253 -3471 -682
252 -682 -13367 -357 7239 -175 -5328 -3870 -1409 -7587 -4915 3791 10614 6594 -3898 9464
266 9464 9150 -8253 -1341 7859 9745 9646 10474 16189 8581 -199 4708 12773 8960 1930 19083 24931
282 24931 10654 9797 8855 9388 7526 7383 20904 22114 13494 15803 19930 12832 361 10640 20937
297 20937 17619 19611 19480 21388 14304 4451 12457 14554 10835 16830 24816 24467 10167 8681 13390
312 13390 9551 8683 10737 21603 22125 12950 16033 13512 4772 3020 10717 19520 12645 11743 18236
327 18236 14292 6524 -598 6101 10430 5670 13493 17963 11842 3223 2300 8242 1029 -1075 9275
342 9275 15453 12821 3957 5699 5556 -4816 -722 7011 8869 5383 5502 11868 3361 -7090 -3617
357c617N882K079l240N775L677r796k139k7P87k238k93J2236P70q943j079K014
373A848o62p151L918P111j504J228n05J046n232q185Q740M539m740J467M910J766
389H594p162k696K496r73N86J394P512l08j0466M976K823o523j513M220O402k058
405G304k022J780j802k632l412O513L271p322M746N784m334n304o93N745j691
420E931k042M317J440j253m414K997K361q561J739P043N28l568j831M297j714
435G270l908R10J874K181m701L167O259r088k166N329j48k191j516K852J666j339
451F451k845N37L610p423J128Q879p311k262M767J45j126k765j051K849R26m638
467a29J581N602p891l28P933o270k421K376M5K833k732k705M179J301o763Q04
$$ plain form
357 -3617 2265 4344 1104 6879 10556 760 -1379 -1406 -619 -2857 -3150 9086 9856 913 -166 1848
373 1848 1186 -5965 -2047 5064 3560 4788 4283 5329 97 -8088 652 5191 451 1918 6828 8594
389 8594 1432 -1264 1232 259 845 2239 9751 9443 -1023 3953 6776 253 -1260 2960 9362 7304
405 7304 5282 7062 5260 2628 -784 5729 9000 1678 6424 12208 7874 2570 1877 7622 5931
420 5931 3889 8206 9646 8393 3979 6976 9337 776 2515 9558 10086 6518 4687 8984 7270
435 7270 3362 4272 6146 8327 3626 6793 13052 3964 1798 7127 6979 4788 3272 6124 7790 6451
451 6451 3606 4143 7753 330 1458 10337 3026 764 5531 5676 4550 1785 734 3583 4509 -129
467 -129 1452 7054 -837 -1165 6768 498 -1923 453 498 3331 599 -2106 2073 3374 -3389 -2585
483b585O056o800j205Q624l649k173j31r10L644l914k713M205K801l995p42N570
499B083n671l569N400k28m47j080R68M226l365m273J926K052k371o25N910k286
515a350l046L436j598j049j856m66N388O52l062L77K456l320l085N068q46k363
531d664M529K12J36j792m170K823K355k928N72N355j373m273L886k321l885L507
547b031j30L055J623m830K598K739o236k459O250n57k532O489j138m349J576l581
563c513K656K346n825M503N658n052l012L710k281m045N317P47n32J967l198K208
579A654j79o450K201M325j350m83K514l06l468N61q00k21J088j887M991J662n782
596a930k26P24p84r76J060K314j44l51j66J32j985l672L202L013k100J70J256
$$ plain form
483 -2585 3471 -3329 -4534 4090 441 -1732 -1863 -2773 871 -3043 -5756 -1551 1250 -2745 -3487 2083
499 2083 -3588 -7157 -1757 -1985 -2432 -3512 -2544 1682 -1683 -5956 -4030 -1978 -4349 -4974 936 -1350
515 -1350 -4396 -960 -2558 -3607 -5463 -5929 -541 111 -2951 -2574 -118 -3438 -6523 -1455 -2301 -4664
531 -4664 -135 77 213 -1579 -5749 -2926 -571 -3499 -2927 2428 1055 -3218 668 -1653 -5538 -2031
547 -2031 -2161 894 2517 -2313 285 3024 -3212 -5671 579 22 -2510 3979 2841 -1508 68 -3513
563 -3513 -857 1489 -4336 167 5825 773 -2239 1471 -810 -4855 462 1209 677 2644 -554 1654
579 1654 1475 -4975 -2774 1551 201 -282 2232 1926 -1542 -981 -1781 -2002 -914 -2801 2190 3852 -1930
596 -1930 -2156 -1432 -2216 -3192 -2132 182 38 -313 -479 -347 -2332 -6004 -2802 211 -1889 -1719 -463
613d63L27k714k225J858K10n34R81K313Q5m903J357J866k901q80K025K553l13
630a358j920M05r08j280p73K048K460l409P84L554k647k593L25J311k2M47J157
647b419k58L49k247m45K956l723l3M558n40j424m40K01l54l02k43J005J430j584
665c513M72K759l771j598L054k86K87m75Q38Q19n29j396K83J190k094Q42L317
682A99j835j233J377n07K92r41j75K251m45p83Q96Q67k187k92K564r12p67P69
700h62M44J131k234m37J800n87r76J455J023j643l10J836j168m21n7M96J237q79
718a52o45J456l42q00r9J256q54j118K024l50p15k97J91J315p19j297Q82O05m22
737h1l64J063m14j309J394j66k87m60l06J708k74j035o0P20n21p71J328q1j050
$$ plain form
613 -463 -136 -2850 -5075 -3217 -3007 -3541 -2560 -247 -162 -5065 -3708 -1842 -4743 -5623 -3598 -1045 -1358
630 -1358 -3278 -2873 -3781 -5061 -5834 -3786 -1326 -4735 -3951 -397 -3044 -5637 -5312 -4001 -4023 -3576 -2419
647 -2419 -2677 -2328 -4575 -5020 -2064 -5787 -5820 -1262 -1802 -3226 -3666 -3465 -3819 -4121 -4364 -3359 -1929 -3513
665 -3513 -3041 -282 -4053 -5651 -2597 -2883 -2596 -3071 -2233 -1414 -1943 -3339 -3056 -1866 -3960 -3118 199
682 199 -1636 -2869 -1492 -1999 -1707 -2648 -2823 -572 -1017 -1800 -904 -37 -2224 -2516 48 -864 -1631 -862
700 -862 -418 713 -1521 -1958 -158 -745 -1721 -266 757 -886 -1196 640 -528 -949 -1006 -510 727 -152
718 -152 -797 659 317 -483 -582 674 -180 -1298 726 376 -339 -636 -445 870 151 -1146 -264 341 -81
737 -81 -445 618 204 -1105 289 123 -164 -624 -930 778 504 -531 -591 129 -392 -1163 165 84 -966
756i66Q17l0J39n77j180J520K55j235L62Q93l00p70N97j89q48M35N23N65n95j265
776a849J233J45j143K08O73m1k6L48Q9q86k46l73J048r3q86R94N78q28m52n2L63
797a196o37P51O17k28j03m66N30l76j117R53L15M75j03j66L97j059j18O35j21
816a017J06j22J113k41j008J21L2K83l82K71O21j69k91K30k21n62j10R39O76p41
836d72k1J15P9n20k65R15j7J08M92n5l38j025O89L84l95n5M81O72m70m41K10m53
858c82j82O76K37N38p56K76K41p02l02L96O96j11k32M8J62m27l26M39J12k65K78
879D14R56n25m18k35N48m48k83R24k08j19l1p0J46q98K44R43J16k13j99J49j02
900F91n66J37k38N45J89J6L97o18m38L96k23l5k59P90O0l62L08o45k9j48K08R72
$$ plain form
756 -966 -149 -179 -40 -617 -1797 -277 -22 -1257 -895 -2 -302 -1072 -475 -664 -1512 -1077 -554 11 -584 -1849
776 -1849 -616 -471 -1614 -1406 -733 -774 -800 -452 -363 -1249 -1495 -1868 -820 -913 -1799 -805 -227 -1055 -1507 -1559 -1196
797 -1196 -1833 -1082 -465 -693 -796 -1262 -732 -1108 -2225 -1272 -957 -482 -585 -751 -354 -1413 -1531 -896 -1017
816 -1017 -911 -1033 80 -161 -1169 -1048 -1016 -733 -1115 -844 -223 -392 -683 -453 -674 -1236 -1346 -407 269 -472
836 -472 -493 -378 -299 -819 -1084 -169 -186 -78 414 359 21 -1004 -315 69 -326 -381 100 772 302 -139 71 -382
858 -382 -564 112 349 887 131 407 648 -54 -356 40 736 625 393 441 603 176 -150 289 401 136 414
879 414 1370 845 427 192 740 292 9 933 725 606 575 505 651 -247 -3 940 1056 843 644 793 691
900 691 125 262 24 569 758 774 1171 553 115 511 288 253 -6 784 844 482 790 145 116 -32 176 1148
922A148o21n02R51l14m35l28M51m7j1K51l1j27r3l95N36l71l88N92M23m90j17
943H2L91n66j08L25l76O91k46j34N91o42l73K49J44l4l73P82k15l13J33l54M51
964A05m89j55Q72j29p54m2N13k0r14Q48mk33K50k96M97k41p58Q74k4o89J32O31
986b6o5n13O08j18O7l79k29P45j66o88Q66J8n94j81L44M84m63K9nK86K4n48N98
1009I4k49n00K35P60m61R3l3Q7j97N3k37N22R7l32Q38o6r90K97M98j46J02l54
1031A11L74K70l5o79M17K48q39Q21K31q53Q76j06o4j79l85K45O75n4o99P58L83
1052A516j452Q47K03p52M42N23K49l31l76m45P44q3p38Q30O65q27M27K06p43N5
1072I60k14O54L4j87P0O6K76r48L90K54o91O01M14n25M9o4N5K54p95r7N59O88
$$ plain form
922 1148 527 25 976 662 227 -101 350 303 292 543 512 385 292 -103 433 62 -326 266 689 199 82
943 82 473 -93 -201 124 -252 439 193 59 650 8 -365 -116 28 -6 -379 403 188 -125 8 -346 105
964 105 -384 -539 333 204 -550 -592 -79 -99 -1013 -165 -169 -402 -152 -448 49 -192 -950 -76 -100 -789 -657 -26
986 -26 -91 -604 4 -114 -47 -426 -655 90 -76 -764 102 120 -474 -655 -311 173 -290 -261 -266 20 44 -504 94
1009 94 -155 -655 -420 340 -121 -28 -61 26 -171 -118 -355 167 264 -68 770 704 -286 11 509 363 465 111
1031 111 485 755 720 41 458 706 -133 688 919 66 942 836 772 593 208 453 1128 1074 375 1133 1516
1052 1516 64 911 1114 362 804 1327 1576 1245 869 424 1168 1085 347 1177 1842 1015 1442 1648 905 960
1072 960 746 1400 1434 1247 1317 1383 1659 711 1101 1355 664 1265 1679 1154 1203 1139 1194 1448 653 556 1115 1803
1094A803p19Q4J04r15L39J62N2j16K0L28K63q87m67M56L72n43N16N33o74N8k15
1115E54q8J31q17N23R10l01n87J01K10o78J03N23o03O79M4m07L53r31k85J068
1135E02j68k17K05O14q61o1N67o84J24L0P9P42m38p60Q45l02p72L45R68n08J30
1156C80J75n89J95j37n53J042l79m66J307l86k90n85N40k35K50K36J07l9j05n44
1176g6Q72o51m72R54q0j40J02R2r1j41J38j21L72k63J3J074j034l00K72lQ4l25
1198B76K53L36j86Rk07K50j64m33J107k95m73K96K70J71q12J26P9J55J75m23Q10
1219A320k79p15O18j46l03K29J73L10m38K53k51j99K84m31N62k23n40N40J02l88
1239D78k79M37K87l38j76Q2R5m7k44L83lj056P48J46l85J49j45K00K96l82l6M3
$$ plain form
1094 1803 1084 1168 1272 357 696 858 910 794 814 1142 1405 518 51 507 879 336 852 1385 711 769 554
1115 554 466 597 -220 303 1213 912 325 426 636 -42 61 584 -19 660 704 297 650 -281 -566 502
1135 502 334 117 322 936 75 14 581 -103 21 51 130 872 434 -326 519 217 -555 -210 758 250 380
1156 380 555 -34 161 24 -529 513 134 -332 975 589 299 -286 254 19 269 505 612 573 468 -76
1176 -76 796 145 -327 627 547 407 509 601 510 369 507 386 758 495 508 1582 548 248 520 517 601 276
1198 276 529 865 679 688 481 731 567 134 1241 946 473 769 1039 1210 398 524 603 758 933 510 1320
1219 1320 1041 326 944 798 495 724 897 1207 769 1022 771 572 856 425 987 764 224 764 866 478
1239 478 199 636 923 585 409 491 586 539 295 678 675 -381 367 513 128 277 132 332 628 246 210 253
1261B53o6n16N07L35p95N41N9L3l43O6l8R4Kl39K10J01n13N4N91q36J77K88K01
1284F6P9p50L95Jj20k58K06L15p81L90J66n57J39j49N44L94j023M84M82k89k86
1305e52j58J78j76J64O68l41J4n14O73J67r76L07M43K03k80k47K44l86l67N89
1325c47Q1L17o15L70K53n15l26L19K77K4l87R20p95N3L64k24J10o33N07O53m88
1346h2k09k8K10m23j48L85K23q5L10j56K8o01M41J03j8k54K78K01p9n19K77m90
1368f36nN32L33j31M1n80L38k30k28J48J18O40m32j7Mn87L25l45L79R2j65M67
1390F1m24O0n83L5N20o09O14K86m35p9j9N24o76j80L00L99J48n91RJ32p07M66
1412g49j13L61j22mM46k05n62R3L1K62m70J81L85l79R7n2l21K28l11O59n4j8q3
$$ plain form
1261 253 187 -329 178 513 -282 259 318 351 8 74 36 130 132 -207 3 104 -409 -355 236 -600 -423 -135 66
1284 66 145 -605 -210 -209 -329 -587 -381 -66 -847 -457 -291 -848 -709 -858 -314 80 -943 -459 23 -266 -552
1305 -552 -710 -532 -708 -544 124 -217 -203 -717 -44 123 -853 -546 -103 100 -180 -427 -183 -569 -936 -347
1325 -347 -266 51 -564 -194 59 -456 -782 -463 -186 -162 -549 371 -424 -371 -7 -231 -121 -754 -247 406 -82
1346 -82 -291 -319 -109 -532 -680 -295 -72 -157 153 -3 25 -576 -135 -32 -50 -304 -26 175 96 -423 -146 -636
1368 -636 -641 -109 224 93 134 -446 -108 -338 -566 -418 -300 340 -92 -109 -105 -692 -367 -712 -333 -241 -406 61
1390 61 -363 -303 -886 -851 -331 -940 -326 -40 -475 -554 -573 -49 -725 -905 -605 -206 -58 -649 -640 -508 -1215 -749
1412 -749 -862 -501 -623 -627 -181 -386 -948 -855 -824 -562 -1032 -851 -466 -845 -748 -800 -1121 -893 -1204 -545 -599 -617 -700
1435g00o2K90o19j07O83l17Q4J50q4j35j32J67J93O4l58K61N40o45j44K20k22
1456h73J56L7K7K47l19K32J2p2l07R2L57k17n3K26J4mL8k49K74l68P1L78J41l13
1480d73k94P15j53m13K59J73q4o5N5o3R9j14K15K98l15k85M50J4l37L36k16Q9
1502a09J44n56P14l71m00O43j60Q6j98K99j11J15j03kj71M12m74N08q4l45J21
1523d2L74m55l81M65M7K8J18o91L52O9m45R73j16l91p0O41l25p37M97J81k12K00
1545H0m17J23L01n55N12m3k2l29M28J20q02L64J75J52n1j91P0K69p79L54K32l62
1567c71K9K98L92n12K39l66k27N23m92J19M52l80L92J76o37M9j05K85K2j0N1k7
1589a00P13r82J72K10m94M54K78k11L32m44J92m1j86m90O41M32n18R9J26l44o0
$$ plain form
1435 -700 -762 -472 -1091 -1198 -515 -832 -748 -598 -682 -817 -949 -782 -589 -525 -883 -622 -82 -727 -871 -651 -873
1456 -873 -717 -680 -653 -406 -725 -493 -481 -553 -860 -768 -411 -628 -681 -455 -441 -445 -407 -656 -382 -750 -679 -301 -160 -473
1480 -473 -767 -52 -205 -618 -359 -186 -270 -335 -280 -343 -244 -358 -143 155 -160 -445 5 19 -318 18 -198 -109
1502 -109 35 -521 193 -178 -578 65 -95 -9 -207 92 -19 96 -7 -9 -180 232 -242 266 182 -163 -42
1523 -42 332 -123 -504 -39 8 36 154 -537 -185 -116 -561 412 296 -95 -165 476 151 -586 -89 92 -120 80
1545 80 -337 -214 87 -468 44 1 -21 -350 78 198 -604 -240 -65 87 36 -155 -85 184 -595 -241 -9 -371
1567 -371 -342 -44 348 -164 75 -291 -518 5 -487 -368 84 -296 96 272 -365 -316 -421 -136 -114 -124 -73 -100
1589 -100 613 -369 -197 13 -481 -27 251 40 372 -72 120 79 -107 -597 44 476 -42 57 183 -161 -221
1610b21J16J75j52K97K37j81L04r65N36K72n54N39O9j45K5o5j16J85J2k08j11
1631D9L69R7k12N86p81q5K89J31k2J58J3K32k74k96P9J32O6l10O82l39j00L13
1653G77o17j26K20K04M2P5m23K04K91m66k2M34o5n61P43k41n0qk38L75l09j2K78
1676E05J74k0n25K14j10K7Q7Q9K30j96j95M17q9n60j09L96r0R3L53l47k99L20
1698C65j55J38r5k20M69P0m51k30K38J29k23L87k90K55Q9m11j65L48j83J19K72
1719D56j52l15M86l8k45l55J85k25P16l53K48P8l89J6K89k06l74M48K36k73j91
1740D2L11k76M1M9K59j89j28k9L66j16j87j55j06K58J03K43l75L01l93K72K58
1761E49m90J74L37j64j62k74M38k46K44m74M12J45m63J08M16l53k61L10r2k70
$$ plain form
1610 -221 -105 70 -82 215 452 271 575 -390 146 418 -136 403 472 327 352 287 171 356 368 160 49
1631 49 418 515 303 889 108 23 312 443 421 579 592 824 550 254 333 465 531 221 903 564 464 777
1653 777 160 34 254 458 500 575 152 356 647 181 159 593 528 -33 710 469 419 411 173 548 239 227 505
1676 505 679 659 134 348 238 265 352 441 671 475 280 697 608 48 -61 335 245 338 691 344 45 365
1698 365 210 348 253 33 502 572 121 -109 129 258 35 422 132 387 476 65 -100 248 65 184 456
1719 456 304 -11 475 437 192 -163 22 -203 513 160 408 486 97 113 402 196 -178 270 506 233 42
1740 42 353 77 118 167 426 237 109 80 446 330 143 -12 -118 140 243 486 111 412 19 291 549
1761 549 59 233 570 406 244 -30 408 162 406 -68 344 489 26 134 550 197 -64 246 154 -116
1781a16M35k51k51L64j42K9K15k23J3J81m2j44K71J49k43R8n64K19K85j64j14
1802EJ08r1j54M24l5J24n52K3L48o5k97P4K30j79j19J70k02K26N3l45K59RM8k19
1826a57r0J84k56L98k37K76M7l32k35J50R5K31l90L50j86lp4k47K61J48m98L91
1848a74R1k01j18M0K27k88m31N01P8k2K69p4L3m49L03j27q6J06J41Nj31n3J77
1871a83q9k2k4J31J79l86O0R8j62P2O1m6K22k43LM75n3m92J35N5k18J53L01j04
1895g7rm03L23kp7M5o4K77j6k31J42j50k78L96K21k06N0J3M9m49J62J1K77J7K
1920B3J38k15k44r0K83o3r3L40L1k97K67m13K98j37j77J46J22p2qJ91l02l18K11
1943c79L19k45j4j72Q20m78k98O1j80L87K44n40N01j99o8j17K21p7j08J55j25
$$ plain form
1781 -116 319 68 -183 181 39 68 283 60 73 254 212 68 339 488 245 343 -221 -2 283 119 5
1802 5 113 22 -132 292 257 381 -171 -148 200 135 -162 -88 142 -37 -156 14 -188 38 91 -254 5 14 62 -157
1826 -157 -247 -63 -319 79 -158 118 165 -167 -402 -252 -157 74 -316 34 -152 -155 -229 -476 -215 -67 -565 -174
1848 -174 -83 -284 -402 -362 -135 -423 -854 -353 -275 -297 -28 -102 -69 -518 -215 -342 -428 -322 -181 -176 -307 -360 -183
1871 -183 -272 -294 -318 -187 -8 -394 -334 -236 -398 -326 -265 -311 -89 -332 -329 146 93 -399 -264 -209 -427 -274 27 -77
1895 -77 -86 -489 -166 -168 -245 -200 -264 13 -3 -234 -92 -242 -520 -124 97 -109 -59 -46 3 -446 -284 -273 4 21 23
1920 23 161 -54 -298 -388 -105 -168 -261 79 110 -187 80 -333 -35 -172 -349 -203 -81 -153 -161 30 -272 -590 -379
1943 -379 -60 -305 -319 -491 329 -149 -447 -386 -566 -179 65 -475 26 -173 -241 -358 -137 -214 -322 -167 -292
1964b92M51k55l2n60J96K22P1l72O9J60K83P4m44j72O03l70J68j47j52J04L39
1985e6q6l88j5J73O2L12l07l4M24m90L1J38J52q6l48M18j07j2j58r2L56k74j82
2008e69O23l28K27o3l64K31j24J89O5j33K19j57L90o23Q6M81j53l36M64n3j12
2029d0k69J14J19J20pm08P31l50j06J32j79J79p2j56K47j31r5L99K05l73k52L80
2051A88n2N4l92N7L33k79L0J33L20n89L20K50k44j62N66l30J11l60K15J48r8r4
2073A25kK05j90Q5J4k82j20M12j04m4J02j26L58Lk51p8K4K18k48J07j68o3P1J02
2097A50p0K18l12M44l09L2L23j76k94RN8jp3N07m18J17L3k75J19K28j74K56j61
2120B31o7j58P7K89l73J24o6J01J17k18P4Q5j33K3L65k36j80K53L7l6l76m7N72
$$ plain form
1964 -292 159 -96 -128 -688 -492 -270 -199 -571 -502 -342 -59 15 -429 -601 2 -368 -200 -347 -499 -395 -56
1985 -56 -142 -530 -545 -372 -310 2 -305 -339 85 -405 -374 -236 -84 -170 -518 -100 -207 -219 -377 -469 -113 -387 -569
2008 -569 54 -274 -47 -110 -474 -243 -367 -178 -113 -246 -27 -184 206 -417 -331 150 -3 -339 125 72 -40
2029 -40 -309 -195 -76 44 37 -371 360 10 -96 36 -143 36 -36 -192 55 -76 -171 228 433 60 -192 188
2051 188 136 190 -202 -145 188 -91 -61 72 392 -197 123 373 129 -33 533 203 314 -46 169 317 219 125
2073 125 123 328 138 223 237 -45 -165 247 143 99 201 75 433 436 185 107 131 349 101 208 40 -23 48 150
2097 150 80 298 -14 430 121 153 476 300 6 15 73 72 -1 506 88 205 238 -37 82 310 136 392 231
2120 231 164 6 83 372 -1 123 57 158 275 57 131 216 83 106 471 235 55 308 345 309 -67 -114 458
2143D58l38j83N53J75o21O7j85M8Q2q9K69j90K67j94J64j18j01J56M41n29N6R7
2165B85n9j87k33K83L62R8j99q9P2k00L30n3j15J65P8j68K42k91p3J44K3k10K0
2188B25L87k20M5j39l24J94L3J93J98k23j94J5K33M4k70Q3R7k22L44j12j75J47
2210C59j69K89k22j56K90J20J16m62K56j7k47K98l37J68o7L89j16K2l29j07L71
2231D49k46L4K35k92l6K53l13L0K64J4K6k9l01j74M94k45k6L62j54j86O2m8r3
2254H0J58p8p0O9N5j04M2J88j78j12j01M9N7k29M06j85k07K44k59O8P4k3J20j61
2278i7L92j55k21J99K3J87l14L2L42k88Q4m47K51RL08k21j71J95l5k15N5j2K18
2301A19q4L8L23n85J91J1n6j1q1L75j09l75L60l69K07L1j46L51m14K9Q2O9J69
$$ plain form
2143 458 120 -63 490 665 44 111 -74 -26 56 -33 236 46 313 119 283 165 64 220 661 132 188 285
2165 285 226 39 -194 89 451 549 350 261 333 133 463 410 295 460 538 370 612 321 248 392 415 205 225
2188 225 612 392 437 298 -26 168 201 394 592 369 175 190 423 467 197 280 377 155 499 387 212 359
2210 359 190 479 257 101 391 511 627 165 421 404 157 455 118 286 219 608 492 514 185 78 449
2231 449 203 237 472 180 144 397 84 114 378 392 418 389 88 -86 408 163 137 499 345 159 221 173 80
2254 80 238 160 90 159 214 110 152 340 162 50 -51 -2 55 -174 232 47 -160 84 -175 -107 -33 -56 64 -97
2278 -97 295 140 -81 118 141 328 14 46 388 100 184 -263 -12 -3 305 84 -87 108 73 -142 -87 -99 119
2301 119 35 73 396 -189 2 13 -43 -54 -135 240 131 -244 116 -253 -46 -15 -161 190 -224 -195 -113 -44 125
2324A25m22L84o4l7O08m52j82K06k22K04p4l10l6J77P9K9%J22l95K68l6m6l00
2347c74M50K11l39k00L83l64K99j04j83J30j91L08j41j7J14k14L23k5j67l3j3
2368a47N5o3o1L93k14l65N42k94L14m18K74j63J44k73j9P5p7K95k47o1M54k94
2390a50K53k35l53L92k27J80Q5L8K24p16M88j85m62P32j71m5l29J28J22M4o6J08
2412a45m11M74J88l33j34r2M82l46P2Q4j58J09J46L6n10K96R4J2j23K98k95K1
2434b35k62J88j39k40L63N4K26l18K02k88o3J60J65l82M02m4J37p9m7k97L91j27
2456b33J32n07K38K97m30M03j99J01J0o1j60P5J51j45R5P9o8p1j3j42L52J00k74
2479b70l68K40K87k04k0k10M77M47l28j58q9o2L8Q9LK2j63L2O0J55j70m6L14j84
$$ plain form
2324 125 -297 87 23 -14 594 142 -40 166 -56 148 74 -236 -272 -95 -16 13 13 135 -260 8 -28 -74 -374
2347 -374 76 287 -52 -252 131 -233 66 -38 -221 -91 -282 26 -115 -132 -18 -232 91 66 -101 -134 -147
2368 -147 -92 -155 -216 177 -37 -402 140 -154 160 -258 16 -147 -3 -276 -295 -220 -297 -2 -249 -310 144 -150
2390 -150 103 -132 -485 -93 -320 -140 -55 -17 207 -509 -21 -206 -668 64 -107 -152 -481 -353 -231 -187 -253 -145
2412 -145 -556 -82 106 -227 -361 -453 29 -317 -245 -161 -319 -210 -64 -28 -538 -242 -148 -136 -259 39 -256 -235
2434 -235 -497 -309 -448 -688 -325 -271 -45 -363 -161 -449 -512 -352 -187 -569 -167 -211 -74 -153 -200 -497 -106 -233
2456 -233 -101 -608 -370 -73 -503 -100 -299 -198 -188 -249 -409 -334 -183 -328 -233 -154 -222 -293 -306 -448 -96 4 -270
2479 -270 -638 -398 -111 -315 -335 -545 -68 379 51 -107 -196 -258 -220 -131 -128 -106 -269 -237 -177 -22 -192 -238 76 -108
2503a08N5j96J67J09j6R6j30q6j32J56K10n84J92L33p1j31j13K40q5J7j27j68
2525c72J84K28J86l08N9l19J82k01J92K12p9N3j77r0K43J5k9j07K16j55k97J89
2547a75L28n82M38J66m03J56J73k79L0jr3L30m08o8M41l7O6j85k0Q1L94k58k66
2570a72L72l30l3j83K54k52K79J28j45Q7j05J56M1k3k46o2L26jnl67N1J54k52
2593c28K68J55J36j10j35j06ML14K5l76K61m6k45L76n1J75j00k16K88m78O4K96
2615A71j22J43k53Q2K40r3k51N1K15O4j01J59L5l5j70j78K39l11J42O8j09K88
2637B74l24L74q0j32P6j25Q0m2J56j78k26NN21k37N6j66n8J08O8o9j24J30L33
2660D20k89K77k38o5m0N14k37j00m34K75K5K63l60K78m3m1J81m02j18L74l1j62
$$ plain form
2503 -108 -53 -249 -82 27 11 107 -23 -109 -241 -85 125 -459 -267 66 -5 -136 -249 -9 -94 -77 -204 -372
2525 -372 -188 40 226 -82 -23 -342 -160 -361 -169 43 -36 17 -160 -250 -7 8 -21 -128 88 -67 -364 -175
2547 -175 153 -429 9 175 -228 -72 101 -178 -148 -149 -242 88 -320 -388 53 16 82 -103 -123 -42 352 94 -172
2570 -172 200 -130 -163 -346 -92 -344 -65 63 -82 5 -100 56 97 74 -172 -234 92 91 86 -281 -230 -76 -328
2593 -328 -60 95 231 121 -14 -120 -116 198 223 -153 108 62 -183 193 142 317 217 1 289 -189 -125 171
2615 171 49 192 -61 21 261 168 -83 -32 183 247 146 305 340 305 135 -43 196 -115 27 95 -14 274
2637 274 -50 324 244 112 188 63 143 101 257 79 -147 -142 379 142 198 32 -26 82 150 81 -43 87 420
2660 420 131 408 170 105 65 579 342 242 -192 83 108 371 11 289 246 205 386 -16 -134 240 209 47
2682D7J15J12mk81q3M55j86k47J21J73L3J6Oj68K37k21j16K56k58K77k72Q1j40
2705d7k3M61j47j50j21K63k30K84j68L1R3j06j79J9J39P6J16j79j62K87p7n8J34
2728B56k07K19l0k39J46N5l0l25J43P9M06l96k43L22j59M12m19L92k32J12J81
2749D43j76j57l8J66O4k19J23k84J93o8J76j83J9Q7J73k20J2K2J28m2k27m3J69
2772A18J20M3M6j44J6j28%q2J42j23K4j06K45l18J37k38J27L06j21l00L87J43
2794B94R7m86L82k26m1K73l05J90k74J24K39j82L2n9l6L09j49j63LOj3RR8k19
2818i7kj8L51m45L59k99N24k20j1p8k57N68k71J79k17k20K61j04L1k19J17J25
2840E7R3j79J47k32J22J33k56JJ29l1J09k57K51k83K24k38J69J28j08n2Q8m1K05
$$ plain form
2682 47 162 274 270 -11 -94 361 175 -72 49 222 255 271 277 109 346 125 9 265 7 284 12 93 -47
2705 -47 -70 391 244 94 -27 236 6 290 122 153 246 140 -39 -20 119 195 311 132 -30 257 180 122 256
2728 256 49 268 238 -1 145 200 170 -155 -12 67 473 77 -166 156 -3 409 -10 382 150 262 443
2749 443 267 110 72 238 302 83 206 -78 115 47 223 40 59 146 319 99 111 133 261 219 -8 -51 118
2772 118 238 281 327 183 199 71 71 -11 131 8 32 -74 171 -147 -10 -248 -121 185 64 -236 151 294
2794 294 391 -95 287 61 20 293 -12 178 -96 28 267 85 117 58 22 331 182 19 22 28 15 24 122 -97
2818 -97 -99 -117 234 -211 148 -151 373 153 142 64 -193 375 104 283 66 -154 107 3 34 -185 -68 57
2840 57 150 -29 118 -114 8 141 -115 -114 15 -16 93 -164 87 -196 28 -210 -41 87 -21 -73 15 -26 179
2863A79r6j26J60k59R7j59M51l08K65l05J69l46J63J91R4k29j79K98l00J93O9
2884B2k26L8L7K54j82o9l01N05j79J86k21K13Mk4m47N19j91N2J28j90l13M62J21
2907A98p7l55L21k40L09l8n8j85J45m1k22J26n1K55j92j30N78m14j14J22n3q6
2929b02J70K10l63L31r4j50n5K3q5J94m6Q3j48l10K91J38J6l18K38j32qRP3Q7
2953d8J8k33m5J32J3rN6O1j54O0k17M08J86k41l%k77J27m7O3J31j49k64J69L7
2978b26K33pm7J41l80J83oK3L4mj63qK23J26k63P3j03L40m21j42K76K24m60L0
3002c24L54J2j35P7n1LO8J30j92j0k03M80j86J23m8q2p7K1Q4k78K21j08K19k98
3026b00K04j16QJ24j09J32K47n84N4K45o7k01K39o1K11l0k96K41J7j44K12J24
$$ plain form
2863 179 83 -43 117 -142 -45 -204 247 -61 204 -101 68 -278 -115 76 170 -59 -238 60 -240 -47 22
2884 22 -204 -166 -129 125 -57 -126 -427 78 -101 85 -136 77 81 57 -390 129 -62 -10 118 -72 -385 77 198
2907 198 121 -234 87 -153 156 118 60 -125 20 -21 -243 -117 -168 87 -105 -235 343 -71 -185 -63 -116 -202
2929 -202 -32 178 -185 146 52 -98 -153 -130 -215 -21 -67 16 -132 -442 -151 -13 3 -315 -77 -209 -217 -208 -135 -48
2953 -48 -30 -263 -308 -176 -163 -172 -116 -55 -209 -149 -366 42 228 -13 -16 -16 -293 -166 -213 -150 -19 -168 -432 -263 -226
2978 -226 7 0 -47 94 -286 -103 -109 -86 -52 -56 -219 -227 -4 122 -141 -68 -171 169 -252 -394 -118 106 -354 -324
3002 -324 30 42 -93 -16 -67 -64 4 134 -58 -68 -271 209 23 146 98 16 -61 -40 44 -234 -13 -121 98 -200
3026 -200 4 -112 -104 20 -89 43 290 -294 -240 5 -62 -263 -24 -85 126 96 -200 41 58 -86 126 250
3048B50l48K3O9l7L55l47j9K47l34J14J63j6N9K1k1k39j60J73J34j00j78J84o2
3071f9o6K19l09L75k62O5K76l53J9j16J81NK03k20J77K5J8j42m2L7J70j11j38
3094e8J53m5K12P0k29q3J58R3m12J75r9J59j07j06K05q3J37k53K22Q5k41K99n1
3117B01k50l02N29j70J7J44K03k08L5k51J20K69j82j17k26K85k16N9j53J44J71
3138A02j32K05m2k45J06jk15L18J98l29j41K64j95J84%o2J53j31L9j6j03J81o9
3161F9K84j61k1j17k2K17r3j10m5L41j21j96K00M1k34J28l29K15J37M2r7K68k74
3184A22p4rnj4n4m8K66j66K45k45p9J78m1m1m9j01K69p6j40R7k04M01l42J89m5
3209C4%J80l36M27j69j54p6K30O9lj70J6n9QL29k59m8j03q6K11j29K62j72K8L5
$$ plain form
3048 250 -98 -75 -6 -43 312 -35 -54 193 -141 -27 136 120 179 200 179 -60 -220 -47 87 -13 -191 -7 -69
3071 -69 -135 84 -225 150 -112 -47 229 -124 -105 -221 -40 -35 168 -52 125 150 168 26 -16 21 191 80 -58
3094 -58 95 50 262 332 103 20 178 271 -141 34 -65 94 -13 -119 86 3 140 -113 109 194 -47 252 201
3117 201 -49 -351 178 8 25 169 372 164 199 -52 68 337 155 38 -188 97 -119 -60 -213 -69 102
3138 102 -30 175 133 -112 -6 -7 -222 96 294 -35 -176 88 -107 77 77 15 168 37 76 60 -43 138 69
3161 69 353 192 171 54 32 249 156 46 1 342 221 25 225 266 32 160 -169 46 183 225 128 396 122
3184 122 48 39 34 20 -34 -82 184 18 263 18 -61 117 76 35 -14 -115 154 78 -62 35 -169 232 -110 79 34
3209 34 34 214 -122 305 136 -18 -94 136 205 202 32 48 -11 -3 326 67 19 -84 -170 41 -88 174 2 30 65
3234F5j61L51m30j2K76l4J60k97j36J16L59q8k37J57R1k93RL8J93j63J5M9m6l2
3258e0m6K0O5J1m4K29l25J07J47j12j35J05j12O4j38m3K49k5j17J82j14l4l2j5
3282a63K10K59k16j77J20q8J0l19K78q7K41J72l21M04j29l97M54m44K69o1O3K7
3304A05L8p1k71r1J63J34j36P6r7R1k06J18j34K06k2J91j05m13L49n0Q1j52K06
3327A0Q9j31J04P6l76P6K06j04k8j08J64n5J15q9J84k02J68j02j49J10r2j85K59
3350f0N5j22l06L19J05j50j1o8l0K19o0k12qL94o2n9J17m3k65N27m99k26O21j10
3374F6j3k02K0k60K74PM98m77M4J9l02j01M48k12J73J01r6K2q9R2j90M7o0m2L0
3399b03l09M62j60K67o0L5j69j63J47L7J12j21O4Q3j50M1p5O7J1J36j50pq7l4
$$ plain form
3234 65 -96 255 -175 -187 89 55 215 -82 -218 -102 257 169 -68 89 180 -113 -104 -66 127 -36 -21 28 -18 -50
3258 -50 -96 -76 -11 0 -44 185 -140 -33 114 2 -133 -28 -140 -76 -214 -257 -8 -33 -150 32 -82 -116 -148 -163
3282 -163 47 306 90 -87 33 -55 -45 -364 -86 -173 68 240 -81 323 194 -203 251 -193 76 15 78 105
3304 105 143 72 -199 -290 -127 7 -129 -53 -150 -59 -265 -147 -281 -75 -97 94 -11 -424 -75 -125 -44 -196 10
3327 10 99 -32 72 148 -228 -152 54 -50 -78 -186 -22 -77 38 -51 133 -69 99 -3 -152 -42 -134 -319 -60
3350 -60 -5 -127 -433 -114 -9 -159 -170 -238 -268 -49 -109 -321 -329 65 3 -56 61 18 -247 280 -219 -445 176 66
3374 66 53 -149 -129 -389 -115 -108 390 -87 -43 -24 -326 -427 21 -191 -18 83 -13 9 -80 12 -178 -131 -191 -233 -203
3399 -203 -512 -50 -210 57 -3 32 -137 -300 -153 -116 -4 -125 -61 22 -128 -87 -162 -95 -84 52 -98 -105 -192 -226
3423b26N3R4o4J51Ln5j03J02p8J15Q9n8l47J13J76J25j99K79J7l82J90p4K8m0
3447i1K84k9k15k10M89m80kM0J05J76k53L05j70j53K78m6j07O3pj23J8J48J99
3470B19m24K1M21k56L09j00k86l4J27j03L6Q1j9n4J32l10K05p0J81l27O1o3J02
3493a51L75l68M0j8K57l74K76j54j48K46k1l9n2j0J23L0k65M28j83QM47k85k11
3516d9o1L50o9j93oj70K83J69j42j57Lk4J30k94O0L42l18L73k25J22l37r2L58
3539E3J50k07n1j35R4J94K32m70J39J12j69p8J36M9j0L39l69Q8n2j10J54m2K48
3562B95J0j44J53j21j60k02L16m5j00o3O8J36p1k23P4J57j53K37n5O3j01j85L46
3585B32k50J70Pj72J48k76K16K5r0J81%j27j02M49j65m5j7r4P2m4P5j49J73j41
$$ plain form
3423 -226 -173 -79 -143 8 11 -44 -147 -45 -123 -8 81 23 -324 -211 -35 90 -109 170 187 -195 -5 -79 -51 -91
3447 -91 193 164 -51 -261 228 -252 -254 -214 -109 67 -186 119 -51 -204 74 28 -79 -16 -23 -146 -128 20 219
3470 219 -205 -184 237 -19 290 190 -96 -130 -3 -106 -70 11 -8 -62 70 -240 -35 -105 76 -251 -190 -253 -151
3493 -151 224 -144 -104 -122 135 -239 37 -117 -265 -19 -40 -79 -131 -141 -18 12 -253 175 -8 0 447 162 -49
3516 -49 -110 240 171 -22 -28 -198 85 254 112 -45 -42 -66 64 -230 -170 172 -146 227 2 124 -213 -305 53
3539 53 203 -4 -55 -190 -96 98 330 -140 -1 111 -58 -136 0 49 39 378 9 97 45 -65 89 47 295
3562 295 305 161 314 193 33 -169 147 102 2 -61 7 143 72 -151 -77 80 -73 164 109 172 71 -114 232
3585 232 -18 152 159 -13 135 -141 75 100 10 191 191 64 -38 411 246 201 184 90 162 118 193 44 217 76
3609G6Nl6j1k3K19j23Q0m7N4q9p9mK2J56k55N2r3O0k9j54P1J24K23k29N4M7p6
3636ej47O2J08K36k34q8M6M1k3J37j09o4L31o6r6j21J68k99q4L71N9k05K03j06
3660A15j07J2Q9q4j10R5L2j57J50J61o3p8P8k65M12k24%Q8J73n42R9K16K16j65
3684A41j37j29j5K28R0p5q6R0j6R6l5l6k52J6K35r6J88k68M0K6L7ko9j68J82J77
3710A62r0K08M2j78K44p12M52j26j81J43K25J56l41J19l4m18M71M7k14kP0O8J22
3733B33n7P0k4K02j95m31K59o5nQ4J33o1j64q0J72J02j35O9R6k9o3k40K12k06
3757a23K22j27J04Q3j44J54l38J03J77j86K02K85m21L5r8n8J26M11m56N4K04l14
3779a05rK94j21l03M20r7N5j32J49j40j2jO0K02l4k34l4J64J33l79j69K14rkJ23
$$ plain form
3609 76 81 45 34 11 230 107 187 140 194 105 26 22 44 200 -55 -3 -96 -36 -65 -219 -148 -24 199 -30 24 71 -5
3636 -5 -152 -90 18 254 20 -68 -22 19 -4 133 24 -40 291 225 129 8 176 -123 -207 164 223 18 221 115
3660 115 8 20 109 25 -85 10 42 -115 35 196 133 55 133 -132 280 56 56 144 317 -225 -126 90 306 141
3684 141 4 -125 -140 88 178 103 17 107 91 187 152 116 -136 -120 115 19 207 -61 -21 5 42 40 -29 -197 -15 162
3710 162 72 280 322 144 388 -324 128 2 -179 -36 189 345 4 123 89 -329 142 189 -25 -27 43 111 233
3733 233 176 246 222 424 229 -202 57 -8 -13 71 204 143 -21 -101 71 173 38 107 203 174 111 -129 83 -123
3757 -123 99 -28 76 159 15 169 -169 -66 111 -75 127 412 -9 26 -72 -130 -4 407 -49 5 209 -105
3779 -105 -114 180 59 -244 176 79 134 2 151 11 -1 -2 58 260 226 -8 -42 122 255 -124 -293 -79 -88 -90 33
3804C3K51l81o4K21p6p3m8n2K63j19o1J95P5j36k08L5j59L90n3k1N9j26K54p1
3828A28l67K63o7PQ3m12J15J93J65J01k76J13P0j60r8O2Lk1j48L08j54l8L1J90
$$ plain form
3804 33 284 -97 -161 60 -16 -89 -137 -189 74 -45 -106 89 164 28 -180 -145 -304 86 33 12 71 -55 199 128
3828 128 -239 24 -43 -36 47 -365 -250 -57 108 209 -67 46 116 -44 -142 -80 -77 -98 -246 62 -92 -130 -99 91
$$ [...]
8191A38
##END NTUPLES=NMR FID
##END=
