##TITLE=1H_TR-2405-12
 200.13Hz, CDCl3.
 8 sc
 
 23.4.2026
##JCAMPDX= 6.0         $$ Bruker NMR JCAMP-DX V2.0
##DATA TYPE= NMR FID
##DATA CLASS= NTUPLES
##ORIGIN= UXNMR, Bruker Analytische Messtechnik GmbH
##OWNER= pz
$$ XWIN-NMR		Version 3.5
$$ Thu Apr 23 14:06:25 2026 Russian Standard Time (UT+4h)  she@DPX200
##.OBSERVE FREQUENCY= 200.131
##.OBSERVE NUCLEUS= ^1H
##.DELAY= (6, 6)
##.ACQUISITION MODE= SIMULTANEOUS
##.ACQUISITION SCHEME= undefined
##.AVERAGES= 8
##.DIGITISER RES= 18
##SPECTROMETER/DATA SYSTEM= spect
##.PULSE SEQUENCE= zg30
##.SOLVENT NAME= CDCl3
##.SHIFT REFERENCE= (INTERNAL, CDCl3, 0, 14.3821)
##AUDIT TRAIL= $$ (NUMBER, WHEN, WHO, WHERE, WHAT)
$$ ##TITLE= Audit trail, XWIN-NMR		Version 3.5
$$ ##JCAMPDX= 5.01
$$ ##ORIGIN= Bruker BioSpin GmbH
$$ ##OWNER= she
$$ F:/spectra/data/she/nmr/H-C/1/audita.txt
$$ ##AUDIT TRAIL=  $$ (NUMBER, WHEN, WHO, WHERE, WHAT)
(   1,<2026-04-23 14:04:41.00 +0400>,<she>,<DPX200>,
      <created by zg, POWCHK disabled, PULCHK disabled
       configuration hash MD5:
       00 E9 B6 7A A2 85 ED C7 34 08 36 98 17 FE 4E 26
       data hash MD5: 16K
       B0 76 2A 74 29 36 28 F6 84 71 57 55 36 1D AF 90>)
$$ ##END=
$$ 
$$ hash MD5
$$ D3 A1 2C 5E 29 A8 73 52 B1 22 E0 73 84 BA BB 79
##$RELAX= 
##$RELAX= 
##$RELAX= 
##$RELAX= 
##$RELAX= 
##$RELAX= 
$$ Bruker specific parameters
$$ --------------------------
##$DU= <F:/spectra>
##$EXPNO= 1
##$NAME= <H-C>
##$PROCNO= 1
##$TYPE= <nmr>
##$USER= <she>
##$AMP= (0..31)
100 100 100 100 100 100 100 100 100 100 100 100 100 100 100 100 100 100 
100 100 100 100 100 100 100 100 100 100 100 100 100 100 
##$AQSEQ= 0
##$AQ_mod= 1
##$AUNM= <au_zg>
##$AUTOPOS= <>
##$BF1= 200.13
##$BF2= 200.13
##$BF3= 200.13
##$BF4= 200.13
##$BF5= 200.13
##$BF6= 200.13
##$BF7= 200.13
##$BF8= 200.13
##$BYTORDA= 1
##$CFDGTYP= 0
##$CFRGTYP= 5
##$CHEMSTR= <none>
##$CNST= (0..31)
1 1 145 1 1 1 1 1 1 1 1 1 1 1 1 1 1 1 1 1 1 1 1 1 1 1 1 1 1 1 1 1 
##$CPDPRG= <>
##$CPDPRG1= <>
##$CPDPRG2= <>
##$CPDPRG3= <>
##$CPDPRG4= <mlev>
##$CPDPRG5= <mlev>
##$CPDPRG6= <mlev>
##$CPDPRG7= <mlev>
##$CPDPRG8= <mlev>
##$CPDPRGB= <>
##$CPDPRGT= <>
##$D= (0..31)
0 0.7 0 0 0 0 0 0 0 0 0 0.03 0 0 0 0 0 0 0 0 0 0 0 0 0 0 0 0 0 0 0 0 
##$DATE= 1776938680
##$DBL= (0..7)
120 120 120 120 120 120 120 120 
##$DBP= (0..7)
150 150 150 150 150 150 150 150 
##$DBP07= 0
##$DBPNAM0= <>
##$DBPNAM1= <>
##$DBPNAM2= <>
##$DBPNAM3= <>
##$DBPNAM4= <>
##$DBPNAM5= <>
##$DBPNAM6= <>
##$DBPNAM7= <>
##$DBPOAL= (0..7)
0.5 0.5 0.5 0.5 0.5 0.5 0.5 0.5 
##$DBPOFFS= (0..7)
0 0 0 0 0 0 0 0 
##$DE= 6
##$DECBNUC= <off>
##$DECIM= 32
##$DECNUC= <off>
##$DECSTAT= 4
##$DIGMOD= 1
##$DIGTYP= 9
##$DL= (0..7)
0 120 120 120 120 120 120 120 
##$DP= (0..7)
150 150 150 150 150 150 150 150 
##$DP07= 0
##$DPNAME0= <>
##$DPNAME1= <>
##$DPNAME2= <>
##$DPNAME3= <>
##$DPNAME4= <>
##$DPNAME5= <>
##$DPNAME6= <>
##$DPNAME7= <>
##$DPOAL= (0..7)
0.5 0.5 0.5 0.5 0.5 0.5 0.5 0.5 
##$DPOFFS= (0..7)
0 0 0 0 0 0 0 0 
##$DQDMODE= 0
##$DR= 18
##$DS= 0
##$DSLIST= <SSSSSSSSSSSSSSS>
$$ [...]
##$SUBNAM0= <"">
##$SUBNAM1= <"">
##$SUBNAM2= <"">
##$SUBNAM3= <"">
##$SUBNAM4= <"">
##$SUBNAM5= <"">
##$SUBNAM6= <"">
##$SUBNAM7= <"">
##$SUBNAM8= <"">
##$SUBNAM9= <"">
##$SW= 18.0517599122864
##$SWIBOX= (0..15)
0 0 2 0 0 0 0 0 0 0 0 0 0 0 0 0 
##$SW_h= 3612.71676300578
##$TD= 16384
##$TD0= 1
##$TE= 0
##$TE2= 300
##$TE3= 300
##$TEG= 300
##$TL= (0..7)
0 120 120 120 120 120 120 120 
##$TP= (0..7)
150 150 150 150 150 150 150 150 
##$TP07= 0
##$TPNAME0= <>
##$TPNAME1= <>
##$TPNAME2= <>
##$TPNAME3= <>
##$TPNAME4= <>
##$TPNAME5= <>
##$TPNAME6= <>
##$TPNAME7= <>
##$TPOAL= (0..7)
0.5 0.5 0.5 0.5 0.5 0.5 0.5 0.5 
##$TPOFFS= (0..7)
0 0 0 0 0 0 0 0 
##$TUNHIN= 0
##$TUNHOUT= 0
##$TUNXOUT= 0
##$USERA1= <user>
##$USERA2= <user>
##$USERA3= <user>
##$USERA4= <user>
##$USERA5= <user>
##$V9= 5
##$VALIST= <valist>
##$VCLIST= <CCCCCCCCCCCCCCC>
##$VD= 0
##$VDLIST= <DDDDDDDDDDDDDDD>
##$VPLIST= <PPPPPPPPPPPPPPP>
##$VTLIST= <TTTTTTTTTTTTTTT>
##$WBST= 1024
##$WBSW= 4
##$XGAIN= (0..3)
0 0 0 0 
##$XL= 0
##$YL= 0
##$YMAX_a= 152009
##$YMIN_a= -163518
##$ZGOPTNS= <>
##$ZL1= 120
##$ZL2= 120
##$ZL3= 120
##$ZL4= 120
##$ABSF1= 10
##$ABSF2= 0
##$ABSG= 5
##$ABSL= 3
##$ALPHA= 0
##$AQORDER= 0
##$ASSFAC= 0
##$ASSFACI= 0
##$ASSFACX= 0
##$ASSWID= 0
##$AUNMP= <proc_1d>
##$AZFE= 0.1
##$AZFW= 0.1
##$BCFW= 1
##$BC_mod= 2
##$BYTORDP= 1
##$COROFFS= 0
##$CY= -3
##$DATMOD= 1
##$DC= 2
##$DFILT= <>
##$DTYPP= 0
##$F1P= 0
##$F2P= 0
##$FCOR= 0.5
##$FTSIZE= 0
##$FT_mod= 4
##$GAMMA= 1
##$GB= 0.15
##$INTBC= 1
##$INTSCL= 1
##$ISEN= 128
##$LB= 0.25
##$LEV0= 0
##$LPBIN= 0
##$MAXI= 10000
##$MC2= 0
##$MEAN= 0
##$ME_mod= 0
##$MI= 1.114404
##$NCOEF= 0
##$NC_proc= 0
##$NLEV= 6
##$NOISF1= 3.799351
##$NOISF2= 2.8
##$NSP= 1
##$NTH_PI= 0
##$NZP= 0
##$OFFSET= 14.38212
##$PC= 1
##$PHC0= -4060.873
##$PHC1= 12.99229
##$PH_mod= 1
##$PKNL= yes
##$PPARMOD= 0
##$PSCAL= 0
##$PSIGN= 0
##$REVERSE= no
##$SF= 200.129724274929
##$SI= 16384
##$SIGF1= 3
##$SIGF2= 2
##$SINO= 400
##$SIOLD= 16384
##$SREGLST= <1H.CDCl3>
##$SSB= 0
##$STSI= 0
##$STSR= 0
##$SW_p= 3205.1282051282
##$SYMM= 0
##$S_DEV= 0
##$TDeff= 0
##$TDoff= 0
##$TI= <>
##$TILT= no
##$TM1= 0
##$TM2= 0
##$TOPLEV= 0
##$USERP1= <user>
##$USERP2= <user>
##$USERP3= <user>
##$USERP4= <user>
##$USERP5= <user>
##$WDW= 1
##$XDIM= 8192
##$YMAX_p= 0
##$YMIN_p= 0
$$ End of Bruker specific parameters
$$ ---------------------------------
##NTUPLES= NMR FID
##VAR_NAME=  TIME,          FID/REAL,        FID/IMAG
##SYMBOL=    X,             R,               I
##VAR_TYPE=  INDEPENDENT,   DEPENDENT,       DEPENDENT
##VAR_FORM=  AFFN,          ASDF,            ASDF
##VAR_DIM=   8192,          8192,            8192
##UNITS=     SECONDS,       ARBITRARY UNITS, ARBITRARY UNITS
##FACTOR=    0.0002768,     1,               1
##FIRST=     0,             0,               0
##LAST=      2.2672688,     0,               0
##MIN=       0,             -163518,         0
##MAX=       2.2672688,     152009,          0
$$ Real data points
##PAGE= N=1
##DATA TABLE= (X++(R..R)), XYDATA
0@%%%%%%%%%%%%%%%%%%%%KpJ1j3J4j4J4j4J6k1K6k8L0l5L8m2M9n3N9o6P3q1Q9
43D7r9J08j18J29j43J59j73J90k10K32k57K85l18L57m01M54n23O09p16Q60j062
64e90J355j812K600m170Q249l2586m3363J82919r6282j58544J51377P4116k4439
77E8830R066j12681j7306J52620l1334o0285O8924p2616n174J61965m9912j08876
89f779J8753k2138M9618R6248n0187o6179K539J3471N5311Q175r6009p167N2991
102D8647r283N6665J2375j10626p329M5877J0212K5951m5141l9860O5859J1021
114F4368l1997K5187m4044o4725P9597L8401n5423J4479j8121k4452O0592k4381
126A9481n2346K4091j2705R615N8437l1607n6687J7964K264o36L4270l6469k6071
$$ y = [0, 0, 0, 0, 0, 0, 0, 0, 0, 0, 0, 0, 0, 0, 0, 0, 0, 0, 0, 0, 0, 2, -5, 6, -7, 7, -7, 7, -7, 9, -12, 14, -14, 16, -19, 19, -23, 26, -27, 32, -34, 39, -42, 47, -52, 56, -62, 67, -76, 83, -90, 100, -110, 122, -135, 150, -168, 189, -212, 242, -281, 328, -388, 472, -590, 765, -1047, 1553, -2617, 5632, -26954, -70317, 112602, 16320, -142224, 9153, 83269, 58830, 67896, -44785, -62091, 90529, 59195, -1090, 67834, -4782, -9956, 152009, 102097, -6779, 11974, -10164, 39454, 135702, 85515, 19336, 21875, 35346, 90657, 98832, 2823, -4344, 48647, 39364, 96029, 108404, -2222, -9551, 36326, 46538, 72489, 27348, -12512, 53347, 64368, 32371, 57558, 13514, -51211, 28386, 66787, 11364, 25843, 7722, -16730, 43862, 19481, -32865, -8774, -21479, -11864, 46573, 14966, -41721, -23757, -21493, -22129, 12141, -24328, -50399]
139e0399M5380m128L137R358n4513l6L6395q527J8150q33m1164J8773K9981l4009
153c2435K4J2165l3704L4521L3446m6056J0997P325l5835L7130R737l9434K4332
166a7787J9337k0860K2536q92m4017K3912K6000k5449K4325J351l3914L2626M596
179A1764k3762J3944q418r629L1069J726j6153O892o506q666K1984n918j4113
192e786K1244r890p34K0664k2774l525J1636j3365J2887J2557j8669L033J2069
205A9347j8579j189J5741k0552M760J9171j8317N710P696k5833J3022N208j5483
218i298J0798N879j2181N394O451j3855L38M570j1257R830P277j2158P997m345
232d560j1079J1051m871k465P101l370K735N202n847q030L873k125n03J4075q948
$$ y = [-50399, -5019, -9147, -6010, 3348, -51165, -51201, -14806, -23333, -5183, -6016, -47180, -28407, 1574, -32435, -32411, -20246, -53950, -19429, 14017, -32039, -21042, -13717, -49552, -12422, -2685, -42119, -17787, 1550, -19310, 3226, 2334, -41683, -17771, 8229, -17220, 7105, 8456, -25458, 7168, 11764, -11998, 1946, -6472, -16101, 14968, 16694, 541, 7433, 927, -7739, 14245, 8327, -5786, 15458, 5568, 4834, 25498, 2724, -801, 10835, -2530, 10357, 22914, 4245, 7278, 19347, 768, -421, 15320, -5232, -472, 18699, 382, 6092, 13788, -12045, 977, 6185, -9298, 1500, 7379, -4802, 592, 7043, -6812, -6474, -1904, -13161, -3331, 3946, -8212, -215, -4560, -15639, -4588, -9459, -11924, -4823, -8193, -5458, -256, -6103, -14133, -10260, -12385, -12888, 1187, -7761]
247g761p71R254j2948M179O446j5695P630R594n061L677J677r106O77Q121q693
262h780L658P951j0270R228R878j6299K823K033n417R393K251k300K648K947n525
277D219K657Q68j1883Q523R027o111P269k562q374O968m584j535O024k739K356
292A0123N945n9p530L6J10l934P896J44l418P504l868j297J998p783l36K560K192
309A0283J160O27q23m339O81k655n100N261o85K351M468m131j903k467k118K047
325B657j850N17K230J938L40n000J09k745k842M176j23J855j927j022K669m243
341c261l602j041K72M591r35K047J135m597M64j674Q5K04r19M354Q42l56k135
358d526l333J183k385K197J968l120M892o12l203K403n093j700N099o39K58Q54
$$ y = [-7761, -8532, 722, -12226, -8047, -1601, -17296, -9666, -72, -5133, -1456, 221, -8885, -8208, -87, -8780, -5122, 2829, -7441, 1787, 11665, -4634, -1811, 222, -5195, 4198, 6449, 4149, 6797, 9744, 4219, 6876, 7744, -4139, 4384, 13411, 7300, 14569, 12007, 3633, 10601, 6017, 4482, 10506, 7767, 10123, 16068, 16009, 8479, 8515, 8625, 4691, 12587, 12731, 9313, 16817, 12949, 11652, 13650, 5867, 5531, 8091, 10283, 11443, 12070, 11247, 6908, 7589, 4934, -166, 5095, 4410, 6761, 11229, 7098, 5195, 2728, 610, 2657, 807, 1324, 3554, 5492, 5832, 832, 941, -1804, -4646, -470, -593, 1262, -665, -1687, 982, -3261, -6863, -7904, -7632, -3041, -3976, -1929, -794, -5391, -4927, -6601, -6516, -6312, -7231, -2877, -2035, -2391, -4526, -7859, -6676, -9061, -6864, -4896, -8016, -3124, -3736, -6939, -4536, -9629, -11329, -6230, -6869, -6611, -5757]
374e757K04j059N05j197m100N802q45p93P400o145r93K626j429j146M51j052K293
391e235L150j422j112r9k331j724O685l626j39K466j071K925n73m635L131l08
407c918N47K625J80r60j201L693m050K083O44j993N145l09l191K343j079o56R39
424H42K86M54R94J61l51J439r12l603N622j081k259M338k695N50K496k735J968
441E514j393m92L346m54o99j53L61j000J002K47l879L894L60l029N500l340m924
458H61P093k710j646M817l147l239O674j199o118O040k627n562R761k286o442
473B70R366m843m371O725n061k772O629j11o884N319k56p276P192J94o594N905
489C432k352j623M739m553j847L177j023n52J720j198k666K359j53j294J589l637
$$ y = [-5757, -5553, -6612, -6107, -7304, -11404, -5602, -6447, -7240, 160, -5985, -6978, -4352, -5781, -6927, -6476, -7528, -5235, -2085, -3507, -4619, -4718, -7049, -8773, -2088, -5714, -5853, -3387, -4458, -1533, -2106, -6741, -3610, -3918, -3371, -746, -566, -1526, -2727, 966, -3084, -1001, -357, -2350, 2795, 2486, -705, 1638, 559, -97, 842, 1128, 1582, 2576, 2737, 2386, 3825, 2913, -690, 4932, 3851, 1592, 5930, 3235, 3785, 6281, 3546, 5514, 4121, 3629, 6975, 6521, 5822, 5669, 6030, 5030, 6032, 6279, 2400, 6294, 6654, 3625, 9125, 5785, 861, 7954, 5244, 3598, 8415, 5268, 2029, 8703, 7504, 1386, 7426, 4799, -763, 8998, 6712, 270, 9636, 4793, 422, 7147, 2086, -686, 5943, 5832, -1052, 4267, 4011, -3265, 3927, 4121, -2473, 3432, 1080, -543, 4196, -357, -2204, 973, -50, -602, 1118, -80, -2746, -387, -540, -1834, -245, -3882]
505c882Q87L629n392L170l68k609K977r81k477K268J445j993K520k048l121L793
521b182Q87l695L891j706l654N114k007m54K236j925l99K295k50j17j249p69O76
538c308K819k928O62J232l891L511J648l948L853m3m257M728j681k902M865Q49
554A209o616M079J350n750P339J497p329L948K566n924N648j653n812N799O77
569A028l262M247K02p548L982L507n502K730K734m245L174k20l749K018q92O3
585a733J919l23j844K544j06j746K68j444M63L468k403j13K634n800L500J765
601A049m564K445K089m830L364L425l379l84J973m175K252K391m031K348K536
616B509n447J947L252n258M307J524l608k55L450l509K680N0k633J994J929j868
$$ y = [-3882, -2995, 634, -4758, -1588, -1956, -4565, -1588, -2569, -5046, -2778, -1333, -3326, -806, -2854, -5975, -2182, -1295, -4990, -1099, -2805, -6459, -1345, -3352, -3806, -1570, -3495, -3894, -1599, -1849, -1966, -3215, -3984, -3308, -489, -3417, -2755, -1523, -5414, -1903, -255, -4203, -350, -393, -4650, 78, -1603, -4505, 360, 1209, -5407, -1328, 22, -5728, 1611, 3108, -4221, -273, 2293, -3631, 2017, 364, -5448, 351, 1028, -2234, 2013, 2215, -5333, -1351, 2156, -3346, -616, 2118, -2127, 1047, 827, -2922, -904, -1796, -1733, 186, -137, -1981, 563, 457, -1289, -1021, -2465, -2002, 1466, -937, -1050, 1584, -4216, -716, 1049, -3515, -1070, 1019, -3811, -447, 2978, -401, -785, 1188, -2987, -735, 1656, -2375, -27, 2509, -2938, -991, 2261, -2997, 1310, 2834, -774, -1029, 2421, -1088, 1592, 1642, -991, 1003, 2932, 1064]
632A064K410r51j877R11k88J459n40j912N01K900q66k89P97l543J090J342j734
649D74L221J390n587L341K760m909J359J384k554K715J512m522K034J360l415
664E63J515K053m299K746K663n016K555P13l301L150n57k595K389L78j737J259
680B479k22l121K076J054j626K113j826j080K303j721j459K308k306M66J892p60
696E70j523J171j148r60K765k513j305M122j822o84K041k827p58J854p28l77J193
713i29j108j90J816j056k632K435r14L18J298j558N0J288j076K67j91p49j99J992
731a138O44j203q65N6P35n9m21N81o38K35J362p34J90n94j523K087J06q13P98
750a194M08j472j073K408j866J62K680j298K25J052k551K120p1r23K68P81k8j387
$$ y = [1064, 3474, 2523, 646, 1557, 1269, 2728, 2188, 276, 777, 3677, 2811, 2522, 3319, -224, 866, 2208, 474, 3695, 5085, -502, 2839, 5599, 690, 2049, 3433, 879, 3594, 5106, 584, 2618, 3978, 563, 2078, 4131, -168, 2578, 5241, 225, 2780, 3493, 192, 3342, 2785, 190, 2579, 2957, 1220, 2479, 2257, -864, 1212, 2266, 640, 2753, 927, -153, 2150, 429, -1030, 1278, -1028, -562, 1330, 570, -953, 218, -930, -1890, 875, -1638, -2943, 1179, -643, -1327, 714, -2113, -2871, -1017, -1745, -2122, -929, -2037, -2227, -411, -1467, -4099, -1664, -2578, -2260, -962, -2520, -2470, -1182, -2258, -1991, -2182, -2931, -3130, -1138, -494, -1697, -2562, -2506, -1771, -1830, -2251, -1670, -2308, -2073, -711, -1445, -1255, -1849, -3372, -1285, -1179, -1992, -1194, -786, -2258, -3331, -923, -2789, -2627, 53, -1245, -1020, 32, -2519, -399, -470, -1393, -1125, -344, -372, -1759]
768a759J719r67j307K305n80O11n72m19K344p51j126P45q95M81K30O92J90q67
786G4N06l46J89O61k010J561L82p4O64j514o4R44n65P70N30q36P7N20N19q66j91
807I31k65J17J941j208M63l4j450J186L80l35N0k24L0M65J53j056O56q44J091
826B047l50P16n74k3j39N50m44j670J279N91J031j988Q50K68j134n41P59J6R54
845B198n63m16M92j474j17J107q40J039o14j252J981n18n98m96L00N67k05M8k73
864C66p86J056j173Q47r92J46m48L68M49m23O11o38R75r96k42p34mJ278j22M14
884d8j146N6j43p96Q26k86j71L11J319k54j005r09M71N09N18r15N20K03P48l32
904e24j452j3L83o94P12J390R3j344O88m67l88J77j025J014P60RM59j042l97N92
$$ y = [-1759, -40, -1007, -2314, -9, -589, 22, -550, -969, 1375, 624, -502, 243, -652, -171, 59, 751, 941, 74, 580, 234, 423, 1084, -926, 635, 1017, 943, 1607, 93, 29, 973, 408, 1178, 1708, 872, 949, 1469, 1988, 1122, 931, 666, 783, 2724, 1516, 1979, 1945, 495, 1681, 2061, 1726, 1776, 1552, 1582, 2047, 2200, 1144, 1800, 956, 2047, 1697, 2413, 1839, 1816, 1677, 2227, 1783, 113, 1392, 1983, 3014, 1026, 1876, 2144, 1010, 469, 1228, 1244, 2198, 1635, 1219, 1711, 237, 120, 1227, 387, 1426, 812, -440, 1541, 1023, 425, -71, 229, 796, 591, 639, 366, -420, 636, -537, 310, -682, -536, -984, -616, -167, -590, 21, -617, 358, -638, -880, -1614, -1618, -340, -462, -48, -1194, -1138, -1281, -2077, -1251, -1537, -1708, -1397, -78, -332, -1337, -2246, -1775, -1266, -748, -1663, -1143, -940, -192, -524, -1976, -1989, -1606, -2300, -1588, -198, -105, -1449, -761, -1228, -1616, -1439, -2464, -1450, -690, -681, -222, -1264, -1661, -1069]
924a069Q37K70o22o90Q16O24l50m82l11M77k45J027k27L16j162N11N93r56Q07
943A64n92P75N17m44l69J382k784M47J864j208j96Q95n73m8L14K26l74j82J30
962e6j746K479r13n30J04J235l85r62k78P73M07p67j143K272P03j971J625k069
980a222J230l1K13M84j247J74J175j283L36p76N87K66k55J095j485J9J174M34
998H88j704J828r11J692r11j260J221j170M11P50j23r1n27J320r89J021l72j195
1016a22J251K75m33o7j77J32k86J318k36j047R05K4J69K07m7k82J17o30K77K35
1036A583jp01P85P93j654J0Q63o09P04n23n49J93J094l77j182R12q30m44J666
1055A733j039j036J485j001J89J336j027j251J297p89l09J258r12o81J277l03
$$ y = [-1069, -232, 38, -584, -1274, -458, 166, -184, -666, -977, -500, -745, 282, 55, 371, -791, -280, 313, -643, 164, -428, 347, 864, 420, 51, 1433, -1351, -904, 960, -248, -444, 451, -122, -170, 144, 370, -4, -186, -56, -1802, 677, -236, -766, -662, 573, 188, -774, -1052, -279, 128, -639, -1782, 490, 1193, -778, 847, -1222, 8, -23, 190, 674, -573, -399, 776, -507, -171, -947, -360, -94, -349, 746, -739, -720, 454, 888, -816, 1012, 101, 1793, 882, -378, 843, -327, 84, 834, 711, 620, 93, 1413, 424, 1445, 1073, -122, 1129, 1404, 971, 904, 727, 859, 573, 1891, 1655, 608, 1513, 1537, 1706, 1913, 1866, 1584, 1701, 1071, 1348, 1583, 1582, 881, 1666, 2459, 805, 815, 1678, 1069, 1773, 1250, 701, 894, 1988, 1611, 429, 1341, 511, 67, 1733, 694, -342, 1143, 142, 331, 1667, 640, -611, 686, -103, -412, 846, -66, -747, 530, 227]
1071B27r36P86j280m88J209r5r50j38J419k18j096J172j523J144N38n24Q63j544
1089a434l93P77j251P28K45l41J42q32l55J171P50j372P51J123j909m94K411p61
1107a044n00M29j234M21J300o39l56Q15n22r4J163q13o81J361j228J236n06q07
1125a699R30K03j02j58m72J143o78P02J92p14o0J90J84O77L9q81N30M29o69M9
1145a65R2r9k51J874j554m50J251k2m13K84N30p99R02m0p38M17J56r02R57Q33
1165A863j604J057l67K08L93q19m64j00O74m10P56n69M52ML6Nk07j734R02Q05
1185H81j12j3J11q87N33L35M23k61P1j531J675m01m95L07K5Q74j087J99q52J50
1205e5J042j29r85N69j58R75m65j487J442K67j438m52J592j613K184n90p4l58
$$ y = [227, -709, 77, -1203, -1691, -482, -577, -1527, -1665, -246, -464, -1560, -388, -1911, -767, -229, -753, 110, -1434, -1827, -1050, -2301, -1573, -1328, -1669, -1527, -2359, -2714, -1543, -793, -2165, -1414, -291, -2200, -2694, -283, -1044, -1544, -1115, -2349, -1928, -628, -1267, -1623, -808, -1330, -1424, -261, -1074, -1755, -394, -1622, -386, -892, -1699, -769, -566, -668, -826, -1298, -155, -833, -131, 61, -653, -713, -523, -339, 338, 377, -504, 26, 455, -214, -165, -73, -172, -423, 1451, -103, -553, 698, 676, 263, 547, 1077, 278, 1180, 1140, 402, 819, 975, 73, 1030, 1863, 259, 1316, 949, 1157, 1550, 731, 267, 167, 841, 431, 1187, 618, 1070, 1074, 1110, 1115, 908, -826, 76, 881, 769, 756, 867, -20, 513, 848, 1271, 1010, 1081, -450, 1225, 824, 329, 636, 661, 1535, 448, 647, -205, -55, 987, 858, -127, 442, 284, 1259, 794, -693, 749, 1016, -422, -874, 718, -895, 1289, 699, 625, 267]
1223B67P30o72r66J599j464M03l92P84j1j06M38j271m1J917p32j098J016l05j99
1242a03N37q17R06r27J16M74K79n94j19P36m09j029J724j762R91l60J96J7m99
1261f43K32n99l08J540j68j01J362j788k16m01n8L87NM25n51l71O09M76P03j307
1281g72R1k77J401p49o54J02J78m25J129n72p73Q64m95q0M01r12l69O24M82K79
1301e27j32P55J95q83p02J009N83q26p23K051p28m25n65N60Q0n78k60M39L78m74
1321g73k67M67J14O51j567J186K84l79J388l15k313R70P92m60J49l89Q17j032
1339f77J102k88m01N92k29k76K37k76N78j300j40K08J353n10k66R69j264K023
1357A435o95m09p60m49Q83K29j032O39J804j187l72N97O85n67o96J346k53k22
$$ y = [267, 997, 325, -641, 958, -506, -103, -495, 289, 278, 172, 610, -661, -702, 1215, 483, -615, 401, 96, -103, 434, -383, 523, -404, -288, 186, 465, -129, -248, 488, 79, -950, 774, -988, 3, -357, -161, -144, -643, -411, -1010, -1318, 222, 54, -47, 1315, -473, -689, -1090, -1148, -761, -756, -331, -882, -1253, -644, -168, 535, -772, -681, -958, 443, -306, -960, -858, -680, -1105, 24, -548, -1321, -457, -952, -1032, -631, -1543, -1912, -1288, -806, -527, -659, 96, 291, -592, -1294, -285, 298, -528, -1251, 800, 72, -353, -918, -358, -278, -856, -1116, -677, -299, -773, -1040, -573, -459, 192, -1375, -189, 95, -284, 1104, 789, -1524, -554, 238, -222, -73, -462, 355, -677, 425, 137, -264, 328, 99, -177, 60, -216, 362, -938, -1078, -870, 483, -27, -293, 676, -588, 1435, 740, 331, -429, -878, 5, 234, -798, -159, 1645, 458, 86, 683, 1368, 801, 105, 1451, 1198, 976]
1375I76q10N06r4K48j68L97o24o0R07k79j00l76k62R66p76k85O11j34L32o85N94
1396H84j004K76N60n55M47k82K24L49m3o10o4N1N1K51L81K27o89%o44o4K90j76
1418a40O77k63j05jk23k10m4j3l4k94J072q90N49L97j325m08R94j22K48J60n22
1439d97J26j44O64q94N18J23j23J179j419K68l18J46q0l18J4L8n65R06l15p7l61
1460a129l34J29M16K68K00p53P16N4K52n42L24L31l36l07J017m09q10nM59o72
1480a131M54n04N04Q37r07K42n02N64M86p00O06o54N43R02m04n41j21K3M72j30
1500C9m19l87J064m88O50j033K51O10m10K00O93J76k69r3k70p13P03j20J73L25
1520F82n27r5N00p24R74L0l16J03J24k12l32j27K15L50n69N29l69M88L52n33L02
$$ y = [976, 166, 672, 578, 826, 658, 1055, 431, 371, 1278, 999, 899, 523, 261, 1227, 451, 166, 777, 643, 975, 290, 884, -120, 156, 716, 161, 608, 326, 550, 899, 856, 246, 182, 233, 284, 535, 916, 1143, 454, 454, -190, -254, 36, -140, 537, 274, 169, 168, -55, -265, -309, -322, -356, -650, 422, -468, 81, 478, -847, -1255, -261, -383, -135, 25, -497, -371, -515, 149, -745, -227, -104, -227, 952, -467, -199, -517, -371, -451, -769, -755, -717, -1282, -376, -691, -768, -1129, -1463, -1334, -918, -650, -450, -1203, -487, -433, -181, -723, -399, -68, -404, -711, 306, -103, -913, -918, -459, -1131, -677, -1181, -677, 160, -747, -505, -1007, -443, 43, -657, -51, -705, -162, 740, 336, -205, -326, -303, 169, 39, -380, -767, 297, -191, 459, -574, -323, 287, -123, 77, 770, 946, 677, 584, 314, -399, 304, 184, 357, 682, 155, 60, 560, -164, 810, 840, 524, 627, 751, 539, 207, 80, 295, 645, 76, 605, 236, 724, 1076, 543, 845]
1541H45r90P33k60N14J74n70P70q83p68P94M43k27J29m72M46n5J64j39kl85K44
1562E05K96m81O78n07N8j66m30L80l13p2N61J33r43P95j71k03k28K45j24O36j16
1583E33K50n60m59J00O07q06J124j267M91R98j435O6J45n16O59K20j70K17jj13
1603H3m67L78l35P7j84L34o20N06k06K47mJ3k51N7k01N45n90J34j17P1K05k85
1625f10J1j5m10J175J62p94Q87n66q33Q60l33R5J73J28O1j156Q07NO0J51n87L93
1647c36j75K17m03j56R54j111O87P06l49m86p4K68N93j217p2O94J038m45r65J244
1667F12j07p18jk61P35p04J65M92M61q05m41J87N36l85j031K579r03j038K70L71
1687A4k21j04O57Nj07m46L20j1m46l44M30rk62l5Q57j027j76J260j65m46J239
$$ y = [845, -145, 588, 328, 842, 1016, 446, 1216, 333, -435, 359, 802, 575, 704, 232, 678, 623, 787, 648, 646, 261, 505, 801, 320, 998, 491, 549, 383, -47, 333, 20, -52, 509, 642, -301, 494, 323, 120, -108, 137, 13, 649, 533, 783, 223, -236, -136, 471, -335, 789, -478, 13, 1011, -424, -358, -213, -729, -70, 150, -20, 197, 196, 83, -384, -6, -341, -264, -448, -114, -734, -228, -434, -187, -191, -178, -429, -372, -573, -28, -618, -484, -601, -530, -325, -610, -599, -614, -1024, 151, 313, -481, 406, -160, -993, -133, -466, -371, -198, -70, -9, -1165, -358, -353, -293, -142, -729, -336, -511, -294, -697, -853, 101, -1010, -323, 383, 34, -452, -526, -258, 335, -882, -954, -260, 778, 333, -632, 612, 505, -213, -214, -475, 260, -444, -279, 213, 674, -131, -572, -385, 151, -234, -1265, 1314, 411, -627, -357, 14, -207, -311, 346, 351, 244, -202, 118, 107, -339, -683, -253, -262, -524, -559, 298, -729, -905, 355, 190, -256, 983]
1708I83q68K19l48k40J165j367J088q47N60K73l61N63j473M56O41M47q2n16k50
1727D3Q92j154P04k06n84R00J37j67p34N03P05n42R42j767k70O58Q71K09j130
1746A0Q8K95J51Pj702M6J110J099r32k27L43M22q4o89Q18l28M3k9L9l82J025j65
1768I58j308K05J30l06M66J3m70N28j80n27L04L38L6r2pK4l37Q82j114L78m23
1789e02l54J090M6o78L98j035L85o94R59L31O21j638P39N11l50K0m08K48j91J410
1809I08k150l85O07O00P7J75J08l49q25J457k56p9o76L63j46k90J97P88o20r6
1829e92l29o93J041M14J163j495R53j745M45L61M49j67O46l96r03P82q58J338
1847D14r11l73Q19M75j028Q78j168K14R19m03l85O22N33l97j274R37j28O49M0
$$ y = [983, 115, 334, -14, -254, 911, -456, 632, -215, 345, 618, 257, 820, -653, -197, 444, 891, 809, 293, 43, 935, -219, 485, 279, -305, 595, 732, 565, -169, 334, 1039, 497, 1439, -328, -598, 60, 931, 1140, 10, 98, 393, 544, 551, -1151, -1105, 5, 1104, 172, -55, 288, 710, 626, -63, 755, 427, 470, 441, 480, 98, 1123, 958, -350, -145, -15, -321, 145, 158, -312, 216, 36, -491, -187, 151, 187, 95, 88, 112, -225, 657, -457, -79, -502, -856, 234, 280, -398, 0, -1035, -650, -1344, -385, -54, 567, -1071, -332, 179, -171, -151, -559, -311, -502, 908, -1242, -1627, -1020, -420, -343, -168, -60, -409, -1234, 223, -33, -112, -788, -425, -571, -861, -664, 124, -496, -592, -921, -1614, -573, -159, 1004, -491, 462, -1283, -838, -477, -28, -195, 451, 55, -848, -66, -924, 414, -497, -870, -51, 424, -604, 274, -894, -680, 239, -164, -549, 73, 606, 209, -1065, -128, -256, 393, 433]
1866D33o76N13n7j80J514j218O26p66P98l00j368R04L85j64K41K13n37j59M68
1885F70J52K08n79K77L58j134M82l63P06M8o99N60m56q55J514j139O39p96K93
1904a14O60j82J17L48J29J75o06l93l39K48N03k98K35m65O46r51N57O54q90q9
1924e5J97R94j438R80j12P7k54k71K58q18R00r91K00m23L10N90J155l23M95j848
1944c77R18Q0j986J532r5L81p51L29M95l98O72l38M18k07J5p20o43P81o21j15
1964f30M12Q38j000L22j07K2l46l49L20j075J371j554P24J958k051J380n52N7
1982b60r13J967l81m26q84M64j072J158Q60l69q97J476j678J202j023J290q46
1999c32j42R87j219J507j041r57O12J21J659p95k31l21Q5l68j017J702M6r99M81
$$ y = [433, -243, 270, 213, 33, 1547, 329, 955, 189, 987, 687, -681, 223, 608, 444, 685, 898, 361, 202, 670, 822, 1030, 451, 728, 1086, -48, 434, 71, 777, 825, 126, 686, 230, -625, 889, -250, 389, -407, -114, 546, 364, 481, 829, 958, 1133, 527, 134, -205, 43, 546, 248, 483, 18, 664, -287, 270, 924, 34, -55, 142, 1136, -302, 678, 566, 643, 389, 118, 376, -442, 458, -533, -333, -756, -446, 144, 1299, 976, 1471, -377, 541, 621, -1365, 167, 72, 453, -298, 31, 526, 128, 800, 462, 880, 673, 688, -32, -675, 106, -515, -630, -218, 620, -380, -58, -165, -143, -489, -838, -518, -1593, -222, -1776, -1052, 906, -1145, 235, -317, -260, -1173, 794, 413, -13, -897, -433, -1505, -347, 513, 144, -753, 723, -955, 247, -776, 514, -332, -474, 513, -706, 801, -240, -1197, -585, -464, 1195, 400, 169, -152, -67, -435, -1452, 250, 296, -703, -222]
2018b22J144p74N0j109J662p84R05k98k27r69O66l91N33j25j269J268k79rL14
2037H6Q84q03L03p7l11o12J581p59k31p49J566r46R02j007K10O44m37p50J027
2056E21n11J129j594J022j052L36O23m97N99p45j13M24n29M70O8n00J70p75J063
2075A09N0J44k45M68L90j703J226j74n7j38O34k18k16M04q47J393j679N45j083
2094i97M31K004r70M27J18o03P70p30k12j052J472k37P18q31M95j798O09J482
2112A096q28j318K33P98l09K81N13j88k28q9m81J998r62n26K190k392K20O91j936
2131a237J306j459J417o4N24j299P93k34o38R40n82K21p11r1j68P61J254j537
2149h04K28l31L1j73p8J762j88j848J71K50K235M1n5j260P45k135J202R19%j303
$$ y = [-222, 922, 148, 198, -911, 751, -33, 872, 574, 347, -622, 44, -347, 186, 61, -1208, 60, -219, -228, 86, 970, 167, 470, 393, 82, -530, 1051, 292, 61, -688, 878, -68, 834, -173, 37, 681, 244, -506, 521, 10, 1139, -455, 567, -485, -149, 474, -23, 576, -169, -282, 142, -387, 83, 151, -349, -179, -954, 109, 159, 303, 58, 526, 916, -787, 439, 265, 208, 70, 704, 486, 270, 674, -173, 1220, -459, 86, -997, -566, 1438, 468, 895, 1013, 410, 1180, 450, 238, -814, 658, 421, 1139, 308, 803, -995, -386, 1096, 268, -1050, -817, -19, -328, -47, 466, 278, 50, -39, -520, 1478, 516, -10, 2180, -212, 8, 699, -1237, 69, -1390, 27, -37, 487, -812, -19, -253, -891, 49, -533, -312, -1023, -1114, -1282, -521, 733, -804, -576, -907, -876, -1049, -1127, 635, 447, -1401, -1230, -980, 1255, 1296, 1241, -19, 726, -1409, -207, 712, 712, -591]
2169e91P33Q0j281k70R20J383j712J643k113N59p27K236j984J800j415K77K28
2186b34R15j63k08N02p20o11K53p07P04J543j164k3m95L03R87p35k04r83J122
2205H2m46k62J604k29j126N82j243P61O00j548J714J8k075J248J36j20L38q45
2223h11l41J909p55J93m77O10j00q00J597r50J50l53N82o6j01M25j116Q36k99
2242A33j11o6K13n9J26M61m68r11J262j270p8J780j931J038k98K16M96p41M05
2261A97n8J861r98j106J10K70n0K56j158R81K84r39P23o01J120j270Q06J17l94
2280A51M46j064M33K51m37K08m57j63j32l3K11M46n4J31J99m80M49k11j69J32
2300a43P33n83j371J697k76N40o74P24q53m10J94k48J347l99M19j000K18R64j152
$$ y = [-591, 142, 222, -1059, -1329, -409, 974, -738, 905, -1208, -649, -1376, 860, -1124, 676, -739, -462, -234, 681, 518, 310, 812, 92, -519, -266, -973, -269, 1274, 110, 87, -408, -105, 882, 147, -57, -1040, 82, -364, -626, 978, 749, -377, 205, -1038, -277, 323, -1225, 489, 507, -1568, -320, -184, -304, 34, -811, -1152, 757, 2, 195, -282, 328, 228, -572, 1025, 75, 225, -128, 454, 388, 287, 712, -404, 432, 133, 22, -44, 169, 110, 236, 697, 229, -682, 580, -690, -768, 1012, -919, 119, -179, 37, 533, -208, 197, 139, 2000, 1002, -104, 6, 276, 226, 482, -676, 305, 589, -350, 373, -228, 892, -378, 428, 545, 151, 597, -467, -34, 217, -220, -12, -469, -632, -764, -797, -586, -140, -194, -63, 136, -344, 105, -106, -275, -143, 590, 7, -1364, 333, 57, 597, -77, 647, -206, -616, -422, -670, 677, 278, 697, -303, -85, 879, -273]
2319b73Q04l40o04O54r9L98r06N5P77m21L25j05q02l18L96J33M1J189l27k36n44
2340b03k51J037M36r08k05q42O48L3R5o80J102J08j134P80O16o83Q01o68p62K55
2360d25RJ709j162k4R35m96j281J474j287k81J879j393J131r72k85M16k63p0N15
2379A29N05o95j75k20N68j33m58M27K5o6L6L3M05l40k35j93J430p65k09O64q58
2400a25k72O0L60j47l41J202p70O81J32r57L74N04l05l48p46l3Q01L50n50Q21
2420F91q6l18L3j18K46p14p3P21r23M41O00k17J10L99j279N28n2L32J99p69P92
2441E43n30k67p37Q83K62J57L15M31o21q23M23J75K42k43p13L64O26j292j7J127
2461C05M35q27J853j526L49j203L21J2J387j390J56j004N22N11O79K30n74N18
$$ y = [-273, 531, 191, -413, 241, 142, 540, -366, -311, 466, 45, 370, 265, -537, -855, -459, -326, -285, 904, 577, 341, -203, -454, 583, 1019, 111, -94, -936, -288, -255, -160, -840, 262, 370, -764, 16, 632, -51, 750, 82, -680, -425, -416, 1293, 131, 107, 1042, 546, -735, 739, -548, -829, 1050, -343, 788, -184, -469, -53, -316, -386, 129, 634, -61, -236, -456, 112, -21, -479, -52, -27, -93, -57, -24, 381, 41, -194, -387, 1043, 278, 69, 733, -125, -397, -337, 23, -124, -465, 737, -33, 648, 780, -177, 197, 701, 396, 48, -698, -731, 70, 420, -130, 691, 605, 287, 320, 202, 448, -266, -339, 382, -541, -100, 500, 283, 393, 792, -487, 41, -11, 321, 520, -249, 543, 13, -254, -991, -108, 154, 311, 626, 1057, 436, -387, 36, 211, 453, 210, -503, -139, 487, -805, -822, 305, 740, -87, 1766, 240, 589, -614, -293, -281, 1106, -284, -128, -1132, -610, -99, 580, 810, 236, 754]
2479G54j232N45k64J609j882K65m01M73J175j412P38j76Q74r40l03L31L8l63O9
2498a02q88L66N55MJ021k34m4j637J299j64Q28j121K10J273n72r38o08J145j66
2517B27q6o53J107q17N25m81n05J137l80k50j55M50Lk56N11m47N0j92O31l68J091
2538A142j874l28J258n30J396n54j324O61J30j6n53J67P89j8k69n61Q16m86Q74
2557G20q26r57J827j004M74n43P01j090P44M28m43L31K7l4p00M85J48l84m47M76
2577f7r80N27J330o28k27P21p80l71M0J67N39j155J200l32j61k8l55N61j84Q91
2597G08o77m14J019r13N6k4l02P46Q6m13l26O78J67MO79j471n74R76n3q59J002
2618I5j57j13l3M63rQ9n0K22R55j348O42o89n2k4n5N77m67k37Q10n97N13n74K26
$$ y = [754, -478, 67, -197, 1412, -470, -205, -606, -133, 1042, -370, 368, 192, 1066, 126, -177, 154, 192, -171, -102, -990, -624, -69, -65, 956, 722, 678, -959, 340, 176, 1004, -117, 93, 1366, 794, -144, -752, 393, 227, 141, -512, 595, -222, 303, -178, -683, 454, 74, -176, -331, 119, 122, -134, 377, -70, -20, -212, 419, 51, 1142, -732, -1060, 198, -332, 1064, 510, -814, -153, -23, -39, -592, -425, 364, 346, 77, -484, 332, -154, 720, -106, -1063, 764, -240, 234, -309, 392, -698, 46, 474, 31, 362, 389, 355, -345, 140, 288, -96, -543, -67, -1047, -520, 810, 182, -45, 676, -104, -475, -435, -268, 271, -884, 316, -16, -177, -205, -560, 1, -183, 708, 31, -383, 636, -277, -221, -245, -547, 199, 285, -128, -454, 224, 391, 395, 1074, -397, -971, 5, -48, -907, 95, -62, -175, -208, 255, 246, 335, 285, 507, 1462, 114, 756, 67, 15, -9, -64, 513, 46, -191, 619, 22, 535, -39, 187]
2641A87k16L91o42M63K28m68q5R0K26J73P4o56M72m11R36p23K2J3KJ77l79j68
2663b94M69R6L73l17J07l45k12N44l48m5N09pq01P12k42L13n54J97P7j5l46J98
2685F9k60L6P6r5K70l7K66k80k14L11p6K05j92k00L10k85M2n9K53K31p43K74m05
2708e03N43k03L0jJ38O6k51p9M63L2n48K06J30k7M1M13l51J27m64M20j26L90m83
2731c7Q8P6m0l32M25m63K45L28k68n9J95j24J29j67k80L63r7J66j16K25j98m14
2753c55M86N7k66n2L8K23J04l42QJ16j43L40k37o9r4K23l07Q4j8J53k90P2J54
2776a15M09l42J9j7N25j43M82j150Q6J91M83k31m22M87m77M3j86J31M9J23KM52
2798C99j84R3n22N53n94N98k77n34J05%J39n2L92L78n36M47p67M42j47J50L78
$$ y = [187, -29, 362, -280, 183, 411, -57, -142, -52, 174, 347, 421, -235, 237, -174, 762, 39, 61, 74, 76, 253, -126, -294, 175, 271, 644, 327, 434, 89, -123, 421, 73, 28, 537, 530, -271, 441, 199, 512, -42, 155, 232, 217, -129, 69, -191, -155, -79, -174, 96, 59, 325, 45, -169, 142, 66, 271, 79, -121, 189, -96, -54, -113, 140, 371, -372, -98, -503, 40, -163, -133, -134, 4, 70, -181, -260, 203, 235, -313, -107, 23, -4, 37, 450, 99, 226, -238, 182, 56, 446, -37, 51, 127, 87, -245, 180, -283, -38, 290, 22, -37, 158, 34, 163, -4, -284, 79, -18, 148, 32, 257, 59, -355, 131, 188, -78, -130, -92, 131, 235, -107, -99, 17, -126, 214, -23, -92, -186, 37, -270, -186, -204, -51, -341, -269, -115, 294, -48, -29, -46, 479, 336, 818, -332, -246, -55, 428, 197, -225, 262, -215, -172, -358, -227, -178, -55, -53, 399, 215, 308, -214, 339, -255, 343, 66, -468, -363, -363, -224, -276, 116, 494, -42, 405, -362, 80, -67, 83, 461]
2819D61n06N3n07N52K65K1p28k54P76K2j30K91N5J39k22n27N81k93j05P63j280
2840e73K88N90j242P28N99o78M40J20j9n47p89R06m32k23M04q6P67N31r27M67
2860C24l44m71J740p84j083L60j448K533n41O29j76k72J72j891J84Q33K10k90
2878c15m2M85m83N47l00J56J214k109J552O03j827R29O75l69Q08j110n26L61N44
2897G93j374L67P00r66K3J057M77j086n43o37Q42o78j6J679p67O61J65q36Q28
2916F89J0k58n06o5j132Q89j39L32O74m67J586o77j102m98M07J428j486j182K260
2935G63j697K360k624P45J669k918O94J658o54L43j17j055J26J176k27J35j64
2952B13n77N38J20n50K55K11J31m26m0K97j96m0l56Q74q46mL87P8m06k64K58n1
$$ y = [461, -45, 8, -499, 53, 318, 339, -389, -643, 133, 155, 25, 316, 371, 510, 288, -239, 342, 49, -56, 707, -573, -285, 305, -937, -209, 390, -288, 152, 272, 253, -294, -1083, -177, -609, -832, -428, -514, 253, 784, -143, 324, -20, -491, 1249, 465, -618, -258, -1706, 827, 286, 915, 739, 467, 639, -1252, -1068, -235, -25, -315, -357, 128, -355, 192, -108, 48, 1262, -847, 705, 1308, -519, 410, 1085, 716, 1524, 414, -112, 249, 793, -581, -214, 486, -480, -457, 600, 1077, -9, -552, -1189, -347, -1025, -1041, 638, -129, 532, 697, -139, 689, 699, 441, -65, -130, -1262, -373, -512, -180, 494, 27, 1613, 936, -166, -664, -257, 1171, -315, -1497, 763, -934, 1426, -1198, -453, 1216, -1702, -1008, 650, -4, 339, 222, -833, -707, 469, 242, 377, 213, -364, 174, 294, -256, -1, 210, 341, -85, -125, 172, -24, -64, -420, 454, -392, -396, -9, 69, -337, -601, -343, -394]
2974c94O96m35j6l89O79n06K08O29Pj66p21j98O39L67p18M92J28k3q24J817j650
2995c78mJ32N10L69m44l88L01m07L05O58j110Q44K3q14P81q04m05R95n31m91O86
3016a72J053q26k2o03M91M76k5L22p62O66j506J055N36J0j171l30J576q33O5p08
3036g08J102q79M46Q75p18l15O2q06n4q6J181O59n20j522P24R11p26q8O3P61j24
3057B38K70o29O43n84l3J258o37q30Q62J10l85o7r87J298O6q52K14K36Q47j485
3077d47J086p28n29N79J01K06O1o88m34L76L07n1O45m31j9q01J757p62n80m74
3097h26J610q76P4N18n38j39N04k17o13P39l08p24P33L37L98J031j529L56l88
3116A42J376j370r12N42J084J45j064k86J193j248J451m27j393R48k60J102o77
$$ y = [-394, 302, -133, -149, -538, 141, -365, -157, 472, 479, 313, -408, -606, 33, 400, -318, 174, 302, 279, -545, 1272, -378, -382, -250, 260, 629, 185, -203, 98, -309, -4, 654, -456, 388, 411, -403, 378, -426, -831, 164, -367, -858, -172, 881, 55, 33, -570, -79, 397, 372, 694, -68, 598, -908, 147, 683, 693, -478, -808, 768, -65, 0, -708, 394, -485, -39, 836, 118, -197, -135, -941, -995, -1081, 100, 759, 239, -1283, -559, 352, -374, -462, -399, 362, 238, 508, -121, 522, -62, -95, 1163, 526, -304, 558, 668, 283, 216, -771, 527, 593, -259, -45, 191, 1038, -447, 639, -89, -618, -39, 62, 268, 329, -359, -793, -417, -110, -161, 484, 53, 34, -767, 990, 228, -352, -826, 784, -92, -18, 500, -38, -177, 327, 110, -503, 236, -72, -796, -63, 274, 672, 1703, 174, 530, 142, 1518, 148, -764, -222, 862, 1007, -57, -343, 850, -398, 1053, 626, -767, 181, -79, 1023, 346]
3133C46k73P08j441l70J209n80O70m94n37L44J063R31l92j016j79r58Q87q15J526
3152F29J286k267N58Q24L7j896Q75L88j428J447j205J16J455k70l58j666J269
3169b06R62m60m79J059p34m70J210m62k64m30J72m47o33K199j409N26j150J788
3187G72Q21j554k04j071J461O87p73K43j917J630r18O55J000k033K392j652l17
3204g78P84K16m27Q41r6j421J072j6K36o75p41J250J9j067J052J7J59j07l50J9
3224a3j01L16r0p10K18r3O09o93Q75o98K30J56J72N6r8P4n95k73O18M4j52J2p8
3247b14o34J421o00M5n40P14l28K82Q35m64j961L51J361n75M70L55p34o53O96
3266a73L48J759k029l32j14R60J47k87k11j99n08J71J087j027P75p89J095K52
$$ y = [346, 73, 781, -660, -1030, 179, -401, 269, -225, -762, -418, 645, 1576, 1184, 168, -11, -969, -82, -897, 629, 1915, -352, 206, 1030, 1067, -829, 46, 434, -994, 453, -752, -636, 819, 549, 191, -1475, -206, 756, 296, -183, 876, 142, -328, 882, 420, 156, -274, -102, -549, -1182, 1017, -392, 134, -1016, 772, 1593, 39, -165, -1236, 225, 912, 139, 382, -1535, 95, -823, -168, 832, -1201, 1191, -461, -778, 6, 222, -205, 636, 540, -881, 191, 175, 411, -264, -1005, 245, 264, -803, 249, 266, 425, 318, -32, -13, -114, 202, 112, -598, -380, -473, 136, -557, 318, -380, -150, 6, 178, 234, 136, 210, -385, -658, -40, 4, -148, -136, -214, -848, 573, -27, 18, -522, 192, -136, 146, 981, 517, -1444, -1093, 268, -307, 163, 518, -216, -869, -173, 175, 1934, -95, -427, -541, 419, 566, 279, 68, -131, -639, -468, 619, -408, 367, -422, 673, 925]
3284I25l60j512Q9O16J944r59j193J864k129L13J94O05l94J093j075l56J020p97
3302a12O18j430J194o15J250r88M69J65M77j558N15L45O86l71p41J584n99j195
3320c06P19j11J75j57N55k668J119K95J05J92J49m08j84l01J105O93o89q02q82
3339a401N76O11R14p8n38j268J472M10r00J74K76j369J925m55L27J75l78j601
3357a128Q64m43J003q96M39j48k41O84p62K58M00L33j41M66k28o25M58R73j761
3376d95J147l26p42L30J685n61n66o75k95J582j178Q35j539M85J741j587L66P80
3394I87M3j082J368r99n29r40J810j581M32K29L68m15n92N98Q09m77K60P08l47
3413F50j222J446M87j445Q78j4O24j594O66O70j044Q7j050J763o40n00N19K08
$$ y = [925, 565, -947, -858, -242, 1702, 743, -450, 1414, -715, -402, -208, 397, 3, 1096, 21, -335, 685, -112, 506, -924, 270, -345, 905, -83, 386, 551, 1028, -530, -15, 330, 1016, 645, -96, 1488, 889, -306, 413, 302, 477, 320, 875, -1793, -674, -379, -274, -82, 67, -341, -525, -826, 279, 972, 283, -519, -1401, -825, -214, 700, 622, 84, -1184, 288, 698, -202, -28, 248, -1121, 804, 349, 676, 851, 473, -1128, -264, -707, 296, -600, -161, -309, -550, 134, -628, -370, 30, 363, 222, 688, 460, -165, 293, 1266, -495, 652, 326, -416, -86, 1599, 1038, 472, -203, -498, 1084, -94, 741, -798, -313, 1428, -159, 207, 987, 1030, -52, 1316, 317, -212, -1152, 658, -923, -491, -262, 106, -309, -901, -303, 506, 29, 289, 997, 650, -572, 874, 1361, -84, 794, 780, 1404, -190, 476, 1146, 102, 189, -861, 902, 262, -238, 281, 489]
3431D89m59k16O10J0K02j121K20R7P44M9m58l79K05n6K77n98L45l7K14O42p90
3452a0l04M73l10K25P41q93l05P22m85k72N20j22J98R2K89p73j33k00Q02K0k91
3473a6K26M34M94j112K48n47O95L31o48r38J662o19J33J04p04j0K64M8k96M15
3493A64l06n55P96K2L58r68R7J5K71k11L33RR1N25n59K81j71m06Q76j057O49n57
3515c03j58O99k87L12k97j58L2K17l34j32j56R10O2j63j92J72k61M12p17J59J09
3536g4N68J03p03j43L16m57N54j058P90O96r66K65j74J93J16nL00o8l04K36j65
3557B0j07J47r5k46N24j84m00J94j17K80j12J04j95L09k12j7M22l91J15J55O5
3578B59k55R1N8j39Q9M0m7Q1m50M29m55M83o0p0J37j76l19K09K62n77L21J53j57
$$ y = [489, 30, -186, 424, 434, 636, -485, -265, -168, 576, 625, 167, -212, -7, -63, 214, -384, -39, -76, 138, 780, -10, -314, 159, -151, 74, 815, -78, -383, 339, -146, -418, 102, -20, 178, 270, 559, -214, -347, -547, 255, 275, -16, 210, 644, 1138, 26, 274, -273, 422, 753, 105, -833, 829, 210, 343, 447, -257, -267, -3, 45, -251, 164, -142, -697, 99, 121, 479, -489, -392, -377, -106, -317, 16, 25, 116, 641, 82, 363, 192, -214, 662, -395, 254, -303, -461, 238, -49, 263, -34, -192, -160, 57, -277, -409, -565, 345, 407, 244, 52, 224, -37, 375, -342, -183, -74, 494, 597, -106, -249, 67, -390, 164, -894, -104, 592, -374, -109, -283, -90, 26, 21, 321, 253, -51, 185, 20, -87, 60, -35, -281, 243, 59, -341, -147, -264, 16, -96, 8, -187, 122, -90, -107, 315, -76, 39, 194, 259, 4, 95, 153, 14, 103, 143, 96, 177, -273, 156, -299, 184, 124, 54, 191, 15, -304, -95, 167, -410, -89, 64, -93]
3601i3J59j10qq9j66J41K84l45L39l95k0K28k55L57l5j87K96J61l77m8K31O78
3623G46p68O71m17n27R41j098J694l51j038K4j87J277n06o57n21K17L06J049j268
3642d13L87k57J6M30j14J39j56m79K86O37l65k31J15J29j11M8l41J14mJ56P7k28
3664a65L4L27q0l4j05j24K07N3p9q4M5k06K64M9l50J68R4j70L29l74O55n75N9
3687f2J41k38J65K02k39O9l1k41J59j73L14q1n5k26o1M47m81L5R81q22K94M92
3709E89p61N45r7Q8l13Mj10K42L64j25l02q0l52N4m31J447l18q8k24OK05o51L94
3732H6J4n28J8J53P46j58j132N21J57P36q03j4j35j81J274j27j262kJ195n15L33
3753C76j076O89L73O5o54N8p8K06P4N50r68N23k84o53P54r36P58K12j07M7j4o46
$$ y = [-93, 66, -44, -52, -141, -307, -166, 118, -227, 112, -283, -303, -75, -330, 27, -8, -195, 101, 262, -115, -163, 68, 746, -22, 649, 232, -295, 646, -452, 1242, 891, -147, -123, -310, 967, 461, -196, -717, -500, -194, 855, -413, -26, -283, -267, 163, 49, 188, 32, -447, -161, 476, 111, -120, -5, 124, 13, 61, -280, -166, -170, -14, 63, -165, -131, 196, 116, 82, -23, -147, 60, 113, 34, -50, -5, -211, 53, 102, -248, -80, 14, -156, 173, -201, 454, -121, -62, 79, -159, 6, 208, -31, 38, 7, -234, -75, -248, 66, -15, -70, -296, -357, 90, -391, -356, 625, -197, 97, 589, -172, 373, 276, 364, 51, 55, -55, 187, 551, 426, 124, 44, -308, -254, -685, 762, 444, 356, 132, 138, 343, -308, 86, 100, -428, -410, -257, 489, 331, -801, -280, -123, 613, -190, -204, -339, -520, 754, 627, -635, -637, 558, 43, 376, -700, -11, 362, 427, -227, -169, -247, -41, 33, 583, -385, 138, -146, -799, -45, -981, -223, -11, -118, -71, -85, -731]
3775g31K89L78j007J496l37L30n04N43m71l53K44k8Q21r25Q32j230L46K38L15
3794B46k72r78M84N72j53j42J94K4j015J194n43P57q38O81l93j172J746j90m81
3813b79N13o99N19l62j79O34o0O19p31N0j83j7O94m85J24k55j055R56k73J034
3833E65m85j91L20q7N52p71K22j61L31K38q06K76m52K55K68m27K46K91q81J227
3853E30l94J39k26k0N38r95O13j99Q3o4O42p33N17q12M30K25k90J20L4q2J27K5
3875B08k72K2J01Q6j24k46J53J25m3p2K39m18M81L1k58Q4j22J19m57O56m79L11
3897A25N70p84K90n87L47o26O25j94J80M74j48M7n84L00k01P86l45q48m8k00J092
3918B71k9q35P88q26O97K32k30J86O29J7j113l4m0n08O57p0R62o53K61p30K46
$$ y = [-731, -442, -64, -1071, 425, 88, 418, -86, 457, -14, -367, -123, -151, 670, -255, 577, -653, -307, -69, 246, -26, -1004, -520, 52, -101, -243, -49, -25, -1040, 154, -389, 368, -470, 211, -182, -1354, 392, 202, -279, 234, -465, 54, -308, -487, 147, 87, 706, -25, 25, -158, -175, 519, 34, 158, -97, -1152, -196, -469, 565, 80, -111, 209, 122, 674, -97, 125, -36, 295, 533, -273, 3, -449, -194, 74, -353, -107, 184, -697, 530, 136, 275, 49, 29, 567, -428, 185, -14, 69, 5, 647, -86, 431, -381, 49, 274, -16, 104, 138, 56, 183, 208, -64, -42, 59, 145, 21, -225, -72, 53, 10, -62, 177, -241, 240, 271, 13, 97, -25, 94, -363, 293, -186, 125, 695, -89, 201, -386, -39, -665, -40, -234, -54, 420, 272, 319, -265, 35, -166, 620, 275, -573, -621, -821, 271, 242, -593, 195, -631, 66, 298, 68, 254, 883, 900, -213, -247, -287, -795, -138, -208, 754, 101, 362, -368, -122]
3939a22J02K53r33Q97j81m86K31J30m75P20Q7m44Q2L92p90J087q46j69K61M37
3959B33j25R0mq47J054r38J322j056O73K6j102p7Q41J329o25n31K34q76Q24l4
3979D11L8n48m06P92R0j568J031J891j864J125j511J088P2j979J480K08r1j20
3997A39o71J725k081L79m4P65j7k50k01J144o76o20L16M34k32r76P08J22J0J05
4017G9n10J197l42m54K89L72J5j114j63L4J7O93m15l98O53Q86m1p7j171j33L86
4038a97J15l8j12k0K66%J31K42j003L09N54r38P91j5J66m09q61R24J64M83l53
4059A99k48L98L34j027j24Q33k63q40J551m16q09M86l74K50L42O45k50n09L69
4078E47o56J37n84L02O63r59P58q49J296L46k70j78p8j573R83m70Q7Q54P54j508
$$ y = [-122, -20, 233, -700, 197, 16, -470, -239, -109, -584, 136, 223, -221, -139, 253, -537, 550, -296, -465, -204, 233, 108, 198, 194, -653, 401, -537, 785, -271, 402, 428, -674, -751, 90, 1419, 794, 263, 497, -379, 445, 411, 449, -99, -505, 287, 377, -1191, -160, 1731, -133, 992, -519, 569, 641, -1338, 142, 350, 259, 139, -532, 1193, -888, -509, -553, 212, 195, -55, -256, 888, 212, -408, -92, 342, 110, -866, -158, -36, -26, 79, -431, 766, 424, -30, 259, 631, 646, -468, -631, -597, -580, 113, -302, -700, -47, 839, 798, 721, -450, -583, -197, -82, -120, -232, -252, 14, 14, 145, 387, -616, -307, 247, -691, 100, 85, 251, -158, -1019, -95, 69, 552, 199, -49, 349, 683, -344, -468, 365, 102, -738, 813, 397, -412, 74, -300, -50, 292, 937, 687, 178, 547, -109, 28, -556, -254, 409, -550, 208, -641, 655, 1001, 731, 553, 475, -1098, -115, -585, -498, 356, 1110, -398]
4098c98J096l09J80M64q68L12p03m69l62P25M69Q28k440K277p25l86o24Q80p36
4117g89L4O42P9P11k271Q23K7k81J187r24N31J315L99k095Q25o8K48k8j291M32
4137d94m69J312q56l28J238q30Q38n58p51J563k24N39j407J373K23k469Q62J94
4155b44J201p95j42J044j000l55O86p37O92j397J695k63j019N95N27j7n14R12
4173H69q15r59R67k72j65N55r15l37J035j26j133N86J730k054P81M65M74p75P7
4192a2N65j6K17j47p67J00N76j159k51O54j0M44j074N31k8K72m65P98L86k67q02
4213d55M13m95P04N56q00K02qm96M29j67k78J77p5o99K58L86L16m51k39P33J37
4234A48O64o35K86j288J030o16J556j245L70k03j153P44J103o85n0K27m73N44
$$ y = [-398, 698, 389, 569, 1033, 165, 477, -226, -695, -1057, -332, 137, 965, -1475, 802, 77, -309, -933, -53, -789, -755, -113, -34, 677, -1594, -771, -744, -1025, 162, -762, -231, 1084, 1483, -612, 213, 145, 393, 365, -926, -494, -963, 349, -507, -835, 403, -427, 411, -147, -898, 665, 441, 980, -427, 946, 1169, -1300, -438, -244, 957, 162, 20, 1064, 64, -291, 395, -342, 350, -1047, 648, 385, -634, -39, 488, 471, -43, 869, 54, -905, 62, -210, -375, 180, -735, -1072, -37, -163, -1296, -710, 1020, -1034, -253, 212, 686, -89, -12, 553, 537, 754, 607, -160, -60, 516, -643, -894, -240, -250, 194, -880, -349, -377, -105, -570, 228, 614, 347, -455, -42, -537, 167, 723, -77, 125, 117, -379, 50, -117, -395, -218, -293, -992, -734, -348, -32, -483, -722, 11, 148, 812, 177, 463, -825, 205, -411, 1145, -100, 270, 67, -1086, -342, 761, 76, 26, 253, -220, 324]
4252C24j36j481O70Q08n94j09R0L5k92J69Q32o62o1k7N4R13m43K86k11r4m93J27
4274b95N74o92O38L10m93K29l33J05k48J48L67l01P90j061P64j163R10p81J0N55
4294C3l63l01J408j851P59J260n58q49M7J83j79M58R6l14k12N20M56q88k26N54
4314C3J54m91M43k96K1K72N2j77R41j240K479j517q50R09j954O34P67r59K13K048
4334A482j250l16N63l80o41J209q19KJ10j28P08k83N93j183J33l39m7J106L98
4353I18j025m16k4O80l78m18J182n53j42R7K19n99L36K97l55k36P04K85k89m81
4373a98J36r5j97J82j21J21o32P25M80m5p11N27n24N81j11j4j10k55N44k68P2
4394H7j18j96R16n18j71k1l10O8N47n67M09n1j69L27k36k12M24o1o79M07J17J43
$$ y = [324, 188, -1293, -623, 185, -409, -518, -428, -393, -685, -516, 316, -346, -407, -434, -380, 533, 90, 376, 165, 71, -422, -295, 279, -413, 225, 535, 42, 271, -62, 43, -205, -57, 310, 9, 799, -262, 502, -661, 249, -532, -522, 33, -330, -631, 777, -1074, -315, 945, 387, -462, -415, -232, -411, 47, 143, -171, -383, 137, 593, -295, -521, 33, 187, -304, 139, -157, -136, 136, 188, 11, 952, -288, 2191, 674, -176, 733, -1221, -587, 180, -779, -566, 1482, 232, -84, 479, 99, -542, 667, -152, -150, -40, -168, 540, 257, 850, -333, -200, -539, -586, 520, 918, -107, -523, -547, 133, -245, -663, 519, -34, -176, -79, 140, -459, -123, 174, -181, -417, 287, 572, 283, -198, -62, -157, -354, -172, -293, -172, -804, -79, 401, 356, -355, 172, -352, 229, 118, 104, -6, -261, 283, 15, 87, -31, -227, 689, 171, 0, -21, -331, -263, 284, -283, 126, 75, -94, 233, -3, -215, 209, 148, -531, -124, -7, 136]
4416A36p7r5K45k2o13L07L46k43o07J417o03R2m10O27k06p24P30k52j27J5N47
4437D83m39k78L05k42Q3Q86j364K89N5J16K03L31j41p55p5K22j17N99q56j37N11
4458c21L5k43O48o2Qn03N62k43p87J458r92R55j097J043j89j14n36L58L27L5o57
4479c15O74n35J20J07N2O09l15n31R20p10K93m16R9OJ7P9k03n3J4K01l07J46m66
4502e14P74k02j26N30j110O96k58J66Q6k98K63l30J45L24k5k84R8J52M25M4o22
4523f6J58jR2r24P04n87N17p9L72M5l37j4j83JL46o2l65M44j38p1m48L55N00j71
4547H8qL52L32o88J28p40N44j65p2j9L62J4o1k40j07O16o22P43l2j162P75r9q0
4570a41J53o00J259n55K25l74l10K36l67R30n00o1P83j162J73L50k62K65j1K57
$$ y = [136, 59, -36, 209, 187, -426, -119, 227, -16, -623, 794, 191, 283, -127, 500, 294, -430, 300, 48, -79, -64, 483, 44, -234, 71, -171, -88, 798, -566, -277, -222, -106, 97, 428, 287, -468, -543, -321, -438, 161, -695, -832, -321, -286, -529, 119, 57, 65, -438, 124, -119, -906, 552, -440, 515, -582, 461, 272, 158, -378, -20, 307, 342, -315, 359, -176, -56, 51, 103, 712, 397, -134, 786, 76, 369, -47, 52, 58, 75, 154, -49, -102, -88, 113, -194, -48, -514, 260, 58, -68, 462, -648, 48, -210, -44, 42, -256, 7, -323, -178, 146, 121, -163, -65, 87, 512, 556, -66, 92, 91, 183, -741, -37, -624, -107, -186, 186, 231, -106, -120, -303, -302, 44, -18, -383, 61, -77, -148, -596, -241, 259, 88, 80, 432, 764, 76, 204, -536, 8, -157, -229, -248, 114, 128, 67, -173, -280, 336, -286, 457, 425, -737, 38, -61, -141, 12, -588, 671, 116, 341, -33, -343, -107, -474, 456, -44, -105, 678, -484, -311, 39, -223, 42, 31, 288]
4590B88k03j92L41k89J92l29L88l30J0K92k74k27K61m5j75J50J81k53j17N09M8
4611B26k56k08O84n15Q5l2j88p7K65%Kl48M81k84O7M6J23o7L9J28k51j79R2J44
4635b3n7l38M45l1j22K58l8k36M11j11j10j09p3M7K44l37L37N5k02J70q3K60o1
4658B96p3k78o2J02n9q8J35N67n01o0QQ0K16n0P5q6m32K23J42n50L41K14n22K72
4682i0J94J77Ol26K07k71K52j61m05L56J22m8j34L87J64r46P57k38K27j24o67
4703e61L64n13O35N00m54L98O3o3p02r1O14k00L10L30o48j055J076j102R11n51
4723g39J778l31j591R80p33N54j56j45N99n27L60k90j245J611p32Q46l98N6J37
4742C4r2l63M71q4q8n99j13k02J23J105R0m39j87L22j135J20J31L27P43p70o78
$$ y = [288, 85, -107, 234, -55, 137, -192, 196, -134, -124, 168, -106, -333, -72, -117, -292, -142, 39, -214, -331, 178, 226, -30, -238, 446, -69, 16, -16, -204, -281, -16, -16, -14, -362, 119, -165, -98, -52, 71, 4, 43, 171, -80, -259, -167, -23, -80, -418, 27, -4, -126, 132, 94, -142, 269, 158, 48, -61, -134, -87, 157, -180, 157, 212, 10, 180, 97, 357, 296, 223, -55, -117, -15, -74, -162, -27, 540, 39, -21, -13, 67, 283, 233, 308, 222, -210, 13, 155, -395, -54, 160, -362, -90, 104, 281, 287, -39, 168, -103, 149, -12, -417, -61, 61, 13, -121, 266, 430, -516, 241, 3, 230, 106, -561, -197, -710, -75, 425, -29, 369, 432, 369, -333, -424, 190, -10, 300, 630, -18, -1073, 3, -1099, -188, -739, 1039, 708, -883, 97, -636, -82, -238, -383, 216, -311, 49, -241, -1486, 125, -607, 239, -159, -103, 34, -58, -421, 50, -34, -122, -721, -834, -1036, -913, 192, 282, -157, -344, -22, -1157, -1037, -906, -579, 164, -606, -1284]
4763a284J304R25j10j676R03k99q6L08M73j045M01n6l0M53j95p60R61L79j238
4782f72J222l76r12Q08k41L37q74Q59P62r43r5Q26K7q1j162L71m29J330p18p71
4802g32O42k31n1O14l08J283p09q15J553p35K6j020mj93R75L7J47j049Q79q16
4822e07P53j221L77Q69M19M15j849J203M84l24j586L92n56R21Q95q27N95j72L34
4841F15q55K35j72M5q11M99j81L20K15J085j750L74N51N49q80N56K98j436K33
4860e10K75j84M44k94K84L14j015M67O36j98R9n18M6N90k69m16Qk14M64L86k23
4881A72l28K07l73J294j294L33M82l79j60N5J86n13k06J635j552N59P1J278j235
4900B32p13m00R12RK04N09n67M11q5j242J221L33k130J201j20K40j010J784o26
$$ y = [-1284, 20, 945, 835, -841, 62, -237, -323, -15, 458, -587, -186, -242, -272, 181, -14, -774, 187, 566, -672, 550, 174, -738, 70, -171, 166, -708, 151, 913, -30, -125, 701, 728, 647, -515, -144, -573, 757, 39, -732, -90, -321, -372, 242, -66, 1217, 508, -307, 1246, 511, 537, -483, -487, -680, 295, 332, 479, -570, 309, -507, 246, -975, -598, 271, 690, 1105, -744, 459, 943, 619, -967, -575, -1131, -210, 685, -142, 453, 281, 615, -240, -5, -177, -132, -943, -444, -625, -305, -90, 995, -755, -381, 170, 719, -161, 395, 693, -743, -510, -235, -419, 25, -269, 15, 329, -686, -219, 417, 219, 318, -200, -154, 436, 167, -249, -241, -455, 9, 395, 172, -156, 51, -322, 972, -322, 11, 493, 114, -46, 9, 195, -318, -524, 1111, -441, 118, 189, 1467, 232, -481, -881, 31, 40, 244, 753, 186, 597, 512, -730, 491, 824, -1306, -105, -225, 15, -995, 789, 163]
4919A63p52J207n44J135j643J17J63J28o39J212k118J343p33J004j562J764J274
4936A519j875J330q61P93j738R38rk5j147K132j763l6j108K129j38K95r10L6M5
4955c93k54J593j484J597p58K55k780K880j574J612k39L63n30P9q81Q49L27l19
4973C43J54m19p15P70q63J043q01j279K001j595J697n20m85q59J291k30R0n66
4991i43K007n19j022k56J203l38J91p98N15J804j459K94k47q64K090j156l58j253
5009a109M99J73k7L42K00J44k79N99o0m49L03j63j059l37kR95m09J350j29K7L93
5030A002j170j66J135q04j20K97o19P89j147J361n59r82Q10m4j66n80J035N7k3
5049A06k62J176l74q12M11M7J48n77k53M11K07k54j19j074Q89J646j284M70l58
$$ y = [163, -589, 618, 74, 1209, -434, -317, -154, -26, -665, 547, -1571, -228, -961, 43, -1519, 245, 1519, -356, 974, 113, 906, -832, 106, 97, 72, -1075, 1057, -706, -742, -1850, 279, 141, 436, -474, -438, -393, -647, 946, -538, 1059, 301, 556, -2224, 656, -918, 694, 455, 818, 288, 367, -514, 335, 662, 343, 497, 78, -637, 133, -730, 313, -488, -1767, 234, -1361, 336, -184, -669, -1528, -237, -467, -377, -943, 1064, 545, -477, -733, 470, 132, 323, -475, 40, 1844, 385, 679, 432, -432, 1658, 502, 144, -1109, -610, -437, -464, -122, 78, 222, -57, 542, 482, 33, 336, 173, -886, -1223, -1225, -230, -639, 711, 582, 609, 1002, -168, -334, 801, -3, -123, 174, -445, 344, -803, 558, -1, -983, -173, -217, -383, -963, 72, 129, 106, -156, 1020, 646, -166, 245, 292, 440, -137, -390, 21, 228, -26, -145, -1219, -330, 1316, 32, 502, 144]
5068A44n55l26P58m63K40Q95p87p41J457j76j184LJ94j45J268l1j192P97m66O25
5088C15r2J183j940N98n00Q60J182j224K30n11M90j105J721j097p25L52j33m74
5106h70M26J148n13M29k331R21J634j247n54O76Kk17J351k013J072K2J452k996
5124a608J072M06Q0P61l98L09j363J172l74j578J871p59N00J87j600J612j265
5141i75J298n81N80n18Q35O43j55m49p21N61j25J33r73p01O80J206J149k287j045
5160a445Q84J122j668J421l58j206K265j96j479P09j683P76J56j42J568j081K5
5177c32k89Q34J67r23K005j756o22O45P97Q96p26k33P62r02L45q00q09J274j824
5196a491K005j449P87k04Q90j280J199m06O33p8l06Q36k011R23p80N45O11J057
$$ y = [144, -411, -737, 21, -442, -202, 693, -94, -835, 622, 446, -738, -735, -541, -686, 582, 551, -641, 156, -310, 315, 223, 1406, -534, 64, -436, 424, 1606, 382, 612, 101, 591, -514, 1207, 110, -615, -263, -396, -870, -444, 704, 191, 620, -1711, -790, 844, -403, -957, -281, -279, -496, 855, -1158, -86, -64, 1388, -1608, -536, -130, -50, 711, 313, 622, -741, 431, 57, -1521, 350, -409, 91, 278, -1322, 290, -975, 323, -258, 322, -196, 639, 1282, 1127, 678, -43, 518, 393, 526, -447, -1148, -468, 738, 1887, -400, -1445, -561, 561, -1107, 314, -44, -1250, 1015, 819, -660, 49, -1634, -858, -702, -844, 724, -357, -332, -621, 213, 380, -543, 1462, -294, -916, -271, 526, 1422, 696, 463, 1225, 323, 668, -132, -941, 333, -1491, 514, -935, -148, -352, 538, -742, 457, 51, 684, 606, 300, 1136, -875, 48, -732, -187, 424, 1481]
5214A481l158J241K587j451j495n90J548r61n63J397M29r15Q40O07j231j096J756
5231D26L13j290J056q36m44J493N58j748P52K53j08o13M61J431k148J79p57L09
5249g13R2P22k399K449N62j589K053o19r43J387j429l45K423k287n58J401j002
5266g95Q6M74K8L39r17M70P78p06L82n87J958j675R43j547J82R49j022J62P91
5285B93j357P38k59R05l75J90q59j40Q73K67N71o90l47p52J196M11j350R76P32
5304A023p95j298J897r97K96P30P5j697O66O1m09L80r14M96M32J95M40j014l64
5323g97J163n63O33j117m20J466J6p16n46L40m3J087j14j576K096j158J078j566
5341g37J719j937Q07p02N46M16r3O02j463Q2M65L23j24Q59o04k61j281K622j716
$$ y = [1481, -1677, -436, 2151, 700, -795, -1385, 163, -798, -1361, 36, 465, -450, 390, 997, -234, -1330, 426, 739, -551, 505, -331, -775, 718, 1276, -472, 280, 533, 425, -188, 273, 1704, -444, -265, -1022, -713, -621, 101, -2298, 151, 713, -876, 1177, 558, -385, 1002, -427, -772, 1651, -636, -1194, 207, -795, -709, -235, -207, 132, -785, -315, 463, -243, 139, -448, 1510, -165, 778, -769, -587, 362, -660, -498, 293, -1064, -326, -585, 320, -55, 135, -724, -864, 9, 276, 847, 157, -190, -942, 254, 665, -685, 291, 1023, 228, -1070, 827, -170, 126, 856, 931, -766, -100, -39, -448, -68, -982, -486, -54, 141, 581, -433, -797, 366, -197, 436, -681, -1101, 365, 381, -335, -881, -541, -584, 503, 389, -1187, 909, -249, 829, -737, 982, -955, -148, -850, -304, 112, 19, 621, -842, -760, -295, 28, -96, 763, 159, -102, -1383, 1239, -477]
5360d77q53Q36j28J557k10r2j043l16J51k96k15Q70p16J284j285J466l92o09J062
5379E94j586P87L08j41J05k07P16Rp77j482O33J044J174p52j372O77J140l21j097
5398e48M11m07Q3q26N43N39L23L95r94P61j088Q55k31P17n26L31J46j286O77R31
5418H06j126k96M39P08K61p91R9L25o79J52P77r36K09P07j053J02M20l50N7n4
5438b23N46J31j034P49l08P67o22m25Q66k71o88K99L61n82O19l29J66O34n94J42
5458B04o21M72K59l34j8M36j54p61N9O47O9p1m46K17j22j69J034m21j75K96n59
5479a58j22L96o31l83J034k26o9l37K32K38L3K89k79M9r9kk51K73l68N92j042
5500h31J217q82MM23R1k78P85r81L49k34Q2N75m87q6r2O09j216J135j624J097
$$ y = [-477, -1330, -494, -622, 935, 725, 633, -410, -726, -575, -871, -1086, -216, -932, 352, -933, 533, 141, -468, 594, -992, -205, 103, -38, 67, -140, 576, 585, -192, -1674, -1041, 3, 1177, 425, -947, -270, 870, 549, -548, -137, -544, -461, -1287, -744, -205, 118, 513, -481, 280, -808, 47, -184, 533, 7, 338, 484, -802, -125, 806, -320, -616, -177, 531, 792, 1, 100, 425, -254, -102, 675, -261, -52, 655, -398, -296, 124, -226, -169, -223, 323, 454, -580, 169, -139, 628, 6, -419, 447, 176, -512, -213, 148, -434, 185, -144, 22, 656, 62, 204, -417, 55, 314, -20, -38, 398, 244, -517, -458, 189, 258, 187, -259, -42, -164, -333, 701, 280, 105, 401, -158, -280, 116, -515, -898, 136, -90, -159, -496, -264, -26, 7, 296, 17, 66, -33, -35, -286, -13, -381, 211, -831, 386, -496, -492, -69, 22, -256, 529, -452, -103, -337, -255, 320, -167, -253, -345, 264, -952, 183, -1441, -344]
5520c44L75m86R53j418J719n52p74M66K2O2l14M92j097R17j077J174N5m88P4N76
5540C35k47k24q42P43k26J049n63R17n67j265J138m76O34q40J166j301L07L89
5558A27q46J352k56j74k20m49J239r08o46J257m93o80M16P64p74m17J034q8j534
5577a296J301j82J99M18j299J24m0o5J340L8j325m1J318j015J812j032p19N85
5595A21p09K06J038j471P26m43K42J51O62j58k14L28m85K40j408J360j53J19k62
5614a10J04K56O26p35M8m62J160j215k79R8P05l36K99l66n81p4J284m37q13J675
5634H47o79L01K31j928J550r77M69J70J86L29o32n48M68L02q79O80N10m65J50
5653H5j152P26J038m28k44l14j27L34j535J857n98J640r48O7N03k572J516L24
$$ y = [-344, 31, -455, 498, -920, 799, 247, -527, -61, -39, 23, -291, 201, -896, 21, -1056, 118, 173, -315, -241, 335, 88, -136, -978, -235, -461, 588, 25, 942, 375, -890, 248, -228, 406, -434, 732, -569, -262, 127, -719, 633, 377, 203, -17, -466, 773, -135, -781, 476, -17, -697, -281, 483, -291, -708, 326, 238, -1296, 5, -177, 22, 440, -859, -735, -775, -840, 500, 538, -787, -828, 490, -525, 1287, 255, -464, 121, -588, -382, 656, -815, -89, -532, -290, -139, 523, 365, 151, 479, -6, 234, -1174, 186, 33, 152, -110, -6, 250, 876, 141, 189, -273, 887, -328, -607, -509, 196, -140, 159, -207, -788, -862, 422, -15, -828, 847, 168, 469, 700, -1228, 322, -655, -186, -16, 170, 499, -133, -681, -213, 89, -790, -110, 400, -65, 85, -1067, -341, 697, 269, 25, -289, -416, -82, -1617, 240, -358, 1282, 334, 401, 904, -1668, -152, 172]
5671A72L74j019k14J407R1k154J485p79R30p59P19k86O30O3l12n46l15O92k01
5690b2L49l90j27J065o46m52J23R14r00k36P54j2n83R8l56k39n6N45O24m88P71
5711G36k93l48j58k50j98J14O10l68N15m22L81m7l15l82J68K09M34n21M30m93
5731a98l20O72N77n66J16K5p83J05P88k22n87M81j90l1j09N15l28p7m4K7M41Q4
5753C76r23O96K65m80J31J55n09N9k42N66j71r9M32K52j077QN71n9N57l97j10
5774Al84L95K6K70k76J45m16n53Q32k38K96j09lj72R63r42L32K31o37K64l48L43
5796B0L69m43L70n27qL78j15j29J92%j35N7K33j05M0o94L98M34n66q0N8K01J99
5819A47L50k44r6j65Nk52P6O99l31m06q4J27J00J60K58k90m6j5j31M20l47K0n9
$$ y = [172, 546, -473, -687, 720, 811, -1343, 142, -637, 293, -466, 253, -33, 597, 660, 348, -198, -513, 179, -22, 327, -63, -190, 875, 229, -223, -100, 814, -86, -322, 432, 420, -163, -65, -421, -660, -716, -171, 453, -35, 736, 443, 95, -63, -313, -511, -397, 213, -155, 360, -62, 319, 272, -43, -425, -257, -48, 386, -135, 295, -198, -518, 154, 731, 165, 281, 306, -477, -372, 416, 194, -393, 88, -102, -133, -242, 273, -55, -132, -176, -149, 292, 376, -547, 149, 414, -66, 65, 220, -289, -230, -472, 94, -77, -176, 256, 508, -569, -561, 10, -49, 508, 111, 1, -383, 12, 38, 308, 32, 177, -239, -792, 40, -198, 98, -11, -14, -186, 777, -165, 167, 398, -239, 25, -323, 20, 389, -54, 316, -211, -219, 159, 44, -85, 107, 107, -28, 29, 262, 157, 197, -497, -99, 335, -231, -311, -253, -52, 147, 497, 253, 157, -8, -3, -255, -179, 520, 189, -217, -301, -174, -74, 86, 344, 54, 8, -7, -138, 282, -65, -45, -104]
5842a04K80L7j03k22K70l7j17K11m50O3K17r6k34M63l60j47M19o8J73m7j002K86
5864e68N71O8L01L40n87k0j28q87J267l50L39o04N5M88l02m67N72l68M36j83j84
5885b11J76P8n60K83K79J14l32P60r38L07J59o2k7J96k2J8Q3k39j24K70j36K07
5907B79n3k72k3k01L23j37k49J85m00M46O07r2o9r45L94N77o85M37J11n26L20
5928B7k20O78J73j021L59n48j67L49R00j193M71N6O08o61m83J344q90J065j105
5947b58L37J8l94n1o13J081n66L61L3K72m62K23j49K90K56J06o19K18j14J08Q0
5968A57k17j56qL01K61l87J29l37N29kl32m28K61N93l0m34J36L36p89N08J35m16
5990a90Mm2j4J08L5m19L63O30n73M97r4m27O49l62J3l6m34K97j91K46j81M24q84
$$ y = [-104, 176, 213, 110, -112, 158, 121, 4, 215, -235, -172, 45, -51, -285, 178, -182, -329, 90, 22, 195, 148, -854, -568, 3, 71, 372, 712, 125, 105, -23, -910, 357, 7, 346, -258, -203, 285, -17, -484, 88, -280, 156, -27, -211, -35, 43, -517, -234, 45, 159, -173, 587, -351, -44, 115, 53, 26, 222, 200, 218, 301, 62, -62, 208, 72, 279, 226, -46, -69, -270, 53, -84, -333, -148, -548, -102, 505, 413, 344, -601, -207, 370, -315, 122, 233, -293, 27, -193, 485, 658, -363, -4, -552, -719, -370, 530, -663, -192, -136, 472, -189, -672, 672, -218, 847, -258, 79, 97, -297, -348, -961, 120, -446, -85, -52, 220, -242, -19, -168, 122, 378, 484, -135, 83, -31, 77, 157, -60, -216, -224, 77, 338, -49, 80, -257, 272, 270, -62, -490, -229, 364, 334, -100, 36, 372, -417, 91, 226, -190, -186, -228, -242, -134, -99, -518, -155, 475, -98, 399, 305, -122, 527, 165, 178, 142, -292, 5, -186, 60, -121, 303, -581]
6013e81R34L8k51L41j396O46N08R3k30O75j003M33J14L3p54Q71m22P48n76N04
6033G25r52J93k38k21M68M6r7q59P48O45o84k77q9O09k95l84J423j799J752k55
6053D59Q3l14N22q7p66M5J8k27P0O13j128p64J471n40k09L13K19j24J225m4r65
6074a30P3j95q82N14J61K56o4Q11O06j351J167j993J126j177R82M66o44L22p19
6093f71J109j432J401j256J351j063J014m18j5o1l71q47R61N60p00Q02j430n42
6111a608J473m6O92j323J785O07j511o96RK539l636K067j462J284m49K1P58j080
6129e76Q12r19r99M33R24N76J056q76J91j913K198k42j36J04j78r11Q36p85J423
6148A018j292m62J59k80J023r55Q78O8j048J054P5j569R18p36O97j155M88k27
$$ y = [-581, 353, 391, 140, 481, -915, -269, 239, 332, 102, 777, -226, 207, 321, 354, -400, 471, 49, 797, 221, 725, -227, -34, -272, -493, -25, 21, -76, -935, -187, 458, -226, -503, -592, 17, -278, -662, 761, -1038, 714, 459, 542, 228, 750, 663, -103, -58, -40, -267, -197, 416, -712, -1476, -5, -545, -754, -441, -222, -346, 879, 835, -130, -57, -252, -1134, -620, -459, -203, -267, 544, 1150, -201, 966, -1027, 99, -1078, -96, 370, -274, 48, -671, 438, -994, 407, -849, 502, -561, 453, 35, 20, -41, -412, -1259, -298, 262, -438, 364, -1066, -1608, -135, -181, 511, -812, 973, 1580, 69, -627, -618, 1921, -1715, 352, -1110, 174, -275, -254, 504, -576, 236, -683, -1682, -1249, -325, 251, 1307, 431, 622, -1291, 907, 665, 529, 633, 455, -456, 380, -405, 1018, -274, -736, -577, -857, 166, -789, 89, 157, -891, 163, 238, -1331, -413, -1149, -452, -1607, -1119, -1346]
6166a346J367K04J216l92n32k73j81L52K01j3K72M56k007L4P79j097K158j631
6184d33J041p04P5r94O31m68m70K570j534N23m39n37N03p23J386Q7L85o72j034
6203h07J041j357K047p91o53N32K55j82N42K4p41K41k5j244Q91L18m9R1j442J747
6223D38j150Q28K71j074J84J815j863J929k225o85J211L83o57O85k27O10j854
6240a381J642L64n8M41o53J98r44P51l06m0N5J39l45Q40k293J836n61P58p04O16
6260C55n04j094J616k11N53j248j33L85L67K82j006j42J454j373Q68l40J303j455
6278c23Q15p69L8K23K75P20j102K14l76n32M23m82K31N88l01J395j496L61J7m6
6298a27k3o85J256k86k53k69J948j266m78J144m76l78m32J126m24Q63k322J378
$$ y = [-1346, 21, 225, 1441, 1049, 517, 244, 63, 415, 616, 603, 875, 1331, -676, -642, 137, -960, 1198, -433, 608, -96, -21, -1015, -384, -852, -1322, 1248, -286, 237, -202, -739, -236, -959, 427, 514, 899, 227, -807, 234, -1123, 924, 133, -520, 12, 267, 85, 627, 651, -90, 151, 126, -1118, -227, 91, 42, 133, -1309, 438, -712, 116, 387, -687, -503, 1312, -551, 1378, -847, -1532, -321, 62, -595, 90, -137, 473, -1381, 261, 625, 567, 1008, 355, 553, -391, 360, 54, 14, 69, 208, -137, 703, -1590, 246, -315, 443, -261, 355, -149, -1243, 373, 162, 715, -533, -666, -281, 86, 368, -638, -780, 674, -699, 169, -171, 1132, -323, 492, -277, -239, -16, 259, 979, -123, 91, -285, -817, -394, -876, -645, -57, -358, 1037, -459, -98, -81, -127, -150, -835, 421, 135, -118, -387, 1561, 295, -183, 961, 485, 107, -325, 801, 377, 1240, -1082, 296]
6316B96q54L99k80J29L24j303J532M14q72J57j84J070j500Q17K91R27j485j146
6334a268J557k225J171M13L64j107Q68N60n02N92k75r38J376k580K471M81j216
6351b58n30j15Q47l02K80Q12k97q04J900k533J664l75n43J420k085J502M80r09
6369A54K67m57o8p85J088L47j13J7n87j31J51J152j585k00J289j472N97Q65q45
6388c16k53N76j38J39J82l31J011p43M94k54j24j024R41K79j408P70P23j057P72
6407B39m68m38N18m59Q34j006K40N93o62J41q7k06M25j3q2J444j121n83J308j484
6427h67N88J097j203J36J81M00m79p63R02k30L21J9L10j63q27L4L45l57L25O45
6447D14p99P26o85p40J309N11m90o24K60J72m42o4j250J258p66Q17L43M53r01
$$ y = [296, -558, -159, -439, -310, 14, -1289, 243, 657, -215, -58, -242, 828, -672, 145, 436, 1363, -122, -1268, 289, -1936, -765, -352, 12, -1095, -227, 333, -169, 423, 148, -790, 586, -1994, 477, 958, -258, -788, -903, -56, -358, -78, 734, 437, -367, 1533, -1000, 664, 289, -254, 1166, -919, 583, 1063, 154, 421, -36, -104, -889, 199, 546, 433, 450, -137, -268, -117, 1035, -550, -750, 539, -933, -336, 529, -316, -569, 7, -131, 8, 190, -141, 870, 127, 621, 367, 243, -781, 160, 439, -969, -199, 524, -533, 239, -229, -667, -149, -608, 226, -780, -540, 53, -609, -468, -555, -761, -336, -349, -431, 1013, -108, -691, 617, -867, -279, 818, -385, -249, -68, 332, -147, -910, -8, -238, 83, 102, 412, 249, -578, -544, -199, -556, -231, 414, -385, 341, -344, -1084, 225, 736, 246, -378, -118, 54, -388, -452, -1702, -444, -1210, -393, -50, 403, -498]
6466d98N46j83o48J033k20L43k96K70m58J111j827J713j922K005j424J058o35
6483c2J00J14M05l13p20N31p36J277j007J041K34j201n6Q86N12j634J484K10j729
6502f34K79n79J557o22Q90n51l00j619R07p55K403q52q9J455j223p03k25P7L92
6521a92j122N81O35P05N00k2q49R68k280M15L30L2j018O69L17K08j59l19mJ462
6541H57r09K50o28M82J758j890M05J40o32NK97N69j4o40q3J52r21P55j23J08l16
6562c78J009j351P78o43R68p17P09n32J85j28M37p2q01M76m93o40J085Q20q34
6581a22M51o68P10R5k10k50m4L39L39o62m45n15J565m22O08j126M31l85J282p76
6601A95m14M56o88J181j421L29n50J080j026P97K00L65j38O5j235Q26K4l11P87
$$ y = [-498, 48, -135, -783, 250, 30, 373, 77, 347, -111, 1000, -827, 886, -1036, 969, -455, 603, -32, 68, 182, 587, 274, -446, 85, -651, 626, -381, 660, 894, -307, -363, 523, 1035, -599, 885, 1095, -634, -355, -934, 623, 1, 891, 340, 40, -1579, -672, -1427, 976, 124, 35, 1490, 267, -436, -661, -584, -192, -1314, -733, -98, 607, 1107, 1085, 236, 1204, -1076, -661, -331, -299, -1317, -648, -331, -123, -282, -601, -605, 857, -52, 198, -430, 52, 1810, -80, 325, 465, -167, -162, 135, 704, 690, 50, -33, 119, -802, -47, -170, -62, -378, 631, -720, 58, -585, 383, -334, 375, -157, 28, -100, 337, 265, -536, -60, -553, -1193, -108, 712, -122, 329, -339, 371, 466, 256, 6, -38, 301, 640, -22, -467, -982, 583, 161, 769, -357, 74, -311, 971, 195, -219, 237, -451, 730, -691, -362, -912, 168, -858, -61, 139, 504, 366, 431, -804, 22, 46, -265, 522]
6620E22m77k66q05J722m92l31M79p3O86j682L73l52K86L12j15l37O28N05l19l09
6640d5J479r41l53j39r07J14Q80O03j020J655p89P2p72q60J058Q46n19k31K52
6659C83L92j529O51O43r22P03m30L91j216J545p78N6J57J96m95N9p43K51N00J56
6679c0j003M32J660k77k34k57n30N25l44O23o57j36k73P55J49m3l45n6N37n7O22
6700A061r44K89N4k88J318j460K53P06k64P4j196N34j86N84n51j101L17J381r51
6719c70J70J231o28j006O18j46P2O51q37m07P99N3o18P8k32K06O35n9r53P04N77
6740E38j29p66O57o98R41N3m52j32q2j538J456j06Q99j81r50K99R46k65l51L16
6760D55k151J691m16J51O37n54K12K78m49J7K09j57k12K66pk70p8R28J26o02j99
$$ y = [522, 45, -221, -1026, 696, 204, -127, 352, 279, 965, -717, -344, -696, -410, -98, -213, -550, 78, 583, 264, -45, 1434, 493, 140, 1, -906, -792, 88, 691, -329, 1326, 537, 609, -163, -1023, 35, 881, 362, 131, 383, 775, -754, -103, 540, -382, 321, -109, 282, -934, 611, -167, -111, 46, 242, -253, -194, -937, -686, -186, -30, -1033, -601, 1059, 782, 548, 291, -239, 286, -58, 565, -92, -228, -501, 254, 403, 360, 15, -41, 496, 439, 1061, 117, 406, 460, 172, 1490, 30, 283, 989, 725, 799, -397, 137, -49, 535, -16, -1117, -800, 581, -370, -200, 1031, 403, -603, 15, -131, -59, 592, -245, -652, 147, 200, -418, -340, -572, -366, 269, 210, -743, -39, 538, 409, -357, 300, -398, 543, 596, 144, 12, -70, -1608, -152, -258, 641, 460, -490, -191, 755, 490, 139, 455, -1696, -5, -421, -270, 367, -187, 25, 303, -146, -129, 80, -77, -289, -23, -30, -300, -378, 550, 676, 74, -125]
6781a25m0K54k62K41o17N28K51n40N15J00n84N67k38k33P16j17K41j204O79L21
6801D53n05J30j88p34R39K85l06j8n86P33o27P77K86J40K19l70l21O44j876K05
6821g20q7K299L48l157J090o20R03Q33j476L52J502q28r63l72J245p76L23L59
6839B55J2mK28R87j713K01J267q02n18J20k38M50n17P2j31R93P0o21M0j068J088
6860A71m80j22n7J14N73L43p18J175P95m25j886J97P60L62n39l64K78n61P14J031
6880A361p12r10p1M73R45j688P41n6N75r42O31o55J17R21n63M5q64R31n64P02
6900D17M91j003J24M24k19L61k08K90j194J70J219k84l00J37o39nL68m33K64p80
6920h00N25K73L18J66j250J963j204k38Q16q43j00Q21j49k68K64j055L08OO81
$$ y = [-125, -165, 89, -173, 68, -549, -21, 230, -310, 205, 305, -279, 288, 50, -183, 533, 416, 657, -547, 132, 453, -52, 78, -110, -844, 95, 380, 74, 56, -530, 203, -424, 353, 639, 779, 998, 628, 307, 951, -925, -720, -807, 1492, 1840, -1317, -227, -847, 56, 889, -587, -235, 1267, 439, -524, -896, 349, -427, -104, 255, 267, 263, 491, 1478, -235, -34, 1233, 431, -87, 33, -205, 245, -272, -200, -331, 662, 732, 111, 151, -917, 171, -309, -431, -488, -374, 199, 542, -176, 999, 1794, 1369, -517, -320, 440, 802, 263, -101, 177, -384, 330, 1361, 649, -261, -332, 141, 1086, -602, 139, 83, 658, -284, 347, -308, -191, 730, 167, 212, -652, 279, -285, 417, 908, -95, 29, 453, 234, 595, 387, 677, -517, -347, 872, 588, 288, 425, -214, -219, 149, -284, -20, -800, -275, -2, 316, 482, -768, 1195, -9, -247, 569, -274, -374, 447, 298, 30, 294, -761, -453, -447, 234]
6939B34k15o18L89J039k993K851q23N79l19O64j311r47J002N9J067l38j70o63
6957e13Q53p5n58J02R76k88q15N92pq12P79o25Q70%N40p95l53J213n21j207O65
6978B1J6L36J073k133Q55K08p24L64l54J04l95P42K09j275P42L4L2K03o95O77
6998D0M12J05n17m0J05q01l11J120q9J69L09l61m3K25l66N13l04m46R38j381R03
7019A80M21l15l79j49L1k69O24K21J76Q6n01k69N06l83j14M76K76k21l89pl05
7040c04R21j021k04L04n00N69%r3j4Q68m79n40N18K06N19p46L28k14P37r95J07
7061c3J48J88m28J95J1K4J15n06R67n58K63k53n37M52K58l07m9L59j36o3J8j03
7083B5j50J91P0K08q18L67K30j13K39j84K71o7k56l04N75m46J46k4Nk48K20N5
$$ y = [234, 19, -599, -210, 829, -2164, 687, -136, 443, 124, 788, -523, -1470, -468, -409, 658, 320, 150, -513, 340, 265, -293, -191, 785, 497, -318, 274, 267, -545, 234, -391, 479, 479, 1019, 224, -129, 1084, 563, -644, 21, 37, 373, 1446, -687, 168, 376, -348, 16, -338, -234, -629, 113, 322, -953, -211, -177, -145, 58, -637, 40, 452, 557, 40, 0, 105, -696, -1007, 113, 24, 193, 502, 141, 98, 323, -43, 470, 166, -280, 658, -723, 180, 601, 286, -93, -242, -211, -480, 144, 365, 541, 627, 126, -143, 363, -20, -134, 342, 618, 397, 8, 1, -304, 617, -404, -608, -304, -804, -235, -235, -328, -342, 526, 47, -493, 25, 231, 750, 4, 332, 118, 855, -140, -33, 115, 303, -125, 70, 81, 105, 220, -286, 681, 123, 386, 133, -404, 48, 306, -1, -50, 309, 173, 110, 128, 25, -125, 66, 136, 344, -474, -107, 123, 10, 249, 65, 336, 269, 13, -291, 284, -162, -16, -40, -35, -283, -63, -8]
7105hL38k55O8j98q8K68k69J31m45L38k8L01o37M32r1J09R4m7o9J39n07J91M41
7128B08j12k75L3J91J01k07K7L00l73j04J42K93l27K64l08J87o5j25k0P3K51K30
7150C84n68M04l09J76q6n8J70l59L69k38J70q2O4J4P2pj00J42k89R3J62k65K00
7173E9k49L01k66J98R8jR6k9J17l30j38J46N2j84J83l89K09L47j71j33J61M1j01
7196A7q4J62o7j3m8J86j17ll62L65r2K49k00J48j21J72j19j56OM78m00Q6j08J94
7220A73p0k62M3K17j83J96q6M8l5j36J35N0j09J40k16J38K67m75J45K60r7rj94
7243f0L25l17J27Nj01K76j94l5o2K19r1k69L83r9k16P0K16J4r7k48Q0p4J28l51
7267c71K73J49o6nk07Lj9J89L5o7J08J77l34k5N7k25K56k5J76k0j0K80k12j50
$$ y = [-8, 330, 75, 143, -55, -143, 125, -144, -13, -458, -120, -148, 153, -484, -52, -143, -34, 60, 13, -56, 83, -424, -233, 208, 96, -179, -146, 45, 146, -61, -34, 266, -107, -211, -69, 224, -103, 161, -147, 40, -25, -150, -170, -97, 154, 384, -184, 220, -89, 87, 1, -57, 113, -246, 123, -115, 55, -27, 37, 51, 123, 116, 16, 158, -131, -38, 124, -141, 59, -190, 111, -155, 43, 141, 140, 236, 207, 324, -6, -144, 2, 54, -130, 53, -336, -127, 220, 49, -84, 77, 118, 17, -67, 95, 28, 15, -33, 153, 36, 33, -329, 36, -56, 193, -7, 141, 20, 192, 73, -83, -77, 401, 1, 87, -21, 173, 103, -159, -116, 101, -82, 114, 28, 76, 41, -95, 40, 90, -19, 121, -95, 43, 310, -165, -20, 240, 143, 134, -60, 265, -52, 75, 80, -21, 255, 61, 26, -36, 183, 92, -177, 206, 107, -109, -39, 177, 191, 94, -154, -74, -148, -20, -371, -98, 51, -15, -20, -227, -224, -243, -54, -19, -86, 22, 199, -135, -160, -103, -328, -72, -97, 79, 59, 49, 329, 117, -33]
7291c3k9J15L6j32P7j81K02o5K5j01l3M9j89J03L34m09K49n1Q6r4j13L33m55M20
7315A44j41j6M2K84n79M7J52K01j26j5J18J5R2p8k05n6J93J86k53J40n36O38k49
7338bo2Q1j7l64K10l9p8L14k69K22r7l75l7O42l97K55k71L57r0j53p5Q41l24m39
7362a67J81K04O02o63L20n30J121j388O32J28j018O43l15J18P96j070k30J573
7380I37k12p30o33J115l77K6o60M11M11n18N59k57o93k36J211j576Q07N29o53
7399e39M88Q06j026N17J270j954N20L96M90q22P93mj796J094j26N41N14j583k37
7418f58Q90R67k044O67J84N08p10J146l9m94K12o81Kk85P86j126N20O49J48j055
7438d13K619k192r61J510q49P63M76k22n67n31P53L63j601J119J44O05j059N1
$$ y = [-33, -62, 53, 89, -43, 34, -147, 55, -10, 15, -86, -119, -70, -259, -156, 178, -231, 18, -33, 53, -41, -154, 179, -276, 144, 3, -13, 29, 313, -266, -219, -67, 134, 8, -7, 111, 126, 218, 140, -65, -121, 72, 258, 5, 145, -391, 247, -2, -64, 17, 0, -364, -154, -193, -271, 43, -226, -4, -101, -476, -513, 129, -268, -13, -284, 73, -17, -170, -245, 596, 272, -167, 14, 218, 820, 157, 477, -53, 1068, -320, 312, 440, -578, 65, -250, -132, 664, -406, -636, 937, 725, -5, -638, 477, 100, 126, -534, -123, 288, -230, 329, 72, -621, -857, 354, -1222, -415, 114, -539, -51, 755, -271, 246, 1516, -438, 82, 478, 968, 146, 939, 935, -861, 233, 107, 648, 1162, -421, -658, 232, 1199, -845, -178, 6, 514, -196, 950, 911, 417, 629, -52, -50, -335, 451, -675, -155, 494, 642, -413, 2206, 14, -947, 563, -286, 477, 953, 731, 164, -367, 386, 749, -852, 267, 411, 1016, -43, 8]
7456Hl79j03O95q00J053l16l17J2J479r00J43l13LK6j72Q0M87J06p09J684j427
7477C40q86O00m19M97M90q95n96J614j181J53K04L36n8k21N67o35J540n31n61
7496C58K9p44j59J959j724j093K097O78j268P85n63Q2L66n84j54L2O2P9k66M08
7516C80m45N94j620J86p8L01P78L10q74Q25n76j4M13m88N97J85j416J880j013
7535g5L6M64o38Q55k91o76o39J045R57j524J91Q92n51J22K70p73j69R02l77R50
7555I71m59m60m2J260q57j74P6r46J405o96k90L75J76k77m93K24R49P57j265n2
7575A82m00O59j751R46M76N5R24M41o23j049J249k222L53N10k81O82j64O02O5
7594F54J059j685L52n55j51N66N46m87j31J021k167J017J562j286p51O52P80j26
$$ y = [8, -371, -474, 221, -579, 474, 158, -159, -147, 1332, 432, 575, 262, 265, 291, 119, 199, 686, 792, 83, 1767, 340, -546, 54, -365, 132, 622, -273, -869, 745, -436, -283, -79, 257, 199, -22, 545, -90, 1450, 919, 358, 387, -357, -516, 1443, -281, -1374, 723, 1401, 133, 918, 355, 437, 803, 219, 65, 97, 159, 238, -28, 380, -65, 529, -1091, -905, -983, -682, 96, 406, -468, 357, -219, -233, 180, -308, 289, 474, -942, 938, -75, -39, 425, -213, 642, 351, -325, -964, 81, 1038, -486, -295, 597, 46, 168, 438, -335, -504, 398, 21, 971, 512, 52, 10, 1270, 413, 239, 315, -631, 774, 78, -212, 163, 339, 62, -431, -207, 742, 1499, 234, 182, -218, 441, -1310, -364, 112, 167, 1091, 1532, 909, -140, 1109, -1113, -760, -250, -531, 151, -13, 589, 654, 1713, 28, 380, -175, -326, 240, 786, 299, 168, 1189, -978, 39, 1601, 315, -436, 216, 996, 870]
7612H70l90n95ol12K83J18Q62j026K44l05Q3p93J923k146J141J60n06L82l78J790
7632A399j368Q70q95M14K11j455J658q5j75j14p87J069q70P30r43M51K41p53k0
7651d22M72L84M54o92J150q09Q32j997K077m09j291K8J281q23J110n07j033J640
7669A445j383L27p2J05o37J249j108J461r63k85n05L58j13M00k92n42J006m87
7687c6Q12j77p18L48J068M73l87j023q4P8r82J338j343N43J518Qk078J070j923
7706a495J933R9J74j57p01K44m86R53j724K236o23J301j536L16L26j304l44q5
7724h73J19J090rJ521n97j206N26o00Q72j512j707K814O3l82J701j768l10O25
7742C67L40j409M99N07j50p93J059k747J877L83o51K008r54J175q66N45j207J25
$$ y = [870, 480, -115, -121, -433, -150, -32, 830, -196, 48, -257, -174, -967, 956, -1190, -49, 111, -395, -13, -391, 1399, 31, 901, 6, 420, 631, -824, 834, 749, 574, 460, -327, 742, -128, 602, -341, 110, 351, -402, -422, 50, 434, 888, 196, 1346, 537, 1369, -628, 1449, 1040, -251, -223, 1058, 235, 1345, 838, -195, 1445, 62, 389, 317, 422, -215, 1034, -74, 1387, 424, 139, -366, -8, -121, 279, -13, -555, 451, -36, 776, 599, -119, 229, 1297, 1770, 1383, 360, 276, 354, -628, 710, -633, -90, 1428, 1436, -642, 428, -1495, 438, 537, 711, 554, -147, 97, -389, 564, -1160, 1076, 453, 1754, 218, 534, 860, -444, -788, -873, -754, 336, 327, 1848, 1251, 45, 571, -29, 843, -669, -2376, 438, 501, 119, 1820, 52, -258, 367, 707, -702, -203, 304, 154, -639, 420, -2327, -450, -67, -718, 1290, 336, 1511, 645, 1190, -17, 108]
7760A08o28J458q66l7P86J40j707O05O10j384J445l19J25j17l4n02O78o82M87
7779A66M06N19n81j369K56R10O83j416J216p01j17K06n10O79j172J223k73K78
7797D03o29j03K80N52j005L84N70K3J42q84J586q90k30J48j53j065j81J030O99
7816F77j143R83r56J615j358j01J392p89j062Q68K35j22l50j92l43J392l21j061
7834f36k50J876j373J23K76J68p11O44K09k19m95K10p45Q20r71R28J68M13q58
7853d23N29L05j15O23j087N17q09L47K9m79n1R7L39O06K99r03j21J57L18j78k10
7874b10Q31k98K0p28O12j147J282k77P19p48r84L83q39J599J42N56n08j38o74
7893d07R39r76l25K21j87M99P3j85R59l90M66K7l81p82J181l62p80N46o8k18K0
$$ y = [108, -520, 938, 72, 35, 821, 961, -746, -141, 469, -915, 530, 211, 336, 219, 185, -317, 361, -321, 166, 572, 1091, 510, -859, -603, 307, 990, -426, 790, 89, -28, 178, -332, 347, -825, 398, 125, 403, -226, -329, -49, 503, -502, -118, 452, 475, 617, -267, 1319, 429, 199, 347, 194, -871, -1052, -22, 677, -466, 517, -439, 1176, -182, -283, 1109, 320, -742, 126, 361, 239, -111, -303, -646, 746, 425, -636, -886, 990, -383, -260, 16, 184, -527, 117, 326, 107, -388, -178, -923, -103, -1074, -146, 22, 435, -423, 106, 411, 296, 919, -168, 349, -460, -113, -84, -563, -614, -517, -178, 428, 727, -176, -297, -140, 178, 0, -210, 621, 323, 343, -385, 227, -920, 362, 85, 804, 56, -928, -545, -1384, 215, 357, 913, 405, 267, -407, 532, -444, -769, -548, -735, -236, -163, -348, 611, 221, 687, 714, 333, -449, 732, 370, -410, 136, 68, -150, -130]
7914a30M54O98r76L88M32l07K00j643J182K38J70j323J349Rj234K03K3J276j407
7933c98r3O71Q38q07j62j58P6n15R01k65J330j695P21o23j00k87R28j36O81K35
7953A142r60J31o95P98n5o08L75J00K62p73L29n82R39k65Q78j764J305k01r88
7972f32J245k99j34l43M97m83J026n49q64J508l89p42J287k124J690q81M71J56
7990D40N59j404M04j054M16k68Q79O81j881J517Q31o65j552Q69L67K96r02Q15
8008C48j61j2j00m43r4K35k12P02J35J84j56m42N17p02R15j352N08L34l80N59
8028C83O08l76n28pN83m30j02l19J59K79O55r08J1N69Q99j953J248n31p21R55
8048D74q94J183j229K24l10R00K32j180P86N93j73p35Q82n75K45O78j675J934
$$ y = [-130, 324, 1022, 46, 434, 866, 559, 759, -884, 298, 536, 706, -617, 732, 741, -493, -290, -267, 1009, -398, -491, 180, 1018, 211, 49, -109, -33, -548, 353, 88, 1418, -277, 444, -179, -279, -566, 362, 226, 907, 1142, 182, 313, -382, 416, 361, -247, 128, 228, 490, -283, 46, -536, 403, 138, 1016, -748, 557, 356, -632, 613, 314, 180, -163, 334, -149, 877, 328, -536, 972, 583, -159, 1128, -996, 694, -187, 284, 440, 999, -405, -1, -1055, -639, -907, -28, 653, -1228, 289, 1120, 455, -1097, -228, 139, 435, -467, 348, 187, 175, 75, -368, -462, -227, -439, 263, 398, 582, 426, -16, 501, -201, 714, -638, -130, 204, -176, 383, 991, 615, 87, 80, 663, 233, 131, -188, -29, 250, 905, -3, 8, 577, 1476, -477, 771, 240, -481, 474, -420, 763, -466, -242, -552, 348, 580, -600, 186, 779, 606, -129, 753, 178, 423, 1101, -574, 1360]
8066A360j875M50m64R71L71j585m2J373q83J1n75l08J196J96P56j582R42K79q04
8085b13L9L02k43M62m32N01L92k63o19L32o26K10O31m27Q03j342L94m93R4p70
8105a268J725J12p35J20m16L76M43j49k89M2K41j61M8r8M92j151J605o76k69j70
8125a78o2K9J77J85j77j17l21L52M60k41j018J607p40Q48r29J52K2p49J163o42
8145a79L22q9o83O48L12J105j084N47k20J20j103N08J67j46J48m03J45j25j60
8164a70J77J74N29j134M16L89k10k38Q92r29q25J406n3q37M84L65j10R2l18l31
8184b31J90k29J46N72j208J076k12
$$ y = [1360, -515, -65, -529, 442, 813, -772, -814, 559, -324, -313, -888, -1196, 0, 196, 952, -630, 312, 591, -213, -174, 128, -115, 347, -85, 416, 808, 545, -74, 258, -368, -158, 473, 46, 849, -493, -99, -592, -498, -1268, 457, 569, -166, -46, -462, -86, 357, 208, -81, -39, 202, 41, 89, -9, 483, -668, 937, 261, -8, -178, -240, -211, -34, 151, -26, -143, -464, -112, 348, 107, -911, 696, -44, 804, -125, 27, 49, -700, 463, -179, 143, 54, -629, 19, 331, 1436, 352, 899, 679, 799, -304, 204, 371, 225, 373, -30, 115, -10, -170, 7, 181, 710, -424, -8, 381, 171, -67, 825, -104, -929, 477, 424, -413, 71, 436, 326, 418, 100, -231, -41, -270, -124, 448, -760, 316, 104]
8191A04
$$ Imaginary data points
##PAGE= N=2
##DATA TABLE= (X++(I..I)), XYDATA
0@%%%%%%%%%%Pj4J4j4K1k8L5m2M9o3P6q9J04j19J40j68J96k24K58k98L40l89M44
33B36n00N62o37P18q03Q99j005J120j247J384j532J696j874K069k284K517k772
50a453L054l366L709m089M515m994N538o159O876p716Q714r926J1434j3367J5954
65H724j9614K5213l4969N6777j94486J6487K37589j50643M2967o4122q7441J13608
77d9910P9941q4810O271p4654j1174J96614J8282j70503K7674l390j7634J17432
89C4139j5469j01430M7102L2322J5111K3302o0148m5519M6756K0777L4149K4777
101E5869q6204m115R6385k9010l1901Q517l3385M4165N5014k3129J323l4731m7026
114b8228P3426M0829p6995M940L6793l1261M3908K1546q1364M184J7597j1661
$$ y = [0, 0, 0, 0, 0, 0, 0, 0, 0, 0, 0, 7, -7, 7, -7, 14, -14, 21, -21, 28, -35, 41, -48, 56, -63, 77, -91, 105, -119, 139, -159, 181, -208, 236, -264, 298, -339, 379, -424, 475, -530, 590, -657, 727, -805, 891, -983, 1086, -1198, 1319, -1453, 1601, -1765, 1944, -2145, 2370, -2624, 2914, -3245, 3631, -4085, 4629, -5297, 6137, -7230, 8724, -10890, 14323, -20646, 36131, -158355, -141868, 95721, -54922, -11955, -76077, -163518, -49910, 30031, -54779, -48508, -123162, -134336, 62278, 80560, -89943, -62269, -65659, -83293, 34139, 18670, -82760, -35658, -3336, 11775, 35077, -25071, -70590, -23834, -3057, 31092, 55869, -30335, -34450, 61935, 32925, 1024, 9541, -23844, 20321, 75335, 52206, 53529, 18798, -28228, 45198, 86027, 9032, 13972, 50765, 19504, 63412, 84958, 3594, 7778, 25375, 13714]
126A3714N7870j1149n7761L1476J5411k5638J7923j2982l8076L9405K3924k3012
138C1105J7164k6580k8908M2012j1255j9107J9062k2545J0285L5222l4039k0487
150h071J2966k4256J0848M4001l4289j8926L1792k9399Q777K9475n3172M44L4634
163D824k0913J9263J7223m7498j207K8544k1968P021K2628m0182J0584L4964l0619
176a7336L307O967l3500K2945J9200j8441J0834L68j6883J3689O581j9551Q252
189a3568P598q706K3951m328k4615J6790m342m917K1433j5353m482J9799p098
202B162j075J0788k0229q008K7590l501q892J6515j6022m524K5108j8999k900
215a987J2429j3386R766J6642j6031o324N560n496M36J2654j1176j480J3748j0914
$$ y = [13714, 71584, 60435, 2674, 34150, 49561, 23923, 41846, 28864, -9212, 30193, 54117, 31105, 48269, 21689, -7219, 34793, 23538, 4431, 23493, 948, 11233, 46455, 12416, -8071, 4895, -19361, -8513, 35488, 1199, -17727, 14065, -15334, -6557, 22918, -30254, -29810, 4824, -16089, 3174, 20397, -27101, -28308, 236, -21732, -14711, 7917, -32265, -21681, 13283, -17336, -14029, -7062, -40562, -17617, 1583, -16858, -6024, -5656, -22539, -8850, -2269, -21820, -13568, -5970, -14676, 9275, 4947, -19668, -2878, -7220, -12137, 9296, -6057, -10539, 9260, 2162, 1087, 11875, -8354, -16362, 11228, 7727, -1165, 15350, -672, -5196, 19912, 913, -1987, 10442, -2944, 6822, 23464, 7433, 1109, 6669, 1173, 1609, 14263, 3087, 1607, 15355, 4441]
229D441K858M26j6340Q590N588m106R020o978n272N878k564n816K303r94l594
244f560J2743k150j1389Q051j0281l393J4599j2227q22J1634o506j151M387j0216
258a3281l605Q383j234j850J0892r544k591J2549j5242j273Q745q172P282O874
272b067o358K65j63n974O97N640o264L168J0770q326K414K198j0149O116J444
287f589l877R195L67k044M322j417o418k48N402k548M559N495n960N184j282o806
303b665M139k391N91O703J54M30j214r42j790k95K024k583N478M612l057L513
319A2707m914k180J071o88L735n29l38L925o5r25n889j614L511j433M226Q01r52
336A0449q72j687J218k771l936L248J667N096p24k467l10m010K96J474j472M93
$$ y = [4441, 7299, 7725, -8615, -25, 5563, 1457, 10477, 3499, -1773, 4105, 1541, -4275, -1972, -2966, -6560, 6183, 4033, -7356, 695, -9586, -12979, 1620, -10607, -11429, 205, -6301, -7452, -3065, -13281, -16886, -8503, -9737, -11587, -695, -10239, -12830, -281, -15523, -16796, -8051, -16223, -8941, -2067, -8425, -8160, -8323, -14297, -13600, -7960, -14224, -11056, -286, -8612, -6198, -4000, -14149, -8033, -6589, -10466, -1271, -904, -2948, 1374, -43, -6461, -6709, -1307, -3855, 704, 6199, 239, 5423, 4141, -2665, 1474, -917, -326, 6377, 6531, 6961, 5747, 4805, 3015, 2720, 4744, 2161, 7639, 12251, 9194, 12707, 7793, 5613, 6684, 5996, 9731, 9202, 8864, 12789, 12724, 11799, 5910, 4296, 7807, 6374, 10600, 11401, 10449, 9577, 7890, 9108, 6337, 2401, 5649, 7316, 12412, 11688, 9221, 8911, 4901, 5197, 6671, 5199, 5692]
352E692O73K903J339m648k148k668J005K99l8L363l386J794J016n994K769m674
368b703M46N253j323j465K051r59l023j56o39k259M288L338m452N099m219n593
384f316N414k363j326K416k080K562N08l56n462R57m26j910O738k306l059L709
400c300l71j784N49l690K119J968J47O25n26j288j228L034k840p63K363j206J335
417d856K279o394L036p58k734M211j023n11J605K016l057J089j101k168L564K231
433b571l230K321N15k791L085k632R36J007j464L806j52j831p1k72o73L27K616
450a074l090J957L318l844K839O76n875N962J903m415N090j108l556N029J045
465D857p419M028L162o988O942L318r764O601J488o645N956J30n823O659O19n846
$$ y = [5692, 6365, 9268, 10607, 5959, 3811, 1143, 2148, 2447, 2409, 5772, 2386, 4180, 5196, -798, 1971, -2703, -2257, 2996, 1673, 208, 2259, 1300, -1723, -1879, -2518, -4777, -489, 2849, -1603, 3496, -723, -6316, -902, -3265, -4591, -2175, -4255, -1693, -1185, -1541, -7003, -6046, -6472, -8382, -1644, -3950, -7009, -3300, -3671, -5455, -4906, -8596, -6477, -4509, -4362, -3737, -4263, -5551, -6779, -3745, -6585, -7348, -4985, -6191, -4856, -2577, -8971, -5935, -6693, -9427, -5216, -6239, -6750, -5145, -3129, -6186, -5097, -6198, -8366, -4802, -2571, -5801, -3480, -2965, -5756, -2671, -5303, -4367, -3360, -4824, -1018, -1170, -3001, -3072, -3344, -4017, -3690, -1074, -4164, -2207, 1111, -2733, 106, 782, -5093, 869, 2772, -1643, 3447, 2339, -1217, 3812, 4857, -2562, 1466, 4628, -2360, 4582, 7900, -1864, 4737, 6225, -420, 5536, 5666, -157, 6502, 7121, 1275]
481A275K382L760o386M299L546p870M014K634n239N318k618l966L748R98q39J368
497F424j885j271J283J022k607J501j448q08M260l355M86K372n208L948J9m159
513E74K331J463j963J05p78j164o93M066l044R66J26n051N502Q44m546J316N2
530A06j587L510j402Qj536N01k18J543j330k363M592k355r61K131n460L231K319
547G29l892J810K848n964L177K492o510K890L928n221K241N355p652J152M542
562A925o158L580L148q612M819L797o490K879L526o659J223O912o851J318M124
577B481o299K572L006o448M464J535l804L604l33l900K596M89j316q48J173k098
593c126M102m22l012K171k544J269K334l549K62L685m196Q54L515l726j694L105
$$ y = [1275, 3657, 7417, 1031, 5330, 8876, 1006, 5020, 7654, 2415, 7733, 5115, 1149, 4897, 5895, 5056, 6424, 4539, 3268, 4551, 5573, 2966, 4467, 3019, 2211, 6471, 3116, 3602, 5974, 766, 4714, 4733, 574, 2905, 4368, 2405, 2510, 1732, 568, -125, 3941, 897, 1863, 1989, -3062, 2440, 3284, -1262, 54, 106, -1481, 2029, 627, 635, -901, -400, -618, 925, -405, -2768, 1824, -531, -1492, 639, -4821, -1590, 729, -3163, -1353, 1495, -4469, -1292, 1200, -5310, -2420, 1508, -3713, -1472, 3883, -3769, -2617, 1925, -4233, -653, 2495, -6117, -1298, 2499, -3991, -1112, 2414, -4245, -3022, 3890, -2961, -1643, 2481, -3818, -1246, 1760, -4688, -224, 1311, -2493, 1111, 778, -3122, -526, -37, -1353, -2201, -1028, -3126, 976, 554, -2458, -287, -2831, -1562, 772, -2777, -2515, 1170, -3026, -2172, 1343, -2383, -4077, -972]
609i72k316Q47M447m815N06L483n171M15L514n370J463N364m517m77J470O20j684
626c193J654k259Q16L317k122O65O97k606L19J004m32J757k119K073O47j038k10
643a030M98k844P51L486j772q5L014l369k85L906m434R50K588k692J899J895l485
660a009K0L721m162L18M619k956NM245m501j82K634k559K004J529k549R85J993
677D155k524M66J731l052P33K799j894P58k30j427K345j66l065K383q09p23K099
694C579M45k330J880n58j455K839j408k948L944n69k617K649j937r74K337l79
710B498j122J050K04j585J149p42k244K603O05k204K231j834m94J135o97l60P1
727B64R50n21J001m09j310p3K05K79q2q98K37J65r72J887j425j032O34l49J999
$$ y = [-972, -3288, -2441, 2006, -2809, -2303, 1180, -3991, -3576, -62, -5432, -3969, 1395, -3122, -3599, -2129, -1509, -3193, -1539, -3798, -2982, 335, -1787, -1122, -425, -3031, -2712, -1708, -2140, -383, -2502, -429, 218, -820, -1030, -532, -3376, -2625, 861, -911, -996, 2018, -1351, -1636, 2270, -2164, -1214, 1374, -1318, 581, 2476, -1009, -989, 2732, -1430, -1112, 3507, 551, 556, 4801, 300, 118, 2752, 193, 2197, 3726, 1177, 2162, 4155, 1631, 2097, 3828, 776, 1509, 4308, 2414, 3172, 2942, 1515, 3860, 3694, 629, 3012, 2203, 1480, 3579, 4024, 1694, 3574, 3016, 1561, 4400, 2992, 44, 3988, 3419, 802, 3451, 1514, 540, 2877, 2498, 1376, 2426, 2630, 1045, 2194, 1452, -792, 1811, 2416, 212, 2443, 609, 115, 1250, 553, 193, 264, 1214, 693, 1694, 1285, -25, -98, 107, 386, 304, -594, -357, -192, -1164, 723, -702, -1734, -1100, -1449, 550]
746E50R83l087M70Q19k504J063J89K53j441K063l03q47N73p94Q21M58j229N61
764a402K56j148P53M9k68k73M40o4m17J057j782J493n49j281M24M53j4Q82p3j21
784a585m37K72m23M48L62j324Q22O32j89O35j206n65J017k52L17L50r92K64M72
803a382N80m22j011L78Q09J275j117J18q8r39Q66k2J192m92rL65J82J14j71j747
823a521Q15R82J45P34k123J621j49j407J404m03J176m24j68k08J78M92M36j048
841E32J080o90J80O07l63J049j260l69J850o44L42k81j5N94p10j64q82j97M56
860A115J64J108R14j712O35n33j02o08O3J316K0k77m16M1O54j436M13l03j056
879@J129J190r87m18m35J357j319M46J16J84O47j019m98J464j200m14L07l42R05
$$ y = [550, 1533, -1554, -1084, -265, -2769, -1706, -1517, -1264, -2705, -642, -945, -1792, -1219, -2013, -1192, -734, -1963, -1402, -1146, -2294, -1541, -1492, -1760, -2033, -1593, -1657, -2074, -1017, -2799, -1306, -1855, -3136, -2712, -2259, -2273, -1391, -1464, -1585, -2022, -1750, -2173, -1725, -1363, -2687, -1865, -1233, -1422, -787, -1993, -2558, -1541, -1793, -1476, -1126, -2118, -1854, -1382, -802, -1224, -2235, -1857, -1048, 227, -890, -772, -860, -1799, -933, -955, 237, -255, -264, 101, 283, 397, 226, -1521, -706, 276, 421, 1155, -968, 653, 504, -903, 501, 98, 1274, 850, 682, 474, 652, 1144, 1580, 532, 1612, 922, 1102, 1709, 1346, 2395, 1135, 766, 2616, 1972, 2314, 2033, 2018, 2612, 1902, 1738, 856, 659, 1115, 1279, 2387, 3301, 1589, 2224, 1691, 1589, 981, 1044, 2360, 2380, 2103, 1687, 1728, 2382, 946, 1359, 1056, 0, 1129, 2319, 1332, 914, 479, 1836, 517, 963, 1079, 1263, 1910, 891, 393, 1857, 657, 243, 550, 208, 1113]
898A113j41o2m59j25p92r44N72R50J40p14Q00j003J101k214K321j463o32J802
916B50J08K82k131K688j250j340O42J259n56m09R32J45m27l05L08k119K082n7
934A02m24M98n4k72P63o58n37j50L39Q23n48K05j067O79n28k63R59j364J53J519
954A75r60R15j064Q22j647K674j348R63j307M04K03K89n75j76j86J107q5l06r22
973a024P46J09q47m97j47J817k69j31k95p89l12J903r86J31l79N53q30N36J54
992e57p69j29J23Q36l34O33P4j185P72j03q14N88l46K45L81QM1m43R41m14p59
1013a211O41q85M55J441j503K59P66o36k11O36p36M88kO90m87j65L41k56J185
1032H10q70Q3j2L75N86n83O56q37l8J054m63m2N13p99K55Q44k81p58J464j67j059
$$ y = [1113, 972, 910, 451, 326, -466, -1410, -838, 112, 252, -462, 338, -665, 436, -1778, 543, -920, -1552, 250, 358, 640, -1491, 1197, -53, -1393, -751, 508, -48, -457, 475, 620, 193, -112, 196, -1923, 159, 102, -322, 176, 122, -150, 613, -45, -582, -732, -393, 430, -118, 87, -980, -301, -829, -1092, -133, -1497, -1344, 175, -785, 130, -934, -112, -1759, 915, -433, 530, -777, -373, -170, 119, -456, -632, -818, 289, 204, -102, -1024, -278, -169, -1016, -1513, -1660, 157, -112, -243, -538, -1327, -1639, 264, -722, -591, -970, -417, -1247, -711, -557, -1326, -1455, -1332, -496, -830, -197, -123, -1308, -536, -639, -1453, -865, -1211, -966, -585, -577, -536, -979, -38, -452, -1211, -570, -1455, -1000, 441, -1062, -803, -37, -673, -884, -248, -984, -496, -498, 192, -295, -460, -119, -375, 810, -60, 23, 11, 386, 972, 389, 1045, 208, 170, 1224, 761, 719, 1232, 433, 688, 1532, 1251, 493, 1957, 1790, 731]
1053G31J273j99j473J165L45n24Q26o66l19Q30J26j124O91N27j371J138k83m90
1071A203P86p35L61P96j167L4n06J440j044L78n22m94P22M64j699J817q91q31
1089A12J633j861O93R63j188l07M18o65R03N22j897J057Q69k243O31P28p3m54
1107a59n01p70J217L31k67j99k96J21k26Q1n92r83R63O68j80o7j53r66N28K37
1127a213k34q4O75n03N18K80j299k47P27j7k33Q16m74J87J32k0p39Q13j24j016
1147b055J890L0j797P79J99j94L41k23K55j16J397j405K70k18j65K10l11k98J330
1166h1n01P2J16M21l56m08J406j452J680k76j116P00n94n15J272j037k11J596
1184G16m81K1m55J33j245J391O18r14J151m58M70L6j091m84J304R2k33m48Q45
$$ y = [731, 2004, 1805, 332, 1497, 1842, 1318, 2144, 1478, 1159, 1989, 2115, 991, 1682, 2209, 838, 1976, 1693, 1203, 1989, 1254, 1615, 2411, 1244, 1278, 772, 2212, 1168, 1546, 1024, 530, 1252, 1716, 17, 1834, 943, 112, 1745, -116, 577, 1540, 352, 45, 463, -202, 701, 1223, -674, 383, 1252, -991, -360, 368, 295, -159, -660, -1430, -213, 118, -149, -348, -644, -523, -749, -668, -1260, -2243, -1280, -612, -792, -859, -1012, -1978, -1450, -1213, -1447, -1531, -856, -1359, -841, -561, -1860, -2107, -1380, -1397, -1630, -814, -1288, -1101, -969, -989, -1728, -915, -1039, -2055, -165, -135, -1932, -1153, -954, -1148, -807, -1030, -775, -891, 506, -899, -629, -847, -1012, -802, -1113, -1411, -81, -582, -510, -394, 27, -329, -737, 669, -783, 897, 621, -495, 205, -389, -904, 368, -669, -880, 716, 235, 256, -199, -66, -1311, 80, 698, -216, 935, 477, 947, 983, -108, -592, 712, 804, 571, 123, 968]
1203I68r09OO97j026L10J046q29M49j83L3J221j317q95Q04P23q91L42O66r14M07
1223G08q20j77J129m01o06K033k165J115l22R6r6l68n07J937j789P93J061j200
1241D21J92o59P07j30Q2R5q58J461p55mM12j395Q57j48p12J830j238l3k62L56
1261B19J422j122m53k52P49j14P39p10k80O49N36q35l11j77M18r29K87L08j64
1280b0P29O17j660J391j058l40k96P72m54J44O9q97R29M99n85m68J163j418O54
1299b29l78K73oP92j342m58o40J172O39K11p8n55K97m21K18K70r9M3j239K089
1319E59j147o23J199l14p24K50k15R95k29j116J458P4m20j078M69l34J698k67
1337B35r88p96L6R43q00J662r51j197K068j269J83J23O64n91M44p66J355k32l78
$$ y = [968, 59, 65, 762, -264, 46, 1092, 263, 712, 529, 562, 1783, 466, -429, 375, 1098, 207, 549, 1215, 301, 708, -112, -289, 840, 439, -167, 1866, -299, 816, 494, 590, 494, 126, -381, 1556, -233, 560, 1621, 421, 613, -46, 661, 531, 613, 708, -150, 1311, 556, 552, 964, -431, 426, 278, -434, 1396, 158, 125, -137, 219, 1641, 519, 66, -186, 563, 449, 1188, 478, 198, 847, 1383, 548, 237, 60, 478, -451, -164, 144, -20, 709, 1326, -334, 1057, -1, -341, -637, 135, -319, -175, -106, -1003, -74, 425, -160, -628, 535, -883, -229, -607, -334, -340, 452, -890, -1348, -1988, -816, -177, 34, -44, -599, -302, -723, -505, -235, -334, -291, -1530, 559, -588, -1211, -12, -326, -1050, -800, -1015, -20, -249, -1365, 93, 167, -253, -1331, -862, -1196, 502, 235, -753, -1549, -1513, -570, -1370, 292, -659, -1856, 212, -1057, -874, -751, -87, -678, -234, -1000, 355, 123, -255]
1356b55o93Q03q80k44J303j039L21k11R43j035k99O61l25J028j99n6R92j284j96
1375f65M00m20kL13N00R02j046K83Pn14n3J2N91p33O04N54j95J58k50n67Q26K38
1397I43q31P66m58O57r44Q96m95m31k57N70J43J07J33K14m69L27k33K48J64p69
1417B81L57P42p80m50J08M16J22P88r0j423J333q07M01j31o75Q14P00o98M81l31
1437A158l16o63M49N3n18J069r85J031q50Q02q08L24rJ28j30m89r2M38j66j03
1457C23m17M29l49k37J205j266Q46m24M99l77r93L18j192J304O03o84N28j30m84
1476d98L11l71j31j58J060l26K41m53J79o18R33p56K6P10r20O12r27M48n31rL21
1497h57O1L44r07N94O04n74o94N59k16O17l08k5K03k87O86o0p62L96L52O25o90
$$ y = [-255, -948, -145, -1025, -1269, 34, -1005, -684, -895, 48, -987, -1286, -625, -950, 78, -121, -177, 815, -469, -665, -265, -685, -687, -374, 126, 1028, -18, 265, 272, -242, -295, -283, 308, -425, 179, 733, 538, 696, 446, -121, 705, 943, 112, 878, 420, 1077, 133, 1029, 534, 103, -154, 416, 559, 666, 799, 1013, 544, 871, 638, 886, 1050, 281, 638, 1380, 600, 150, 258, 674, 796, 1584, 1494, 71, 1404, 597, 998, 867, 192, 1006, 1706, 1008, 1489, 1158, 842, 179, 628, 681, 163, 1232, 247, 1278, 428, 1230, 422, 746, 737, 865, 735, 246, 154, 592, 426, 323, -94, 335, -14, -251, 954, -312, 534, 110, 609, 232, -761, -443, -1635, -331, 272, -412, 116, -14, -498, -187, -558, -689, -847, 213, -113, 128, -325, -146, -764, 169, -587, -561, 149, -771, -159, -1086, -638, -1169, -1178, -857, -796, -452, -1359, -765, -161, -735, -1429, -870, -1086, -469, -777, -802, -599, -886, -200, -260, -1022, -626, -274, 351, -339]
1518c39J10k06m76R73ll66L07r6l40M28j46r2k10N2j6J39K04l28l77R08Jm61r2
1541d26N15R9J68o38j08Q15R2q96P37l69K30J17R1Q3j55M6p19K87J143j029J63
1562B46k8j27L99o5o04L49K15J70J96J09Jn52K91k69J45k95K11k97K79J51L44
1583H69k03K55n70j05p8N12J90l41n0j64m25Q86K2k71N04l51O9q33Q72n34J25
1604C79m89O84K08j00m51j5L34l24j00J23P1J6q1j55m0J73n6o0K31K55n09L70
1626D64p36N42r6q52J134k23J64k83K54n9L45l5m0p19k31M02j05O79r53r39J209
1647g8o52R52j224J239m31K56O24r62l23L12r1R12q60l4o8k5N33k97K07r74J744
1668G60j426n0J87l16N25o47L13j78K08Q97j149j36J415q07J07l1j340J415O6
$$ y = [-339, -229, -435, -911, 62, 59, -307, 0, -96, -436, -8, -154, -246, -456, -404, -420, -281, -77, -405, -782, 126, 127, -334, -426, 89, 188, 356, -282, -390, 425, 517, -379, 358, -11, 219, 336, 427, 510, 355, 401, -318, -31, 1112, 83, 246, 218, 91, 490, 425, -179, 170, 385, 555, 751, 860, 861, 309, 600, 331, 476, 181, 392, 95, 374, 525, 869, 666, 921, 351, 246, 168, 680, 870, 529, 479, 315, -110, 776, 798, 527, 1031, 680, 749, -84, 788, 254, 379, -110, 574, 782, 682, 231, 216, 550, 226, 126, 249, 320, 336, 255, 100, 60, 233, 177, 117, 348, 603, 94, 464, -272, 270, 174, -678, 456, 233, 397, 114, 368, 309, 654, 619, 579, -140, -371, 31, -74, 605, -348, -1287, -78, -730, 222, -1002, 237, -194, 62, 686, -276, -599, -287, -378, 534, -326, -360, -428, -453, 80, -217, -10, -984, 760, -666, -716, -529, -845, -320, -967, -654, -832, -624, 273, -876, -1012, 403, -404, -297, -328, -1668, -253, -187]
1687a87r61J508n73l62Q78j079N66J49m42nj52M05m19L98K65p30p31R74j50K27
1707d21j51l72J40Q47M22j537J99J081j28n88j089J418N10j597N98M21m4K08M26
1726C43l59k29j08J045r0p94P68j228P31j232J656k47n50Q79q17L02k28K30j80
1745a08j239J543q47J744l56K58m74Q17j004l98N61j84Q82r18o8K39j116O06J42
1764H0NM23l8Q26o70m51j61J275k021J719K72n58M94r08O45k51k60R02j378Q90
1784H35l3o30N02R1K49o38n75K62k16M80K07L84j021Q58l0p27j09l8K80Q71k20
1805G82m87j381J982n45j58j53n61K72K39J52q27Q10PO6k73m3J52J207j130L53
1825D64j359J297k22r30k7J67l04L19q60J492o98k47m39q6K035n83l73M97P74
$$ y = [-187, -1148, 360, -213, -575, 303, -776, -210, -61, -503, -508, -660, -255, -674, -276, -11, -741, -1472, -498, -648, -421, -572, -944, -804, 43, 465, -1072, -873, 208, 80, -508, -1597, -179, 331, -1266, -668, -247, -291, -83, 343, -16, -245, -353, 692, 602, -192, 576, -652, 79, -1153, 503, 256, -294, 585, -232, 70, -158, 72, -108, -1347, 196, -651, 1093, 737, 995, 521, 1338, 334, -64, 497, 313, 1195, 277, 209, 448, -668, -62, 80, 85, 508, 470, 1296, 626, 175, 14, 1289, -732, 987, 1259, 701, 1195, 287, 932, 681, 421, 1323, -55, 835, 802, 172, 674, 765, 1014, 376, -199, 63, -153, 327, 534, 918, -103, 755, 725, -2, -111, -149, 131, 1002, 782, 295, -1086, 896, 351, 193, 40, -521, -249, -10, 142, -685, 125, 132, 198, -75, -118, 34, 1241, 111, 464, -895, 402, 180, -750, -777, -610, -914, -595, -1455, 37, -661, -908, -1347, -1433, 602, 19, -354, 143, 917]
1844I17k575J139M77j136J357j142L54K21O15J4p97K14Q0N4m22j61J49J410r38
1863a70m52L52q3L61m04Q6m78R11p83L21J09o85R86J82J116j288p73k94K185o52
1883E47j213R18j145Q38r94J200M28j306J416j206J130r88R21j435L88O54j367
1900a214Q61R44p82J03L38m14L30r51M21L41Q76p10p11J14l95N89J11N73j230
1919h06J301R35j167M98N51j825M23k88J64m25O23J080j8J66j233l8J046j193
1937b06k54J094K84k4n64J85M3M46k0k47q52J14o15J46J295Q0L8R98j548l15M38
1958E16p05K8J167q71r8N93l9o35O41k16r00J516q68j99P04o05l85j092K673n03
1978G22j198R53q14j335J798j068J260r9j63q50Q77K45j052J799r10j55o57J429
$$ y = [917, -1658, -519, -42, -1178, 179, -963, -609, -388, 227, 241, -556, -342, -262, -208, -630, -791, -642, 768, -170, -622, -270, -353, 8, -396, -310, -788, 123, -660, -339, -230, -915, 71, 253, 1369, 81, -692, -986, 1199, 547, -666, 252, -893, -55, -1049, 151, 579, -727, 689, -517, 613, -375, 546, -889, -501, 153, -1214, -353, 591, -191, -88, 250, -164, 166, -785, -364, -23, 853, 143, -568, -454, -849, -260, -149, 424, -806, 495, 1430, 263, 761, 1312, -513, -90, -378, -214, -639, -16, 1064, 1046, 1212, -21, -59, 987, -206, -460, 634, 918, 894, 330, 515, 558, 1004, 984, 737, -115, -1, -616, -470, 825, 905, 943, 1941, 393, 78, 516, -189, -161, 1006, 135, 37, 630, 591, -44, 597, 381, -519, 997, 129, -70, 634, 29, -356, -1448, 1225, 722, -476, 477, -337, -1672, 126, -942, 318, 219, 56, -794, 83, 328, -724, 1075, 165, 10, -647, 782]
1996G82m1l15l53K22j328J672m21o89Q40j40o6m09J013n66j71o74J097l94o11
2015e52N10n13N05K82j348O17o76Q23P32k69j07l24M94q32J136r73P46l86m53
2034e88M63k15J05Q42j688J437r48k90L28M45j36o14J582j512J849j242o16M76
2052c22o40O26Q68j259J154k69m96K80l46Q02N82j476p1L62J44P45o41j33j51
2071b41j24r68J216L39j37n51O4L83J2j001Q65o50N79J185j365p64Q52N50J5k49
2091A0M48nj064J129L3m20J060o15m4L9m86l20k55L57J318j567K59O3j778J475
2111c63M38k87j432K939j682L63N07o6q27P39N08j709J983j557P21j22Mj354J706
2130E09L55j240O42M7J94m63J38L80K99j060Q79k37Q2K57q36K95l16O6k51m06
$$ y = [782, 741, 426, 73, 295, -1033, 639, 218, -471, 369, 229, 163, -246, 767, 201, 30, -644, 453, 59, -552, -42, -555, -50, 232, -1116, -499, -1175, -352, 380, 111, 4, -320, 174, -658, 478, -495, 251, -135, -588, -125, -340, -235, 607, -1081, 356, -592, -882, -554, -109, -245, -859, 723, -789, 1060, -182, -798, -322, -962, -336, 532, -727, 427, 158, -338, -58, -404, 398, 980, -496, -567, -205, -61, 684, 43, -90, -241, -365, -1333, -117, 222, 85, -466, -402, -19, -7, -1008, -143, -793, -214, 971, -394, -1158, -306, 244, 259, 10, 458, 453, -611, 518, 551, 131, 1191, 576, 532, 571, 85, -235, -490, -133, 1185, -382, -123, -60, -1838, -363, 75, -212, -1644, 1295, -387, -24, 483, 417, -410, 329, 837, -872, 1111, -446, 275, 153, 157, -1197, 509, 864, -376, 266, 313, 507, 44, 182, 562, 861, -199, 680, 443, 525, 782, -54, 241, -75, -9, -260, -666]
2150f66N49M28m8P35j167N6k497K984j402L18L60J282m9r66J348j487n75P79J114
2169A096j101j101J601N03j152Q10l17j78M95j080l46J042n30M28k48o89m42Q9
2187a120J031K85j605Q66k82O5J85j23Q72m32l48L24K40k95r8J180k527J239j90
2206g33k67J118m18l77K14j267K567m36j050J518p04O93j178J410j322m64M83
2223b13Q27j275J053R41j489l29j27L68L6p21M80M07J49k57P21j87o43K65o12
2242f06m55N49P24o06j57J296J83r0p6k13L86n88j09J79M98p89l9j12K05n06k42
2263e68L36n2Q77o12P68p51J19J187j286L62k49m10M19L34M59o84M09r34k52J229
2283G01k19O8l79K74n86o75J097p12k10R68Q5j19l13N92p10K51j64j53J4l68L1
$$ y = [-666, -117, 311, 263, 998, -169, -113, -2610, 374, -1028, -710, -350, 932, 883, -83, 1265, -222, -797, -18, 1096, -5, -1106, 495, 998, -154, 656, 339, 161, 656, -424, -770, 272, -258, 170, -78, -767, -1209, -1120, -89, 196, -1409, -543, -825, -760, -575, -698, 174, -258, -606, -282, -42, -337, -435, 745, -1782, -543, -733, -1000, 118, -300, -677, -463, -1730, 837, 401, -649, 869, 165, 858, -320, 1090, -232, -696, -213, 614, -661, 392, 1333, -156, -485, -612, -244, -208, -929, -449, -42, 107, -150, 571, 384, -259, 6, -606, -1061, -512, 212, -394, -551, 745, 928, 838, 762, 549, 935, 347, 238, 417, 915, 126, 87, -25, 180, -326, -568, -232, -284, 593, -19, 749, -2, 117, 1304, 18, 380, 131, -279, 140, 474, 933, 249, 658, -276, -528, 701, 482, 550, 171, 445, -141, -816, 281, -431, -641, 327, 412, 293, -20, 572, -138, 113, -51, -204, -190, -558, -527]
2304e27n58R40J49J64r58L68K99J35J87P0j87k62N81k08L07K30m75l84m55Q43
2324B59m7n94N78p77Q51j75k16l24P48k2q91O29J06m32N57k34k80N48q14P71j54
2345H7j18K12J32M55j387J364m26k93q55l48J724r26M42R08j250Q48p09K31l24
2364b33Q43o76J46O2K42R1l76M5J9J65N89j836P30J25l53N27k34k19m83J038L2
2385B44j104R34k05K67j62q12K92O11k5j35m70r16J477P8j216J198k77P46l68
2404A57j088J639k64K39p41P89o78j43k73R02l02j078J331n63n97Q84p46R68q37
2423d01l73J441j112M64K06j14M00m84n99N73J43k77M6M32k3l30K51j27n55J469
2443A030n56l56l66q2m3L75n0M18j05j58P06k68n4m74p82J83N55N60m15m66L8
$$ y = [-527, -1085, -145, 4, 168, -790, -422, -123, 12, 199, 269, 82, -180, 401, 193, 500, 730, 255, -129, -584, 259, 212, -382, 196, -581, 270, 95, -121, -445, 303, 281, -610, 19, 125, -307, 250, 16, -264, 284, -530, 241, 87, -31, 181, 313, 768, -619, 745, 319, 26, -829, -1177, 547, -379, 63, 971, -279, 569, -140, 91, -233, 610, -66, 80, 142, 384, 475, 99, 144, 163, 328, 917, -919, -189, -64, -417, 110, -124, -343, -826, 212, 244, -860, 74, -131, 136, -26, -838, -546, 65, 40, -95, -565, -1481, -4, 74, -1142, 56, -221, 525, 157, -931, 708, 444, 683, -58, 731, 53, -90, -363, 539, 237, -841, 490, -73, -670, 214, -532, 436, -401, -774, 667, -445, 19, 225, 111, 511, 27, -572, 1, 144, -133, -87, 345, 322, -8, 243, 116, -439, 1030, 474, 118, -248, -330, -373, 2, -48, 370, 265, 107, 813, 545, 491, 17, -765, -582, -27, 533, 118, -348, -310]
2464c10R64j795K23J405P95q21j85o06L29J289j003R08p41n33N50j32p60N86j47
2483A6R28l48m57L73l40M06j035P99N6j445R66P3R70n40j057R01K81j589J533
2502D91k65p52J68O00l75L03k12q9M25P36j223l95P98q60J260p17L60K08m14j11
2522f4L26K40j423J173k81l92J238j694J305k23j26r54j6L49J932p90p89M33n23
2541b79M17k20K24L47q79J002p51O81L66j393J037n75n01K57K52M37j66n43Mj44
2561d27K64p9L70K23j04K63p55K23N42j102M77M60l97M48o57O35m17p06M45N05
2581B11j311R34L5k81K33q8J87j86K20K72j9O57o66j78P71j183j25K25Q75n68
2601A5O5m96R60L4k95l33m8L1P20l56j98n20P64j224P80J09q6m70K85M17p6N72
$$ y = [-310, 654, -1141, -918, 487, 1282, 461, 276, -330, -1, 1288, 285, 1193, 452, -81, 469, 337, -423, 163, 16, 944, 596, 139, 512, 172, 578, -457, 342, 398, -1047, -81, -8, 962, 422, -635, 266, 547, -1042, 491, 226, -526, -358, 242, -133, 170, -42, -131, 294, 1030, -193, -588, 210, -650, 610, -107, 253, 461, 47, -64, 262, 502, -921, 252, -29, -421, 817, -877, 428, 205, 79, -875, -891, -542, 1390, 600, -189, 244, -279, 138, -82, 142, 489, -390, 612, -139, 542, 908, -485, 552, -23, -524, -267, -15, 422, 256, -287, -283, -427, -163, -242, 128, 351, 247, 510, -245, -22, 520, -582, -105, 355, -42, 406, -251, 384, -33, -739, -294, 211, -1100, -166, -131, -412, -179, -267, -80, -266, -46, 226, 207, 864, 198, 20, 791, -392, -517, -292, 583, 15, 80, -416, 544, 578, 283, -50, -98, -67, 653, 297, 99, -421, 343, -881, -101, 8, -78, -548, -263, 154, 78, 650]
2623F50R1j088j30N23N6K07r11Q96k15l07J40L23L88n99M33O0n01j50j28O09N70
2644I17m07n47J6M45o69K71O7m3k09J98q18J319Q1j022N06l35M74L73l7j578J323
2665C25m67M59K82o73q74N65N57j69J06J1p52O32P0L7K82r57L41L18J50n03M5
2686b15O74j58k44n15K84M02k57L41l18K6m0J58j70K44l24K49M71o66L54o26J42
$$ y = [650, 741, -347, -477, 46, 102, 309, -602, 294, 79, -228, -88, 235, 623, 24, 457, 517, 16, -134, -262, 347, 917, 510, -37, -21, 424, -245, 26, 93, 50, -159, 39, -779, 540, 621, -401, 105, -230, 244, 617, 580, -998, 325, -142, 317, 599, -74, -948, -383, 174, 5, 111, 122, -630, 2, 72, 109, 391, -566, -225, 93, 243, -260, -215, 459, 301, 57, -458, -174, 228, -29, 312, -6, 20, -20, 138, -32, 212, -112, 137, 608, -58, 296, -330, -188]
$$ [...]
8191h2
##END NTUPLES=NMR FID
##END=
