##TITLE=1H_DE-139k_TFA
 200.13Hz, CCl4.
 8 sc
 
 6.4.2026
##JCAMPDX= 6.0         $$ Bruker NMR JCAMP-DX V2.0
##DATA TYPE= NMR FID
##DATA CLASS= NTUPLES
##ORIGIN= UXNMR, Bruker Analytische Messtechnik GmbH
##OWNER= pz
$$ XWIN-NMR		Version 3.5
$$ Mon Apr  6 15:56:53 2026 Russian Standard Time (UT+4h)  she@DPX200
##.OBSERVE FREQUENCY= 200.1313
##.OBSERVE NUCLEUS= ^1H
##.DELAY= (6, 6)
##.ACQUISITION MODE= SIMULTANEOUS
##.ACQUISITION SCHEME= undefined
##.AVERAGES= 8
##.DIGITISER RES= 18
##SPECTROMETER/DATA SYSTEM= spect
##.PULSE SEQUENCE= zg30
##.SOLVENT NAME= CDCl3
##.SHIFT REFERENCE= (INTERNAL, CDCl3, 0, 14.3821)
##AUDIT TRAIL= $$ (NUMBER, WHEN, WHO, WHERE, WHAT)
$$ ##TITLE= Audit trail, XWIN-NMR		Version 3.5
$$ ##JCAMPDX= 5.01
$$ ##ORIGIN= Bruker BioSpin GmbH
$$ ##OWNER= she
$$ F:/spectra/data/she/nmr/H-C/1/audita.txt
$$ ##AUDIT TRAIL=  $$ (NUMBER, WHEN, WHO, WHERE, WHAT)
(   1,<2026-04-06 15:54:40.03 +0400>,<she>,<DPX200>,
      <created by zg, POWCHK disabled, PULCHK disabled
       configuration hash MD5:
       00 E9 B6 7A A2 85 ED C7 34 08 36 98 17 FE 4E 26
       data hash MD5: 16K
       32 D2 E4 48 AE 8B C6 C3 31 2C 3C AF A7 58 63 95>)
$$ ##END=
$$ 
$$ hash MD5
$$ 28 81 5C 7B D8 BA D6 F3 D1 1C FB C7 C0 84 6B 05
##$RELAX= 
##$RELAX= 
##$RELAX= 
##$RELAX= 
##$RELAX= 
##$RELAX= 
$$ Bruker specific parameters
$$ --------------------------
##$DU= <F:/spectra>
##$EXPNO= 1
##$NAME= <H-C>
##$PROCNO= 1
##$TYPE= <nmr>
##$USER= <she>
##$AMP= (0..31)
100 100 100 100 100 100 100 100 100 100 100 100 100 100 100 100 100 100 
100 100 100 100 100 100 100 100 100 100 100 100 100 100 
##$AQSEQ= 0
##$AQ_mod= 1
##$AUNM= <au_zg>
##$AUTOPOS= <>
##$BF1= 200.13
##$BF2= 200.13
##$BF3= 200.13
##$BF4= 200.13
##$BF5= 200.13
##$BF6= 200.13
##$BF7= 200.13
##$BF8= 200.13
##$BYTORDA= 1
##$CFDGTYP= 0
##$CFRGTYP= 5
##$CHEMSTR= <none>
##$CNST= (0..31)
1 1 145 1 1 1 1 1 1 1 1 1 1 1 1 1 1 1 1 1 1 1 1 1 1 1 1 1 1 1 1 1 
##$CPDPRG= <>
##$CPDPRG1= <>
##$CPDPRG2= <>
##$CPDPRG3= <>
##$CPDPRG4= <mlev>
##$CPDPRG5= <mlev>
##$CPDPRG6= <mlev>
##$CPDPRG7= <mlev>
##$CPDPRG8= <mlev>
##$CPDPRGB= <>
##$CPDPRGT= <>
##$D= (0..31)
0 0.7 0 0 0 0 0 0 0 0 0 0.03 0 0 0 0 0 0 0 0 0 0 0 0 0 0 0 0 0 0 0 0 
##$DATE= 1775476479
##$DBL= (0..7)
120 120 120 120 120 120 120 120 
##$DBP= (0..7)
150 150 150 150 150 150 150 150 
##$DBP07= 0
##$DBPNAM0= <>
##$DBPNAM1= <>
##$DBPNAM2= <>
##$DBPNAM3= <>
##$DBPNAM4= <>
##$DBPNAM5= <>
##$DBPNAM6= <>
##$DBPNAM7= <>
##$DBPOAL= (0..7)
0.5 0.5 0.5 0.5 0.5 0.5 0.5 0.5 
##$DBPOFFS= (0..7)
0 0 0 0 0 0 0 0 
##$DE= 6
##$DECBNUC= <off>
##$DECIM= 32
##$DECNUC= <off>
##$DECSTAT= 4
##$DIGMOD= 1
##$DIGTYP= 9
##$DL= (0..7)
0 120 120 120 120 120 120 120 
##$DP= (0..7)
150 150 150 150 150 150 150 150 
##$DP07= 0
##$DPNAME0= <>
##$DPNAME1= <>
##$DPNAME2= <>
##$DPNAME3= <>
##$DPNAME4= <>
##$DPNAME5= <>
##$DPNAME6= <>
##$DPNAME7= <>
##$DPOAL= (0..7)
0.5 0.5 0.5 0.5 0.5 0.5 0.5 0.5 
##$DPOFFS= (0..7)
0 0 0 0 0 0 0 0 
##$DQDMODE= 0
##$DR= 18
##$DS= 0
##$DSLIST= <SSSSSSSSSSSSSSS>
$$ [...]
##$SUBNAM0= <"">
##$SUBNAM1= <"">
##$SUBNAM2= <"">
##$SUBNAM3= <"">
##$SUBNAM4= <"">
##$SUBNAM5= <"">
##$SUBNAM6= <"">
##$SUBNAM7= <"">
##$SUBNAM8= <"">
##$SUBNAM9= <"">
##$SW= 18.0517328524113
##$SWIBOX= (0..15)
0 0 2 0 0 0 0 0 0 0 0 0 0 0 0 0 
##$SW_h= 3612.71676300578
##$TD= 16384
##$TD0= 1
##$TE= 0
##$TE2= 300
##$TE3= 300
##$TEG= 300
##$TL= (0..7)
0 120 120 120 120 120 120 120 
##$TP= (0..7)
150 150 150 150 150 150 150 150 
##$TP07= 0
##$TPNAME0= <>
##$TPNAME1= <>
##$TPNAME2= <>
##$TPNAME3= <>
##$TPNAME4= <>
##$TPNAME5= <>
##$TPNAME6= <>
##$TPNAME7= <>
##$TPOAL= (0..7)
0.5 0.5 0.5 0.5 0.5 0.5 0.5 0.5 
##$TPOFFS= (0..7)
0 0 0 0 0 0 0 0 
##$TUNHIN= 0
##$TUNHOUT= 0
##$TUNXOUT= 0
##$USERA1= <user>
##$USERA2= <user>
##$USERA3= <user>
##$USERA4= <user>
##$USERA5= <user>
##$V9= 5
##$VALIST= <valist>
##$VCLIST= <CCCCCCCCCCCCCCC>
##$VD= 0
##$VDLIST= <DDDDDDDDDDDDDDD>
##$VPLIST= <PPPPPPPPPPPPPPP>
##$VTLIST= <TTTTTTTTTTTTTTT>
##$WBST= 1024
##$WBSW= 4
##$XGAIN= (0..3)
0 0 0 0 
##$XL= 0
##$YL= 0
##$YMAX_a= 203550
##$YMIN_a= -162241
##$ZGOPTNS= <>
##$ZL1= 120
##$ZL2= 120
##$ZL3= 120
##$ZL4= 120
##$ABSF1= 10
##$ABSF2= 0
##$ABSG= 5
##$ABSL= 3
##$ALPHA= 0
##$AQORDER= 0
##$ASSFAC= 0
##$ASSFACI= 0
##$ASSFACX= 0
##$ASSWID= 0
##$AUNMP= <proc_1d>
##$AZFE= 0.1
##$AZFW= 0.1
##$BCFW= 1
##$BC_mod= 2
##$BYTORDP= 1
##$COROFFS= 0
##$CY= -3
##$DATMOD= 1
##$DC= 2
##$DFILT= <>
##$DTYPP= 0
##$F1P= 0
##$F2P= 0
##$FCOR= 0.5
##$FTSIZE= 0
##$FT_mod= 4
##$GAMMA= 1
##$GB= 0.15
##$INTBC= 1
##$INTSCL= 1
##$ISEN= 128
##$LB= 0.25
##$LEV0= 0
##$LPBIN= 0
##$MAXI= 10000
##$MC2= 0
##$MEAN= 0
##$ME_mod= 0
##$MI= 1.114404
##$NCOEF= 0
##$NC_proc= 0
##$NLEV= 6
##$NOISF1= 3.799351
##$NOISF2= 2.8
##$NSP= 1
##$NTH_PI= 0
##$NZP= 0
##$OFFSET= 14.38212
##$PC= 1
##$PHC0= -3702.699
##$PHC1= 13.7923
##$PH_mod= 1
##$PKNL= yes
##$PPARMOD= 0
##$PSCAL= 0
##$PSIGN= 0
##$REVERSE= no
##$SF= 200.129724274929
##$SI= 16384
##$SIGF1= 3
##$SIGF2= 2
##$SINO= 400
##$SIOLD= 16384
##$SREGLST= <1H.CDCl3>
##$SSB= 0
##$STSI= 0
##$STSR= 0
##$SW_p= 3205.1282051282
##$SYMM= 0
##$S_DEV= 0
##$TDeff= 0
##$TDoff= 0
##$TI= <>
##$TILT= no
##$TM1= 0
##$TM2= 0
##$TOPLEV= 0
##$USERP1= <user>
##$USERP2= <user>
##$USERP3= <user>
##$USERP4= <user>
##$USERP5= <user>
##$WDW= 1
##$XDIM= 8192
##$YMAX_p= 0
##$YMIN_p= 0
$$ End of Bruker specific parameters
$$ ---------------------------------
##NTUPLES= NMR FID
##VAR_NAME=  TIME,          FID/REAL,        FID/IMAG
##SYMBOL=    X,             R,               I
##VAR_TYPE=  INDEPENDENT,   DEPENDENT,       DEPENDENT
##VAR_FORM=  AFFN,          ASDF,            ASDF
##VAR_DIM=   8192,          8192,            8192
##UNITS=     SECONDS,       ARBITRARY UNITS, ARBITRARY UNITS
##FACTOR=    0.0002768,     1,               1
##FIRST=     0,             0,               0
##LAST=      2.2672688,     0,               0
##MIN=       0,             -162241,         0
##MAX=       2.2672688,     203550,          0
$$ Real data points
##PAGE= N=1
##DATA TABLE= (X++(R..R)), XYDATA
$$ [...]
1954A14L13J89K70n06m09l22j79n49N39L91M05j67P76l6l82p04L51q67o2J93K19
1975d23N5O59J95M56n07K50m75k83r47N32j25L98M88L70j42J14J6n13l44m51K27
1996d50l65J49N33O21k2L81o0o12n80M04p97J20q0Q10K3L79J34L54o61k22m24
2017c65j74l23N46k76O52J63O94o71K46k52n4o08k42K67j70M89M93K03m21L86
2037E83j18k78o15Q9j87j00L43Q57j98J25K55j12o95M2o08K14j96N95K2O5L60
2058D43M64n65j07j47k47m83L08j91M82j52Q82j3l85l1k69m56j08J21K19j9L25
2079G1K99J42j53J50l16p15M3K1j25J06N91M09K16j54J12o16j61m87J70l55M43
2100c09J35M34l29N13Q9m24j37l50l23J47N3Q38j60J73K70k5j97j14m36k27l42
$$ y = [114, 427, 616, 886, 380, -29, -351, -530, -1079, -540, -149, 256, 89, 865, 829, 447, -257, 94, -773, -835, -642, -423, -368, 291, 486, 942, 435, 685, 210, -73, -1020, -488, -613, -215, 273, 643, 501, 615, 631, 118, -226, -677, -450, -815, -666, -133, 488, 466, 847, 787, 175, -405, -1, -798, -678, -758, 52, 75, 454, 588, 942, 281, 59, -365, -539, -862, -316, -592, 60, 223, 917, 246, 492, 240, 186, -422, -664, -397, -567, -78, 415, 618, 197, 583, 465, 187, -428, -339, -526, -626, -283, 574, 376, 501, 756, 644, -51, -9, -617, -403, -599, -4, 18, 83, 443, 907, 342, 235, 88, -159, -642, -334, -525, -43, -195, 687, 674, 289, 258, -11, -467, -575, -454, -235, -254, 71, 370, 512, 359, 509, 193, -522, -479, -458, -583, -477, 114, 523, 739, 585, 697, 81, -80, -567, -397, -752, -309, -174, 260, -69, 444, 533, 109, -28, -378, -701, -554, -501, 337, 177, 350, 620, 595, 398, 284, -152, -379, -721]
2121g21L03j05Q33m4N06j39o8j90n87l07n7K86M9J84M40K15J3m6n03K82r68L78
2143b46n43L74j30Q23j55L53O8R2q61j6j85m2j73J61L02M43L30P4m8j83m57j11
2165a30n91J2L29K85M9O48j79J40k48k21l46k44j60L9M09J1O85NJ25j3l83r29
2187g07L49j35LJ33K39M31p9M78j36n71L0l51n6n56M12K00M92j52Q45l25l15l50
2209a21K78n86k70K87M6K92J17P16l75J16k36l43k22J89l75q5L65M08J39J07j46
2230C01M7m42k60l02K64k99N99L61K82k78N62o85L4k4k98o25K93N5N18j18O07
2251E92j25K9n05K75p22j6j46L84j84L98K62L29k70j0Rn04k99J27j30p6P07L72
2273D97L25m86J82j9m43l96L4l25M44J16O30l62L04M1p9p04R1n16L7O7O34l31
$$ y = [-721, -418, -523, 310, 266, 772, 633, 565, 375, -212, -519, -576, -290, -241, -57, 383, 598, 611, 565, 62, 344, -624, -246, -789, -415, -545, 278, 123, 476, 544, 636, -225, -241, -426, -468, -641, -480, -178, 265, 595, 669, 621, 438, -19, -130, -721, -709, -380, -95, -46, 602, 423, 563, 315, 94, -252, -496, -656, -617, -208, -197, 488, 493, 618, 605, 222, -707, -358, -493, -490, -357, -118, 313, 234, 712, 576, 5, 35, -316, -372, -928, -516, -316, 176, 24, 869, 544, 229, -121, 157, -429, -699, -412, -366, -74, 43, 759, 384, 500, 264, -79, -301, -112, -487, -572, -207, 201, 340, 447, 301, 348, -94, -354, -656, -392, -691, -92, 269, 551, 273, 835, 150, 184, 160, -138, -763, -470, -415, 103, -15, 592, 467, 496, -9, 266, -456, -472, -618, -234, -418, -20, 242, 571, 301, 291, 300, -204, -503, -376, -506, -582, 125, 497, 822, 336, 518, 499, 56, -340, -306, -631, -187, -71, 559, 197, 501, 542, 463, -241, -150, -666, -629, -562, 72, -259]
2295b59O09M5K11k33j52l11l78k21L18k1L28L42O36n48k4k76J97p36P8l06M69
2316b32J34L54K39o9J29q5m42m69J37m42M71j68P31l42O45k56P5m01K78n65K34
2337d4n88M59J68P6K05K49l23K1o67K30o34N81k8PK64N84p0l9m42J70l17m66L45
2360b59J07k20L30P36j04K64p65J80o56n2r7J11J19O8N76R8j78K44m10kp56L44
2382c22m18L97K68N79l08M88n81J42j25j70k46k11K31K06j64L78K91N9m7j91l60
2403a04j31l36J91j39K77N55j9K05l8j41k63l83r0J84k53O15K1K82k53M76nk87
2425C64p71o9R1j35L05L38m4N93l65J19m18L9p8k39k66M15q2K24RN76l9m92Nk74
2449a94j10k73K64j49J80N22K77m26K28m8k34o71K07m5M47P1L28l81M41O0Ko90
$$ y = [-259, 350, 395, 606, 373, 221, -90, -468, -689, -371, -392, -64, 278, 914, 366, 342, 66, 263, -473, -395, -701, -232, -98, 256, 495, 426, 555, 470, 28, -441, -304, -746, -275, -443, 288, -54, 591, 335, 410, 9, 287, -278, -44, -632, -173, -5, 71, 276, 525, 202, 223, -444, -214, -848, -267, -295, -288, -24, 560, 490, 451, 9, 179, -138, -604, -259, -152, -372, -42, 694, 590, 854, 89, 269, -387, -439, -536, -425, -306, -238, 338, 436, 258, 502, 92, 90, -666, -322, -740, -343, -75, 504, 196, 684, 103, 245, 120, -50, -296, -507, -276, -70, -234, 144, 435, 494, 447, 256, -104, -235, -571, -380, -519, -242, 313, 294, 499, 461, 320, 57, -326, -416, -232, -485, 130, 151, 433, 180, 656, 651, 364, -407, -476, -385, -520, -215, 123, 79, 672, 307, 426, 8, 47, -31, -270, -536, -121, -203, 21, 30, 606, 567, 75, 80, -194, -304, -577, -313, -462, -282, 240, 517, 91, 319, 271, 37, -634, -427, -472, -25, 46, 374, -7, 434, 494, 496, -194]
2471a94K03l75Pj8N36m14N20n7N52m71l04j61j99j13Q2O89O4j34K75k26m9J65
2493C78l44k03j50P8p3L27j11M19r1k1k47L13n22j81O9M35l11M85n6R4pM3m27
2516a03r7k21J60l26K46L30J56J64J22k58K76m58n8n87j6L12M80r6J67L01p8r8
2538C18j93j47o69M76k11L77j88M81P7K50l86P4l69j26P1k56P6K47K03M45m50
2559A00N93m70k21k99j5l69K15L15L49m7K93j31N5p66L34m15%K6J33J59K09M54
2581E02k37L0j01j01p88J84K21P4j72J22N80K38j45j07q4m01KJ18l90l3M02O10
2603E24l60K21j18o3l00j53k13J45j28O16m2J02J04J07m03j75O0J08k78j78L85
2624c9k7L28J95j20j36l58K27l74M6j36J59N9j7N98OK94m60n98J60j67j54K34
$$ y = [-194, 9, -366, -359, -377, 159, -255, 265, 208, 760, 289, -15, -176, -375, -488, -406, 283, 347, 213, 488, 262, 213, 378, 34, -169, -319, -241, -314, 13, -98, 321, 230, 209, -38, 275, -247, -428, -359, 76, -235, 250, 194, 288, 281, 324, -103, -200, -421, -261, -587, -341, -11, 145, 309, 431, 173, 449, -9, -67, -654, -670, -358, 122, 26, 193, 494, 416, 318, 125, -22, -691, -215, -426, -49, -237, 244, 321, 571, 185, 259, -110, -236, -165, -421, -345, -98, 105, 550, 100, 693, 223, 2, -297, -312, -681, -466, -151, 198, 151, 444, 313, 368, -398, -64, -479, -479, -453, -320, -161, 48, 502, 265, 295, 194, 93, -695, -511, -290, -216, -388, -266, 314, 552, 407, 300, 216, -185, -183, -65, -455, -488, -86, 524, 164, 385, 267, 204, -96, -249, -462, -317, -445, 171, 129, 231, 335, 442, 39, -136, -76, 32, -246, -424, -39, -66, 262, 457, 337, 201, -157, 70, -304, -258, -394, -235, -176, -193, 405, 411, 705, 245, -353, -193, -360, -514, -280]
2646b80l30R82l86L27%M3j54k50m69K37j62J91M13K38j63J12j74K3l06j55n8J30
2668a91K31P6l22M83K94m95K8M9m20Q8l35O98l39Q7K35n1K97o3j72k28k32RK24
2691d9l36M83o0N09m88K80j22om47nk59M33o5N14k07J78L5O6m59J1k14m9l52M37
2715a72J45Q5R2K75n24J30j9l74l8k15L01m6N75R8J68k16lo5k92k31J09N4N6L6
2739g1L33o2K62o89M52m23L2l22L54J90n7K65J5J34k24l2P4m91Q2J1k6J51J68
2762A26k36K27L33l09jj33l97K52j0O4K24j37M88l76M48l19m14l4L2l13K41M34
2784A90n5K06J21j94J1k84n5p2K5k27J86L98j8j65J73l2j27j34j01k09ML42nJ77
2808A55J62j01M3j51K48m59k84P2j5L56J25J14m7j52J22K02n24J28m08K01L4K12
$$ y = [-280, -610, 372, -14, 313, 313, 356, 202, -48, -517, -280, -442, -251, 162, 400, 237, 349, 175, 198, -108, -263, -321, -191, 40, 116, -206, 277, 571, 76, 104, 153, -267, -179, -514, 184, -155, -68, 167, 116, 413, 350, 178, -50, -282, -273, -49, -385, 98, 38, 547, 59, 339, 217, 211, -236, -241, -500, -67, -132, 382, 175, 353, 388, 454, -5, 6, -208, -257, -609, -172, -27, 58, 150, 425, -99, 31, 12, -362, -400, -615, -314, -360, 215, 313, 481, 265, 262, 197, -95, -326, -217, -163, -107, -71, 262, 200, 462, -227, 225, -198, -166, -488, -134, 56, -1, 264, 279, 413, 189, 157, 231, -260, -178, -167, -193, -42, 126, -110, 117, 450, 141, 140, 7, -390, -138, -148, -84, 140, 3, 491, 115, 563, 244, -170, -204, -172, -485, -244, 190, 135, 341, 462, 268, 279, -5, -60, -132, -107, -334, -148, 250, 232, 67, 240, 208, 81, -53, -154, -363, -359, -17, -22, 155, 317, 216, 259, 108, 356, -103, -387, -315, -330, 26, 151, 265, 218, 66, 188, 390, -134, -6, -414, -213, -179, 33]
2830C3K55ok90K95m65M42o64R5R1J2N5K45J30L29l76j40K16j96m46K96J28j64
2852a25oK70J11Q7K1n7k68k04j39J8K61N3K17L3J7o9Pk36J1k49%Q8K0J22J42J71
2878B96O4l86k73j58K23r6R6K0m8L74J49J9J7k42J7k66J01k30L41j24M40P8n3
2901C59P1k46k96k13Q2k80K01M38l00L05N6M9n6jk32k06J50L5M12n05L26k26K53
2924A76P2l26j50J20OO4j22R8R2L14j67n2Q8J68n53j74L88k49M77l12M9p1K52
2947A88j10k8k73J4o3l0Q6K21j61N68j36l28M9j6j25j73J83L7JP5L19j86l5K38
2971C15k35K99n87K4K81j1j32K24J66l20K77k35Jn4k94m7K2K58K63j14J25K38
2993D64j78j3j11j52j44J9K40k14K58k8J96m56K57m88J35r7J35O0J1K30p7q7K11
$$ y = [33, 288, 282, -8, 287, -178, 264, -400, -305, -214, -202, -147, 98, 228, 557, 181, 41, 257, 61, -385, -89, 39, -125, -131, 139, 250, 337, 358, 301, 33, -171, -310, -292, -31, 22, 239, 272, 289, 220, 227, -9, 2, -247, -247, -159, -139, -17, 125, 296, 360, -26, -299, -457, -234, -330, -234, -214, -262, 112, 261, 280, 297, 55, 72, -194, -93, -323, 18, -106, 334, 412, 359, 430, 184, -112, -325, -243, -523, -322, 116, -184, 121, 177, 226, 170, 169, -63, -269, -119, -84, 328, -177, 149, -77, 176, 248, -78, -228, -108, -102, -38, -160, -62, 30, 344, 177, 125, 213, 381, -172, -346, 42, -207, 270, -42, 7, -64, 188, 78, 50, -223, -209, -272, -302, -216, 5, -156, 412, 276, -52, -3, -19, -144, -317, -134, -97, -96, -21, 298, 112, 77, 315, 80, 379, -208, -184, 97, 86, -46, 178, 344, 24, 301, 66, 67, 13, -281, -328, -306, -48, 215, 101, 226, 464, 286, 273, 162, 10, -134, -115, 125, -89, 169, 141, 337, -119, 138, -350, -215, -312, -177, -117, -106, 124, 47, -40, 171]
3016A71k64M15o99L5L02j66K9J55K32j26J62K28l77l8j63N7k48O2J46n4K65J95
3038C19k56J73k60j75J83l23J18M07n4p4J53l3mj52K52p33N68j33j45M33k53p3
3060f2J54K19k42m84L21k93M71l72J86K82J32M0k28LJ7l08j31n4K50M7K14O6k38
3083a0L64l55pj01J55j39L0j10K23p1M12n40M71l51R8J4l73M4Q5J06k02M78k7
3106A94K6J30m25O2l03N61n32K53K9J98m4K31m19J77r2r3J00l77L5O4J63J05j94
3129a51J46J87j32J72o04L98o1k79K57O7j92K19J37k52Q8o7l89M22k03L41p2j
3151C1J0K68m97J89k62K43k81K38qo3l1O7M02r1l52J12j98J12k85K27K08J01j61
3174b1J41K20k74j8j47K1p1J05k16M41J10J0j96l09J28%j58l5O7J99p2K73j50
$$ y = [171, -93, 322, -377, -342, -40, -206, -177, -22, 210, 84, 246, 474, 97, 59, -104, -47, -295, -233, -87, -141, 124, 319, 63, 236, -24, -199, -16, -339, -221, 186, 132, 58, 211, 178, 174, 22, 274, -459, 109, -24, -169, 264, 11, -62, 92, 311, 69, -415, -94, -387, 84, -288, -102, 180, 312, 352, 124, 127, 144, -164, -295, -349, -99, -52, 162, 228, -10, 354, -1, -8, -109, 46, -93, -63, -173, 50, -21, 391, -149, 322, -29, 69, 83, -290, -246, -161, -55, -257, 221, 194, 220, 350, -75, -13, -316, 245, -287, -34, -5, 193, 149, 380, -39, 138, 46, -47, 53, -324, -289, -225, -62, 43, -151, -5, 182, 50, 222, -382, 16, -45, -324, -67, 0, -192, 27, 164, -88, 0, -67, -456, -34, -237, 104, 32, 31, 41, 309, -188, 1, -261, -18, -299, -61, -69, -132, -163, -96, 306, 215, -137, -25, -223, -111, -396, -169, 39, 140, -21, 120, 340, 66, 48, -99, -78, -149, -44, -260, 181, 291, 301, 105, -204, -76, -76, -234, -269, -202, -3, -75, 198, 48]
3197D8K05j68K46l31m18J24Q3k47M55J19o3j34L08M9m24J7k07L13l51L92%j9j02
3220a05j32O26n08J03m0k96J24J65p7r2O02m01r4J7L49o6k26k43J77J45J12k1
3242A19L3k09K19q9l39O6J35j94PL20O1o9j54J56l21L98j62k51P3L5K89j68K53
3265B08k43K11O3m37J68o7k32L41j28O1J48j11J18K43k46O6k19j75J99o46P41
3286F3L17j7n43N89m42Q9q7J1j38L1K0l8J37K64l56J07j35j40J72m5k59N46l05
3309a59J53J98j40j9q7p4l2K45o12M30J82N7N7J81j65p0l11L8k10K84L2l10M50
3332A18j03K97l44n4Jo7P1j09K40m51L33R3L83l08l8J82l67L18l86r7M13l57K91
3355E9l5L06ol85M82o76K33k38K47k91L92j1J08k09J25k70K90m0k13j31J89J62
$$ y = [48, 253, 85, 331, 0, -418, -294, -211, -458, -3, 116, 53, -81, 227, 276, -148, -131, -338, -25, -376, 16, 16, -3, -105, -237, 389, -119, -16, -56, -352, -228, -63, -140, -232, 370, -31, -125, -108, 241, 175, -51, -294, -117, 28, 140, 119, 152, -57, 162, 73, -266, -200, -65, -259, -252, 68, 129, 60, -94, 62, -259, 139, -23, -274, -201, -166, 123, -45, 208, -35, 176, 239, -198, -30, -97, -329, 12, -116, -55, 93, -18, 100, 343, 97, 163, -56, -231, -32, -678, 63, 380, 363, -180, 409, -33, 56, -31, -20, -158, -127, -107, -145, -8, 256, -100, 7, -128, -268, -96, -141, -400, 146, -159, -6, 192, 52, 33, -54, -128, -160, 85, -527, -97, 85, 142, 199, 380, 215, 145, -166, -128, -338, -54, -22, -332, 118, 15, 312, -32, -86, -85, -152, -81, -190, 50, -401, -68, 25, 408, 100, 62, 244, -123, 195, -191, -288, 125, -232, 59, 24, 330, 324, -61, 421, -255, -22, -260, -13, -304, 88, 77, 185, -24, 101, -169, 121, 81, -132, -263, -74, 88]
3377H8m4m6L08k00J29l67K28R5k37j81P2P5l9K37k26L26k64P7k54P8J0L0Q5K25
3401B05k19K82j75k4j29j21J78l96K67L72k39O6P2k06J55L19m31l50J12J68j87
3422b81K84k45L90o4k94j24L08o3K3P3k44lN58k54j76K51J4j88j78J73j67J78
3444b9n8J65P7N9L47m39l43K18j95R4k33J25L1K55L39j72k43R1j20o3o9oR2J18
3468D1j05ML14Ok27j3k4k51J42K6p3J37L54N2l12O0l1J74k93p2PJ76j40m6J60
3493F6M8J75l00l0p6J96k71P8j19J15J66K18L4k70K56n95K76j75L08l5or5K43
3516B07J01n42L52L7k83J76k05Q6l0K19N2k7p7j37O6k00J00j79K29o5K42k48J95
3539F9Kj26r4l6L69m19J37k64K91j76J07J05L68l79N8q3j7j47N6M08k42l28N07
$$ y = [88, 44, -2, 306, 106, 235, -132, 96, 191, -46, -227, -155, -80, -119, 118, -108, 218, -46, 31, -223, -145, -135, -105, -20, 205, -14, 268, 93, 69, -60, -181, -3, -399, -132, 240, 1, 67, 139, -67, 88, 407, -24, -374, -262, -94, -281, 3, -242, 148, 84, -210, -334, -26, -89, -66, 7, -237, -240, 318, 64, -112, 139, 153, -35, -213, -40, -207, -29, -87, 78, 155, 214, 561, 122, -221, -3, -198, -104, -337, -212, -181, 74, 413, 241, -2, 89, -31, -94, -163, -169, -77, 41, -64, -60, 254, 260, 33, 20, -4, -255, -113, -87, -160, -23, 331, 383, 71, 131, 100, 274, -19, -91, -84, 92, -48, -94, 66, 114, 289, -11, -41, -117, 79, -192, -114, -233, -118, 48, 266, 300, 30, 286, -309, -33, -208, 100, 65, 59, -36, 207, 308, -234, 118, 155, -128, 48, -157, -71, -101, 118, 170, 143, 66, -71, -5, -205, -105, -284, -55, -120, 122, -126, 69, 71, -55, -149, -185, 184, -235, -98, -362, -71, -247, -140, -35, 333, -46, 12, -71, -88, -235, -179, 229, -13, -341, 166]
3562A66M6j77R1j27m0m0j01K04k15J58j30M3N10m01j25J27K1R2k60K02L50l51
3584D3j04nJ44J1j46K3jk85K78J15N0l12K32k24J3l9M10l75J65O8j25n7J01N9
3608C9o0M00l83j53J79q3j40j47M10J60j53o5J03r5j53L8k55K99%J22J15l0j51
3631cJ67n8k17O4K30k91k4M84l56J87j25%J19Q2k23k77l5J92L3J00l47K82K73
3654B57k53J5K28n53K44J23p9l83L41Q6P1N8J55m61Q7k53J24o5J30R1o9J05L4
3677C3J21k20J71j48K7j68J54J60k32J02J2n9rM3k7j98N6L57k98k1K45k05K60
3700A56J15k30o3r4k3J64l26K46PK98l1j41j86Q4j41J06NM3K8Q1j44r9Q1R8l99
3725c65M47j93p0M03j67K39N4l31j17N69k03N4j43l52j13K77k4O2J65Pk70R8n
$$ y = [166, 212, 35, 126, -1, -41, -81, -182, 22, -193, -35, -165, -122, 388, -13, -138, -11, 10, 102, -158, 44, 394, 43, -61, -66, 78, 89, -57, -34, -35, -320, -42, 73, 123, -189, 43, -181, -168, -207, 203, -172, -7, 61, -64, -121, -20, 39, -21, 379, -4, -157, 22, -61, -201, -348, 62, 222, 69, 4, 107, 12, -141, -103, -358, -59, -59, 63, 178, 148, -3, 164, 106, -111, -47, 183, -108, -132, 352, -4, 183, 58, 58, 177, 259, 36, -241, -276, -84, -51, 49, -298, -16, 257, 4, 19, 247, -306, -62, 61, -18, -401, -60, 26, 97, 155, 310, -151, -64, -317, -193, -258, -128, -37, -106, -1, 33, 154, -66, 105, -43, -16, -184, -30, 130, -102, 0, 12, -47, -56, -13, -40, -238, -182, 175, -123, -144, 101, -104, 156, 271, 41, -22, -116, -139, 25, -301, -55, -48, 250, 219, 78, -108, -24, -165, -59, -54, -11, 17, 98, -46, -145, -64, 34, -365, 82, -111, -181, 222, 55, 294, 348, 17, -100, 469, 266, 320, 177, -175, -288, -11, -35, 27, 192, 199, -71, 27, 22]
3748B2k9M3J13l50L58k59J33Q8k76K52j1q9J02m45J78n3M66L4l46J3K85k29j39
3771a39K19O3k89n7J23pJ38l6J40l96K74J96m42L7J63l27L50j41J79J5J12j3j73
3794a1Qk19J68Q8l6O1R3m07L27k48L0M5l8k0p1L53r7K45q1k56J76k87M4j01K70
3819C6p9J31J5j3j92J91k40P0N97o78ok3M4K01q2K35o2L2j16l12j9J55%m1j09
3844b65L30j30J80m09K94j1J55j18l15L82l3M8j96L53Oj31j22j07R8k15L41m44
3866c09L89l0J03j68J71q7P8j02J91l82J95M1o3j5O2j22j15M48o40K63K5k20M3
3889b44K14j67J80J04M4k8m5k15j09K85K31k78J4K82k69M8l1K50j0j66L3m13K76
3912a4k18m7R8L80m24M48kk27j78j7N5nL37k9O7q0L9L9m4l25N2K72l05O9K92O8
$$ y = [22, -7, 36, 149, -201, 157, -102, 31, 119, -157, 95, 84, -5, 97, -348, -170, -223, 243, 277, -69, -56, 229, 0, -139, 80, 143, -146, -203, -80, -87, 51, 15, 155, -241, 33, 229, -213, -176, -13, -340, 10, -131, 48, 63, 175, 162, -11, -3, -222, -54, 34, -2, 59, 152, -255, 72, -176, -146, -101, -139, -159, -230, 123, 26, 271, 190, -66, 110, -177, -133, -234, 36, -43, 88, 103, 90, -102, 89, -151, -81, 516, -162, -168, -191, -147, 54, -28, 207, 145, 177, 61, -251, -270, -115, -115, -156, -265, 65, -65, 115, -294, 0, -11, 144, 26, -289, 93, 60, 108, -88, 265, 271, 140, 18, -89, 9, -206, 135, -309, 80, 50, 153, -15, 156, 69, 147, 45, 236, -146, 49, 90, 27, 12, 74, -48, -163, 285, -355, -92, -67, -287, -244, -30, -197, -17, 87, 131, 103, 58, -157, -266, 19, 250, -28, -14, 268, -1, 47, 16, 266, 256, 90, 123, -290, -14, -232, -279, -181, 199, -225, 223, 221, -6, -184, -201, -146, -151, 186, 157, 224, 144, 183, 222, 178, -147, -95, 177, -128, -59, 233, 301]
3938C01m77J27O4P4k39j6J34l7L19r6j01J92j66Q3l06J08J8k45K32K15j20l14
3960b50L16J79l56J58K06m27J29r1L4l6l09L06J37K87j13j3p8l23J94q7K56k3
3982I6L4p6o6J36o9J93m42J30J2j1PP8K2J8J42J31l68J54l29K57p6J67J76K0k53
4007H3k33j0J03J48j78Q6l92K07M17j97rr4k2L51pm98r8M9J75J11O5k49M43j26
4031A25r4J4j44J06J55m61L65p5m1J62L81n15J66l0m1j88j03K21j20P6N0j48K23
4054H4o0J2j49l6RJ52k89K54J29J49k02j48K92k07j90m4K20J29j63K02J0j07j09
4077f2L4K09l2m28N42m77L17k19kK2K07o2k51N52k40k46J32R7j85J15R1j51j07
4100a44K74lj27M0r2k59M89k03P9Q5K1j53N6q5N8j98l2K7J51l7K82k1k8k11K18
$$ y = [301, -176, -49, 15, 89, -150, -166, -32, -69, 250, 154, 53, 245, 79, 162, -144, -36, -18, -263, -31, 184, 64, -250, 66, 245, -111, 47, 253, -174, -45, -136, -102, -138, -447, -141, -4, 283, 170, 157, 79, -244, -50, -137, 119, 96, 130, 54, -12, 124, 55, 248, -194, -64, -52, -63, -56, 22, 44, 62, 204, 335, -33, 121, -208, 49, -27, 140, 316, 336, 83, -150, -160, -57, 91, -87, -1, -393, -186, 231, 34, 25, -69, -91, 260, 253, -245, -343, -294, -119, -8, 57, -192, 251, 125, 31, 45, -99, 7, 162, -299, 66, -9, -50, 112, 493, -22, 144, 114, 73, -115, -218, 3, -117, -41, 9, -139, 84, 24, 36, -113, -149, -140, 12, -277, -23, 106, 255, 53, -95, 197, -10, -200, -244, -24, 105, -58, 144, 154, 47, -62, -28, 181, 149, -279, 263, -214, 103, -116, -118, -96, 111, 49, -202, 350, 110, -136, -4, 93, -92, 23, 114, -37, -144, 130, 127, 0, 40, -52, -311, 178, -25, 54, 139, 160, 7, 63, -22, 36, -162, -194, -167, -16, -53, 229, 208, 180, -31, 187]
4125A87k69J47j36J82n81M21J06R2k31J09k52L01j49j3j86P1L7K06l2J50k63J00
4147cJ05j7m40K47Po3J48K05k0P2m61L15j46j78k27J86K00M6j4L6J87j86j76j59
4171c36K97qm0J76l80Q1L56j78J12l4J12n09K29m1J20J70J26n5k5l66L3K46j05
4194a9l5l23J21K96l32L06L05Q2l95K24j2m44K42j40J80l06L06n8J6K87j47l89
4216b35M80l01J53p4J14m08K45r7N5Lj5J34k02j7j34J3L31p0J76K00l36K2n9J5
4240gj14%K25p8J22j85J44L09l07J1k21J52r6J62k6r6pK18j98L72q9m20l1K65
4264A05j17l5o3j44K01J28k0N2J01j55l25J82R9l2j82K37J49j87J20k42L80l49
4286i7J83j85M7L1k4J87o3k8M7m8j84k21K52p3J8N2J8N8M6J76J65l78j36n9l7
$$ y = [187, -82, 65, -71, 111, -470, -49, 57, 149, -82, 27, -225, 76, -73, -86, -272, -201, -164, 42, 10, 160, -103, -3, 102, 85, -355, -108, -101, -164, -16, 189, 169, 241, -220, 95, -51, -229, -456, -270, -70, -24, -38, -2, 185, -1, -177, -336, -39, -47, -87, 89, -291, -210, 146, -32, 80, 46, 158, -351, -122, -163, -43, 127, 253, 198, 173, -193, -160, 86, -19, -54, -377, -256, 40, -292, 14, 319, 401, 6, 230, 218, -226, 16, -124, 56, -250, 56, -2, 14, 301, 154, -235, 245, -56, 97, 23, 137, -271, -26, -123, -68, -65, -80, 54, -148, -165, -299, -286, 45, -25, 151, 351, 15, 37, -22, -7, -121, -121, 104, 26, 148, -37, 107, 416, 109, 120, -101, 51, -45, 117, 91, -5, -12, 206, 8, 380, 291, -129, -160, 105, -12, -47, -110, -254, -53, 75, 55, 107, 208, 53, -272, -90, 9, -23, -205, 32, 181, -6, 114, -128, 252, -97, 86, -99, -52, -21, -45, 142, 79, 51, 98, 50, -134, -355, -103, -176, -158, -106, -88, -30, 16, 192, 357, -21, -157, -216, -253]
4311b53L3J84L9J55N9J4k09k08J88j78J93J04k51L08o1j09J30N9k8j80K75l49
4333h5k6K17k14K5O0L23r6k2j16k95K35j9J65m57R4J64J39m8K01o78L97J34j51
4356e3k01K02J72j21p9J36oJ85k73J03j97%Q2j45L37Mrj81J11k33K08L0j43j03
4380a74J54k2K13q8J49j77j05j2j62L06J57n09J87n3M5L65L5k56j60n6K07Q7J1
4403A42k00k04N30r5k47K53k22J6K2R2M5k72K12J14K1k13l3R5nl64k16M02P2J0
4427d5L26k15O6m2J17l54K30j80J21L4k75M05m8j49M13m26k28K82k16j02L41j80
4449a25J89j13M51n41J66Qj21K90k46P6k80M95m73K74r7J28J68l77K25j9j32j49
4471b03J28j53K61L84j60j54n0j89K81j89M0N7j47J95l10K52P5M3j56J97j83j67
$$ y = [-253, -220, -36, 3, 158, 217, 231, 22, -186, 2, -176, 17, 121, -130, 178, 117, 8, 138, 197, 169, -11, 264, -85, -111, 106, -108, -83, -23, 300, 204, 182, 66, -229, 6, -13, 152, -305, -211, -47, 92, 44, 245, -433, -36, 98, -53, -254, -52, 120, -1, -80, 56, 50, 235, -38, 65, -132, -132, -50, -195, 142, 146, 137, -44, 67, -166, 42, 72, -71, -174, -20, -42, 171, 83, 232, 55, -50, -62, -224, 82, 239, -270, -83, -136, -91, 274, 309, 53, -107, -163, 44, 131, 142, -58, -262, 268, 173, -74, 179, -43, -27, -5, 87, 132, -140, 72, 186, 207, -6, -39, 56, 51, -313, -529, -127, -55, -45, 281, 66, 132, 90, 207, -147, 83, -97, 24, 58, -217, 188, 140, -9, 404, -22, -250, 32, -184, -286, 55, -125, 64, -49, 402, -139, 27, 35, -86, 204, -42, 34, -246, 249, -224, 50, -47, 81, 249, -128, 97, 78, -54, -203, -75, -228, 33, 417, 257, 103, 53, -136, 145, -44, -4, 53, -94, 101, -209, 43, 118, 161, 5, 202, 19, -148]
4493a48j61M43k42o8q3N16j5j90J0l43J85j71L17j49J37%K30j57j95J82N6j94
4515d0j7m5j66M05q7J5k47N94m39N3k0J65p6m74N31j79J2M8Q2N4o3k38j17K54
4539El49M04n8J8k4j00K88K7k30Lk0n9L44m48J12K21J50j92R6j59Lj40q6L0K1
4564a43N34n93J52O8j29K68q7l66K81j2L9r6R6J25j66L13p5m43K98J01k68R6k54
4587b61L21m3J22J01M5j82r2r4q4J97O4q9J63J29j01j49J3Q7j79K24j54j76R9
4610c9K89k28nM15l99j28j36J78j47K04J92j14k42N3r3L77j27n1r5J19m27K38
4632a66K81l57K53J15M1o9l17L06l84M9RM77k42L72m86J10K91m08K57k45l8k4
4654a75j51J71K1L9Rl5K50j99l6J52k75p4J37J08j03J42j00J63K9k53R9k96J67
$$ y = [-148, -309, 134, -108, -176, -259, 257, 242, 52, 62, -281, -96, -267, 50, -99, 38, 38, 268, 111, -84, 98, 154, -40, -57, -102, -268, 137, 50, 65, -182, 412, -27, 26, 6, 171, 95, -379, 152, -27, -15, 33, 115, 169, 106, -132, -249, 5, -344, 60, 2, 20, -4, -104, 184, 211, -19, -16, -36, -95, 249, -199, -87, 134, 284, 92, 188, 29, 32, -108, -194, -164, -143, 391, -202, -50, 18, -111, 157, 70, -296, -15, -27, 12, -84, 12, 137, -29, 284, 209, -234, 64, 165, -103, -7, -261, 60, 17, 139, 240, 285, 103, 11, -83, -167, 30, 94, 5, 168, 297, 196, 47, 60, 147, -32, 192, 38, -138, -39, 250, 22, 17, 432, 33, -95, -231, -53, -200, 4, 196, 82, -160, -107, -200, 177, 50, -1, -96, 23, -404, -166, 115, -242, 11, 126, 167, 98, -219, 87, -297, -248, -239, 238, -4, 368, -118, -8, 283, -125, 132, -113, -151, -175, -326, -155, -134, -95, -86, -121, 129, -70, -106, 46, -229, -303, -166, -58, -161, -19, -119, 44, 73, -180, -81, -377, -210]
4677b10J74r6J61k15K81k69K13Q6J2m80L81l43Q4K14mJ3J0p1L36j4m48J23J81
4700A19j77J90j7m7O6j71l8j39P0Q8K29j48k31K66k5l3K0k05J55Q5j87O2o3o8
4724a99L28J88k94M77p27L73O3j38k62J82p4l0K4K16m3k48Q0J70j45l41O44m73
4746b29L03m03M32J49k26ln0J9k03j17J40K88j31J37m2J41r2j29l7O0j85J50r2
4769a20J52J13l30J20K05O8k79k6j55L55P7J00j54J39M10o52k2J66j9k36n5R2
4791e1Q8k94J85K21q3j26K00r4j34k20N65l73J75k47J49J87N0Pk58n6M3k12K78
4814@k27L92j65Q1M1M1k96J00k75K26j2K33k7j26N3J61j62j34J8l06k8M02Q4o
4838F8nj8J05J81l27L9j6k35M25l33P4J20J53k63K4l3L87k83j56p8M6qJ50jo3
$$ y = [-210, -36, -132, 29, -186, 95, -174, 39, 125, 137, -343, 38, -305, -221, -7, -11, 2, 12, -59, 277, 263, -185, -62, 119, -58, 132, 115, 68, 134, -37, -75, -214, -144, -56, 173, 25, -206, 60, 35, 2, 22, -183, -28, 57, -130, -68, -131, -199, 129, 317, 23, 500, -227, 146, 209, 71, -191, -9, -83, -113, -89, 127, 84, -164, -84, 86, -59, -400, 244, -229, 74, -329, 103, 252, 26, 23, -27, -8, -211, -328, -188, 100, -31, 106, 64, 205, 113, -16, -53, 7, -178, -28, -120, 32, 145, -185, -65, 140, 208, -71, -97, -252, 103, 180, 280, 126, 265, 675, 23, 1, 167, 148, -88, -143, -51, 37, -257, -72, 149, 66, -60, 140, 46, -88, -308, 257, -116, 59, -188, -39, 148, 198, 205, -53, -109, -66, -278, 0, -227, 165, 0, 81, 122, 163, -133, -33, -308, -82, -94, 139, 112, -14, 39, 200, 38, -96, -78, -384, -412, -10, 74, 68, 63, 45, 150, 331, 4, 43, 27, -208, 217, -116, -42, 78, 231, -32, -8, -41, 346, 63, -93, -171, -125, -133, 17, 16, -47]
4863d7K74j07k36M15l53r6L52k09J53J45l65K09k54J48K08l77L00l72K94jj71
4884i0J85k7k15J36j03l9l23K34J07j39J42R6j54L03j46J71q4k37M17l47K4K72
4906A83K9j44j66KJ3J92O3q5k16J09k08Q6J00J29J06N4k71J22l59m6M31l46K76
4929E4j53K36k48L17j74r0J22k30mL0K30P1j88M9L50k49j31R8l32Q7K65j8l47
4952b55K38J40j8j5J22l89K19j00r1J95K17k76J79J19K8j84P0l73K09n7k02K37
4974A3m9n7L05j62j23J59p6J93j96NJ46j09J7J38j49j8O9j12n1J24p8PM0K81k62
4999E5q1L8J42k62N3j20K62k04j24L33j90J23l19L76K86l79k60J59j03k1L46k45
5021a35M40j22q4J23l40L40n13L86N8q7j46M92j63l87M52l86L28n21L76j92Q1
$$ y = [-47, 227, 120, -116, 299, -54, -150, 202, -7, 146, 291, -74, 135, -119, 29, 237, -140, 160, -212, 82, 81, -90, 95, 68, -147, -11, -114, -153, -476, -242, -135, -274, -132, -36, -190, 113, -33, 138, 54, -183, 234, -113, -89, 183, 212, 68, -98, -96, -83, 109, 172, 87, -129, -20, -228, -142, -42, 87, 193, 247, -24, 98, -261, -307, 124, -222, 54, -99, 137, -111, 206, 32, -58, 64, -166, -170, -140, 90, 161, -27, 22, 372, 123, -8, 90, -242, -155, 110, 92, -255, -17, 123, 105, 90, 212, -177, 42, -58, -149, 46, 263, -13, 166, 285, 313, 129, 199, -174, 35, -22, -224, 13, -36, -93, 212, 50, -73, 86, 10, 203, 7, 12, 158, 49, 66, 204, 55, 37, 106, -6, -57, 67, -11, -4, 36, 317, 55, -26, 12, 154, -108, -55, -175, 87, -117, -241, 92, -98, 25, -294, 82, 368, -11, -271, -112, -215, -236, 110, -135, 305, 183, 99, 222, -118, 222, -291, 95, 153, 66, -80, 412, 249, -138, 314, -72, 256, -265, 111, -81, 0]
5042@J37j72N0J52j82J40j34j68J9K63m48L26k6J21K0J76k07r5K97m63J97j54
5064a51K68Q1m61N72o40K82K71o9j21k27J55O8j62K16J51l16J12K47m40J49K63
5085B48n27L44k03M14k1l39J59J45n17L74j46J64k30k5M64k37q6J20R6K2q7j68
5107c6q7L9k9J57k69N61j66j20L16n36J72p8q3R4o9J72l2K10r2n7p8L6o8j00Q4
5132e9o9J12K21k62J45n9L6P5j81j95J07J04J38j64l5J20J24k08q3rN7Q7P6MJ15
5157A97q2r7J19q7j2K19j43p8L6J5J49k62K2JJ20l53K21n3J00p0j74L98j34r9
5181d7K18n0P8j53l3OJ52j19n9n3Q5K3p4M6L7k0J33k76K18j27R4l6R8k3j19J58
5207A57j67k93K68l3J41O7j0J8j77jP1q0L50n57q8L15k80K69N8j5K05j32j62J82
$$ y = [0, 137, -35, 15, 167, -15, 125, -9, -177, -158, 105, -343, -17, -43, 78, 98, 274, 67, -28, 269, -194, 3, -151, 117, 198, -263, 309, -331, -49, 222, 153, 32, -195, -40, 28, -134, 82, 233, -83, 29, 276, -164, -15, 248, -279, 65, -138, 276, 255, -84, 75, 220, -297, 77, -69, 95, -135, -160, 304, 67, -19, 101, 197, 219, 132, -36, -123, -84, -113, 44, -225, 336, 170, 50, 366, -170, 2, -76, -159, -65, -134, 38, 6, 216, 124, 67, -11, 25, -43, -143, -59, -128, -16, 205, -57, 88, 29, 65, 140, -41, -236, -129, -25, 113, -51, -86, 34, 158, -50, -133, -142, -85, 2, 78, 82, 197, 115, 18, 137, 50, 38, 257, 114, 36, 72, 87, 236, -26, -4, -3, 117, -236, -15, -68, 32, -38, -212, 186, 52, -47, 171, 121, 199, 46, 13, 19, 171, 52, -7, -60, 25, 48, -26, 20, 57, 37, 170, -106, 112, -15, 79, 43, 141, 118, -1, 157, -10, -303, -35, -68, 73, 140, 130, 148, -29, -30, 41, -39, 311, -246, -334, -19, -299, -30, 28, 13, 218, 86, -76, 106]
5231A06o3k00P9k4o2K27M7q4R3L6q9k46j5N2K00mk9k65L35K8k1O5k06j94L16K3
5257A05m1p6j20q2M17l20j35J48L6P1K10j10j98j05J98J1J36k0l54L72j89L54
5279C08r6j47N3r1r3J79k4M0k13k5o5J01K15j63k02K46j56K45J5j40j82K32n1
5302a4k07L25o8n1P4k95J50M21m67j35J82K56o4j15r2K07O2J6l90K52N4M1k0P4
5326A96k13l6J39k12L95k39j12NJ74r6k21K52j35J90j7N1o5j30J4k3j4j22K50
5349C1k5J68r0PK8l78K83j89J92L6r8J09n3J84k84J77K18j58j8j39k6p9K05J5
5373A16q2j9j02K60r2k20J53O1k18K82j75J84k54L23j61l31K74P5j53j85J46K59
5395A41l3j96O2L10l29O4m8j0K43j75j43K69l6J81k55m8J24l5J55l00J00k42J05
$$ y = [106, 43, -157, -78, -102, -164, 63, 110, 26, 119, 155, 66, -180, -195, -143, 57, 53, 24, -241, 94, 122, 101, 166, -40, -234, 82, 105, 64, -12, -132, -214, 203, -117, -252, -104, -68, 3, 213, 103, -95, -200, -2, 9, 145, 125, -229, 143, -46, 308, 212, 65, 118, 27, -66, 113, 89, 129, -84, -109, -174, -73, 142, -21, -223, 23, -133, 112, 127, -13, -195, 37, -14, -221, 104, 36, -15, 59, -236, -86, 335, -132, -267, -85, 171, 107, -8, -100, 107, 169, 185, -205, 47, 101, 142, 122, 196, -17, -53, 86, -126, 269, 30, -82, -77, 97, 1, -220, 32, -103, 87, 70, 121, 56, -74, -60, -83, -97, -219, 31, 6, 174, 84, 91, 119, -259, 24, -165, 27, 63, -35, 74, 21, 205, -79, 98, 316, 158, 140, 1, -25, -104, 101, 116, 34, 15, -87, 173, 81, -139, 14, 75, -143, 139, -36, 148, -106, 217, 56, -275, -1, 74, -79, -264, -118, 141, 108, -88, -26, 284, -45, 19, -29, -39, 204, 29, -114, 155, 119, 300, 45, -3, 121, 86, 241, -59, 41, -201, -96]
5418i6j05L23P5k19K98k19q0J92N4l10J71j86L16K0m6m40J23J61KP2q0K6m0L6
5442D8j05l6R4J88r3n7n4L30k56j19K06k56J12K09j51r5k3j49J15Q3%j71K48j50
5466h2R2Q2k51L18j14k03N9J75l64K80n2L4J00p4O4m3K7L8j19J94k35L37l95L95
5490B63k41q2R3RK15r6j72p7J00J50J09q1j98N5K44n17L97k54J73J62l82n1L93
5513B12k36%j30K22k9k65j0K10O3j63K07j2M7l38o5K42q3J25q2O4K64k58J00Q9
5537A74p0k31K01P4mk84L81m08k3L64n96M17j24k9M2K79l16P3K60k0r8j90o9J23
5561g4R0K59k91O4j22r6L01j59k06J32mk93K44J86m3k4j58K45j41K95l21J40j4
5584A0J72k48j14L40l03K57J7J17k19j9k4q5J55J63k53pM5J48j31j07L78m57J63
$$ y = [-96, -201, 122, 197, -22, 276, 57, -23, 169, 223, -87, 84, -102, 214, 234, 188, -252, -129, 32, 34, 106, 26, 52, 12, 48, -57, -93, 1, 189, 96, 39, -15, 315, 59, -60, 146, -110, 2, 211, 60, -35, -58, -207, -92, -9, -9, -180, 68, -82, 10, 92, -159, 159, 45, -158, -99, 76, -288, -8, -60, -26, 74, 0, 64, 21, 48, 86, -33, 161, -74, 263, -132, 263, 22, -60, 33, 42, 257, 161, -11, -88, 12, 162, 271, 190, -8, 47, 291, -226, 171, -83, 90, 252, -130, -181, 212, -24, -24, -154, 68, 39, -226, -236, -26, 37, -126, 81, 69, 116, -222, -287, -45, -128, -3, -85, -21, 243, -15, 85, 174, 104, -127, 74, 148, 144, -140, 241, -167, -190, 174, -422, -5, -129, -158, -116, 163, -153, -80, 180, 160, 62, -128, -197, -74, 16, 275, -16, 48, -74, -170, 131, -28, -234, -102, -106, -399, -155, 31, -12, -36, -194, 51, -90, 205, -116, 24, 10, 182, -66, -180, 160, -143, 114, 131, 248, 29, 10, -14, -99, 56, 219, -34, -41, 4, 152, 21, -86, 292, -165, -2]
5607bJ3j97J00J53J04j91L05l8j59j69J26j57K75l87K23J26j05J64k26J61n4J61
5629B26n16K79Pk05K12J00j84k5J08j55J57m7Onk00M9Q2L32j40k6K61k21l4M3
5653A04mn3K18r1J4K11l98m3R8j44N3l20M40j97L2J51j84L23l1r6j03j82r7MM87
5678A92j11k13J19M84j30l76k06J72P4j21k13J27K40r4J18l02O03l62K25j74j17
5699f5Q3j56O4p7j16K39Qj17K18n0r1K20l43J05J50o3k50K47J50k06J6j68K54
5722E2j42L20k37m1P1k16L10Qk03k00R3K11J09l08K61J40q5j18K2k0j91j58K62
5745f0N5J6K28r3j83J2R7J00m21M30j1k46N0J08j70m3J09J13j77K09l61L62J23
5768B47Oj75n8L38k96J3l8J01k28o5L1Q2J63k33K83k43K7O8j0j57r6M70j53J0
$$ y = [-2, 11, -186, -86, 67, 171, -20, 285, 247, 88, -81, 45, -112, 163, -224, -1, 125, 20, 184, -42, 119, 65, 226, -290, -11, -4, -209, 3, 103, -81, -106, 2, -153, 4, -43, -37, -42, -242, -193, -111, 221, 81, 55, 316, 95, 61, 104, 100, 47, 265, 174, 188, 399, 1, -42, 56, -88, -35, -355, 85, -112, -80, 71, -113, 210, 179, 83, -20, -202, -299, -295, 192, 81, -132, -13, 471, 341, -35, -241, -69, 5, -116, -329, -202, 38, -56, 62, -240, 363, 1, 226, 52, -65, 18, -138, -74, -151, -267, -28, -20, -137, 81, 31, -60, 160, -183, -78, 72, 9, -241, 6, 156, -50, -34, -202, 52, -90, 230, -7, -48, 23, -193, 117, 125, -78, -278, -185, 26, 135, -173, 88, 228, 143, 25, 47, 27, -164, -322, -60, -5, 11, 239, 146, -37, -25, 72, 172, -249, 181, 170, -76, -26, 82, -88, -131, -22, 91, -86, 123, -238, 124, 247, 253, 78, 20, 358, 62, 75, 37, 138, -90, -155, -124, -42, 121, -112, 171, -72, -45, 23, 13, -144, -240, 230, 77, 87]
5792H7k79K11L69n33q1K09k25k6L89l19J69L08l05J6J67Q5j13j01j46O3j45K0
5814a80K58j05J45k8J67k85J6j38j4K69k07J00M8M3N6p9J03m39L91q6j34%M33
5837C34l84j1J99j91RP7j98J1J54O7J80p7K0m83L29J46l63J28j72J98O7O2J20
5860B22l40L16m65K70o0l4K45J5j33R7l01P3O3m04P22j36j56j29N5k3q2R2K45
5883A52k32K18J35j53j02m2J98m2l32K36j80J95m1K63n51K56j15r6K56l10L36
5904D9n3J3R5L0k77J06L0K52n9k42J23j23L79l58K22m5j44N9qk51L88l61Q2O2
5928c1J74k88J40p3M47n68L06k08K66j55k08J14j9J57M7K15l95K10k48J6p8K60
5950H1j1J37l73L30r5l28M00J57l46J60P8l29J46m4j31L29L1k51J33m05K32n1
$$ y = [87, -192, 19, 388, -145, -226, -17, -242, -268, 121, -198, -29, 279, -26, -10, 157, 242, 129, 28, -118, -55, -200, -180, 78, -27, 118, 90, 257, -28, -12, -150, -164, 105, -102, -2, 46, 89, 145, 66, 169, -270, 121, 35, -99, -99, 334, -50, -61, 138, -53, -44, 33, -165, -154, 0, 67, 247, 170, 190, -293, 36, 182, -181, -53, -225, -27, 40, 102, 222, -118, 198, -267, 3, -57, -91, 154, 169, 36, 133, -168, -95, -32, -436, 286, 150, -6, -135, -80, -103, -185, -93, 152, -80, 138, 273, 120, 18, -24, 174, 132, -200, 36, -144, 51, 10, 273, -278, -22, -137, -233, 23, -287, 49, -4, 9, 104, 134, -143, -37, -7, 245, 186, -56, 67, -56, 323, -35, 187, 142, -2, 57, 49, -202, 186, -175, -93, -31, 143, -145, -5, -78, 369, -199, 107, -101, 165, 10, -198, -84, -103, 54, 101, 316, -79, 131, -117, -101, -179, 81, 70, 207, -166, 164, 69, -259, 141, 298, -48, 112, 190, -139, 7, -37, -168, 161, 192, -59, 74, -331, -99, -150]
5972a50N4P3r0J59K25o15K68j4J17Q0n4q9j05K15j25J57O1k23K40L1j42j97J24
5995@K16O4r1j58r6K56l3j94L28l0n82L48J32l34L34j56p3O4q4K13k83j19M27
6018A49k20J41k6K15j87j18R7M2p2m6J08K21l88J38j5j56J3K72k09q5L5J7K31
6041A57q8K7m1K10j78j73J6k4o3K80j3j30l8J91k07J98l2k12j5k50M13J30k10
6064e2J52q8J24L0J0k20J98j44K62j34j41j15K64k48j03P6j25K53L8O3N3j1j36
6087FM5j26l0k36J27r4M17o5O3k66N2Q3j64O3J80ll84L30m4K14j85j29L25k35
6111e6K8J68m3n2K6l00L2K28P6J14j68J03j10J5l5k3K21k66R3m20M35K8k04L1
6135g9O0L5o2o7j38L55k34K73j08K13k09PJ91k28N4K21k87J11p4k10K05j72K03
$$ y = [-150, -96, -23, -113, 46, 271, -344, -76, -90, 27, 107, 53, -36, -141, 74, -51, 106, 167, -56, 184, 215, 73, -124, 0, 216, 280, 189, 31, -65, 191, 158, -36, 292, 262, -320, 28, 160, -174, 160, 4, -69, -5, -89, 124, -159, -278, 149, -71, 70, 44, 259, 72, -46, 51, 93, 21, -25, 83, 304, -84, 54, 39, -117, -104, 168, -41, -126, -91, -74, 157, 69, 96, 55, 265, 87, -86, -70, -94, -157, 123, 110, -20, -58, 133, -74, 124, 92, -120, -135, -385, 28, 158, -52, 100, 12, 136, 166, 176, -44, 154, 10, 272, 138, -3, -118, 146, -102, -205, -129, -254, -1, 37, 100, 153, 142, 6, 51, -75, -105, -341, -214, -308, 109, 44, 107, -159, -107, -24, -188, -125, 55, 52, -332, -2, -46, 168, -17, -146, 179, -56, -28, 140, 97, 45, 71, -229, -197, 31, 107, 221, 53, 156, 46, 61, 26, 3, 224, -42, 51, -369, 66, 94, -110, -79, -19, 16, -46, -113, -251, 104, -130, 143, 35, 248, 39, 46, 237, 9, 63, 284, -3, 108, 34, -176, 29, -143, 60]
6158F0k0J87j83M36m88j00Rj34K16J00m05J24Mn7L23n5J09n6J3q7j08K41p7j63
6182a11M1j03L48k49J72J2j57o1J69j7J15R0j10r5j25L6j31K20J82k97J80j42
6204c3Q9j19K08j97j55K45K9j96J0K68j28J97l61J54P8m7O0j13J81j36q8J76j18
6227Dr0n1l5K6j36L22J23l37K60l9j25j2j71K39k09L09J1k29J97j70K63k32n9
6250a41J59k67L76Q6k20J46k31k0J9K90k71K92l54K36j39q3K94m37L12M5O5qJ3
6273A62k11J4J74j92L62j83n8j73o6J4j0L01k16j5J36M4M3l7Kn4r4M4j54L61Q5
6298B79j04k02J24l01M46l95KM69j90Mk10K51J90k13O0k18k13K62M9k14J49k3
6320BJ1r2J90j20qJ1j76L14n0Q4j92JJ09j54L7k23J70M9RJ88K17k53J22l31j02
$$ y = [60, 40, 227, 44, 480, -8, -108, -99, -233, -17, 83, -322, -198, -194, -251, 72, 17, 126, 70, 83, -4, -112, 129, 52, -111, -70, -173, 175, -74, 98, 110, -47, -108, 61, 44, 159, 249, 139, 44, -81, -45, -176, 44, 226, -71, 109, -33, 56, -63, 145, -52, -207, 38, 67, -129, -119, 149, 21, 218, -143, 11, 89, 42, 102, -11, 170, 34, -54, 122, 4, -86, -137, -172, -146, -282, 40, 163, -174, 86, 47, -78, -90, -261, -22, -231, 78, 89, -140, 57, -113, 150, -82, -141, 18, -249, 127, 213, -7, 139, -92, -112, -93, 197, -74, 218, -136, 100, -39, -122, 172, -265, 47, 92, 157, 149, 162, -49, -35, 139, -53, 309, 126, 68, -105, -171, -157, -167, 134, -82, -97, 39, 83, 126, 89, 91, 37, -57, -13, -167, 194, 279, 175, -27, 97, -204, 242, -153, -151, 318, 128, 132, -78, 173, 363, 150, 210, -8, -221, 41, 90, -124, 25, 2, 13, -79, 111, -9, -17, -6, -182, 132, 82, 166, -26, -25, 84, -70, -33, -256, -86, -37, -28, 160, 377, 124, 246, -85, -187]
6345a87J58j02J17n8J65J28k04r4QK43j16J0l42L4K49J68l57J49K29k64K26j85
6367b5M5o1J68j72J82k21L30j60m5j99J93j18J70j70O8M6Q7o4j62Q1J97m0k35
6390a05j7J43J06r0nK29O6l01J59l84J92k3q0O7q0M7K48k94K61J02k31Q4j36j95
6414b37J66J38k14M71q1k18n7J57l79O2K18m15K60M5J22J11J86m76L3J05o9K01
6436A29k53o7j47N58k32l14K86J66l8j83Q5L2p5j35J96l0j34J80J46L4k68k25
6458b89N01j69l0n6Nr1PQ9o8J58M8k04O7j39J14k6O4P5o4Q3j29M6J6pp6J35k10
6485a50K89k29K10j0o5L4k0j1j52K97k89K10J03j20j42k26O3Q8N4N6N0Q9k26J89
6509I2N1o9L7j58K35j30m86K03O2J44j18lj25o8L17J10k6k87K6J60l7Q5j6J96
$$ y = [-187, -29, -131, -14, -72, 93, 221, 17, -77, -69, 174, 58, 68, -274, -240, 9, 177, -180, -31, 198, -66, 160, -25, 20, -41, 127, -45, 137, -84, 246, 86, 41, -158, 35, -83, 87, -83, -15, 31, 118, 54, -108, -27, 170, 130, -105, -122, 21, 127, 37, 32, 261, 327, 26, 185, -199, -7, -30, -110, -43, -123, -76, 172, -122, 139, 241, 10, 94, -42, -237, -71, 67, -147, 324, 243, 25, -32, 125, -254, -192, 26, -389, -129, -84, 38, 149, 335, -141, -108, -3, -72, 129, -124, -191, -338, 220, -12, -326, -40, 126, 88, -95, -10, 22, -53, -188, 8, -22, -156, 24, 170, 204, -64, -289, 212, 43, 13, -43, -38, -129, -122, -33, -101, 57, 105, -99, -32, -171, -57, -83, -19, 56, -8, 75, -54, -8, 8, 1, -75, 60, -150, 139, -90, 120, 110, 45, 79, 59, 48, -104, 193, -96, 114, 217, 97, -45, -271, -208, -120, -66, -10, 40, 129, -97, 92, 143, 74, 111, -47, 188, 58, -428, -225, -163, -19, -137, -140, -265, -333, -16, 94, 68, -219, -193, -33, -70, 15, -1, 195]
6533A95r0Jj63j26J74O6j40m7J92K20k53J48j48Kj41J96j00K7r8k30L29O4l37
6556b59J68L54l30k79M76k82L0o4L59j30q9j2P2k5J24j03o3J39R1n2j08J08L9
6579A64k14j62M45j98k4K5L2l63M15n2j26J70j89L12n7k20L83j69m19J01K14K07
6601B75n8j32j21r2K96j30J75l17p4M35j78J4j52N6N6m4K08j51l9J9m4J30k20
6624h8J94p4n9K05N0j1J15m2n40L74j69J43j66K84j26l33N9m1Q8L71j57J55k3
6647B09j51j64K84q3l69L68p3jP8k19k8Q1K46J16o5l63j33J65om9J46p6J22K20
6671B55%j45m60M10k08Q0L33l10j0o4j61J28j21L74ol67M60k34K06l8m56M72j67
6694b9R8l50M41j74k76N29j57k97K36o2L68k55mR4k9q5j69O6K81J4j85J45k52
$$ y = [195, 105, 106, -57, -183, -9, 57, -83, -130, 62, 282, 29, 177, 29, 31, -110, 86, -14, 13, -85, -315, 14, 78, -259, -91, 263, -67, -346, 130, -152, -122, -186, 173, 43, -46, -58, 14, -11, 113, 10, -53, 86, 177, 125, 17, 125, 164, -50, -212, 233, 35, 11, 36, 68, -295, 120, 68, -58, 112, -77, 235, 178, -42, 341, 172, -247, -146, 68, 275, 217, 85, -36, -128, 168, 38, 213, -104, -178, 257, 79, 93, -59, -3, 53, 9, 217, 66, 27, 46, 2, 132, -88, 106, 32, -27, 178, 228, 217, 332, 290, -250, 124, -45, 98, -68, 216, 90, -243, -184, -225, -137, 234, 77, 232, 209, 58, -106, 178, 95, -274, 94, 21, 20, 98, -121, -149, -68, 178, 294, 229, -134, -267, -102, -108, -157, -11, -87, 35, 255, 255, 110, -350, 60, -148, -68, 265, -45, -55, -119, -280, -152, -273, 101, 95, -272, 188, -46, 160, 122, -334, 138, -29, 69, -281, 160, -14, -290, 239, 82, -215, 21, -41, 327, 72, 68, 162, 133, 48, -121, -55, 226, 240, 55, 200, -52]
6717e2k02R7P1J25p1K44j26k54J53P3l10K57K27j52l3J5P3k36p7L70j92k3k0K24
6741A81k30O0l3j4J91l07K30ok2o4Q3K09l88j10K4L34o7J45l99R9L85m20J50M5
6765G6k06R4m5L13k11j29J75o8K14N1l08n1L13l64J24M2j72O0K49k98K42M6l61
6788b14O7n7J91p8j5q7J35J72L6j93q1J58q7O8P3L56l56k42M00l00jR2k25L43
6812A55j51k9L0p6l30M32j05j41j4L45p4k12J85j1J8K27j25p5k08L87m36M5k4
6835a87K49R0J8k62NN67m82R9r8j6q5J47J80m15K42J48k77k03L43j05J4K8j43
6858a43LQ9J48j39P5Q9R5j94J13Q4n9k08j48M2L22O8j98J34r6K21l98q0J21K44
6882A85k38K37M2j89J16k1j05k34K02m63M53J4K36j26m8m05L31J46j88J33k1M5
$$ y = [-52, -254, -157, -86, 39, -32, 212, 86, -168, -15, 58, -252, 5, 232, 80, 47, 62, 135, -101, -178, 192, 0, -23, -43, 181, -49, 11, -22, -36, 155, -152, 78, 72, 50, -14, 69, 278, -110, -220, -196, 138, 71, 216, -183, -84, 301, -119, 31, 76, -130, -36, -81, 232, 21, -108, 67, -1, 213, 264, -44, -95, 218, -146, -22, 20, -152, -92, 157, -141, 101, 147, -214, -147, -204, -13, -91, -106, -193, -58, 114, 150, -43, -124, 34, -53, 15, 88, 444, 88, -154, 246, -54, -55, 37, -188, 155, 4, -25, 5, -71, -401, 31, -74, -215, -229, 116, 42, -170, 15, 4, 22, 249, 124, 49, -159, 228, -208, -163, -187, 62, 152, 170, -92, -87, 480, -2, 97, -1, -17, -102, 45, 225, -190, 52, 200, -77, -280, 63, -42, -28, 0, -143, -140, -51, 97, -42, 33, 122, 217, 23, 136, 220, 161, -47, -195, -153, 169, 237, 39, 173, 77, 298, -100, -180, -59, 185, -53, 184, 226, 37, 153, 132, 27, -207, -5, -468, -15, -1, 235, 109, 61, -344, -13, 133, -55, 78, 57, 102]
6904A02j96L36k79r2K23rr1k8K36k83J30k16J45j51K68j00KJ41j50J27P7q0k53
6927a41J10rK05l59R4K09j37J3K9K05j98k62L30k25J34R3j9k24n6j24K34K72l50
6950a76N8J18J68j45J32k93J69k29K7J12O6K66j77m8nk0j64j46K98K11j72k60
6972b10K45k47J72KN9K5l19R6N0J68j41r1R9K8k11K64J21k56K76j20p8k59m2N32
6996A63M3k16j77K79RQ1k96j8M72l85J43%k92K26O9j70j27J07K84k32p3N8N8k43
7020b37J62K18j23J80k39pK68k74P0L5j80L20k59N5L9P1k21N4L13j51j20q3p8
7043a87J97K3k54l0N07l22J64R1k72P9j73K76k28j00J09N6RK95n67j7L85M9k45
7066a55k2J32R9l05K07Q6j6j01J75J22j21j89r5L45n8j16K06m06L77Jj62k82J93
$$ y = [102, -94, 242, -37, -129, 94, 85, -6, -34, 202, -81, 49, -167, -22, -173, 95, -5, -3, 138, -12, 115, 192, 112, -141, -31, -40, 165, -194, -100, 109, -28, -15, 14, 219, 21, -241, 89, -136, -2, 91, 72, -152, -208, -332, -98, 174, -176, -118, 0, 168, 23, 155, -138, 31, -198, -171, -59, 7, 273, 96, 48, 43, 23, -141, -287, 11, 222, 50, -210, 35, -212, -40, -38, 21, 46, -273, -177, -127, 41, -100, -191, -92, -64, -275, -11, 110, -146, 130, 10, -68, -327, -369, 163, 206, -10, -187, 92, 101, 182, -114, -132, 340, -45, 98, 98, -194, 32, 101, -69, -196, -89, 195, -37, -110, -52, 6, -237, -75, 143, 20, 200, -39, -46, 222, -52, 18, 53, -127, 193, -66, -11, 28, 99, -122, -68, 245, 94, -26, -109, -187, 10, 33, -221, -251, 256, -66, 98, 189, -83, -4, -177, 99, -129, -229, -120, -64, -55, 240, -327, -344, 41, 90, -155, -177, -45, 54, -251, -44, 42, 26, -75, 100, 222, 101, -88, -183, 162, 104, -12, 194, -212, 165, 166, 4, -278, -85]
7089h5K2J10m5k10O04l97L80l01J48n52M15j8J13j76Kk59J09L61k42j10J18K45
7111B32l79J57R6Pk64L16m30K68j07J40K45q7k04o0l8J10J30r6q6J26k38R1R3
7134B2R5r8M5n5j21J16o4N1K30k66M6m9J12r5J15n6j04L64l83K33j22k06P1L39
7158B20l09J28j12K91O3l7j86L2p0q0k5j71K87j02J47J68j21l4p2j23j56L36j43
7181f9PK27r2Q0j29L1J54l94J72j60J14J50j64M2P9o6J60l25L0m2J59J70l09K83
7205A08k02J03J7K34r3j73K91l40j56J63Q3N9K27o01L11L3n9j73J29J78o5k43
7227a69O8J2J83K24l82k1J70k30J2O5k89M65N3k3J93j60j52J04k38J84k25O45
7249D89l49j00L6o1j19J22j11J94k8m6j63K37Mj88l2O6m4nK26J4j47L1j7k6K61
$$ y = [-85, -63, 47, 2, -208, 396, -1, 379, 78, 226, -326, 89, 71, 184, 8, 10, -249, -140, 221, -21, -131, -13, 232, -147, 10, 106, 113, -151, 165, -265, 3, -104, 36, 281, 194, -10, -70, -108, 2, 132, 36, -50, 76, -162, -71, 22, 117, 19, 64, 9, -112, 4, -60, -9, 221, -45, 1, -48, 64, -31, 84, 28, -76, 288, -95, 138, 16, -190, -119, 220, -89, 39, -73, 218, 281, 244, 58, 90, 20, -60, -85, -256, 31, -71, 76, 244, 123, 89, 17, -106, -262, 74, -69, -62, 165, 73, 153, 24, 55, 209, -185, -13, -173, -59, 91, -73, -31, 48, -18, 142, -183, -153, -195, -36, 134, -175, 108, -94, 9, 26, 260, 167, -6, 285, -55, -211, -48, 35, 94, 321, -280, 31, 64, 5, -168, -39, 139, 74, -169, -101, -89, 94, 318, -64, -85, 85, -145, -133, -68, -357, 108, 161, 138, 331, 171, 19, 123, -115, 69, -156, 489, 140, 40, 76, 15, -104, 18, -93, 101, 73, 27, -136, 101, 105, -83, -115, -49, -93, -98, 128, 142, -5, 26, 9, -17, 244]
7274B44m39L91j27k85K28K56j61k31J03K01l34Q7K05l85K04N7o2lJ27j70J3J99
7296A18j57j61L90o1m3K7l04K00k00Q7J64q8k4J63P2l9o3qJ12j27R3j56k53J20
7320a38N70l90J16k56K5K07j40Q9r5N0J3q0K41l64K72rl05J76O2j86j90K38P5
7343a9k06L61K30k11l77N0J90j16j30K07j05J0K76k84J33p0P2o3p4J33j05K48
7365A50J12l08R2k30r0K82R3j49mJ24j65L49k76k8O4r4m3J35r7Q7j6LK21l53P7
7390f4J32k8j8Q0l7P1m79M44k11K87l78J01J80Kj97J57k4j07m8l3J23K26r5j3
7414G1J5j41j57J70j20M0L34j03n3m12L32O2n8L09o7k52rJ28n1J07m12K45j5l
7438d0J54Q3k40k08mJ59R3J81j62K51L8m59J89J49m27L91j87M3Q8j42p4J60J74
$$ y = [244, -195, 196, 69, -216, 12, 268, 107, -124, -21, 180, -154, -67, 138, -247, -43, 14, -48, -51, 76, -94, -81, 118, -39, -200, 190, 129, 86, 113, -191, 9, -191, -104, 60, -28, -52, 111, 183, 144, 81, 73, 185, 58, 151, -5, -258, -138, 432, 42, 158, -98, -73, 134, -6, 83, -12, 38, 51, -29, 212, -152, 120, 111, -194, -18, 44, -142, -332, -94, -19, -225, 136, 366, 155, -222, -172, 18, -98, -228, -21, -126, -116, 160, -124, 9, -61, 11, -52, -126, 7, -98, 150, 262, -46, 46, -184, -274, 8, 101, -48, -52, 72, -93, 256, -20, -48, 16, -78, -121, 14, -83, 4, -12, -9, 212, -141, -64, 68, 40, 22, 102, 65, 136, -343, 101, -110, 177, -201, -100, 80, 82, -115, 42, 18, -89, -137, -170, -47, 179, 84, 71, 86, -55, -212, -42, -162, -122, 212, 109, 56, -356, -24, 38, -20, 289, 222, -30, -39, 89, 38, 145, -267, -22, -37, -40, 114, 197, -43, -251, -255, -96, -3, 178, 16, 267, 305, -154, 35, 184, -243, 148, -39, 4, 92, -50, -124, 36, 210]
7461B10l18N2m9M2n6N2K79k08jL47m26P9m5q6M31j24l49L74m38M55L5k50j64K55
7485I7k12K83l90k6M67j63Q6j80K01j92o8J76k90K17j15J0K41k94K08K46m69J93
7507B6Rr4j3P1mJ1J79l87L68k21K69k13P2j9q1j10J11J04M9J4l16O8J69K26m52
7532a64K21j72P0PK55M0j60l31K77j06J36k34L30n1k25P9Q8k29n8K25K12k19J23
7555A14o5j99K86k66K0m5m6kM49l76j21L83p4k8J74l40L11p6j08J4k81K90j74
7578a60L18R4j27j8j12j37K02k0n1J1K48j47k91L38k12P1r6NJ93k13K65l59L41
7601A43k70J82j69P3N7m0K65j78l86N20n3l41K03J65j22M6Rr5j79J3M8L03j41
7624E3K22r1k57Q9k74R1J21P0LJ07k32J6n8J17k1O3N5k8R3l97K39K95l17j37J02
$$ y = [210, -108, -56, -105, -63, -119, -67, 212, 4, 3, 350, -76, 3, -42, -128, 303, 179, -170, 204, -234, 221, 256, 6, -158, 97, -115, 168, -222, -248, 219, 56, 142, -38, 163, -29, -97, 79, -211, 6, -109, -99, 142, -152, 56, 302, -167, 26, 35, -59, -72, -1, -5, 6, 185, -202, 166, -55, 214, 1, 73, 54, -27, -137, -26, 78, 127, 141, -175, -107, 62, 288, -164, 57, -115, -45, -38, 217, 257, 97, -234, 43, -63, 73, -161, 169, 118, -107, -28, 60, -169, -227, -2, 210, -9, 114, 49, -150, 136, -130, -110, -155, -201, -203, 246, -130, -251, 132, 58, 30, 204, -136, 175, 99, -9, 5, -276, 14, -160, 158, 252, 125, 107, -5, -142, 60, 40, -11, 0, 248, 101, -190, 148, -64, 7, -89, -84, 109, -104, 161, -198, 143, -127, 55, -114, -41, 16, -24, 241, 63, -323, 197, 144, -197, 6, 171, 49, 95, 104, 9, -170, -157, -109, 194, 53, 275, 184, -73, 16, -258, -167, -46, 24, 27, 134, -98, -82, -140, -23, -44, 19, 74, 46, 139, -258, -19, 276, -41, -178, -76]
7649g6K37l26j26L02J44J33l40j56L32o8j89R5M3l8j8J00n2K53j62j00N0j42k3
7672a27J00K31NJ01k00O1m75J3K76r2K06j7P7k72J42N0N2k70N7J88l28L28j97
7695i1J72l5j85J66lQ4L3j74j74Q8Q8j1j4K36L0l55L20j64K26k85K12m18M43j61
7719B8N7l07Q7K0J26K9k51j4M80j21j38R5J0L0l4Q6l09J2m3j69M04q0j60J79p9
7744f2M1k1N3N3mp7q8J16q9K85p0K6l06n2L59n7k77K1J99p9n7K58M6j81R3k43
7770a13O1j07J99nJ31n5Q6k18k02L99j64j15K57k54R5O6j91K64L4k58L16j96J03
7793A33j44j90L88j04j93K59k33J53j02J39j4m2j70O5J02m2J63l57KL42k18j01
7815a64J86l0Q0j7rJ39j86p5M7p7L08k68J96l38K02k07M65l83J79J26k78lK66
$$ y = [-76, 161, -165, -291, 11, 155, 288, -52, -208, 124, 56, -133, -38, 5, -33, -51, 49, -3, 250, 88, -12, 38, -104, -127, -27, 204, 209, 310, 110, 171, -304, -291, -15, -107, 99, 82, 159, -113, 29, 79, 131, -139, -82, 106, -222, 106, -91, 81, 46, -139, 27, 24, 108, 141, -33, -207, -119, -31, -42, -56, 180, 210, -145, 175, 11, 237, -48, 164, -254, 189, 28, 85, -222, -135, -115, 11, 40, -211, -225, 255, 134, -4, 91, 101, 131, 97, 183, -126, -114, -157, -326, 78, -2, -162, 17, -62, -21, -42, 11, 64, 60, -17, -105, 11, -78, 207, 137, 163, -143, -195, 164, 107, -170, -149, 50, -29, -86, 172, 218, 37, 130, -113, -52, -159, 40, 35, 166, 111, 197, -21, -223, 176, 12, -103, 154, -100, -5, 61, -130, 134, 168, -90, 226, 30, 133, -11, -201, 187, 83, -110, 149, -84, 69, -33, 106, 92, 50, -120, -55, 47, 5, 168, -189, -187, 155, -63, -164, 22, -8, 72, 55, 46, 185, -1, -76, -29, -106, 202, -66, 130, -208, -6, -213, 252, -131, 48, 174, -104, -107, 159]
7838A59j99J70r0q8K05m0O0j3j25j06J47J53l67K99j72j90M10m54J68P1p9j47
7860b28J08L00j88q0nN0K40rk59K18j61k68L42l6j18p4j55K05L43n9j55M55l74
7883I2j43J38k19J2k4M23k67n8J33j67M02k95k14K82j94pJ17Nr5Q8j69K86q9k33
7907a96J74N3l41O4K17J84k72J13lJ84j34J3K9J96l17m1L89k15q9k9K14j26J44
7930B11o6j66L28n27j8L47j43j69J85k82J31L33k93L26k15L4J64j29M7m3L5O4
7952A54n05L88mO4j38l7J65j20R3n2q9J15M2l26J99l0J96oK31n54L05J02m0k78
7976a25L16l24p4K89q9N4j53O9K58j92M3L2nP7j21k32L92j81Pp2L01l39j4p3L98
8001B42j32J09M5k74J13j29J19k82K54k91K65n4k23J27L06m7l21L25j19J5Mj26
$$ y = [159, -40, 130, 40, -48, 157, 117, 177, 164, 39, -67, 80, 233, -134, 165, -7, -197, 213, -241, -73, -2, -81, -228, -120, 180, -8, -88, -93, -43, 197, 188, -71, 147, -14, -282, 60, 24, -94, -168, -323, -118, 225, 166, 11, 466, 92, -51, 87, -132, -120, -144, 279, 12, -46, 87, -80, 322, 27, -187, 95, -99, -106, 11, 16, -79, 9, -160, 126, 37, -196, -22, 31, -310, -246, -29, 155, -117, -4, -7, 177, 43, 56, 85, 281, -36, -77, 312, 97, 8, -21, 193, 67, 211, 145, -21, 307, -220, -238, 109, -34, -203, -18, -300, -169, 164, -129, 197, -18, 16, 180, 51, 98, 55, 90, 154, -351, 37, 33, 97, -41, -78, 87, -33, 60, 8, -81, 34, 76, -250, -51, -81, 115, 109, 340, -214, 91, 193, 153, -125, 191, -133, -207, 82, -7, 47, -106, -37, 221, 29, 72, 104, 99, 176, 55, -177, 215, 34, 41, -31, 270, -69, -83, -156, 242, 110, 219, 264, -10, 103, -26, 93, -189, 65, -226, 39, -15, -238, -111, 195, 148, -173, 152, 33, 48, 52, -74]
8023g4J30m4J19j48q5Q2Q8N8k6k39J00L3j64L48J03k41J56l77J98K45m56N21k79
8046D8O7J54j10j03j7r5o5R5k03L57m83L94j80K84P5k3m49J97Q8j24O7K42j01
8069A15N2n0k46J20J55j27R1j63K25k48L1M10k32j80k00J78k01J65J24J46k93
8090a28Q8j09k4J4J9K85Pj75R8L2r7R4k72K13J8R0k09J79r9j9r5R4j60J69N6l6
8116C3j09J59J11m63N9o7K56M40m64J61l07K09j51J73l19L79r2L2j08J81p4l32
8138b93N30k43J08p8N8k19K09q3J81l06K64p8k30R9R1j71R6p2K82j84j62L30m7
8161H2q2O6j9j04j3K71k56J01o7J81k72L35j95O9n4j47J86l56K71q2M4j86M16
8184A89mL2k47r5L37l06R9
$$ y = [-74, 56, 12, 131, -17, -102, -20, 68, 126, 100, -139, -39, -6, -170, 178, 281, 40, 196, -181, 17, 262, -194, 327, 48, 115, 269, 159, 56, 39, -56, -121, -26, -229, 128, -355, 39, -141, 143, 218, 195, -254, -57, 31, -93, -26, 216, 115, 167, 117, -129, -9, 146, 19, 110, -53, 172, -76, -45, 365, 133, -47, -247, -69, -270, -105, 19, 165, -128, -40, -149, -173, -159, -140, 145, 152, -23, 75, 107, 10, 104, -168, 45, 63, 153, -56, 123, 24, 5, -90, 4, -156, 13, 69, 33, -76, 83, 194, -269, -210, -277, -21, 419, -45, 116, -191, 18, -133, 40, -279, 100, 8, 40, -68, 113, 39, -293, 237, -6, 102, 24, 82, -137, 72, -11, 170, -136, 128, 50, -180, -81, 10, -161, -65, -137, 145, -39, -201, 129, 82, 0, 66, 47, -57, -70, 201, -55, 46, -21, 160, -112, 223, 28, 97, 43, -104, 82, -274, -3, -85, -41, -227, 189, 185, 217, -30, -125, 212, -94, 5]
8191E
$$ Imaginary data points
##PAGE= N=2
##DATA TABLE= (X++(I..I)), XYDATA
0@%%%%%%%%%%Qj6J6j6K4l2M0m8N6p2Q8j04J21j45J76k08K40k78L24l73M29m92
32b62N59o33P18q13R16j028J150j286J438j604J784j981K198k432K686k968L276
49A718l613L985m393M842n339N892o513P215q009Q920r980J1224j2714J4540j6837
64i062J9837k3962L0063m0241O1865j94768L0075N2760M2613J56559l6742J14553
76B03550p8065L500j63909r656j17661J785Q8049p9690J81608O263J26392j6365
88A45801o0235J6643j36225L2551j34412P941p917O6076Q0440M6116P2834p0690
100E8923R2392j03126m7597l3960j15629R0180m7757O7742R435R8875J1245J9095
112I9818N743j09080K4349q4542J8032l0896k7075P8603M115J04459n9416P2445
$$ y = [0, 0, 0, 0, 0, 0, 0, 0, 0, 0, 0, 8, -8, 8, -8, 16, -16, 24, -24, 32, -40, 48, -56, 65, -80, 96, -112, 128, -150, 174, -199, 230, -262, 297, -336, 382, -431, 485, -543, 607, -679, 759, -845, 939, -1042, 1156, -1276, 1410, -1558, 1718, -1895, 2090, -2303, 2539, -2800, 3092, -3421, 3794, -4215, 4705, -5275, 5949, -6765, 7775, -9062, 10775, -13187, 16876, -23365, 38500, -156268, -126193, -73433, -30820, 125739, 88997, 203550, 125485, 128985, -34924, -44580, -162241, -160456, -72407, -152097, 29511, 35774, 162166, 145801, 85566, 102209, -34016, -1465, -135877, -127936, -135853, -69777, 10663, 56779, 129613, 58923, 151315, 48189, 592, -33368, -148997, -58817, -106574, -38832, -29397, 69478, 80723, 99818, 105561, -3519, 20830, -63712, -45680, -76576, -103651, -25048, -20933, 83526, 24110, 96555]
124I6555m2741k2722q289p8847J2771n2066P2784j6949L8320L1820N3P3180q6650
137A7219K6209o8970l814m63k7023L9809m2191Q9340k3576M3560j4251j3907J6959
150C8901n6827K5467o4343K8739K910L896M1892m3676P4522l8779L4912m1468
162F146p034r478k7068M0053m4891L9227r041K4279J9885l6262M2712m5953L3049
175B5624m3791J0024r785r069L8860l3243L7267k8217L5852l549j5711J4973l7173
188a7938K6744l1879J8346j3296R20L3236k3699L4190l6353L7472k2829J81m971
201A24k1685J8489j7457K5634j6439M827K2511j0600K3494l8027K7954k9350R649
214h76j0744q896J2837o053L1643j6337Q455K344q93O161l1924J3101k2920J7129
$$ y = [96555, 53814, 31092, 22803, -56044, -43273, -95339, -22555, -39504, -1184, 30636, 30689, 103869, 17219, 43428, -25542, -29356, -29819, -56842, -17033, -59224, 30116, 6540, 50100, 35849, 21942, 38901, -17926, 7541, -56802, -28063, -25153, -21257, 20635, -23041, 51481, 12702, 47614, 6146, -888, -10366, -37434, 2619, -42272, -3045, -12086, 12193, 32078, -4184, 38528, -7425, 25624, -18167, -8143, -17928, -26997, 11863, -21380, 15887, -12330, 23522, 19973, 4262, 19235, -17938, 8806, -23073, -4727, -18023, -17103, 16133, -7566, 26624, -9729, 27743, 4914, 5095, 124, -21561, -3072, -20529, 5105, -11334, -6507, 16004, 5404, 28898, -9129, 18825, -10525, -876, -11620, -20516, -7679, -13732, 17911, 1574, 10029, 12373, 11480, 17641, -14283, -1182, -24102, -6973]
228f973j871K634P462k571L1119k2040P870k1447N186m443j1419O635j0328J9858
242c28P308Q859k797j1772K0028k2592N745k8749J3038n253J3136Q000p020J3340
256A0943K245Q511j3605j9020N620j0445J2297j5147J6098l976J9544R483j2428
269A0120j738j1118R288j5136q595j603O112J7886K178Q069j0954M758O271j3889
283A649q067j7375J6754m483J2241l569P366P054O408k284j6778r353N107k964
297h294N79j1485J7265K253K0028n174n326j0879K803n08j2372q417O536J0325
311b666R907n98M213l790N902l709j2090j4776M27J3457J016K45J227R612M871
326A3248K979j0231j0647o760O692k989k597j912J6318N420N777p492j081o971
$$ y = [-6973, -8844, -6210, 1252, -1319, 29800, 7760, 15630, -5817, -631, -5074, -16493, -9858, -20186, -328, 6980, 15839, 13042, 1270, 21298, -1294, 4451, -24298, -11260, -16513, -3377, 4623, -2397, 10943, 13188, 21699, 8094, -10926, -5306, -15751, -3454, -18601, -2503, -6479, 13065, 22548, 10120, 8382, -2736, 6552, -8584, -17179, -18782, -12670, 5216, 7394, 15463, 4509, 9267, 15538, 1649, -6418, -23793, -7039, -11522, 719, -2850, 4516, 11570, 17978, 15694, -1084, -10437, -5330, -8294, -7715, -19200, -1935, 318, 20346, 15172, 9846, -1033, 1770, 1262, -11110, -19527, -12991, -2666, 7241, 6643, 10856, 7066, 12968, 9259, -2831, -17607, -17180, -3723, -2707, -2462, -1235, 8377, 13248, 16227, 5996, -4651, -11411, -4719, -7708, -10305, -12217, 4101, 9521, 15298, 7806, 6725, -246]
340b46L820r983p486o246J6292P396P393o147M901k482J500q177p383r258O763
355i343O924R38j560R801M990K034q809n640o537R91K352m435j668L872J7013
370A0923R52j009p110p86m457l394m091l063K246J3267J087L358m907J0637q049
385E604j926j3712r9j573P656N796j049l03R702L28k554j1607K485p153L288l897
401i014M600J159Q306P783m984m668k053K637o720q014J2J721Q534O757L514l293
417F277l53K647q869m224r834R775l048P086m49O077K460N062l704j1115m655
432f867J839k192K801o410J2930k652J3633l878j538p243j39j103j1178J014K210
447h773Q778M491n61P272p857Q147q235n754j0371q31J1385l952R206k641J1223
$$ y = [-246, 3574, -6409, -13895, -20141, -3849, 3547, 10940, 4793, 9694, 7212, 8712, 535, -6848, -16106, -9343, -2419, -1481, -3041, 6760, 11750, 13784, 4975, -665, -7202, -6211, -3859, -8294, -9962, -6090, 10923, 11875, 10866, 3756, 2970, -1487, -4881, -8972, -12035, -9789, 3478, 4565, 7923, 3016, 13653, 5604, 3678, -10034, -10133, -11706, -4050, 1746, 697, 394, 10096, 10424, 7870, -3737, -1252, -8405, -5117, -9014, -4414, -3255, 5051, 12834, 7850, 3182, 1129, 3766, -2954, -10968, -10956, -9235, -701, 6056, 9570, 6277, 5924, 8571, -298, -4522, -14356, -4581, -7629, -543, -992, 5085, 7545, 12607, 8903, -2212, -6867, -5028, -7220, -4419, -10829, 2101, -551, 13082, 9204, 7666, 423, 284, -819, -11997, -10983, -8773, 5, 4496, 3935, 11207, 3350, 11497, 3262, -2492, -12863, -13694, -2309, -6261, 2945, 304, 11527]
462A1527l135J239m436j2180K749m033K533l618J738J5487l195J0055j1575N161
476H317j1274M255o585q243L364L428J1516m65J869N389o871M761j4782J550j0719
491a4490Q570K024O54L180L774J1151q203Q11p911n796J604l597L088m955J0911
506H15M665L722j081n571O154j3335M299j1296L764j293J0708L007l888Q176k063
521F783J850o404q416K136q512J1794p034J1728o887J2997N40q577J749q077M109
536b21p702K802j13j743J4937o796J0495j2231N466j016p544Q34r032J2630q973
551h207J4531m151j554Q706p178M501j3454L582q60j509P046r175J5561j1426
565c587J5320q598k996o10k957M987j0795Q002o07J747Q141q439P656j1764J0220
$$ y = [11527, 8392, 9631, 5195, -6985, -4236, -8269, -5736, -9354, -7616, 7871, 4676, 14731, 3156, 8317, -2957, 1298, -5287, -13530, -10166, -6738, 4778, 4313, 6182, 11571, 4700, 9461, -5321, -3771, -14490, -5920, -3896, -3242, -62, 3712, 14863, 6660, 7471, -440, -6236, -4632, -8229, -5141, -10096, 815, 5480, 9202, 8121, 2550, 8704, -4631, -332, -11628, -7864, -9157, 1551, 4558, 670, 8846, 6783, 8633, 2229, -6187, -4051, -12563, -769, -7803, 3925, -2962, 10035, 10575, 1998, 3747, -4330, -221, -7923, -5121, -5234, -6977, 7960, 1164, 11659, -572, 4894, 3878, -3666, -2832, -11864, 766, -8207, 6324, 2173, 619, 9325, 2147, 6648, -6806, -3224, -4084, -5593, 1453, -7722, 7839, -3587, 11733, 3135, 139, -471, -3428, 1559, -9236, -1234, -1841, -94, 8047, -392, 7264, -4500, 5720]
580E720q904J157m636K172R270q646R858n423K276M22k356j430q459R531m706
595d154O033l563K373N899o421O956j1771N356p564P715k509m017Q117j451N403
610F402m862L18j363l814N739j1298R734r933J5245k885j587K744m150M667q610
625c653K654n510M19P608m115Q479r211J2583n531j434k262p172P159q331J0429
640B112o797M271M873J234K431j0434N567p520J634j238m282Q984n639J5304r130
655A370M418l812J773j818r472L670m882O821K480Q05M254n971J2306j1417J880
670B405r291K763O35l187O876l772Q502J1L439l730p844N849p764K661o844M640
686d651L897J880Q334p137M747o795M310p699m543J887j88O266j057M268J073
$$ y = [5720, -3184, -2027, -6663, -4491, 4779, -3867, 5991, 568, 2844, 3266, 910, -520, -8979, 552, -4154, 1879, -1684, 689, 6588, 167, 7123, -4648, 708, -6856, 859, -1650, -5667, 2450, 999, 6402, 1540, 1858, 495, -3319, 2420, -8878, 856, -9077, 6168, 3283, 1696, 4440, 290, 4957, -3653, -999, -6509, -6090, 1518, -2597, 5882, -3329, 9254, 3723, 2289, 27, -7145, 14, -8317, 2112, -4685, -414, 4459, 5693, 8124, -2310, 3257, -4263, -2629, -3867, -8149, 835, -4804, 10500, 1370, 5788, 1976, 3749, 1931, -7541, -3871, -8753, -1932, 548, 1353, 5607, -364, 11942, 525, 2405, -6886, -4123, -3488, -6675, 201, -3571, 4931, 4942, 8381, 4651, -3193, 2656, -5108, -2447, -9291, -4651, -754, 1126, 9460, 2323, 7070, 275, 4585, -3114, -7657, -5770, -5958, 308, -749, 3519, 4592]
701D592P8M771r973M96q817P125m180K575J093K507N597k66K192o403k858J193
717b78m531M16m909R085p47N852M2j81k13l133J726r423j8m85M782K165j9N396
735E527j591K221k359l844l063l823O036n654N623j826P722m66M63P0n157k35
751c56k245j261j381j350Q731k169O363l993L632m252j585j426m590J257K41M079
767c05L84N31N343k656J345m726m18l682m59K605j658L683J84N715k811q3r75
784B017k301j804j590k71N57J724M527j158K384k325L365n760j37l049J64l77
800d034K975J752R78J051K251k465j674l000J665l596J599n2K481M00K992J254
816D577k603j108m67j206k793j77J552J255J837J969O9r8j212N13m724l95r38
$$ y = [4592, 4670, 9441, -532, -36, -8853, -1728, -5908, -3333, -2240, 267, 5864, 5598, 7790, 1387, -1471, -278, -4809, -4393, -9302, -217, -964, 4888, 4930, 4749, 4536, 1403, 3129, -6294, -6312, -6797, -2015, 150, 131, 5527, 3936, 6157, 3798, -46, -3109, -6932, -896, -6550, -927, -2753, 4969, 4503, 4966, 5036, -121, -356, -2601, -3862, -5243, -6593, 2138, -31, 6332, 2339, 5971, 1719, 134, -1292, -5882, -4625, -4384, -305, 79, 610, 5953, 3297, 4642, -84, -502, -4184, -4643, -2038, -3696, -13, 171, 5886, 3075, 2992, 2017, -284, -2088, -3678, -3949, -3392, -1668, 2859, 1701, 4085, 1760, 5125, -635, -772, -3821, -3657, -4034, -1059, 693, 1671, 2722, 4973, 2508, 834, -2166, -501, -4097, -2498, -2550, -69, 331, 3323, 4577, 1974, 866, 399, -807, -3600, -3777, -2225, -970, 867, 2836, 2905, 2807, 1595, 2108, -2616, -3011, -3949]
833c949K835j007K920N49J709n7M95l094j563k040K203k781K133M64L788o69J774
850C710j696j038j711L01k017j245L26L907M84P33N17O41j229n90j959k725n32
867d123K368J465k40J851J693J192k188l00l837Q6p30J451j556J581K227L070
883D010j451J62j822j93k681P24k612R06P21M978p99P60p08J240k312j653k241
900b971l28j73L214O03J47R09K820r91k006k134j196o88L59Q12l89K085K374K227
918D674k612q86j343m03j657l54n66J378J638L711j903P48j273J682l907n55j810
935c438R63L53K873K06N67K16K363k817j642k411J379j750J490L48R13J941J400
952B954P20k804j066K0j145r80r89J865O70K338J753j736J86j621J309l829j49
$$ y = [-3949, -1114, -2121, 799, 1348, 3057, 3000, 3495, 401, -1162, -3202, -999, -3780, -1647, -1183, 2605, 1936, 3710, 2014, 976, -735, -434, -2451, -3696, -3370, 537, 1021, 1754, 2271, 2912, 1683, 1093, -866, -3591, -4123, -1755, -290, -530, 1321, 3014, 4206, 2018, 1718, -2119, -2033, -2763, -1312, -2868, -1287, 940, 4010, 2559, 2721, 899, 706, -1975, -1251, -3863, -2957, -2236, 2742, 1943, 2703, 1995, 3235, 923, -730, -2971, -3299, -3472, -258, 345, 492, 1401, 4221, 3230, 1224, -910, -2106, -2794, -2435, -1623, -2012, 73, 2447, 4674, 2062, 1176, -167, -570, -2227, -2581, -3147, -1769, -131, 3580, 1677, 2425, 1152, 2834, -1073, -1628, -3438, -2475, -2122, 751, 957, 1524, 1740, 4103, 1286, -356, -2767, -1388, -3138, -1648, -1300, -387, 1554, 2954, 3674, 870, -196, -176, -1321, -2301, -3290, -1425, -755, 1583, 3336, 1600, 1786, 165, 1474, -2355, -2504]
969b504o67J995P04J362J153J03n28J464l432r02j976K584j754J714J71J989J01
986A577J623j114j821j496M75j382k01j21K723N03J378J47j11j669l44r59j800
1003b592j49R77J956j02J754K00K03j138k18j921j353K93J094j43J018P24K350
1020B953k097J823k715J09k259J156j089K10J320K225J27L45p21O71l407J127
1036b22k224P18l50J909J161l11J196L44l55j921q79l63j689J676K68J140O24
1053G22R99J191k724J304k442L38k222J213K32P70J771R07l30Q9r05K76l349Q17
1071a343j714J873k78K540l2Q83J96K7j768j727o49O24j051J243R95J438P2J400
1089B729q79j584n50o28q11q90J297J97K016L43J173n43r58k88j246j715l1O35
$$ y = [-2504, -3171, -1176, -472, 890, 2043, 2146, 1618, 3082, -350, -1252, -3228, -644, -2398, -684, -513, 1476, 1577, 3200, 2086, 265, -1231, -756, -2138, -2339, -2460, 263, 766, 2144, 2291, 2180, 511, 167, -792, -2592, -2741, -1764, 192, 90, 1844, 2044, 2247, 1109, 891, -1030, -2383, -2090, -996, -1139, -121, 603, 2953, 856, 2679, -36, 73, -2186, -1030, -2119, -1909, -589, 1636, 1763, 2108, 1387, 2058, -1349, -222, -2446, -1728, -2078, -169, 992, 681, 1877, 2221, 1866, -55, -934, -1297, -2986, -1310, -1042, 98, 722, 1721, 2912, 188, 1492, -950, -612, -2834, -1621, -1389, -619, 1152, 2059, 1729, 1818, 913, 1189, -2160, -1343, -3057, -1184, -1462, 1078, 1046, 1929, 2125, 2152, 384, -1343, -1992, -1368, -2419, -1176, -181, 1257, 1329, 2729, 1850, 266, -284, -912, -1723, -2613, -1316, -1119, 897, 1240, 2413, 1870, 912, 624, -622, -2337, -2368, -1733]
1107a733J584m19K421r37J748j462O69k730j198P1Q49l01M63J693J298o70J443
1124B789k503M31k259J034j545K3J157J128J259k72R38p91j150K01k202l45n29
1141b636J940M05K75J921m26Q15k359Q43k617L86P5L00O0P15J624M38o27L92j749
1160b25K66k029J448j684J070N44K131j1m55N80n93j420j73j461R38m91K234l52
1178C17R08J82N08p03j525k15p82j54M52P93J03O00J382L5j129p17n48k22j162
1197a877J111q02J529O13J749j585K98n26l6j647j46J1L68K93J844m91P52q22
1215F36J340k671N3p82K61J06M40J024O5Q97J91n20r67q32O44j548J59O95Q97
1234H8N67J30J204j359L7j220N84j757N0R42N10M94J070k02M99j451J037k594
$$ y = [-1733, -149, -568, 1853, 916, 2664, 1202, 1871, -859, -2057, -1986, -1137, -1438, -975, 718, 2016, 1346, 2789, 286, 717, -1542, -508, -2053, -2030, -873, 255, 1514, 1242, 2180, 1389, 239, 440, -1762, -2107, -2636, -696, -291, -16, 1905, 1479, 2294, -65, 778, -1839, -1453, -1378, -1078, -1018, -303, 1321, 1759, 1132, 1524, -225, 41, -1988, -540, -2224, -1154, -610, 1521, 1510, 1055, 1635, 1042, -378, -551, -2012, -1074, -1565, 669, 317, 1225, 1407, 1915, 1212, -313, -528, -1310, -1464, -1012, -219, -116, 484, 1866, 1901, 772, 55, -493, -715, -1877, -766, -1568, -39, 574, 2323, 738, 1036, 510, 474, -1173, -1319, -1308, -940, -647, 1197, 706, 1458, 636, 1976, -695, -642, -1424, -1163, -1057, -617, 407, 472, 1369, 1560, 1040, 73, -759, -115, -1663, -1504, -809, 88, 655, 785, 1989, 630, 667, -553, 31, -1726, -1676, -734, -224, 270, 1340, 1138, 1637, 186, 1223, -1371]
1252a371N65p08J045m90J073J101K23n1j18j139m28j221J094j493J139K52J622
1269A095k01L48J84j064n23m57m47m88L33J135M03N59N86N5o11j145J45j253J61
1288a185m15J465k31J201K76J052j313k59q16o97o41P95n96R97M97J595p02K96
1306A319o38m24j213j30l93J85O70J087K48K95N9O67j271o81r36k64j48O07J155
1325A94j47J065J97J49j131l0r65n05l62N87M50M12R46J201j295L38o88p9j716
1344a379J51k0O59M3J489J60Q7m10K34j544j79q97N86k90R71O53L29N69j9m65
1364G28q59k31l62m17l76J078L90M66P68L27q58m07l55j84j037N21k02R86K34
1383B10Q66K0M25j025l39j110k20j40P58l43J227M36M28p20M46o49n40r35O69
$$ y = [-1371, -806, -1514, -469, -959, 114, 1215, 1438, 1387, 1269, 130, -298, -1519, -425, -1918, -779, -527, 1095, 894, 1242, 1426, 362, -161, -618, -1065, -1553, -1220, -85, 318, 877, 1463, 1518, 907, -238, -93, -1346, -1185, -1600, -135, -366, 835, 1111, 2163, 850, 591, -225, -922, -1563, -768, -1364, -367, 130, 1725, 1023, 1319, 681, 257, -956, -1086, -1479, -1294, -624, 463, 711, 1006, 1065, 1732, 461, -220, -1156, -1420, -1568, -961, 194, 47, 1112, 1309, 1458, 327, 297, -668, -1173, -1535, -948, -498, -86, 860, 2061, 766, 1104, 416, 337, -1379, -1228, -1248, -589, -546, 943, 1103, 1190, 780, 1014, -530, -709, -1606, -1020, -1310, -339, 314, 643, 1212, 1193, 728, -131, -362, -724, -1141, -1517, -439, -49, 417, 1185, 1512, 654, 247, -108, -292, -1329, -808, -1010, -24, 210, 1076, 1096, 1521, 496, 157, -953, -1173, -1313, -555, -898, 329, 765, 1193, 473, 919, 270, -270, -1205, -536]
1402e36o95M68P32J028l87J74M4m65q51J90m20o62P63M31K05N44K69J36n48o97
1422b77R8r81N07k34Q81l95J027j2N93r65N30r36p48j36P70l07N77Q2J112q61
1442C25Q11m26r50o69m3l3N46J52R91m78L84L3L95j148k72l02j75pL10R37J01
1463D82K06J5l2q04J42p04Ql48R39k00Q13P1P36r64K24l08o42q39N55L19M41j79
1485f9J207m37J20m28K09j401l7J35J54k52J170L37L49k51J19j001o01j68Mp9
1505i20M23L69P72Q3K88R6q02k28p13n0p38R35K87Q45j44O40l57j90m69k54r12
1526a039K08k33R75k96J196k61L86l63K70r87q24m7K03l07R94K70J236o63M8l99
1546C67m67j13l87j28n18R80N00M81L82k57L0m06p05l19n48N12j13J304k64P55
$$ y = [-536, -1231, -763, -31, 997, 610, 784, 828, 363, -488, -298, -718, -1380, -617, -186, 19, 563, 832, 968, 420, -277, -179, -1160, -653, -887, -6, -401, 626, 614, 1207, 242, 772, -164, -912, -1048, -278, -585, -8, 74, 1186, 325, 1136, 710, -240, -909, -952, -985, -439, -287, 704, 226, 610, 643, 1038, -110, -382, -684, -859, -866, -556, 381, 482, 688, 703, 671, -133, 9, -695, -687, -1035, -96, -296, 517, 588, 1324, 360, 584, 276, -366, -1205, -650, -331, 110, -69, 1138, 701, 821, 393, 602, -799, -836, -701, -547, -799, 371, 708, 1057, 806, 925, -76, -677, -845, -841, -920, -497, -128, 644, 727, 1015, 1111, 309, 81, -632, -682, -1420, -485, -198, 647, 503, 1143, 786, 596, 127, -127, -1039, -831, -1064, -89, -385, 811, 550, 936, 573, 843, -144, -968, -1015, -812, -1119, -125, 145, 1381, 718, 766, 367, -100, -213, -600, -728, -1246, -266, 234, 715, 1097, 840, 870, 464, -241, -560, -1108, -596, -709, 595, 331, 1086]
1566A086K30l26p46l37m85k97j46O38k67R12J77P85l51k92m79m85m34K16k21M60
1586c62J6J179J17J18l60l92o21l21k1n38O26J67O98K79J93K45n10o67m38k52
1606h44j0n5P62Q0N57L78J42o35P4o84m21n64N55J49O59K72P28k81m6m32n45m16
1628e77j56P1K42j80J261q4L60n26K67n12n23m6m69L01K5Q47L46k74N36j91o55
1649F3k53l64nn25R38J24M99n2Q45p72k93j05n20n90L94l5O74l38J191j64k10
1670E02l05K10o27m38P3J77k72J072P1K37k01O9k15m26k96j86k90M01N10J78K56
1691E00L40Q5o49j82l50m56k77O19J0M93K71M56k86l11k75L08r64J5k82O78J38
1712a19O26M02q0m60N6l20o30k82K90m17J243j76P72o61L33Q2o08o60q9P3j54
$$ y = [1086, 1316, 990, 244, -93, -578, -875, -1021, -383, -650, 262, 439, 1224, 873, 581, 102, -383, -817, -601, -822, -362, -346, 833, 950, 1068, 708, 316, -305, -626, -647, -1185, -559, -392, 306, 585, 778, 1023, 513, -154, -592, -844, -854, -909, -147, -67, 490, 868, 1010, 375, 449, -235, -656, -1220, -665, -516, 143, 415, 1143, 862, 816, 384, -161, -577, -733, -662, -420, -600, 661, 577, 937, 411, 678, 166, -357, -403, -872, -571, -546, 301, 647, 373, 909, 718, 63, -190, -554, -559, -1084, -146, -22, 477, 425, 1270, 498, 205, 100, -420, -1010, -616, -651, 23, -315, 876, 712, 502, 197, 407, -220, -658, -585, -408, -680, 392, 463, 700, 499, 568, 353, -73, -369, -555, -845, -444, 66, 244, 500, 840, 925, 276, 94, -256, -712, -989, -370, -360, 133, 404, 860, 574, 263, -12, 296, -668, -653, -935, -257, -119, 507, 909, 829, 369, 425, 105, -525, -807, -517, -934, 309, 133, 905, 244, 577, 659, 51, -609, -698, -625, -779]
1733g79K83P66N1L09K37k95o50m99J27k68Mr6J152j40M01p9M51q15j12l79k81
1754f12j27L67K58M23q1Q48o32m1l63k85p31K29J45K63J49P99j52J99k54m4q05
1775d47m8k2j42L4M34N30N4M07k92j23n73l91N6j45OQ40j13M28R3M9k01m43m32
1798d41K65m99N25l25N86K5Q94m59n1k91k51p61J39r7L40l8J001N1K48l22j14
1819D25m75m50j50L29m55J62P94P24k64k29L21q32k65K2k4n47N88M68L51l35O26
1840G84m31k29o97L58p15N95l95R58l68R30L7j48p69k8k77k81j91Q04o9J98L70
1861D36O92o41J9m13j29p14K18p0K81L39L60L83k01l6k85k40p92M70l36K46M10
1882cP32l85L99K5k20p98K93n80kj18M06J91P22L0M05r87j10k84j96o25O67l3
$$ y = [-779, -496, 270, 321, 630, 867, 572, -78, -577, -450, -718, -714, -810, 342, 202, 603, 524, 975, 160, 48, -331, -612, -739, -372, -114, 309, 228, 1076, 444, 403, 40, -245, -976, -747, -602, -339, -190, 609, 457, 656, 402, 358, -447, -495, -517, -659, -625, -191, 339, 393, 800, 508, 385, -188, -579, -523, -668, -662, 178, 65, 493, 586, 635, 434, -9, -441, -176, -675, -150, -475, 111, 136, 1030, 571, 520, 229, -22, -783, -644, -741, -401, -439, 562, 613, 861, 539, 425, -50, -500, -650, -321, -776, -614, 180, 904, 640, 411, 732, -100, -365, -343, -367, -914, -326, 142, 493, 158, 784, 353, 124, -573, -215, -930, -335, -730, 228, -140, 790, 827, 679, -90, -118, -395, -676, -867, -63, -132, 66, 436, 1128, 487, 506, 93, -36, -750, -532, -602, -321, 18, 378, 761, 560, 524, 239, -1, -793, -323, -659, -413, -3, 729, 344, 743, 768, 548, -250, 43, -537, -539, -657, -251, -60, 662, 692, 1097, 110, 0, -284, -480, -1105, -438, -471]
1904d71M78K50O48l80J34o28j31p03J59J38R4l1Q19M11k57J86l9n78n51m67K5
1925h94jM57O95J00K72k9L41p74k15m04k44n12J077J09O15K5K17j83l07o44L47
1946D8j089N55j90N49K03M34L60j88m92K11o84j76l31L40k30O45M80K06r8r1o
1967D56m40n45k47K29k79O96M94n8M11O7n85Pl91J2r01L52L74M32K11M63q8m9
1989F21r07M02o91j46j10N16J72K61N20R2l40n8m35j76o00M86q5q5M80O90j14
2010D93P3J83o01k80k75j22JO5O30M95k21K03j30p2n59k79q5k40J5O71J85L32
2032D82K45J85p06Q6n29l3p81Q38m7M60J71M25l37Q1n33M3n13J07l75M53J78L24
2054B24L34j60P7q0m64n10L46l45K92J78O76j33Q6J15M9r69J37m15J33N2M04J36
$$ y = [-471, 7, 257, 905, 525, 659, 31, -100, -803, -644, -506, -412, -443, 376, 787, 530, 716, 677, 99, -452, -919, -894, -895, -438, 257, 357, 629, 600, 941, 167, -48, -452, -696, -1208, -131, -22, 593, 618, 835, 652, 345, -299, 48, -1041, -486, -676, -127, 76, 510, 870, 682, 190, 401, -283, -459, -790, -450, -680, -35, 445, 651, 553, 462, 456, 16, -529, -776, -547, -826, -130, 364, 306, 717, 784, 199, 206, -185, -173, -1074, -722, -348, 84, 295, 758, 670, 621, -286, 116, -575, -721, -831, -315, -143, 118, 638, 730, 390, 332, -103, -279, -879, -393, -478, -563, -83, 607, 493, 566, 749, 148, -132, -407, -529, -528, -463, 167, 662, 441, 644, 514, 442, -117, -396, -481, -721, -706, -35, 150, 482, 727, 912, 206, 292, -237, -270, -1051, -213, -260, 200, 371, 796, 459, 540, 7, 50, -463, -356, -731, -278, -100, 224, 558, 398, 475, 395, -69, -579, -233, -578, -286, -108, 568, 435, 521, 636, 685, -284, -147, -562, -429, -377, 27, 163]
2076A63L6J16L51m97l4m33R4n00J54L27L19L06L62k84O4l48J22p65q3J49K12l23
2098d92Q75j64L54k31r3r5m16k96l9K02R1M26J79J38j4L41r72K94p40K47k60M25
2120b40p7O05J67J34j00r1p67L93q87M15k10O81L61k0J75q7m23J54n99J68n86
2141h34M25R9l0M56L51K42k49l9n27k11l51L96k20L30N26K21j49J1l18J4m22q4
2163c63k34J26J87M29K17L51l3k08o86M0k32p4q2L43K20K64K29N52p16j19m28
2184b17O7o02K65J09L24J90L63K03k94k12p5m86j94P4N2J36K06O36o1K00k09r5
2206C80o47Mj94j57O5P25K7N60k43K49q42L14o23Ol06J37J58O03p1K28j49q6p1
2229F7j60o48J95J96M80m79O91L06j78N9k48l69l79Nm8J31L80K43K71J80m06M11
$$ y = [163, 199, 315, 666, 169, 135, -298, -204, -704, -550, -223, 96, 402, 764, 480, 544, 196, 318, -447, -530, -381, -169, -492, 383, 219, 573, 342, 249, 154, -262, -558, -597, -395, -304, 122, 301, 439, 425, 766, -206, 88, -652, -405, -665, -240, -317, 288, 455, 589, 489, 398, -369, 24, -863, -448, -658, 23, 384, 364, 539, 452, 29, 183, -416, -248, -834, -409, -310, -340, 116, 467, 709, 460, 421, -106, -317, -668, -272, -492, -162, 364, 585, 436, 447, 129, 143, -279, -363, -597, -471, -284, 145, 362, 713, 680, 472, -214, -174, -406, -480, -562, -219, 1, 265, 494, 1046, 330, 211, -217, -150, -752, -487, -378, -54, 136, 499, 702, 408, 196, 121, -365, -559, -485, -433, -297, -91, 545, 484, 684, 475, 380, -267, -263, -457, -614, -549, 176, 203, 763, 520, 769, -73, 241, -382, -376, -682, -545, -387, 216, 145, 373, 224, 138, 67, -93, -741, -546, -350, 130, -349, 342, 648, 470, 529, 281, -88, -467, -462, -510, -379, 1, 244, 515, 695, 289, 700]
2251G00p27m03Q3k6k49K62M19J99J8M26l12k90k99K0n40L54J20N08k83M15J19
2272E14J70l80l72m21m1K19p5J91N79J28L27l76k52Kn11k05r7K86R5J29J65O86
2294G61m99K73k99l09o15k2N04p3J4O50o2K75j32qo47J08o05M06k43O02Q6J14
2316B79M14J11m81l27k64J93o86K22j66Q99l81Q37N4j01l43j75o83m3N02j06Q5
2337a60M05K61K93j92k25j83o59J80k37J02K2P35N3K91k97J41o16q9l70K56j07
2358c96M99j35K54R6M59n77P0l53J0m21j28J10L08K51L60K75p9m9l53m31k02j14
2380e46K46J4L13K66K90k25K60j70m15m79K34j93j34O10L8L23k23K22j0l29l40
2401b48l6l96L41J32L95r0N56k88j6o37J73k02n37M27K87J90J36J51R7l34L42
$$ y = [700, -27, -430, -347, -373, -622, -360, 59, 258, 276, 702, 390, 100, -199, -179, -719, -365, -245, 263, -20, 395, 514, 684, 304, -68, -489, -530, -311, -386, -195, 384, 512, 839, 463, 211, 213, -298, -503, -600, -314, -219, -90, 75, 761, 262, 535, 236, -73, -688, -710, -206, -279, -265, 385, 323, 598, 466, 458, -189, -81, -686, -280, -523, 79, 165, 279, 693, 804, 323, -4, -268, -75, -761, -539, -705, 194, -187, 650, 704, 603, 260, 85, -598, -641, -139, -245, -160, 245, 506, 799, 607, 382, 199, -460, -280, -517, -415, -393, 342, 395, 686, 389, 530, -86, -175, -545, -289, -396, 103, -32, 222, 318, 777, 200, 270, -83, -73, -494, -622, -512, -204, 47, 407, 682, 603, 554, 201, -230, -432, -546, -300, -286, 27, 293, 583, 358, 618, 448, 33, -446, -212, -405, -539, 71, 109, 432, 209, 431, 421, 92, -248, -284, -680, -339, -207, 188, 98, 654, 366, 350, -287, -114, -316, -853, -426, -139, 51, 187, 338, 435, 101, 443]
2422D43m41k71q1l92M32J11N74j93L33k06Q7l8m39k90O3k6M8M04K18l0K07k11
2444C02L6o57J8j35m5r9O28k49M61K2Nm88k8J70l45l27M65K2M98K13J14o3l17
2467B01m7k25l49J49l02L15M46qM63m78j26j6j96l84L18r5P7K2N39k53M07m6k54
2490A58l32l4n0K6K1R7L0N98m47O61m15l07j09j58k93N18l93J37L14M87q3O4n04
2513a4k9k51J7K9r1M2L82N2L00K36m91J11n63p8r7k1J15M02J44L31j93L2n1k91
2537B3o87L61k79K59J33N69l5O3L4op27J68rm39J25L98J72L94RL6k86k83J38j20
2561A1o56M24P4l3O23j01m0J6j64k42j63l07r5L92K14L74N4j29R0K20o87n73N66
2584a32m62J49K63L94j56O43l22k00k71m7Nj24j27L9K89R7M49l1j20k54J57n27
$$ y = [443, 2, -269, -350, -742, -310, -199, 375, 182, 515, 309, 396, 358, -81, -371, -308, -334, -286, 118, 336, 306, 513, 302, 338, -319, -301, -436, -481, -580, 48, -201, 260, 282, 287, -201, -229, -59, -404, -731, -266, -244, 254, 467, 581, 518, 201, 154, -71, -420, -271, -573, -258, 188, 180, 643, 165, 39, 23, -173, -557, -239, -334, -257, -235, 304, 51, 458, 412, 158, -174, -208, -258, -232, -211, -114, -84, 514, 67, 728, 313, 6, -103, -261, -554, -36, -429, -292, 22, 509, 426, 490, -14, -43, -294, -277, -248, -339, -297, 85, 137, 437, 673, 182, 293, -270, -348, -445, -466, -351, 51, 195, 526, 333, 365, 314, 23, -664, -303, -582, -323, -190, 379, 344, 407, 441, 435, -292, -124, -133, -572, -447, -49, 123, 517, 526, 562, 276, -7, 131, 11, -645, -221, -147, -180, 443, 342, 302, 318, 154, -88, -251, -558, -653, -261, -47, 327, 381, 252, 342, 562, -125, -698, -132, -594, -445, -182, 212, 56, 699, 377, 177, -94, -141, -136, -260, -387, -348, -59, 38, 487, 456, 336, 82, 239, -288]
2606b88O2k80K29q8L41L51K2rj64K3k26l68N3M8L35J70J24k07K14ok13m23j62
2629d62P5L10m39M67M14j31K0J41N6l43l40J03j56j48M27l24L25N30q2k5m64K
2651d4n7j72j32OK46L28K33j72M6Q8n59k88L6Q0J55LL36mJ80l42M37n06N4j79
2675b27K5n34O21J69O62m94J24k78l4k93J08m9m72N64J5K13J95j76O2l2m9k33
2697a13l84P1J40K78K15J22L4m01M5O5k65J67k38p9l3K32K05M70l24Lj36O9o74
2720e31M25k27k4J42L54j67J10J79J5n57K38l28k2J41J86P2K16K46l5j49j11m02
2742b29m5k34L25K01k24M94k6j00J62k44L2m16j82K73N0K0L01L22k14N0j47K12
2764C81o71k15J33J49J02K80J40k8j17J79k19ll04m8l40L42L62j57L35j95L3Q8
$$ y = [-288, -226, -506, -277, -365, -24, 327, 349, 340, 176, 199, -27, -395, -342, -294, 41, 211, 335, 128, 342, 336, 123, -300, -462, -387, -77, -516, -49, 365, 234, 254, 395, 451, 108, -232, -129, -285, -433, -6, -330, -5, 525, 443, 418, -46, -44, -101, -273, -405, -399, -153, 175, 408, 236, 282, 370, -189, -477, -441, -361, -206, -203, 133, 129, 309, -33, 404, -102, -48, -227, -202, -736, -115, 54, 716, 222, 346, 68, 34, -259, -151, -200, -672, -108, -93, 120, 315, 139, 201, 169, 120, -113, -497, -426, -286, -8, 207, 329, 363, -38, 7, 72, -193, -26, -264, -343, -376, -144, 61, 531, 207, 210, 74, 143, -531, -106, -333, -357, -215, 139, -28, 82, 261, 276, -281, -43, -371, -393, -252, -66, 6, 222, 468, 433, 284, 173, -229, -274, -508, -183, 18, -206, 288, 262, 162, 324, 80, 112, -304, -486, -213, -163, -143, 158, 480, 266, 316, 169, 381, -290, -505, -372, -223, -121, 159, 299, 271, 154, 333, 114, 111, -193, -241, -581, -239, 123, -34, 301, 106, 139, 227]
2786B27k14j53j93J81j88J44j07K93J19K06j24J60k93j91j60LK43j23L72K7K25
2807D54k7k45J00l57j81r5K0K84Q9K69j37K66n8k05j59l83M3L32k0N9j31M78j4
2830C82j49k32Nk98%Q2P4J19j3L45k08J52k32J65m51J27k30L62RN9PM3j0nm3r8
2856c8l18K59j50j1K44M14l14J58K42O8p50r8K00j91l6M69k08K49K71o1j44k37
2878A8o3j55l4J43m2J89k11K69L63l48J67k03k84j02M0lK57R9N8Q3r9J8j48j67
2902a55K3l8Q7J13N1L4J29k45L80m67J72q1k13l3K02j55K9K59O0j32J19j53N1
2925C7k10k12L39J72Rq7L77k34pj89J9l48N8j13K22j34N42Q4k47N6o9m60M45m36
2949c86K07j69M03K5O6J4o8j06j19O2oj21J8J20L39k07J92P9k86p3J6Lk59k84
$$ y = [227, 13, -140, -333, -152, -340, -196, -303, -10, 109, 315, 191, 351, 58, -133, -293, -290, -47, -170, 202, 229, 454, 427, 182, 282, -75, -256, -351, -331, -47, 42, 311, 174, 440, 382, 177, 18, -365, -322, 10, -10, 49, -82, 396, 382, 233, 1, 6, -292, -292, -210, -136, -17, -30, 315, 107, 259, 27, 192, -259, -132, -362, 0, 9, 68, 75, 118, 108, 103, 60, -38, -356, -97, -247, -258, -14, 400, 86, 244, 486, 554, -196, -294, -94, -285, -321, 148, -60, 189, 460, 399, 255, 18, -45, -200, -234, -91, -133, 56, -155, 114, 477, 129, 296, 93, -191, -293, -253, -256, 1, 100, 158, 241, 142, 160, 12, -155, -132, -170, -83, 30, 81, 115, 244, -1, 379, -88, 84, 3, -210, -243, -41, -196, -167, 92, 152, 20, 139, -14, 37, -173, -385, -46, 126, 135, 48, 425, 191, 184, -5, 14, -334, -276, -389, -167, -301, 241, 325, 78, 134, 65, -395, 50, -386, -179, -348, 55, 80, 146, 160, 92, -14, -133, -71, -77, -198, -180, -60, 279, 72, 264, 343, 57, -16, 0, 3, -256, -540]
2973e40O08N6r3K53J28k45l21N58n37J34l82L68n9J11J97n2Mk8j84K24n73K95
2995g8jl53M11K68l09K47O1K76m22j85m30M57k44N12k66K93L6Nj4k25l03P9J01
3018h4l98M88n2K35j75L92n37K61N2k55j74J92r0L9J55L43nk12j91L11l06J4l47
3041c44L15j61J76pK0L97j09k78P0k25mj33K59J86l42L42o2J71l42n0J8O3k32
3064b72L04P8j93L84J23n57K11k59O3M5l80J39K40j49N73Lp0k43pj57k16J84P8
3087g8J19K02q9k00J8K44K6l78k26M00k63Q5J32k25L64j84M48l66J82j49j89J34
3109Gk67J17K57J06l18L27j06j1j32M1k97K71l36L66K50j52J87o32O98l65K19
3130B30k81J90m20N6K35N1R3M40j83n9k67r3j45R3r3R6L81J4k23J45j67pK45p91
$$ y = [-540, 68, 124, 31, 284, 412, 167, -154, 404, -133, 1, -381, -13, -72, 39, 236, 184, 188, 160, -24, 200, -373, -78, -79, -432, -21, 247, -62, 185, 246, 522, 100, -85, -515, -58, -302, 210, -56, 237, 273, 278, 264, 39, -264, -185, -84, -482, 6, -46, 189, 14, 406, -131, 130, 182, -73, -247, -55, -145, -106, 49, 392, 387, 175, -16, 295, -11, 3, -344, -29, -190, -14, -21, -1, 396, 287, 9, 79, -146, -150, -283, -24, 162, -180, 162, 100, 271, -71, -121, -103, -40, -272, 32, 110, -83, 301, 424, -133, 78, -181, -118, -73, -453, -314, -74, -223, 350, 353, 283, 40, 33, -124, -340, -156, -78, 41, 243, 154, -46, -28, 216, 242, -136, -362, 38, -225, -140, -8, -233, 131, -53, 395, 29, 211, 62, -127, 7, -260, -143, 114, 220, -98, 229, 123, 112, -20, 21, -276, -5, -341, 25, 275, 123, 310, -322, 376, 11, 230, -51, 139, -281, -225, 10, 61, 154, 594, 411, 352, 85, -8, -153, -60, -153, -57, 324, 338, 115, 260, 93, 86, 331, -460]
3154d60J57qJ49M35j01j12L76n28K00j15R4j52nj86N3K52j7K89n58L04j52l23
3176d08L65j31l79L79M87k42K78m45J41k90qj9r8L5L15m57Q34m7J47l60j97J44
3198D4l34P5J23j1K95j98J19L6O4M3m9k68l10J1J19J69j86L92m0L07l99J65o7
3221A00p8n01L55k27N97l77M27j27n6J69o2k86k76J23O4J14K0J89J14o7K79m98
3243dl9Qk06K22r1L4M7J31Q3O9k37R2l63L67j49k2O6n5M54l25O7k3j81n3Q8n1
3269g1O6r9J40R7m25M92o0r7l01L58j27j53J34J29q3N2j44K24qKj35k59j09K57
3293a20Q4J41j64J18J9q7N7O4j43%P1j39J4K84RL4j97k2K85o60K20o0J57j28L64
3318B01k7J83j68k02J56j26L5k68J8K09MJ47j79J52l7K15k68j77J40L3k85J97
$$ y = [-460, -303, -311, -162, 273, 172, 60, 436, -92, 108, -7, 87, -65, -70, -256, -203, 49, 32, 321, -237, 67, -85, -408, -43, -174, -553, -174, 313, 71, 349, -96, 45, -245, -253, -272, -370, -335, -20, -477, 357, 310, 457, 97, -100, 44, -290, -215, -92, -103, 192, -6, 113, 149, 213, 256, 207, -61, -371, -360, -241, -72, -258, 134, 94, 401, 2, 167, 100, 22, -479, -124, -351, 246, -131, 296, 169, 113, 282, 220, -66, -342, -219, -155, -41, -21, 168, 282, 215, 494, -4, -43, -35, -241, -19, -110, -76, -29, 102, 185, 254, 17, 109, -254, 113, -36, -58, 8, -47, 407, 82, 149, 126, -55, -108, -20, -71, -5, -104, 36, 133, -292, 200, 140, 43, -258, 100, -27, -180, -46, 83, 0, 52, -92, 132, 124, 126, -9, -268, -377, -120, -36, 105, -59, 59, 78, -9, 48, 112, -31, -31, 40, -99, -85, 199, 208, 242, 45, 23, 308, -352, -132, -192, -35, -163, 201, 174, 357, 189, -13, 143, 17, 52, -216, -198, 11, 15, 162, -17, 135, 98, 313, 45, -132, 8, 41, -244, -47]
3340d7J3o9J68k61J00N0j24J77J23r8m98O90j10r3L41l19m5p5oN4Kj03P6K52j91
3365GJ7o5k3K27l18J02o6l15L55J0q4M06j82j33R0l0N1r6O5P8J14J38l41j02J88
3390I3k05J67j80j81J79J48j92K56j42K60j31n6O9k70k35K15j05K69l1M60m61
3411g3K90o0n6m51K29J34l3r3L10j53J01K57k15l94J01L27k86j52N0L74p5L2j07
3434E7J49o1j91j83j4J06K03n0j34O7K18k46J84j09O6l63K05j01O1J59K86l12
3456cK71m59K56k6j30N1j53j09j09N88k13M38l61J53k65J15j80K53k46L9j03K05
3478A2lL1m02M99k68K19j22k19J78j61M1R5K52KK2l50Q8L8J42m02j0M28j84J32
3502E8N0Qj03j26J18O5m4n3J87n7l4o5K48k45l5K38l33O3k10l2K47L76k74n6J14
$$ y = [-47, -34, -103, 65, -196, -96, -46, -170, 7, 130, 32, -466, 224, 114, 21, 362, 43, -2, -77, -83, -29, -27, -130, -54, 198, 7, 24, -41, -64, 163, -155, -53, -119, -434, -79, -69, -153, 253, 71, -62, 28, -2, 49, -47, 18, 96, 210, 348, 7, -95, 93, -112, 55, -125, -306, -127, 21, -171, 85, -57, 203, 72, 16, 85, -185, -420, -205, -310, -41, -72, 388, -73, 217, 157, 101, -350, -121, 13, -20, -113, 197, 44, 145, 402, 187, -207, -106, 221, -65, -217, -167, 207, 132, 164, 57, 206, 145, -46, -229, -243, -137, 66, 16, -118, -51, 167, -79, 105, -4, 62, -301, -96, -197, -136, 23, 309, -3, 268, -191, 65, 39, -91, -40, -193, -302, -411, 177, -36, 402, 41, 194, -71, 44, -136, 117, -129, -90, -193, 12, 9, 40, -362, 137, -131, 88, -34, -253, -75, -236, -195, -100, 152, 154, 176, -174, -86, -48, 94, -308, -318, 110, -74, 58, 108, 116, 13, -113, 5, 70, 26, -27, 160, 103, 69, 4, 252, 7, -28, 210, -123, -60, -270, -302, -55, 321, 47, -9, 105]
3527A05j78Qq9J90l00J74Q3J7R7n6O7J8J4k19P7l13P5K01q2J42J0K01n7j38l93
3552c46L60j09n2J08j73M48N7k83R3j99J19l45K9K79k2r5j36K31L36Q2n97L88
3574A73l44o1L09k13j11j64K42N72j67r5j64o7p6K4J38o1K01J2lj96k9M39k72
3597H7k64P1K66m13K82Q2k44p2O3K01k24J90l90J44K20k34K39p8J94L0j19K49
3619B80l11K85l31l31O01k59k07M77j39J49k43M0m5K2k33n0R2L29j18K25O2j89
3641A06O2l12L26l80J74P0k19N40o0l23j45o8L78n2j20o0n3L9J63k58K54K63l40
3664a5K47J4k38N0k07M45l75L00j64K15l29J27P8k06j71O7K98j46j25K47J82j67
3686A27r1l5J03n52K70J45k82J13J48L7J74j49L2K1j00p8R4k3k0J71k0l56L45
$$ y = [105, -73, -65, -154, 36, -264, -90, -7, 10, 107, 51, 118, 136, 150, -69, 8, -305, -230, -29, -111, 31, 41, 242, 185, 47, -346, 14, -95, -147, -39, -212, 236, 293, 10, 103, -96, 23, -322, -293, -14, -36, -131, -267, -36, 300, 382, -215, 173, -171, -232, 77, -136, -247, -411, -169, 403, 236, 141, -23, -90, -166, -142, -4, -65, 136, 148, 145, -51, -80, 359, 87, -177, -106, 160, -253, 29, 111, -133, -205, -142, 59, -165, 25, -365, -221, -1, -235, 4, -74, 120, 150, 31, 280, -31, 254, -77, -408, 193, -66, -273, 204, 65, 214, -29, 11, -34, -12, -245, -295, -203, 126, 8, 233, 295, 106, 168, -144, 182, -198, -24, 46, -173, 367, 307, -16, -161, -229, 149, 97, -23, -83, -136, -97, 66, -192, 62, 325, -15, 232, 246, 8, 58, -149, 296, -79, 221, 57, 272, -57, 70, 148, -58, -229, -162, 136, -10, -135, 112, 294, 127, 36, 1, 104, -448, -178, -33, -315, -202, -54, -17, 157, 8, 40, 61, -39, -117, -23, -46, -66, 105, 85, -271, 74]
3709G4k1p9j33J32q4K33l41J55J92k05L41l80K56o0k25r7N3M5O3n1L68j23lK32
3733C42m65J16j19m7L4K90j10jJ68l2j24k0m7k56K91j63K81L8j72K43l05k03L80
3756A19k9l37M8K14J24j00J95j87J20J22l31J31k52J1L9J48l78N39k43j87K23
3777a1R1j60m4K18k43R3J0J74N3l4k1k9j60l9R7M4l11Q74m17j75K6j8J15j31K5
3802B7K59l82o6j23L12j96J96M28k59k52Pk44J02J45pJ12k35N62k57j74J69J17
3824B41m31K56j4k85M34k76j8J70j81J79JJ04j56J05l2l85K45J38j56K36K41k51
3846A65n2q3l0K38k70O6J1q9K34J52l74J80m0K16l31k77M0K03j32K61R3l10J41
3869A2L6K2p6j96L60k94L19j00J28m1l43K42l8m4k31J39R3J29q0rJ77j91j1J20
$$ y = [74, 53, -26, -159, -27, -111, 122, -219, -64, 128, -77, 264, -116, 140, 80, -145, -242, -189, -144, -81, -132, 236, 113, 110, 342, -123, -7, -126, -173, -139, 151, 41, 40, 208, 176, 52, 32, -15, -271, 20, -143, 138, 176, 4, 247, -58, -261, 119, 90, -247, -199, 15, 139, 39, 234, 47, 167, 289, -42, 89, -163, -152, -113, 35, -343, 196, -47, -234, -11, 80, -80, -124, 94, -149, -56, -46, 128, 181, 147, 126, 97, -63, -102, -5, 39, -272, 602, 185, 10, 36, 18, 133, 2, 27, 286, -96, -162, -285, 27, -169, 27, 455, 196, -56, -49, -293, -191, -46, -53, 59, -176, 386, 129, -45, 124, 241, -190, 66, 52, -233, 201, -75, -93, 77, -104, 75, 76, 180, 24, 129, 97, -288, -43, 95, -61, 175, 416, 165, 113, 30, 0, 238, -32, 34, 45, -44, 190, 342, -32, 148, 108, 324, -7, -284, -244, -41, -173, 88, 181, -129, 12, 48, 70, -6, -202, 158, -136, 183, 83, 211, 170, -173, 69, 31, -13, -244, -105, -12, 117, 37, 28, 205, 14, 3, 123]
3893A23r6k14J68j6k32K08K03J62k99M4K06j41m5Lj44Q4j04j54L41j3q5M7m8L58
3917C56j76J21k61j78J59K34k76Q3K4n3j74j74L30j45mJ1J02p4K12j36j00n3K12
3940D0m03N62l00j44K22R1J43o9j42j56K20k86K47n9j93L27n5j11P9J21j45P6
3962F5J47o9j19K19m55K93Qm02L69N8Q6O2j28l15k0N6P0P0R8K67l51J4R3l47J93
3987c8j08K47k05J86l46L38k55R8K48l4k90L1o2J64K18pJ77m59N9m2J9p9J44n0
4011d6l34K57K97K3k49L06j13n2k9k01J59M3o5M8l8J12k41P6J11R2m52J64L35
4034B03k57N7k54J82J01qK30k5k63m2Q1l0r9J48p6J21J96m20K70j35k18Q7K5Q3
4058d3j67o1K85J79Nj13J15l50j03K82j89KJ27l8j09J88J03O8j39r9j30L28r1
$$ y = [123, 27, -187, -19, -35, -267, -59, 144, 306, 7, 51, 257, 116, 71, 74, -70, 14, -90, -244, 97, 84, -1, 46, -2, 356, 180, 301, 40, -138, 21, 255, -21, 62, 86, 33, -141, -315, 15, -130, -134, -123, -21, -95, 117, -19, -119, -172, 40, -363, 199, -101, -245, -23, 68, 211, 142, 0, -156, 64, -222, 25, -34, -227, 100, 45, -66, 13, 134, -11, 65, 212, 143, 24, 243, -212, 81, 89, -313, 56, 114, 200, 262, 134, -181, -201, -145, -75, -5, 93, 360, 9, 23, 116, -231, -38, -146, 101, -104, 82, -264, 74, -181, -83, 165, 131, -159, -128, -190, -26, 192, 185, 362, -97, -38, -80, -61, -140, 4, -46, -380, -123, 174, 197, -52, 254, 141, 89, 60, -141, 18, 61, -4, 44, 6, 118, -123, -47, 64, 156, -296, -132, 203, -54, 3, -251, -69, 32, 24, 254, 229, -34, -76, 5, -25, -124, 24, -52, 69, 265, -155, 115, -20, -238, -151, -126, -43, -210, -271, 14, 193, 198, 85, 200, -150, -253, 29, -160, -158, -31, -69, -178, 10, 113, 181, 42, -57, -187, 141, 50]
4081E0Q6q0QK19p1m7j19n7j72J46N1%j28J31j85L35K6p4j07K22o8j76K11q4l40
4106b23K76o2jj15R5k2j69Qj26L17j21K29q6J78k45J20k06L75m05K91j50J58o7
4129D9k52M44o6J3j51j14K63k8m19J74l0J15J20M7j19Q7j05p7p0kJ60j17jJ80
4153A01P2k34K15k27R3j78K70j92j68J9L91J82j35l80N1o0O8K30j89M8j65J85
4175cKK75m54L68m93M95l42L26k77k1J71J70j27j54R4J15k00k47J36R7k70M57
4197A18n0P1K15l19k42r3L54j89O8q9K79l1j36OL08k46J16j56k03M7J53Q8k09
4220a40M89k75O3R3j63r7j61J56q1j27K93K9K91k93j43k4J99j51k3j19L9K47K5
4243A27O8j14j4J26l22P8m1j00P3o3N18m07K36j13J8j91L00l38k6k2O5L05J2K37
$$ y = [50, 136, 56, 64, 283, 212, 165, 46, -11, -183, -37, 14, 14, -114, 17, -168, 167, 193, 119, 12, 234, 166, -10, 201, 117, -223, 53, -9, -10, -125, -30, -52, -221, -213, -339, -22, -143, 86, 0, 178, -67, 53, -153, 222, -183, 108, -42, 116, 49, -203, 241, 175, 188, 37, -77, 186, 158, -261, -87, -117, -2, 118, 165, 46, 133, 28, -49, -119, -121, 39, -78, -79, 101, 173, -61, 154, -73, 20, -158, 112, -80, -248, -229, 162, 344, 209, -171, -120, -180, -112, 118, -71, -23, -188, -3, -1, 274, -180, 188, -305, 190, -152, 174, -103, -124, 47, 217, 90, -64, 30, 145, -55, -302, -166, -69, -339, 118, 68, 139, 354, 35, -207, -300, 54, -135, -67, -156, 123, 92, -44, -38, 270, 24, 140, -16, -219, -172, -19, 69, -140, 349, 74, 137, 230, 67, -30, -191, -35, -116, -243, 50, 79, 370, 77, -66, -90, 109, -42, -65, -184, -145, 102, 127, 195, 81, 67, 193, -129, -51, -92, -192, -119, -182, 336, -71, 165, 52, 70, -121, 179, -159, -185, -207, -142, 163, 175, 412]
4267D12l38R6l78K62j76J31J28k28p7L1J32J84l24K2M1P2m4l59M32M8k20K47L4
4290A28o5k8r7J44k46L05k09M0QK00M3k17K8K00l18J26J4K3j49K97j64j90K99
4313A72j22oJj14j00J30K18l89R9j2J09J7L1L56l28J15l09J11l27M13j81J22R0
4336I6j21j87M62N8r8l37L6N1p1J16O0j16N2k3J98j97j61J75p2L23l39L36n2n2
4360A37p8j43o0J73k98J44N8J71l30L86n3ol61J66J22j78O1O9l3K1J90L7k98P
4384i6J65J61j83J7j85M44m89K39J81L0n2k31K4j33K2J85j56p1L44k74O7r3K57
4407A73o5m17J94J50k06J19L84l30o8j85M27k57o1J87n51N30M2J34J8p1O7k84
4429g0n6R2O7j0k61M01j59n4r0J69J68j60L4l19K62J9k32P2l8J64K49j42j35L5
$$ y = [412, 74, 170, -208, 54, -122, 9, 137, -91, -168, -137, -5, 179, -145, -123, -82, -10, -54, -413, 19, 67, -153, 94, 128, 63, 35, -62, 82, -164, 141, -68, -28, -20, 180, 223, 6, 34, 234, -84, 42, 56, 79, -70, 227, 63, -127, 172, 50, 44, 45, -69, -169, -39, 179, -210, -111, -123, -14, 3, 34, 390, 62, 177, -132, -21, -348, 65, -116, 6, 96, -25, -212, 250, 308, 210, -127, -91, -40, -111, 5, 65, -51, 1, -22, 176, -21, -182, -7, -79, 244, -95, 241, 189, 137, 59, -84, -144, 29, -269, -125, -67, 104, -226, 160, 107, 101, -260, -94, 28, -150, -89, -20, -53, -32, 158, 195, -103, -96, 69, 230, 47, 64, -121, 323, -166, 73, 254, 284, 232, 1, 25, -108, -86, 99, -57, -128, 216, -58, 9, -84, 173, 108, -309, -115, 35, -171, -52, 332, 2, -66, -251, 176, -81, -142, 45, -506, 24, 66, 200, 218, 147, 214, -70, -126, -34, 33, 23, -238, 163, 4, -50, -140, 29, 197, 37, 71, -248, 14, 33, -199, -127, -165, -1, 248, 106, -29, 6]
4453Fj65O2J38j21Q1L9l0J27j08M32l94J39m85L22n8r5K95j11k04J3L01j90j52
4476a58M05m03J95j48M7l4J10J92j55N6n6n3L4J0l94M72j28K6J2K09P7j00l22
4499a06p1M1J39k03R7OJ86J00N5j89j51R0k5l10K43o6K95Ll24O04k12J35n71L26
4523I2j85M0q5N2J12p0L37Qk27k62K41k67P3j72j6R1J99J45j19K62k69J27q7j91
4547a71Q7J28Qj04J03O0n3m7K22m86J96q0l41N08J05q3K51m52M42k65q0k07L2
4570b27O3K44j73J7o4M06j80l2l9J03j49p2N9j7K72N7j14o5K4j63K41p30K92R3
4594a54j25L28jJ25r7J38j98j5L2j05j57N33m78J33m8K86p2J51q0l84K13k06J06
4617g5j4r4M8O7L46k49k77J81j82K91j18J57l06J65J12q8OQ3J7j43J5K58j56j78
$$ y = [6, -159, -97, 41, -80, 1, 40, 10, 137, 29, 461, 67, 206, -279, 43, -15, -110, 185, 74, -130, -117, 184, -6, -158, 247, -156, 39, -109, -62, -96, 14, 206, 51, 107, 51, -2, 32, 42, -352, 120, -8, 18, 30, 239, 316, 216, -106, -177, -136, 3, -200, -103, -97, 89, 189, 244, 55, -96, -6, -31, -341, -98, -164, 131, 134, -190, 414, 202, 337, -234, 92, -93, -53, -138, -86, 26, -44, 293, 301, 74, -188, 53, -214, -141, -313, -329, -238, -39, 106, -13, 249, -20, 107, 20, -171, -84, 44, 52, -52, 51, 111, 58, 11, 233, -253, -57, -137, -478, 30, 135, 52, 303, -149, 293, 28, -52, -259, -227, -164, 80, -93, -76, -140, 266, 86, 54, 15, 118, -31, -103, -44, -61, 211, 268, 154, 89, 113, -50, 191, -539, -247, -154, -279, 49, 48, 173, 76, 214, 16, 1, 33, -72, -229, 304, -174, -41, -89, 197, 125, 276, 196, -188, 25, -181, -75, -89, -183, -135, -68, 278, 29, -248, -67, -249, 42, -76, 81, -225, -60, 52, -36, -30, 53, 70, -73, -58, 200, 44, -134]
4641a34M20k55j75L42q9j66K13n01L02J12k41J89J61l24J49O2m23N54n06J93r9
4662b16K1O0J35O4J25K1m25L76j44k58L11j39k19J02K21L6l4J71k5j78L7k37N14
4685C19m37j59K32J54J2j9o7L4K27k37j16q3J57L52j93L6j39j60J65J66p2r3k52
4708a73J64J40k30K18M2l14k6J79O7K4M7j05o2N9Kl9Q3P3q6j36j15q9J51J8J28
4733B0K44m57K15K3j38l14K71mj81J49J93r7N7K07j74k20J41o0K79j22q7q6L50
4756B09J4l4j35j94jk2K04jk31J45J35q9Q9j46J66J34R6k32r2j95R5J23q6J84
4780A36k6L0R3k03l2k17K17o8k72N20l35p1L92j06j04JN7o6J01j22J7J53j05J25
4804A15k30J78n0J3l34K60j57J3M83k1k0K1r4j77r5O7O8k46J8N6L9N07n85J89
$$ y = [-134, 286, 31, -144, 198, 109, -57, 156, -345, -43, 69, -172, 17, 178, -146, 3, 65, -358, 196, -310, -117, -216, -195, -135, 0, 64, 189, 210, -215, 161, 17, -241, 70, -69, -288, -186, 35, 71, 37, 208, 183, 5, 42, -195, 319, -118, -277, -45, 109, 121, 102, 35, 69, 296, 59, -57, -140, 17, 369, 176, 212, 73, -87, 78, 244, 172, 79, -173, -9, 131, -99, 119, 161, -153, -179, 0, 67, 91, 138, 33, -29, 30, 32, -7, 76, 149, 63, -73, -188, -277, -126, -108, 20, 264, -193, 22, 45, -93, -407, -136, -140, -321, -172, 21, -76, -19, 188, 14, -206, -65, -125, 154, 32, -55, -141, 209, 223, 189, 54, -140, -141, -163, 41, 40, -191, -46, 89, 0, 89, -57, 109, 243, 339, 107, 15, -180, -85, 38, -48, 136, 110, 140, 233, 30, -2, -219, -2, -70, -342, 178, -157, -228, 164, 58, -46, -45, 12, -54, 47, -75, -58, 95, -10, 115, -115, 63, 13, 26, -308, -48, -205, -192, 291, 270, 250, 271, 177, 0, -95, -28, 40, -206, -188, -132, -93, 414, -171, 18]
4828A8R7n9k31j72K53J75l12N28l73L56j30k96O2kJ11k72n8K53kJ00K66N4k06
4851A60n36L98O5J7k12M2J76p2j1R2n2L4l65J15P8j43K2K99k48K72n0j8N1l5J36
4876B15l74m3J92oQ1m9j13KM93o15L32j64o8l2K57K8k6M6R4j39k38L22k73N4J43
4901A19j54p3r8J79J22mo4j25J45M4k06j26M4J16K7J39q5J19Q8j56Nk8qj08M0
4926d8m2K53l86M09m6l05J48J78j91O5r6J61J2o4L24k20j1K2l60K17l11L87l22
4949b26L23M29l83j72K16m45J17K52k94L90k12j97J07M55l15j65nK60k09K6R4
4970D6j55J9J31q4L33k55j56l8J28J49l91M06p7j53L53j93j30M92m33N5j42P9
4992a6j82K03j06J64n7l0K83o4j75j18J81k27L01n9j7N8j70J08J10j42l23L35
$$ y = [18, 115, 56, -175, -347, -94, 81, -231, 297, -76, 280, 150, -146, -84, -86, 25, -247, -305, -52, -54, 46, 312, 366, 160, -376, 22, 87, 104, -108, -66, 110, 38, 27, 119, 67, 101, -264, -149, -71, -214, -192, 107, -141, 131, 81, 63, 114, 79, 215, -159, -202, -10, -16, 65, 16, -97, -95, 398, -217, 115, -49, -117, -149, 108, 136, 110, 156, 250, 111, -127, 195, -78, -24, 119, -35, -108, -206, -27, 95, 91, 27, -98, 47, 91, -115, -241, -197, -81, -54, 85, 0, 119, 207, 51, 56, 28, 20, -88, -48, -90, 163, -223, 186, 140, -165, -17, 161, -30, 35, -61, 100, 112, 48, 372, 152, 141, 163, -197, 20, -291, 96, -226, 97, 526, 143, -29, 187, -258, -141, 111, -183, 207, -5, -202, -95, 360, 45, -120, -125, 135, -74, -48, 46, -109, -90, 41, -43, 290, 35, -121, -159, -31, 118, -273, 133, 56, -97, 256, 63, -67, 425, -8, 47, -95, -16, -198, 5, -101, 63, 6, -24, 259, 195, 20, -98, 83, -144, 157, 98, 81, 139, -31, 77, 187, 45, -278, 57]
5014E7j05J02JL2L4n0J0j8m4j62j55j9L10rJ9lj36M9l1L05j84J23j47p4j62K20
5040c7LL90l71K08j57k9K8l23K19j9R5N6R2k49K21J66r2n06J04j26M30m54L10
5063d1J37l9K69l17J64j40j66J31j3O2l06K66j2l6K24j84J06k74q7K34k65J29
5085a58K13KK1QM5k32L32j05k15q5M00k47jmj4J61Pk65J14r8Q9l10J28J44K08
5110A38q7K69l05j38J05j01J29l4M0R0k9j53K41j90K70l9k1j12k6q4Qk13L50J11
5134B19j83m6r0K08j03LP6j36L7L4K08j97R0j00m9K36m10j3M9J72M3O9KO6Rk93
5160i9O0l5Q8P5K11k85p5K22Ll42M20k09j64k37J57K93r7j29K47N8K7j22k37R1
5184g9R2l93Q5N10k37K5J44M3N1k69j75K9K31j53K59n6l6K1j58K02j12j60J02
$$ y = [57, -48, 54, 55, 87, 121, 71, 81, 63, 19, -143, -298, -317, -7, -16, 3, 0, -136, -87, -118, 187, 3, 126, -21, -95, -257, -37, -34, 356, -15, 193, 36, 7, 35, -288, -69, -88, 7, 63, 155, -94, 127, 293, 201, -305, -201, -327, 103, -351, -41, 96, 57, 326, 9, 173, 33, -133, -2, -15, 47, -259, 7, -5, -41, 183, -1, 105, -169, -256, -22, -287, -158, 55, 57, 78, 86, 131, -101, 231, 126, -89, -174, 226, -21, -22, -26, -40, 121, 128, -137, -23, -121, -32, -342, -214, -70, 138, 51, 320, 15, -123, -18, -119, 10, -24, 16, 106, 77, -76, 165, -25, 245, 206, 185, 73, 47, -37, -29, -242, 108, 219, 36, -10, -100, 108, 5, 8, 84, -52, -15, 19, 227, 30, 120, 20, -29, 207, -203, -216, -167, 5, 48, 117, 119, 185, 194, -99, -39, -74, 14, 89, 300, 15, -60, 162, 165, -177, 243, 34, -130, -367, -210, 83, -14, -143, 104, 162, 189, 67, -170, -79, 13, -380, -295, 215, -22, 3, 147, 190, 241, -28, -203, -174, 57, -96, 163, 107, 71, 92, -66, 136, 24, -136, -34]
5207c4j49K27J6q4M6k1L58k73r7R8P2m67K37o6M1Q0n1J76n7j16L4Q9K2j63k24
5232c06K66m5N1L1J95k63L07k23R4O0r9j36J09K0M1k47M22p6j5j04j69J7p7k9
5256a76n3J88J64l08J94O5j58j02L1K46k49L45J03L3k14Lr2Kn5n1k13J91J75m5
5280B4Q4N0J10k79q7o7K18k6J79j36nQ6r1Q7j77j47m4K67j58L35k43J17Q2l99
5304b20L98P0j47J6j26K75j78k62J48J25j28P1J5K21k03k38j0j08K8L02K07l44
5326h8J81l65L64j49j16J43RP8LJ8J90j15j78J12j42K26k96r4J02J7r2J39K2n2
5350h3J33J95k81j21J51J17j59P6Q1q4J55j04k89K45p0J16qp9J4j91P2J3R4L1
5374B4P4k10L1K49P4k28M4k17R8O9J52M4j79j33j71L49j58j78L80k47r4M19q2
$$ y = [-34, -183, 44, 60, -24, 22, 1, 359, 86, -11, 87, 159, -308, -71, -137, -96, -16, -67, 109, 52, -64, -30, 59, 81, -82, -306, -40, -85, -34, -3, 192, -71, 236, 13, 107, 167, 68, -68, 41, 61, 102, -145, 277, 201, 186, 82, -87, -70, -147, -176, -229, -41, 123, -185, 9, 74, -84, -186, -155, 91, -158, 187, 290, 323, 109, 112, 20, 22, -33, -84, -297, -106, 69, 24, 108, 158, 268, -11, -98, -165, 53, 27, 206, 70, 65, 151, 60, 147, -30, -177, -221, 46, -112, 223, -20, 97, 179, -220, 178, 248, 101, 117, -9, 266, 88, -174, -26, 99, -29, 42, 57, 278, 75, -163, -173, -281, -253, 49, 256, -88, 93, -272, 92, -57, -173, -30, -21, 57, 60, 78, 268, 153, -25, 87, -55, 171, -125, -219, -117, -100, -192, -53, -31, -83, 50, 245, -36, -157, -6, 111, -48, 28, 109, 25, 180, 76, -213, 32, -38, 78, 70, -9, 5, -186, -114, -101, -7, 24, 98, -112, -81, 168, 242, 14, 58, -159, -61, 8, 160, 204, 25, -108, -279, 70, -88, -266, 114, -133, -227, 192, 110]
5397A10k91K45lmK06l68J15lj14P9R9J54j14l2k31Pk22M65mq5J35l99K86K37n69
5422c01L46l15J75n0l1J35K34o1k8k54J00Qp2J35p5K68l48K77l54J08O2P5j85
5445a51L26n6j18j72L32k2j31n4K16l65J94q0J83p1k01J83Q5J28k63j60K28K1
5467E2J38l26m7K30k14J94L4Q0j87J02K23k93j46LoK77k75J36J19n4J9j02R5j47
5491i5K75l54k2K94K7J33l67nK4K3M6K06Km61K49J8p6rQ9K09k16o2L27n25J22
5516a48K52j99J24oM6J2J84k94J61o3k76L18o3k15K79K8j19R6j83n0J74k36N3
5539a25J85l8j06J77p8j16K92l18K85k17j09K65M3l02m4K86k30L23k73L94n88
5560b94J97k1L36j97p8l5K27j96k33K73k58J77K70j42j10J21j05j17K66n2k02
$$ y = [110, -181, 64, 61, 57, 263, -105, 10, 7, -107, -28, 71, 225, 111, 79, -152, -145, -367, 98, 94, 9, 144, -255, 31, 268, -301, 45, -270, -95, -145, -176, -41, 193, 132, 104, -150, -50, -42, -114, 21, -54, 214, -134, 143, -211, -103, -41, 34, -151, 175, 119, 1, -171, 161, 139, 8, -46, 170, -195, -1, -81, 102, 31, -170, 13, 98, 226, -37, -197, 31, 52, 190, -136, -183, 47, -167, 27, 61, 141, -46, 56, 279, -14, -160, -157, -163, 114, -161, -25, 94, 40, 59, -43, 52, -95, 180, -174, -196, 98, 125, 258, -109, -114, -90, -67, -21, 185, 187, -274, -25, -7, -83, -92, -3, 206, -10, -72, 255, -270, -148, 104, -95, 29, 23, 69, 81, 265, -29, 132, 69, -207, 111, 48, -167, 112, 140, 21, 117, -66, -116, 58, -178, -125, 60, 22, -84, 93, 15, -101, 191, -127, 158, -59, -168, 97, 140, -162, -206, 80, -150, 173, -100, 294, -294, -97, -118, 218, 21, -57, -92, 135, -61, -294, -21, -279, -102, 168, 26, -84, 37, -68, -185, 81, 29, -173]
5581a73K70R4J13m55Q0j0RJ50j54J23M4n6rQ1q3k27J95Q6Rj8j09R2j19j05J85
5606A3p7K25k23Kk00J50K6K47k59O8j02J19m2K62k14n2O2j53K14L8J75n98L15
5629dj46O6J44j76o7K80K3k86l0j4J98k61K14l30L29K15J58l39J9q0J19q5j81
5652b34K00j45J86r3J87M6l44M42k80K79l06J92J50j73l10K67R9M4k66j90J86
5673f3J7j2K11j95m8J45J03m5k79K91k82K64k48J90p8%j69K27K0m1j20JP5N3J70
5698A87m16K24K3j33J44J06j79O5J2k49K51k09J65K45p4N6k06K95k89l4j97J30
5720h3N4JN9l4K5l4J74n4l03J75K31k20J33k85L86l25K41k56Q3lj50P0K19N7k84
5745a23%P0O9k70Q5R2k6M8O4m5q7J76j3p0J11O1j1K08j18l41J5j09K83J65k72
$$ y = [-173, 97, 191, 304, -151, -71, -81, -72, 78, -76, 47, 91, 35, 26, 107, 24, -203, -8, 78, 87, 69, -40, 52, -67, -172, 13, -64, 161, -62, -60, -260, -110, -84, 163, -96, -28, -130, -11, -53, 209, -5, -57, 5, -148, 66, 104, 279, -319, -4, -150, -84, 60, -116, -183, 97, 120, -166, -196, -210, -12, -273, -59, -389, -60, 155, 313, -26, -7, -87, 32, -53, -234, -34, -179, 7, -86, 101, 147, -197, 245, -35, 244, -62, 130, 280, 107, -203, 64, 163, 207, -59, -249, -63, -46, -58, 153, -42, -90, 55, 158, 113, -166, 125, -157, 107, -141, 49, -29, -29, -198, 29, 49, 8, -112, -111, -36, 17, 187, -229, -5, 18, -115, 29, 135, -44, 21, 33, -216, 35, -174, -9, 236, 162, 218, 12, 307, 18, -16, -213, -83, -29, -28, 31, -3, 22, -12, 162, 108, -195, -20, 211, -9, 124, -161, 225, -100, 141, -115, -32, -35, -185, -115, 104, 161, -123, -123, -53, 16, -254, -169, -77, -103, -55, 9, -36, -123, 53, 40, -30, 81, 142, 131, 339, 221, -120, -105, -214, 69, 234, -38]
5770c8J09j10m6N8j00K84k07j67K27j89J51r5K45j38o6n4M9O5p6PO6q9L4m8P3
5795e5k18K43JO2M3k82Q4k7J52J87n1k71J30J3J84k37k9L94l39p1RK63m00M0K32
5820E7n4k64J09Q8N2m8J97J8k67K45p0k03K70j11J35l41K13P3q8N9q6J01J16j28
5844G3M4q4J73k17j27k0J0K28O8k87J17q3RL1J72L7j14O4L5k04K77j21k35K32
5868G8j93M48m23K19j37K27m51L27o4j12k9j39L8J08M5j85K52J25j7l22K76m6
$$ y = [-38, 71, -39, -85, -27, -127, 157, -50, -217, 10, -179, -28, -123, 122, -16, -82, -136, -87, -22, -98, -91, -25, -114, -80, -128, -55, -273, -30, -29, 33, 76, -206, -122, -149, 3, 190, 139, -132, -2, 11, 195, -42, -71, 323, -16, -87, -78, 185, -215, -175, 57, 3, -261, -152, -64, -12, -60, 137, 155, -112, 133, 63, -140, 130, 19, 154, -187, 26, 99, 11, 70, -16, 85, 201, 73, 117, 33, 206, -11, -138, -158, -148, 80, 148, -139, -22, -105, -96, -65, 107, 144, 30, 94, 129, -75, 202, 81, -154, 78, -115, 333, -90, 129, -8, 219, -232, 95, 31, -81, -110, -249, -211, -103, -58, -243, 9, 134, 117, -205, 71, 25]
$$ [...]
8191a94
##END NTUPLES=NMR FID
##END=
