##TITLE=1H_DE-138m2_TFA
 200.13Hz, CCl4.
 8 sc
 
 15.4.2026
##JCAMPDX= 6.0         $$ Bruker NMR JCAMP-DX V2.0
##DATA TYPE= NMR FID
##DATA CLASS= NTUPLES
##ORIGIN= UXNMR, Bruker Analytische Messtechnik GmbH
##OWNER= pz
$$ XWIN-NMR		Version 3.5
$$ Wed Apr 15 16:10:39 2026 Russian Standard Time (UT+4h)  she@DPX200
##.OBSERVE FREQUENCY= 200.1313
##.OBSERVE NUCLEUS= ^1H
##.DELAY= (6, 6)
##.ACQUISITION MODE= SIMULTANEOUS
##.ACQUISITION SCHEME= undefined
##.AVERAGES= 8
##.DIGITISER RES= 18
##SPECTROMETER/DATA SYSTEM= spect
##.PULSE SEQUENCE= zg30
##.SOLVENT NAME= DMSO
##.SHIFT REFERENCE= (INTERNAL, DMSO, 0, 14.3821)
##AUDIT TRAIL= $$ (NUMBER, WHEN, WHO, WHERE, WHAT)
$$ ##TITLE= Audit trail, XWIN-NMR		Version 3.5
$$ ##JCAMPDX= 5.01
$$ ##ORIGIN= Bruker BioSpin GmbH
$$ ##OWNER= she
$$ F:/spectra/data/she/nmr/H-C/1/audita.txt
$$ ##AUDIT TRAIL=  $$ (NUMBER, WHEN, WHO, WHERE, WHAT)
(   1,<2026-04-15 16:08:41.10 +0400>,<she>,<DPX200>,
      <created by zg, POWCHK disabled, PULCHK disabled
       configuration hash MD5:
       00 E9 B6 7A A2 85 ED C7 34 08 36 98 17 FE 4E 26
       data hash MD5: 16K
       5D D5 9F 3B 8D A8 81 36 57 36 BD 6F 9D 3C E3 57>)
$$ ##END=
$$ 
$$ hash MD5
$$ 75 CF 7B 59 53 58 37 37 93 6D 75 2E F2 C3 EC 08
##$RELAX= 
##$RELAX= 
##$RELAX= 
##$RELAX= 
##$RELAX= 
##$RELAX= 
$$ Bruker specific parameters
$$ --------------------------
##$DU= <F:/spectra>
##$EXPNO= 1
##$NAME= <H-C>
##$PROCNO= 1
##$TYPE= <nmr>
##$USER= <she>
##$AMP= (0..31)
100 100 100 100 100 100 100 100 100 100 100 100 100 100 100 100 100 100 
100 100 100 100 100 100 100 100 100 100 100 100 100 100 
##$AQSEQ= 0
##$AQ_mod= 1
##$AUNM= <au_zg>
##$AUTOPOS= <>
##$BF1= 200.13
##$BF2= 200.13
##$BF3= 200.13
##$BF4= 200.13
##$BF5= 200.13
##$BF6= 200.13
##$BF7= 200.13
##$BF8= 200.13
##$BYTORDA= 1
##$CFDGTYP= 0
##$CFRGTYP= 5
##$CHEMSTR= <none>
##$CNST= (0..31)
1 1 145 1 1 1 1 1 1 1 1 1 1 1 1 1 1 1 1 1 1 1 1 1 1 1 1 1 1 1 1 1 
##$CPDPRG= <>
##$CPDPRG1= <>
##$CPDPRG2= <>
##$CPDPRG3= <>
##$CPDPRG4= <mlev>
##$CPDPRG5= <mlev>
##$CPDPRG6= <mlev>
##$CPDPRG7= <mlev>
##$CPDPRG8= <mlev>
##$CPDPRGB= <>
##$CPDPRGT= <>
##$D= (0..31)
0 0.7 0 0 0 0 0 0 0 0 0 0.03 0 0 0 0 0 0 0 0 0 0 0 0 0 0 0 0 0 0 0 0 
##$DATE= 1776254920
##$DBL= (0..7)
120 120 120 120 120 120 120 120 
##$DBP= (0..7)
150 150 150 150 150 150 150 150 
##$DBP07= 0
##$DBPNAM0= <>
##$DBPNAM1= <>
##$DBPNAM2= <>
##$DBPNAM3= <>
##$DBPNAM4= <>
##$DBPNAM5= <>
##$DBPNAM6= <>
##$DBPNAM7= <>
##$DBPOAL= (0..7)
0.5 0.5 0.5 0.5 0.5 0.5 0.5 0.5 
##$DBPOFFS= (0..7)
0 0 0 0 0 0 0 0 
##$DE= 6
##$DECBNUC= <off>
##$DECIM= 32
##$DECNUC= <off>
##$DECSTAT= 4
##$DIGMOD= 1
##$DIGTYP= 9
##$DL= (0..7)
0 120 120 120 120 120 120 120 
##$DP= (0..7)
150 150 150 150 150 150 150 150 
##$DP07= 0
##$DPNAME0= <>
##$DPNAME1= <>
##$DPNAME2= <>
##$DPNAME3= <>
##$DPNAME4= <>
##$DPNAME5= <>
##$DPNAME6= <>
##$DPNAME7= <>
##$DPOAL= (0..7)
0.5 0.5 0.5 0.5 0.5 0.5 0.5 0.5 
##$DPOFFS= (0..7)
0 0 0 0 0 0 0 0 
##$DQDMODE= 0
##$DR= 18
##$DS= 0
##$DSLIST= <SSSSSSSSSSSSSSS>
$$ [...]
##$SUBNAM0= <"">
##$SUBNAM1= <"">
##$SUBNAM2= <"">
##$SUBNAM3= <"">
##$SUBNAM4= <"">
##$SUBNAM5= <"">
##$SUBNAM6= <"">
##$SUBNAM7= <"">
##$SUBNAM8= <"">
##$SUBNAM9= <"">
##$SW= 18.0517328524113
##$SWIBOX= (0..15)
0 0 2 0 0 0 0 0 0 0 0 0 0 0 0 0 
##$SW_h= 3612.71676300578
##$TD= 16384
##$TD0= 1
##$TE= 0
##$TE2= 300
##$TE3= 300
##$TEG= 300
##$TL= (0..7)
0 120 120 120 120 120 120 120 
##$TP= (0..7)
150 150 150 150 150 150 150 150 
##$TP07= 0
##$TPNAME0= <>
##$TPNAME1= <>
##$TPNAME2= <>
##$TPNAME3= <>
##$TPNAME4= <>
##$TPNAME5= <>
##$TPNAME6= <>
##$TPNAME7= <>
##$TPOAL= (0..7)
0.5 0.5 0.5 0.5 0.5 0.5 0.5 0.5 
##$TPOFFS= (0..7)
0 0 0 0 0 0 0 0 
##$TUNHIN= 0
##$TUNHOUT= 0
##$TUNXOUT= 0
##$USERA1= <user>
##$USERA2= <user>
##$USERA3= <user>
##$USERA4= <user>
##$USERA5= <user>
##$V9= 5
##$VALIST= <valist>
##$VCLIST= <CCCCCCCCCCCCCCC>
##$VD= 0
##$VDLIST= <DDDDDDDDDDDDDDD>
##$VPLIST= <PPPPPPPPPPPPPPP>
##$VTLIST= <TTTTTTTTTTTTTTT>
##$WBST= 1024
##$WBSW= 4
##$XGAIN= (0..3)
0 0 0 0 
##$XL= 0
##$YL= 0
##$YMAX_a= 196716
##$YMIN_a= -161258
##$ZGOPTNS= <>
##$ZL1= 120
##$ZL2= 120
##$ZL3= 120
##$ZL4= 120
##$ABSF1= 10
##$ABSF2= 0
##$ABSG= 5
##$ABSL= 3
##$ALPHA= 0
##$AQORDER= 0
##$ASSFAC= 0
##$ASSFACI= 0
##$ASSFACX= 0
##$ASSWID= 0
##$AUNMP= <proc_1d>
##$AZFE= 0.1
##$AZFW= 0.1
##$BCFW= 1
##$BC_mod= 2
##$BYTORDP= 1
##$COROFFS= 0
##$CY= -3
##$DATMOD= 1
##$DC= 2
##$DFILT= <>
##$DTYPP= 0
##$F1P= 0
##$F2P= 0
##$FCOR= 0.5
##$FTSIZE= 0
##$FT_mod= 4
##$GAMMA= 1
##$GB= 0.15
##$INTBC= 1
##$INTSCL= 1
##$ISEN= 128
##$LB= 0.25
##$LEV0= 0
##$LPBIN= 0
##$MAXI= 10000
##$MC2= 0
##$MEAN= 0
##$ME_mod= 0
##$MI= 1.114404
##$NCOEF= 0
##$NC_proc= 0
##$NLEV= 6
##$NOISF1= 3.799351
##$NOISF2= 2.8
##$NSP= 1
##$NTH_PI= 0
##$NZP= 0
##$OFFSET= 14.38212
##$PC= 1
##$PHC0= -3713.992
##$PHC1= 21.99229
##$PH_mod= 1
##$PKNL= yes
##$PPARMOD= 0
##$PSCAL= 0
##$PSIGN= 0
##$REVERSE= no
##$SF= 200.129724274929
##$SI= 16384
##$SIGF1= 3
##$SIGF2= 2
##$SINO= 400
##$SIOLD= 16384
##$SREGLST= <1H.CDCl3>
##$SSB= 0
##$STSI= 0
##$STSR= 0
##$SW_p= 3205.1282051282
##$SYMM= 0
##$S_DEV= 0
##$TDeff= 0
##$TDoff= 0
##$TI= <>
##$TILT= no
##$TM1= 0
##$TM2= 0
##$TOPLEV= 0
##$USERP1= <user>
##$USERP2= <user>
##$USERP3= <user>
##$USERP4= <user>
##$USERP5= <user>
##$WDW= 1
##$XDIM= 8192
##$YMAX_p= 0
##$YMIN_p= 0
$$ End of Bruker specific parameters
$$ ---------------------------------
##NTUPLES= NMR FID
##VAR_NAME=  TIME,          FID/REAL,        FID/IMAG
##SYMBOL=    X,             R,               I
##VAR_TYPE=  INDEPENDENT,   DEPENDENT,       DEPENDENT
##VAR_FORM=  AFFN,          ASDF,            ASDF
##VAR_DIM=   8192,          8192,            8192
##UNITS=     SECONDS,       ARBITRARY UNITS, ARBITRARY UNITS
##FACTOR=    0.0002768,     1,               1
##FIRST=     0,             0,               0
##LAST=      2.2672688,     0,               0
##MIN=       0,             -161258,         0
##MAX=       2.2672688,     196716,          0
$$ Real data points
##PAGE= N=1
##DATA TABLE= (X++(R..R)), XYDATA
0@%%%%%%%%%%%%%%%%%qJ6j6J6j6J6k4L2l2L7m5N0n8O9p7Q7j00J11j23J38j56J76
39I3j94K15k39K65k95L26l60L96m36M81n29N82o41P08p83Q65r56J062j186J330
59G04j500J705j959K282k705L287m146N526q073J4210n3826k0235K01408q5748
73E0930j96079J50973J90892r7989r7920M698j148P2956O3525j59288j27940J21308
85b5082P5893r0403m1209P23J6337Q5578J5065r7455k3006O8005N2317N702m4631
98b166m1988N6434Q4776l2613p4480J9668M4800P735r771o8635n7842O1045M1158
111B8121o1360k5608K1560j058K0631K7739l6483k7584N8535L8300m2728j8307
123a8242K1387N972K6419J8027m7408j7160N1194J3517m3974l0376M499J4379
$$ plain form
0 0 0 0 0 0 0 0 0 0 0 0 0 0 0 0 0 0 0 -8 8 -8 8 -8 8 -16 16 -16 21 -24 26 -32 37 -40 47 -53 58 -65 73 -83 93
39 93 -101 114 -125 140 -155 171 -189 207 -229 252 -277 305 -336 372 -411 454 -502 560 -626 704
59 704 -796 909 -1050 1232 -1473 1814 -2332 3194 -4879 9331 -44495 -64730 136678 50930
73 50930 -145149 5824 196716 98727 807 5505 4357 77313 140838 -18450 -146390 -25082
85 -25082 50811 -39592 -80801 -80078 -63741 21837 36902 -60553 -83559 -15554 36763 42465 -2166
98 -2166 -44154 12280 97056 64443 -10037 9631 54431 62166 52395 -16240 -74082 -13037 28121
111 28121 -33239 -58847 -37287 -38345 -17714 10025 -26458 -54042 4493 42793 65 -18242
123 -18242 3145 9117 35536 53563 6155 -11005 40189 53706 9732 -20644 -16145 -1766
135a766K695j2685k1824m116K5144J2806j1208m151N290J2763J2104j0701j2464
148h113P454J5506J1459q937j9160O020J7022N25j4433j5906n46J0392J55j0122
162h684j1766J642J6021L621o150P7J312P575N976j0092n422R327P258N75r150
177B120p186P228P732k45p225q551K141N351k945l158k472K992O393k573q08K702
193A496k520L964M444q397m754N779K896m29l570l672J083O173M626r234p077
208i192R941L432p031K145J652q64M853M47n175R25M945o36p097j296J951l054
224d054J394L298o160j716N576Q06k08j97j752J932J719N03J106j5K243J434j865
241D044N01l89j27Q83m837m027M80j411J106J143m673o6M333J514k30o73J616
$$ plain form
135 -1766 929 -11756 -33580 -37696 -12552 254 -10954 -15105 -9815 2948 15052 4351 -8113
148 -8113 -659 14847 26306 17369 -1791 4229 21251 21776 7343 -8563 -9109 1283 1438 -8684
162 -8684 -20450 -18808 -2787 834 -5316 -5239 -3927 3648 9624 -468 -5890 3437 10695 11270 2120
177 2120 -5066 2162 9894 9649 2424 -6127 -3986 1365 -1580 -4738 -7210 -4218 2175 -398 -1206 1496
193 1496 -1024 2940 7384 -1013 -5767 12 2908 2479 -1091 -4763 -3680 2493 7119 -2115 -9192
208 -9192 749 4181 -2850 -705 947 83 4936 5383 208 1133 6078 5442 -1655 -2951 -1000 -4054
224 -4054 -2660 638 -5522 -7238 -1662 -856 -1064 -1261 -3013 -1081 638 1141 2247 2232 4475 5909 4044
241 4044 4545 4156 4029 4912 75 -3952 -3472 -4883 -3777 -2634 -7307 -7373 -3040 -1526 -1756 -2429 -813
258h13J745q20R60J186R03K974m32k833K682N74k218r19k884k569j170j510M89
275d655k16j792P51J207J969K646j178K74K254p59J127N77L9K468M37k430J141
292C860P54j10j245l267j438j311j525M27j543j045K073J19R61K400O45R07R37
309A599q42O99O18J38J212r11j39J757r95J97J8k256j482j615j292L59r96j026
327d957N98J58J847J481j64J720J080r84J67L43J293P01j886j21R36K90O63n43
345B622j628M09j486k140Q8n27j51o88q00J364J516J77J293P7J90J232n00L39
363A387J011j296M6K04m8J537k31j009j33r62r44j84q28n38p61n62N86O2Q40J727
383i6l92l27J210R5O93O18n93r2O77j62N43p0L92m5j885j39K19j395k43j214j263
$$ plain form
258 -813 932 112 1072 2258 3161 6135 5703 2870 5552 6126 3908 2989 105 -2464 -3634 -5144 -4655
275 -4655 -4871 -6663 -5912 -4705 -2736 -90 -1268 -994 1260 501 1628 2205 2244 4712 5149 2719 3860
292 3860 4614 4504 3259 -8 -1446 -2757 -4282 -3855 -5398 -6443 -4370 -4251 -3290 -890 -245 662 1599
309 1599 757 1456 2074 2212 3424 2513 2374 4131 3136 3333 3351 1095 -387 -2002 -3294 -2935 -3931 -4957
327 -4957 -4359 -4201 -2354 -873 -1037 683 1763 779 946 1289 2582 3283 1397 1276 2212 2502 3165 2622
345 2622 994 1403 -83 -2223 -2135 -2662 -2813 -3501 -4301 -2937 -1421 -1244 49 126 316 1548 1048 1387
363 1387 2398 1102 1148 1352 1304 2841 2610 1601 1468 506 -438 -622 -1450 -1988 -2749 -3311 -2725 -2663 -1823 -96
383 -96 -488 -815 395 490 1183 1801 1208 1116 1793 1631 2174 2104 2496 2451 566 427 646 -749 -992 -2206 -3469
404c469R71k42K53J018J32N64K16R4J495M10K7L50o72Q32Q32p36Q5Q90j459q58
424G33n21m85Q8j501j005P8p29J195L96j161J740O22o26J372P29KN80m0M81M83
444B431N42M06j534l90L9j097o95M43j654r35K24j396M94J625m47n17N49J142
462g70L44M82J223j35n0J409Pr73J740K27k348j15M8p85o40r25q25l48J83K42
482b009q23Q53P32j067M90J584n10K185o31m68J74K265r92J078L46q01p91q81
500G34M6j126k2m38k228M62J526p17l3R25q52J34J661L49o08N3K177j478J78J207
520A950J024j445P61l70j521L81Rq59r37k13k32k51L7L79M24r36M52J060l57N93
540e1n51O02J157o87Q96J039j335P16k04j199P99O00j327j684O79j44l14k38J375
$$ plain form
404 -3469 -2498 -2740 -2487 -1469 -1337 -773 -557 -463 1032 1442 1469 1819 1147 1979 2811 2075 2160 3050 1591 733
424 733 212 -273 -185 -1686 -2691 -2613 -3342 -2147 -1751 -2912 -1172 -550 -1176 196 925 927 1507 1467 1948 2431
444 2431 2973 3379 1845 1455 1494 397 -298 145 -1509 -2444 -2220 -3616 -3122 -1497 -1944 -2461 -1912 -770
462 -770 -426 56 1279 1144 1094 2503 2510 1537 3277 3504 1156 1041 1089 304 -336 -1261 -2086 -2434 -2251 -2009
482 -2009 -2832 -1979 -1247 -2314 -1824 -240 -750 1435 804 336 510 2775 1783 2861 3207 2406 1615 734
500 734 780 -346 -368 -806 -3034 -2572 -1046 -1763 -1796 -871 -1723 -1589 72 421 -187 -134 2043 565 743 1950
520 1950 2974 1529 2290 1920 399 780 789 -70 -1007 -1220 -1452 -1703 -1666 -1287 -863 -1799 -1347 -287 -644 -51
540 -51 -602 0 1157 470 1366 2405 1070 1786 1582 383 1182 1782 455 -1229 -550 -694 -1008 -1246 129
559A29r02j272J472m78j120K223L94k663J000J627J01o56J775P07r95j89J306
576B459j520n23M48j288j05J010j179K36l4q42N15n27j09J251j559j36J9J113
594g71Q55m77J325O48k96k69J076p65N7O10j359n97J15o98J125l12p78k85M1N78
614a77j689m06J312K58j290J120J184J36O30j49O60n67oJ059q71N69k88j455n33
633e03J651p21r61q44J18K3j00N49m66r13P09P99q39P97J315P0P0J127l42j1N0
654A578k51j56k88m94l72k04p2l37l72K7m47m28J010n52k31M03N11N71J73j222
674a153J404P86n93J526k20l11o97p27R63n0j090M95j507N8P32j145k70J247q31
693a383n61J34N22J274k01P3K69J02Q13J052p40j32P36j622J24N24j03m44n42
$$ plain form
559 129 -773 -2045 -573 -1051 -2171 52 446 -2217 -1217 410 511 -145 1630 2337 1342 1153 2459
576 2459 939 416 864 -424 -529 481 -698 -462 -496 -1338 -823 -1350 -1459 -208 -1767 -1903 -1884 -771
594 -771 84 -393 932 1580 1284 1015 2091 1326 1383 1993 634 37 152 -546 579 267 -511 -796 -755 -177
614 -177 -1866 -2272 -960 -702 -1992 -872 312 448 1078 929 1589 1022 1016 2075 1204 1773 1485 30 -503
633 -503 1148 427 -534 -1378 -1260 -1237 -1337 -788 -1254 -2167 -1458 -659 -1498 -701 614 684 754 1881 1539 1528 1578
654 1578 1327 1171 883 389 17 -187 -259 -596 -968 -941 -1388 -1816 -806 -1358 -1589 -1186 -675 -104 69 -1153
674 -1153 251 1037 444 1970 1750 1439 742 15 978 928 -162 333 -1174 -1116 -384 -1529 -1799 -552 -1383
693 -1383 -1944 -1810 -1288 -14 -215 -142 127 229 1042 2094 1354 1222 1958 336 460 984 881 437 -105
712a05L12o42q55M77K76q74K93j09j39R40k9L09L83n71R61P54k69K88j78m25K31
733A028j46K01l07n81j2m3j090Q65m85o44l25L54j95P96j32o9K34L37M20k08P08
754G06N25m70n81R36p6K11N8p50j17j61j20j26n25J29p20p01J50Q63j42Q6j97
775a022L03M27L35L61K75j35J0M13j55N37L94p52j01j97J20j08q26l67l31o83
795a502m9M72n45P73j50n13J164j03P17L68p34L51J97J78R20j06l40L15p09j08
815E96N12p53n15o84l60J76m99RO30o91M25K39j9R00N14k66L5L38J86O17P2j13
837A349J95o13J51O4o33j23o88q25j49K6j28p9q8M65%L89L95L98Q7L03k97K80
859D79O38k8J97j90k21L88l26k21o0r65j12k65n71KK22j98J8r0L39N39M26l2J96
$$ plain form
712 -105 207 -435 -1290 -813 -537 -1411 -1118 -1227 -1366 -426 -455 -146 237 -334 627 1381 1112 1400 1222 797 1028
733 1028 882 1083 776 195 183 140 -950 -85 -570 -1214 -1539 -1185 -1380 -584 -716 -785 -551 -214 206 -2 706
754 706 1231 761 180 1116 1040 1251 1309 559 442 281 161 35 -490 -361 -1081 -1782 -1632 -769 -911 -825 -1022
775 -1022 -719 -292 43 404 679 544 554 967 812 1349 1743 991 890 693 813 705 -121 -488 -819 -1502
795 -1502 -1551 -1079 -1624 -851 -1001 -1514 -350 -453 264 632 -102 249 446 624 1544 1438 1098 1413 704 596
815 596 1108 355 -160 -844 -1204 -1028 -1527 -1518 -888 -1579 -1154 -915 -934 -34 480 214 249 587 773 1390 1462 1349
837 1349 1544 931 1082 1146 513 390 -298 -1123 -1272 -1246 -1374 -1453 -1541 -1076 -1076 -687 -292 106 193 496 199 479
859 479 1117 1089 1286 1096 875 1263 937 716 656 -309 -421 -686 -1257 -1255 -1033 -1231 -1213 -1303 -964 -425 1 -31 165
882A65K90k2K65M2Q24n14l16j0j89M09K4r34m27p9k59J75k70l44J23L1J88N04
904c24m6K30R4l31N64K82k21N85l12K00Q3m81L84K2l12k16n62m51R72o36l07j94
926i77K98k08O92k02Q5J85l68M63M35J09l9K02o90M5O02L99j13%p04k34n17M15
948a22l64m0J42n10Q2M79L8M0J28L46N2m70O2P16q08O99k75O05o86Q49k84n95
970H4l95M24j10l77Q40k87m31j24j92O96q35P7o66J015L38m80M81k12M25Om5K83
992E15K05m01O18k17k42m06J87J32p93O93q83m4Q4N30o05j67n8j1P40n5L19j73
1014c2l0O0N80J50J78l03k81M79j39k92L26q82%j11J67p4k32r4j59j91K62P1r9
1037f46K34N15l71K63N35O9R9j1m0k2j04p9q4j31j42j82m52K93K90p36K8j16j08
$$ plain form
882 165 455 433 698 740 1564 1050 734 724 535 944 968 34 -393 -472 -731 -556 -826 -1170 -1047 -1016 -828 -324
904 -324 -370 -140 -46 -377 187 469 248 833 521 721 804 323 707 729 417 201 -361 -812 160 -476 -783 -977
926 -977 -679 -887 -195 -397 -312 -127 -495 -32 403 512 473 675 -15 30 632 1031 918 918 214 -20 -537 -122
948 -122 -486 -526 -384 -894 -812 -333 -295 -255 -127 219 271 -199 -137 579 -229 470 195 800 114 963 679 84
970 84 -311 113 3 -374 466 179 -252 -376 -568 128 -707 -630 -1296 -281 57 -423 58 -154 271 277 232 515
992 515 720 319 937 720 478 72 259 391 -402 291 -592 -636 -552 -22 -627 -794 -852 -863 -123 -178 141 -32
1014 -32 -62 -2 578 728 906 603 322 801 662 370 696 -186 -186 -297 -130 -204 -436 -530 -689 -880 -618 -547 -646
1037 -646 -412 103 -268 -5 530 599 698 687 647 625 521 442 358 227 85 -97 -549 -256 34 -702 -674 -790 -898
1060h98K84J7K60K3j54M57J91M30M88m16j93L42p1J38Lp51K12n68n9N9j66k73
1082f45J86l53L33N0n83P43j24m15Q98M22O10l2n2m12M06M7k0n69M65m96m78J33
1104A14k55k46K69n5j73j032J042o77Q17n00j72K24O37M72J56k72K08K9k7Rj82
1125C86K21j78j24m20n3N9n9n17J72M1k36Q9P7J26j15K43M5J57J94K95K32l51
1147B84L44K58k88J44j62m65K02l71J31j31r5k42p1l96M64m0n3J58j49k03O05
1168g6J34m7M73n1M7k96L73K96l63r6On6j11J74m09l39L10n52J58j5L02k73m67
1191h78J99N11L3m3K64J02k52M48J24j2K39l21j12l1k25J32J38K2l40p8k98L3
1213c45J63k40j80J10P9J1M54l8pJ25J10K71m8J14q2j46L06q8k25o0K01m14l43
$$ plain form
1060 -898 -614 -597 -337 -314 -468 -11 180 610 1098 682 489 831 760 898 901 150 362 -206 -265 -206 -372 -645
1082 -645 -459 -812 -479 -429 -1012 -269 -393 -808 90 512 1122 1090 1038 626 1032 1079 1059 490 955 459 -19 114
1104 114 -141 -387 -118 -173 -346 -1378 -336 -1013 -196 -696 -868 -644 -7 465 621 349 557 586 559 568 386
1125 386 607 429 305 -115 -168 -109 -168 -685 -513 -472 -708 -619 -542 -416 -531 -288 -243 -86 108 403 635 284
1147 284 628 886 598 742 580 115 317 -54 77 -54 -149 -391 -462 -858 -394 -434 -487 -329 -478 -681 -76
1168 -76 58 11 484 433 480 184 557 853 490 394 400 344 233 407 -2 -341 -31 -583 -425 -440 -138 -411 -878
1191 -878 -679 -168 -135 -178 86 188 -64 384 508 496 735 414 302 271 46 178 316 338 -2 -80 -378 -345
1213 -345 -182 -422 -602 -492 -413 -402 52 14 7 132 242 513 465 579 497 351 657 569 344 284 485 71 -272
1236b72k06K97R0m58j33p8L61j91J02L01j51k2L49J47L87K90o80J29R6K65Ln27
1258I9N9jK31l02j35nj01l36J67r7k1J70o8M07j3k62J88M97k84j8M7L74n70L76
1282D02j75j35J65K67l30M57q96k7o68N56l8l31L26m3j03N21M83m94K01L98M16
1303I52j096M20K37m22M19L55k91J07R2n87m92J3o1P07j092k65O61P68r63J43
1323c95JK90p31K37Q66n90N94K71k30k00N95m51j62L79n59P69n61K06o51j03k84
1344g09N74N8K46l62L64j03j16m11N29l62J97l17M48m2L47k62J52J06m82P77m80
1365A52q08N18L85o03K38m82K49k17O12J79l02O46k77p68O12q3J97N00Q4j102
1385b70P44o14N97J0J34L49Pj137l12L73O60q69r2L0j9R4K85k17k88R86j28j38
$$ plain form
1236 -272 -478 -181 -91 -549 -682 -760 -399 -590 -488 -187 -338 -360 -11 136 523 813 133 262 358 623 626 99
1258 99 158 157 388 86 -49 -54 -155 -491 -324 -421 -442 -272 -340 67 54 -208 -20 477 193 175 222 596 26 402
1282 402 227 92 257 524 194 651 -245 -272 -940 -384 -422 -753 -427 -470 -573 -52 431 -63 138 536 952
1303 952 -144 276 513 91 510 865 574 681 773 186 -306 -293 -354 353 -739 -1004 -343 425 -538 -395
1323 -395 -394 -104 -835 -598 268 -322 272 543 313 113 708 257 95 474 -85 684 123 329 -322 -425 -709
1344 -709 -135 -77 169 -193 171 68 -48 -459 70 -292 -95 -412 36 -6 341 79 231 337 -145 632 152
1365 152 -656 -138 247 -356 -118 -600 -351 -568 44 223 -79 567 290 -478 134 51 248 748 832 -270
1385 -270 474 -140 457 467 601 950 957 -180 -492 -119 541 -328 -420 -390 -409 -315 -30 -247 -535 451 323 185
1407A85J79k83k69Q04r1m87L62l82K63L4n16J10K0K18m65k54P0P7K37M2R2M8K55
1430B49m58K16k63J87L08R9k11J1M42j09k20K94n96J05p4l86M32m18j19P1L43
1451i7n6K64j61k17L83m05N26k91M53p7k4rk26K04k01k0K12m13l7J35r5j80N9
1474b73L72m98J05j8L00q9l98K43J43O2J38P5J38J49m74O13j64k52J8k12J76P0
1496B24l18m8k6l63J97O2q9l8J8j21L88o6K8L48l39L47J66j91K24o2l0l32J78
1519A57l38L63m39P48n97K4n0j69j01L38k45J6L60l23J77r3K31O4J91n99N16J96
1541D27j57k9k1n11K86K16k70j61J08j59J75J9l23O9O54j15p60J17R79p16l08
1562d80Q03l26M04N8l40R54q62k81N32k88j66l09K9J62j6l33P1n1M66j12j88n7
$$ plain form
1407 185 364 81 -188 616 525 38 400 18 281 315 -201 -91 -71 147 -318 -572 -502 -425 -188 -146 -54 -6 249
1430 249 -209 7 -256 -69 239 338 127 138 580 471 251 545 -51 54 -20 -406 26 -392 -511 -440 -97
1451 -97 -153 111 -50 -267 116 -289 237 -54 399 322 298 289 63 267 66 46 258 -155 -192 -57 -152 -332 -273
1474 -273 99 -399 -294 -312 -12 -101 -499 -256 -113 -51 87 162 300 449 -25 588 424 172 190 -22 154 224
1496 224 -94 -142 -168 -531 -334 -272 -361 -399 -381 -502 -114 -180 -152 196 -143 204 370 179 403 341 311 -21 157
1519 157 -181 182 -257 491 -106 -82 -132 -301 -402 -64 -309 -293 67 -256 -79 -172 59 123 314 -285 231 427
1541 427 270 241 220 -291 -5 211 -59 -220 -112 -271 -96 -77 -400 -331 323 208 -552 -435 544 -172 -480
1562 -480 323 -3 401 459 119 1073 211 -70 462 174 8 -301 -272 -110 -126 -459 -388 -439 27 -85 -273 -330
1584c30L11L30o01K33Q2J45j03J62L6M4J03p01Q07o3p34P93q21K18j12K27k65
1605b39j32M22M0j38r2N79M09j133j02O81L83k89k06q7L6o2l49P79l73m30L83
1626H0m5l28o15Q74q24J28L90K34J24J49J63n4n34L51R06q78l09J286r80K17L99
1647G34N9o71J064o57j674J346n24r4J235j122j26R77l10q78l8P09p20J155p69
1666c04j61Q28l5m53RK74k71N1m39N27m33N91o6q9n84K95k8J24j18K09l40J71
1688b42L07j22Kp6K7M19j78N0p1J73nk40r8J98j24Q0j36j7m9k27L21k19J81k31
1712b77K73l1j80O8J21K67m7k93J61Q4j87L18M0j32N2j70K3K4j39K94m08Q6q4
1735a37n9K08k63J90k09J8K64j16R6j36p4L89j69K69J00l06j2P4O3j61r0K03l24
$$ plain form
1584 -330 -19 311 -290 -57 25 170 67 229 265 309 412 -289 518 455 -279 514 -307 -89 -201 26 -239
1605 -239 -371 51 91 -47 -139 440 849 -284 -386 295 678 389 183 96 132 70 -279 500 127 -303 80
1626 80 35 -293 -908 -34 -858 -730 -340 -106 18 167 330 276 -258 93 999 121 -188 1098 118 335 734
1647 734 793 122 1186 529 -1145 201 -323 -417 818 -304 -430 547 237 -641 -679 30 -690 465 -304
1666 -304 -465 363 328 -125 -116 158 -113 -62 -501 26 -407 184 118 29 -555 -260 -288 -164 -282 -73 -413 -242
1688 -242 65 -57 -55 -131 -104 315 137 187 116 289 284 44 -54 144 20 100 -36 -53 -102 -329 -8 -227 -46 -277
1712 -277 -4 -35 -215 -147 -26 241 194 -99 62 146 -41 277 317 185 237 67 90 114 -25 269 -139 -53 -137
1735 -137 -196 12 -251 -61 -270 -252 12 -104 -8 -144 -218 171 2 271 371 65 53 127 190 29 -61 142 -182
1758a82%L16l00J2j50O5J78J0j76L86j07l13J22K42k11j7J57j22j33M74q1RL2
1781B11Q1k67R0K17k88m6Nk39j76L59k12J18K0R8o2Q8p4L44n6k08K10j83P8K7
1805A35j47L32k41m0Q0j21k54m7J96j01l5K91k1l52N13j05l8rM0j36Q0m0j81K81
1829H0K35j49J54k76j83j65L07N4o5k54K47M3k88J52q4l2J8M26m73P4J70k23L58
1852A26p0L8Q1o2R1q2l2K16l26J57k62N6q2J60J06Oj81l27K69P5K46k06J01k4
1876G4o6K21K62m46J83p5j61J12n4q0J48j66k8RJ18j70j52J55P4N6r9N4Lj48N1
1901a25m4M9K61J0L31J7l35k5N9j60J31ok48k9K25l15L20j70k05M40j94K6M3l00
1925b44K13L04m68J33j45M42k64r1Q3K12J68m4l39j23P6M5k79J85K18l01j1J00
$$ plain form
1758 -182 -182 134 -166 -154 -304 -239 -61 -51 -227 159 52 -261 -139 103 -108 -125 32 -90 -223 251 170 179 211
1781 211 292 25 115 332 44 -2 3 -236 -412 -53 -265 -147 -127 -29 -91 -3 -77 267 211 3 213 30 108 135
1805 135 -12 320 79 39 119 -2 -256 -303 -107 -208 -243 48 27 -325 188 83 45 36 76 -60 20 -20 -201 80
1829 80 315 166 320 44 -139 -304 3 57 -8 -262 -15 28 -260 -108 -192 -224 -206 220 -253 -179 -9 -232 126
1852 126 56 94 175 113 204 122 90 306 -20 137 -125 -69 -151 9 115 121 -60 -387 -118 -43 203 -3 98 74
1876 74 8 229 491 45 228 153 -8 104 50 -30 118 -48 -76 -67 51 -119 -271 -116 -42 14 -85 -31 -28 -176 -125
1901 -125 -169 -120 141 151 482 499 164 139 198 38 169 163 -85 -114 111 -204 116 -54 -259 181 -13 13 56 -244
1925 -244 -31 273 -195 -62 -207 235 -29 -120 -37 175 343 299 -40 -163 -87 -42 -321 -136 82 -219 -230 -130
1947a30L96l88L0P6K71k27j30J31p7n5L12k3l1k95L69l64L40j10q1R5j92K04o1
1970F0j26j05P1k5J72k98J45j70o6N41m35j2L96j36J6J93P8k23j3j80J15J10j09
1993aj4p2Q1q0n6J00LO4l3k4m5j53M02j87J04l19K96K23l49K49j22M5lk3j69l6
2019a19L32k72J96j04j17mM4l5q9L28k88J4j35J17K02o8J19J06j82Q5N2J18j21
2042A79j43K06j40K10m00n9j57J56j28L11l28M2J18L26j59j09j45K69J8J44k27
2063a6o5J98L4j37K12l44J76j3n6K29l33K02n2K66l85K75q7P7j51r9j98K13r8
2086a52K32l3J75k82k51L38L5k52J05K66k80L08l67M5J1O6J25j04J58k20Q4p5
2108f8J74k84L46k97K56k91K20Q4P7%l96J20J73j26n5N93o00o4l18M32J78k96
$$ plain form
1947 -130 266 -122 -92 -16 255 28 -102 29 -48 -103 209 186 155 -140 229 -135 205 95 14 109 -83 121 60
1970 60 -66 -171 -100 -125 47 -251 -106 -276 -342 199 -236 -248 148 12 28 221 299 76 63 -117 -2 108 -1
1993 -1 -15 -87 -6 -86 -142 -42 -39 25 -8 -32 -77 -230 172 -15 89 -230 66 289 -60 189 67 112 109 86 -83 -119
2019 -119 213 -59 137 33 -84 -88 -44 -79 -168 160 -128 -114 -249 -132 70 2 121 227 45 130 182 300 179
2042 179 36 242 102 312 -88 -147 -304 -148 -276 35 -293 -251 -133 193 34 -75 -220 49 67 211 -16
2063 -16 -81 117 151 14 226 -118 58 45 -11 218 -115 87 35 301 -84 191 104 181 30 -69 -267 -54 -152
2086 -152 80 47 222 -60 -311 27 62 -190 -85 181 -99 209 -158 -113 -102 -36 89 -15 143 -77 7 -68
2108 -68 106 -178 168 -129 127 -164 56 140 217 217 -179 -59 114 -12 -67 526 -74 -138 -456 -24 154 -142
2130a42J0j93L3M1Q0o2QM4L17oj07O2j79K4L7J14rk17J69j34J9K17o4n1N5l44
2156b78L7l1K80P5j3j33m5m2O8J13k0K07l09J36K8L02m14J5n7L00j38r2j69J01
2180g9mO6M1j93J16L26m00J92j2J77m23K94j44q9J41P5k31l8L55k27K05J61k59
2203E0p7J89k40K97l83Q1J73l53P6M50m13J39k39K72L04o11L61K04l54J35k26
2224a65M38o2j04j2L03l19j00L91l55R2l40J92Q5j30r1k99N35j47J24l9j03K03
2246I7K11l22J50Pj68K25k59r4LK09o8kj96P6J81N8R8m41J58L5J33P5r7J67k49
2271a3J9m1j32K78J3J52l7k10P7k61L45m01J91O5k61L31j56j21J40K77k77R8j67
2294i1Q0j98K74o3R6K8k8j96l3K15klk03K31j3j90O6J36m89L36O2r0J85k98J4
$$ plain form
2130 -142 -132 -325 -292 -251 -171 -233 -225 -181 136 130 23 85 -94 -70 -33 81 72 -145 24 -110 -91 126 62 11 66 -278
2156 -278 -241 -272 8 83 70 -63 -108 -150 -82 31 11 218 -91 45 73 375 -39 -24 -81 219 81 -11 -180 -79
2180 -79 -83 -17 24 -169 -53 273 -127 65 53 230 -193 101 -43 -132 9 84 -147 -185 170 -57 148 309 50
2203 50 -27 162 -78 219 -164 -83 90 -263 -187 263 -150 -11 -250 22 326 -285 76 280 -74 61 -165
2224 -165 273 211 107 95 398 79 -21 370 15 107 -233 -41 44 -86 -177 -476 59 -88 36 -3 -106 97
2246 97 308 -14 136 143 -25 200 -59 -153 -150 59 -9 -11 -207 -131 50 108 206 -235 -77 -42 91 166 69 236 -13
2271 -13 6 -35 -167 111 124 276 239 29 106 -155 190 -211 -20 45 -216 115 -41 -162 -22 255 -22 76 -91
2294 -91 -11 -209 65 2 98 126 98 -98 -131 84 82 79 -124 107 94 -96 -30 106 -383 -47 15 -75 110 -188 -174
2319a74K17m30N54j30n8Nl8n9L32j72m2m4L56m96J63M30k64j20j37J71j53K19
2341A30l29J41Q0k80J12O7k5K0q6J36N2oj41J41r1J25j61J32Lj02m2J27M8l46
2365b95M32J18J4n38K08r8J14n3j83L01m7J07m4K70k22k78J09P3J27r4J79l32
2387a32R6J23l9q4M4o0l1L8n2K07j9J19l14K23m00L42K69k53r7J94j27p6j09P0
2411f8K88k99O7l27L49j63J04K21q6k2L5k59K50k13K9j93L30r2N7l5k9J12j81
2434a25K23l33L30k37J46Lk62M1M14j67K20j27l6m35K14l3J34L00n46L42p02R03
2456B67M77r33K1O8P85n90m16M42J12J10p23J151j031L35P3q00L64P19j086n5
2476g10R18j52N4k46k0J011r81O67j238Q74j572O87N97O00j66J31m70P6j8L58
$$ plain form
2319 -174 43 -387 167 37 -21 -16 -54 -113 219 47 5 -39 317 -179 -16 414 150 30 -107 64 -89 130
2341 130 -199 -58 22 -258 -146 -79 -104 -84 -170 -34 18 12 -129 12 -79 46 -115 17 20 -82 -124 3 51 -295
2365 -295 137 255 269 -269 -61 -159 -45 -98 -281 20 -27 80 36 306 84 -194 -85 -12 115 21 200 -132
2387 -132 -36 87 48 -36 8 -52 -83 -45 -97 110 91 210 -104 119 -281 61 330 77 -20 174 47 -29 -138 -68
2411 -68 220 -79 -12 -339 10 -153 -49 172 86 64 99 -160 90 -123 -94 -287 43 -49 8 -27 -56 56 -125
2434 -125 98 -235 95 -142 4 7 -255 -214 200 33 253 126 90 -345 -131 -164 -30 270 -276 66 -636 267
2456 267 744 -189 -168 -100 685 95 -321 121 233 343 -380 771 -260 75 148 -652 -288 431 -655 -710
2476 -710 208 56 110 -136 -156 855 -126 541 -697 177 -1395 -708 -111 489 323 454 -16 60 42 400
2496D00p56N87o13L11k54O36o00P06k11l77l28K93m1O8m3L42L3m04M65o1k33l37
2518d17N68j62J02K86K31k19m34k75m58Q33l99O0R64q43K54L2K47n31J83J022
2538A044r32j38l51Q39J16n14O64q78N96%j027L12O81o83L42p92M29l17K86N93
2558B70j73M65j88p0R1j187P40l9j41M15n79N3m04J009r71N94J86k08n50O00m06
2579d93n5R19r73J63Q26r46J299j020J91L03K06l84k76O14l85N09l23k74p6P38
2599E63p82M40n49K40o44Q08k80l12Q07q7n64N09k12J83k90J2M56m13P3K20p04
2620e26R46l42N7J58r1k98M7L26k78k90K4n4M00M13m58K61j58N0n08J36N9J36
2642A0l35O21l96N7j21M27j2l94J57m29N59l5n7r7K1j34K8k7J29J58k0l4j05N0
$$ plain form
2496 400 -356 231 -382 -71 -325 311 -289 417 206 -171 -499 -206 -247 -179 -222 120 153 -251 214 153 -80 -417
2518 -417 151 -11 91 377 608 389 -45 -320 -778 55 -344 -284 680 -163 91 123 370 -161 22 1044
2538 1044 112 -26 -377 462 578 64 728 -150 446 446 -581 -269 412 -271 71 -721 -292 -609 -323 270
2558 270 97 562 374 304 395 -792 -52 -91 -232 183 -396 -343 -747 262 -709 -115 71 -137 -687 -87 -493
2579 -493 -548 371 -602 -439 387 -559 740 -280 -89 214 420 36 -240 374 -11 498 175 -99 -175 563
2599 563 -219 221 -328 -88 -732 76 -204 -516 291 204 -360 149 -63 120 -170 -158 298 -115 -42 178 -526
2620 -526 420 78 135 293 202 -96 -49 277 -1 -291 -267 -321 79 492 34 295 137 187 -321 -185 -126 10
2642 10 -325 296 -100 -43 -164 263 251 -143 14 -415 144 109 52 -45 -24 -158 -130 -157 -28 130 110 76 -29 21
2666B1l4J7k22J65M0l6K85k54n1n9K41Mj1k63K12k03J22J2J03P1k22J87K6m25
2690b74J74K02j15j34K55O4q8j1P8K55m62Ok71K88L56n94J26Lj15k07L93N19o94
2713b46J16l57j13L47J59L9J30r4l37O16j248M07N02O16k66p27O46k08q44M38
2733d24N10M93L4r59L07J33j361N64m0j89O25P70l81l39L91Q0r31N62K92o09O50
2754A78Q8j40o19O69l91L57p72M09M65L56o03j4N75q3p03L10L88l90o45M48N06
2775C89k34J339k093Q77n37O37q75N85L28k6o00J020m88k79j0r0m26K98k82l9
2795e06J436j41j686Q45K99l61q4N9K7M36j97n22j26j50R99m86L9N43j68o54K65
2816a33j68N06l97J8N28l34l30P59p70J16l80K96K62K85M89m25m99K34j41K4j14
$$ plain form
2666 21 -13 4 -218 -53 -13 -49 236 -18 -69 -128 113 117 106 -157 55 -148 -26 -14 89 160 -62 125 151 -274
2690 -274 -100 102 -13 -147 108 172 84 73 151 406 -56 -50 -321 -33 323 -271 -145 -142 -257 -464 -71 448 -246
2713 -246 -130 -487 -600 -253 -94 -55 75 -19 -356 260 -988 -581 -79 537 271 -456 190 -18 -862 -424
2733 -424 86 579 613 -346 -39 94 -1267 -703 -743 -932 -307 463 82 -257 134 214 -717 -155 137 -472 178
2754 178 266 126 -493 176 -215 142 -630 -221 244 600 -3 -17 558 475 -228 82 470 80 -565 -117 389
2775 389 155 1494 -599 278 -259 378 -497 88 416 390 -210 810 322 43 33 -57 -483 -185 -467 -506
2795 -506 930 789 -897 -52 247 -114 -198 -139 -112 324 127 -395 -521 -671 328 -158 -119 424 256 -398 -133
2816 -133 -301 205 -192 -174 354 20 -310 449 -321 -205 -585 -289 -27 258 747 322 -177 57 -84 -60 -174
2837a74K42K49p59R74l79J2L3m15K80J97m14K91m33O3k18K19j28J3K15J27k2n3
2859h0l01O1L4o67J456p46l11m42J521j22r82J84M50N40j619J514J19p70P05l79
2879A65L59m45l76M04l19M86l00o3K26j66l6J4L20K53n91j01M52l94l70j51J359
2900G26m01m65K9L73o95J98J19P3K96Q5J8n47K3J5N17m17P1k89L5L69j8j02J80
2923A93k83K99J35m19J87P1p9J95j02k14J85J59l72M9R4J66j88K3J35k06j95l14
2945d81O67k57J06j51K80q5l1m3j32J59j92R5N4Rj88K89k26j18R3K39n9R0k90
2968a72lj6J01K15k65j19M20k71K16r0K4M1j18K44j53j4k83K46n1R7j70K26k07
2991a02j09L27k58J16q2J20J69j33j98K31l16J97K53k6j78J71k36j68L50k24J19
$$ plain form
2837 -174 68 317 -442 532 153 165 198 -217 63 260 -154 137 -296 -233 -451 -232 -360 -347 -132 -5 -27 -80
2859 -80 -381 -320 -286 -953 503 -243 -554 -996 525 403 -579 -395 55 595 -1024 490 609 -161 544 165
2879 165 524 79 -297 107 -212 274 -26 -89 137 -29 -65 -51 269 522 -69 -170 282 -112 -482 -633 726
2900 726 325 -140 -111 262 -433 -235 -116 -43 253 338 356 -191 -168 -153 364 -53 18 -271 -236 133 115 13 193
2923 193 -90 209 344 -75 112 183 104 299 197 -17 168 327 -45 4 98 264 76 99 234 28 -167 -481
2945 -481 186 -71 35 -116 164 79 48 5 -127 32 -160 -65 -11 -2 -190 99 -127 -245 -152 87 28 118 -172
2968 -172 -175 -191 -90 125 -140 -259 161 -110 106 16 40 81 -37 207 54 40 -243 3 -48 49 -121 105 -102
2991 -102 -211 116 -142 -26 -108 12 181 48 -150 81 -235 -38 215 189 11 182 -54 -222 128 -96 23
3012B3N8j10M8j22P2p3N1m4j6J07J27j29P7j81m6J25j09j11L72p4j81K27L05j60
3036B36P7l53Ko5J84o7M0J75m35K42J23k10L06j11j43k05J60J5R5k72Q7J6R4n3
3060f2J36NL1m0j22K72k96K76j53N5l87J31L70k74Q1N8j90n5K07j26r6K65o0J03
3084A29R4k76n8O5J9n5r7J07pL49j90L45m23m3j46J54J91m4k16J25Qk74J91Q6
3108C4j8j43K35l03J47J32j17m9L82j91r3Nq7j67J93o9K56j99K6Q4n5L05l18j43
3132a53J40j6Q9M1l50J84k1p5L73k17L2J26j23l92L26n4p6L39k69K0M0j21L11
3155A54j83L34n03J11K65o0l09k24L30p4L28j95J20k46l6K49r7J53k78J89P2j23
3177b3K21j89l08M94l35J96J23K1l86K16k2P3j07j39NJ51Q8j17L32l32k23K92
$$ plain form
3012 23 81 -29 19 -103 -31 -104 -53 -97 -113 -6 121 -8 69 -112 -158 -33 -142 -253 119 45 -136 91 396 236
3036 236 313 -40 -38 -103 81 14 54 229 -206 36 159 -51 255 144 1 -204 -44 -29 66 -206 -119 -103 -9 -62
3060 -62 74 79 110 70 -52 220 -76 200 47 102 -285 -154 216 -58 23 81 -109 -164 43 -83 -179 86 26 129
3084 129 223 -53 -111 -46 -27 -82 -179 -72 -79 270 80 425 2 -41 -187 -33 158 114 -102 23 31 -243 -52 34
3108 34 16 -127 108 -195 -48 84 -33 -82 300 109 16 21 -66 -233 -40 -109 147 -52 -26 58 3 308 -10 -153
3132 -153 -13 -29 60 101 -249 -65 -86 -161 212 -5 27 153 30 -362 -36 -90 -166 173 -96 -76 -36 -157 154
3155 154 -29 305 -198 -87 178 118 -191 -415 -85 -159 169 -26 94 -152 -188 61 -36 117 -161 28 100 -23
3177 -23 198 9 -299 195 -140 56 179 200 -186 30 8 81 -26 -165 -160 -9 79 -38 294 -38 -261 31
3199C1q7L4P6j69%K16j08j22p6L99l4l49J20K78j19P9l03K71l53M52q2j25L34
3222C63k05j65k88L36J3k6N6j24j30L3n8K07K52k35L1j24Q5r8J32P8q4K64l72
3245e9L19k29J60l09MJ55k10k8L28k00k61J20J79R7j95R9l19L63p6K30j13o2k80
3268b87L52j06o9QM5j3j34J91J99j64k2J11K9O3o4k00K03n12L60k1O1j01j6P5
3292a2KQ1K9k36R3N0J75l1j06o0k9k10J72M9j32J75p0j16O5J49M5K4k92L64k26
3317d7J41k15J04K01q8k32K58j51M8J21j83J75m84K89O4o0j04J62N4k26J31J1
3339c1J21pl9j48k1Lk4J81Pk21L36r0n5L52j62q8l02K93j37j47J77nj77P8J8Q8
3365@O3K38j42k60p0J31l2L85k30N4l2j18o3P8mj20L03l7l6j20lj98J78j85O4
$$ plain form
3199 31 -56 -22 54 -115 -115 101 -7 -129 -205 194 160 -189 -69 209 90 169 -134 137 -216 236 154 29 363
3222 363 158 -7 -295 41 54 28 84 -40 -170 -137 -195 12 264 29 60 -64 21 -77 55 133 49 313 -59
3245 -59 260 31 191 -118 -114 41 -169 -197 131 -69 -330 -210 -31 66 -129 -30 -349 14 -62 168 55 -7 -287
3268 -287 65 -41 -110 -102 -57 -70 -204 -13 186 22 0 111 140 203 139 -61 142 -370 -10 -31 30 -71 -87 -12
3292 -12 -10 71 100 -136 -43 7 182 151 45 -15 -44 -254 -82 -33 -165 10 -60 -176 -111 38 83 107 -185 179 -47
3317 -47 94 -121 -17 184 96 -136 122 -29 19 140 -43 132 -352 -63 1 -59 -163 -1 53 -173 -42 -31
3339 -31 90 83 44 -104 -125 -122 -146 35 42 -179 157 67 12 364 202 114 -188 105 -32 -179 -2 -7 -184 -106 -88 0
3365 0 63 301 159 -101 -171 -40 -72 313 83 137 105 -13 -76 2 -2 -122 181 144 108 -12 -15 -213 -35 -220 -156
3390a56J88k7k68K67J8J43m4j26k48M70k69k9K17J06j91j31k4Q7L67k39k29M4
3412g4J69k22j9J95J10n8l38J09L85m52R6J81k25K06j65O6j59J79J39k51K79j83
3434c2M7j94K05J04m5qj48j12K91l9P0k03J98k66K72k81J34J07p7J12J09k16L8
3457F6j42J79k29L1p1L64j59L4K16m35K37l29K26K77l56R1J0k24K16j31R4J46
3479A11k03o0L35m24N4N72l38k04L30j61K9o4k1q3K78J35m00o7L78k50J24J1j02
3502b0q3K54j77k75K85l5j42L44k14j13J98j32J16k89L55k44O5K54j32O2n6n9
3524c8L4J51j21R5m6qL3J15j8k76J16k3l0J9j49K26jj66L2J99j04Ko7N7Jk27Q5
3551a09J74k21P6J11k7J11j70J38qj30j75M08m8l55L02k74J85K08j53q6M4O2k48
$$ plain form
3390 -156 32 5 -263 4 22 165 121 -5 -253 217 -52 -81 136 242 51 -80 -104 -17 350 111 -118 -74
3412 -74 95 -127 -146 49 159 101 -237 -128 257 -195 -99 82 -143 63 -102 -36 -195 -16 123 -128 151 -32
3434 -32 15 -179 26 130 85 77 -71 -183 108 69 139 -64 134 -132 140 -141 -7 100 23 135 244 28 66
3457 66 -76 103 -126 -95 -166 198 39 73 289 -146 91 -238 -12 265 -91 0 10 -214 2 -129 -35 111
3479 111 -92 -152 183 -241 -187 385 47 -157 173 12 41 -23 -44 -127 151 286 -114 -181 197 -53 71 82 -20
3502 -20 -103 151 -26 -301 -16 -51 -193 151 -63 -176 22 -110 6 -283 72 -172 -107 147 15 77 21 -38
3524 -38 -4 147 26 121 75 67 100 215 197 -79 37 14 -16 3 -146 80 79 -87 -55 144 40 42 -25 32 33 -194 -109
3551 -109 65 -156 -80 31 4 115 -55 83 75 -55 -230 178 130 -225 77 -197 -12 196 43 -43 1 63 -185
3574a85J12j1O5n9k04L74J05n0oL5k75J57j66K45l79J66NJ83L0l20K41k53K22
3597C2k4m7j57J62M3L2j69L41k40L69l00k18Q2J68mj10j64K79L2n7j31K46j14
3620E1nj67J22M0k9Q7j18P1O6r0k8j52K7O3n0R3Po5j54K89q5r0K02M0k42M0j9
3647i6L15l13m8J24j18K51k19K93j26Q9k67L4K87j02k43J96M7J45k17k40J96Q4
3669G2l75K42Kj26n9L15Nl28K13o1J78j84L10m64J04M7K32Q7j78k03M1j52N14
3692B32p40R44J68j177k69O41P20m02m56J049l97j77K8k5j62m19J051k84n99N83
3712C09p77K06m45P36N71n96k73M09l69K83K46l91o79K04N91QQ47j271N58j34
3732C3L01l52M28q37R78o92l36J051o68Q56l23Kj682P50K25Q36l97k74m35J161
$$ plain form
3574 -185 -73 -84 -19 -78 -282 92 197 147 141 176 -99 58 -108 137 -242 -76 -71 112 142 -178 63 -190 32
3597 32 8 -39 -196 -34 9 41 -128 213 -27 342 42 -176 -94 74 70 -40 -204 75 107 50 -81 165 51
3620 51 46 -121 1 41 12 99 -19 52 118 28 0 -152 -125 -62 -112 -19 -12 -77 -231 58 -27 -117 85 125 -117 -77 -96
3647 -96 219 -94 -142 -18 -136 115 -104 189 63 152 -115 -81 206 104 -139 57 104 249 32 -208 -12 72
3669 72 -303 -61 -59 -185 -244 71 76 -252 -39 -100 78 -106 204 -260 -156 -109 123 210 32 -171 -130 -282 232
3692 232 -508 436 604 -573 -842 -201 519 117 -339 710 313 136 164 139 -23 -442 609 325 -274 309
3712 309 -468 -262 -707 29 600 4 -269 140 -229 54 300 -91 -770 -566 25 33 880 -391 167 33
3732 33 334 -18 410 -427 551 -141 -477 574 -94 762 439 441 -1241 -491 -266 570 173 -101 -536 625
3752F25p4J29j092N4N77L92k10l60L37O4j18o40N25K45k31M5j5M41o54K41M22
3773G03l72J15n23k8m25M42P03j213Q31k70L47j28J88l1P36j458o8L09M49P83
3793A090j385j55M54m51M50j030J054M12m71L63J29j157N17Q79l32l32o44O98
3811H9l43L99k29N8L1n9J57l10L81l27N26p3j16j97K70O43r49K28l33N71l05L99
3833E11r23L75m35Q59n83K14L03l53m8l26O44j53q00K82L70j80N63M5n66j34P25
3854C90p0J18n07K58Q8j86Qq8o2k79k0J34L72m47%J045o72O6k55Q0j31L46l88
3877b00M25R3m68L03j33P0m45N79o3l66P7J02K3j63Q8K16l35K41R9j94k59J84
3899a26J45j34L55l56L36k14O4l80M13L7l55L58k12j40K61J56m10K30j50L6R2
$$ plain form
3752 625 551 680 -412 -358 219 611 401 41 378 442 324 -316 209 454 223 268 253 694 40 281 703
3773 703 331 446 -77 -105 -530 -88 615 -598 233 -37 310 182 370 339 1075 -383 -451 -142 307 1090
3793 1090 -295 -450 4 -447 3 -1027 27 439 -32 331 460 -697 -180 699 367 35 -609 89
3811 89 -254 145 -84 -26 5 -54 103 -207 174 -153 373 300 184 -13 257 900 -49 179 -154 417 112 511
3833 511 -412 -37 -472 387 -196 18 321 -32 -80 -406 238 85 -715 -433 -63 -243 320 365 -201 -335 390
3854 390 320 438 -69 189 277 91 99 11 -51 -330 -350 -216 156 -291 -291 754 82 148 -107 -27 -158 188 -200
3877 -200 225 318 -150 153 20 90 -355 224 161 -205 -128 -26 -3 -166 -78 138 -197 44 143 -51 -310 -126
3899 -126 19 -115 240 -116 220 6 70 -310 103 140 -215 143 -69 -209 52 208 -202 28 -122 -86 6
3920FJ36R5j08o2N2kQ2k01J0k05M18j51j11J27l98O39k57j81j02J91J95j72J53
3943A54l15R1jR6lj22K69q5j05k41M02p7k19K62p1jq6o3J61o0K39k40L21k91k52
3968b37J60L10m4j49j08j22J31J03j9j12R5n2R8j30K01J72m04mK58o1o5L1P8N6
3992A86j93J00R5K2P3k15k26j13J86J78j60N8J2J69m4k00K17M7l54M49l13Jk1
4015d6r5M18l29M1K5j36K54k0q8K4l1R2k76K45j44J95k48K78j48J0j63J71k27
4038a98L40j89P0J09l32J35J21j2R7j32l42K70K31J60k18j06Q8k4L7m6k98J04
4060a35J71j04l4J91p9k7l16L32q8J84j58J42J07l18jJ01LJ88nM3k75M7k21M3
4084b09K25K22m16L86O7j50j40N6K27m16K07j3Ql33J82n2R6j3J56o3j88K09Q7
$$ plain form
3920 6 142 237 129 67 119 117 199 -2 8 -197 221 70 -41 86 -312 327 70 -111 -213 -22 173 1 154
3943 154 -161 -70 -71 25 22 -100 169 84 -21 -262 140 63 -156 106 35 34 -52 -115 46 -14 225 -15 306 15 -237
3968 -237 -77 233 189 40 -68 -190 -59 44 25 -87 8 -44 54 -76 125 297 -107 -111 147 86 21 52 130 186
3992 186 -7 93 188 210 283 68 -158 -271 -85 93 -67 -9 3 172 128 -72 145 192 -162 287 -26 -25 -46
4015 -46 -141 277 -52 -11 14 -122 132 112 24 48 17 109 -167 78 -66 129 -119 159 11 21 -142 29 -198
4038 -198 142 -47 23 132 -200 -65 56 44 141 9 -333 -63 168 328 110 4 92 68 105 59 -239 -135
4060 -135 36 -68 -102 89 10 -17 -333 -1 -89 95 -63 79 186 -132 -133 -32 -29 159 154 197 -78 -31 -252 -209
4084 -209 16 238 -178 208 275 125 -15 41 268 -148 59 46 54 -279 -97 -149 -53 -66 90 27 -161 48 135
4107A35j28J04J08q9o9l3j58L32k27J57K6k75K04K60j86K87m46p1J34l5k44M1
4129a73K67K4j89J89j25j14K84Q7k16p0j6o8K90m3N1j63o2N1J84j31k48K12l49
4152c28L81l46M99j15j39m5J97p2k20n6J88J53j56j45P7K83k08J30j29q3J08k0
4174d6k7j24j16L44l80L44Kk29K71K33k89j10j38K57j3J48K8j1k4j59K21l9Q1
4197B24k5r8J1o8k51K74q0m5j01L95l65j55K24J28j0m0l6k41J46N62k66j25k03
4220a45N1P7j04oN3L0R2k11o8Q6J19J32n37L78K31k25K09j36J2JJ32k36J67k21
4244a19R2j03j37K01P7k13K09j09j08J80Q8K19j65O3j94N0p4N9M09m42J30J85
4266B98kn43L02J33j53J01m3N1k46j89k0M18j56k66K80k5K86j91k69L16j20j34
$$ plain form
4107 135 7 111 219 130 61 28 -130 202 -25 132 158 -117 87 347 161 448 2 -69 65 30 -214 -173
4129 -173 94 118 -71 118 -7 -121 163 250 34 -36 -52 -120 170 127 178 15 -47 4 188 57 -191 21 -328
4152 -328 53 -293 206 91 -48 -93 104 32 -188 -244 -56 97 -59 -204 -127 156 -52 78 -51 -134 -26 -46
4174 -46 -73 -197 -313 31 -349 -5 -3 -232 39 272 -17 -127 -265 -8 -21 127 155 144 120 -39 182 143 224
4197 224 199 101 112 44 -207 67 -13 -58 -159 236 -129 -284 -60 68 58 18 -18 -259 -113 449 183 58 -145
4220 -145 -94 -17 -121 -127 -74 -44 48 -163 -231 -145 -26 106 -431 -53 178 -47 162 26 38 39 171 -65 102 -119
4244 -119 -27 -130 -267 -66 11 -202 7 -102 -210 -30 58 277 112 175 -19 31 -43 16 425 -17 113 298
4266 298 296 -247 55 188 35 136 93 144 -102 -291 -311 107 -49 -315 -35 -60 226 35 -234 82 -38 -172
4288a72K31M0k35p6J74j77K76J89m41M21l9k40J45j81J05j37J86j93Q8l4m6L14
4310A98L37m85M3j21J37j11o3KR0j7K05k44R0j61N3J23k47M20k17q5qL29j21m
4334A43o3m6j99J6J74J78n08M85l01K06J06k53j49J39k2K60P0r3k59j35K94q8
4356d5o7J46k92Q7J85k31P7J09O5n3MM8k34nJ72o0J87K8J4k23L43j11l05P9J02
4381B0K63l02n6k3P2Qjl4l0m8L76l52l7J60L9j05J06jJ61J22l21J21k53Q2j56
4406a89J66m3l9n2N0RM40l55M0J34k83L04k09j74L46k20Q3k03L00k14J49j87N6
4429i1J71K7j07K0K92m81L01k91K97l21J06K8j12M20j09l3l22K80j54J28m5k08
4451b04J62J31k63K21j28K05k25QL11k47J40l6K9k42M9k7q4J26K13J22j01j92
$$ plain form
4288 -172 59 99 -136 -212 -38 -215 61 250 -191 230 191 -49 96 -85 20 -117 69 -124 -36 -70 -116 198
4310 198 535 50 93 -28 109 -2 -65 -63 27 10 215 -29 61 -100 -47 76 -171 249 32 -53 -61 268 147 143
4334 143 80 34 -165 -149 25 203 -305 180 -121 85 191 -62 -211 -72 -94 166 236 143 -116 -251 43 -45
4356 -45 -112 34 -258 -171 14 -217 -140 -31 34 -19 -15 33 -201 -206 -34 -94 93 121 135 -88 255 144 -161 -82 20
4381 20 283 -19 -75 -98 -26 -18 -19 -53 -83 -131 245 -107 -144 16 55 -50 56 55 216 338 17 138 -115 -33 -189
4406 -189 -23 -66 -105 -157 -107 -98 342 -13 27 161 -122 182 -27 -201 145 -75 8 -195 105 -109 40 -147 -91
4429 -91 80 107 0 20 312 -169 132 -159 138 -183 -77 -49 -161 259 150 117 -205 75 -79 49 4 -204
4451 -204 -42 89 -174 47 -81 124 -101 -93 218 -29 111 75 104 -138 -89 -116 -200 -74 139 261 160 -32
4473c2L1n6r7J80o8n8Q5L4j7k15J04J78R7j42J45k62K38J11k27l33L38p8m9J82
4497H9J33j53r1j04J96K62l71p6J28K55k19L0j2l6J50l19Q8n7M78n79q6K83P0
4520E9J52k21k51J82LK03k10o5J84j69Q0J9j26J31q9RJ27m0J69k00K04k32J08
4543B7L1q9J3p0K22jk05J01q9J34J5k73L99k09j78Q3K92Kl96L15l38L83r3J75
4567B51n91P00m80J46j11o6K72qj82J02m5o7J67j8j45J98j34Q6l05K85jL7J47
4590B38k41K72j77k4N9o6p1k0j28J38P2K40m96K92J79l94J54l08J51J67L12k83
4612F6j92K15k16J60k2j42J94l4k30K18l5p1j47O5J47R9j05M2q8K29j82k18M22
4635A75j05q3J98j50j44K81m81K50K00k04P4k8nl5k9O9J00l16K45k3q8L52l07
$$ plain form
4473 -32 -1 -57 -154 26 -42 -100 -15 19 2 -213 -109 69 166 24 169 -93 145 256 29 -304 34 -44 -93 89
4497 89 222 69 -22 -126 70 332 -39 -115 13 268 49 79 67 31 181 -138 -50 -107 371 -208 -294 -11 59
4520 59 211 -10 -261 -79 -76 127 -83 -148 36 -133 -53 -34 -160 -29 -118 -109 18 -22 147 -53 151 -81 27
4543 27 58 -31 -18 -88 134 133 -72 29 -60 74 89 -184 215 6 -172 -89 203 205 -191 124 -214 169 76 251
4567 251 -340 360 -120 26 -85 -151 121 113 -69 33 -12 -79 88 70 -75 123 -11 75 -230 55 54 91 238
4590 238 -3 269 92 68 127 61 -10 -30 -158 -20 52 292 -204 88 267 -127 27 -281 -130 37 349 66
4612 66 -126 89 -127 33 11 -131 63 29 -201 17 -18 -89 -236 -171 -24 75 -30 12 -76 153 -29 -247 175
4635 175 70 -13 185 35 -109 172 -309 -59 141 -63 11 -17 -22 -57 -86 -17 83 -233 12 -11 -99 253 -54
4658e4%K10j39j19Q7J23k50L36l17j61L70p5m4l9p3J48r8J63q7r4J93j4L4m7J04
4683A57k68K68K01l48P7j82j16R6P0O3K77j26j31n4J63o7l3O1J16m58L11k1Pr2
4707b9J41O6j80J99l21l8m6R3j13K27j71K49k29j47P7K52q9j66J90L20j50k94
4729a59J63K39o78L75K7j3J19R4k9o3p6L25k32k12J47j52O7j20J65M0l08L16k33
4752a98J58k71J30L59k20p6P2J46m4n6J39j52mK71j10j70j11r0J93j1J57N3o9
4775I6N6k05j06O4J90j87L14m03J37J49j91j73L52kj35oK46J27k94J1j89N5K16
4798A22j57M27j77j93l6r0K60Jo5k1J60j83k44J5N15l49j69K34j59J10J3k18J64
4821d0j53J59K9p8O0j15j3R3P4l00L28r1Q7n5K86m16K57j1r8J00l1r4L22k53j92
$$ plain form
4658 -54 -54 156 17 -102 -15 108 -142 194 -123 -284 86 11 -33 -72 -145 3 -95 68 -19 -113 80 66 100 53 157
4683 157 -111 157 358 10 87 -95 -211 -115 -45 18 295 169 38 -16 147 80 47 108 224 -234 77 56 63 -29
4707 -29 112 178 -2 197 -124 -162 -208 -115 -228 -1 -172 77 -152 -299 -222 30 -59 -225 -35 285 135 -159
4729 -159 4 243 -435 -60 -33 -46 73 167 138 75 -1 324 92 -120 27 -125 -58 -178 -13 27 -281 35 -198
4752 -198 -40 -311 -181 178 -42 -118 -46 100 56 0 139 -13 -17 254 144 -26 -137 -227 -34 -45 112 165 96
4775 96 152 -53 -159 -95 95 -92 222 -181 -44 105 -86 -259 93 91 -44 -50 196 323 29 40 -149 -94 122
4798 122 -35 392 215 22 -14 -104 156 157 92 71 231 48 -196 -181 334 -15 -184 50 -109 1 14 -204 -40
4821 -40 -193 -34 -5 -83 -23 -138 -151 -58 16 -284 44 -47 40 -15 271 -145 112 101 3 103 72 -22 300 47 -145
4846a45J11kP9k80K08J26j97L3k9J98J06m3n6j5m41L53r7K68k0j39%J62l41K06
4870D5j32K63m19L60k69K47K4j79PK82j64K7M5n86N04o9J02j45Q2P1j57K62j08
4893I3M3k26N5J26n0p8J79q4n8J22j1K6k7j6k01J73l17K70J54q6l3L4k3r1K97
4918B71m02q8L30k02j91L11j2j16J13J5J6J27k12K4K42k4k53J29M7Q4k4l29R3
4941e1N9L16l75J81l52M29Nk95R0k35K47j98p4J71l0Q0J59kj67j82O1Q7J21o1
4965a6N30o45J28K82n19J17J81qp5J99j54K0r3j88M84k27j09J95j49r2L81jl65
4988a24L58r5k09L37k37L87o56N31k68m5K18k38K39k32n5J50Kj04K3K9q3J02R3
5011A23J1j65J36M6j71N3o3P2k88L44q8m3o9J74M3j52J88O8k07k37k4R9J98k01
$$ plain form
4846 -145 -34 -36 43 -237 -29 97 -100 -67 -96 102 208 165 109 94 -347 6 -91 177 157 18 18 180 -161 45
4870 45 -87 176 -243 117 -152 95 119 -60 -53 229 65 92 137 -449 55 -14 88 -57 25 96 -61 201 93
4893 93 136 -90 -35 91 41 -37 142 58 0 122 111 137 110 94 -107 66 -251 19 173 87 54 88 65 -26 271
4918 271 -131 -219 111 -91 -282 29 17 -99 14 29 45 172 -40 -16 226 202 -51 78 125 209 185 -144 -51
4941 -51 8 324 -51 130 -222 207 212 -83 7 -228 19 -179 -253 -82 -112 -32 127 125 -42 -224 -163 -76 45 -16
4965 -16 514 -131 -3 279 -240 -123 58 50 -25 174 20 40 -53 -241 243 16 -93 102 -47 -139 242 241 -124
4988 -124 234 139 -70 267 30 417 -239 292 24 -21 197 -41 198 -34 -89 61 63 -41 -18 11 -72 30 123
5011 123 134 -31 105 151 -20 33 -30 42 -246 98 10 -33 -102 72 115 -37 151 219 12 -225 -249 -150 48 -153
5035a53K54l2j24k4J4L52j47Pm9N1k90j01J49R1j2j22J31K44m20J51q6O6L80m40
5059a10q0J45J12k12N6no8M46k21M2L2j53r8J21l3l2K77j27p4k69L41NJ80k81
5083fj9nK50l32K07l12L14K77j47r6j2o1k03L02pl54J73k89L52j91M39l44o9M65
5107C32k41k57K77j1P1k29K17J16j95k65K10J07j24J58k01l7l0n6j1K78k10j0
5129a11K70j56j71K63J89j48m0J21K7m28o5K71K06N2k78N7n5J45k23j0K46k94
5151a32M07k99P2j09j41J23Q3K4l56J21L49j95L10p7k07o2q4P2J76j61J18k79
5173b47Q9K74j7k8m9j15Q8P9m5m06K96K20j40J58k35K98l98L24m6j64K01j74j05
5196a42J21K25k75M8j87K22j55K38M5k63j08L17K58m13J55Ok0J84l26K30k4m20
$$ plain form
5035 -153 101 69 -55 -79 -65 287 140 147 98 149 -141 -242 -93 -2 -14 -136 -5 239 -181 -30 -116 -50 330 -110
5059 -110 -190 -45 67 -145 -89 -94 -162 284 63 105 137 -16 -114 7 -26 -58 219 92 18 -251 90 95 275 -6
5083 -6 -25 -30 220 -112 95 -217 97 374 227 131 119 58 -145 157 150 -204 -31 -320 32 -159 280 -64 -133 332
5107 332 91 -166 111 100 171 -58 159 275 80 -185 25 132 8 166 -35 -72 -102 -158 -169 109 -101 -111
5129 -111 159 3 -168 95 284 136 96 217 244 -184 -249 22 228 280 2 59 4 149 -74 -84 162 -132
5151 -132 275 -24 48 -61 -202 -79 4 28 -328 -207 142 -53 257 180 -27 -89 -173 -101 75 -86 32 -247
5173 -247 -158 116 99 71 22 -93 -5 74 29 -377 -81 139 -1 157 -78 220 -178 146 100 -64 137 -37 -142
5196 -142 -21 204 -71 -23 -210 12 -143 95 140 -123 -231 86 344 -69 86 92 72 256 -70 160 136 -284
5218b84M15N5j06j11J8k46L67j96l5K29J1k93K23L6nJ15m31N62k93o9l1j56L22
5241I7k00K74j70j38nJ73p5K11j86Lj73l3J42Q0J6k59O75l67j04l86N46N25m42
5264B04m47R6j55j66k66O90n7M26K56j046M39r46Q79L87L46n64k35K75k03O31
5284E44k24p3n32L02J04j72K12J07o35P68q1l17J917j686j134J656l08k9q60J077
5304F36j047M33p65J448r16L1L71j97p36J221j21m02L12j00K5r34P97j05n89O56
5324A8j68k50j14J38O75n22L36n60P94J53l18m53L76p9L66J42n26j78P3k01P43
5345D45m67o3J28N51m70k70J11L0k86K21P8L99l05l46J88j9L84l32L26l77L12
5366B38k27P2l23L58m54L27p6J19R0k46PL8K67K48l63j85M89n62K90J54j89j2
$$ plain form
5218 -284 131 186 80 -31 -13 -259 108 -88 -123 106 117 -176 47 83 78 193 -238 324 31 -38 -69 -225 97
5241 97 -103 171 1 -137 -142 31 -44 167 -19 -16 -189 -222 -80 0 16 -243 432 65 -39 -425 121 646 204
5264 204 -243 -147 -302 -468 -734 -44 -101 325 581 -465 -26 -972 -93 294 640 76 -159 116 -87 544
5284 544 320 247 -285 17 121 -51 161 268 -367 401 320 3 1920 234 -900 756 448 419 -441 636
5304 636 -411 22 -743 705 -211 -180 191 -6 -742 479 358 -44 268 168 193 -741 56 -49 -638 18
5324 18 -150 -400 -514 -376 299 -223 113 -447 347 500 182 -271 105 26 392 534 8 -170 -97 -298 445
5345 445 -22 -85 43 594 124 -146 -35 -5 -291 -70 8 407 102 -244 -56 -75 309 -23 303 -74 238
5366 238 11 83 -240 118 -336 -9 -85 34 124 -122 -115 -77 190 438 75 -110 379 -183 107 261 72 60
5388F0M00p95Q75l83L00q01N19O91l4o15L36o75O29m28k51j86L51J86O5Q88q67
5409B65M86k36m18K70k45R7l07P05k87j94M7q4N5q60J508k76l02n51J52N1l52
5430d76N85J43j71l54K63j91P84n21j27J80L2j78j38M91j004N86j70Q34l43m09
5450a84j29M32J16n66O84m52O36q85M9K05n17J76P71n43L59k25K07m97P32Q3l60
5471I2K59m43p3K4J94J15k17L50l23Q5q4J23J38j83J1P3kk85M15P0j35m74N96
5494C26L11q48O66n25J12l80K16J28M5R2J52J53j6p42j06Q65n48P6J6l25M36k9
5516G5l73n8M53Q26j209Q62j030M38J07j33N37n95L58q53Q89l26K7M47N94m05
5536F31r31O08k6M7q58J35O06m7L19o67n5j67L85k36J070j604L94M55Q5J92o3
$$ plain form
5388 60 460 -335 540 157 457 -344 175 866 832 217 553 -122 507 79 -172 -358 -7 179 244 1132 265
5409 265 751 515 97 367 122 219 -88 617 330 136 183 99 154 -706 802 526 224 -327 -175 -124 -476
5430 -476 109 252 81 -273 -10 -201 583 62 -65 115 147 -31 -169 322 -682 -96 -266 568 225 -184
5450 -184 -313 119 235 -331 353 -99 537 -348 -299 -94 -611 -435 336 -207 152 -73 134 -363 369 452 92
5471 92 351 -92 -165 -141 53 168 -49 301 -22 63 -21 102 240 57 68 141 139 -146 269 339 204 -270 326
5494 326 637 -211 455 -70 42 -338 -122 6 51 143 295 448 432 -310 -416 449 -99 -23 -7 -332 104 75
5516 75 -298 -356 97 923 -286 576 -454 -16 91 -42 495 -100 258 -595 294 -32 -5 442 1036 631
5536 631 -300 308 282 329 -529 -394 212 165 484 -183 -238 -405 -20 -256 814 -790 -396 59 144 336 273
5557B73k46J65L01o20O79o13j13O34l95J76p7k79n10O31K14o52K02K6M16n7J68
5578C23P11n89j56K66o09n68R67n04l73M04n18J232p59q6O68P86j477M9N28l00
5598eL79r66M99K81M88o08m54O22M18L58q49n20L35k40j00J790k22j594j95J398
5618H15R8n85k65j30k29N03J77M64j596J002j92n95R08j51L5n93M8K28j90j3K21
5639d0K73M36j73N40j184J72l10J43m19N79n65N47M54j145O37N88O9K2k60K3K7
5660D14p87O65m8l68l38J097J18j81m46n52M75j8j14M73n28M25k66K82k81kL43
5681C63O7m35K4L86k94L08l27O42n55m25J49M5K72l63J88l31j42M2N12L56k02
5702B80l3l54K44j34j4J59q6N49j045K9N74j03n1N41q98N27K72o65K16J32l47
$$ plain form
5557 273 27 192 493 -127 552 -61 -174 460 65 241 164 -115 -625 6 220 -432 -230 -204 212 155 323
5578 323 1034 445 289 555 -54 -622 345 -159 -532 -128 -646 586 -173 -259 409 1195 -282 -233 295 -5
5598 -5 374 -592 -93 188 676 68 -386 236 654 1012 163 -357 -22 -262 -362 1428 1206 -388 -583 815
5618 815 913 328 63 -67 -296 207 384 848 -748 254 62 -533 375 224 259 -334 -286 -58 -248 -261 -40
5639 -40 233 669 496 1036 -148 24 -286 -143 -562 17 -548 -1 453 -692 -55 533 602 624 364 387 414
5660 414 -373 292 244 -124 -462 635 753 572 126 -426 49 31 -83 390 -138 287 21 303 22 20 363
5681 363 430 -5 19 405 111 419 92 734 179 -246 -97 -52 220 -143 45 -286 -428 -386 126 482 280
5702 280 247 -107 137 3 -11 148 62 611 -434 -405 169 66 15 556 -342 185 457 -208 8 140 -207
5723b07J11q0M88m01o03L49J42Q82m77l31K44o9M55n11l07O36m67O24n31K31m93
5744c15P83n15M2o5L8L61l88L74n97M01J79n8J02l94J60O5k8N0P4l52qK01n8k20
5768a68O92n03o85P77l52P40n21Q41n41j80l37K55J53q5J15j07p81M82M01j28
5788F8L94L39o62K58O8n95L47O37r19K4J6J64m02M70J80o17M27l97j62L86QrK86
5811C09k21J92R0o39O89j28k59n10m19N57K43J75N1O5m56R66r14J75NN65l55Q08
5833I89p39l07K46n66Q96l57o4o00O70M3M8p34n88J148N28r13M30k68J46K67k48
5854B7J18l29J33o2N30l60j56Q9L9Oj96M3Kk20M69J97r9k16L8n4r4L0Q9m3J41
5879A22j06K06l18k9K51M7j91J42k40M6N1n7n1l04K02M08r6J92l78K05k62L83
$$ plain form
5723 -207 -96 -176 312 -89 -692 -343 -201 681 204 -127 117 48 503 -8 -315 321 -146 478 -53 178 -315
5744 -315 468 -47 -5 -70 -32 329 -59 315 -282 119 298 240 342 -52 108 173 145 195 269 -83 -91 110 52 -168
5768 -168 524 21 -664 113 -239 501 -20 821 280 100 -237 18 171 86 201 94 -687 -205 196 68
5788 68 462 801 139 397 465 -130 217 854 -65 -41 -25 139 -263 207 387 -230 197 -200 -362 24 32 23 309
5811 309 88 280 370 -269 420 292 33 -477 -896 -339 -96 79 130 195 -261 705 -209 -34 -29 536 181 989
5833 989 250 -57 189 -377 519 162 98 -502 168 211 259 -475 -1063 85 613 -300 130 -138 8 275 27
5854 27 145 -184 -51 -113 417 57 -99 -10 29 35 -161 -118 -116 -336 133 330 231 15 53 -1 -95 -65 24 -19 122
5879 122 16 222 -96 -125 126 173 -18 124 -116 -70 -19 -76 -127 -431 -229 179 83 275 -103 102 -160 223
5901B23l49J05j39K79k8k8j91q8M45l24K31o9k54J16J06J2O7j30j00J50J24l76
5923b18K78K58k30j51N35k86j72j41J53l71J40K5K7K31j72J8k9L42n01L4J62m13
5945d81Q53l53J02j71k56J63J6M71m29M84o80L26Qok14q9N44l62K23J68k57j20
5967f0J63M5k60J62l00O77p64M49l82R7L31J98m82K37k59M14j50n39J74l83M33
5988a99p6J70j77Q1N01k94j41k5nJ94L20K6m89N00o65J18J41k31O4m98K10L84
6010i1K91k70m92K38M2M20K24J52m32k85L96l25R5J60M1q6o1N4j81J38Pj15j24
6033b04J34k6L67Ok69j30L00j00j40J90r8k17J91K79k43j27P5J12k44K81j10K00
6055B27l32J5O5P5l37N38k76j61J62j98L41p2j76Q1Q6M1l0K08l16j06K98m4m9
$$ plain form
5901 223 -126 -21 -160 119 91 63 -128 -216 229 -95 136 67 -187 -71 35 47 114 -16 -116 34 158 -218
5923 -218 60 318 88 -63 472 186 14 -127 26 -345 -205 -180 -153 78 -94 -76 -105 237 -264 -230 -68 -481
5945 -481 372 19 121 -50 -306 -143 -127 344 -85 399 -281 45 53 47 -167 -256 288 -74 149 317 60 -60
5967 -60 103 148 -112 50 -250 427 -337 112 -270 -173 158 356 -126 111 -148 266 116 -423 -249 -632 -199
5988 -199 -275 -105 -282 -201 300 6 -135 -160 -165 29 349 375 -114 386 -279 -161 -20 -251 -187 -685 -475 -91
6010 -91 200 -70 -562 -324 -282 138 362 514 82 -203 193 -132 -37 123 164 78 17 71 -110 28 35 -80 -204
6033 -204 -70 -96 271 277 8 -122 178 78 -62 128 30 -187 4 283 40 -87 -12 100 -144 137 27 227
6055 227 -105 -90 -25 50 -287 251 -25 -186 -24 -222 119 47 -129 -48 38 79 49 257 -59 -165 133 89 40
6078D0J11j21j4J5o1Lm8Q6J40k16lk38K90j84Q3K00K7J53m10K84k5k21L97j63
6102A25k98J25L83k70J40j0q2K61k16j14N81m96K42L41n27J56k29K47o94o7K50
6123a52P54m87M1k69J02K64K02k39j74n0J90k42o59L45M02l37M09j95j26J99M06
6144C84m87J82L28J01P14n32k81l72K88M48l12m2j50r28M02P73L4j006m2J281
6164G83J85L73l78r66M3n65M39l7M67q1l74p5O14n88K17j6l57P16l57k3L78k17
6186A81M48o40J77n48L58M13k9q4o3l90L67J43l40N48m16K12k61m0Q9j57j83K08
6208gm5J27m92P52P9l79K36m68M71q65M45J93K27m27K28R8l42K77j66J83j60L
6230c2l56N49k80P0J51l49M25O2m31L66k23j4K98q2o13M99j00j4o7J35J04j13
$$ plain form
6078 40 151 30 16 31 -30 -27 -75 11 151 -65 -68 -306 -16 -200 -117 83 110 263 -147 137 112 -109 288 125
6102 125 -173 -48 335 65 205 195 113 374 158 44 625 129 371 712 185 341 112 359 -335 -402 -152
6123 -152 602 115 156 -113 -11 253 455 216 42 -8 182 -60 -719 -374 28 -309 100 -95 -221 -22 384
6144 384 -103 79 407 508 1222 690 409 37 325 773 461 419 269 -659 -257 516 550 -456 -498 783
6164 783 968 1341 963 -3 40 -525 -86 -123 344 263 -111 -186 428 -160 57 41 -316 400 43 20 398 181
6186 181 629 -11 166 -382 -24 389 360 276 213 -177 190 333 -7 541 125 337 76 36 125 -32 -215 -7
6208 -7 -52 75 -417 335 414 35 271 -197 274 -591 -146 47 274 -153 75 173 -169 108 -58 125 -35 -32
6230 -32 -388 161 -119 -49 102 -247 178 240 -191 175 -48 -62 236 154 -459 40 -60 -74 -141 -6 98 -15
6252a5K14j02J25k76J78p4Q6j53p2k2K76j05j57Q2K80l50j63J33m2j5M7j60J73
6275a12K80j81k66K00Q3m0J15j66m9K40M1m37N58k00l39J07J97L7j1K28m89J23
6297h1J83M4p3j20J06p9j6o2L20m35L35n6j03K43k47L3p2J96k9r9M5L00m19j60
6321b46K90j91OP5J36j27J47j49J90J2O9j82J16j19J9l8j60OO5J12m4j55J88l54
6345c34L34L6J52l79K08RJ11mj64O2J95k62n9r1L57R5n17K84j23L02m64K64mj17
6369a09K60q9n8l51J88N42l83j31J18N6j45J8L25r0j85k00J80R9rj69L38k34J50
6392A21j68J08j81K01J2r5Oj30L75n08M30k08J4k26L40j20K4K37o5k84J2K33l21
6415a93J16O1k09K40k5K87l12J35l49L51n4l09K38K18k59K55k13M59m78k21N63
$$ plain form
6252 -15 199 97 222 -54 124 50 136 -17 -89 -111 165 60 -97 -15 265 -85 -248 -115 -157 -172 -125 -285 -112
6275 -112 168 -13 -279 -79 4 -36 79 -87 -136 104 145 -292 266 66 -273 -166 31 68 57 285 -204 -81
6297 -81 102 146 73 -47 59 -20 -36 -98 222 -213 122 66 -37 206 -41 -8 -80 116 87 -12 33 333 -86 -246
6321 -246 44 -147 -141 -66 70 -57 90 -59 131 143 212 30 146 27 46 8 -152 -146 -81 31 -13 -168 20 -334
6345 -334 0 36 188 -191 17 26 137 133 -31 31 226 -36 -95 -186 171 266 -251 33 -90 212 -252 12 8 -109
6369 -109 151 62 4 -347 -159 383 0 -131 -13 43 -102 -84 241 151 -34 -234 -54 45 36 -133 205 -29 121
6392 121 -47 61 -120 81 93 -2 4 -126 249 -259 171 -37 -23 -249 91 -29 -5 232 167 -117 -105 128 -193
6415 -193 -77 -16 -225 15 -10 277 -35 100 -249 102 48 -261 -23 195 -64 191 -22 437 -41 -262 301
6436C01l30nJ9O8M2n4j83k7J85l38J89J43k11K22j72K60j29J46J4Q1m38K49rj19
6460i6pJ23j7Q8j54J04M9r5J06o4rK6J29k10L14k41q4N9n5k2j71Q9o4J18N9Q1
6486E6J3k11M27m23J08K2L19m94K38j76K16R7p8J04K41m36R6o9J76J31l99K35
6508A93k26Pp3L62j91k83J15K11Q8n84N00k7k35j40J05j12J62J55O3K96l87l22
6530c23J28K78l90N35j86n90O18k47L93k69l48L09M56o28M3J53K06J6J68j83M
6551A43J00k22m62N56M22m74J4n49R88m74j93J51j7Q1k77J24J87m57L27L81j19
6572B30l18j17K40p2j01j15J53J49O67o75N36j061Q91p63K00N78o33M60j11M0
6592A78J92o94q5O59m75K9l42J44M2O80p13Q21p77O2Q0M66n24j12M86K29l50J66
$$ plain form
6436 301 -29 -34 -15 53 95 41 -142 -169 16 -322 -133 10 -201 21 -151 109 -20 126 140 221 -217 32 23 -96
6460 -96 -103 20 3 91 -63 41 90 -5 101 37 28 54 183 -27 287 46 -38 21 -34 -56 -227 -138 -202 -84 -25 56
6486 56 69 -142 285 -138 -30 -8 311 -183 55 -121 95 192 114 218 459 23 119 50 226 357 -42 193
6508 193 -33 -26 -99 263 72 -211 -96 115 203 -381 119 92 -143 -283 -178 -290 -128 27 90 386 -1 -323
6530 -323 -195 83 -307 228 42 -548 70 -177 216 -53 -401 -92 364 -264 -221 -68 138 154 322 139 143
6551 143 243 21 -441 115 537 63 77 -472 516 42 -151 0 -17 64 -213 -89 98 -359 -32 349 230
6572 230 -88 -205 35 -37 -138 -253 -100 49 716 41 577 -484 407 -356 -156 422 -211 249 138 178
6592 178 370 -324 -409 250 -225 -196 -538 -394 -352 328 -385 436 -341 -279 -199 267 -257 -369 117 346 -4 162
6614A62K7l37o1K91o0M15m57N4P9m98N76J38m44j77P14l08J68m7m2l2K1j39nK08
6638B46o87M26k81J78K80p6k48M5J80k24J91j91l9J51j7j88M3Q3K73j89J58m41
6660c27L12k39P5M81m27J61J0R3l05L48J26k85K1R4k58N38m24l41M29j97J85k59
6682a89J39J01l7r6J38J5j72j90L65j4J60J56k78l3k00J29o9J18m8K7l42L2J43
6705a45J17n6J96k10K38J55p7j69o8K50o0q3Rj05j17J57p3L34l45L1j58L04N0
6728A75j02j88K01N5k5j25n9K56m18J68J77k6K4k09L07k58j90N18k15n2K9k13
6750a70J26N2K33l74Q0R2J01m20K90J78m74M25l4l70L55op8k40Q6J45n9MJ1L07
6774B60k88J07j76O8L1k08L07k06R7K10k88R0m9j13K10J37l69L25k75J73Rk05
$$ plain form
6614 162 189 -148 -209 82 22 437 -20 34 113 -385 191 329 -115 -292 422 114 282 235 193 161 182 43 38 246
6638 246 -441 -15 -296 -118 162 86 -162 -117 63 -161 30 -161 -200 -49 -66 -254 -211 -128 145 -44 114 -327
6660 -327 -15 -254 -179 302 -125 36 46 139 -166 182 308 23 44 138 -120 418 -6 -347 82 -115 70 -189
6682 -189 -50 51 14 -82 56 71 -101 -291 74 60 220 376 98 65 -135 -6 -75 43 -5 22 -320 -288 -145
6705 -145 -28 -84 112 -98 140 295 218 49 -19 231 171 88 97 -8 -125 32 -41 293 -52 -21 -179 125 175
6728 175 73 -115 86 141 116 -9 -68 188 -230 -62 115 89 113 -96 211 -47 -237 281 66 14 43 -170
6750 -170 -44 8 241 -133 -53 39 140 -280 10 188 -286 139 105 -265 90 84 6 -234 -148 -3 -62 -58 -47 260
6774 260 -28 79 -97 -29 2 -206 101 -105 -8 202 -86 4 -45 -158 52 189 -180 145 -130 43 52 -153
6796a53L25q0k27J58m7j55K79j00l0J69j42o7M55m99K0J55K95k61K13p1j30J61
6818B68k46J20k87J32j55K30l5K49k82L27m13K40j09O0p7O3L1L7j8jJ5k93J74
6841C0m16J06L90k03J71k12k1K2L15j9nk9j35j64J74j72J39M84k91m40L69k65
6863a72M88k28J55k60J39m41K91J77j23J56k21l0r3J30K26n01J18J82j89K12J
6884A7jm6j43K65O3k20M9J19Q6N2j29j22R3m79N32k50K13j10Q3k3k81K6J09O9
6908b8O5j72QK64k30L23j20J14k53om5j46O84m83J52k39M9j86J39m1J71J22p5
6931F7M5k96j26K59P0o8Q2O0l15N33m43L64j43J48k03l62K32j7J61l02L35k55
6953a74J31J64j52Pj65J82j99M1J91J50n2j10J91j70k78K07J48j74M7p3K29j36
$$ plain form
6796 -153 172 92 -135 23 -24 -179 100 0 -30 139 -3 -70 385 -114 -94 61 356 95 308 237 107 268
6818 268 22 142 -145 -13 -168 62 27 276 -6 321 -92 148 39 99 22 85 116 153 135 134 149 -144 30
6841 30 -386 -280 110 -93 78 -134 -155 -133 182 163 158 129 -6 -170 4 -168 -29 455 164 -276 93 -172
6863 -172 316 88 243 -17 122 -319 -28 149 26 182 -39 -69 -162 -32 194 -307 -189 -7 -196 16 17
6884 17 16 -30 -173 92 155 -65 -16 103 189 241 112 -10 83 -396 136 -114 99 -11 72 49 -232 -206 -97 -28
6908 -28 37 -135 -127 137 -93 230 110 224 -29 -35 -80 -226 458 -25 127 -112 -63 -249 -110 -151 20 142 67
6931 67 112 -184 -310 -51 19 -49 33 93 -222 311 -132 232 89 237 34 -328 -96 -113 48 -254 81 -174
6953 -174 -43 121 -31 -24 -189 -7 -206 -165 26 176 124 14 205 35 -243 -36 112 -62 -15 -88 141 5
6975EK17l45J15K64l40j63J51p1J49N5n7o4L5Q7J02m00M02j81j81j4K34m3M9L0
6999C6N1j1j16J85k20K10l31K99O8j9r5j14J93j80j22J48J43j82j5j3Mj7J86k11
7023a23l2K11l62L60O9N7l76J52J02j0o2j41K1N2j42K37j16L30l97K30r4J75r8
7046D3l08L76j40L1q4K43j30r6J53k90Q1N5M93o50qK81J69k57J1J32k57j21J74
7069i9k8m6J2o1K89l8J57Ml18j7K33j5Lk76M2K78K75m27l23L82p0N0m1R0l39K30
7095e3J46k13JNq5J8J26q5J15J04p2R6K7j03K30k55l5J66n4o1O6j18N7o0K34k72
7121g5j21M76n21L73j85J95j95q4J09P9Q0j25K61j67l22J25K89n2L3l09J24J55
7143A43R9l05J54p6Q5r7n6j08Q5J74k61J98k74M79n57K88J50k36J52k82K9O8J23
$$ plain form
6975 5 222 -123 -8 256 -84 -247 -96 -167 -18 37 -20 -84 -49 38 140 -260 142 -39 -220 -234 0 -43 6 36
6999 36 87 76 -40 145 -75 135 -196 103 171 152 57 -57 136 -44 -166 -18 125 -57 -72 -85 -81 -98 88 -123
7023 -123 -155 56 -306 54 123 180 -196 -44 58 48 -14 -155 -134 -82 -224 13 -103 227 -170 60 -34 141 43
7046 43 -265 111 -29 2 -82 161 31 -65 88 -202 -121 -66 427 -223 -231 50 219 -38 -27 105 -152 -273 -99
7069 -99 -127 -173 -161 -222 67 29 186 190 -128 -145 88 73 76 -200 -158 120 395 -32 -355 27 -43 7 -34 56 -283 -53
7095 -53 93 -120 -119 -114 -199 -181 -55 -140 -25 79 7 103 130 27 257 2 -33 133 79 18 84 -34 23 -37 197 -75
7121 -75 -196 280 -241 132 -53 142 -53 -137 -28 51 131 6 267 100 -222 -97 192 140 173 -136 -12 143
7143 143 242 -63 91 15 100 3 -53 -161 -76 98 -163 35 -239 240 -317 -29 121 -115 37 -245 -216 -148 -25
7166b5J96o7k33P8J15j42o0K77l99L09L1m0j73L4J4J80j25j3O2j40M32n2k67r8
7190a06J20k9L37m13Q5j4O9j65n4j00J74J41J99k09n6j40L72k56K30k5J1k48R4
7213A7j01rK74k34r9J7K71k58L81j35k36k28L92K3J91j73J51k26rl75M16q4j77
7236b11M43j40K36m73P7j20L3M1K17Mk16M29k18j55M86l50j25J47J64k70J77k03
7258b7q2J69j33J21PJ18k77p8L72j53J20l60L36Qj10j93j7n4L67Nm00K66j43L09
7282A71J4j82R0P5K5Nl98P1J09J85o5j27j69K34jJ8k33J37j35M21n08K34K06j29
7306D8j99J75l7J15%l34K59P0p1j2l62N33k10m15L02K35j02j35J60J45l9L6j97
7329c5P3n0Ko7K43l32K05L3k08k8J6M10l57J56O0k12k7J21KK03k60o1r4L12j90
$$ plain form
7166 -25 171 104 -129 -51 64 -78 -138 139 -260 49 80 40 -133 -99 -85 95 -30 -43 19 -121 311 259 -8 -106
7190 -106 14 -15 322 -91 -6 -20 49 -116 -170 -270 -96 45 244 35 -21 -161 211 -45 185 160 171 -77 17
7213 17 -84 -93 181 -53 -152 -135 136 -122 259 124 -112 -340 52 75 266 93 244 18 9 -366 50 -34 -211
7236 -211 232 92 328 -145 -68 -188 -155 -114 103 107 -109 320 102 -53 433 83 -42 105 269 -1 176 -27
7258 -27 -109 60 -73 48 55 173 -104 -182 190 37 157 -203 133 141 31 -162 -179 -233 134 139 -261 5 -138 171
7282 171 185 3 93 168 193 198 -200 -129 -20 165 100 -27 -196 38 37 55 -178 -41 -176 245 -263 -29 177 48
7306 48 -151 24 -13 102 102 -232 27 97 26 14 -348 185 -25 -440 -138 97 -5 -140 20 165 126 162 -35
7329 -35 38 -12 -10 -77 166 -166 39 72 -136 -164 -148 262 -95 61 121 -91 -118 3 5 208 -52 -113 -207 105 -85
7354h5Q5O9O4q7Q2j44QP4j10J07J29n02L57j97K62J0l25K22J08j30k30J67J17
7377E1l04K30J50k70K5M2PK01p7j42K43k40J98j83p2L2M31m13J58L8J11m46O4
7400a66L15p5J26l06K78l30L11k00k10K00J67l3l23J57J66N8k46L1k8J85R7j00
7422G4j43K56k30K09l70J53j5j28M7K99j19q4J55o7P9r3j3QJ98j01k03O7O5Q7
7446A31j04J24M3k61n1j67O32k86l30J51J89k20K12m5l8N8LJ5rk5r4j46O9K04
7470E5m11M44j39K9oJ50q4J23M8Q0j45j74M8j63J64QM7q4J9k49M47J72l34j7O0
7495H8K30n13L92l84M92n31nJ60Q8O7k00N1J35j19K42j29j74k6L8J15M9k17K45
7518I4kr2J0J87m89K70P5j20n4j52K68j3M2K13j28j7K83p03K49K32m5j63K23k41
$$ plain form
7354 -85 0 69 133 46 128 -16 -8 66 -44 63 192 -310 47 -150 112 122 -203 19 127 -3 -233 -66 51
7377 51 -253 -23 127 -143 -118 -76 -69 132 55 -87 156 -84 114 -69 -141 -109 322 -91 67 105 216 -230 -166
7400 -166 149 74 200 -106 172 -158 153 -47 -257 -57 110 77 -246 -89 77 135 -111 -80 -108 77 174 74
7422 74 -69 187 -43 166 -204 -51 -66 -194 -147 152 33 -51 104 37 116 23 10 18 216 115 -88 -21 44 131
7446 131 27 151 194 -67 -118 -285 347 61 -269 -118 71 -149 63 18 -20 38 41 56 47 22 -72 -218 -149 55
7470 55 -356 88 -51 -22 -28 122 38 161 209 289 144 -30 18 -145 19 27 74 -10 9 -240 207 379 45 28 88
7495 88 318 -195 197 -187 305 -226 -231 -71 17 84 -116 -65 70 -49 193 64 -110 -136 -98 17 66 -151 94
7518 94 92 0 10 197 -292 -22 53 -67 -121 -273 -5 -18 24 237 109 92 375 -328 -79 153 108 -55 168 -73
7542g3J07o0K4m4mJ63m2J5j42R3n3N6O6O9p9Pk61K84j91J39L1M2k4q0l1j88L45
7569A69j97l3O4N1k30M43m9k84R0O5J13j16j38J01J16k18J40Q0p0k16J62j77q2
7592b16L34J47j43l08M30l67J91l1k90M19k07j35o0J18j16L27Q8j05j25M9J64
7613A64m15K89K69j61k46R5k35K70L4j3P6j09k2N0J03l27J82K19l6M3l00J55j84
7636i9J15r1p8Q6k8J27j50K28Q9k25m8L06l88k1J35o9J71j28j6L59l04Qk45N75
7660C09j90l84J17K20l25K92k95L81m60N05J15l60O6K84P5m57N97o59M83j68O0
7681B06j18J77M0n00O5K1l02Q74O4p17k87N75p19J130q36m6K54J14l77M18J085
7702A121r34q4M32L44j119N65j35J25k98L26L15m45k62L79K95k47q3n64K74J73
$$ plain form
7542 -73 34 -26 -2 -46 -50 113 71 86 -56 37 -16 40 106 175 96 103 -158 126 -65 74 105 147 123 43 12 -176 169
7569 169 -28 -61 3 54 -176 267 218 -66 24 89 202 86 -52 49 165 -53 87 167 97 -119 43 -134 -216
7592 -216 118 265 122 -186 244 -123 68 37 -253 166 -41 -176 -236 -118 -234 93 181 76 -49 0 164
7613 164 -251 38 307 146 -100 -5 -240 30 64 51 127 18 -4 46 149 -178 4 223 187 230 -70 85 -99
7636 -99 16 -75 -153 -67 -95 32 -118 110 199 -26 -74 232 -156 -177 -42 -111 60 -68 -84 275 -29 -21 -266 309
7660 309 119 -265 -148 72 -253 39 -256 125 -335 170 285 -75 -9 275 350 -107 490 -169 314 146 206
7681 206 88 265 305 -195 -130 -109 -411 463 527 -190 -477 98 -621 509 -327 -373 -119 -5 -382 36 1121
7702 1121 187 103 535 879 -240 325 190 315 17 343 658 213 -49 330 625 378 295 -269 5 178
7722A78K59k04q6m23N54L22m93M30l46J78o2J29m33l6K9L93k85O5n14L26j6J12
7744G7K99j76L72k40N2q2O9o05j71j47M21Q9J27m99N07O76n66j63L58m19K06j66
7766A9J30m86M78k71K89K36n71p6N34k26l51Q41n76J0k47M11m44P98O1r30J78
7787a93Q05p90L30n35n09P01k11j05n74R19o95N37N00r73L54O17K86m21k27L68
7807A84l92N38L88o83M06j92l37l56O26J43l9j92L0l05J35J37Q0j39M05r04J84
7828b83N17j88j71q0j02O6J4K94m03K87jRr8J87j08m2PK0K23n6L0p2j01j30K00
7853A9M1o8Qn5M4K2R0Pj7l14M09j36p6o7K13Q1j5J0r8j96PR6k34M72jm54M53k84
7881d3j35K15m8O3l9k03P0Q4N4K47k01K8J19k54n3J29M5J70m65K38Nj86K94l12
$$ plain form
7722 178 437 233 147 -276 278 600 107 537 191 369 307 436 3 -33 -4 389 104 169 -345 -19 -35 77
7744 77 376 200 572 332 384 302 371 -234 -405 -552 -131 -42 85 -414 93 769 203 40 398 -21 185 19
7766 19 149 -337 141 -130 159 395 -176 -252 282 56 -295 546 -30 -20 -267 144 -300 498 559 -371 -193
7787 -193 612 -178 152 -383 -892 -191 -402 -507 -1081 -162 -857 -320 180 -793 -439 178 464 43 -184 184
7807 184 -208 330 718 35 441 249 -88 -444 182 325 286 94 124 -181 -46 91 171 32 437 -467 -283
7828 -283 234 46 -125 -205 -307 -241 -227 67 -336 -49 -50 -41 -139 48 -60 -102 -95 -75 148 92 122 50 -51 -181 19
7853 19 60 -8 0 -55 -11 11 101 108 91 -223 186 50 -26 -93 120 201 186 196 98 -98 -91 5 -229 243 242 -212 241 -43
7881 -43 -178 37 -11 52 13 -190 -120 -36 18 265 64 92 211 -43 -96 33 78 248 -217 21 26 -160 134 -178
7905a78L5L57j21P5l33J29K90l05j3m9L13m6N1k46J67l12K82p2j58K7j36J73K32
7928A62r0K9j06K85l59J72R6j10J63k54N1j33J54p7p3j24R5k6l2M37m84M60j61
7951G5P8k09K11j36q1qJ48n9J27k99J47R1k04J06j22O8K9j39N9M8R3RJ51m1j39
7976CK46l10p9K33j60N3J49J49l02l0o3M7J04J15q7K31l73q4J85k03K98P%L7r8
8001F8k7k22l8K88N8j38k44K30J0K99m81M37l48J52m1j43J28kN8J37j50n3j24
8024a46K36j59J5p9K78k38J46j76k0j34L49j55j46M44Q0k90j55L42m99L60l0j42
8046a19J86M0j29N5r0o2K37j36P3j42J59P6j70j76J78J30R5l61j28L17J84k97
8068h0K43j6k01P3k49N57l77J1J79J50l73L05k55J5j01r3M1Q8k10L6n2L35k50
$$ plain form
7905 -178 -143 214 93 168 -165 -36 254 -51 -64 -113 200 154 205 -41 126 -186 96 24 -134 -107 -243 -70 162
7928 162 72 101 -5 280 -79 93 189 79 242 -12 39 -94 60 -17 -90 -214 -119 -145 -177 260 -224 236 75
7951 75 153 -56 155 19 -62 -70 78 19 146 -153 -6 85 -119 -13 -135 -67 -38 -177 -118 -70 23 32 183 142 3
7976 3 249 -61 -140 93 -67 -14 135 284 -18 -48 -111 -64 40 155 68 299 -74 -158 27 -176 122 129 129 166 68
8001 68 41 -181 -219 69 127 -11 -255 -25 -15 284 -197 240 -108 44 3 -140 -12 -14 44 181 31 -22 -146
8024 -146 90 -69 -54 -133 145 -93 53 -123 -143 -277 72 -83 -229 215 295 5 -150 192 -307 53 23 -119
8046 -119 67 107 -22 33 -57 -119 118 -18 55 -87 72 148 -22 -198 -20 110 205 -156 -284 33 217 -80
8068 -80 163 147 -54 19 -230 327 -50 -39 140 290 -83 222 -33 -18 -119 -212 -171 -83 -293 -257 -309 26 -224
8091b24K41P4rN2l24M11n2k11K83l71K07L3r5Q6j26q2L77r9j21j24K63l78J87
8114bJ42k0q2lN8j43M8j47Q0j2n2K8K33k31R5l56L12j15J16L4j09K05k43N8J51
8139D5m1n1J29k50L11k54J03m6K45m18K42j07K62j71r3p3J66K64j79p8J71k88
8161a11m7J07K4l6k3R7j73L07j29o6o3J49k71L27k17q5O1J9J0J88j27M5n6Q9J10
8186A29pK7q5j19m37
$$ plain form
8091 -224 17 91 82 134 -190 221 169 -42 241 -130 77 110 15 101 -25 -107 270 171 50 -74 189 -189 -2
8114 -2 140 120 38 35 93 -50 -2 -149 -69 -81 -133 -105 128 -103 -8 -364 -52 -167 -51 -17 -126 79 -164 -106 45
8139 45 4 -47 82 -168 143 -111 -8 -54 191 -227 15 -92 170 -1 -94 -167 -1 263 84 6 177 -111
8161 -111 -158 -51 -27 -63 -86 11 -162 145 16 -50 -113 36 -235 92 -125 -210 -149 -130 -120 68 -59 -14 -70 19 129
8186 129 122 149 64 -55 -492
8191d92
$$ Imaginary data points
##PAGE= N=2
##DATA TABLE= (X++(I..I)), XYDATA
0@%%%%%%%%%%Qj6J6j6J6k4L2m0M8n6P2q8J04j20J37j61J92k24K56k94L39l87M38
33B32m95N60o31P10p98Q93r98J110j232J368j517J680j858K051k262K494k748
50a441L026l333L675m054M477m949N486o102O813p645Q636r840J1340j3269J5849
65H669j9503K5113l4919N6979j97597J8711K83163j65840l5579J7142j9016P0730
77H053J25243j28095q9237J23786P8890p9617j2594k3846k6108J00680O0477j39955
89b323p3173N9350L4665k0910n1204n7791M2407P9727j2884n7052N936L5984M1877
102B4609L7213l2058o2970M1112O0234k8592k4621K556j0451M0277K7861p8545
114c375n0102N9359K8100m9010k9361j089k916L1607K5590m5234j4579O3338K0869
$$ plain form
0 0 0 0 0 0 0 0 0 0 0 0 8 -8 8 -8 8 -16 16 -24 24 -32 40 -48 56 -64 73 -88 104 -120 136 -158 181 -206 232
33 232 -263 297 -334 376 -422 471 -527 583 -649 719 -798 882 -976 1075 -1187 1307 -1441
50 -1441 1585 -1748 1927 -2127 2350 -2599 2887 -3215 3598 -4047 4589 -5251 6089 -7180 8669
65 8669 -10834 14279 -20640 36339 -161258 -142547 140616 -25224 -60803 -43661 -62677 8053
77 8053 133296 5201 -84036 39750 118640 39023 26429 2583 -23525 77155 137632 -2323
89 -2323 -75496 -16146 18519 -2391 -53595 -111386 -68979 10748 -2136 -59188 -53252 -17268 24609
102 24609 61822 29764 -33206 7906 68140 39548 14927 17483 7032 47309 75170 -3375
114 -3375 -53477 5882 33982 -15028 -44389 -45478 -48394 -16787 8803 -36431 -51010 12328 33197
127C3197k5483J292o30m385K3437R847k6343j6060K1328J8868j6299k4178o899
140a2308J0242J6136j2221l3572n413J9033J3413j957j3550K266K1636Q860l712
153H853o104k195J1674R075q725j2532j939J1160O795j0400r788j084N869P773
167H432j0947j6401L912R052M240k8p439O05J0310M685j035m720K8P017J52p144
183G19m642J16Q193L935q302n665O98P198N521j0049q133P901L907j209K05l134
199b741J496N417J34m727j426M971j108o973K265Q52n178O393M846p871j125N031
215B56J761J240l98l451k014M913M615m936l241O361o08m384J295k687j595J976
231h97l446l406Q93J941L745o91j282J151J651L742J168k655N46J033k85J669
$$ plain form
127 33197 7714 9006 8376 3991 27428 37275 10932 -5128 16200 35068 18769 -5409 -12308
140 -12308 -2066 14070 1849 -31723 -37136 -18103 -4690 -6647 -20197 -17931 3705 12565 8853
153 8853 2749 554 12228 21303 12578 46 -1893 9267 16062 5662 -4126 -5210 659 8432
167 8432 -2515 -18916 -15004 -5952 -1712 -1740 -9179 -8574 1736 6421 5386 666 694 7711 7863 719
183 719 -3923 -3807 4386 8321 19 -5646 -4948 2250 7771 -2278 -10411 -2510 1397 188 393 -2741
199 -2741 -1245 4172 4306 -421 -1847 3124 2016 -4957 -2692 -1840 -7018 -625 4221 -3650 -4775 256
215 256 2017 3257 2859 -592 -2606 2307 6922 1986 -1255 5106 4498 114 1409 -1278 -2873 -897
231 -897 -4343 -7749 -6856 -4915 -1170 -1861 -3143 -1992 -341 3401 4569 1914 2460 3493 3208 4877
247D877j381r52K925k429l047Q62j600k154r99j342j189j546J984L188r1Q47J555
264d92k39M303K410l396j50J732Q8k81j425O06J438j803k108r89n92M44k866l361
282f681O8j27P24K431l7J568K427k81K363K246l30k96q88Q7M26j641J058k01j841
301A075O7p40j815J234j376l025n35r76R50J651L04J173R59J338K822M75j96J192
319D577q58r80k74o71Q58k49j893q7o52J93N95k111j069k50j263k81Q33N42J677
338a363k58N71K887N14O94M89r16N03n83j492K95M56q91m48n50J93N66j262r49
357a544k82j013K5m05q9J467j66N99J611L54J777Q66j007j78L44n89K66k91n23
376A222m37n78M89j33p70L60j153j647N71k89n52N76k24O3J590N43R36R73K91
$$ plain form
247 4877 3496 2544 5469 3040 -7 855 -745 -2899 -3898 -5240 -6429 -7975 -5991 -2803 -2894 -2047 -492
264 -492 -731 3572 5982 2586 2436 4168 4256 3975 2550 3156 4594 2791 683 -306 -898 -454 -3320 -6681
282 -6681 -6613 -6740 -6016 -3585 -3622 -2054 373 92 2455 4701 4371 4075 3187 3274 3700 2059 3117 2916 1075
301 1075 1142 402 -1413 -179 -1555 -4580 -5115 -6091 -5141 -3490 -3186 -2013 -1054 284 3106 3581 3385 4577
319 4577 3719 2739 2465 1794 2652 2403 510 423 -229 -36 559 -1552 -2621 -2871 -4134 -4415 -3582 -3040 -1363
338 -1363 -1621 -1050 1837 2351 3045 3534 2618 3121 2538 1046 1341 1797 906 458 -92 101 667 -595 -1544
357 -1544 -1826 -2839 -2814 -3219 -3308 -1841 -2007 -1408 203 557 2334 3200 2193 2015 2359 1770 2036 1745 1222
376 1222 785 207 696 563 -207 153 -1000 -2647 -2076 -2365 -2917 -2341 -2565 -2502 -912 -369 567 1540 1831
395A831N32q02N8J037n66m52m54q11O87N03j215m5o24j300l03j202P85L13q43
414b871K56N21N02J926j24J33J917m95k70J001m5J05m66j104N05l82k20j03k044
433a258n07M40j463N9M38o53L01L35L66J322Q22O01J20j63J175N97k63P72p92
452B249j014Q59p53r07J041j468j452o78r1l17L3j99J42o32J309J244n03J728
470E91J254j399P27J331l14M73k82p50j40K66l3j055n32m6j682j295J972j265
488b179j354Q75q99K164P16M18k69J607m00j34M76K64P46j226P43m87r55K129
506B235r07j557P42p85j866R09M44j541r53J464J21K07J042J185r38j61J572k59
524I54K37Q27r18J90j48L8J66K07m64p03j212L23j9p35J69m89n00O01m54O13J058
$$ plain form
395 1831 2363 1561 1619 2656 2090 1638 1184 373 1060 1563 348 303 -321 -1621 -1924 -3126 -2341 -2028 -2871
414 -2871 -2615 -2094 -1592 334 210 343 2260 1765 1495 2496 2451 2556 2090 986 1491 1109 889 786 -1258
433 -1258 -1765 -1325 -2788 -2729 -2291 -2944 -2643 -2308 -1942 -620 202 803 923 760 1935 2532 2269 3041 2249
452 2249 1235 2094 1341 434 1475 7 -1445 -2123 -2214 -2531 -2498 -2697 -2555 -3187 -1878 -634 -1137 591
470 591 1845 446 1173 2504 2190 2663 2381 1631 1491 1757 1724 669 137 91 -1591 -2886 -914 -2179
488 -2179 -3533 -2658 -3557 -1393 -677 -259 -528 1079 679 545 1021 1285 2031 805 1548 1061 106 2235
506 2235 1328 -229 513 -272 -2138 -1229 -785 -2326 -3279 -1815 -1694 -1487 -445 740 -198 -359 1213 954
524 954 1191 2018 1100 1290 1142 1180 1346 1553 1089 386 -826 -503 -522 -1257 -1088 -1577 -2077 -1476 -1930 -1317 -259
545b59j1J2Q54m44P97L25m13j088J174Q76p42m92J066N71k690L21M92j864Q89
564f26L74k535J018J479p52m08J236Q8p87K23J522q61j46J108q86j60K524j002
582A409J98o32L10m84P6p18Q36j644p18K20k15n68L12J363m66j499M66J183K83
601b88m51J274N98j753K048L79L03j325M77P02r97p24J158k725K16K79j583P81
619a631R79p08o1l4j42J226O14L05j011p59J907o2J49J228O47j266N25r37P07
638A676K40r58j039j148k37n11K47n47J209q15M40K52J19J52k80J397K33o36O19
657D13Q20O03L0L4j731J296m02j304J56m47j721J831m62l31k07q89P44K02M72
676h93J40P5N2M24Q0M95J146P5OK2n49O18k78j464k2M59j352n72P09K02q33k48
$$ plain form
545 -259 -270 -258 596 152 949 1274 861 -227 947 1823 1081 589 1655 2226 -464 -143 349 -1515 -626
564 -626 -252 -2787 -1769 -290 -1042 -1450 -214 -126 -913 -690 832 -29 -175 933 47 -113 2411 1409
582 1409 1607 975 1285 801 877 159 995 -649 -1367 -1147 -1362 -1930 -1618 -255 -721 -2220 -1754 -571 -288
601 -288 -739 535 1133 -620 1428 1807 2110 785 1262 1964 967 243 1401 -1324 -1108 -829 -2412 -1631
619 -1631 -652 -1360 -1421 -1455 -1597 -371 243 548 -463 -1222 685 623 772 2000 2647 1381 1906 969 1676
638 1676 1916 958 -81 -1229 -1466 -1977 -1730 -2277 -1068 -1883 -1443 -1191 -1072 -920 -1200 197 430 -206 413
657 413 1233 1836 1866 1900 169 1465 1063 -241 -85 -532 -2253 -422 -884 -1215 -1422 -2311 -1567 -1365 -893
676 -893 -753 -678 -626 -202 -122 373 1519 1594 1600 1622 1073 1691 1413 -51 -73 386 -966 -1538 -829 -627 -1460 -1708
698a708N49n75M66J144q92J8J430n10l0J051O35l13k96j16P01n67J55l98q58L37
718B23m96l08J70q7q25J82j69Q3O52j90j66L88j04O37O55P4K13j7J85L23o98N60
740A285M9j100r0K5m33N12l55p39q1q4j25J39l98O93l61n50J338M24o4N59l38
761C06R4O69L47j50j48k41j8n42J7O33q25j78l47o64j22N5j81J70k93n5N27k7
783i73Q77M30K09K52J56J21N13j87k01j00l42K87K4j024K90k81p43j82q2k26j60
804a342n90K07M95O0Q35j2n3R13J54j29P72L55m44p6k67J23O8l80k31m49n36K60
826b67o86j19j09o92K23M8L54M89K40L11N15J5N29N55j46j52L66m41q2K76o52
847E75K30p85j46M0n43l5j77o01j28LJ5P98n0N27N20k32M09N56J15o2m3l92N84
$$ plain form
698 -1708 -1159 -1734 -1268 -124 -1016 -998 432 -78 -108 943 1578 1265 969 853 1554 987 1142 744 -114 223
718 223 -273 -581 -411 -498 -1323 -1141 -1310 -1227 -575 -765 -931 -543 -647 -10 645 719 932 915 1100 1423 725 1285
740 1285 1334 234 144 169 -264 248 -107 -846 -927 -1011 -1136 -997 -1395 -702 -1063 -1613 -275 149 85 644 306
761 306 400 1069 1416 1266 1118 877 859 317 334 967 142 -36 -383 -1047 -1169 -1114 -1295 -1125 -1418 -1473 -946 -973
783 -973 -96 334 543 795 951 1072 1585 1398 1197 1097 755 1042 1066 42 332 51 -692 -874 -956 -1182 -1342
804 -1342 -1932 -1725 -1230 -1170 -335 -347 -400 513 667 538 1310 1665 1221 1145 878 1001 1069 689 458 9 -527 -267
826 -267 -953 -1072 -1181 -1873 -1650 -1602 -1248 -759 -519 -208 307 322 851 1406 1260 1108 1474 1033 951 1227 575
847 575 805 20 -126 -86 -629 -664 -841 -1442 -1570 -1567 -1552 -754 -804 -277 243 11 420 976 1091 1029 986 594 1178
870A178j80k71O3m69M9o44j79j2L2r77j36M4R2O71K8K12J91k2O61L60M75n1o73
893D42L71J0J13j58O0m56j79k4p60K97n5l88j25k95L14J83N2J39J28k53P76J73
915C65J66L24l46k1J45j88M04j07o01K31m43P4Q6m12m5k56n96L29M39l88P75o57
937g22K10K06K51J42R6m54O58j58J7M67J08m04n43N28m29l23Q70k61j029Q65n14
958d19J74n6l20M77j064J022k61J04K22ol63K14J55M7K01J50M27r83O27n54M41
979B35Q7p49J43p62Q89m66P4L58N06j227J36J044n92Q2L98n16j93J132o68J284
999A195n09J52j85J98n29K46n9o08K2j42j1k08m50J93m2j62N38K62j54K67j88
1020a74L9N78k34N60j23j07P0P9J33j56l85j52k02k43O7l79r0J75m19pL94K59
$$ plain form
870 1178 998 727 790 321 370 -274 -453 -465 -433 -1410 -1546 -1502 -1410 -739 -711 -499 -308 -330 331 691 1166 1115 442
893 442 813 823 936 778 838 382 203 179 -581 -284 -339 -727 -852 -1147 -833 -650 -598 -459 -331 -584 192 365
915 365 531 855 509 488 633 445 849 742 141 372 -71 3 89 -323 -368 -624 -1220 -891 -452 -840 -65 -722
937 -722 -512 -306 -55 87 183 -271 387 229 246 713 821 417 -126 402 -27 -350 520 259 -770 95 -419
958 -419 -245 -301 -621 -144 -1208 -186 -447 -343 -121 -127 -490 -276 -121 -74 127 277 704 -279 348 -206 235
979 235 322 -427 -284 -1046 -157 -623 -549 -191 315 -912 -776 268 -324 -242 156 -360 -553 579 -89 1195
999 1195 686 838 653 851 322 568 509 -99 -77 -219 -230 -438 -888 -695 -737 -899 -361 -99 -253 14 -174
1020 -174 -135 443 209 769 646 539 609 688 821 665 280 128 -74 -317 -250 -629 -719 -544 -963 -970 -576 -317
1042c17j60M22l82K72J70O2M81n1O5K2k2m3O94q31k55r0j05k55K36n07O8l64K52
1065f38L07m97N45o1q4J60L36K15K49k49R5N16n68P24j9k02l18l20p59Q99l52
1086b1l38j72k43n2N49R19j675M67O54l24P51n06Q07L02o77L32q11P43O71k87
1106A089p46p33K90K86n52pJ72p31n7L38n22Q70k67k00L68J00Q0M67j31J61K68
1127E43j19O3J10K17k14l16j4k57j36j08o4l25K91k12O0J23Mj80J60j88L80j35
1149c17R5M73j31J01N42k33J28k2j80k01k02L5K9k41j16k17j55K20R8j69o4K34
1171b93j41L67j35L18j25k60K70M61m0J79n8k62J57Lo6K53o06l51L37m00K85j03
1193b10j31k49K11l86N17l59L42K96l47N47k04M28J92k22r3J80k49P6J63l94P
$$ plain form
1042 -317 -477 -55 -437 -165 5 67 548 497 562 584 562 519 1213 382 127 37 -68 -323 -87 -594 -526 -890 -638
1065 -638 -331 -828 -283 -344 -428 -268 68 283 532 283 378 894 326 1050 1031 829 511 191 -568 331 -21
1086 -21 -359 -531 -774 -826 -277 642 -1033 -566 88 -236 515 9 816 1118 441 773 -38 705 1376 1089
1106 1089 343 -390 -100 186 -366 -373 -201 -932 -989 -651 -1173 -303 -570 -770 -402 -302 -222 245 114 275 543
1127 543 424 487 597 814 600 284 270 13 -123 -231 -295 -620 -329 -541 -481 -358 -354 -534 -374 -562 -182 -317
1149 -317 -222 251 120 221 763 530 658 636 456 255 53 88 117 -124 -240 -457 -612 -392 -294 -463 -527 -293
1171 -293 -434 -67 -202 116 -9 -269 1 462 422 601 543 281 438 441 375 628 22 -329 8 -392 -107 -210
1193 -210 -341 -590 -379 -765 -248 -607 -265 31 -316 231 27 455 647 425 332 512 263 339 502 108 115
1214A15J45k69n2k15r1L1j92J3J08k0K22J16k50M88j48L95J65k79L00j36j30j09
1236B07M26m28j43pJ35k60Pj82J02l67pJ38L4J95m15R0K00K83L80l28L38J51k69
1259B80J51K11j93k5j40j71K11k09Q3k96N7m81N4j8P1j03j57k3L93J19M57Rk02
1282G8M52k59j92L4L5O89p1m55K56p51K61k25KJ92K8m92K20M62n95K92l41M43
1304F3o2J18OK64K10J1j02Q5J135r29n05K27j408R35N43j85q18k6K18q48J79R76
1326H7j611J217M37q49P74m6K62j002R64O41j441R08N09q4j15q35Q48k29r9l13
1346B3l6j29k97P10r40N96n60j72J66k2L29j62L52J97m4j30J05p0M19J065j899
1367d99J068o45J9N39j97L5N41o00m73l42q9R8m41P99P78m05Q0l84Q06m42Q81
$$ plain form
1214 115 260 -9 -61 -276 -367 -336 -528 -515 -407 -427 -205 -89 -339 149 1 396 561 282 582 446 316 207
1236 207 633 205 62 55 190 -70 -63 -245 -143 -510 -517 -379 -345 -150 -565 -475 -275 8 388 60 398 549 280
1259 280 431 642 449 424 284 113 324 115 198 -98 -41 -522 -468 -486 -415 -518 -675 -698 -305 -186 271 280 78
1282 78 530 271 79 113 148 837 766 311 567 -184 77 -148 -146 46 74 -418 -198 264 -331 -39 -380 63
1304 63 1 119 125 389 599 610 508 593 1728 799 294 521 -887 48 591 406 -412 -438 -220 -1068 -889 87
1326 87 -1524 -307 130 -719 55 9 271 -731 233 874 -567 341 850 766 651 -184 664 435 336 23
1346 23 -13 -142 -439 271 -669 -73 -633 -805 -639 -661 -332 -494 -142 55 11 -119 -14 -84 335 1400 -499
1367 -499 569 -76 -57 482 285 320 861 261 -212 -554 -643 -545 -986 -187 591 186 266 -118 688 246 1127
1388A127m81j227R27l69J67k32J49K21J44m99o0J51l70J62j24m25J97o9L41K55
1408a5k49K41j50j78P69l89L10J8n94Q63k83k71K21l33K18k62r6K7M48l52j10
1429a67o2m05L01q6L12k75M65J35l15J43q4K24k8L8J51J80l01j40j14j35L70m0
1451A67k56J31l45r3o3J71j51J00j84L03K3J48M34l33O7j02L10L6j41N7J3k27
1473F5J9k95K93l0r4l3l97J13K85l26Q9K00m18J51P2M53l64L49p8J31K45J47k76
1496C01M39n66j58K04k36R3p2n28J91J92r2j54k3M1K77n2m9K66K55k45M4J07R
1519B44q5m8Q6J66l76J38N41o61j36M16q52M36l86K86JM2j99j91M09J10JJ75J21
1542B38j47q2K89J44n33P76q67N95Q2l05J76l66j13j66J3J07P1l0n2O9j58l02
$$ plain form
1388 1127 646 -581 346 -23 144 -88 61 282 426 -73 -133 18 -352 -190 -314 -739 -542 -611 -270 -15
1408 -15 -264 -23 -173 -351 418 29 339 357 -237 626 343 72 293 -40 178 -84 -180 -153 295 -57 -167
1429 -167 -229 -634 -333 -419 -107 -382 83 218 -97 46 -38 186 158 196 347 527 226 86 -28 -163 207 167
1451 167 -89 42 -303 -396 -459 -288 -439 -339 -523 -220 -197 -49 385 52 119 17 327 363 222 279 292 65
1473 65 84 -211 82 52 -42 -75 -472 -359 -74 -400 -311 -111 -529 -378 -306 147 -217 132 54 185 430 577 301
1496 301 740 174 16 220 -16 77 5 -523 -332 -140 -232 -386 -409 -368 -91 -143 -192 74 329 84 128 235 244
1519 244 159 111 197 363 -13 125 666 5 -131 285 -567 -131 -517 -231 -230 -188 -387 -578 -169 -59 -58 117 238
1542 238 91 9 298 442 -91 685 -182 413 495 190 366 0 -113 -279 -266 -159 -88 -118 -170 -101 -259 -561
1564e61N60o4J22j95J74L02N34j063P44r3l26K09M28l10o25M92r11o6O74m3k34
1585b52K7K21l51pJ74k21N49M20j332J217L84n84M3M17n25L18n87P08k07l65M71
1606E18m45q2j95l65M5L15j75N87o2j26m03P0j18N98l46P30j50n4p15L48N06L58
1628H39r47L42n18L21O01j119m07R12k55r3r8J54N33j72k13l12j92P42j01p82
1648g65J274j248J785r1j042M94l61M31n54K96q88O01M91j478Q10n34J707j062
1666a34K11k96m98K82K37L66m1n82N21K76l93J81kk07L89k26k82O42n10K31jk76
1688a12QM4j3j28J8k8k77L15L3N5J9K3k3J63J06k07JK23r0K33l54J41n5k30L57
1713B22m63K31k85K02J05l87K98q6j77M44l83L65o2J71K42j54J37l73J87l48K41
$$ plain form
1564 -561 -1 -65 57 -138 36 338 872 -191 553 460 134 343 771 461 -164 328 -583 -649 25 -18 -252
1585 -252 -225 -4 -355 -362 -188 -409 140 560 -772 445 829 245 288 705 180 498 -89 619 412 47 518
1606 518 73 -9 -204 -569 -524 -209 -384 203 141 15 -388 -318 -436 162 -184 546 396 342 -373 -25 481 839
1628 839 -108 234 -284 37 638 -481 -888 24 -231 -324 -422 -268 265 93 -120 -432 -624 118 17 -765
1648 -765 509 -739 1046 955 -87 407 46 477 -77 219 -669 -68 423 -1055 -245 -779 928 -134
1666 -134 77 -219 -717 -435 -198 168 127 -455 66 342 -51 130 128 -79 310 84 -198 444 -66 165 164 -112
1688 -112 -104 -60 -73 -201 -183 -211 -488 -173 -140 -85 -66 -43 -66 97 203 -4 -3 220 130 363 9 150 95 -135 222
1713 222 -241 -10 -295 -93 12 -375 -77 -163 -340 104 -279 86 24 195 437 283 420 47 234 -114 127
1734A27K70k61k52J77j45k8o8q6L3P9j54J87P2j5K30l04m6K00j36J97n3nnK35
1758B49j3r5R5k32J08P0k39oK74r3k64k23L40K5k94J68l8L6K13K62k68l10J61
1781g4L87j27j42K47Q6j76Oj56k28K20j68M9R5m45L66k9J22l02K25j6k13J99r1
1804a65l0L14M1m6R3K3j39K93j84k42J08J93k54k13L13k33k33M57m02K37q5m2
1826a96k1K67J27j42j11K64L7J40q5L0j89J0J85J3m1k67J58n43J84j87J59K46
1848C8j41j15q8M4K18n9o6J34K48K7l05M67k72J79k35NJ43m6j72K08j46l3m2k0
1872b9l78L98l54J66l0K74k18Q2J49r6J72J4l77K04J35J46k60n1J18J5R6q7j36
1895d7j10L2L89j61n24K02K24j45J30J09k66Q7n1J22K06Oj66M5J08J02k90J76
$$ plain form
1734 127 397 136 -116 61 -84 -112 -180 -266 -233 -154 -308 -121 -49 -64 166 -138 -184 16 -120 77 24 19 14 249
1758 249 236 141 236 4 112 182 -57 -63 211 118 -146 -369 -29 -4 -298 -130 -168 -132 81 343 75 -235 -74
1781 -74 313 186 44 291 377 201 207 51 -177 43 -125 -76 19 -426 -60 -89 33 -269 -44 -60 -273 -74 -165
1804 -165 -195 119 160 114 207 230 91 384 200 -42 66 259 5 -208 105 -128 -361 96 -306 -69 -154 -196
1826 -196 -217 50 177 35 -76 188 225 365 280 310 121 131 316 329 288 21 179 -364 -180 -367 -208 38
1848 38 -103 -218 -306 -262 -44 -103 -169 -35 213 240 -65 402 130 309 74 79 222 176 4 212 66 33 -9 -29
1872 -29 -407 -9 -363 -197 -227 47 -171 -89 60 -36 136 150 -227 -23 112 258 -2 -53 65 80 176 89 -47
1895 -47 -157 -125 264 103 -421 -219 5 -140 -10 99 -167 -80 -131 -9 197 203 37 82 190 292 2 178
1917A78k2j77M5M5k86K62l83K06k17K57p6j56L53k39L58k47J65j43J12Q5j3r9
1939Hj21qL25j35Q6l26J86l2j61oJ36J68n46M53m57K40J62j58K39k32MK34J6L08
1963C83n9l81O3J95M1K7j60j35p0J36J23j25r3j15pL03k51j51LR6K7Q5o3J87r3
1988c4j64K64K83k38J72l0j66J51r8k67P7J15k3PJ26m10j4N1M2j3J05n2J49j56
2012a23k25L14K88j30j15J48J46j09j74L28l91J82J17k54M5k52L0L53j39j50l
2033a14J8J06j38O4j08j97K85J80mJ14n1j71L20k68R1k29L21j28pR5m82K37l45
2056d11M54j91J93n4j5K00j78j3m6K10k00j61M14m7l3J14j74N6k57M19k74j58
2078a52O6P3j02K51k61l5J58j83R5J09j44J60J5j2P6q6J91k21mJ10K89m33m7r
$$ plain form
1917 178 156 -21 24 69 -217 45 -338 -132 -349 -92 -168 -324 29 -210 148 -99 66 -77 35 120 107 8
1939 8 -113 -121 204 69 155 -171 15 -17 -178 -184 -48 120 -426 27 -430 -190 -28 -186 53 -179 -175 59 75 383
1963 383 324 -57 6 201 242 269 109 -26 -96 40 163 38 -55 -170 -177 126 -125 -276 -273 -177 -150 -65 -128 59 -34
1988 -34 -198 66 349 111 283 253 87 238 140 -127 -50 65 42 49 175 -235 -249 -198 -156 -169 -64 -116 33 -123
2012 -123 -348 -34 254 124 9 157 303 194 20 348 -43 139 256 2 47 -205 -175 178 39 -111 -114
2033 -114 -96 10 -128 -64 -172 -369 -84 96 92 206 155 -16 304 36 127 -102 219 91 84 179 -303 -66 -411
2056 -411 43 -148 45 -9 -24 176 -2 -15 -61 149 -51 -212 202 155 122 236 62 118 -139 280 6 -152
2078 -152 -86 -13 -115 136 -125 -160 -2 -185 -90 19 -125 35 50 38 114 28 219 -2 -6 104 393 -40 -87 -96
2102i6M5Q1N6j80l2J42o7n7P4RK2j14j94K11O2m2K92k69K13m4PLj11R6j00k63
2128b56K06K28j15j75k39K68k2Q2p7p3K40Ko0N5j32K75j47n9K45j73k54M31r7
2151A53Q4j4ok14rq5L84l71j1M9k33K55j04L45j84J85m18r3K54J14j3L7l6R7k75
2176a09n4K25J27j64J4j54M9k1n5M35l09J85j74l27K78J69j2m50L95R2l62L68
2198A46m6K01k17p5j8K29k4k49M9l8j49J95j98j1J31K01l16K85m1k43r2L15j4
2221B1pjJ5O8j32L6k4J03K5r4K14j38J38l29K12M3j89L3k14oP8L3J81J38l56j11
2247b63K73K59l06%k22L97P3jq0j21j56N0L72m92J2rJ28r0K98k92K33j50j92K01
2271g8j44J64PJ78l11K03Q9M0J84m97R3J35J28j28k32R3J59j51p6J71J2L10l28
$$ plain form
2102 -96 -51 30 86 -94 -126 16 -51 -108 -34 -25 -3 -117 -311 -100 -38 -80 212 -57 156 112 119 122 11 107 7 -256
2128 -256 -50 178 63 -112 -351 -83 -105 -23 -100 -173 67 69 9 64 -68 207 60 1 246 73 -181 250 153
2151 153 237 223 217 3 -6 -91 293 -78 -89 -40 -273 -18 -122 223 39 224 -194 -287 -33 81 68 105 69 166 -109
2176 -109 -163 62 189 25 39 -115 -66 -87 -142 293 -16 169 -5 -332 -54 115 103 -347 48 140 -222 146
2198 146 100 301 84 9 -9 220 196 -53 -4 -42 -191 4 -194 -205 -74 127 -189 96 55 -188 -280 35 21
2221 21 14 13 28 96 -36 0 -24 79 104 10 224 86 224 -105 107 150 -39 -6 -220 -226 -148 -115 66 204 -152 -263
2247 -263 10 269 -37 -37 -259 138 211 210 130 9 -147 -97 275 -217 -205 -214 -86 -176 122 -170 63 -87 -279 -78
2271 -78 -222 -58 -51 127 -184 19 108 148 332 -165 -72 63 191 63 -169 -76 83 -68 -144 27 39 349 21
2294B1Q4p9L03l57j38J09jj91P1K28J36r3j34K58k8k32p7K64j70J37m61K54j10
2317b06K18L8k72K12pL3J1k92J20J49k65N35l14P1j21J20K3j42L66k19o9L39l76
2340d8m1J3o1K35j24j62J81k87K79k18K02oJ4M4r7J45Q7r3j0O1Pm2j02P2N4o0
2366D3J77j45J7j91L6O8N1o4j41K36k36O5j50L34P7N2j96J19j90Q1j04P6j15J59
2390E9o1J0k16L11J15k45M8Kj58L03j91J7p9Pj15J63L4m5q7J10j63J74J87o5l07
2415a92J26K1o4K12K1j19j07K53k9nq6K4p2L7j85J25K29J68q7k46j50J48P3j52
2439e7M3J39k12K71j62nk26j01Q7K09m19Q8O4J10k31M39K70j03l93K99K12K31
2461E53l79k67on99O45M77n90Q4k08Q43P9L9q73M50r4J0k55M45q13R00r03k18
$$ plain form
2294 21 105 26 329 -28 -166 -57 -58 -249 -178 50 186 93 -41 217 189 -43 -120 144 -26 111 -350 -96 -206
2317 -206 12 50 -222 -10 -17 16 27 -265 -145 4 -261 274 -40 31 -90 30 53 -89 277 58 -11 328 -48
2340 -48 -89 -76 -137 98 -26 -188 -7 -294 -15 -233 -31 -37 -23 21 -76 69 156 63 53 114 121 79 -23 49 103 43
2366 43 220 75 92 -99 -63 5 56 -8 -149 87 -149 -84 -234 100 177 229 33 152 -38 43 -61 15 -100 59
2390 59 -2 8 -208 103 218 -27 21 23 -135 168 -23 -6 -85 -78 -193 -30 4 -41 -128 -18 -181 -7 180 115 -192
2415 -192 -66 -45 -109 103 124 5 -102 151 122 117 31 55 -17 20 -165 -40 189 357 270 24 -126 22 95 -57
2439 -57 -14 125 -87 184 22 17 -209 -310 -223 -14 -433 -345 -281 -171 -402 37 307 204 -189 110 322 553
2461 553 174 -93 -99 -698 -53 424 -166 -82 -290 553 632 671 -202 248 154 164 -91 354 -459 441 -462 -680
2483f80J094j410J107j89L23M41N0j516Q88o02L95N49n27L60L77q55p3K99M07
2502D38o63O48k26O25q24L70J3m22j54N44L0jK11n52k33n7M94J27l92j28J06K58
2524B12j46K9l11N96r6J02n93J05K49j93P9N88n81L88k21K86k3r66N25O17p20
2545g4M29N28r26j71L19M79j83j51k98K39p02j57M73N98O84j118R52p8m19m00
2565B4p58Q87m0l19N08P24j186RL91Q7p64k12J253m06R3m3M51j49k92j69K50N7
2587C96j145J240j155J221p06m65J291r55j47O37j35m05N65r6l97L30K29l52J91
2606A42M89j26p41J55j0O13Nm03l79N48l90K24n80M02R10q62K5KL38m69K87l04
2628a24K72K6l46P23m72n0k10L11m89M13J32n90M06N31o33J17M46o12K27k0J85
$$ plain form
2483 -680 414 -996 111 -78 245 686 736 -780 108 -494 -99 450 -77 283 660 -195 -268 31 438
2502 438 -225 423 197 822 -2 368 381 -41 -195 349 379 378 589 37 -196 -253 241 368 -24 -152 -46 212
2524 212 66 95 -216 380 284 386 -207 -102 147 -46 33 621 40 428 207 493 470 -496 29 646 -74
2545 -74 355 883 -43 -214 105 584 401 250 -48 191 -511 -668 -195 403 1087 -31 921 843 424 24
2565 24 -734 153 113 -206 302 1026 -160 -151 240 327 -437 -649 604 198 291 248 699 550 258 89 339 396
2587 396 -749 491 -664 557 -149 -614 677 -278 -425 212 77 -328 237 141 -256 74 303 -49 142
2606 142 631 505 -236 -81 -91 522 527 124 -255 293 -97 127 -453 -51 859 -3 22 24 362 -107 180 -124
2628 -124 148 174 -172 551 79 29 -181 130 -359 54 186 -404 2 533 -100 17 463 -149 78 58 243
2649B43q1j29k31K13Q1K19o9l60J00J68l54J4L00m00M36K2n10N30l2j05j51J61
2671F5k46M91k45k76J11L06m70L89q2l80O6K53J94k80L01k98j70M53J48l23K5
2692C2r9K31k19J0K23J78l05M6N6j92J67M04p09L77k35L36K02l70K57j120Q69
2713A39j19k18K44K39k05q1n07P78j85O12k29N6o24k84K53o85P14O65n68Q8K17
2734C00m62K81O31j147K94J2j72Q61j213J24J434m59L32p81l74J375j102L42q3
2753A93l04L02m12M23m66N4L46L25n29l5L78Q8K99o50L9j90J126k93o10l94P63
2774D53o25KJ021k077J637M44k90l76p10Q91n22Q38l25m32k92j23J760j078O75
2793H71j555M80P98o34j3M2J04M15o31K85p05O04J7M05m26o48L14l66Q24J11n39
$$ plain form
2649 243 162 33 -198 15 96 315 246 -114 -14 154 -200 -186 114 -286 150 172 -338 192 160 55 -96 65
2671 65 -181 310 65 -211 -100 206 -264 125 43 -337 -271 -18 176 -104 197 -101 -271 182 330 7 32
2692 32 -67 164 -55 -45 178 356 51 97 153 -39 128 532 -177 200 -35 301 503 133 390 -730 139
2713 139 20 -198 46 285 80 -1 -508 270 85 697 468 524 -100 -384 -131 -816 -102 563 -5 83 300
2734 300 -162 119 750 -397 -103 -91 -263 598 -615 -491 943 484 816 35 -339 1036 -66 276 193
2753 193 -111 191 -221 202 -264 -210 136 461 -68 -103 275 363 662 12 51 -139 987 694 84 -310 453
2774 453 -172 -170 851 -1226 411 855 565 189 -521 370 -152 686 361 -71 -363 -486 1274 196 871
2793 871 -684 -204 594 -40 -53 -11 93 508 -123 162 -543 61 78 483 57 -591 -277 -643 181 292 -247
2814b47R75q57O51l60k9L34q89L19R2J48p57J001j17K6j88k56P03n46j62K84k86
2835a61M55j22n02N00L70n37L50l5m66L15o00N00K36J61p06L83O19k60j289P20
2855f9J10L49l58p10J047n97L26o61L29m37J228k35J4N99j611N69L60n85J206
2874H74p79N43K69r72j72L60k3p3J08l09K8m5J86k43l15J309n78l21N96p48L1
2895b74M55N18o76N77p85J81L27K02l75l10J75K81p10M22J82j54Kk20M95k68k3
2916B2r2j85N83m96J03J01M5MN1m40M94L3j44k02J62k8m1q0J48K42o06M90j3r6
2940E5l57L88l37M89p13K73J83j06R4l42J18M55j30q6J70k4l46J1J5K27l6N2l67
2963c14M03j52K99j45J3q5p0M8j1N8oj9j07K26l36M38k96P8M4k39k7Q2K29J96
$$ plain form
2814 -247 728 -129 522 162 133 467 -422 -103 -11 137 -620 381 264 290 102 -154 549 3 -159 125 -161
2835 -161 294 172 -330 170 540 3 353 318 -148 167 -433 67 303 464 -242 141 760 500 -789 -69
2855 -69 41 390 32 -678 369 -228 98 -563 -234 -671 557 322 336 935 -676 -107 253 -332 874
2874 874 95 638 907 -65 -237 123 100 27 135 -174 -146 -191 -5 -248 -563 746 168 -153 443 -305 -274
2895 -274 181 699 23 600 -185 -4 323 525 150 -160 15 296 -414 8 190 36 38 -182 313 45 22
2916 22 -70 -255 328 -168 -65 36 81 85 136 -304 190 223 79 -123 39 11 -30 -110 38 280 -326 164 151 55
2940 55 -302 86 -251 238 -475 -202 -19 -125 -31 -373 -255 200 70 -16 154 130 -216 -205 -190 37 1 53 -314
2963 -314 89 -63 236 91 104 19 -51 -3 -14 44 38 19 -88 138 -198 240 -56 22 66 -173 -200 -118 111 307
2987C07l28R2k35N9J66j34j84L15q2J96Ol24J14k12L02j21m5L68l23P3J95j42
3009F3k08j03M95k88J53M3l69O8P3j73K51j51L52K4l6j67j39j40L12l02J47J82
3031H7j25J4l4j12K27N6j4K2m07L20m1j6O8j39M0L08k86j8k60K92j89o0K21R5
3055D9PJ87K2n9j57J22l3j20O3p8K7j51qM9Q7M9M1j36J27k54J87j64J42J14q4
3080B9k06J50J55k44N2L65k98k63K63R2k77J56J70k48J64k3m9n6M1J84k65J0J53
3103E5J01j90Q1j59J75m4K18J9l42J3n8M2k1J32J03k93J02j24K52R5j52K8j73
3126a40K44q5l2j51K66j52Q0J70l77J97p2n6M4q1J3j66L04j16K88n7r6n0J13j52
3150f4K65k45J04j09Q4K95k27O4l44j16L15j06j91M90Q7n53L58j77q2L71l81J48
$$ plain form
2987 307 -21 71 -164 -105 61 -73 -257 58 -24 172 178 -146 -32 -244 58 -63 -108 260 -63 10 205 63
3009 63 -145 -248 247 -41 112 155 -214 -146 -73 -246 5 -146 206 230 194 27 -112 -252 60 -242 -95 87
3031 87 -38 -24 -58 -170 57 113 99 121 -286 34 -7 -23 45 -94 -54 254 -32 -50 -310 -18 -207 -267 -46 49
3055 49 56 243 265 206 49 171 138 18 81 3 30 -121 -129 -80 7 56 97 -39 88 -166 21 -143 -1 113 29
3080 29 -177 -27 128 -116 -64 301 3 -260 3 95 -182 -26 144 -104 60 37 -12 -68 -27 157 -108 -98 55
3103 55 156 -34 47 -112 63 19 237 256 -86 -73 -131 -89 -110 22 125 -168 -66 -190 62 157 5 33 -140
3126 -140 104 19 -13 -164 102 -50 30 200 -177 20 -52 -108 -64 -145 -132 -298 6 -110 178 121 25 -25 88 -64
3150 -64 201 -44 60 -49 35 330 103 167 -177 -293 22 -84 -275 215 302 -251 107 -70 -152 219 -162 -14
3172a4r9J27j15r2J32Q2k40J36K45j70j89K3L76m34N4N28m23J78j29P5j38O5K51
3195B29m37K65j06j38K04k28K72J15R0k01O8J2j22j53K10Q2N7l09J38l07lK37
3217b5j45J61P4o4K43k99J41j22J78J87l19j13o1J76P6j5K63m74K4J63m8j33R4
3240c8k6K9k32K82j07K75k96lQJ38j53K05m6k68J49J48p2J2j28J00j49N8P2Q6
3264D4m0j18K46j65j08J44j74K18r8J91j64J4j3M6j70J20L44l21j44J49jK05p6
3287A29J12n03J81P7p3n6p7L36p5J03k81M7K13l63K48j44k03M10J13k86q9J53
3309b8l4J43Ql28K76K3j94O4j99M39l46j5L31J74o10L66M4k67O6J17j02L8L02
3332B68k12Pk64L58p0o9k3K3l7j4J69l07J41J49q4%P5k02R8m6j20L31j25P8j20
$$ plain form
3172 -14 -113 14 -101 -193 -61 21 -219 -83 162 -8 -197 -174 202 -232 -178 350 -73 105 -24 51 -87 -22 229
3195 229 -208 57 -49 -187 17 -211 61 176 266 65 133 145 23 -130 80 162 219 -90 48 -259 -262 -25
3217 -25 -170 -9 65 1 244 -55 86 -36 142 329 10 -103 -164 12 88 73 336 -138 -114 49 1 -132 -38
3240 -38 -64 -35 -267 15 -92 183 -113 -116 -108 30 -123 82 36 -232 -83 65 -7 5 -123 -23 -172 -114 -42 44
3264 44 4 -114 132 -33 -141 3 -171 47 -51 140 -24 -10 -23 23 -147 -27 317 -4 -148 1 0 205 129
3287 129 241 -262 -81 -4 -77 -133 -210 126 51 154 -127 -80 133 -230 18 -126 -329 81 194 -92 -181 -28
3309 -28 -62 81 89 -239 37 60 -134 -70 -269 170 -176 -191 140 314 -296 70 114 -153 -87 30 -72 -34 268
3332 268 56 63 -201 157 87 18 -5 18 -19 -33 136 -171 -30 119 35 35 110 -92 6 -40 -160 171 46 124 4
3357DL71k33l25K16J51k77PQ7o6L07j77k36J59J50o0k94J64n6P0J65J3j98J38
3380H0o9k36J82j12K08p0L4j6P9k04K6j88K42J49o0j00k07L4j39M99r5j89Q6J07
3404D1j00J26j94Q7O4j16q2j1r0R8R5J72L15l70J12k98L25o4J25l93N44k81j31
3427b6K93k17j86K05p8o5l3L1J72j19J53m46O7L85j50J65k30l6K97l37n5K46k87
3450b51L63l93J50Q8k56K18O9K15l70K10q7R0j74M7N4p3j4J7L65j12n5N4j17O4
3474A02j15J16j56r7L67k04k6r9J87j86K64j58J43J45j99k45L02j66k0P3j92K05
3496D1J27j63J74n6j65M6j45J6N2J59j21j05J61r7K09R6j62j7k55M53l39K03K
3519A14K6n3k58Q1K00k50J26R0j0M9l42L32L6k09M8k21K35K51k02J47j08R1k96
$$ plain form
3357 4 375 142 -183 33 184 -93 -86 1 -65 242 65 -171 -12 138 78 -216 -52 -108 -38 127 140 -58 80
3380 80 11 -225 -43 -155 53 -17 17 1 80 -124 -98 -286 -44 105 45 -55 -262 -228 -367 132 37 -152 -66 41
3404 41 -59 67 -127 -40 24 -92 -174 -185 -275 -177 -82 90 405 35 147 -151 174 110 235 -158 386 105 -26
3427 -26 267 50 -136 69 -9 -74 -107 -76 96 -23 130 -316 -249 136 -14 151 -79 -115 182 -155 -210 36 -251
3450 -251 112 -281 -131 -43 -299 -81 -12 203 -167 43 -44 46 -128 -81 -27 -100 -114 -97 268 156 101 155 38 102
3474 102 -13 103 -53 -150 217 13 -13 -112 75 -111 153 -5 138 283 84 -161 141 -25 -45 28 -164 41
3496 41 168 5 179 123 -42 4 -141 -125 -73 86 -35 -140 21 -76 133 229 67 50 -205 248 -91 112 114
3519 114 140 87 -171 -90 110 -140 -14 76 66 115 -227 105 141 -68 -20 -241 -6 245 43 190 82 173 -123
3542a23K89P6l44K74k04J17p5p0J73j74L6K16j74R2l06K24j31R0L17l48L2r3K12
3565A06K12k34j40k29J56J5K58j71K07k73K18k93KO5J11p9L91l34J01K9j23j5
3587b0R0L8j94J26R8R2k65n4J83L7m02L79j63K04J32j95m3j35L21l50j08J88J13
3610G2J20j96k8j50M39j77j11O1O6j21P8j28J72k71n7LK7R7M34l70L17k55j44
3633a22J1K22j47j51J84j48J60l3m4J52J48j94k50K16r2R6J52n6k53Q0N7J4J6
3656A8J33j54lj09j23L39k50L05nj41q1j49Q7r4P6N0N9K65k74J08O1J58k90k30
3680b44M78m80J84O5j2K85j69j64pR3k00L2K66n32Q13q66L68L3j55N18l9j019
3702g52O0O25J16M3K63j35j014N25P72o33N88j087Q30m7m85m20M41o8P50k25p09
$$ plain form
3542 -123 166 242 -102 172 -32 85 10 -60 113 -61 -25 191 17 109 -197 27 -104 -14 303 -45 -13 -106 106
3565 106 318 84 -56 -285 -129 -114 144 -27 180 -93 125 -168 -166 -101 10 -69 322 -12 89 118 -5 -20
3587 -20 70 108 -86 40 138 230 -35 -89 94 131 -271 108 -55 149 281 86 43 -92 229 -121 -229 -41 72
3610 72 192 -4 -32 -182 257 80 -31 30 96 -25 53 -75 97 -174 -231 -228 -201 -104 330 -40 277 22 -122
3633 -122 -111 111 -36 -187 -3 -151 9 -24 -68 84 232 38 -212 4 -88 8 160 104 -149 -69 -12 2 18
3656 18 151 -3 -6 -115 -238 101 -149 156 151 10 -71 -220 -133 -227 -151 -101 -42 223 -51 57 118 276 -14 -244
3680 -244 234 -246 -62 3 -9 276 107 -57 -64 29 -171 -139 127 -405 408 -458 -90 -57 -212 306 267 -752
3702 -752 -692 -67 49 92 355 220 -794 -269 503 -130 458 -629 201 154 -331 -751 -310 -378 372 147 -562
3723e62M83rL85j09j67m88l21Q11L22m73K18m0k75J19J123o50l59NJ29J49M95
3744G86r82k73l77O15K86p98Q77n06J054k52l75p74J098j282M03M39l57O82n09
3763b45l4N10j152J749o61J33J82m25o78J57Q54J82l68K83p57J64K15J39m16q
3783a76q9J64K17L95j6j66l53l18J58J54L71K25o03N13k89j68J62J45O5n82J71
3804b0o8r7n34N99R3m75J111q32K45j98N8n32J30Q58n81K94rn07M8J275r93K34
3826I9k3l63O99o71L3J015r53Q45p61n37L08K73n41L10L27J79m18J49J9q0J02
3847A1m7L01o8K30l68N72n25L00n01L27o54j40O21k33N85P5N0n98K49Ll18k17
3869c45K51M45p41K71J97k24LK36j11K89q1j03J81n93J60J69oj75o3R2jJ45k5
$$ plain form
3723 -562 -79 -88 297 188 21 -467 -788 23 345 -128 90 50 -225 -106 1017 367 8 13 142 291 786
3744 786 -196 -469 -846 -231 55 -743 134 -372 682 430 55 -719 379 -903 -500 -61 -418 264 -245
3763 -245 -279 231 -921 828 167 300 482 57 -621 -464 390 572 204 487 -270 -106 109 248 -168 -176
3783 -176 -265 -101 116 511 495 329 -24 -342 -184 -30 341 566 -37 476 187 19 181 326 391 -191 -20
3804 -20 -88 -185 -719 -120 -27 -502 609 -223 22 -176 -118 -650 -520 338 -243 51 42 -465 -417 858 -135 99
3826 99 76 -287 412 -259 -226 789 -164 681 -80 -617 -309 -36 -577 -267 60 239 -179 -30 -11 -91 11
3847 11 -36 265 197 427 59 631 106 406 -95 232 -422 -562 59 -174 411 486 536 -62 187 190 -128 -345
3869 -345 -94 351 -390 -119 78 -146 -143 93 -18 271 190 87 268 -325 -165 4 -2 -177 -240 -148 -149 -4 -29
$$ [...]
8191H1
##END NTUPLES=NMR FID
##END=
