##TITLE=1H_DE-138_oil_TFA
 200.13Hz, DMSO-d6.
 8 sc
 
31.3.2026
##JCAMPDX= 6.0         $$ Bruker NMR JCAMP-DX V2.0
##DATA TYPE= NMR FID
##DATA CLASS= NTUPLES
##ORIGIN= UXNMR, Bruker Analytische Messtechnik GmbH
##OWNER= pz
$$ XWIN-NMR		Version 3.5
$$ Tue Mar 31 13:30:47 2026 Russian Standard Time (UT+4h)  she@DPX200
##.OBSERVE FREQUENCY= 200.1313
##.OBSERVE NUCLEUS= ^1H
##.DELAY= (6, 6)
##.ACQUISITION MODE= SIMULTANEOUS
##.ACQUISITION SCHEME= undefined
##.AVERAGES= 8
##.DIGITISER RES= 18
##SPECTROMETER/DATA SYSTEM= spect
##.PULSE SEQUENCE= zg30
##.SOLVENT NAME= CDCl3
##.SHIFT REFERENCE= (INTERNAL, CDCl3, 0, 14.3821)
##AUDIT TRAIL= $$ (NUMBER, WHEN, WHO, WHERE, WHAT)
$$ ##TITLE= Audit trail, XWIN-NMR		Version 3.5
$$ ##JCAMPDX= 5.01
$$ ##ORIGIN= Bruker BioSpin GmbH
$$ ##OWNER= she
$$ F:/spectra/data/she/nmr/H-C/1/audita.txt
$$ ##AUDIT TRAIL=  $$ (NUMBER, WHEN, WHO, WHERE, WHAT)
(   1,<2026-03-31 13:29:22.29 +0400>,<she>,<DPX200>,
      <created by zg, POWCHK disabled, PULCHK disabled
       configuration hash MD5:
       00 E9 B6 7A A2 85 ED C7 34 08 36 98 17 FE 4E 26
       data hash MD5: 16K
       83 8F F6 61 08 84 20 D7 9A 27 14 31 0A EC 31 3C>)
$$ ##END=
$$ 
$$ hash MD5
$$ 5B 07 37 56 5C AB 62 2A 1A A5 A9 58 C6 17 D0 65
##$RELAX= 
##$RELAX= 
##$RELAX= 
##$RELAX= 
##$RELAX= 
##$RELAX= 
$$ Bruker specific parameters
$$ --------------------------
##$DU= <F:/spectra>
##$EXPNO= 1
##$NAME= <H-C>
##$PROCNO= 1
##$TYPE= <nmr>
##$USER= <she>
##$AMP= (0..31)
100 100 100 100 100 100 100 100 100 100 100 100 100 100 100 100 100 100 
100 100 100 100 100 100 100 100 100 100 100 100 100 100 
##$AQSEQ= 0
##$AQ_mod= 1
##$AUNM= <au_zg>
##$AUTOPOS= <>
##$BF1= 200.13
##$BF2= 200.13
##$BF3= 200.13
##$BF4= 200.13
##$BF5= 200.13
##$BF6= 200.13
##$BF7= 200.13
##$BF8= 200.13
##$BYTORDA= 1
##$CFDGTYP= 0
##$CFRGTYP= 5
##$CHEMSTR= <none>
##$CNST= (0..31)
1 1 145 1 1 1 1 1 1 1 1 1 1 1 1 1 1 1 1 1 1 1 1 1 1 1 1 1 1 1 1 1 
##$CPDPRG= <>
##$CPDPRG1= <>
##$CPDPRG2= <>
##$CPDPRG3= <>
##$CPDPRG4= <mlev>
##$CPDPRG5= <mlev>
##$CPDPRG6= <mlev>
##$CPDPRG7= <mlev>
##$CPDPRG8= <mlev>
##$CPDPRGB= <>
##$CPDPRGT= <>
##$D= (0..31)
0 0.7 0 0 0 0 0 0 0 0 0 0.03 0 0 0 0 0 0 0 0 0 0 0 0 0 0 0 0 0 0 0 0 
##$DATE= 1774949361
##$DBL= (0..7)
120 120 120 120 120 120 120 120 
##$DBP= (0..7)
150 150 150 150 150 150 150 150 
##$DBP07= 0
##$DBPNAM0= <>
##$DBPNAM1= <>
##$DBPNAM2= <>
##$DBPNAM3= <>
##$DBPNAM4= <>
##$DBPNAM5= <>
##$DBPNAM6= <>
##$DBPNAM7= <>
##$DBPOAL= (0..7)
0.5 0.5 0.5 0.5 0.5 0.5 0.5 0.5 
##$DBPOFFS= (0..7)
0 0 0 0 0 0 0 0 
##$DE= 6
##$DECBNUC= <off>
##$DECIM= 32
##$DECNUC= <off>
##$DECSTAT= 4
##$DIGMOD= 1
##$DIGTYP= 9
##$DL= (0..7)
0 120 120 120 120 120 120 120 
##$DP= (0..7)
150 150 150 150 150 150 150 150 
##$DP07= 0
##$DPNAME0= <>
##$DPNAME1= <>
##$DPNAME2= <>
##$DPNAME3= <>
##$DPNAME4= <>
##$DPNAME5= <>
##$DPNAME6= <>
##$DPNAME7= <>
##$DPOAL= (0..7)
0.5 0.5 0.5 0.5 0.5 0.5 0.5 0.5 
##$DPOFFS= (0..7)
0 0 0 0 0 0 0 0 
##$DQDMODE= 0
##$DR= 18
##$DS= 0
##$DSLIST= <SSSSSSSSSSSSSSS>
$$ [...]
##$SUBNAM0= <"">
##$SUBNAM1= <"">
##$SUBNAM2= <"">
##$SUBNAM3= <"">
##$SUBNAM4= <"">
##$SUBNAM5= <"">
##$SUBNAM6= <"">
##$SUBNAM7= <"">
##$SUBNAM8= <"">
##$SUBNAM9= <"">
##$SW= 18.0517328524113
##$SWIBOX= (0..15)
0 0 2 0 0 0 0 0 0 0 0 0 0 0 0 0 
##$SW_h= 3612.71676300578
##$TD= 16384
##$TD0= 1
##$TE= 0
##$TE2= 300
##$TE3= 300
##$TEG= 300
##$TL= (0..7)
0 120 120 120 120 120 120 120 
##$TP= (0..7)
150 150 150 150 150 150 150 150 
##$TP07= 0
##$TPNAME0= <>
##$TPNAME1= <>
##$TPNAME2= <>
##$TPNAME3= <>
##$TPNAME4= <>
##$TPNAME5= <>
##$TPNAME6= <>
##$TPNAME7= <>
##$TPOAL= (0..7)
0.5 0.5 0.5 0.5 0.5 0.5 0.5 0.5 
##$TPOFFS= (0..7)
0 0 0 0 0 0 0 0 
##$TUNHIN= 0
##$TUNHOUT= 0
##$TUNXOUT= 0
##$USERA1= <user>
##$USERA2= <user>
##$USERA3= <user>
##$USERA4= <user>
##$USERA5= <user>
##$V9= 5
##$VALIST= <valist>
##$VCLIST= <CCCCCCCCCCCCCCC>
##$VD= 0
##$VDLIST= <DDDDDDDDDDDDDDD>
##$VPLIST= <PPPPPPPPPPPPPPP>
##$VTLIST= <TTTTTTTTTTTTTTT>
##$WBST= 1024
##$WBSW= 4
##$XGAIN= (0..3)
0 0 0 0 
##$XL= 0
##$YL= 0
##$YMAX_a= 268141
##$YMIN_a= -242143
##$ZGOPTNS= <>
##$ZL1= 120
##$ZL2= 120
##$ZL3= 120
##$ZL4= 120
##$ABSF1= 10
##$ABSF2= 0
##$ABSG= 5
##$ABSL= 3
##$ALPHA= 0
##$AQORDER= 0
##$ASSFAC= 0
##$ASSFACI= 0
##$ASSFACX= 0
##$ASSWID= 0
##$AUNMP= <proc_1d>
##$AZFE= 0.1
##$AZFW= 0.1
##$BCFW= 1
##$BC_mod= 2
##$BYTORDP= 1
##$COROFFS= 0
##$CY= -3
##$DATMOD= 1
##$DC= 2
##$DFILT= <>
##$DTYPP= 0
##$F1P= 0
##$F2P= 0
##$FCOR= 0.5
##$FTSIZE= 0
##$FT_mod= 4
##$GAMMA= 1
##$GB= 0.15
##$INTBC= 1
##$INTSCL= 1
##$ISEN= 128
##$LB= 0.25
##$LEV0= 0
##$LPBIN= 0
##$MAXI= 10000
##$MC2= 0
##$MEAN= 0
##$ME_mod= 0
##$MI= 1.114404
##$NCOEF= 0
##$NC_proc= 0
##$NLEV= 6
##$NOISF1= 3.799351
##$NOISF2= 2.8
##$NSP= 1
##$NTH_PI= 0
##$NZP= 0
##$OFFSET= 14.38212
##$PC= 1
##$PHC0= -3707.631
##$PHC1= 8.5923
##$PH_mod= 1
##$PKNL= yes
##$PPARMOD= 0
##$PSCAL= 0
##$PSIGN= 0
##$REVERSE= no
##$SF= 200.129724274929
##$SI= 16384
##$SIGF1= 3
##$SIGF2= 2
##$SINO= 400
##$SIOLD= 16384
##$SREGLST= <1H.CDCl3>
##$SSB= 0
##$STSI= 0
##$STSR= 0
##$SW_p= 3205.1282051282
##$SYMM= 0
##$S_DEV= 0
##$TDeff= 0
##$TDoff= 0
##$TI= <>
##$TILT= no
##$TM1= 0
##$TM2= 0
##$TOPLEV= 0
##$USERP1= <user>
##$USERP2= <user>
##$USERP3= <user>
##$USERP4= <user>
##$USERP5= <user>
##$WDW= 1
##$XDIM= 8192
##$YMAX_p= 0
##$YMIN_p= 0
$$ End of Bruker specific parameters
$$ ---------------------------------
##NTUPLES= NMR FID
##VAR_NAME=  TIME,          FID/REAL,        FID/IMAG
##SYMBOL=    X,             R,               I
##VAR_TYPE=  INDEPENDENT,   DEPENDENT,       DEPENDENT
##VAR_FORM=  AFFN,          ASDF,            ASDF
##VAR_DIM=   8192,          8192,            8192
##UNITS=     SECONDS,       ARBITRARY UNITS, ARBITRARY UNITS
##FACTOR=    0.0002768,     1,               1
##FIRST=     0,             0,               0
##LAST=      2.2672688,     0,               0
##MIN=       0,             -242143,         0
##MAX=       2.2672688,     268141,          0
$$ Real data points
##PAGE= N=1
##DATA TABLE= (X++(R..R)), XYDATA
0@%%%%%%%%%%%%%%%mJ2j6J6j6J6k1K9l2L6m4M8n6O5p3Q4r6J10j24J40j58J77j94
38a01K17k46K72l01L35l68M08m54M99n50O07o67P35q11Q92r86J092j208J343j498
58g90J676j889K147k466K868l393M121n187O892j0032J7543o5886L355L19182
72B68141l8420l59803o1997J75746P2784J17897O8614j97234j88901J5503K3093
83a04577Q6491J80524m1394k40493q0608M7716O5428J79209J28795j40102j79228
94i8239k0188M3844J06079J50031p67j39807j13430o8949L4494J92873J11268
105A97209j21740j49431o6032k9888Q6464J68644M1291q5790r3479q8250J4671
116a26331J83375J34467m5586r0203r5309r5946N7976J71213M0540q0757o6600
$$ y = [0, 0, 0, 0, 0, 0, 0, 0, 0, 0, 0, 0, 0, 0, 0, 0, -4, 8, -8, 8, -8, 8, -13, 16, -16, 20, -24, 24, -32, 33, -40, 44, -52, 58, -66, 74, -84, 93, -101, 116, -130, 142, -159, 176, -192, 216, -238, 261, -289, 318, -349, 386, -425, 467, -519, 573, -635, 708, -790, 886, -1003, 1144, -1322, 1546, -1847, 2274, -2913, 3979, -6053, 11490, -54396, -51041, 268141, 229721, -130082, -192079, -16333, 56451, 174348, 242962, 45728, -143173, -127670, -104577, -18086, 162438, 121044, -119449, -200057, -152341, -86913, 92296, 221091, 80989, -98239, -118427, -74583, 31496, 181527, 180760, 40953, -72477, -141426, -106932, 85941, 197209, 75469, -73962, -139994, -169882, -83418, 85226, 126517, 40727, -52752, -141002, -126331, 57044, 191511, 145925, 55722, -39587, -135533, -77557, 93656, 134196, 53439, -13161]
127a3161r2498o9424J08677J69003J5460r2941q9091o7821J5840J23277J06671
138A13992K493o8588r4024n0232O4206J22178N2423m8238j00268r5943k5696P6391
150e1306J08184L2711o4871r1719m4127L0587Q8980Q8529P026q1829r0515k6853
162i5203N1544J02115O9475l6596r6896o1810M86M9401P6094K8787o6475r7771
174g6849m5101K7889Q4142Q8967J2217p3981p6723j0475N2877P0465L9716k1149
186G1995p3985p4921m730P5015P9908J6107m8888q0621n5940K3184P5846M7700
198E0670o557m2800o1996k7249N6708Q8832M0135k1770o5800p0061n518O4651
210g55N5855L280l3962n8727m5736K1301O9574M9737j295n0789p2926k3794N3085
$$ y = [-13161, -105659, -175083, -66406, 102597, 118057, 25116, -63975, -131796, -115956, 7321, 113992, 116485, 47897, -46127, -96359, -32153, 90025, 142448, 94210, -6058, -102001, -127697, -51306, 56878, 89589, 24718, -67001, -111128, -80541, 8439, 96968, 103994, 22165, -68350, -95203, -43659, 58456, 127931, 91335, -5561, -67371, -66885, -17484, 58610, 87397, 20922, -76849, -121950, -94061, -9919, 79048, 91265, 17284, -59439, -69914, -17037, 53428, 93144, 71995, -1990, -76911, -81641, -6626, 73282, 89389, 40501, -40120, -96060, -72876, 2970, 50670, 44113, 1313, -60683, -87932, -31224, 57608, 97743, 75973, 10173, -59888, -65406, -755, 55100, 58380, 24418, -34309, -80045, -58744, 10830, 60567, 59272, 8483, -64443, -88237, -35152]
223c5152O7304K7807j2353m3251m7452K92N2869N1690J1193l6657o9509m7830
235h1049K2002O4892M2536p213m0230m3254j4507K8280N3426L5814j8031n8543
247a5877m2528R699M9537N1342J7314l2802n4725k8874J4238L9433L3845k749
259C7853m4206m7708r986L3363N2981L5694j4724n2110l6582Q519L6712L4974
271C4780J1699k0914m2026k8775J3318M9244L9978r573m8498m1637q639K0746
283c0297L6900K8357q584l7626k9077N332L5336M0673J2496l1346m6255j8287
295d2378J6493L3670K9104L637l1178l9274j0429K4520L3201J6424j3023l6368
307a5601l1600L967L8423L7868Q675k1337l0015j7038Q289K8176K5981j504l1136
$$ y = [-35152, 32152, 59959, 47606, 4355, -43097, -42805, 10064, 61754, 72947, 36290, -33219, -81049, -59047, 5845, 48381, 41168, 938, -42316, -56823, -28543, 24883, 60697, 42666, -15877, -58405, -48706, 831, 52173, 69487, 36685, -18040, -46914, -32676, 6757, 40602, 37853, -6353, -54061, -64047, -30684, 22297, 57991, 43267, -8843, -45425, -36906, -194, 34780, 46479, 25565, -16461, -45236, -31918, 17326, 57304, 47731, -767, -42404, -51043, -30297, 6603, 34960, 26376, -11250, -40327, -34995, 341, 41014, 53510, 22164, -24091, -42378, -25885, 7785, 36889, 40526, 9348, -29926, -40355, -15835, 17366, 33790, 20767, -15601, -47201, -43234, -4811, 33057, 41732, 20395, -9620, -26658, -18369, 9807, 35788, 34284, 3148]
320C148l5903q298K6246L6788J4920j6318l0455k2006j941J9784L0258J6008j8518
333A3713l5622j2342K2342L1739J6646k995k2192l3253j5537K0130L2387J1456
345B6472j2132k2257j9998j023K5621L0025M193k2801k6739j3277J0519K8205
357F808K3015j57k0467k2313p990J2891K6008J3762j5277l1119j8847O150K1017
370f519K1448R865j0605k4397j6533Q275K4665J8085m581k0930j9917k407J7506
383f045K2963J2050p800k1514k0594l980J8077K2658M022j7216j7776o294O975
396a4474J9210K0178j293k2670k0083q04J1308J6110J3881j964k1224j8672M449
409a6048K1275J3977k717j1146j6673j3331M341K0886J6431l79j3399j6601n989
$$ y = [3148, -32755, -41053, -14807, 21981, 36901, 20583, -9872, -31878, -33819, -14035, 16223, 32231, 13713, -21909, -34251, -11909, 19830, 36476, 33481, 11289, -21964, -37501, -17371, 15016, 26472, 14340, -7917, -27915, -28938, -3317, 26708, 30901, 8100, -18639, -31916, -21397, 6808, 29823, 29666, 9199, -13114, -21104, -8213, 17795, 31557, 16280, -14839, -33686, -27536, -6519, 14929, 24794, 14189, -10208, -26741, -18466, 6199, 24284, 19703, -1227, -21144, -23551, -6045, 16918, 28968, 21168, -346, -20940, -24920, -6843, 15815, 19837, 2621, -15155, -21449, -14474, 4736, 24914, 23621, 951, -19132, -19936, -8628, 7482, 21363, 19399, -1825, -20497, -16048, 5227, 19204, 16487, 5341, -11332, -24663, -20322, 564, 16995, 16616, 3217, -13384, -19373]
422a9373J4348J9012M304r231j2887j2051m51J6030J7626N005r817k0101j3175
435b0761O945J5910P935k193j0150j3396k149J3408J4172R387n31j9208j9107
448a9738N669J7577O799K237j460j5143j1878Q467J5614O932l030j3797j5764
461a7515k504R125J2118J2579q18j6949p851R163O986N294O587q925j9902n204
475a7816R125R598J2084L910j4778j2552K321L409M767R553l788j6493n590O710
489i540J0005J2733O711j0262j2586m472K73P311J0519k943j2401m689n91L455
503f477J4805R703j0790j3593l971k590L975J3775N936r193q039J28M931J0131
517H731O807l976r051j0114p812M939J5325N297p281n752k188j109M996P360J748
$$ y = [-19373, -5025, 13987, 18291, 9060, -3827, -15878, -16329, -299, 17327, 22332, 12515, -7586, -20761, -13816, 2094, 10029, 7836, -2314, -15710, -17859, -4451, 9721, 19108, 18577, -631, -19738, -14069, 3508, 10307, 12544, 11084, -4059, -15937, -7470, 8144, 15076, 12046, -1751, -17515, -20019, -10894, 1224, 13803, 12985, -3964, -11815, -2652, 4334, 9628, 16215, 7290, -12612, -17816, -8691, 907, 12991, 16901, 2123, -10429, -8108, -4699, 68, 9621, 5833, -10660, -16250, -9540, 465, 13198, 19909, 9647, -2939, -7411, -7138, 173, 10692, 7749, -4652, -9341, -9932, -6477, 8328, 18031, 7241, -6352, -10323, -12913, -8938, 4837, 10773, 1580, -6459, -6331, -1400, 8731, 15538, 11562, 2511, -7603, -15415, -10476, 4849, 10146, 2865, -2887, -5075, -6184, -1188, 6172, 7920]
532G920o366j0061o678O077J4199P179k144m119m530m983N69P245M303o337r980
547g706m383L010O881P983M619m927r844m121L403M903M061N49m632n143m37P032
563A248R304L600n550r365p260k360M810P088K39l987k098j857J801Q875P234
578A1722m343q647o018k587N659R057K332k096l50n411m155P488P150o075o792
593c066m660n409K230J0878M472J2J782n793o940P347P815n395l658J014o828
608f199l747J1536Q800k810k036m051p280n48M684J62j11o03n556j12R087O322
624G538M95Q72n153r026J315M889j313J674K704p010m486Q416M880k389J86k811
640G81r357j279O664J589J671M252l144m749N390N948j567n99j740q017m003L957
$$ y = [7920, 1554, -8507, -15185, -9108, 5091, 12270, 10126, 6007, 1477, -3506, -2937, 4308, 8611, 2274, -7706, -12089, -9079, -2198, 5785, 10404, 5477, -4367, -8488, -5085, -182, 3879, 4428, -204, -5347, -5784, 1248, 10552, 14152, 8602, -763, -8023, -10383, -5573, 1515, 1754, -2233, -4331, -6188, -4387, 4488, 11722, 7379, -1268, -7286, -9873, -4214, 4843, 7175, 5079, 4729, -682, -4837, 2651, 9801, 3726, -3066, -7726, -13135, -10905, -27, 4445, 4457, 6239, 446, -6494, 853, 8668, 3273, -385, 629, -6199, -9946, 1590, 10390, 7580, 5544, 1493, -5787, -6335, -1651, -1489, -1600, -2203, -7759, -7871, 1216, 7538, 8033, 8905, 3752, -5274, -3959, 930, -383, 1291, 3995, -3015, -7501, 915, 5795, 3406, 3592, 781, -8576, -9855, -3191, -1602, 69, 4321, 1177, -3572, 1818, 7766, 6199, 5600, 3860, -4157, -8160, -4203]
656d203L755K622K847m225n579K342L558k194K009K680p541o317O503O817J395
671D469K084P60n339m467J714J190J113L70m270m565J445L862L234K304n3m695
687h44l117j40J952L778K745l138k744K045J542N26L474L58o889m691O32K65J792
704b454M114r69k947M02J572K68K963J839m662l472J91J445L415L398j064k587
720A452N2k628k214L539K784n579m331L500J280qM534L858k899m370k32O26J354
737G18J436j116j898n48J82J377L357J637k994l917k389p18J733K182Q01K45K30
754C18j099J123L757J745k903l332j634j513L36L293J757L57j169r39r42J073
770B28J467j292k844k023m57K044K948K289J863l25k764j419K003P85k383j764
$$ y = [-4203, -448, 2174, 5021, 796, -4783, -2441, 1117, -1077, 932, 3612, -3929, -10246, -3743, 3074, 4469, 6553, 7313, 1974, -2493, -779, 411, 1524, 1894, -2376, -6941, -5496, -1634, 1600, 3904, 3851, -844, -3961, -4101, -2149, 1629, 4374, 1236, -1508, 537, 2079, 2605, 6079, 6437, -452, -5143, -4511, -4246, -2454, 1660, 691, -2256, -1854, -282, -14, 2949, 4788, 126, -3346, -3155, -1710, 1705, 5103, 4039, 1452, 1504, -1124, -3338, 201, 2985, -2594, -6925, -3425, -2145, -2153, 2381, 6239, 3340, -1030, -1262, -636, 718, 2154, 1038, -860, -1408, -1226, 151, 3508, 5145, 2151, -1766, -4155, -4873, -3140, -958, -157, 88, 318, -781, 342, 4099, 5844, 2941, -391, -2025, -3538, -3202, 91, 1848, 2205, 1036, 97, -845, 228, 1695, 403, -2441, -4464, -4921, -2877, 71, 2360, 4223, 3898, 1134, -285, 1718, 2503, 120, -1644]
786a644O4j335j258L513M143l17k066j463p74p16J90P14N29n43m51M42L232L003
804E263n4k096j857j943k257l31J797Q81r19o21M26J728K125K69r98j464k099
821b150j160J665K856R16j16M32j337k55J084Q92k300k471r62j251n6K409K934
838A130L97q77j19K18L02n0M93m64k023j294J330K750Q71k65J26j896k528l09
856b208K87P65j79r60o96K166K087O18N43O29j570k869j17J449Q07l21k89m7O26
875G21l07j47J220j93k760k069M87J010R59J784O89q11L92P06o6K40j09j693j888
894a835o77J237J878O02j28K27k90j889j258J484K58k208j71J540Q51J370J740
911B731P95m07j517j923p60J057k53j157K11N59K78K47J875R68j559k597r81J96
$$ y = [-1644, -1580, -2915, -4173, -660, 3483, 3166, 1100, -363, -1137, -1853, -1663, -949, -420, -963, -1414, -972, 2260, 5263, 5209, 3113, 1256, -687, -2944, -3275, -1478, -597, -1516, -2137, -1711, 17, 2142, 2411, 1413, -51, -2150, -3310, -1645, 1211, 2127, 2011, 2443, 1106, 851, 1935, 2827, 527, -1944, -2906, -4157, -4213, -1804, 1130, 1527, 650, 531, 749, 1051, 1001, 1494, 1030, -993, -2287, -957, 1793, 2664, 2399, 2525, 629, -1899, -2208, -1921, -1156, -1335, -2295, -2991, -825, 1262, 1880, 2423, 3052, 1482, -1387, -1504, -55, 752, 431, 142, 95, 721, 414, 267, 1487, 1294, -1466, -3535, -3048, -2038, -1079, 705, 1394, 583, 975, 1681, 1615, 1855, 1746, 53, -1835, -2512, -1275, 603, 1205, 1077, 1304, 1014, -875, -2133, -649, -391, -2599, -2770, -1230, -379, 991, 2731, 3526, 3119, 1602, -321, -1081, -24, -277, -1434, -1223, -664, -386, -139, 1736, 2704, 1145, -1452, -2433, -2237]
929b237Q57n10J188K252j73j126J910J574j335j377j458j460j036M32M37J670
945c92J273j36n45P34O18j199o13o61j520lJ420Q00J644J746k57k056N92j45j864
964e64p70k92p65n24J480J305J539R13o23q18j32j201k78L6k05k71J43O35J305
983I13K213k94k587j13N58k848j170K567P11k371J111K550J24N18P06j255q40
1000D93r69j811r0K602L22j072J037J536j787L58J350j833j424k07n23j55J771
1017d02J271m1R60j79r89j54j26m36o63k84o41R23Q87M46N47J095j754o23j11
1036b74o28n14P45N06j400J496K610j003q41J992j171l079J78J247j082j25J182
1053a61K35L06J042L3j018L29j016k067N15J761o48j06J964K70j238Q26Q74j102
$$ y = [-2237, -1380, -1890, -702, 1550, 1377, 251, 2161, 3735, 2400, 1023, -435, -1895, -2931, -2499, -2062, -392, 881, 745, 200, 934, 1552, 353, -260, -921, -2441, -2444, -1024, -224, 1420, 3166, 2909, 853, 1445, 1300, -564, -1334, -1626, -2391, -2915, -1435, -130, 1409, 2322, 1699, 881, 749, -452, -730, -694, -899, -1170, -1027, -392, 913, 3126, 2832, 245, 132, 690, -2158, -3328, -761, -50, -2421, -1310, 1240, 1364, 1882, 2588, 1333, 493, -476, -2287, -2377, 225, 547, -525, 512, 2048, 261, 619, 1969, 136, -1288, -1495, -2018, -2173, -402, 869, 828, 1788, 1609, 620, 466, 340, -96, -759, -1043, -1684, -761, 126, 572, 1119, 2214, 460, -163, -274, -902, -1416, -671, -165, -1565, -69, 2541, 1538, 697, 2689, 1518, -1561, -1383, -136, -1218, -1343, -161, 74, 380, 1422, 1455, 437, 766, -250, -2317, -1802, -41, -689, -795, 1169, 1439, 201, 1027, 1901, 799]
1071G99j370r43P1k03L95Q86J066Q98l81n17j50j3l5j093r97J015L39q31R85K153
1091B074M71j474j52m23k338K31J005p56m85J499R98n24J440J576j512j818J31
1108e7q45q82P66Q40l55P50R38m77K71Q33j196j882L78K33j494O99K165j5m91
1127A79J290O06q67q61l37o77p28j64N6Q59J508P4J66j27J95n10j372j90k5m04
1147a329k46J114J381K1M68L14o21j382N7k54q40l7R66j45r1J481R21j019j99
1166E60Q6j169p09N22J54m0K94L46L38P58O42q87q47K95q61j457K88J749K80j008
1186f66J036J306q87q84L78k48p53m41L52j5J424N87n54L4J037j552r44R38k5
1205A23j751Q1J597j6l64J493K44r64m10J90j186K87L36j09K2Q60O38m25L90L75
$$ y = [799, -571, -1514, -1443, -1646, -1251, -365, 701, 1599, 1218, 701, 551, 538, 503, -590, -1587, -572, -233, -1064, -79, 2074, 2545, 1071, 919, 496, -1842, -1611, -606, -1362, -1847, -348, 650, 126, 1566, 3142, 1630, -188, -57, -902, -1784, -1018, -178, -533, 217, 1155, 678, 949, 1782, 586, -1296, -918, -685, -2179, -1480, 685, 670, 179, 1469, 2075, 1208, 347, 10, -667, -1395, -1559, -1503, -644, 864, 938, 1104, 977, 1172, 662, -710, -900, -925, -1329, -1575, -461, 920, 941, 1409, 1723, 1102, -280, -223, -477, -1317, -1354, -388, -533, -624, 857, 1778, 759, 560, 646, -523, -1232, -710, -556, -596, -302, 44, 382, 1140, 1782, 895, 48, 343, -518, -1975, -1687, 62, 342, -666, 370, 1676, 789, -95, 283, 35, -718, -1159, -807, -822, 602, 1189, 635, 669, 1706, 154, -790, 148, 123, -1628, -1547, 50, 34, -330, 1163, 1407, 443, 33, 223, -963, -676, -340, -449, -427, 433, 1071, 646, 1036, 1411]
1225A411j145l40n37q04K51P66k84L84J032J84P5k26R4p54q17q22L78N67M61J66
1245D0Q64R67n54q21J87n28j220n27J50K55P52L46Q61P02j17n32p58O71j006j233
1265a501J04J068r2o8J336O48j88m74j46p91o44k86n66J76P46N72N06N87R23n28
1285A382o90n18n92n32k72O7M93M54O77M92M6K07k14j015r12k36J59l55K19J420
1305B80M90K49K28K34l99q68n99l61j76j44j10J061J029l86k72Q40j50q76p87
1324g17J13J10o49l0Q72R06L38m5kL28n74j149k67pj09r5L52R56L60O7k85J06
1346E79n84p07k67L31J72o7M79N29J80J58K31k44o96l10n22m25K68Q10j47L69
1366A37M50J72l6l92r6l99k81n47rP35N48K36K2L83K86j232k30M8L2q70J0Q99
$$ y = [1411, 266, -74, -611, -1415, -1164, -398, -682, -298, 734, 918, 993, 767, 861, 107, -710, -1532, -1154, -587, -126, 40, 904, 1871, 1317, 496, 683, 155, -1065, -1592, -1442, -1187, -435, -89, 772, 1474, 1357, 825, 67, 738, -268, -1501, -1397, -329, -421, -489, 847, 1495, 1307, 833, 687, -104, -748, -1034, -1600, -1424, -678, -106, 400, 987, 1910, 1382, 692, 174, -418, -950, -1222, -1155, -662, -208, 469, 961, 1007, 1214, 1000, -15, -927, -1163, -1004, -1359, -1140, 280, 770, 1019, 1247, 1481, 1082, 214, -385, -746, -922, -1066, -1176, -115, 914, 528, 256, 1096, 946, 70, -717, -604, -494, -1143, -1173, -301, 605, 943, 898, 896, 1224, 650, -499, -766, -773, -882, -977, -625, 331, 691, 758, 473, 579, -5, -712, -979, -648, -476, -543, -64, 465, 645, 803, 1034, 790, 94, -216, -738, -1163, -895, -85, -232, 137, 587, 759, 723, 331, 235, -164, -445, -992, -1001, -266, 282, 518, 540, 923, 1209, -23, -253, -205, -173, -1043, -1033, -134]
1388a34J26O18P8J31m9j44q23J9l28k75p9M23Q44j78M29J23j60m74j52l60m08
1409g73j74J71M95M99L23j71J73M4j3o35k30k46o09N63N09K71R2O05j20k51k91
1430B32k37n11n80M1N44K78O03J05N24q3m89k00K6m78m08J08K0N10k02L76N02
1451F81K43o40l70R5k08r13m0Q55M51j82J56M85N14o05j87n36j17j47m00N47j5
1472c33L17L1M07j40m5n6k61k48m17J66J47L20N69J69L12m03K0l52q3o42l69L80
1494e11J0J60N49M44k92K53j78Rm03o94l58O54J0J7M39P28M6m89m7K24l95p10
1516e34j21R6p4O0N99M12K95j98j84N1k14q10QML00J87l6N85L52j29m9l33n72
1539c05o09l7N89k54M28M64K88m6J59j84n75Mj76k89k41L52K53L00K10R2l0M21
$$ y = [-134, -8, 610, 688, 819, 770, 626, -197, -178, -506, -781, -860, -437, 407, 229, 658, 781, 621, 147, -5, -365, -773, -947, -776, -281, 218, 541, 370, 543, 587, 574, -61, -291, -537, -1146, -583, -74, 197, 289, 894, 774, 523, 232, -5, -516, -1096, -1055, -511, -233, 370, 475, 999, 916, 427, 227, 253, -225, -633, -525, -505, 5, -197, 179, 681, 924, 284, -86, 9, -199, -1112, -1152, -297, 154, -28, 128, 613, 1127, 522, 335, -201, -318, -465, -865, -318, -333, -16, 15, 422, 282, 237, 181, -80, -328, -745, -579, -432, -112, 457, 626, 938, 535, 555, 203, 120, -522, -891, -511, -501, -341, 208, 652, 360, 613, 435, 444, 41, -653, -1011, -357, -347, -330, 109, 837, 883, 394, 347, 571, 176, -534, -655, -559, -633, -573, 26, 438, 733, 535, 351, 402, 188, -622, -614, -610, -310, -123, -159, 426, 778, 649, 600, 267, -305, -914, -951, -362, -616, -188, 276, 564, 518, 677, 493, -82, -78, -254, -543, -784, -432, -179, 121, 331, 423, 393, 814]
1561H14n71o46k4J27m27j98M25R05k06M4N83j72m85m23k60L4o2j23K95R45l43
1582B32Q0N85l3o02q32L01Q4n97N5L71N94M8J82J39L19l01q28n53N88r3n64L48
1604d77Q12P2j93J56L0m8r03n7k67N95j47J15N29J79N9J72J48q00j18m4m48l24
1626i59O33M20l54M92M72l04p2p0p2l80n9o0j82M95j53K25K30L67l66m47M30n42
1648b56k21J45R6O1J21K18J36K41%n02l61K38l51J7PN15K39k31L05K57l91m39
1670a56J32r4l33j05K95M81r5O3L93P4o13j53j58mj52J37k12N26K15J96O4M7k51
1693B97l84l46m1J63%k05J06L62J75N11j27j33l46rn62o8P1K47M84k07L37N01
1715H26m61k14k83j1p4n55L32J76K42L17j50L61r4k38l04N5m03j93L86J15j68
$$ y = [814, 243, -403, -427, -300, -727, -925, -500, 405, 199, 243, 826, 654, 169, -254, -514, -480, -542, -665, -370, 575, 232, 312, 897, 864, 262, -570, -269, -185, -782, -727, -356, 238, 286, 468, 607, 926, 625, -203, -756, -168, -261, -825, -477, 335, 407, 214, 370, 400, 352, -551, -608, -875, -280, -427, -312, 217, 396, 455, 627, 775, -25, -143, -187, -635, -959, -326, 94, -260, 232, 704, 400, 328, 258, 186, -194, -253, -313, -495, 0, -153, 72, 302, 669, 303, -144, 286, -256, -477, -332, -236, -175, -54, 164, 300, 541, 541, 39, -322, -84, -435, -418, -411, 104, 343, 112, 417, 674, 283, -156, -24, -118, -451, -556, -261, 220, 125, 188, 581, 655, 42, -111, -269, -273, -425, -288, -500, 26, 241, 437, 501, 548, 297, -87, -433, -474, -311, -311, -516, -410, -48, 127, 638, 511, 378, 32, 23, -539, -607, -536, -289, 195, -12, 325, 826, 365, 151, -132, -143, -217, -772, -440, -264, -22, 295, 145, 506, 412, 174, -130, -75, -478, -671, -285, -170, -338]
1736c38P26J29K51l86l3l99l07L2j87k47M26M40l6J70K50k1K27n99Qm88J57k24
1758d49k0J44O70K19k86lM14n08o24M1N02p24j22R0R57K36J1m14k35P05l51o16
1780c63k6R8k06L22K98K58k09K27j0j49n21j74J38O7l21M49K65J36J29n4p0K73
1802E57k72p09K52K9O1l02L33M80n8j6N5j61R7p20j57L20l5J89K60k11J23N15
1824F30m08k79l36L33m30J32Q5K39N5QJ87QP2m68K5o3l06J76K17J55K0J1N50M0
1848F53n49j53k54J01p3j97M65L89K3n24K83J62J77o21Q3m09J25k24N0N24KK38
1870B71J74n7K4m69k98m0J46L5rJ71K38Q1J61P5m5m10o3m18K1K09l9J80J28J06
1894A72O0j44K7P9j93j25p35P20k66L56J02L72p4j25n2l45L44m33r8O4O1K08R3
$$ y = [-338, 388, 517, 768, 382, 349, -50, -357, -325, -512, -759, -333, 107, 71, 241, 491, 470, 697, 98, 106, -382, -225, -449, -469, -325, 345, 564, 278, 275, 689, 181, -443, -402, 100, -624, -746, -656, 301, 537, 548, 134, -101, 604, 253, -363, -389, -291, -497, -175, 123, 381, 172, 399, 389, 240, -281, -455, -317, -250, -571, -122, 143, 279, 408, 354, 284, 557, 285, -424, -172, -143, -82, -384, -51, 429, 371, 355, 410, 249, 346, -374, -531, -211, -246, -57, 203, -8, 115, 630, 222, -57, -393, -60, -490, -358, -273, -34, 21, 29, 216, 224, 296, -172, -147, -210, -516, -340, -123, 32, 52, 63, 613, 653, 104, -49, -303, -202, -275, -472, -7, 382, 405, -119, 164, 326, 503, -118, -35, -444, -319, -543, -493, 31, 33, 271, 445, 388, 412, -57, -355, -395, -249, -214, -223, -52, 186, 267, 428, 503, 458, 48, -15, -433, -412, -203, -242, -62, 66, 172, 232, 88, 115, 194, 1, -124, -859, -139, -405, -49, 53, 425, 351, 226, 174, -171, 173, -260, -358, -294, -233, -25, 68]
1917F8p9L84J35j98l99K65p64K94k8J96p0K28M57m5k99Q4j81j14L0o66N75Q9N6
1940A8R3L79j65J07m74J79n2k30k81L31Q6p0N2M10j17L4J40l34j72j63O1o0L6
1963a92J2J00N53k80R4P1p7n53k34J49k10M64KJ30K77j38J39l34J48J67o44K73
1985h3j17P0k8L05p8L0J93l09N6m12j99K46Q7L03j53J67K87Qj90J5k03j36m6J80
2009gj03Nq0Q2L63j3K91l28m24M8j35J61m60M44Q5M51l68j28N88l92k61m20K12
2032c89J35K04o0M1L98j03J22j75L11m93o03P13l38j92L89M01k40q5M0L50j66
2053B60k69n08L02K23l94K49J73R9Q6L08k41L67l22o59J97p8J08j88Q8J17K02
2074A20J63n5k63K7L2o21K50J2M65l51L71j38K63p2j13k32k14J6N2j15M86k37
$$ y = [68, -11, 373, 508, 310, -89, 176, -588, -294, -322, -126, -196, 32, 489, 444, 145, 229, 48, -66, -36, -702, -127, -38, 18, 111, 490, 325, 432, -42, 137, 85, -145, -426, -95, -9, -79, -27, 383, 266, 300, 440, 106, -66, -229, -168, -228, -192, -180, -80, 473, 193, 287, 358, 281, -272, -506, -357, -567, -103, -101, 29, 306, 168, 307, -27, 121, 288, -356, -83, -200, -130, -158, 147, 69, 99, 292, -17, 39, -373, -572, -326, -239, 64, -89, 78, 365, 373, 183, 198, -5, -141, -187, -7, -110, -105, -185, -103, 260, 247, 538, 210, -214, -166, -301, -140, -600, -156, -71, 380, 12, -116, 472, 80, -181, -601, -389, -254, -50, -110, -69, 329, 226, 348, 173, 484, -9, -612, 101, -237, -429, -40, 361, 121, 36, 76, 426, 260, -9, -517, -215, 8, -386, -137, 36, 135, 221, 529, 288, 655, 333, -326, -129, -207, -99, -287, -199, -82, 120, 283, 228, -35, -8, 24, -597, -347, -335, 130, -221, 150, 12, 275, 203, 90, -142, -356, -340, -288, -403, 83, -154]
2096a54K49K29R9k0o75M11k5l27k65L79L19l22N2M21K38j78k59k73j24K87n23
2117d61K04K71m4J75P2O9P6l7m55R9j31k34K20L7L9P1K91k9m8l7l1n55N08l46
2141b76k23L94R7J06m1J27K39k50j05j43O3Rp05R06j01L5J37Q3k00n8Rk61o0q6
2165c04K88P3l38M00J43j0l08o0Pl5n8j25L38k55L36nK69m0j69jj80k34j02J20
2189b50J72J40K13l2K43l00O3l89K82l72j93J64L96j40k91K94O19m57K2m4n9k58
2211a77k26L6O5R3R5L92k4n3J25r4k35l66J88Q4k50Q6R2L13n8j29K39k68l8J46
2235C6l00K0L45j50K87j3j29J55j44j68q1o9R4l2j3J73j34N00L7l52J16p3k32
2258a27J53k44L16k79L0K39J17j13k5J46j59k11J37j22l79J55K99K60q2L01L5
$$ y = [-154, 95, 324, 423, 403, -272, 139, 114, -213, -478, -99, 220, -102, -50, 371, 609, 431, 172, -101, -225, 62, -461, -257, 14, -30, 145, 217, 286, 362, 325, -130, -31, -162, -396, -176, -139, -100, -29, 262, 233, 185, 148, 117, -438, 70, -276, -499, -105, -8, 98, 57, 184, 423, 173, 68, -75, -12, -3, -708, 198, 97, 132, 269, 352, 152, 94, 103, -158, -218, -304, -16, 57, -281, 119, 262, 252, -56, -116, -109, -144, -202, -327, 11, -244, 92, 87, 356, 316, 147, 146, -34, -268, -370, -250, -78, 62, 275, 243, 486, 186, 249, -140, 142, -230, -423, -259, 137, -3, -294, 0, 619, 162, 184, 140, 81, -177, -403, -367, -302, -209, -114, 278, 254, 201, 326, 232, -3, -369, -181, -97, -347, -261, -169, 144, 86, -43, 196, -72, -110, 36, -264, -244, 101, -49, 238, 225, 96, 251, 107, -61, -142, -211, -117, -149, -162, 11, -123, 377, 414, 62, 178, 105, -127, 26, -218, 98, -181, -151, 88, 205, 92, 67, 213, 54, -157, -20, -142, -521, -366, -67, 193, 111, 412, 447]
2279D47k41rj37m72K41J25N0j27K47Q2j82K39K4j5m09j42J23N0j82K25RM98l46
2302I8L5K43k37k37j63J94l51K66Q0L62j25K9J5N3k66k71lL47m01J60L91k97J66
2325H8o8K86m7pl12j56m3J94k0j3J90J68j80Q4j82L3J17j78l93K3K88%Q9J88j3
2350A36o4N0l26J12m9K35r3j38L5J47J11j86K36o2%k26l2J7o0K85j34M5J26j01
2374F4K35q2l00J03l30K8Q7j22M16j90j39N73j94p6k5K48n84K3k0K44L2J52l2
2397A11K53j87j27n6K93n58O2mK00m4J46k10M90r0k60p9L36n19p3L14L2o1K25
2420A94k8J33m07M01j29j07J28l82J55J79l08J87Q2j64J31lJ02j63J28k11q1K36
2442G3p4R1Q9q6o2j0J06N5l82n2J28J58j00K16l6P6J14j43j83N6o4k42J80JP2
$$ y = [447, 206, 197, 60, -412, -171, -46, 4, -123, 124, 206, 24, 263, 287, 272, -137, -279, -156, -106, -288, -63, -54, 444, 98, 133, 376, 139, -98, -261, -67, -418, -152, -72, 290, 165, 194, 209, 262, -4, -275, -278, 69, -332, -172, 219, -78, 88, 20, 306, 259, 252, -60, -216, -259, -65, -85, -98, 92, 260, 80, 164, -18, 15, 132, -46, -439, -416, -128, -128, -39, 149, 136, 72, 122, -204, -92, -141, 94, 1, -137, -102, 45, 156, -30, 206, 144, 144, -82, -114, -97, -157, 128, -6, 39, 165, 64, 299, 217, -83, 20, -310, -282, -195, -317, 99, -91, -230, 343, 149, 73, 48, 296, -288, -265, -285, -41, -9, 143, 111, 364, 177, 50, -6, 287, -271, -209, -213, -13, -57, 89, -121, 369, 279, 19, -60, 276, -243, -316, -2, 30, -31, 194, 166, 299, -108, 293, 164, 57, 185, -197, -42, 137, -171, 16, 98, -66, 65, 62, 164, 1, 129, -82, -163, 73, -1, 90, 179, 93, 31, 21, 127, 182, -200, -252, -124, 34, -66, 150, 114, 190, 304, 161, -22, 34, -30, -272, -92, -91, -19]
2467a9N6m6M60k36j59J24l1r7m66L77O5n8J92l99M26J27o1o9k68k42L50j84J10
2490d8q1N33l96P0L5J00j54M6k01o5n8j5n9O31J65k42j38k06J06J27j43j81K7
2513a47K2K43J99j69j21p7K54l47l5L00q1j78J47qk36N23j65N5l03L52j56l67
2535b95M85k36o4J08Q9qj52J84r1m27L95n5P6q5k4Q2L09L9j22M7K19k81m3k23
2559g3J80m51N02M5j5l37K32J70l83N68m49k87N2L17k55NR6L81k35J44j60L2k42
2582a63J20J1L7j37L07j56L0L50l4n37J98J10k12Jj81L8K31J26n3k39K28J75j17
2605A33k7k81J45p5K40l8L3l27N27%l90n4K04k16J89J28m01J7R9L39p8j28q3J32
2629H8N0k67L6l7j16N12m17M01k15j52J96j06qn4k5Q3Kk4k6L09j96J95j06j75
$$ y = [-19, 37, -9, 451, 215, 56, 180, 149, 52, -414, -37, 28, -30, 162, -237, 189, 316, 255, 186, -82, -324, 26, -158, -48, -129, 404, 8, 78, 113, 213, 59, 105, -96, -161, -219, -234, -293, 338, 503, 261, 123, -83, 23, 150, 7, -174, -147, -125, 118, 317, 148, 27, -50, 204, -143, -178, 122, 41, -137, 10, 2, -234, 289, 124, 179, -124, 228, 72, -295, 190, -46, -110, -2, 87, 79, -73, 111, 20, -407, -12, -67, 9, -76, -100, -18, 291, 330, 208, 255, 474, 193, 150, -73, 107, -344, 158, 203, 188, -149, 83, 253, -130, 438, -11, -298, -246, 71, -184, -179, -83, 298, 63, 207, 47, 79, -163, -43, -32, 5, -132, 175, 19, 49, 399, 365, -172, 26, 136, -76, -75, -256, -218, 13, 139, 86, -153, 75, 250, 133, 106, -175, -30, -105, 135, 97, 130, -197, 330, 330, -60, -114, 90, -126, 63, 191, -210, -193, -94, 245, 167, 39, -44, 88, 138, -129, -93, -130, -246, 266, -151, 250, 35, -117, 79, -27, -35, -89, -114, -31, -29, -53, -79, 230, 34, 229, 123, -52]
2653e2n9L6j49J70Kj38J07L51q3Oj33r5J41l02J74m51L77m3K60Q5J06l10j63O60
2677D97p07rK94l56J99J93n1K51k15qp2k10l0J53q2K58M1k1j77R3L68k95J2j34
2701hK3m8o4K62k98K05K1r3j31K35j87Q7k52Q3J54Kj60j24K60K48j41K4j3J85
2725B70l04M3J21j24K69k59N1J44k5q9j73j19J33M1m9o8J75Q1J51J4j53k46L30
2748B14k44k75K41j76K5J05M6j9K39l3k23K78n6l07K2K03O6j27J72j68m2O1J67
2771A69j01l48M10K5j84K4M4j37J90q4p7K04J24k41j8J59j65q8K13j95O5J61j0
2794A40J03k63J99k13k05L89j23J5n7l30M57L6j02q7J16K99k97m02L85r0kq3L19
2817B04l42J76r9P6k2kk07l0J44J04l5m4PLK6j68K94j33K18l56K91kj53J7j16
$$ y = [-52, -111, -75, -224, -54, -52, -190, -83, 268, 185, 191, 58, -37, 104, -198, -24, -475, -98, -141, 119, 204, 310, 0, -163, 497, -210, -219, 75, -281, -82, 111, 60, 311, 96, 88, 16, -194, -224, -71, -153, 105, 146, 125, -52, 41, 409, 114, 126, -8, 15, -33, -97, 165, -133, 72, 93, 0, -131, 104, -83, 4, -248, -165, -11, -9, -169, -293, -33, 215, 74, 98, 85, 270, -34, 9, 130, 6, 275, 16, 67, 211, 186, 97, -76, -195, -62, -21, -70, -138, 37, 118, 269, 283, 130, -116, 214, -30, -305, -64, -240, -215, -110, -64, -83, 156, 123, -100, 178, 122, -185, -163, 40, 106, -21, 151, -17, -59, 2, 169, 68, -280, 130, 155, -29, -5, 39, -98, 92, 8, -69, 135, 259, 18, 0, 159, -6, -94, 119, -76, -11, 150, 140, 243, -20, 179, -34, -239, 150, 27, 42, -15, -345, 112, 148, 46, -41, 75, 374, 77, -325, 60, -30, -32, -115, 204, -138, 38, -61, 15, -7, -9, -216, -246, -102, 2, -33, -77, -70, -67, -41, -209, 85, -48, 170, -186, 105, 103, -50, -33, -149]
2842a49K40k04K70l21P9j22K85j01O8K00k03m7L01j69k58K78j21j13k2P4L43k98
2864A0K58j05O0O1l02J44n7j52K5K00o0j86L42l48K48k45K15k94J53N4j58J84
2886D7J98j56j15J22j85R4n2j21k1O0jK88j85j71L93jp2j41J5n3NK5j23J98l74
2911c26K48J80J62k84K20k86j68M21n59Q5N13l15J12J52N9k07j07M5j54K7L85
2932B03l25k7J63M8p4J15j22r5J25K3Q1K8j44j8j90K1N67k32j92P9J9r0n3o1K80
2957A29j76J44Q3j91j57M89j51k61j52J45l0K68k0j31k2r7L87j30k85J05R1j33
2979i5K41l9r3n1J81ok43O9K8r2J00q7J54j97J85J13j86N5j60J33L7JJ11k05j66
3004b12j42K89%K75j99J75ll38J81k99L16k72M29l47r0L33j15o6J71j95Q5j33
$$ y = [-149, 91, -113, 157, -164, -85, -207, 78, -23, 45, 245, 42, -5, 296, 127, -131, 147, 26, -87, -109, -35, 308, 10, 268, 163, 223, 284, -18, 126, 69, -83, -58, 142, 82, -104, 238, -110, 138, -107, 108, -186, -33, 21, -137, 47, 245, 89, -26, 96, -89, 5, -47, -168, -189, -129, -130, 158, -27, -198, 195, 194, 122, -19, -4, -57, -52, -27, -150, 48, -326, -78, 102, 264, -20, 200, -86, -254, 167, -392, -307, 206, -109, 3, 155, 214, 7, -100, -55, -209, -182, 203, -122, -149, 14, 62, -12, 103, -19, -114, 11, 34, 115, 143, -1, -19, -209, -188, 379, 147, -45, 34, 53, -37, -90, -151, 129, -47, 97, 180, -11, -168, 321, 170, -91, -243, -98, -128, 140, 120, -11, -33, -130, 257, 127, -158, -53, 38, -95, 146, 107, 14, -37, 144, 138, -105, -36, -8, -100, 0, -87, 67, -130, 55, 168, -18, 37, -123, 10, 47, 48, 159, -46, -212, -354, -65, -65, 210, 11, 186, 183, -155, 26, -273, 43, -229, 200, -147, -237, 96, -19, -85, 86, -109, -24, -157]
3026a57J33J54j04K00j10j58L43j91k78L34k50J78K1l0j77l96M89K0J46j15J05
3047A57j66k50L21k06R6k7j40L20Pq1J12r7j95q2%K33j38L0lm7K71q2j07L42m62
3072a94L15k25q8O7J50J22m01J27K09o2j51L2M2j27K63n3k40J50J20K04k91j0
3094d1j68J86P7n5J58p6o4Qj01K21m32L90j34j5N2M8K2k00K8n5J56lm5M2M4J3
3120E6j46j9l2J41K63l74P0k19K47K15l02K18q3J8j23O5J47j30J74j01K03j71
3142A17M5l35J75pnL7J11Kk49Q9l0L17n04L38k80J10j37J26K26j00N4OR7k55K75
3167B23k23J72Q0m69K89q6j2j09J08J63k43R1q8J63j48oJ36J14m49K71j1P8l6
3190HJ7O9j08j59N22m44j09K97j8N0m54K30J22K13k60K07l60J61l47L07o7J41
$$ y = [-157, -24, 130, 26, 226, 116, -42, 301, 110, -168, 166, -84, 94, 115, 85, -92, -488, 1, 21, 167, 52, 157, -9, -259, 62, -144, -48, -75, -215, 105, 112, 31, 143, 46, -149, -231, -231, 2, -136, -106, -109, -156, 115, 33, -74, 268, -194, 121, -104, -192, -125, 25, 147, -254, -127, 82, 20, -131, -99, -57, -184, 79, 26, -214, -64, 56, 260, -31, -41, -209, -23, 54, -1, 157, 81, 17, 25, -76, 145, -287, 103, -31, -46, 6, 54, 76, -124, -96, -151, 5, 2, -43, -1, 43, 56, -90, -109, -141, 0, 263, -111, -41, -260, -13, 202, -100, 118, 35, 53, -70, -5, 142, 12, 186, 85, 288, 117, 162, -173, 2, -5, -10, 27, 138, 140, -109, -20, -50, 267, -237, 101, -179, -69, -206, -80, 146, 46, 100, 106, 203, -52, 223, 0, 172, 252, -217, 72, -14, -26, -135, -27, 136, -107, -16, -104, 59, -89, -95, 41, 155, -294, -23, -34, 44, 8, 25, 94, -14, -173, 349, -95, -204, 93, 75, 125, -329, -99, 23, 236, -24, 183, -177, -16, -363, -56, -123, 18]
3212A8R7r9J43l08j23L23l3K0R3j38j8J61p1k20L94p6j43k17K79j90l3r7L66O6
3236A94k83K03M9m07K87m0k97K47L6j25N7K11j25m5M4lK5j24R3K16j66J05j76
3259b4M6j29J02l07L3J0M25j15k13P4L01K31n79K83l24K90l0j15J27k30l2J36
3281d0j55L40j72q9K04o0o5p4j26l3K45J5j67o4K69K45k20m4J88l36L02j80Pk9
3305c9K25k49J67l02M61p08L34K09R2Mn36N70k84N6j7o1q8K70r8l20J92J24j7
3328a5q2J23K3K1j40J72L5k16J73Nj48J91j32L2r1K96k68nj0J63O8j07l51K97
3352C4m0k49K45K78l9k63j4R3nj83K47j28m7J51q7J1j52K26k67J48K9Q5k44K49
3376G8mj06k92M03o1k16K54m5J47O8k32R3j06J09q4L7J17m39K45n2Nj68K00N3
$$ y = [18, 115, 16, 159, -149, -272, 51, 18, 38, 131, -7, -25, 136, 65, -155, 239, 163, 20, -197, 82, -108, -141, -238, 128, 194, -89, 114, 163, -244, 43, 3, -294, -47, -11, -136, -79, 132, 7, -38, 6, 3, 28, -96, -3, 213, 47, 152, -24, 22, -107, -5, -312, -279, -269, 156, 41, -172, -98, 203, 434, -145, 138, -186, 104, 74, -41, 86, -144, -176, -40, -195, 145, -27, -116, 88, 28, -37, -111, -237, -270, -25, -10, -177, -241, 28, 273, 53, 9, 197, -139, 163, -17, -10, -39, 186, -63, 104, -198, 263, -445, -111, 98, 190, 194, -342, 228, -56, 0, -17, -78, -166, 104, 6, -314, -122, 2, -15, -97, 26, 49, 70, -70, 102, 137, -79, 94, 99, -49, 142, 10, 42, -49, 247, -21, -26, -36, 127, 195, 88, -263, 34, -6, -255, -10, 268, 229, -34, -48, 45, 40, -143, 104, -24, -71, 80, -7, 4, -148, 78, -189, -41, -12, 73, -171, 78, 74, -32, -324, 79, 18, -198, 56, 11, 158, 226, -6, 87, -19, 90, 6, 43, 160, -279, -34, -86, -81, -249, -49, 4]
3400Dj27J41J51k67M3Mn3L3o7kJ07L68j20j99n6J22Q8k57k2K47l0N9j91j2O3J36
3426A63P0k60k47L96J32q2r9J24j54J39l27J19K4J9l25M90o6J71k34o6K28l68
3448a53Q0J44J64j54O8Q0j66j05K37m81M18r2l00O0M00k05k65M49m78L26L21k86
3470F2j71K67j93K11k02L56j69j75n6J49m39K76J85r3O0J7m5j3O0j7l0k89L47
3493I8r6j4j08RP6J16o7j38J23p3J6l48L73M7J24j58M8J88l19J42M2Pk91Q8j8
3518a33L75l12J32J84m78K68M1k5L72m57l29N23k89J16J1J51k50P7j7n0o7jk9
3541a87L47Jj69K04j17q7Rr3L4R0J26j50l26K70KL7Nj92K16J35j2m43K66O0J74
3566B00j01pJ38k24Q9K6kK0j15j79O3m2j13L42Q5k59K35j80K82l10K43l62j63
$$ y = [4, -123, 18, 169, -98, -55, -51, -104, -71, -138, -140, -33, 335, 215, 16, -40, 82, 170, -87, -109, 138, 108, 167, -24, -36, 27, 163, 233, -27, -274, 122, 254, 172, 73, 197, 43, 182, -145, -26, -2, 17, -308, 182, 116, 287, 53, -13, 215, -153, -73, 71, 235, 81, 149, 229, 63, -42, 195, -286, 132, 40, -260, -200, 200, -5, -270, 179, -299, 27, 348, 62, -109, 158, -35, 176, -26, 330, 161, -14, -70, 79, -360, -84, 101, 8, 68, 85, 40, 27, 87, 70, 40, -249, 98, 2, -12, -120, -111, -35, 81, 14, -124, -1, -74, -58, -406, -33, 14, 138, -20, 28, 216, -103, 39, 81, 88, -203, -115, -133, 242, -70, 62, 246, -232, 36, 77, 52, 424, -33, -362, 161, -128, -12, -1, 150, -100, -23, -40, -90, -157, -158, -187, 160, 161, -8, 196, 79, -8, 1, -92, -58, 32, 158, 8, -318, -48, -46, -9, -4, -196, 20, 155, 143, -300, -34, 26, 200, 99, 92, 230, 6, 95, 121, 119, 139, 24, -155, -92, -134, -247, 95, 180, -79, 156, -24, 258, -52, 191, -171, -334]
3589c34M94l41K57j03R2j80N4J71K3k54J07n7Q3k39L05j76o4O1K63j76N4l11K25
3612d6O4j27J69r8J95m16K62m7R8k13R1j01L00J13k42J51n57L82L1M1R6k2j81
3635e7J07k07j8o7L01o1j79M70m61K27n2J40j16M7o1J52L6l59N05l62L20l89K01
3658A17k01J23j41k3J99J0j44J6l53O10p6k17J76J4k84J42k05K38Q0m2J66k58
3680e3J65l4l9J16j69J65m3J79o7n01K74J16J74j31k5q1J24k45k47L35m1O5j35
3703i8L16q2r1k1j29L24k16P2k10K15M6m08L6o9M62l36j67N10p9o2K36k72l6K51
3727A92j38j58M03k73J10l98L08j11J53o8j47j0R7K37k07J1j03J55O5J29j32j34
3749a9k5J72k42q8J50j29J49L32n34J54L46j91L9Jm90L52J7R2l16P59m73J9j45
$$ y = [-334, 160, -181, 76, -27, 65, -115, -61, 110, 133, -121, -14, -71, 12, -227, 78, -98, -162, -101, 162, -14, 40, -271, -46, 18, -109, 60, -38, 157, -259, 3, -44, 54, -159, -68, -169, 131, 244, 2, 153, -404, -22, 9, 50, 146, 124, -57, 50, -157, -175, -242, 59, -2, -181, 289, -172, 55, 3, 143, 27, 74, 13, 165, 201, -158, 347, -15, 305, -84, 117, -84, 39, -102, -125, 74, 84, -60, -44, -397, 213, 137, -80, 96, 110, -174, -32, -237, 1, 81, 39, 205, -53, 112, 78, 39, 155, -14, 151, 108, 287, 220, -281, -7, 109, 283, 152, 127, 46, 170, -75, -322, 13, -28, 37, -98, 218, 136, 45, 24, -105, 219, 3, 75, -135, 80, 126, -282, -246, -315, 147, -189, -356, 154, 75, 13, 249, -23, -59, 192, 54, -104, 299, 26, 136, -262, 46, -65, 88, 20, -127, -137, -40, 197, -10, 1, -102, 53, 118, 247, 115, -19, -44, 128, -114, -202, -52, -181, -32, 300, -234, -80, 266, 75, 114, 115, -375, -23, -6, 86, -230, 529, 56, 75, -70]
3772g0K52j53p0k46K40j88J04M9J6M9K55l93K30L1O1m4k18K70l35m5J43J62p0
3795C0K4J88n33K39R3k79K71j78Q0L44l30J47J4p9k18J60j0J52k05M6J75O0K00
3818C91o72rL55K2q0JM2n4j94J28J16J4j39K47k74R9k9k8j32M45o75N13l4k41
3842a88K81k40M81n26M52l03j68K11M3R7j29j35L06J92l43L8k51K97k52K1j06
3863b22L6K00J77m57K38J08N4j47J86q6L3k59M3Q1k9J64l84J87n7j16J49J26J09
3886A34l3j43N5k74K62J22p2J54l07K12j00J35J13m46o9K48O1k1k18L25j11k0
3908GM8O5K16n08J14j10J88O3J34k06M3J0OJ13o8p7j24o4P4j6J3j5Q4P0j05M6
3934Ap9m5NO2m0K60k03M6j8J66k51M5L23k13j02o1K21j92j12Q2J46j7r0j72K40
$$ y = [-70, 182, 29, -41, -287, -47, -235, -131, -82, -66, -17, 238, -155, 75, 106, 167, 123, -95, 175, -160, -205, -62, 100, 30, 54, 242, -291, -52, 41, -238, 33, -145, -65, 279, -51, 96, 110, 31, -187, -27, -37, 115, -90, -44, 131, 191, 391, -281, -290, 65, 87, 7, 8, 50, -4, -198, -70, 46, 60, -79, 168, -106, -7, -36, -64, -196, 249, -426, 87, 53, -188, 93, -147, 334, -192, 260, -43, -211, 0, 43, 140, 11, -124, 182, 374, 31, 69, -182, 115, -137, -116, -222, -186, 14, 191, -266, -28, 80, 134, -13, 173, 87, 120, -139, -96, -15, -44, 120, -264, -77, -134, -250, -101, 25, 134, 101, -42, 13, -261, 1, 123, 51, 205, -102, 110, 10, 145, 258, -188, -257, -9, 52, 31, -187, 138, 27, 7, 55, 120, 336, -172, -58, -168, 20, 83, 217, 11, 54, 64, 70, 183, 115, 38, -86, -150, -76, -92, -79, -94, -10, 60, -45, 1, -78, -123, -118, -56, -96, 164, -39, 7, -11, 155, -96, -51, 272, 59, -43, -104, 117, -75, -187, -105, 41, 24, -66, -238, 2]
3959BO3k18J24J35k61K95k8J15j70l51L05j3K01j32N1k7k92K45n0n2M7j55Q9J07
3983C0N3k16R3JL04k11M8l7m9r2R3j1q3JJ50Ll01N37j78o3l53K81P2k2j75K60
4009A35l02K28j95K10n1r6N1q0n3N1K13j86N5l0K46j21j72J18l78N08j0n4k86
4032a99J59J06j53J94j90o3j83J37J76k13K24L6j56K96j65J47j85J16%j26k1J36
4054G3j46J18K19k41o6N6k0J43k3K4k42l3j05L06J75k94J50J27k01j67K14k26
4076a59L25l36K43M2o9k38J43J94k03J28j44P9J72j68j24K16p0j06J63J60j42
4097A06Qj6q2j51Q5J16l85M72N7j54R7J52j22o9mm19L26L7j19PJ24m3M2j90p6
4122b01J53N3J75j05j3m16N70k54M0J58l90L00ml82M58q7P4j49Nj69o0L50j29
$$ y = [2, 65, -153, -29, 106, -155, 140, 112, 227, 57, -294, 11, -2, 199, 67, 118, 91, -201, 44, -6, -58, -11, -166, -77, 30, 83, -133, -40, -39, 265, 54, 102, 65, 16, -76, 17, 6, -77, -76, 74, 77, -224, 313, 135, 72, -281, 0, 72, 50, -125, 135, -167, 61, -134, 76, 25, -71, -20, -100, -153, -102, 111, -75, -20, -50, 196, 75, -97, 21, -357, 151, 141, 87, -199, -40, 66, -87, 107, -83, -146, -329, -192, -16, -229, -5, 31, -125, 171, 6, 153, -32, 84, 84, -42, -63, 73, -73, 45, 264, 23, -43, 13, -7, 136, 113, 137, -105, -138, -243, 63, 238, -56, 94, 221, 20, -147, 67, -159, 166, -170, 73, 115, 46, -192, -49, 145, -58, 70, -74, 5, 177, 9, -115, 101, 31, -75, 88, 248, 106, 114, 98, 16, -135, -50, 66, -319, 153, 210, 56, 153, 305, 183, 114, 110, -309, 17, 54, -65, -58, 66, 23, 65, -125, -201, -48, 5, 180, 75, 62, -354, 216, -38, 2, 160, -230, 70, 66, -316, 142, 55, 129, -20, -15, -184, -244, 106, -23]
4145b3R5j8K14k50p0P9k90P8L30K7l4j32N3m6M3j39K23P4l05J16j46J16L30n40
4169b15L33k06J37M6l02K06J37j52QQ0j9Q1j56r6M5j68K41K5p5j30K26RM0j76
4193h1K36k67J54O5m0J86l14K26J23j40k91L05N9j18j56K35o0k61K03n2pR3K1
4216A19o3k33J77k68L11l4j98o4L74n0o3K53k30M6j22p4L53l41m5R7K3J13j21
4239d0L0K76r2j78J2l97J78k1J08J30K1K54k02l22J98J38J44l5k88J49m2j0K11
4262B22k92L41k82j76K06j12J81k38M7k2K36J36j40J9k9k55J49M9j17nj11K86
4284I3q1r6J87j59N3J68k47J04K5j10L35n90M53k05j4J32qj50K6K28l68k6L8k1
4308b33K19J35O0l69k03M84p8Kj05L0L7K40l43K07j09J7k86M9M85%j94K74j59
$$ y = [-23, 72, 54, 268, 18, -52, 27, -263, -185, 145, 172, 138, 6, 59, 13, 56, -83, 140, 214, -91, 25, -121, -5, 325, -215, 118, -88, 49, 95, -207, -1, 136, -16, -8, 72, 53, 134, -22, -118, -73, -241, 0, 25, -50, -180, 46, 55, 95, -81, 155, -112, 42, 107, 67, 253, -61, 165, 288, 148, -143, 162, 221, 103, -53, 182, 122, -139, 64, 12, 5, 98, 119, 56, -177, 0, -268, 43, 9, -189, -253, 121, 71, 8, 261, 31, 77, -45, -119, 234, -107, -152, -55, -32, 81, -40, -10, 266, 174, -4, 8, -389, -211, -232, -124, 6, 27, 281, 79, -243, -45, 93, 237, 202, -86, 63, 21, 11, 222, -70, 271, -11, -187, 19, -93, 88, -150, -103, -125, 111, 247, 107, 126, 97, -158, -9, 40, -77, -82, -193, 93, 12, -84, 103, -56, -3, 165, -82, 22, 47, -63, 272, -318, 135, -70, -84, 48, 40, -110, -84, 144, -224, -250, -212, -233, -14, 121, 181, -188, -391, 93, 15, 17, -88, -58, -21, 219, -124, 83, -26, -9, -295, -246, 239, 239, 45, 319, 160]
4331A60l79J53J88m01J35K29J18o4k17M2j09J08m7J99j10j83J2p3L39j61j52P0
4353a43n4Q0o5K98o6j63K59j54P8O1m8j65j94K75j81K78Q5k65R6j85R6J94j60
4376d3j41J57K22k93nJ23j27J27Q6K75k42j58Q7M7j97k26O15k94l3J80k36k5J67
4399F6j1M9k60K8L8K00n8j05j44N07k91l14O68m49J15r5Ll2J89O6j12J19k43J04
4423C8k1o3R5K72k44r5N9n8J60p1J61k10k90J58K25j19j5QL04k48j8nj37M0L43
4448B69k40k97L97j74L4PK67k55L90n75p4L60j43o0K46O1j23j22R2j37J26j40
4470i1J3J39K12m56o8L91j66m8j9j36K43k88M83om28N7J34P6j03pJ44k27j40M17
4494A26k12J36l3J27K29l07Q7k3j64J41j01l4J89K0l58k3M58l19K12j9J27m11
$$ y = [160, -219, -66, 122, -279, -144, 85, 203, 139, -78, -36, -145, -37, -84, 115, 5, -178, -166, -239, 100, -61, -213, -143, -197, -117, -182, 116, 50, -113, 146, -8, 70, 131, 83, -82, -276, -1, -182, 96, 181, -84, 12, -173, -77, 117, -43, -184, -27, 195, -98, -103, 20, -107, 20, 106, 381, 139, -19, 68, 115, -82, -308, 307, 13, -20, 160, -76, -101, 66, 55, 104, -156, -128, -90, 110, 52, -53, -197, 310, 19, -295, 373, -76, 39, -56, -53, -85, 104, 170, 58, 177, -66, 38, 17, -46, 49, 321, 77, -18, 41, -17, 143, 72, 233, 23, -267, -109, 116, -3, -18, -10, 294, 46, 28, 23, -114, -74, 269, 29, -268, 129, -45, -11, -4, 263, 8, 398, -177, -251, 109, -34, -94, 152, 213, 90, -32, 60, -77, 49, -91, -78, 61, 273, -183, -251, 140, -26, -74, -93, -229, 14, -274, 209, 203, -225, -168, -34, 42, -61, -68, 76, -151, -291, 126, -86, 50, 17, 144, 373, 66, 153, 130, -34, 107, 6, -28, 161, 181, -177, -200, 258, -61, 151, 132, 259, -152]
4516a52J43k09L06k21L27j55K2l9P6k13K93K9l55K40k58J33J70j71q5J60k28J22
4538f5k12M24m26J42J4L55l68j14N47j43N8l0k41N7oj43K35o7m2J72k00J14o2
4561aR7l02J64r1J47L2p6K15Oo9l80J79M10m07j61L15P6k23K48j83j86L82k22
4584c0j36M99l16N8j35J40j84k3j3K32q7r2M29n75N30l85L1J44j7m9k53M47l50
4607a35J29j80K82l01NK35k87j1L93m20J75K53j09j9j38QK43k04J13m1j6j84K85
4630G6q6J31l22J64q2O0m7J60N8j69M9q6l7L3K1n3j77N16qj91r5J74N0K7k43p7
4656a54P6Po8J37J28k33K69n0l2J08n44M48n1Q2k11K00j29r1K79l41L4L8L8k7
4680h7Q6j01J34n7j57l5K92j94J60K65m21P1M1L32l73P3j53m8J86n7O3q8j10K83
$$ y = [-152, -9, -218, 88, -133, 194, 39, 61, 22, 98, -115, 178, 207, -148, 92, -166, -33, 137, -34, -119, 41, -187, -65, -277, 147, -279, -137, -123, 232, -136, -250, 297, 154, 212, 182, -59, -2, -8, -151, 84, 17, -25, 147, -53, 61, -1, 96, -206, -42, -133, 14, 46, -30, 185, 191, 122, -258, -79, 331, -76, -237, 78, 154, -69, 179, -4, -190, 192, -30, -166, 333, 17, 75, -60, 80, -104, -127, -140, 92, 5, -87, 342, -233, 297, -88, -57, 87, 70, 21, -232, 215, -135, -6, -186, 96, -205, -200, 35, -252, -263, 130, -290, -115, 138, 29, 10, -128, -120, 123, -81, 32, -9, -25, -209, 76, -10, 121, -201, -37, -119, -59, -106, 54, 112, -57, -8, -94, -131, -98, -77, -130, -307, 209, 201, 10, -85, 89, 139, 166, -77, -154, -78, -71, -139, -2, 126, -107, 162, 112, 80, 188, -356, 92, 41, 123, -88, 112, -17, -108, 171, -170, -136, -98, -60, -87, -1, -102, 32, -25, -182, -217, 75, -119, 41, 306, -115, -44, -3, 329, -44, 29, -124, -172, 14, -43, 20, -68, -178, 105]
4704A05j84K26j71J41l39J78mj52M21j53m17K11J31k1o9p7l4K05J97m05J83q1
4726a09L7k80J59J91J06J21m77m4K81J49j39JR9k77O4L55j50j53L21k48j94L58
4748A71k14%J2j55M31l37N5J77J87l64Q8k69K64n8Q5k28m9J57K9q8L1J54j28K49
4772B00q6l63K11J57o7r7L33q7j06Rj26K0P4J84l39N5K1l06M49J34l39O3r9o3
4796a68K54m30L25J4N7k3k5p6K17j03K8k31K64p4J6n5j05K41j12R7jj41J21R5
4820A85l07J67j57k3L41j14j70Q3R2k04L2k64K10L3J07j1J18l10K87O5p5k04K08
4843H9o7j34K15k81Q6R6qJ2L2J26j04m8j37Q1J40j44P1J08Q5k54J16J32J54l17
4867D9j75L89q1j38r5K7J08N3k48P0m6K72j00k59J27q4j6K85j79k7R5K7N3j31
$$ y = [105, -79, 147, -24, 117, -222, -44, -48, -200, 221, 68, -349, -138, -7, -28, -97, -174, -208, -3, 194, -211, -28, -109, -72, -352, -193, -2, 104, 225, -252, -296, -15, 134, -5, -4, 95, -182, -118, 237, 87, -66, 255, 7, -187, 171, -43, -43, -31, -186, 245, -92, -37, 140, 327, -37, 51, -218, 46, -12, 73, -155, -204, -47, -18, -106, -75, 79, -49, 200, 114, -249, -38, 119, 52, -45, 288, 201, 95, 104, -22, -2, 72, 256, -83, -28, -7, -313, 136, 270, -69, -6, -105, -168, 86, -344, -19, -5, 52, 29, 4, -72, 145, 42, 70, -161, 103, 29, 45, -10, -115, 126, 14, 111, 110, -31, 90, 185, -122, 45, -112, -135, 206, 92, -78, 5, 97, -107, -75, -339, -129, -96, 11, 0, 118, -192, 95, 160, 85, -119, 89, 22, -112, 103, -178, -92, 4, -4, 8, 40, 166, 62, 14, -123, -42, 98, -46, 25, 133, 218, -36, 80, 212, 366, 49, -126, 263, 182, 44, -51, -24, 84, 137, -111, -41, -87, 185, 85, -174, -47, -131, -147, 138, -41, -68, 27, 54, 107, -24]
4891b4K62r0O0K5k74J36J36k20l86J73j01M59l59J80j53O5J61p7N8j15M8k14L24
4914G4j73n0j61N07j98j35K57j72L33l69J68j56j07J81q8Q1J1N4r5p7M38k17k58
4937a52K23k79L36l32MPj7N1n4K91r1k45L30j83J29J10j34r2o1K19j62j8Q7j1
4961d4L23n05R7K51l60L27P0l36K9J65k3k8k8L1K25j41O3k08p6L86k49m9j33J51
4985f2J25J09k84J37p7j8J48J41l05r0L93l25K0j54M96k86K14J87l28k67L86j97
5007c7J06J8L3k22J70r0L4j43J16j34J62L1m6k51J66q3JL29L6nj03k60K0K28l4
5032D2qj46J01L6j12M1N9K61l30K37k74J78o4NJ35j21j57k5J35k8mj52L89l92
5056a94K46k29J26j2K8J21j40J05j63J01J18k43M6M9k3j55k1J37M9M9J14k28K79
$$ y = [-24, 238, 148, 208, 233, -41, 95, 231, 11, -375, -202, -303, 156, -203, -23, -176, -111, 50, -27, 31, -84, -36, -250, 74, -99, -149, -310, 197, -1, -136, 121, -51, 282, -87, 81, -75, -182, -1, -89, -8, 3, 57, -38, -115, 323, 106, -152, 71, -208, 128, -204, -200, -193, -210, -159, -213, 78, -13, -258, 72, -111, 18, 128, -6, -98, -159, 60, -102, -120, -33, -44, 279, -226, -129, 122, -238, 89, 159, -177, -148, 17, -6, -34, -62, -31, 194, 53, 116, -92, -168, 218, -31, -80, -213, -62, 63, 172, -112, 25, -52, -70, 78, 219, -86, -176, 217, -108, -88, -242, 254, -32, 182, 369, 41, -226, 160, -37, 69, 87, 120, -102, 68, -22, 12, -131, -15, -149, 13, 44, -2, -253, -87, -170, -169, 160, 196, 191, 88, -172, -152, 76, 42, 34, -112, -11, 25, -87, -46, 13, 274, -56, 181, -93, 85, 21, 26, 161, 40, -117, -142, -7, -35, -39, -191, 198, -194, 52, -177, -51, -63, -35, 86, -54, 51, -112, -11, 107, -136, -90, -41, -64, -219, -240, -103, -54, -5, 109, -119, 160]
5079A60k90J1n0K05Q3j06o6KP4r4K34j52r1K30j57J36M8j72J19j15k7j39M86m47
5103a18K06j94K8J25J3m0k50Q2N49l81K19j98j95K72l39J59qn9K33J5r4J38Q4
5126B47l02N0N0k7K85l41L06m10M05l45J64p1mo7J50m%j45N4J1K44k16j18J54
5150G0j27K19j68j11J09p6M7j67K90j63Q1j05K39j30j74rPJ43J05J6K9J14k45
5173fk57K88j51J50OJ27j64J82k87J02J5k48K71ljJ41k27M0%J14j04l0J77j7R1
5198B09j90M2L4J04j25k14L07m6m44L34P0j88J31N6lj36j32L72j79j2J44J62j66
5221A30j77j0R9j20j24j33L40R3k9k5m4J12j12Pn6j0P6oJ88j34j50K17j03m8J04
5246H5P2j23Q3j70j7K55l8l65M05J55l81R0n5P4m52L16N5J01n5N6Q8l43L76j17
$$ y = [160, -130, -119, -169, 36, 119, 13, -53, -51, 23, -71, 163, 11, -80, 150, -7, 129, 177, 5, 124, 9, -18, -157, 329, -118, 88, -106, -78, 47, 60, 20, -230, -148, 401, 20, 239, 41, -154, 118, -221, -62, -70, -129, 104, 119, 25, 163, 247, -55, -5, 45, 18, 303, -38, 268, -142, 263, -82, 82, 11, 7, -60, 90, 86, 86, -59, -5, 6, 250, 34, -84, 70, -57, 162, -6, -117, -8, -84, -37, -204, 86, -77, 4, -101, 138, 8, -166, -175, -168, -25, 80, 96, 125, 239, -6, -263, 25, -126, 24, 30, 157, -7, 175, -112, -10, 5, -243, 28, 25, 24, 165, -62, -22, -22, 92, -12, -42, 135, 118, 209, 19, 61, 95, 199, 74, -140, 167, 121, -323, 11, 81, -107, 24, 80, 77, -59, -191, 181, 2, -10, 134, 296, 130, -47, -57, 42, -78, -202, -335, 5, 98, 69, 44, 0, 112, 0, 7, -49, -59, 17, 11, 199, 65, -85, 132, 29, -19, 85, 157, 34, 117, -53, -70, 185, 147, -218, 187, 342, -39, 51, -4, 70, -382, -66, -11, 90, 35, 91, 179, -164, 212, 95]
5270I5j39J33l00J43J00k18L39j50Q7j82K15r5l2k05K81n3P3j18Q9n8j92J62M5
5293B0k8L3k3j74K05P0l36K17O3n4l9O1J08R5j93R4J7M0j78m1k12K02K04k73K63
5318A41J19m37L23J3l22K5K68j75J81km4j02j37K36p2m7rj67L69L7j38l8J98l09
5342h9j1J52N4q2K38j03J5j84L04m06L58j54j84nJ51k95K17j07O1J0k7L75n11
5365b23K15Q6j44J00l4LJ58j23L12l48q8j52M17k87RJ62j87J88K1l02J21R0j74
5388a80K99l40Q6L8J06O%j35K39j34P5J68l83k25K59J6k94L67L0j17J19K42k67
5411b5r6M21p3r1k46K6J35j18Q2m3q7L05j29J34l29k7J30o4PK6M53n64O1J40Q1
5436A09J25n16M12k26Pj23J05K33m54J59M6R4M5k35Q6J44K08k23K3M7k37L38n
$$ y = [95, -44, 89, -211, -68, 32, -186, 153, 3, 90, -92, 123, 28, -4, -209, 72, 19, 92, -26, 63, 5, -187, -25, 20, -8, 25, 2, -172, 33, 103, -233, -16, 47, -7, -46, 15, 123, 218, 25, 119, 136, 176, -2, -43, -255, -53, 151, -122, 141, 260, -177, 146, 159, -163, -138, 130, -45, 136, 134, 90, -12, -149, 87, 15, -32, -41, -208, 161, 198, 60, 22, 220, -89, -100, 52, 106, 24, 262, 159, 174, -10, 294, -112, 246, 92, -92, -97, 54, -241, -24, -131, -70, -60, -87, 288, -223, -8, 78, -66, 34, 0, 3, 161, 38, 350, 2, -86, -238, 179, -108, -99, 63, -124, 64, 85, -217, -96, -6, -180, 119, -221, -135, -97, 9, 15, 15, -120, 119, -15, 60, 228, -155, -380, -121, -105, -399, -32, -2, -119, 0, 242, -25, -121, 300, 227, 136, -110, -84, 51, -67, 15, -28, -115, 190, 61, 195, -134, -161, -31, -95, -88, -62, 391, -173, -112, 28, 109, 234, -282, 130, -96, -89, -212, -107, 126, -328, -169, -123, -29, 16, -219, -133, 11, 219, -4, 19, 66, -171, 167, 162]
5459A62M9j91qj60J03J9j35J09M7K7L01m30q9J36j5J88Mj01j54J07k19K40L34
5482C24l69M0J66K4k2k94K77K1K7j26J6M0j53J43L1N0k67N1k70K09k74K99k40
5505b97K29N19n56L3N9j35J32K08Ql77K74k29K51k71L3R7Q4Lj00RJ84l56J14J89
5529A05M4o8nj85L9l2J11J07j80J96O0j45j5P6L9J33k3k32o7P6k06M5J52n7J79
5554A47L2k94K97j78j65r6O19m79r2L13j24R1J1k73K97l16K1J02R9j88J04M1L00
5577B69k40R3j75NP0J9J39k95R9j18n2jL17r2Q7k91K05JK5j02M0j76J77oL39n40
5603b03K29l6ro8J9m6K23k06J21N7k67L04j24q3R9j59M9O7O4j20K26O6l87q3O75
5628D08o65M00p1m2J71j6k05J9r0n8K41k29rR9j75K12J66l75K49L37l71m1J23
$$ y = [162, 211, 20, 12, -148, -45, -26, -161, -52, -5, 22, 323, -107, -196, -60, -75, 113, 117, 16, -138, -31, -250, -10, 324, -45, -5, 161, 185, 163, -131, 146, 167, 194, 68, 84, 124, -29, 114, 145, 195, -72, -21, -291, -82, -356, -57, -297, -68, 451, -105, -72, -13, -148, -16, 192, 200, -177, 97, -132, 119, -152, -119, -22, 62, 65, -35, -26, 158, -198, -84, 105, 149, 81, 76, -109, -70, -102, 9, 116, -64, 132, 192, 47, 32, 108, 147, 280, 257, 25, -42, 34, -172, -127, 25, -32, 147, 179, -115, 182, 4, -161, -257, 362, -117, -209, 104, -20, 71, 82, -191, 106, -210, -189, -87, 12, -176, -72, -31, 269, 29, 122, -53, -48, 22, 41, 180, -115, -16, -134, -186, -187, 130, 38, 125, -166, 39, 40, 65, -37, 3, -173, 4, -2, 337, -203, 26, -10, -19, -87, -68, -114, 109, -97, 24, 81, -186, 118, -6, -89, 10, -149, -100, -33, 31, -89, 137, 203, -184, -267, 408, -257, 143, 72, 30, 201, 185, -20, -1, -91, -149, 92, -137, -146, -47, -222, -10, 156, -219, 30, 367, -4, -45, 78]
5651G8N1q1j10j67K57k33J09p0M0K73m5j82J57q4o6K44r2j62jN0J43l6l45M59
5675A87m10J82J78L7j48P5k75OJ53k53K58j41R8k2J70k41J97k9L0N9j87K4rL17
5699B56j5k63q2j18M35k77JR8q3J70k03J60o6k3l00q9M20l8JnJ52l38JJ80L32
5724C06l20K7l61L67MJ03p6p8l57K07L53j75Ll3o1k9L9M5J88j55J57N9k4O8k32
5749B5j11M2p4J5J15j79K31P0L2q9J0J27J69j98Kj65K8Q3r8Q9L3N8k59J78j46
5774a2J33k16K34j87J69n60M29R6o0L9k40O4N3P3k62J68K06j99j55K49q8o0J27
5797AJ01R5l22K53j38j94K53j38K50J42j51P7j75n2j78N0j44R0j10J85K17N9O8
5820B39m19J57K04k6j83p8r2LQ7P1J20k38L14l29K00n6p1Q7m7rK10k67R5L49j00
$$ y = [78, 129, 48, -62, -229, 28, -205, -96, -166, -126, 147, 102, -80, 77, -7, -73, 171, 79, -83, -84, -34, 109, 73, -272, 187, -223, -41, 137, 174, 26, 101, -174, -168, -15, -268, -10, -151, -53, -75, 95, -146, 51, 22, 52, 111, -76, -52, -61, 256, 241, -22, -104, -222, 213, -64, -63, 35, -48, 122, -81, 79, 13, -10, -310, -399, 21, -17, -16, -21, 131, -207, -206, -26, 306, -14, 13, -348, 19, 23, 126, 50, -28, -385, -178, 175, 0, 3, -30, -91, -120, -81, -36, 152, -3, 154, 213, 189, 257, 25, -86, -44, -118, -103, 12, -167, 64, 134, 166, 77, 87, 214, 383, 185, 187, 22, 50, 133, 35, 124, 157, 215, -44, 134, -12, 121, -95, 139, -48, 121, -439, -10, 86, 26, 65, -175, -111, -58, 15, -247, -79, 127, -72, -227, 22, -66, -126, 1, 102, 197, -125, 128, -10, -204, 49, -89, 161, 303, 152, 229, 54, 2, -176, -126, -270, -180, -290, -105, 112, 171, 239, -180, -23, 181, 155, -28, -106, -198, -195, -108, -37, 83, -155, 159, -170, 30, -26, -97, -10, -57, -66, 144, -123, -28, 321, 221]
5845B21m23n9N35j31R4l56K80j11n5OL1J7J45j18p1K07l34o9J14P5J30j83o4K52
5869A33m7m4J12j95l2M9K18k23j01j6j0J70J54J6m0j83J55m15K04RJ47R0k29J19
5893D1R4J4j53L12m25L18o7k23P9j45R6j75K90k21L7J82J80j28n7J31l31J48q
5916a1J75J15l38J57j86m5J99k90K92k85Q4L27k1k70K45j41n3K8R5P8l2Qr2Rl41
5941b93J18R0l06N30j95J54l81M15m2o4Q5j25j8j63J12J96J27k52o5P4r0J74O5
5964A46l17M43m02NJ95k01O5j23J17K1R7J36k62qJ46P1l58Q7J34K07l85K97k87
5987a76J40j01Q3K58j39k26K12k93K44K7k18K03k09L68j42k69J89J03j66K02j32
6008d2k9Q3rL60n07L49j1j69jj61K09o6J18M5l68N5L55j56J90j81J8K7J0k68L79
$$ y = [221, -202, -261, 274, 143, 237, -119, 161, 50, -5, 1, 32, 49, 194, 76, 5, 212, -122, -191, -77, -2, 128, -55, -119, 133, 86, 42, 154, -41, -73, -24, 194, -29, -130, -146, -156, 14, 168, 184, 144, -39, 116, -299, -95, -86, 61, 151, -78, 41, 135, 149, -4, 308, -117, 201, 134, -89, -10, -155, -59, -234, 56, -165, -128, 54, 234, 106, 49, 180, -151, -3, -11, 164, 279, -59, 98, -88, -133, 66, -224, 68, -217, -133, 194, 173, -97, 148, 7, -46, -18, 77, 155, 123, 131, 39, 48, -293, -175, -85, -391, 139, -56, 98, -283, 132, 90, 26, 111, -14, -32, -195, -83, 113, 240, -12, -77, -3, -93, 81, 146, -171, 272, -130, -125, 70, -131, -66, -189, -72, -51, 46, 182, -80, -88, 58, 129, -229, -142, -8, 199, -186, 111, -176, -36, -137, -54, 204, 65, -161, 51, -242, 2, 29, -189, 14, -195, 173, 31, -238, -49, 54, -112, 90, -42, -71, 12, 3, 363, -144, 205, 194, 25, 24, -137, 72, 6, 124, 169, -199, -144, 211, 55, 245, 64, 82, 109, 119, -149, 230]
6033B30k41j73K55J63k26q3K22j72P4l79L42j02P2mj94J50k1R7n0j19l6J45J42
6056I2oj97P9k21Q5K57Lr4k51L59o5N7l07J85J68k12K3j0k78L85j18r1K83nj05
6081A6L3k5P0q8J5j44J25J21N7l29J36Ql7J72R0j2l1l82L93k59J15p5j48J22L3
6106b4m1J11j00R1N9Rj49J92p6Q5k4j83R0r7R5j16m5L48l86K42j07J36m6l6J96
6131B24k27k66K16J35o0r2k2K90k90M2j10K47P5j51n8K8J72l15K07j06j32L36
6153A43l44J56k8K15j96L67l96O1k8Q0J4k86L59j25J35j45J13M8j87N2o1J52k57
6176a58LL00j99k8J2P0k73L37q5n6K66j53M5j12j33L89j05j05j87OK76k41J28
6199cj16M1j9K60p1K0R0k67K71m17J10K86l24O7J53R6k54J27j3O0N8j02j74j60
$$ y = [230, -11, -184, 71, 234, 8, -75, 147, -25, 49, -330, 12, -90, -18, -22, -216, -66, -87, 10, -40, -159, -195, -50, 92, 86, -111, -32, -253, -168, 89, 92, -2, -253, 106, 41, 98, -209, -24, 144, -68, -45, -55, -333, 52, -66, -157, 126, 121, 16, 49, 24, 94, 6, 21, -123, 2, 123, 180, -149, -13, -5, -42, 130, 220, 208, 177, -205, 188, -71, 44, -31, -179, -57, -24, -65, 46, -54, 37, 96, 105, -44, 148, 72, 157, 133, -50, 40, -57, 38, -78, -123, 225, -161, 81, -26, 110, 64, 28, 224, -3, -269, -53, 82, 22, -70, -92, 198, -92, -50, -160, 87, 162, 11, -47, -19, 153, -162, 45, -61, -193, 143, -201, -45, -73, 142, -54, 313, -83, -22, -50, 30, 44, -242, 117, -8, 127, -18, 95, 143, -44, 8, -53, 99, -158, -155, 145, -54, -82, -70, 0, -273, 64, -21, -77, 189, 36, 81, -31, -164, 225, 120, 15, -172, -166, 110, -131, -3, -119, -78, -97, 163, 92, 112, 202, -65, 206, -211, -101, 185, -139, -72, 81, 177, -77, 50, 37, 97, 155, 53, -121, -281]
6223b81K24M16n83K42K25k40K55j34l72L98m6n6L4J37j63j14J85p6QJ23o6m53
6245c37L95l38K04PK34j65j13K23j47J18k92M39kl68J70m9K1J60K9p4j99j93K7
6268b50j16N32j85j45o1J76L49n52J63L3M2n4k7M01l79J51O0j88Rp2P4k4o1J86
6292F2PK5j58K62j08p5l2o1r8K36j93J93J09l82L53l16j6N0P3J32q0m4J06oj01
6317f2K3K53l14K58l11K14J15j72J45m00J31J5L16j40j12K4j43L13l47K44K8o
6339G2J12k79P0m6J90j34j17qM45q0j0M0n7j14n0r3O0O6p5n3n7r2L40j52O1j64
6365a25j02J91k38r9N21k41M68n10J42j41O7j55L59n5j37R8j55J28K1j48J96j97
6387a12q4K33k4P4n6o5J53l6m0JJ77l18K8N2M4O3k94J91N2N6j1k95M24l91K45
$$ y = [-281, -57, 359, -224, 18, 243, 3, 258, 124, -248, 150, 104, 48, 82, 219, 56, -58, 127, 51, 59, 182, 116, -337, 58, -280, -76, -69, 165, 0, -113, 110, -37, 81, -211, 228, 226, -142, 28, -21, 0, 160, 189, 115, -84, -277, -250, -366, 166, -19, -164, -225, -49, 300, -252, -89, -56, -14, -68, -95, 306, -73, 78, 138, -50, -41, -113, -39, -63, -124, 62, 69, 94, -64, 198, 90, 15, -17, -78, -176, 60, -133, 60, 169, -213, 140, -176, -192, -142, -69, 63, -17, -61, 45, 39, -62, -39, 214, -100, 158, -153, 61, 176, 4, 149, -251, -120, -105, 211, 71, -41, -17, -160, 153, -194, 50, 78, 72, 184, -95, -25, -71, 119, -15, -132, -140, 305, 225, 215, 255, 198, 84, 34, -59, 1, 67, -8, -61, -118, -210, 130, -22, 39, -125, -227, -36, -274, -373, 148, -93, 375, -135, 7, -134, -67, -222, 137, 82, -55, 43, -112, 16, 37, -111, 85, -112, -196, 37, 13, 87, 31, -34, 119, 83, 43, 44, 221, -97, -69, -17, 27, 90, -204, -13, 39, 95, 84, -211, 213, -178, 67]
6412F7l2j70K46j84k2K82m00K57O1m9n7R9k20J88p8k91N09J8j17l55L02R3j91
6435d4OL9j45O2j71J78O4L0K7J5j81J55J86k68J09P1r9J24j63l3J56l8p4O5l08
6460b37P5J88k78K35k5J38l28J75j20L2N1N5j91L9K52j49j11J24o2K89k37J16
6482C1p0J91p1o9k1j18J10p9L13K7k57o1J95j05k96K28J64k95J61o7K02Q1l73
6505a79L94j16p7m8Q1l8o4Q8l2p5K47k70J15j04K36m61K26J88k23J55N8K01j27
6528A75l84J02O0J68j76J67j4p7J17J02j72J3N0k54J30r1j24N7K80j02J63k11
6550b1J12p4L3p3r3P3P3J50k59J81k28J48j30K48o4r3J25k13jj14mK56P7l6Q8
6575A61n6j12O0r5K05j54o9J12j07j57K01n6j87J35J41K18k50r7j10Q4R2L8j8
$$ y = [67, 35, -135, 111, -73, -95, 187, -213, 44, 105, 56, -1, 98, -122, 66, -12, -303, 206, 224, 107, -248, 54, 147, -44, -38, 1, -144, -82, -253, -75, -11, 19, 46, 61, -120, 35, 221, -47, 62, 133, 34, 158, -5, -38, 118, 80, 6, 71, -237, -162, 26, -252, -17, -42, 96, -232, -57, -177, -145, -94, -39, -230, -191, 61, -88, -199, -75, -137, 152, -85, 31, -39, 152, 81, 12, -9, -127, -17, -96, 217, 244, -13, -74, 121, 16, -280, -52, 112, -183, -22, -89, 113, 194, -179, 215, 99, 22, -26, 55, 17, -47, 41, 9, -66, 181, -89, 26, -78, 158, -303, -77, 111, -112, 43, 101, 302, 175, -209, -107, -47, 121, -55, 112, 98, 21, 138, 240, 68, 81, 131, -123, 7, -84, -208, -151, 129, 27, 190, -21, 91, 17, 50, -23, -116, -43, 30, 180, -79, 102, -126, 22, -108, 140, 76, -17, 108, -105, -106, -220, -224, 32, 109, 73, 161, 105, -7, 53, -42, 163, 9, -60, 52, -55, -212, -11, -67, -254, -119, 22, 240, -10, -107, -217, -133, -41, -3, -21]
6598b1K97j15r7K65m56M9J94J32j00P5J7l33p2K01j31MM2q7k12J70J06M4J19J56
6622B47j39M1k81L31j38mk61j35L66k96L35j20K05j76Q9l3J25k34K45k5P9j79
6644D2j37M05m00Q2J24k43J1OJ71j08j31J73l9J61N5N3j72k00K24l9o2r9O5p0
6668a28K7J15J13J8l24J20j22L46k11j38l6Q1J15Q6l2Mj31R6N4n9L8K6j61L7j78
6693b44J54L0K38l58J15k13K31J85m8m5j79K51m1j05J80k63J38K2ln2j03J23k3
6716a0j9kJ69q2k47J44j94K46j94M3K24o9j3Q0R3j74j01J62l95M81j72j33K35
6739G2N9k50K06J29K0l38K32j17R1l53J96P4J31k78p8M87j89Q1k90K5N0L69k82
6762D7j98K19J1o5j29O8L6J94l1j2k74QK75j40J70j08j36j33P7J77Q5kj25MNl7
$$ y = [-21, 276, 161, 64, 329, -127, -78, 116, 248, 148, 223, 240, -93, -165, 36, -95, -91, -49, -136, -348, -178, -72, -28, 91, 247, 108, 149, -132, 199, 61, 57, -204, -339, 27, -269, 66, -54, 151, -25, 64, 31, 156, -78, 167, 142, 221, 42, -95, 310, -90, -8, 116, -127, -116, -110, 61, -47, -178, -5, -44, 117, 172, 225, 53, -147, 77, 38, -24, -123, -58, -128, -101, 14, 127, 145, -179, -59, -181, 165, -46, -184, -220, -139, -24, 62, 30, 34, -97, -1, 53, -6, 32, 58, -103, -66, -244, -90, -60, 178, -180, -65, -278, -47, 138, 90, 45, -134, 117, 76, -29, 151, -112, 26, 48, 45, -7, -110, 13, -10, -29, -31, 138, 56, -191, -47, -241, 5, -189, -146, 78, 9, -4, 76, 169, -5, -106, 56, -339, 142, -30, -163, 72, 131, -119, 87, 216, 236, -102, 130, 13, 104, -249, -53, 21, 152, -126, -204, 283, 94, 175, -115, -90, -40, 329, 47, -151, 68, 79, 14, -115, -47, -11, 183, 152, 140, -134, -126, 149, 9, 179, 71, -65, -198, -121, 56, 141, 139, 14, 18, 23, -14]
6788a4K1j29l4J92Nl5R3l07K47J14j51K53l33j55L56j49p9k17M4L16j51J13j7
6811a7k35L52j67r6J96J20k78J73l0J02j19rk5q9L39j35M5k27K77j59J19R5k98
6834f6L0J06j4j70r6M49k90j58L15J58k48J00j3J31k93L1k20K71j26j43K39j15
6856a22j9L87p2m42L90q9j32R3k38N28k89K0O0J49l9j38j88J16J59j00O2k37K26
6879H5r0o4k4J80m15K17NK45k34J74j84M16j97j15J61m25K86k20J88O2K4j60L75
6902B90l20J6P3n4q8J12r2J60k27L39m31K48j76L60K66m69k5l1L47k33n1L3N3
6925A00j4k15O3J78l00K94j95J01j0o7p7Q5l9J46p4OK7j01M4l0K0M3J04j05O9
6950E3j31m3k0J08J6P6j4k6R4q5nr9n5J60j36j53L71n2m3K3j07K05l58L59k01
$$ y = [-14, 7, -122, -156, 36, 41, 6, 99, -208, 39, 153, 2, 255, -78, -233, 123, -26, -105, -322, -278, 38, -113, 0, -17, -252, 100, -67, -163, 33, 153, -125, 48, 18, 120, 1, -8, -33, -122, 217, 82, 127, -100, 177, 18, 137, 232, -66, -36, 70, 56, -114, -210, 239, -51, -209, 106, 264, 16, 116, 103, 234, -59, -28, -248, 23, -103, -246, -7, -122, -141, 246, 174, -268, 122, 33, -99, -6, -244, 284, -5, 15, 75, 224, 185, 47, -141, -25, 134, 34, 96, -141, 85, -5, -69, -93, 87, -328, -111, -106, 139, -95, 79, -105, 311, 114, -1, 160, -265, 21, -199, -11, 51, 75, -85, 290, -30, -14, 59, 5, -83, 29, -63, 97, -130, 209, -222, 26, -150, 210, 476, 7, -18, -49, 298, 65, 14, 47, 100, 86, -129, -66, 112, -188, 106, -89, 12, 2, -65, -142, -57, -96, 50, -24, -18, 9, -92, -48, -78, -58, -15, 89, -16, 53, -78, -121, -141, -33, -17, 59, 45, 19, 113, 28, 23, -76, -131, 29, -107, -260, 111, 59, 16, 39, -68, 137, -221, 138, -63]
6975f3K9Q7k73L34M8j87j71M89m55J66K94n79L64r5J95n23N17j02J72k69J67n9
6997H6J36m18L0L57Kj25P6r9o4N4K28R6k88k01P9R4k00m8J16M73l15P8l14Q1J60
7022G4j15L48k24k63L25J24m8m18K47j17q5J63K2k00J48j77K07K69l67r0K96J2
7044A31p6n8K02l20K73L5r6P6k57k28M88l80M9M40l51j03M0Q5O5J0j24N5J23j01
7068b2pM7L8J95k74Qq4m3M4K72j52J89R8k64ln60N36k5j06J83j15N2J03j6k82
7093a88P6NL46m85K49J2O6j22R1l5M9n7P8lK2p3Kk3N6J33m91L02k45M98k68K96
7119B91k03K34o6l91j7K34l49L65r0j04K04j3p6j91j2L37j38j18M2L25qj36k50
7142a30L4K87j03l70M21j31r7K42j56j67q9L20J56k72j23ML50q7r4Rj02P3O3J23
$$ y = [-63, -34, 53, -220, 114, 162, -25, -196, 293, -162, 4, 298, -281, 83, -12, 183, -340, 177, 75, 247, -22, 145, 86, 222, -196, -166, 191, 193, 68, 144, 45, -19, 35, 263, 359, 71, -130, -51, 43, -157, -205, -89, 384, 69, 147, -167, -86, 74, -41, 307, 83, -180, 145, 269, 221, -197, 50, -67, -152, 11, 33, -167, -19, -196, 11, 280, -87, -177, 119, 131, 55, -3, 199, -121, 152, 187, 91, 167, -90, -318, 170, -210, -161, 279, -72, -175, -135, -50, 15, 25, -99, -44, 79, -22, -29, 18, 56, 251, -23, -15, -99, -142, -98, 174, 22, 211, 309, 45, 42, -518, 18, -7, -113, 70, -45, 7, 110, 94, -188, -112, -107, 239, -246, 3, 15, 81, -41, 50, 15, 64, 7, 85, 82, 104, 31, 33, 10, 66, 199, -292, 10, -235, 263, -5, 291, 88, 322, 256, -135, -152, 82, -267, 98, 8, -96, 108, 95, 19, -172, -184, 153, 15, -103, -61, 264, 256, 120, -130, -96, 191, 88, -282, 139, 8, -89, 153, -3, -170, -259, 61, 217, -55, -178, -174, 176, 89, -5, 4, -98, -25, 38, 161]
7166A61j31j61J06K72m09P9K97l51J83j79n2K61j16j35J47m8o7J33K19k77j12
7187a80r8K56n1k18L57k9j47P0J42l72K71lK4O5o4l0L8j57J10n5m0J32M3r1j20
7212a47J18K48j36n6j24J05O6k18K87k75R1J53J22k07k5j7j48o7J34j0K85k03
7234b4j56M46l94K82J5j39P4k56K96j24J39J33l97M1K05m0l51K2K84j43J3J98
7256A24j70L0J36k19O2J65j71K30rj24K3Kj04K86j70j10O8k38kR1J28r7P4P6r2
7281a1R8j7k62J86k6J29k97L85j94r8J76J15k94N2L7o3K3pk6L8p2K1J25q4m3J29
7307B0j61M75j91j65o1J20j09k03M50j10J24j92L5J58j8r7M8l60K51p7j05L52
7329A84k76Q9j97M89n36J60K64j68k8J32n8J8j49R3k45L20k42J04j45J89J44R1
$$ y = [161, 30, -131, -25, 247, -162, -83, 214, -137, 46, -133, -185, 76, -40, -175, -28, -76, -143, -10, 209, -68, -180, -278, -22, -73, -291, 66, 37, -110, -40, 102, -270, 1, -2, 22, 87, 23, -7, 31, -126, -16, -71, -111, 21, 64, -27, -147, -29, 219, 83, 27, -97, 8, 74, -144, 143, -132, -41, 112, 234, 27, 2, -15, -163, -230, -96, -106, 179, -24, -180, 266, -128, 154, 169, 30, 104, -152, 144, 20, 159, 292, -105, -64, 141, 101, -250, -228, 56, -87, -74, 124, -46, -16, 120, -99, -37, 128, -43, 187, 178, 54, 77, 79, -25, 261, 91, -19, 49, -189, -191, -100, 28, -69, 5, 81, -11, 87, 70, -192, -6, -32, 97, -200, 185, -9, -107, 69, 184, -110, -58, -21, -84, -61, -68, -94, -56, -128, -107, 18, -66, -109, 20, -141, 334, 143, -22, -83, 37, -72, -275, 175, 65, 189, -3, 32, 190, 172, 75, 123, -237, 14, -63, -168, 184, -92, -3, -200, 289, -247, -87, 177, 9, -19, 113, 55, 73, -76, 17, -228, 92, -150, -46, -191, -2, 142, 233]
7351B33km38O8L12j83qkn8j70K38j4R8r1j21r7K10l1Q5l7J61k48q4J99mO4k08
7377a28Q7M4j07JJ29j14k40K94P5L03m87Q1J44J4O4p9r4m1J45o1k07K6M14nk20
7402C8j71J54j0J3j21n9J99K91k49m3j41j44M9l7J59J57k66L72k36J06k08J45
7424bP1o9jJ33j08k30J74q4Q4J34k17J61k62N95m89M34o37N12j52p9J8j49L25
7447A62m63L94l2J27j67j97J60j58J22r4L57l55M3N95m89J06J7q3l30N81l10L87
7469C73l52K34l21J00K11j49j9O8l50k69M24P2J76m68N10k83L70o04J01K40l14
7490b50L11p7R2j13R8rl42K42L55l90J18j55K32j38m1p4q9M95k72j06Ln7K01J52
7514A86q2lkJ73k27L3K60l98K44k47n0l6L58k31N0k39K49j18J59j87r2P7L23k43
$$ y = [233, 231, -207, -139, 173, -10, -18, -20, -78, -248, -10, -24, 74, -17, -138, -235, -25, -56, 29, -8, 153, -95, -179, 20, 16, 80, -128, -41, 3, -104, -103, 26, -88, -328, -34, 41, 344, -143, -62, 82, 96, 160, 81, -13, -54, 91, 30, -177, -151, 263, 258, 38, -133, 21, 11, 24, -97, -156, 43, 334, 85, 42, -99, -243, -194, -231, -72, 85, -181, 191, -45, 61, -147, -2, 69, 0, -1, 132, 24, -206, -32, -116, -32, 102, -115, 46, -216, 379, -110, 324, -313, 199, 47, -32, -14, -163, 162, -301, 93, 61, 188, 21, -176, -16, -174, -52, -146, 211, -144, -101, 494, 5, 111, 128, 45, -285, 296, -14, 373, 21, 255, -66, 34, 245, 96, 77, 145, -205, -474, -50, 22, 198, -270, 240, -43, 327, -277, -176, 64, -250, 61, -16, 76, -37, 61, 52, -290, -48, 307, -83, 35, -120, 112, -26, -67, -141, -230, 265, -7, -113, -110, -167, 34, 186, 104, 101, 99, 272, 45, 78, 338, -60, 184, -63, -113, -149, 209, -22, 28, -211, 38, -80, 79, -108, -200, -123, 200, -43]
7538d3L7j15J69n5J24l7q5o7P2K49j76R2k47j28P3L11k64J75p8ql17L29k25K84
7562G0k47J24O7m13N84l97N3M9L25p1J7m2j15P2j47J3MJ36j18K01j68k9K27l41
7586a46Q9n3K93j04Q3k55R2rJ6k55K22J72k8j16l85N24m5l18J99k7k78K59j19
7609a89L36n13L99K19l27N0J22n5J27k84n1oK42j03P0Q4k26K56m74M29J9l33K83
7632G5O4j76r1J11J91q3J47k09R4k69J47k3j49L08KP0l57J87LN5k3J1J27m03L43
7657A52j0j93p3J87l05K11J05j2n3k47J28j0R9k9j41J90J29j59j32J55J78j15
7679E5j74K84r4j7l9r9K50k31M4R4Q0j88N3k70N2L45J32l37j12J37P6L4j11M48
7703D12j15K2k01k83K62j68J56k14K80k52K49k79L30k08r7K46j62m7J9j8p3K78
$$ y = [-43, -6, -121, 48, -7, 117, 80, -5, -72, 0, 249, 73, 165, -82, -210, -137, 174, -90, 85, 7, -1, -318, 11, -214, 70, -177, -53, 14, -399, 185, -212, -159, -110, 215, 144, 161, 119, 4, 76, -71, -58, -54, 82, -36, 165, -3, -32, 195, -146, -57, -110, 183, 79, 162, -93, -1, -10, 6, -249, -27, 145, 117, 1, -384, 140, 95, -223, -24, -51, -329, -70, -189, 147, -366, 33, 252, -75, -25, 97, 42, 169, -115, -166, -172, 70, -33, 37, 121, -105, 151, -323, 106, 125, -208, 75, 139, -37, -128, -17, 174, 91, 238, 29, 123, -146, 1, -22, -171, 137, 139, 209, -148, 39, 42, 97, 74, 85, 212, -191, 152, 142, -51, -124, 63, -242, -31, 74, 62, 9, -238, -110, -120, -21, -50, -191, -1, 128, -31, -163, -8, 170, 55, -119, 165, 71, 54, 15, -84, 166, -65, -21, 73, 153, -35, 18, -252, -200, 145, 277, -60, -172, -35, 41, 75, -36, 412, 297, 319, 118, -165, 97, -71, 85, -129, 151, -101, 148, -131, 199, -9, -106, 140, -22, -69, -50, -68, -141, 137]
7725A37l41K60j10J33K65k74k89J07QJ24j52N6M4k29J69Q8L45j48m9p9l2mk5P7
7749H1m4j79jN2J54P4j81J20J5O4l23K90l13l0N20m35j3J28j01K46J11k08j24
7772i7j2L93k13j16K5j22k2L32j53j08M5K11m0J34l04J11j98M60j43k58k25L47
7794D7j5o5o5m3J29k18K84l30M33k37KJ67o2J44n73M09L12m27K93k87K64j36o7
7817d1l46L61j68j32M01K74o0m36J54P7O0j1l25J62k09K8L78q8p0j56J83m6O9
7840E9l07L56n2k38J1L58k45K61m14L89l69J98n4J89j4j64J41k31k82K29J28O8
7862A7j05J36J7k62J19K71k08k6J17j15p1J28j38j76M24j55J02J12q3j48j69J37
7884g6j43K31J1j27MJ84o01O72k10j87L53mq0j77K11o0J43r3R4j35p0l0K99K6
$$ y = [137, -204, 56, -54, 79, 344, 70, -219, -112, -104, 20, -132, -76, -32, -261, -92, -4, 341, 193, 144, 65, 33, 29, 4, 81, 37, -142, -143, -91, 63, 137, -44, 76, 91, 155, -168, 122, -191, -221, 299, -136, -149, -21, -122, 124, 235, 27, -97, -109, 284, 71, -45, -20, -142, -164, 168, 15, -93, -48, 163, 123, 257, -47, 64, -134, 326, 183, -75, -300, 47, 32, -33, -98, -141, -12, -230, 54, -276, 157, -80, -78, 89, 27, 171, -402, 7, 319, -108, 185, -102, 162, 26, -41, -387, -26, -194, -326, 75, 349, 289, -147, 7, 84, 144, 133, -192, -30, -239, -211, 167, 79, 9, -147, 36, -10, 59, -248, 108, 56, -182, -171, 187, -58, 203, -211, 178, -191, 7, -47, 142, 128, -36, 105, -126, -408, -179, -51, 17, -88, 48, 65, -197, -78, 193, -15, -41, 76, -39, -110, 18, -120, -296, 128, -27, 75, 187, 104, -44, -213, -76, -219, 12, 23, -104, -100, 84, -517, 155, -55, -242, 111, 107, 27, -150, 61, 1, 144, 51, 145, 10, -60, -90, 209, 235]
7908B35l41K39l2n2N7j01o2J28k85J52L7j01J65Pr9K11l10J58k26J84J22j47m8
7931a09J31K05k82p4R9J93m21K61J1o8K7j9R2J34q5n0j22K63k17M5N4k23K34j56
7955g7N6J57r1q8O1J32Or6j83K08l13K8M47p4j37K44k78L5p1j3R6k1O6p7n1O8
7981C4R6j09J32j81M0L1o5L3p0m7J86o7k68J81j08N47l44R7l3l16L61j61p8L35
8005B26m47N8M1L4N6pk36K43m7M2L42o50K88k4l1p4Q4J03n6R2k84J13J7%J23N
8031A1k77J33N8J26J42m65K82k8O8J35k30j60K99j2R5l07rJ39K36k95J34l15L68
8054A28N8l54J44j71o0M33k13j6L24k52K31l58l8M08j39J48p9j76p4O3M6K3j25
8077d9P9M4k6l0m6n3m5kK79k99l82N00P9m3j95N7q1M62k58L95j94j69R6k51K77
$$ y = [235, -106, 133, 101, 49, 106, 5, -57, 71, -214, -62, -25, -126, 39, 46, -53, 158, -152, 6, -220, -36, 86, -61, -109, 22, 227, -55, -129, -30, 163, -258, 3, 14, -54, -27, -46, 46, 180, 95, 45, -77, 186, -31, 14, 68, -155, 79, -77, -21, 136, 45, -43, 18, 150, 156, 60, -123, 85, -228, -200, 247, 173, 36, 280, 2, 37, -34, -47, 49, 28, 94, 17, -34, 34, 130, 21, 153, -28, 12, 43, -22, 11, -59, -106, 80, 13, -255, -74, -182, 365, 21, 118, 85, -231, 130, -31, -109, 226, -221, -163, -122, -88, -32, -39, -275, -32, -79, -37, 305, -345, -57, -81, -112, -186, -102, 1, -55, 37, -247, -134, -117, -117, 6, 11, -266, -133, -75, 51, 193, -272, 10, -18, 50, 185, -45, -205, 94, 82, 177, -130, -139, 0, 236, -59, 75, -240, 128, 186, -168, -24, -195, -255, 178, -35, -51, 273, 21, 252, -106, -144, 264, 125, 273, 194, 18, -56, 7, 53, 76, -49, 30, 74, 48, 18, -28, -81, -126, -128, 151, -148, -530, -30, 49, 6, -189, -132, -213, 249, -9, 386, 192, 23, 119, -132, 145]
8102A45k51j67J36J33j33JL16o8j94L3l77M73J50k04j69J29M0p3L3k45K43R9j53
8125a03Q8j81K06q3r7K03k26K55J9K5J38m33K9L58j42pR2j44Q7K6rk74K4L32m71
8150b88K73K17k15J07k37J40j84j10ON32m21J30J71k30o6K23J3n1J12J7k55Q9
8172b7J92r9o0K30k44l6p4J33J84m85K43j01L12k37k04K19J02j23L43
$$ y = [145, -106, -273, -137, -4, -137, -136, 180, 112, -82, -49, -426, 47, 197, -7, -176, -47, -7, -80, -47, -292, -49, 50, -103, -15, -196, 10, -73, -170, 33, -193, 62, 81, 106, 244, -189, -160, 198, 56, 49, 141, -3, 84, 110, 101, -173, -149, 183, -288, -15, 202, -13, 94, -143, -3, -187, -297, -291, 241, -180, -50, 121, -109, -175, 48, 61, 10, 122, 139, -116, -27, 165, 66, 6, 236, -8, -44, -118, 15, 199, -286, -43, -144, 168, -69, -273, -54, 48, -75, 268]
8191B68
$$ Imaginary data points
##PAGE= N=2
##DATA TABLE= (X++(I..I)), XYDATA
0@%%%%%%%%%nJ3j6J6j6K4l2M0n3O1p2Q8j05J28j52J77k08K43k83L26l75M30m90
32b61N57o31P13q07R08j017J140j271J414j573J746j936K145k369K615k885L179
49A667l504L859m250M686n169N707o313O999p783Q691r756J1023j2563J4481j6949
64i174K0258k4951L2185m4902P3789k61362k7986L76834q4172O2105J1756k18323
76i3943j46174K05999J49982P8388J6362j87885k44435P6006J76710Q4437P4799
87A90246l0229k51903j29638R8781J01602P3944P8441j08784j97611k4707J25943
98g3915J50127J36125k8685j81343r6012K4322L4620J07385J07567r2913j85920
109i8642n6775M3352J03007J38340J929j51126j01883k0469K2423J34258J35318
$$ y = [0, 0, 0, 0, 0, 0, 0, 0, 0, 0, -5, 8, -8, 8, -8, 16, -16, 24, -29, 32, -40, 48, -57, 71, -81, 96, -112, 131, -152, 174, -201, 229, -261, 296, -335, 378, -429, 479, -538, 602, -669, 745, -828, 918, -1018, 1127, -1242, 1373, -1512, 1667, -1837, 2022, -2228, 2458, -2711, 2996, -3317, 3682, -4101, 4590, -5166, 5857, -6706, 7775, -9174, 11084, -13867, 18318, -26584, 47205, -214157, -242143, 134691, 50519, 112624, 124380, -93943, -240117, -34118, 115864, 194252, 210614, 22729, -221706, -145700, 31010, 115447, 190246, 160017, -91886, -221524, -122743, -21141, 52803, 131244, 22460, -175151, -199858, -73915, 76212, 212337, 183652, 2309, -93703, -69381, -34761, 72624, 180191, 87278, -98642, -155417, -112065, -9058, 129282, 131211, -19915, -121798, -142267, -119844, 14414, 149732]
120A49732n4309j24381l6966n243N3939J61734O0853j42746j34895k5920M552
131i3650O6290J21281J3933j16977j01339k0205N7062J17882P6503m6722j05959
142c1901p0651q24Q3691J22023M5589p1288j05468n1173K4416P7274P4782P95
154I7265r4391j12596k9939O6603R9571O3028k0654r1726p3760J1746P2569Q0919
166F8635M5517m2185j05625n6018M0812Q1809O3781K868p8761r8643k6406N1641
178e2575P1066M5925j2800p3865p3827J176Q0670Q8256K0819n1309o9680m0567
190f6711J7985P3191O5905p254o4312o7793l3576L3168Q1878M3081m0792o9711
202c4941m6113j166N9920P8750J9880m2642n5149l9131R801P2035O3648j1599
$$ y = [149732, 95423, -28958, -65924, -71167, -17228, 144506, 205359, 62613, -72282, -98202, -93650, -27360, 93921, 107854, -9123, -110462, -130667, -73605, 44277, 120780, 74058, -31901, -102552, -103376, -19685, 102338, 147927, 76639, -28829, -80002, -55586, 21688, 96470, 97265, 2874, -109722, -139661, -73058, 26513, 89541, 68887, -22839, -96599, -84853, -12284, 68635, 114152, 71967, -33658, -89676, -48864, 32945, 96726, 99594, 20833, -77810, -104216, -52575, 18491, 64416, 51616, -22249, -96076, -94900, -14230, 74026, 94845, 43536, -26144, -66711, -48726, 24465, 90370, 83116, 18804, -48989, -82565, -49397, 32481, 75562, 34770, -34941, -81054, -82220, -22300, 56450, 76330, 33688, -21461, -60592, -50791, 21244, 84892, 73293]
214G3293o1286n6503k1469L6465O7919K8343l1058n4308n0894j2618N3804P3082
226D4770J7823l9623n2720k9883K1425O4817M6966j1352m7575m9401k3617K6320
238c2050O0955L8188k2659o1939m5069O813M5398M4078J1862k8917n1749l0802
250f5891K3554N6873M4710K681m0567n1786j6138L1979M6121K0989j9358m9572
262a6405m0480O625M2357M1029J3632k3052m9528l4672J6542N1616L7813n855
274C9622l6880l3500l872K5568L8800K7619j1604n1088m4382K241L8085L6170
286B6779Q943k3785l9056j9585J9281L7587K8831Q07l1843m3396j2885L1771M2652
299B6101J9349j2005l2214l0027j504L1129L1808K424k7715l5661k0237J1437
$$ y = [73293, 12007, -44496, -65965, -29500, 38419, 66762, 35704, -18604, -69498, -82116, -28312, 44770, 62593, 22970, -29750, -59633, -38208, 26609, 73575, 62223, 14648, -34753, -58370, -32050, 28905, 67093, 44434, -17505, -62574, -55761, -10363, 33715, 45577, 16660, -35089, -65891, -42337, 14536, 59246, 61927, 21360, -30426, -46564, -14585, 31536, 52525, 33167, -16405, -56885, -50260, -7903, 33126, 46758, 23706, -25822, -60494, -43952, 7664, 45477, 39622, 2742, -30758, -34630, -9062, 29738, 57357, 45753, -5335, -49717, -47476, -9391, 26779, 35722, 11937, -27119, -46704, -27423, 10164, 38995, 39802, 7959, -35437, -48322, -16551, 26101, 45450, 33445, 1231, -28796, -30300, 829, 32637, 35061, 7346, -28315, -48552, -37115]
311c7115L7225L5032K732l1172l3259o708K3982L1067J3542j2590k8769k4288
323c0321m98K7489L5191J2254k4855m0335j8526J5102K6578J5985o79j6693k6078
336b5386j1979K3869M0085J6447j7264k8747k0461l331K0061L0169Q219k1346
348A0336k6218j0031R120K3157K0875j833k7604k7952o606J8239K9473J8249p452
361B1753k4130j5888M924J7482J7668N744j5323k8984j8063J1848K9538J8924
373B5493m489j8955j8694o271J1043K0246J1442p797k2241j6892M342K4334K5082
386B6643N350j7169k2469j0090M408J4354J5693P85j9982k0375R87J8044J8755
399A4934J0493n869k3549k1949K056K0786J5623R22p802j1664r523M306K2498
$$ y = [-37115, 110, 35142, 37874, 6702, -26557, -33265, -9283, 21784, 35326, 22736, -6033, -30321, -30819, -3330, 31861, 44115, 19260, -21075, -39601, -24499, 2079, 18064, 17385, 692, -25386, -37365, -13496, 26589, 43036, 25772, -2975, -23436, -26767, -6706, 23463, 31682, 10336, -15882, -25913, -16793, 6364, 27239, 25406, -2198, -30150, -36756, -18517, 10956, 29205, 21753, -2377, -18265, -13341, 4141, 21809, 27553, 12230, -16754, -34817, -22969, 6569, 25493, 21004, 2049, -16645, -22916, -11873, 8373, 19815, 12018, -10223, -27115, -22773, 1561, 26643, 31993, 14824, -7645, -17735, -13327, 1027, 16720, 17505, -2477, -22852, -21865, -3821, 14934, 25427, 19558, -3991, -25940, -23884, -3098, 12525, 13447, 5645, -6019, -15542, -11236, 11262]
412A1262J7495p297k3268j7639m135R727J8813J0448o503j2761r743j472J3191
425a882J9960K969j6759j8699p136P391J9102J4850j330r750j2087q290O724J6073
439A1136N552j0463j6628j3669K002K0538J5283o22m748q993j4872Q95K0607J0589
453A6607q190j0097q285m582J0629J7453O384o303j5011j4955J011J3086N952
466C699K070j004j3569j0927J2419J8137M420j401p390j6804n393J2360R240M280
480A0137J650j1656j4477N364J3598M903M31n053j6573q544Q962J1653Q361M442
494A3198r072j2068R49O859N970P595l317j6960o937O913N988P653Q714p827j6122
509h464l156O402L886N069K471q397r170M92P818J2182O758o797j0829l304k74
$$ y = [11262, 28757, 21460, -1808, -19447, -23582, -13855, 4958, 15406, 8903, -3858, -13601, -15073, -1882, 18078, 21047, 4288, -14411, -21547, -14156, 4946, 19796, 18466, 8716, -3371, -11661, -4937, 11136, 16688, 6225, -10403, -24072, -22070, -1532, 13751, 13129, 8381, -612, -15484, -14589, 6018, 16607, 8417, -1680, -9965, -14547, -3918, 13535, 19919, 13616, -1395, -16350, -15339, -2253, 3699, 5769, 4765, -8804, -19731, -7312, 10825, 15245, 13844, 6454, -10350, -15743, -3383, 5857, 10137, 11787, 131, -14346, -8982, 4616, 9519, 9950, 4897, -11676, -20220, -11258, 395, 8756, 13198, 4126, -7942, -6993, -134, 5836, 13431, 10114, -6846, -13783, -6870, -882, 6771, 15485, 7658, -8464, -11620, -5218, -1332, 3737, 6208, -2189, -11359, -10867, -3049, 9133, 15891, 9094, -1735, -5039, -5313]
524e313J503Q776O412p567j1877j918N915Q724N574m269p914o930l886K919J1534
539A683R287l919r685k966M376N789M754K157o220j2070n755N379Q808M848L22
554F788n151q002l178N821P861J945l869p356l859K155P069Q743L385n071p482
569b01l322J17L773O008j219r214m960J780L019N929N908k644o705l978j752L437
585d024R891K158p818k449K387j150L648Q318k428r357m525l278R51R756L340
600E420o858j820J652m776L245J1869p38j0868j458J664j827O093Q929k433o283
615A811l235l105J887O741m13n981k036k979j828P763P984k011k030j726o801
630e959P19R431J346m765J277j746n476M606Q761j286m431k482o576m449P456
$$ y = [-5313, -3810, 4966, 11378, 3811, -8066, -9984, -4069, 4655, 10229, 5960, -1954, -8884, -12770, -9851, 1683, 10970, 7051, -2634, -5600, -1224, 4565, 9319, 11476, 5256, -6814, -12569, -7190, 1618, 6466, 6788, 1637, -6365, -9543, -3722, 4139, 6084, 2215, -5141, -9000, -6845, 224, 8967, 12352, 7281, -201, -3523, -3406, 367, 6375, 5156, -4058, -9018, -7238, -4219, 1710, 7618, 4974, -1731, -5709, -7461, -4024, 5867, 8025, 207, -2242, 145, -1005, 2643, 10961, 8533, -824, -5349, -8627, -7676, 2080, 5420, -1438, -3258, -1606, -6382, -3137, 8732, 7994, -2874, -4332, -2668, -4495, 1598, 10527, 8094, 1811, -1424, -4529, -2642, 4099, 3686, -2295, -4331, -7310, -9138, -1375, 6609, 4598, 2568, 842, -5959, -5240, 4191, 5537, 772, 2049, 303, -5173, -567, 8194, 6908, 2477, -5, -6581, -11030, -3574]
645c574M561j858J454K12n429J997Q359J535l560j745n414k968M891M440M12K103
661E416j652p660j85P399l38n641O10j519n648J812R195L445q79k5k673k479K812
678A990J532j418j388k756l517J173N162L346P02j745n100k986J851P16L73K415
694C50r44l996K363O497J731R32J30n082n829l48K268K90K086Jm048l96M047K061
712B113J078L25l749m533n53J581L428M673J58m341J08L296j282j315L103k939
728A151q044j292M412K592J164K672j12k547o34Q78J238J188j859l609q84K227
744a459K402K788J776j608l343k434j061J095J699j345k462k9J841J100L416L093
760E469j319l890k013J54R12J740N51j675r19P14J180J521J034r44l282l294j134
$$ y = [-3574, 987, -871, 583, 795, -4634, -2637, 5722, 7257, 3697, 1952, -3462, -6430, -1539, 2901, 3313, 5416, 3764, -3896, -4081, 3318, 2980, -2661, -2051, -3570, -9218, -7406, 1789, 5234, 4355, 4330, 1657, -822, 1990, 3522, 2104, 716, -2040, -5557, -4384, 778, 4124, 4826, 3081, -2019, -5005, -3154, -2438, -2065, 350, -594, -4590, -2227, 4270, 6001, 6933, 7063, 1981, -3848, -4196, -1928, -1638, 448, 449, -3599, -3995, 52, 2113, 3191, 3516, -233, -4766, -5319, -3738, -310, 4363, 4521, 180, 288, 3584, 2302, 987, 4090, 1151, -6893, -8185, -3773, -1181, -17, 2655, 2543, -4, -638, 240, 1478, 2666, 807, -2802, -3686, -1459, 943, 3731, 5507, 3899, 556, -1878, -2939, -1844, -145, -1490, -3952, -3981, -2140, -1040, 2376, 5469, 4150, 260, -1753, -1599, -687, 1053, 1604, -71, -990, -276, 904, 2425, 3459, 2515, -767, -4061, -5195]
777e195J831L211Q67k21O25J93j295J590K818j116m057k011P61K8J202L339R37
794C507k271k395o82J164O40k88j599r56j2Q12K273L419K101k319k550r80rK34
812H9k64M5j090j255K24J197L325O44k131k193j257p63N98L064Q15m83K66J029
830A860L26Q09J637j663m127j641q22N47Q16K058J048l99r98K61J705l38j378
847b99o58p07q64M48L236K416j9j077o46o43m60q96j066n47r61j536P18L784K137
866B360l31k66k16j278j179j09P88L10q25p36J491K685O54l12j91k347k789j022
884c313P62N1O46Q14J16L39K071J360j19o16j484j445j540J81J674J952l65r94
902I0J085P39j326m37O97j968k319l11J193J359K113N42J09N87j61j461L34P40
$$ y = [-5195, -3364, -153, 714, 493, 1118, 1311, 16, 1606, 4424, 3308, -749, -2760, -1999, -1971, -769, 2570, 3507, 1236, -1159, -1841, -677, -37, -325, -1924, -2880, -2892, -2080, 193, 3612, 5713, 3394, 844, -136, -145, 89, -175, -130, -1220, -2475, -2251, -1054, 2271, 2915, 784, -1409, -2666, -3429, -2831, 233, 1048, 565, 831, 1860, 2186, 2995, 4632, 2969, -1158, -2799, -3621, -3074, -2258, -200, 848, 449, -549, -288, 1417, 1079, -299, -957, -1664, -2528, -2080, 1156, 3572, 3553, 2476, 1830, 1187, 727, -169, -1235, -1782, -2743, -4279, -3561, 223, 2360, 2029, 1763, 1547, 269, -910, -1019, -231, 79, -746, -1482, 9, 2694, 3348, 3036, 2845, 498, -2291, -3313, -2551, -2500, -1854, -1040, -924, -585, 1486, 2846, 2727, 2111, 627, -818, -2358, -2177, -503, 1449, 1084, 90, 1175, 1914, 588, 151, 848, -1120, -3439, -3750, -2557, -1198, 915, 1457, 1566, 2153, 1992, 531, 865, 1605]
920A605j624k162J68J339P21O99P16K52j123k237l82J424j56j698P17J824m14
937c31M02K501Q37j508j143j366m59P70l0n84P82L20q51M46J589m47p65m43j792
956b072l30J737P54k69J350R23j204l11J416k56j536p58j186o21Q70R33R44J053
974A437m82j230j54L81l95l32l85n02J047R21j17J764J941k333k733J580l23k641
992b556L74K093q68k22J361P64M26J038j793j408M27m18j705J468K194j015J06
1009B66J468k31m49M48q97j828p01j45m52J340J964m53O32N92k25k06O9j435j228
1028a471l38m40J046K042N55k61L97k46j582N81K15k337m27J612j116l89L613
1045A454J378j834R0J198k581j113Q84j72q32R19j15o2J913P89r76J86ok105j797
$$ y = [1605, -19, -2181, -2013, -674, 47, 746, 1462, 1714, 591, -1646, -2028, -604, -760, -2458, -1741, 83, -331, 71, 2572, 3409, 1901, 758, -608, -1067, -297, -327, -911, -129, 191, -660, -214, 1375, 928, 163, -280, -2072, -2402, -665, 89, -180, 1170, 2093, 889, 578, 1994, 1738, 202, -556, -1742, -2363, -1493, -560, 384, 1437, 955, -275, -429, -48, -443, -775, -1160, -1662, -615, 306, 189, 1953, 3894, 1561, -1172, 408, 85, -2556, -2182, -89, -957, -1179, 182, 946, 1372, 2410, 617, -791, -364, -782, -2487, -1019, 1175, 160, 266, 1734, 1503, 1054, 1502, 605, -1223, -1924, -2069, -2521, -1181, 783, 330, 962, 1554, 1329, 1123, 1192, -243, -1471, -1809, -2249, -1203, 839, 1394, 1133, 1530, 1284, -298, 283, 498, -1839, -2266, -654, -1770, -2159, 1454, 2832, 998, 1088, 2286, -295, -1408, -524, -696, -1528, -609, -724, -786, 1127, 1916, 940, 1126, 1120, -985, -2782]
1064b782J295P84r54J112J790l1l24N41N90p95j674r29n54N62O87J67P73O51O05
1083A514q22m41M86q1j811j043J375O51L8P66J159q90l49R90j119j498O00j99
1101f74j911P73K417k99l77J593K12j579k43M27j021j05L44m91K75J767J19k84
1119I43Q07k29k311j040Q81Q8q54J126R63oj32J060K44j03j013j104o03J58L98
1138g27N2P69R67J68r75J85K34k57j610J47lm14J39J599Q85k25L98K19j131p33
1158c13M51q39j043L10J124k77O76J822m72r09m7j53j339n06L36p2O30P87K11
1177C77L45J444j40j770n00J24p65j119O70J705n22m72J210R86n46j28p01p95
1195e97p37J8k95N42J861l01j30J570M10j569o37O50j105j822O82O13J25R47J203
$$ y = [-2782, -1487, -703, -1657, -545, 1245, 1214, 890, 1431, 2021, 1226, -448, -1377, -1931, -1369, -682, -515, 258, 909, 1514, 692, 251, 737, 656, -1155, -2198, -823, -172, -134, 632, 1791, 901, 552, 1542, 423, -1075, -475, -674, -2585, -1812, 605, 306, -71, 1522, 1734, 155, -88, 339, -682, -787, -443, -934, -659, 1108, 1227, 943, 1750, 1521, -790, -1830, -949, -861, -1715, -589, 374, 368, 236, 1296, 1540, 1437, 424, -680, -1283, -1125, -727, -675, 94, 1061, 1229, 254, 439, 673, 416, -1194, -1047, -1050, -1464, -1325, 274, 1159, 934, 1332, 1551, 420, -313, 138, -701, -1744, -1434, -310, -587, 89, 1911, 1439, 530, 483, 330, -1009, -1515, -1179, -1251, -621, 166, 377, 722, 2166, 2026, 256, -244, -120, -885, -2004, -1334, 371, -151, -623, 587, 1573, 1027, 899, 198, -597, -1334, -1316, -1611, -1069, 792, 491, 361, 1931, 2341, 772, 135, 785, -320, -2142, -1460, -847, -722, 225, 1428]
1214A428l25l50L15o92j015J67m84m77L40Q82M30Q34N30j41n82m88q42n38J08
1233i00J97m68N89L62O86N71J43l99l40m25j088J04O84k57k00Q24J064k00O7K93
1253A307n73p03r08l28M29Q8k17N16J314L32r62r4Q62r59j224N99K81m9p3R93
1273F31J45J44l56l83k77M3l34o95L59Q4K33J45Q22J37k5l25k87j31l58j4J1M
1295d27L51O99k16J54J01k38r43l60J88J45n06K23P66O30K66k35J83J67j064p15
1315h31K35N28l80r8P83P42o04k50M57j36r77o92M18M3J42j4P18Q56O0l69k6P1
1337F76k94q01k47j52M51l87M43J034m1N8l80M1n23m53n29K23k6L95N06L23P05
1358A022K11l67l06k31m79q84k71K55O38L61R0M86L71m8n50m99k68m1l11j50J085
$$ y = [1428, 1103, 753, 1068, 376, -639, -472, -956, -1433, -1093, -211, 219, 1053, 1583, 1442, 860, 372, -470, -1008, -900, -703, -1171, -582, -220, 466, 1037, 1180, 781, 441, 16, -1072, -968, -284, -541, -741, 83, 1147, 947, 1014, 1307, 734, 31, -877, -1205, -776, -688, -905, -389, 925, 1257, 295, 201, 1063, 104, -1120, -521, -240, -289, -362, 631, 776, 920, 564, 181, -96, -53, -387, -1082, -723, -639, -406, -261, 561, 698, 673, 348, 61, -70, -428, -442, -431, -427, -76, 623, 407, 561, 662, 424, -519, -879, -691, -546, -1052, -829, -63, 567, 833, 598, 781, 948, -116, -831, -596, -68, -448, -546, 237, 979, 375, 125, 582, 446, -531, -1223, -805, -762, -620, -634, 84, 940, 1000, 631, 605, 676, 382, -419, -666, -818, -367, -754, -311, 723, 682, 740, 360, 401, -122, -575, -1104, -881, -907, -512, -6, 317, 1022, 1233, 866, 560, 329, -150, -1034, -1305, -1050, -412, -51, 39, 525, 896, 848, 298, -201, -469, -510, -821, -971, 114]
1379A14K52j15L76L32J2n73m96j26l19l49j81O22N24O5L97L99p5p00k29m29L24
1400a75o09l73P92L97L5M59O24k33p47j33l98j51l61j00L52N00O28J50J5J24k68
1421E28n76j11n34mJ97L63J97J99M77J63J06n76l10j66o83m15K88M86Q2M39O25
1442G75K70r05N45j02p96l96l34K86L59P48k76O60k2m23k63J16p02m48o3L19K36
1463d16K69L66N32K05k38l72k62k70n12K07j13m9O18O54j01j1Q6m04l04n7o91
1484h63K04P4K95n3R90J13Q3j71J32o26r54K68k48K33L44J99O07l97N22m1k20
1505D91k49q06k28J73J18j11N46O68J16k75k8L18o35o86J26m5p2j08M57N27N54
1526H51l05j01n4j28o52m04K44L06j98M02N22L16o07K68L1l03o17l07R0J63J76
$$ y = [114, 366, 251, 627, 959, 971, 398, -98, -224, -543, -892, -1073, -451, 73, 138, 535, 934, 859, 159, -70, -499, -175, -784, -1157, -365, 32, 67, 526, 1150, 917, 170, 37, -361, -512, -873, -973, -621, -121, 507, 657, 672, 796, 528, -48, -159, -693, -697, -500, -137, 60, 259, 736, 899, 1005, 429, 119, -47, -730, -1145, -857, -371, -289, 150, 775, 1045, 140, 685, 583, -213, -609, -943, -657, -298, 450, 174, 834, 812, 389, 126, 242, -460, -908, -971, -652, -416, -147, 219, 751, 956, 718, 346, 84, -186, -698, -491, -604, -653, -35, 619, 518, 507, 593, 189, -115, -172, -863, -659, -585, -290, -343, 647, 760, 843, 672, 804, 178, -776, -508, -756, -523, -179, 20, 627, 230, 752, 711, 491, 242, -564, -792, -619, -501, -612, -66, 602, 718, 443, 415, 733, 98, -588, -462, -507, -579, -687, -230, 297, 851, 546, 445, 391, 263, -389, -793, -549, -243, -441, -39, 483, 799, 192, 460, 491, 188, -429, -736, -646, -483, -307]
1547c07K14M60J61K67k16m42R9n71k33p7M7L37M33j09L38M14K64j132j94J02j40
1568b85n49K79M78N73l89M02J45r8l94k59j9j94j14j61L37Q06j08l44O92m5j107
1589c54l23K67r2J7k47L57L36P39k82l27O89n88n01k38P3Q9k32L28L26L17K28
1610E82k32r4j0j15o74l6j67k7N47O52k07P3O00k89m20j18j33o50K39L98l8k1
1632a40N13N34m18Q4k95m31n09J64j41J0P04j0K3P76p7l35m68J23k89n24n3L46
1654d13L52M7q7Q61J09m65j44l94m45k05K92j01M76R7J32N17q0k46k42j16k98
1675c53m33L49L1Q2M12Q1J92M44l65k67m01M3l16r8J9L37N55j27K69J76k06k04
1697B20m07k28k94J74l8P7L51K51L91J09l97K58m13l90k93L73J06K23k87J89L55
$$ y = [-307, -93, 367, 528, 795, 579, 137, 236, -335, -568, -645, -598, -261, 172, 63, 401, 815, 1079, -53, -247, -145, -285, -834, -555, -77, 496, 107, 509, 654, 556, 162, -97, -116, -310, -424, -585, -248, 558, 450, 106, 798, 753, -354, -677, -410, -502, -485, -732, -375, -39, 700, 418, 91, 780, 192, -309, -547, -474, -385, -617, -289, 37, 354, 582, 350, 256, 246, 131, -543, -579, -746, -773, -226, 426, 219, 292, 892, 603, 183, 65, -68, -718, -479, -81, -119, -140, 373, 907, 489, 573, 278, -153, -662, -498, -639, -629, 75, 65, 88, 864, 787, 452, -16, 107, -182, -706, -759, -413, -61, -14, -101, 760, 869, 404, 260, -134, -579, -784, -492, -593, -117, -20, 112, 629, 549, 303, 61, -55, -353, -786, -437, -406, -324, 88, 169, 361, 805, 440, 173, -228, -185, -501, -599, -580, -243, 312, 185, 454, 630, 424, 220, -187, -415, -709, -535, -573, -496, -145, 106, 497, 606, 209, 467, 54, -336, -629, -256, -150, 73, -214, -25, 330]
1718C30L58l63k08J42m46k36k7r4K39M0M59K98j07k34J99p71j77L89k78J30K53
1739a04K71J19r2r8N02l61j02j38k37l88J93L69L56J9k52L76q7j94m94N0q0J71
1761b01n6K90M36K18n45J01J60m37l64j40J75L9J7n8L68L41j5j41J02r5l20n00
1783f25N38l63rM10L10R9n9j90N25k46p08j25K2q4N7L69M47K15M6k40P5l08l45
1806a89j81j89Q2L81j53J81L06M93l48l37k99k48K37l14L71j84O68j83J65J54
1826D13M35l52m06k08m08K04k86L95K45N6N5L11Mj74n64K13k2m16r2K95O62j26
1848B34nL46J68n05l30J74k97J13n16K12M14M25j84Q7N1O2j82l57j56j21p8r1
1870e36N64L9J74K59J25k83k07k41j91J1l52N29kK05r5O51m25n9l26L2P1j71j49
$$ y = [330, 688, 325, 117, 259, -187, -423, -450, -544, -305, -265, 194, 492, 385, 151, 350, -421, -598, -209, -487, -357, -104, 167, 286, 194, 96, 598, 237, 135, -3, -240, -628, -435, -66, 290, 309, 57, 433, 346, 152, -342, -292, -372, -201, -257, 33, 469, 687, 142, 243, 403, -34, -398, -538, -363, -324, -307, -365, 3, 344, 329, 188, 290, 195, -125, -625, -87, -450, -459, -49, 261, 360, 301, 111, 636, 390, -318, -443, -421, -505, -448, -79, 368, 583, 629, 389, 464, 156, -189, -370, -559, -477, -96, -249, -68, 238, 731, 383, 46, -253, -501, -264, -578, -207, -391, 277, 94, 259, 413, 848, 496, 90, -118, -526, -322, -608, -213, 32, 88, 143, 454, 458, 284, -280, -67, -89, -505, -597, -302, 360, 234, 229, 575, 743, 238, -92, 82, -215, -102, -618, -406, 8, 433, 249, 336, 387, 449, 267, -90, -246, -367, -445, -536, 28, 67, 241, 500, 625, 342, 135, -106, -297, -286, -638, -109, -111, 94, -1, 650, 225, 166, -160, -128, -57, -228, -377]
1893c77L04j1L5O62m1k29m42J65rm41k85N40J14m27M71K21K03k58J27k65k52j31
1915c26j46N6J25M83O3j44L55o8m46K63k88j68m57N16J69k22K94J24L41l06J8
1936B36j85l9l81J7J52L02l15L15L50J11l86O2j57j50n57M07Km9K11K45J49J3
1958C53l62J78j4m72j98M89N2j50N2K19K78Rl68R1j66k19k74J3L66M0j55J1O26
1981C99J77l67k32L15n02j19j94M58k83K15R9M73%j54o1j72k42l06k09O04j8J30
2003A1J55P6J34R4p4l02j09l09R1k1J81J74mL0l4M30l17k55j7k5j75k21J30K61
2027i6K99n8J40J90l14j32j0m47M21O7k43N1M65q8k43L21J82l86m26K08o2l57
2049e18M26oL41q2j69J23j19R7l83p7K11j78K46J80J98J31l17k5o4J9n0l96J95
$$ y = [-377, -73, -84, -49, 613, 572, 343, -99, 66, 57, -384, -669, -129, -15, -442, 29, 250, 453, 195, 322, 57, -195, -326, -472, -416, -291, 192, 255, 111, 466, 398, -48, 215, -73, -241, -698, -182, -13, -235, 59, 183, 524, 218, 236, 51, 12, -369, -352, -200, 102, -213, 102, 452, 563, 177, 239, 82, -68, -625, -218, -216, -265, -54, 191, 340, 353, -9, 169, 155, -317, -515, -26, 26, -124, -72, 147, 425, 434, 66, 157, -9, -228, -502, -489, -123, -83, -238, -227, 399, 576, 209, -23, 292, -210, -329, -523, -65, -348, -133, -34, 439, 439, 285, 224, 52, -190, -496, -705, -101, -119, 11, 166, 242, 376, 470, 396, 94, -15, -324, -233, -254, -73, 101, 97, 127, 93, 523, 206, -49, -66, -91, -266, -487, -357, -96, 203, 145, 285, 475, 161, 29, 19, -428, -7, 60, -183, -132, 333, 245, 2, 323, 505, 119, -307, -99, -161, -518, -92, -98, 243, 161, -8, 115, -4, 93, -290, -367, -156, -334, -88, 92, 290, 421, 104, 79, 15, 34, -16, -412, -217]
2072b17j09N34l1ml0K62k13q8k3k80l4r0M28m11N05l6o8k7M2J09m52K47k27J57
2096e6j92J3J64j65N37o2L66o58J78l6l01k60Q7O72k63r5J44J23K92l52q3j87
2118a34j34j59P2J78K58n2J75K20m33J87p9j36l42j59K72K49J85O9j1n0K44n52
2140a32J47k65K24l38K48K31M1N5K8l1j8j35j42l9k03P0k3K09l1M08k25P0R9l22
2164g4L09l53k59R3J09J36j4J68L05m3r5n49J73P0l97r5O41j44N3%M38l34j75
2187c7K95k33j26j09j70l4L87l9J07L76l05j45J4J96r4l67K23k17L36k73L62Q3
2209B30J22j04l35R2l35MK88M0j40J56K94m94L59M4O8m19R3o0k00K08K1qR0J08
2233A22k11K45J88j89K6l83J8j71M71k60M29k1n1N2l22kj90o5K55j78O0K7K07
$$ y = [-217, -326, 208, 177, 173, 143, 405, 192, 104, 81, -199, -233, -323, 105, -306, 199, 163, 95, 68, 110, 219, -233, 14, -213, -56, -248, -235, -71, -236, 301, 239, 605, -53, 125, 89, -212, -472, -385, 287, 24, -71, 73, 196, 488, 136, 53, -134, -268, -427, -355, -177, 81, 29, 204, 424, -9, 178, 99, -37, -379, -538, -266, -17, 168, 237, 226, 176, 420, -132, 15, -250, -26, -364, -116, 115, 156, 211, 239, 208, 190, 55, -87, -126, -329, -259, -282, -73, -104, 304, 79, 149, 248, -74, 235, -118, -377, -284, -175, -39, -53, 115, 420, 377, 282, -267, -94, -24, -421, -516, 125, -19, 34, 34, 472, 138, -37, 258, 25, -101, -210, -380, -414, -27, -66, 41, 417, 112, -33, -19, 177, 83, -284, -61, -278, 58, -215, 147, 230, 352, 248, -87, 5, -330, -326, -38, 2, -138, 18, 312, -182, 177, 221, 289, -130, -37, -97, -297, -89, -68, -76, 14, 122, -89, 156, 344, 155, 181, -202, -184, -355, 116, -144, 285, 264, 213, 265, -57, -59, -249, -314, -59, -237, -177, -150, 57]
2256E7m7J42j32M27r1o25j6J28n6k41M10J01K45k80N1j05J5Qj53k23K62K65k47
2279a05K49j21O3L65m95q5j67l8J69j9J32RK54k39M03k78m2M2l42o0r0J03J77
2302a15K07o7J76J94j54l63J96k86k7J32R1k71K54K65j46k22M27j85k13j95L52
2323E0l74j43M53j8J32J37k14J69k4k85j2O5Q4l05J17M32j61m7J41n0k68J46k06
2346a81K6J61L6M2n7J34j17P8m5j39L8J16l87K53j23j30J72L22J25J80n19k04
2368b19J87J37j22k84K46k5j46K63j56K87k37k21M87m8l50p1J69j4J59l5J04j20
2390iK22j93L4j71M3Oj68K18j08K44L96k02k25R2k8q4l15K61j68L36k63K50o8
2413A00p6L42n22M61n36J03J56k28L02l09J96J8KO8l9R4l70J0J37M0K2j33K21
$$ y = [57, 10, 152, 20, 447, 356, -269, -285, -157, -213, -454, -44, 57, 302, 22, 73, -32, -17, -9, -162, -385, -123, 142, -105, 144, 23, 86, 451, -44, -129, -296, -334, -165, -184, -52, -43, 211, -28, 375, 97, 55, 97, -245, -305, -395, -292, -115, 92, 25, 201, 395, 241, -122, 74, -212, -239, -107, -16, -287, -33, 232, 86, -136, 291, 106, -107, -302, 50, -324, -467, -14, -32, 100, 237, 23, 192, 168, -117, -129, -64, 20, -285, -168, 264, 103, 56, 197, 147, -121, 25, -181, -155, 6, 42, 84, 27, 161, 44, 122, 77, -62, -24, 92, -295, -42, -165, -295, -123, 199, 324, 504, -15, -219, -32, 105, -17, -301, -55, -80, -226, 37, -119, 168, -69, -290, 197, 149, -201, -272, -103, -117, 42, 7, 111, -9, 213, 20, 54, -117, -74, -68, -236, -18, -126, 118, 514, 312, 87, 179, 151, 67, -248, 13, -155, 181, -82, 168, 100, 24, 366, -156, 305, -231, -128, 28, -200, 102, -207, -11, 7, 9, 77, 38, 132, -238, -228, -91, -51, -29, -162, 59]
2436E9J71r1N2l17J73K32k75j75j9K22j38N5K52J73l89J04k52P5k0J87k59J91
2458A1j00K23L15m24j0r8K44l99K00k15j02L23K12j47L9o4K76j33k2k14J5J43
2480G3k45J02r1L77k91K42J01n5j27j62j32J90k36J36J91Ok80M43n6k18k55O3
2502b24J1P1m5K02o8K68p5J17k39J20j78p9p5J15No9J73J06Mj59J81q2j09j12
2526a41j02p2J36j17N74j19j8J8j66L72j29m26K4m3J16L0K0L49l89J99o4Qq5l03
2550c28J44Q2j67N5M04n9M3l37L75l46N7N0q9r1J61K00k39M36nk22p2J88k75l6
2574g1q1K3M9M0R6l35L66J05nj03j76J05m3k53K39j83L64Q6k00J79Ml07K35m61
2598c27L11o2k00K81l61M59J45k94M9l3J79k97p3j07K14l24M42L48k42J27j63
$$ y = [59, 230, 139, 191, -126, 47, 279, 4, -171, -190, 32, -106, -51, 201, 374, -15, 89, -163, -88, -108, 79, -180, 11, -89, 134, 449, 25, 15, -83, 161, -238, -38, -253, -355, -32, 180, 33, 72, 8, 284, 151, 129, -85, -70, 73, -172, -70, -161, 216, -75, 167, 268, 213, 86, -76, -208, -18, -254, -118, 73, 79, -201, 242, 186, -32, -287, -224, -213, -142, -187, 15, -53, 215, 140, 257, 18, 138, -40, -119, -194, -79, -74, -143, 30, 136, 140, -19, 162, 80, -29, -141, -243, -315, -179, -296, 278, 159, 141, 159, -7, 365, 236, -190, -166, -209, -93, -63, -43, 306, -83, 116, 52, 60, -25, -328, -184, -102, -269, -214, 190, 131, 174, -163, 212, -134, -77, -27, -116, -207, -46, 154, -85, 351, 346, 124, 52, 240, -35, -71, -152, -129, -80, -40, 56, -279, 87, 192, 187, 84, -92, 13, -30, -283, -44, -227, 137, 223, 23, 202, 206, -101, 134, -327, -16, -78, -278, 3, -358, 101, 246, -48, 1, -32, 147, -150, -223, -330, -116, -440, 2, 350, 108, 235, 72]
2619G2k41L63m88L01j28Q3j3P9K51k22k7r5j14K12j71r1O1K34o9l34L61N7j80
2642i9L39l05M2K7k58K88R5j83O8P1j05o7J62r0k0J82k71J93k66K64m11L77Q4
2665A17m8rk63J64n4J18M1p2k30J43L62k13NM6J45n7n28K20k16P2K43J19l08K92
2689H9J17J7j60o6P5ok5m5K48j48Q6l79K87P1j13o7j65J11j16jP4L50Pk67K4J07
2715A05NP4l79J31K1k48L32P6j97j4K9j28k7K21p1rq9K95J12k84j13L70j1M4k73
2740b8j09L56m54jl3M41j60N8L9j9M2k14K7j59J55M0R7O1k05r2L24l86M30k77
2764f7N6j33J56l12L14nj57L18m2L7J58j26l07K11J37l20k28K70q6L56j23n7k83
2787b33J64m5J04o1K63m91L50P4k10K20J51K96p16l06J65l1l1M69l11M78k92M1
$$ y = [72, -169, 194, -294, 7, -121, -38, -51, 28, 279, 57, 30, -65, -179, 33, -138, -229, -168, 66, -3, -337, 24, 81, -99, 240, -65, -23, 4, -254, 34, 129, -54, 14, 85, -20, -87, 75, -15, -35, 147, -124, 69, -197, 67, -344, 33, 117, 69, 60, -203, -39, -93, 25, 66, -6, -236, -93, 269, 56, 61, 107, 252, 195, -333, -113, -329, -257, -14, 105, -203, 89, 206, 223, 63, -3, 72, 66, 41, -4, 244, 96, 182, -197, 90, 161, 48, -19, -184, -73, -189, -190, -116, 234, 241, -26, -2, 105, 110, 184, -195, -64, -43, -291, 41, 117, -80, -94, -65, -193, -220, 1, -70, -79, -168, 127, 239, -45, -158, 212, 201, 245, -28, -137, 219, -235, -236, -269, 172, 12, 70, 109, 90, 132, -82, -55, -214, -59, -19, 78, 139, -66, -158, 166, -220, 210, -67, -11, -144, 12, -300, 14, 9, -148, 170, 128, 165, 323, 197, -110, 101, 238, -82, -310, -40, -126, 230, 107, 50, -233, -69, -114, -10, -71, 192, -299, 51, 125, -85, 135, 286, 582, -134, -440, -275, -306, -337, 132, -179, 299, 7, 48]
2809D8J10J09k48K7k10n5l9K17j27L99l62J42K93l59J20j64L27k67k08L70j5j17
2831iJ78l58L94m56J59n0J04n9K15p7j30J44j7m6R6J41l07K75j95O7p2j38K32
2854I1r2Q3J96j68l8j32K14o8l55J02q4K95J93k90K21k35M8J21m6k08K45Q8k64
2877h3J73r2J40j57j29J20P5k26Q9J56j9j66K80j71K9J38m24K48K12j9l12Q5K2
2900c1j60K15R5O8o7Jk82Q8J73l63L28j26Q7J24L4k86J76J10l24J63m8l2N5l5
2924c7J17j27L18m68K16Q1j91L6M7j44J11J26j11k71O31m47K41j0n2l6K5k2j35
2947a02K7L07l4l49L43n0oJ41j06j02J41k94j67J84k61N43k07n4k24L29k8k94
2969b63K87j58L2j75J81P9Q0J59l32Q9l40L01K23l08R8j8K12j23J49j19J57k78
$$ y = [48, 158, 267, 19, 46, -164, -219, -258, -41, -168, 231, -131, 11, 304, -55, 65, -99, 228, -39, -247, 123, 108, -9, 169, -189, 205, -251, -92, -142, -38, -97, 118, 41, -89, 55, 38, -8, 88, 229, -78, 197, 2, 69, -3, -141, 91, -1, 82, 278, 110, 72, -60, 154, 86, -269, -167, -251, 44, 237, -53, 168, -67, -19, 102, 56, -152, 93, 181, -83, 90, -2, 138, -19, -148, -28, 47, -179, -90, 66, 47, -119, 161, -10, 19, 157, -267, -19, 193, 174, -138, -53, -31, -191, 24, 119, 187, 120, 121, -161, -73, 100, -263, 65, -61, 26, 150, 184, -102, 74, 184, -140, 23, -25, -57, -2, -37, 80, -47, 271, -197, 19, 100, -91, -55, -8, -152, -41, 85, -26, -297, 334, -113, 128, 118, 66, 30, 55, 33, -102, -75, 232, 198, -151, 192, 142, 136, 277, 171, 69, 210, -84, -251, -67, -328, 215, 8, -46, -270, 59, 31, -263, 24, -134, -102, -277, -96, -17, 63, 222, -110, -21, -361, -60, 163, -145, -47, -65, 147, 24, 173, 54, 211, -67]
2991f7N0K25j29P3k23K5j90L51k03m5J29k50J63l77N67k29M92k41l51K94r0Q9
3013F3l6j74L55k82j44L16m4Q5l19K21p8L3J42j63o4J31L1j29L5q0j5K26m5j04
3037c9R9j3m0p9K67k91K15k64m4K68r8J82l02L49k96O8n5J48P9k40K77k6J39l64
3061f0l0q6L43j27p2Q0L9j14K34j58k14K71l08K57k37M87n32J04l5K76J09p4r7
3084E6l2j55J73l83M61j33J09N5k04J61m27L39k13L32j78j51L72n22K22j13K32
3105AQ2L2LnP2k02L5mj03qQ9L7K33j71k9J12o2l4J45l7l94K01J77q3L9k29L0N8
3133a5j68K81k10O2J7J60o3Q1l8n9O4j63J80j37q3k57M23j54J1o8M9J94N1j68
3157a0K09m54L09oj6j41J7J80j88N1R5J09j14l07L24j72o3K2J08n5J1L75j54j52
$$ y = [-67, -17, 208, 79, 152, -71, -46, -236, 115, -88, -133, -4, -254, -91, -468, 99, -130, 362, 121, -230, 64, -26, 63, 27, -147, 208, -74, -218, 98, 54, 139, -180, 41, -37, -4, 138, -25, -89, 42, 73, -56, -21, -101, -116, 110, 65, -39, 60, 47, 7, -72, 195, -96, 119, -145, -189, 79, -19, 163, -139, 210, -86, -18, -73, 75, 154, -86, 191, 165, 304, -60, -90, -176, 167, 40, -32, 48, 87, -27, 207, 49, -165, 106, -202, 55, -182, 305, -227, -123, -158, 118, 227, 153, 56, 24, -131, 42, -341, 120, -13, 96, 151, -53, 108, -319, 20, -193, 139, -39, -190, 182, -340, -118, -231, 1, 83, 115, 118, 113, 185, -17, 18, 14, -89, -97, -8, 29, 262, 91, 62, 174, 112, 78, 223, 186, -208, -7, 170, 87, 126, -103, -73, -15, -183, 98, -112, -50, -33, 127, 64, 145, 107, 48, 112, -51, 129, -8, -91, -348, 75, -79, -68, -136, -87, 107, 158, -10, 199, -255, 54, 48, 32, -109, -92, 88, -100, -49, 46, 155, 41, -266, 58, -114, -177, -155, -47, -102, -91, 284, 130, -22]
3181b2k7K63p4k98J64J03j21j50K52%L0j28k74L98l18J10J67j37J42R1J98m45
3203g6K60k46J12R7m30L58o7M4j99K58k40K46k9M5j46J42m6K7l33K37O6J2K1j76
3227f3mn8Q4k62K24j48K78o6K2j20J54j48L66j12k43K40r8q1J62k76J26lj72M27
3251B29k07K26k88J9J49O4n8k62K48l20N6QJ30Lk65J14J99j69L59l56J21J89l44
3274a55O5KK05l03K91j30O0R0k38K24l22R9O4Q2j13J77j6j6N7l14l0L24J9k65
3298a43K74l35J80K21k94K1J41L17k94R1k71J18j43N3K71q0J11m47J76k57L38
3319D8j13M9J28j1k13J96q8J65q6k86pN65j47k53N14l54k15K1J47L6r1J78j27
3342E6l92L88J42q4O1k67M8L32j86l16L67j93J17l18K60J95l47K46k13J77j0k13
$$ y = [-22, -49, 214, 140, -158, 6, 109, -12, -162, 90, 90, 120, -8, -282, 116, -202, -92, 75, -62, 80, 171, 369, -76, 184, -62, 50, 147, -283, 75, 8, 52, -147, 111, -129, 117, 88, 133, -13, 129, 83, 110, -223, 14, 80, 92, 113, -63, -67, -125, -41, -303, -79, -227, 51, -15, 7, -113, 41, -107, 259, 147, -96, 144, 46, -35, 127, -149, -23, -26, -198, 229, 22, 248, -40, -21, 128, 192, 134, -128, 120, -200, -144, -136, -6, -3, -268, -154, 45, -124, 235, -121, 0, 189, -155, -90, -88, 117, -186, 105, -25, 35, 125, -113, 111, -211, -112, -48, 34, -79, 98, 82, 66, 123, -191, -221, 103, 122, -143, 131, -204, -24, 197, -97, -76, 65, 382, 88, 179, -92, 26, -117, -64, 207, 127, 238, -209, -33, -290, 48, -65, -16, 112, 101, -112, 84, -4, 161, 75, -211, -218, 347, 200, -53, 461, 107, -108, -87, 60, 96, 5, 183, 56, -336, 52, 194, 110, 171, -96, -48, 284, 98, -218, 149, -44, 73, -245, 15, 210, -137, 109, -104, 73, 63, -150]
3364a50L92m66P9j37M13j13J12k68J35R7j00j53j78K98j45m3O3L24p0J22k32p4
3386i4J4q4M5K23Q7j14K6j70Q0j72J22K68p9q3l5M04m66K30n9n6J43r3k65K95
3410A67L2m51L07j07J10j04n8J74j05o1J06M5l7J66l60r5M36l44K69r4k6Q4L8
3433I2j55J28L9l60P9Q7O4P4j8j58j0K72k17J26j85r8M16n27N75R5k50j57K05
3456A17K8Q2l96RJ10J52j6q6J67l94K72j63J01J13k37j08K84K12Jk07j48R9L8
$$ y = [-150, 242, -224, -145, -282, 131, 18, 130, -138, -3, 94, -6, -159, -337, -39, -184, -227, -164, 160, 90, 212, -20, -94, -80, -164, -119, 104, 191, 77, 103, -67, 13, -159, -37, 231, 152, 69, 34, 438, -28, 202, 143, 87, 230, 137, -128, 167, 199, -252, 55, -52, 58, -46, -104, 70, -35, -96, 10, 55, 18, 184, -176, -271, 165, -179, 90, -4, -30, 54, 92, -63, 65, 104, -256, -177, -90, -26, 48, 30, -128, -138, 134, -83, 43, -142, -240, 176, -351, 224, 319, 69, -88, 117, 145, 227, -169, -160, -50, 102, 86, 0, 167, -227, 45, -118, -17, 96, -141, -249, 35, 247, 248, 41, -107, -8, 30]
$$ [...]
8191B6
##END NTUPLES=NMR FID
##END=
