##TITLE=1H_DE-138M_TFA
 200.13Hz, DMSO-d6+CCl4.
 8 sc
 16.7.2026
##JCAMPDX= 6.0         $$ Bruker NMR JCAMP-DX V2.0
##DATA TYPE= NMR FID
##DATA CLASS= NTUPLES
##ORIGIN= UXNMR, Bruker Analytische Messtechnik GmbH
##OWNER= pz
$$ XWIN-NMR		Version 3.5
$$ Thu Jul 16 13:08:20 2026 Russian Standard Time (UT+4h)  she@DPX200
##.OBSERVE FREQUENCY= 200.1313
##.OBSERVE NUCLEUS= ^1H
##.DELAY= (6, 6)
##.ACQUISITION MODE= SIMULTANEOUS
##.ACQUISITION SCHEME= undefined
##.AVERAGES= 8
##.DIGITISER RES= 18
##SPECTROMETER/DATA SYSTEM= spect
##.PULSE SEQUENCE= zg30
##.SOLVENT NAME= DMSO
##.SHIFT REFERENCE= (INTERNAL, DMSO, 0, 14.3821)
##AUDIT TRAIL= $$ (NUMBER, WHEN, WHO, WHERE, WHAT)
$$ ##TITLE= Audit trail, XWIN-NMR		Version 3.5
$$ ##JCAMPDX= 5.01
$$ ##ORIGIN= Bruker BioSpin GmbH
$$ ##OWNER= she
$$ F:/spectra/data/she/nmr/H-C/1/audita.txt
$$ ##AUDIT TRAIL=  $$ (NUMBER, WHEN, WHO, WHERE, WHAT)
(   1,<2026-07-16 13:07:06.21 +0400>,<she>,<DPX200>,
      <created by zg, POWCHK disabled, PULCHK disabled
       configuration hash MD5:
       00 E9 B6 7A A2 85 ED C7 34 08 36 98 17 FE 4E 26
       data hash MD5: 16K
       C6 A6 45 83 00 42 2F 3A 7E 40 E1 E5 2F FD 5A 10>)
$$ ##END=
$$ 
$$ hash MD5
$$ 31 BF EB 1F F4 5B 15 C6 26 A9 50 70 6D BA 67 70
##$RELAX= 
##$RELAX= 
##$RELAX= 
##$RELAX= 
##$RELAX= 
##$RELAX= 
$$ Bruker specific parameters
$$ --------------------------
##$DU= <F:/spectra>
##$EXPNO= 1
##$NAME= <H-C>
##$PROCNO= 1
##$TYPE= <nmr>
##$USER= <she>
##$AMP= (0..31)
100 100 100 100 100 100 100 100 100 100 100 100 100 100 100 100 100 100 
100 100 100 100 100 100 100 100 100 100 100 100 100 100 
##$AQSEQ= 0
##$AQ_mod= 1
##$AUNM= <au_zg>
##$AUTOPOS= <>
##$BF1= 200.13
##$BF2= 200.13
##$BF3= 200.13
##$BF4= 200.13
##$BF5= 200.13
##$BF6= 200.13
##$BF7= 200.13
##$BF8= 200.13
##$BYTORDA= 1
##$CFDGTYP= 0
##$CFRGTYP= 5
##$CHEMSTR= <none>
##$CNST= (0..31)
1 1 145 1 1 1 1 1 1 1 1 1 1 1 1 1 1 1 1 1 1 1 1 1 1 1 1 1 1 1 1 1 
##$CPDPRG= <>
##$CPDPRG1= <>
##$CPDPRG2= <>
##$CPDPRG3= <>
##$CPDPRG4= <mlev>
##$CPDPRG5= <mlev>
##$CPDPRG6= <mlev>
##$CPDPRG7= <mlev>
##$CPDPRG8= <mlev>
##$CPDPRGB= <>
##$CPDPRGT= <>
##$D= (0..31)
0 0.7 0 0 0 0 0 0 0 0 0 0.03 0 0 0 0 0 0 0 0 0 0 0 0 0 0 0 0 0 0 0 0 
##$DATE= 1784192825
##$DBL= (0..7)
120 120 120 120 120 120 120 120 
##$DBP= (0..7)
150 150 150 150 150 150 150 150 
##$DBP07= 0
##$DBPNAM0= <>
##$DBPNAM1= <>
##$DBPNAM2= <>
##$DBPNAM3= <>
##$DBPNAM4= <>
##$DBPNAM5= <>
##$DBPNAM6= <>
##$DBPNAM7= <>
##$DBPOAL= (0..7)
0.5 0.5 0.5 0.5 0.5 0.5 0.5 0.5 
##$DBPOFFS= (0..7)
0 0 0 0 0 0 0 0 
##$DE= 6
##$DECBNUC= <off>
##$DECIM= 32
##$DECNUC= <off>
##$DECSTAT= 4
##$DIGMOD= 1
##$DIGTYP= 9
##$DL= (0..7)
0 120 120 120 120 120 120 120 
##$DP= (0..7)
150 150 150 150 150 150 150 150 
##$DP07= 0
##$DPNAME0= <>
##$DPNAME1= <>
##$DPNAME2= <>
##$DPNAME3= <>
##$DPNAME4= <>
##$DPNAME5= <>
##$DPNAME6= <>
##$DPNAME7= <>
##$DPOAL= (0..7)
0.5 0.5 0.5 0.5 0.5 0.5 0.5 0.5 
##$DPOFFS= (0..7)
0 0 0 0 0 0 0 0 
##$DQDMODE= 0
##$DR= 18
##$DS= 0
##$DSLIST= <SSSSSSSSSSSSSSS>
$$ [...]
##$SUBNAM0= <"">
##$SUBNAM1= <"">
##$SUBNAM2= <"">
##$SUBNAM3= <"">
##$SUBNAM4= <"">
##$SUBNAM5= <"">
##$SUBNAM6= <"">
##$SUBNAM7= <"">
##$SUBNAM8= <"">
##$SUBNAM9= <"">
##$SW= 18.0517328524113
##$SWIBOX= (0..15)
0 0 2 0 0 0 0 0 0 0 0 0 0 0 0 0 
##$SW_h= 3612.71676300578
##$TD= 16384
##$TD0= 1
##$TE= 0
##$TE2= 300
##$TE3= 300
##$TEG= 300
##$TL= (0..7)
0 120 120 120 120 120 120 120 
##$TP= (0..7)
150 150 150 150 150 150 150 150 
##$TP07= 0
##$TPNAME0= <>
##$TPNAME1= <>
##$TPNAME2= <>
##$TPNAME3= <>
##$TPNAME4= <>
##$TPNAME5= <>
##$TPNAME6= <>
##$TPNAME7= <>
##$TPOAL= (0..7)
0.5 0.5 0.5 0.5 0.5 0.5 0.5 0.5 
##$TPOFFS= (0..7)
0 0 0 0 0 0 0 0 
##$TUNHIN= 0
##$TUNHOUT= 0
##$TUNXOUT= 0
##$USERA1= <user>
##$USERA2= <user>
##$USERA3= <user>
##$USERA4= <user>
##$USERA5= <user>
##$V9= 5
##$VALIST= <valist>
##$VCLIST= <CCCCCCCCCCCCCCC>
##$VD= 0
##$VDLIST= <DDDDDDDDDDDDDDD>
##$VPLIST= <PPPPPPPPPPPPPPP>
##$VTLIST= <TTTTTTTTTTTTTTT>
##$WBST= 1024
##$WBSW= 4
##$XGAIN= (0..3)
0 0 0 0 
##$XL= 0
##$YL= 0
##$YMAX_a= 273971
##$YMIN_a= -232638
##$ZGOPTNS= <>
##$ZL1= 120
##$ZL2= 120
##$ZL3= 120
##$ZL4= 120
##$ABSF1= 10
##$ABSF2= 0
##$ABSG= 5
##$ABSL= 3
##$ALPHA= 0
##$AQORDER= 0
##$ASSFAC= 0
##$ASSFACI= 0
##$ASSFACX= 0
##$ASSWID= 0
##$AUNMP= <proc_1d>
##$AZFE= 0.1
##$AZFW= 0.1
##$BCFW= 1
##$BC_mod= 2
##$BYTORDP= 1
##$COROFFS= 0
##$CY= -3
##$DATMOD= 1
##$DC= 2
##$DFILT= <>
##$DTYPP= 0
##$F1P= 0
##$F2P= 0
##$FCOR= 0.5
##$FTSIZE= 0
##$FT_mod= 4
##$GAMMA= 1
##$GB= 0.15
##$INTBC= 1
##$INTSCL= 1
##$ISEN= 128
##$LB= 0.25
##$LEV0= 0
##$LPBIN= 0
##$MAXI= 10000
##$MC2= 0
##$MEAN= 0
##$ME_mod= 0
##$MI= 1.114404
##$NCOEF= 0
##$NC_proc= 0
##$NLEV= 6
##$NOISF1= 3.799351
##$NOISF2= 2.8
##$NSP= 1
##$NTH_PI= 0
##$NZP= 0
##$OFFSET= 14.38212
##$PC= 1
##$PHC0= -4224.306
##$PHC1= 17.5923
##$PH_mod= 1
##$PKNL= yes
##$PPARMOD= 0
##$PSCAL= 0
##$PSIGN= 0
##$REVERSE= no
##$SF= 200.129724274929
##$SI= 16384
##$SIGF1= 3
##$SIGF2= 2
##$SINO= 400
##$SIOLD= 16384
##$SREGLST= <1H.CDCl3>
##$SSB= 0
##$STSI= 0
##$STSR= 0
##$SW_p= 3205.1282051282
##$SYMM= 0
##$S_DEV= 0
##$TDeff= 0
##$TDoff= 0
##$TI= <>
##$TILT= no
##$TM1= 0
##$TM2= 0
##$TOPLEV= 0
##$USERP1= <user>
##$USERP2= <user>
##$USERP3= <user>
##$USERP4= <user>
##$USERP5= <user>
##$WDW= 1
##$XDIM= 8192
##$YMAX_p= 0
##$YMIN_p= 0
$$ End of Bruker specific parameters
$$ ---------------------------------
##NTUPLES= NMR FID
##VAR_NAME=  TIME,          FID/REAL,        FID/IMAG
##SYMBOL=    X,             R,               I
##VAR_TYPE=  INDEPENDENT,   DEPENDENT,       DEPENDENT
##VAR_FORM=  AFFN,          ASDF,            ASDF
##VAR_DIM=   8192,          8192,            8192
##UNITS=     SECONDS,       ARBITRARY UNITS, ARBITRARY UNITS
##FACTOR=    0.0002768,     1,               1
##FIRST=     0,             0,               0
##LAST=      2.2672688,     0,               0
##MIN=       0,             -232638,         0
##MAX=       2.2672688,     273971,          0
$$ Real data points
##PAGE= N=1
##DATA TABLE= (X++(R..R)), XYDATA
$$ [...]
1838E0k78M3L86P8l39L39l36J77j80r7L63j39j10k8N4K2K93m95j68N78k00l06
1860b93K10k7J0p1m27J80O39l27N17q09J89M49n23m1L31j73N3l6k6L16m4j51K51
1883A97l10M08k66o5P1l3j95K42K36k10O5J18k65J54j24k68K87J35R3l18k1K56
1905A87R6p5j48P8k16K29n05K46J44l6K00k49j17J31j82L09O3l74J38J78k04q1
1927a88K28K01j28l3k3J05m7J01j55j29J06q4K95j28k21j26M86m09k51L60M4p8
1949g4l9MK57j37J20k2J9j47M14l32K66k87k41K63k49K44R9j78J40j27r7J5N2
1972c7L6P6k81nK90K5j00L60l64P0j04q2L05k20j15J05K00j82J17k18K1K50k88
1995a41N5J5N3j1j42O8K06k80K88P8j20J29n10K92J04k7k03K53l68J36J50l7Q3
$$ plain form
1838 50 -228 -185 201 279 -60 279 -57 120 -60 -157 206 67 -43 -71 -17 5 298 -197 -365 213 13 -293
1860 -293 -83 -110 -100 -171 -598 -418 221 -106 411 -398 -209 240 -283 -324 7 -166 -113 -149 -175 141 97 -54 197
1883 197 -113 295 29 -36 35 2 -193 49 285 75 140 258 -7 147 23 -245 42 177 270 -48 -69 187
1905 187 283 208 60 138 -78 151 -354 -108 36 0 200 -49 -166 -35 -217 92 155 -219 -81 97 -107 -188
1927 -188 40 241 113 80 57 162 115 216 61 -68 38 -46 249 121 -100 -226 260 -149 -400 -40 4 -74
1949 -74 -113 -109 148 11 131 109 128 -19 395 63 329 42 -199 64 -185 59 158 -20 120 -7 -104 -89 -37
1972 -37 -1 75 -206 -211 79 104 4 364 0 70 -34 -116 189 -31 -146 -41 159 -23 94 -124 -103 147 -141
1995 -141 -86 -71 -18 -29 -171 -103 103 -177 111 189 69 198 -312 -20 84 57 -146 107 -261 -125 25 -12 71
2018G1j2Qk80K45J55l0jk00N98o13N5k42L71k58P0J20j12K31k42K9J32m8q3K1
2042a5L14l54j96K06J82m07M43j82kK71k74j17J88j31j44L1O7K28k89J16L18k77
2064b4pQ0J7Q6k76PNq7K83o6k73K07Jk40M56l88K25J03j62k48N63k79K96n1m14
2089a86j71J96N9K35k21j17L40kJ47j86l55K28qP8J63j78j69J37q2L31j27l73
2111b61J40p1KJ72k97J62L26k57J11J01j65J20o9j96J78k05N5J44K22l27l5j29
2133b79J87J69q2j33P1o7L93l34oj04J15L30m96m8O04m52Mp8M65k63k26L64k86
2156a52J87K47k36K9l15J49n0K40Q5j88R4j34Q7l32N92k69R0j96J03J66j43q8
2178c4K38m05K97Q3o3n8j44J70oj49j1J60j96R1K25k89R6o3q7K58J43o24N32r3
$$ plain form
2018 71 59 67 -213 32 187 157 156 -44 554 -59 -4 -246 125 -133 -63 57 -55 176 -66 -37 95 47 -36 -15
2042 -15 299 -55 -251 -45 137 -270 173 -9 -11 260 -14 -131 57 -74 -218 -187 -120 108 -181 -65 253 -24
2064 -24 -31 49 66 152 -124 -117 -112 -199 84 18 -255 -48 -47 -287 169 -219 6 109 -53 -301 262 -17 279 228 -186
2089 -186 -357 -161 -102 133 -88 -205 135 133 280 94 -261 -33 -41 37 200 22 -147 -10 -92 239 112 -261
2111 -261 -121 -192 -190 -18 -315 -153 173 -84 27 128 -37 83 14 -182 -4 -209 -154 -10 212 -115 -150 -279
2133 -279 -92 77 -5 -138 -67 -134 259 -75 -81 -185 -70 260 -236 -284 320 -132 -128 -206 259 -4 -230 134 -152
2156 -152 35 282 46 75 -240 -91 -141 99 184 -4 90 -44 43 -289 303 34 124 -72 31 197 54 -34
2178 -34 204 -201 96 179 116 58 -86 84 78 -71 -82 78 -118 -27 198 -91 5 -58 -145 113 256 -368 164 71
2202G1J14K30m74K68l88R2K09k01J8M23k53k81K64Ql93K12K10k54L24k70N0q2
2224a03O9J28k14M19k64j87K49l7k70K21N5j1Q8m41K07O7l4m3Q1L0J76q5M8j10
2248C9j94M5qN6j53J82j66j35K64J49j00J86j77k17R8R8m2N2j11L06j70o7Q4j70
2272a51K16k83L45j72K10J4j75k66L43q5m7l0L17j19k48j2R0K14l17L07M6m95
2294b98M05N4l63K00p0L9M4o3K34k55J13J31O1j95O2r3j46J78M4q5n5J63j30O0
2318C5J2J30J6j71j34K06j20l2J58k85P8j01J90R8j61j2J95l15K76m1j0J72j54
2341C0kK44l51K6r7K39j50K64k08j38K46J7j36j10K74j55N7j5j85K16j52m16O72
2364A70m63K90K08k42K8J84l42j51L99J31R8k77k45L4J01K9o8P4K61l45K15N5
$$ plain form
2202 71 185 415 -59 209 -179 -87 122 -79 -61 362 109 -172 92 100 -293 -81 129 -125 199 -71 -21 -103
2224 -103 -34 94 -120 299 35 -152 97 60 -210 11 66 55 143 -298 -91 -24 -58 -101 -20 10 186 101 149 39
2248 39 -155 -110 -118 -62 -215 -33 -199 -334 -70 79 -21 165 -12 -229 -131 -33 -75 -23 -134 172 2 -65 19 -151
2272 -151 65 -218 127 -45 165 179 4 -262 81 -4 -51 -81 236 117 -131 -143 -53 161 -156 151 197 -298
2294 -298 107 161 -202 -2 -72 -33 11 -52 182 -73 40 171 232 37 99 6 -140 38 82 -3 -58 105 -25 35
2318 35 47 177 193 22 -112 94 -26 -58 100 -185 -107 -208 -18 80 -81 -93 102 -213 63 22 12 184 30
2341 30 28 272 -79 -53 -150 89 -61 203 -5 -143 103 120 -16 -126 148 -7 50 35 -150 66 -86 -502 170
2364 170 -293 -3 205 -37 -9 175 -167 -318 81 212 310 33 -212 -178 -77 -48 -116 -42 219 -126 89 144
2386A44o4o1m6j08J34K03m10K45K47k37J34q3j84N3N3N3R8k38L8R9j12m46M98
2409A0j57k5JK86r3p2N9K15k20j46J08K89j91Qk12P8M0p2J89M4L9q7K22l51L12
2434B74k48p2K1P1j46R4O1J29k55J23l66N50m87M48k45n8J34j52L01j34j95K95
2456A43j15K96m54K23n6j55M4P1r0R5P1k62K85o9j24J90J52j59N5j16r0N69k59
2479B45r8q7j27L1J60j33R1J24m21J92J46p1j70j2j59J71J8M5J30K0J32j85k43
2502b01K22K38k43J01J55k75J41j0J00k80n6L3J05r1K69j57J74l02R8k0o4j89
2524b52J05R9Lj73m8M01j67j18K63k76o7K15Pk00K74j44PKn2J07M7r0L8J46q6
2549D1j45q5K98l41J80J21O0q5J97j37q3N3k20K91j11l3K81l90j26J43R3O8l7
$$ plain form
2386 144 80 19 -27 -135 -1 202 -208 37 284 47 181 98 -86 -33 20 73 171 -67 -29 70 -42 -488 10
2409 10 -147 -172 -171 115 22 -50 9 224 4 -142 -34 255 64 72 -140 -62 -22 -94 95 139 178 91 313 -38 274
2434 274 26 -46 -25 46 -100 -6 55 184 -71 52 -314 236 -251 197 -48 -106 28 -124 177 43 -152 143
2456 143 28 324 -130 93 37 -118 -74 -3 -93 2 73 -189 96 27 -97 93 245 86 141 25 -65 504 245
2479 245 147 60 -67 -36 124 -9 82 206 -215 -23 123 52 -118 -130 -289 -118 -100 -55 75 95 227 42 -201
2502 -201 21 259 16 117 272 -3 138 128 228 -52 -108 -75 30 -61 208 51 225 -77 21 1 -63 -252
2524 -252 -147 -48 -45 -218 -266 135 -32 -150 113 -163 -230 -15 -8 -208 66 -78 -71 -69 -121 -14 33 -57 -19 127 41
2549 41 -104 -189 109 -232 -52 69 129 44 241 104 21 74 -146 145 34 1 282 -108 -234 -91 2 70 33
2572C3L5j79L49l14k5J25nP6m0j77k02K25j06J99P6L6j87p0J20K38l10J19M1o1
2596dQ4L4k60P7J11pK0o3q4J74om4j05j3J51k65K32j93J08N3K86l15j10K25r3
2621gK63m16L67r9j07n6J28Nj01j30N7J24K55O4l13J35k70J43r0R0Q2l1l5j12
2645e4J15k99K57L1k96L33k22k9J49L2K75l22R4l3K86k85qo3k17J46K08R2l42
2668a52k2K29k45K63P4l06K57k0j86L24k99J36J19j95K95k17o6p8R7%P9k61j06
2691b80J35%J83o1N8l30J28K59Q8k72J0k1R1K48l38K35j21Pk62J93J97N4j10m6
2715D5NJ91l87M4K43j90J41l8j00J96l23j18M43J39n11N2M51j49j7l42J52J45
2737G2q1J06j96l9j74L45J16o9k8l3K10l27P2K13j54k04J27J51N2J00j72J83k68
$$ plain form
2572 33 68 -111 238 -76 -101 24 19 95 55 -122 -324 -99 -205 -6 70 106 -81 -151 -31 207 -103 16 57 -4
2596 -4 80 114 -146 -69 42 35 55 -8 -92 82 76 32 -73 -86 65 -200 32 -161 -53 0 286 -29 -139 86 -7
2621 -7 256 -160 207 108 1 -55 73 78 -23 -153 -96 28 283 347 34 169 -101 42 -48 42 124 93 58 -54
2645 -54 61 -238 19 50 -246 87 -135 -164 -15 17 292 -30 64 31 317 32 24 -39 -256 -110 98 190 -152
2668 -152 -174 55 -190 73 147 -159 98 78 -108 216 -83 53 172 -23 272 55 -11 -89 8 8 87 -174 -280
2691 -280 -145 -145 38 -23 35 -295 -167 92 180 -92 -82 -103 -12 236 -102 133 12 19 -243 -50 147 201 91 45
2715 45 50 241 -146 -102 141 -49 92 54 -46 150 -173 -291 152 291 -220 -168 283 134 117 -225 -73 72
2737 72 -9 97 -99 -138 -312 33 149 80 52 19 229 -98 -26 187 33 -171 -44 107 159 259 87 270 2
2760BJ05j58K43j18J20Pl63J89o5o6K95p0k2k86J07L67n42J11L09l96M17l78J94
2783BJ52j42N3K2j91K03r4N3j63K48k49O8J04k23R5N1J31J68r6k41j74K90j20
2806e3K18l88J40N6K23L04m71N5k16K8M8l2J5J26j17J19J17J58l02p4nN4Q5r5
2830grj63M8J54J18P5J8j64K93m85l4P9j34L95j72Mm1K20l23L1K7J64m10L00j5
2855c1r7K76N8Q3j85j8o3k31j38M91n2oK30m12P4j94J73Q1k2j80J20J03k45K66
2879H1j1J98l97J19lO8J80j79K5P6j97j57K16l36J86J55n4j33m73M54n9J88J00
2902D7j63J16Pjrj36J73l60K76k02J32N5K60l80j68L11Q7Q5r3N1k61K14P4j09
2926FJ92m4j01J59k85J7j98M18m15L76l99P4q9K29J96p7j59NJ44r4L5J08l49r
$$ plain form
2760 2 107 -51 192 74 194 201 -162 27 -38 -104 191 121 99 -187 -80 287 -255 -144 165 -231 186 -192 2
2783 2 154 12 65 87 -104 99 5 58 -105 143 -106 -38 66 -157 -62 -11 120 288 192 -49 -223 67 -53
2806 -53 165 -223 -83 -27 196 500 29 84 -132 -104 -56 -88 -73 53 -64 55 172 330 28 -46 -51 3 88 -7
2830 -7 -16 -179 -131 23 141 216 234 70 363 -122 -156 -77 -211 184 12 16 -25 195 -128 -97 -70 94 -316 -16 -31
2855 -31 -128 148 206 289 104 86 23 -208 -346 145 93 87 317 -95 -21 -215 -42 39 17 -163 -43 60 -185 81
2879 81 70 268 -129 -10 -13 55 235 56 81 157 -40 -197 19 -317 -131 24 -30 -163 -636 -182 -241 -53 47
2902 47 -116 0 7 6 -3 -139 34 -326 -50 -252 -120 -65 195 -185 -353 -42 45 130 37 88 -173 41 115 6
2926 6 198 154 53 212 -73 -56 -254 164 -251 125 -274 -200 -289 -60 136 59 -100 -95 49 -45 -10 98 -251 -260
2950b60L23K6j72K41om4j40j0j90K94J08j33J26k2n5L4j16m3J52J5j59j19K43
2973I3k3k03J62M6j0J11j67k3j04Q6j58J85Kj24K59j45J33L7j92J66j60O3Q1j98
2997h3P5j81k5L57p7m0n8RP4Q8q6J53N5j28P2l96K79n5j3p1J28J68pp2l15J3L43
3024B07nl03r0M34j16j97K0k7L25l70Q2J99k36J31J64j31k55jK19o6o8J26k13
3047a71L9J95r6J24j88K47J50j92j9j19N8k9j17J04L23k69J24k37L3j5k38M31
3069A38k30K69k46j5n2K21k16O3J73k78J43J38m1q6K01l7j76k18m5L39N1j40J07
3092F3j39n9P8m9J11K33j7j10p7o3j2j31O2m5j48L27J77l8k19jMR3k74L9K53K10
3118B68l40m7n4K20j42J18k20J95n7o3M6K17M0j73O9m3j73J75j44q5K49j35J69
$$ plain form
2950 -260 63 89 -83 158 152 108 -32 -42 -232 62 170 37 163 141 86 120 4 -39 113 128 -31 -150 93
2973 93 70 -133 29 75 65 176 9 -14 -118 -32 -190 -5 -3 -127 132 -13 120 157 -35 131 -29 34 115 -83
2997 -83 -8 -189 -214 143 66 26 -32 -23 51 139 53 206 261 133 205 -191 88 33 20 -51 77 245 238 166 -149 -136 207
3024 207 202 -101 -191 243 127 -70 -50 -77 248 -122 -40 159 -77 54 218 87 -168 -169 50 -16 -84 42 -171
3047 -171 -132 63 -33 91 -97 150 300 108 89 -30 28 -1 -118 -14 309 40 164 -73 -40 -55 -293 138
3069 138 -92 177 -69 -84 -136 85 -131 -68 105 -173 -30 108 67 -19 182 145 -31 -249 -294 45 96 -44 63
3092 63 -76 -135 -57 -106 5 238 221 111 34 -29 -41 -172 -110 -155 -303 24 201 163 -56 -57 -53 40 -234 -195 58 268
3118 268 -72 -119 -173 47 -95 23 -197 -2 -59 -122 -76 141 181 8 77 34 -139 36 -108 -193 56 -79 90
3141I0j36K87m71K36J88j91o7j66L31P9j9l62M05j88k48L29j8k54R1L66l29L0
3163a7J75m5j43J2j9K8j5J49m9K1J85j97L8J40j30k53J0K73Nk04j65L29j4j97
3187h3J31j68J23k2K35J68l97Kj95j2K39o6P9J11p8j44j45K77j80R4O9P7k86K51
3211H0J75m21J73n0K18j9l10J49r7mJ31k60L87p3j1j78L45l70m2K89j45J34Q7
3234A88m84O9j37L42J47k43J07J14n5j76Q2K22k82K41k68R0m7m4J65l8MJ52j74
3257b5K23k06j67L79J21l41%L3J46r5k52K29m9j24J04M5J77j46j44R8n7K13l19
3280a57j10J3M38j29k21J81j31J81j76q1L4J61K35n50M28k11k4K51M9m05J79O0
3302A5n9R8P8Q4l10J62j70nR0k57J49J14j67M09j31k7k65K63j39J7p8j59J59J52
$$ plain form
3141 90 -46 241 -230 6 194 3 -64 -230 101 180 161 -201 204 16 -232 97 79 -175 -84 282 -47 -17
3163 -17 158 113 -30 -18 -37 -9 -24 125 76 97 282 85 123 263 133 -120 -110 163 168 -36 -201 128 114 -83
3187 -83 48 -120 3 -19 216 384 -13 -11 -206 -218 21 -45 34 145 67 -77 -222 55 -125 -31 38 115 -171 80
3211 80 255 -166 7 -43 175 156 -154 -5 -102 -106 25 -235 152 79 68 -110 235 -135 -177 112 -33 101 188
3234 188 -296 -227 -364 -22 125 -118 -11 103 48 -128 -46 176 -106 135 -133 -43 -90 -134 31 -7 -3 149 -25
3257 -25 198 -8 -175 204 325 -16 -16 17 163 68 -184 45 -4 -128 -24 21 198 52 -92 6 -51 162 -157
3280 -157 -267 -254 184 55 -166 15 -116 65 -111 -192 -158 3 238 -312 116 -95 -119 132 181 -224 -45 15
3302 15 -44 54 132 216 -94 68 -102 -107 -17 -274 -125 -11 -178 231 100 73 -192 71 -68 -51 -129 -288 -129 23
3326B3j8r7J49p2M3K87k36O1k45K37K53l67K22l75O1j52L58P0o3l23P0K88p1m9
3350E4K08q3O7m94L26m58L77K35k38O1j33M73k98j79O2m23L96r1M9k43J03N21
3372B92k40j74K4j27J99L9o3k16M40l50Q8O9Q7J0j17j54L43K5k21r4K55L5l79
3395b29K23o6n3n8L58j24k50P6J03Q6j38p0J75j42K7K01j85J89j83K0O8r9j56
3418b27K50nK60m00L71k49m6R3j6j7J14j3j77O3K00k08m2k6O5J06k61J13j25J41
3442c6P8M2J2k13K26R2nk11J34j05j3j94K22l49O0L27J31m6p1O2j63j13P3L34
3466B74l9n4l61M99j59p5k96K24j58J89k76J36o2J82j99K21o4j23m0J34J42%k44
3489a49rJ94L00l48j39J48J4o8j94J89j96J66J31q5J88k7m3j4L6j80J62j6k32
$$ plain form
3326 23 5 -92 57 -15 28 315 79 140 -105 132 385 18 240 -135 -74 -226 132 202 139 -184 -114 174 103 54
3350 54 262 179 246 -248 78 -380 -3 232 -6 55 -78 395 97 -82 -20 -443 -47 -138 -89 -332 -229 292
3372 292 52 -122 -98 -225 -26 13 -50 -266 174 -176 -88 -19 68 78 -39 -193 150 175 -46 -140 115 150 -229
3395 -229 -6 -72 -125 -183 175 51 -199 -123 -20 66 -72 -142 33 -109 -82 119 -66 123 -60 -40 28 -71 -227
3418 -227 23 18 278 -122 249 0 -46 47 31 14 128 115 -62 1 201 -7 -49 -75 -10 96 -165 -52 -177 -36
3442 -36 42 84 96 -117 109 201 196 -15 119 14 1 -193 29 -320 -260 67 198 152 81 143 -20 -133 -60 274
3466 274 235 181 -180 319 160 85 -211 13 -145 44 -232 -96 -158 24 -175 46 -18 -141 -181 -47 95 95 -149
3489 -149 -158 36 336 -12 -151 -3 11 -57 -251 -62 -258 -92 39 -46 142 115 72 58 94 -86 76 60 -172
3512a72j6L99L6k50J42J31j82j40L7K39l58qq8L12r3L2r0K72m15J16J92K7k10
3535h7L51l27J85l2N0k01K3J10N8j44J14j11Or3o0L46q7k53J46RO7k09PJ95k5
3560C8j76P9K6Q9m0J7p2J1J83L6m13j5M46k64M5p8K23l85o4O24k75O0J08n2k47
3585i6R1r2K97k66K5J90j81j00R9J44K79l85K62m42L72j76J81k03o1M32m52M6
3607c6L3j17J16m6j38K07j90L06N8k02lj50P7K2L23Qk36M0j33JJ21l29L94r7r2
3632f3K53q7j32m3j59Q6m2R6K04j67j46J30O7J07k10J54o0o8K3J99p9k6j24p1
3656a58M82m7k94j58n1j9K76j59L1m4J45l3P8j25m0q9K84k20K53j72l4J8K5r2
3680a43K33Q3k86L61n03K40q8J03M0m9p0Q7j34n2L13j65j69J18p6Q9K14k20Q9
$$ plain form
3512 -172 -188 211 247 -3 139 270 88 -52 -15 224 -134 -142 -230 82 -11 21 -69 203 -212 -96 96 123 -87
3535 -87 264 -63 122 90 140 -61 -38 72 130 -14 100 -11 -5 -98 -158 188 101 -152 -6 3 70 -139 -132 63 38
3560 38 -138 -59 -33 56 16 33 -39 -28 155 191 -222 -237 209 -55 -10 -88 135 -250 -314 310 35 95 203 151 -96
3585 -96 -5 -97 200 -66 -41 149 -32 -132 -33 111 390 5 267 -175 197 21 202 -1 -62 370 -82 -36
3607 -36 -3 -120 -4 -50 -188 19 -171 135 193 -9 -12 -162 -85 -63 260 268 32 72 -61 -60 61 -268 126 29 -63
3632 -63 190 103 -29 -72 -231 -145 -187 -91 113 -54 -200 -70 -3 104 -106 48 -12 -80 -57 142 63 37 -87 -158
3656 -158 324 277 -17 -175 -226 -245 31 -128 -97 -141 4 -29 49 -76 -116 -205 79 -141 112 -60 -94 -76 -51 -143
3680 -143 90 173 -113 248 -255 -15 -103 0 40 -9 -79 8 -126 -178 135 -30 -199 -81 -157 -68 146 -74 15
3703A5P1j31K3P2p8J39p6j9j34N8L3j35J80OJ14l7J76qp1j49l86L91n6m9M6R8
3729I3j21L71n22K95Q4Q2l10j44L7O4Q7m1n6j8J94k8N9j79j96K00j51M06q1j36
3753a1J13m8j7l02N12l92K16k18K29J19j93K33l37J18l7J63k23R2M60m71j52j1
3775a57L9n8k77K97M04k41N9j05m7Q0M3n0o1J42k9k19L42l1K09k00l9j66j25Q3
3799a07J01Qk91K79O5k35k32L36O4J37o5k70K16k00J37L15l59L50L5m46J52l58
3821c68M12J11M3k55K00o5j94K04J93k75J48k84J69J52p2j25N5j56R3J44k18K57
3843A69k75m1K89k30p7RK39K08m85L67k65p0K01k96L63j56RP6%l20L59j83J40
3866C1K9k9O7p6k11J09J3R7o1MJ56j1j75o1J98k21J98j24Q7Q8J59k84K58l95k2
$$ plain form
3703 15 86 -45 -22 50 -28 111 35 16 -118 -60 -27 -162 18 24 138 101 277 269 198 49 -337 54 -2 -51 -5 93
3729 93 -28 343 -179 116 200 282 -28 -172 -135 -71 16 -25 -81 -99 95 67 126 -53 -249 -49 -200 206 125 -11
3753 -11 102 54 37 -265 247 -145 71 -147 82 201 8 241 -96 22 -15 148 -75 17 477 6 -146 -157
3775 -157 -118 -176 -453 -156 248 7 66 -39 -86 -6 37 -13 -74 68 39 -180 162 131 340 140 101 -65 -190 -107
3799 -107 -6 2 -289 -10 55 -180 -412 -76 -12 125 60 -210 6 -194 -57 258 -101 249 284 -162 -10 -368
3821 -368 44 155 198 -57 143 78 -116 88 281 6 154 -130 39 191 119 -6 49 -107 -14 130 -88 169
3843 169 -106 -147 142 -88 -165 -156 83 291 -194 173 -92 -162 39 -257 106 -50 -41 35 35 -285 74 -109 31
3866 31 60 31 98 22 -189 -80 -67 30 -31 -27 129 118 -57 -118 80 -141 57 -67 20 108 267 -17 241 -154 -176
3891a76P7p4N1n9L53j57J30k64J85l7j63K32r6K4Mo1J81R5m17K62J33k35J10k49
3915a51K60j60K14L0j67j22j95K04o9j2K87k06n5m6J11J38k2j41L79k46k04P2
3937a01j72K54j84L32k51L04k45N5R9j66K90l18J49k08P1K31j32J3J72j9q0J39
3959B33l83M26l63K21j51J13%J56n8j53K9J0o2Lq5OJ0J62M8l42Q4N5l0m3K16J6
3985A18O1k75m7mP0J40qM1j7n1k18J49k63N36j54k68k6K07r7J85rj81lP4k46L33
4011D7J70j31L7j2k92O0K95j34j95j19K90J5j00J16N2j35J47j60M9k49K03r4J75
4034C5n5P4K40k40q0P6J58L3j16j02l00J37K83p9O4j04K51k25K8l27K16N7l1R
4058BR6r2k37L95R2j96k76K91Q3l29J91L00n28J78M1J85l71K54J20k98j3k12K94
$$ plain form
3891 -176 -99 -173 -122 -181 172 15 145 -119 66 29 -134 98 2 26 30 -31 150 245 -172 90 223 -12 98 -151
3915 -151 109 -51 163 193 26 -96 -291 -87 -156 -168 119 -87 -142 -188 -77 61 39 -102 277 31 -173 -101
3937 -101 -273 -19 -203 129 -122 182 -63 -8 91 -75 215 -103 46 -162 -91 140 8 21 193 174 94 233
3959 233 -150 276 -87 134 -17 96 96 252 194 41 70 80 18 21 -64 -58 -48 114 162 -180 -96 -41 -71 -114 102 118
3985 118 179 -96 -143 -147 -77 63 55 96 79 28 -190 -41 -304 232 78 -190 -216 -9 -106 79 70 -111 -114 -40 -286 47
4011 47 217 86 123 111 -181 -121 174 40 -155 -274 16 31 -69 47 99 -36 111 -49 0 -249 -46 -140 35
4034 35 -20 54 294 54 -26 50 208 241 125 23 -277 -140 143 64 128 24 275 50 78 -249 -33 24 -7 2
4058 2 98 6 -231 164 256 60 -216 75 158 -171 20 320 -208 -30 11 196 -175 79 199 -99 -112 -324 -30
4081c0j18K89j0j37o2J88o4p6J92l38P0o9j39L76n8K73k62K81m53R4L6m0m3p5
4105a75rj5K26J6J87m52J95k15N9K9J34r6N9o4j83N18l22J80K9j79K27r8j0K1
4129F2L2k98M14k79J35j70O7N1r2J57o8P3j71J22m4k75L5J39K09l67K88j02k0
4152a02J56k83K59J26j35J25p5J22k56Q0P7k50J98K20P2n32K14L14Jl82L20m98
4174b29L2J5J76j51K06l64K2L58j36K98j20k27L09k34J43M7j96K08l80M23j17
4195H3m08L24n5J82k47J61p9pj51J31K44k50M3m9k1qK56o0j05O6l18J54J2L7m7
4220a12k4J09k00L21j05j03R7K25j73l5j02r3M32Q0m07K83j91j67o5K47K59l34
4242e8O9k1j82L80j52K38j98j80P2N3n7K8LJ2r5L2J78k33NJ4K5K1j7K5Qomn9K2
$$ plain form
4081 -30 -148 141 131 -6 -68 120 56 -20 172 -166 -96 -165 -304 72 14 287 25 306 -147 -53 -17 -57 -100 -175
4105 -175 -184 -199 27 43 230 -222 -27 -242 -183 -154 -20 -116 -57 -121 -304 214 -108 72 101 -78 149 51 41 62
4129 62 94 -204 210 -69 66 -104 -37 14 -78 79 11 84 -87 35 -9 -284 -249 -110 99 -268 20 -82 -102
4152 -102 54 -229 30 156 21 146 71 193 -63 17 94 -156 42 262 334 -198 16 330 331 -51 269 -229
4174 -229 -197 -182 -6 -157 49 -315 -293 65 -71 227 107 -120 189 -45 98 145 -51 157 -223 200 83
4195 83 -325 -1 -56 126 -121 40 -39 -46 -197 -66 178 -72 -29 -78 -99 -107 149 89 -16 50 -268 -114 -102 -65 -112
4220 -112 -136 -27 -227 94 -11 -114 -17 208 35 0 -102 -195 237 317 -90 193 2 -165 -230 17 276 -58
4242 -58 11 -10 -192 188 36 274 76 -104 -32 21 -36 -8 -5 7 -88 -56 122 -111 -106 -92 -67 -46 -63 -38 -30 -36 -40 -99 -77
4271g7R5j87K70k29M01k62o2j91M9Q9q8Q1m9K59l26K72m37M23k98L38J15l46Q6
4294g4J29K77m65K90k53o1L34N9q7j80L03k01r2j23J56p2o9K29j30j27R8j25O7
4317a17K76j82o7J79k49P5J98m1j96K65j1j93K67k06Q9j22J82l7k97J50J04k39
4339a72L03j9m5L22n96K27o3N5J07K2J41j93j63J67L2q7j64J45K06j88J3j58K5
4362h3L04m45M70q5p0K1l54M37j37K6n6J90j18nJ44j1qL3k52j14K25j51Q7K13
4386B61l85L4K09n19N83j42k0j05J72L23n61K59j82M2o5J73J44n65K98j74K95
4407G5k8%K4N9j64K18K80n53L1k3k4J07J56k50K32l42K98L1j25j15L2N7N8j01
4431f7L25k58J60Lk82J93N6l47J11J42k5K05k37R8l97N81o43L67m6J52J2k06K30
$$ plain form
4271 -77 18 -169 101 -128 273 11 -51 -242 -193 -104 -192 -111 -160 99 -227 45 -392 31 -267 71 186 -160 -74
4294 -74 55 332 -133 157 -96 -157 177 236 149 -31 272 71 -21 -144 12 -60 -129 100 -30 -157 -59 -184 -117
4317 -117 159 -23 -90 89 -160 -85 113 72 -124 141 130 -63 204 -2 87 -35 147 110 -187 -37 67 -172
4339 -172 131 112 67 389 -207 20 -43 12 119 141 282 89 -74 93 125 38 -126 19 225 37 50 -108 -83
4362 -83 221 -224 246 161 91 112 -242 195 58 84 28 218 100 95 239 228 220 253 1 -113 112 -39 48 261
4386 261 -124 -90 119 -400 183 41 21 -84 88 411 -150 109 -73 -31 -96 77 221 -344 -46 -220 75
4407 75 47 47 71 130 -34 184 464 -89 -58 -81 -105 2 158 -92 140 -202 96 127 2 -113 -81 -24 34 -67
4431 -67 258 0 160 163 -119 74 130 -217 -106 36 11 216 -21 77 -320 261 -382 -15 -61 91 103 -103 127
4454A27l6l7PJ5J62l04R6O4j69K26l26J78k76K58J84j31l0k89K77n6J75l29K65
4477E1j08l9R4K31k49K54n90L03J92k81J56O3k80kK14r8Q9J61Kl26J27J0J50R7
4501B21k26j39J66K95m68QJ87K12m09n2K27o5m7J01J26k01o1R3J43J04p9j61R1
4524F6k78J77N9k21K09l50M17k9p6j0j15J67l5R7J7J06j91j49M41j57j8j35M7
4547C9r8j11J50l3J96N7l06J53L08m44r3JN8K72j31l1M0k56K73O3Jm8l12M08j91
4572c5k2N5K1k44M23j52j54Q7N1J15k71J79j92K48j31J13l23K38K8j38K52m08
4594b60R2j81J50L16rM4J1l24K37Rj99Q0l7R5L1Q1l00K30j9PK14J3l31J13nK51
4620C09j50k60L38j21j55j07K11q9n8J43o8P9J4l17R9J51q7K06j67J57j29Q5k05
$$ plain form
4454 127 91 54 61 76 238 -66 30 94 -75 151 -175 3 -273 -15 169 38 8 -281 -4 -60 115 -214 51
4477 51 -57 -96 -2 229 -20 234 -356 -53 139 -142 14 77 -203 -205 9 -89 0 161 163 -163 -36 -26 124 221
4501 221 -5 -144 22 317 -151 -143 44 256 -153 -205 22 -43 -90 11 137 -64 -125 -32 111 215 136 -25 66
4524 66 -212 -35 24 -197 12 -338 79 50 -26 -36 -151 16 -19 78 95 201 10 -139 302 145 127 -8 39
4547 39 -59 -170 -20 -53 143 200 -106 47 355 -89 -182 -181 -123 149 18 -13 27 -229 44 107 108 60 -252 156 -35
4572 -35 -57 -2 19 -225 198 46 -108 -21 30 145 -126 53 -139 109 -22 91 -232 6 34 -104 148 -260
4594 -260 -168 -349 -199 117 108 152 163 -161 76 85 -114 -34 -71 24 55 136 -164 66 47 54 268 281 -50 63 58 309
4620 309 159 -101 237 116 -39 -146 65 -24 -82 61 -7 72 86 -231 -132 19 -68 138 -29 128 -1 84 -121
4643a21Q3K35k51L3l5qK4K31m91L03L99n12K18j39jL74j94r3m0O8l56P9K38m7
4667cK6n0J36k31J54j01L6O3j42O3Rj55J87l05N26j86K18m13l6L20l43K24p5Q8
4691A0j0J15r8p4J95j91L4q8p1L13l3j12K03j81K60m01R4j14J81Qo7k7p6L44k28
4716a4M3pk29L11Rj05k7L59j08l86l3J35j42K93k95k6J85J14O1j32K13l40J01
4739b0J42k33L41l21J80o5m3M3m4j24J58j30K08k51K36J24j76J90r3l66J7q6K77
4762c6L22k80J1k89L29n2J40k46J74J5K04k78j10lM1K40j81p8Q6l0J95j9J43k00
4786I8j84K42l80J31K88j68N6j74p9J02K55q3p8K81j87j79K21rj69j74K49J3j74
4809a02J96j78K07M5l21K2O3j3P1j46L49k66m9L14k31N5J83l88J27l8K4j12Q3
$$ plain form
4643 -121 -38 197 -54 -21 -56 -64 -40 191 -300 3 402 -110 108 -31 -32 342 148 55 15 83 -273 -194 44 -3
4667 -3 23 -27 109 -122 32 -69 -33 30 -112 -49 -40 -195 -8 -313 213 27 245 -168 -204 116 -227 -3 -78 10
4691 10 0 115 17 -57 138 -53 -19 -107 -178 135 102 -10 193 12 272 -129 -35 -149 32 40 -27 -54 -130 214 -14
4716 -14 29 22 -207 104 113 8 -19 340 232 -154 -187 -52 -194 99 -196 -222 -37 77 138 6 219 -121 -20
4739 -20 122 -111 230 -91 89 24 -19 24 -20 -144 14 -116 92 -159 77 201 25 215 122 -244 -227 -313 -36
4762 -36 286 6 17 -272 57 5 145 -101 73 88 292 14 -96 -99 -58 182 1 -77 9 -21 174 155 298 98
4786 98 -86 156 -224 -93 195 27 83 -91 -170 -68 187 104 26 307 120 -59 162 153 -16 -190 59 72 -102
4809 -102 94 -84 123 168 -153 -131 -68 -81 -10 -156 193 -73 -122 192 -39 16 199 -189 -62 -100 -76 -188 -105
4832a05J34J20k73n5rK41Q3j60j26k2K06j32L18r2k01k6p9K53j85M7qK38j03Q9
4856A53k16j22L4L24L6j83j15J46O5O6M7K50m21l5J03q4j02m4J44P3j92J28j08
4879e3K65K4o3l49L40j15J77k96Lj84M28l64O5pm8K6N8L3q8j96M11j52J39j59
4903a05M6j8k18M19M9j38l8L99n54J09R8L3l84L16p6R1J7R7j94O6l9n3J02J31
4927A56l18k15L14J21j70K02R5j14N1m1j91J97j25l13L98p2K49m4j55J72j38k75
4949b16L83j09rn0L4k13L97O3j37o5j76J1PR4q0K01Q2j4k10o9L0n8J51j7l10J11
4975a69K90k63K56L1j04N4j04p7J88j18J93l46K83l2K50k98oj16K12k00J43N1
4997A18K3o4m76M07j98J47k5K58k45k7L6oJ44j17M9kJ73o8o4J52l89K26rJ25K94
$$ plain form
4832 -105 29 149 -124 -179 -188 53 136 -24 -150 -172 34 -98 220 128 -73 -99 -178 75 -110 -63 -71 167 64 153
4856 153 -63 -185 -151 173 209 26 -89 57 122 188 235 485 64 29 132 48 -54 -98 46 119 -73 55 -53
4879 -53 212 236 173 -176 164 49 226 -70 -67 -251 177 -187 -122 -129 -177 -151 -93 -60 -148 -344 67 -85 54 -105
4903 -105 -59 -77 -295 124 173 35 -3 396 -158 -49 49 82 -302 14 -62 29 46 143 -51 15 -24 -77 25 156
4927 156 -162 -377 -63 58 -112 90 185 71 122 81 -110 87 -38 -351 47 -25 224 180 25 197 59 -216
4949 -216 167 58 49 -1 33 -180 217 280 143 78 -98 -87 -80 14 -66 135 217 203 -7 -76 -46 -104 47 30 -280 -169
4975 -169 121 -142 114 145 41 95 -9 -86 102 -16 177 -169 114 82 332 34 28 -88 124 -76 67 118
4997 118 141 77 -399 8 -190 -43 -68 190 -55 -82 -46 -52 92 -25 24 22 195 127 63 215 -174 52 43 168 462
5022D62k97r2K31m20N3MK68r1l7k60M1p0L8K63j6j90K30k46L37k97J76l9Q6j61
5046b7k01L87m27K91K03m90K66j7L6J13k33J81j87K31k77J09P0l06K44m8J00J8
5068C6N1q9P7k7J49j31L13Kn20O6m8j7K19N0j50J67J18l34K85j22k73J26J90l49
5092b11K96j16k03J52P6j12L88l11J3o2J02j68K18J94l50M7J8P8J34k14N1K81
5114C01l86K12k5J36j56k2k43p6L29r2J99P2J81o37J53P4J23n6j97K0rO6K1j49
5138a61L28j40j54J61j11J06k62L92j14o5J7R0j76nQ4r6jj1P5K05k29J97j14M6
5162F2k7R4L8l73J20J42j79K79k09m7K26J84n02J10p8k0K03l31L63K3J38k56K48
5185B08k2j66K44m37K02J8qk18K09J58j91j83j02K02l5K77j81mK06K9l09J33l40
$$ plain form
5022 462 165 73 304 -116 -63 -59 209 118 81 -179 -138 -208 -170 93 77 -113 117 -129 208 -89 87 48 134 -27
5046 -27 -228 159 -268 23 226 -264 2 -15 21 134 -99 82 -105 126 -151 -42 28 -278 -34 -82 18 36
5068 36 87 -2 75 48 197 66 379 381 -139 -73 -121 -138 81 131 -19 148 266 -68 217 95 -178 -52 138 -211
5092 -211 85 -31 -234 -82 -6 -118 270 -41 -28 -90 12 -156 62 256 -94 -47 -29 49 183 -31 20 301
5114 301 -85 127 102 238 82 60 -183 -259 70 -22 177 249 430 -207 -54 20 143 87 -110 -90 -99 -33 -12 -161
5138 -161 167 27 -127 34 -77 29 -233 159 45 -20 -3 87 -89 -94 -10 -106 -107 -118 -43 162 -67 130 16 62
5162 62 35 129 167 -206 -86 56 -123 156 -53 -100 126 310 -192 -82 -160 -180 23 -308 55 78 216 -40 208
5185 208 186 20 264 -173 29 47 39 -179 30 188 -3 -186 -288 -86 -121 156 -25 -29 177 206 -103 30 -310
5208c10J42K5j52N56m09J32J20j68J28j53J50O8K26j74n8J48l08r6J36K24m5j14
5230F8nj94K40l14N17m77K01rk25K65m0j08j5J73q6J28j93m9J09K36o9lk72n4
5254a76L38k84R4J04n1J71k05j36N9j00L86j03j89J84o0j04m3K42o6J27p6j39
5276b7m6j7R4N3j49L02k06r6K7j77L20M0j86J01N2k18K72l00J03q7O3J59K40l56
5300c9L44l53j76L20j77K04o9j80Q0K21k09J5O2J3O5J00k00k85k8K79k34J85P6
5323A4k62R7K56m9j15j09K84k46O0q9J96m16O01j34N6j97k1M9p9j03K83K1j95
5346i8J68j10k06q7L39M1J17j17J13m7j34k8L7MK32k39J95j01J52j93Rl19L57
5369H5j26j94J43n4J41k02K92j55O4P5j67j87K79j48K52l6k83N8K13n1k83J9M51
$$ plain form
5208 -310 -168 -143 -295 261 -148 -16 104 -64 64 -89 61 129 355 181 123 271 -37 -133 3 227 182 68
5230 68 63 -131 109 -205 312 -165 36 27 -198 67 27 -81 -96 77 -9 119 -74 -123 -14 222 153 150 -122 -176
5254 -176 162 -122 -28 76 25 196 -9 -145 -86 -186 200 97 -92 92 32 -72 -115 127 61 188 112 -27
5276 -27 -73 -90 4 57 -92 210 4 -92 -65 -242 78 118 -68 33 85 -133 139 -161 -58 -145 -82 77 317 -39
5300 -39 305 -48 -224 96 -81 123 54 -126 -46 175 -34 -19 43 56 121 221 21 -264 -292 -13 -247 -62 14
5323 14 -248 -151 105 56 -59 -168 116 -130 -70 -159 37 -379 222 88 144 -53 -74 -25 -104 -207 76 97 -98
5346 -98 70 -40 -246 -333 6 47 164 47 160 113 -21 -49 -12 -8 224 -15 180 79 231 38 47 -272 85
5369 85 -41 -235 -92 -146 -5 -207 85 -70 -6 69 -98 -285 -6 -154 98 62 -221 -163 50 -1 -284 -265 186
5392A86k72q3J27kk0K28j70m4J4m4K57m25K07L48n40J49J56j77J41p0O0J27p2
5415H1k04K6J46j48Rj41N6J4K17k35n3K95j82O7L31k39k75N50l28J27k63Q9kK05
5439A43k67K91l1l15o9M51l15K29J6j50r7oL15j81j9k6J87l4j95J72j91K56J04
5462B68l15K14rk63K30k36J43l1q1J58r7J15N3r8P7J73j90k08R7j90l6L92j16
5485E0J25P6m04J57j30J73J77k22Rj74L23j20j03j72L05j14j51L37Q6j98j78K31
5507H3p4J06j36j63K04jj87j0J84o3J28j03L02k01p4k85M40k39J29J3mj99J88
5530C8m1O7j50K6L41l08j1k06J17kK48j4l28J1L65k52k31M28j24R4n1l14J00K94
5554I7l0k06j12K71j5j74L24j48j48m39L91K70k15J25P8k60j6nK43R4p6K30j19
$$ plain form
5392 186 -86 -169 -42 -44 -64 164 -6 -50 -36 -80 177 -248 -41 307 -233 -84 72 -105 36 -34 26 153 81
5415 81 -123 -97 49 -99 -90 -231 -175 -161 56 -179 -232 63 -119 -52 279 40 -235 315 -13 114 -149 -60 -62 143
5439 143 -124 167 136 -179 -248 203 -112 117 133 -17 -114 -120 195 14 -5 -31 156 122 -73 99 -92 164 268
5462 268 -47 167 158 -105 125 -111 32 1 -80 78 -19 96 149 51 128 301 111 -97 0 -190 -226 166 50
5485 50 175 251 -153 4 -126 47 224 2 11 -163 160 40 -63 -235 70 -44 -195 142 228 30 -148 83
5507 83 9 115 -21 -184 20 19 -168 -178 6 -57 71 -32 270 69 -5 -290 150 -89 40 53 49 -150 38
5530 38 -3 64 -86 -60 281 -27 -38 -244 -127 -129 119 105 -223 -212 153 -99 -330 98 -26 68 17 -297 -197 97
5554 97 67 -139 -251 20 5 -169 155 7 -141 -580 -189 81 -134 -9 69 -191 -207 -212 31 125 49 279 160
5577A60r0R8j95j9r5j07L35Q0j90N0j9r5K63n3j0lo8o6J5J50o4j77nK89k38MJ87
5604A37j2Q4k49NJ43j31J79l1k34J8QJ60j83J89m2J60R3k66k86L15j33j11J48
5627c9K7k1j34J24J2k48J54M34j94j55J69j44j27n1J96m41K56J10J98j35j49L84
5649B26j49J75L7j44r7j70J08j42j2P2K85j79r7j54J20K59j38o4k74M88k52K58
5671A56j65L6j9j27K57q9j15j2j2K04k23M01j88N7l21K05j77L17m36L77k16J58
5693F8N5j03j25J51j52L46m45K95k29Q8j0J20l86K95L3O9l06L42J87m20L07o29
5715d49N65K9K68o59M77k76J76rN5L6k25M0j17Q5j67J39N1k4K58l82K5J69o4N0
5739E1j39K50J2l09J06O6k86L24n9J05Q0l28J15k18M17k64J4q1J02M8N0J00l21
$$ plain form
5577 160 70 168 -27 -46 -141 -248 87 167 -23 27 8 -87 176 123 113 110 42 -24 -9 141 77 -100 -105 184 -54 -50 137
5604 137 125 209 -40 -35 108 -23 156 125 -109 -91 -83 77 -106 83 41 201 294 28 -258 57 -76 -187 -39
5627 -39 -12 -33 -167 -43 -31 -279 -125 309 115 -40 129 -15 -142 -193 3 -438 -182 -72 126 -9 -158 226
5649 226 77 252 289 145 48 -122 -14 -156 -168 -96 189 10 -87 -241 -121 138 0 -64 -338 150 -102 156
5671 156 -9 27 8 -119 138 49 -66 -78 -90 114 -109 292 104 161 -160 45 -132 185 -251 126 -90 68
5693 68 123 20 -105 46 -106 240 -205 90 -139 -51 -61 59 -327 -32 1 70 -236 106 293 -127 180 -449
5715 -449 116 145 413 -246 231 -45 131 122 177 213 -12 28 -89 -4 -171 -32 19 -5 253 -129 -104 65 1 51
5739 51 -88 162 174 -135 -29 37 -249 75 16 121 201 -127 -12 -230 187 -77 -63 -144 -42 6 56 156 -165
5762a65J32P7K1j36j15J01K64j66l5Ok03K00J89l81L78k19N2p8J13j61K22l8n3
5785Ek2q9j41K83J23N3k86j32L19l8k41J73l0Q9q2M0p3J20k5j51O7J14J2L9l57
5810b30K47l73M97p0l11L36j56J56k4R3j53Q0k89M6O9J57N6K6m4j95J18J16r2
5833F0j76K45J56l20j29M29k87k65J64j7l13K96J32k7j12K83m35K21n9Q1J66k97
5855b04L39k33Q6L5k11o2N16n13J41n2L75k90J29M5k91QK83K7l17K97Jmk41J53
5879A7K1j42p2K24j05P6j53J42k2n6L46k12l51K18q2L14o6j75J79l37J75K85r7
5902A27k11J91j32J05q8J05q8p5K29J50k96Q2o7j70p1K33J81j50J8j29n0M9J07
5925E0K35j93j38L16l01j97L58K2j60j71J66J27j31q0L19k61K68l24J57L12m84
$$ plain form
5762 -165 -33 44 65 -71 -186 -85 179 13 -22 -16 -219 -19 170 -211 167 -52 0 -78 35 -126 96 58 5
5785 5 -17 -106 -247 36 159 212 -74 -206 113 75 -166 7 -23 66 -16 24 -49 71 46 -105 -38 76 88 127 -230
5810 -230 17 -356 141 71 -240 96 -60 96 72 165 12 92 -197 -151 -82 75 131 157 113 -82 36 152 60
5833 60 -116 129 285 -35 -164 265 -22 -287 -123 -140 -453 -157 -25 -52 -164 119 -316 -95 -154 -73 93 -204
5855 -204 135 -98 -12 23 -188 -250 266 -247 -106 -158 217 -73 56 101 -190 -182 101 128 -189 108 109 105 -136 17
5879 17 38 -104 -176 48 -57 19 -134 8 -14 -70 276 64 -287 -69 -151 163 97 -78 101 -236 -61 224 127
5902 127 -84 107 -25 80 -8 97 9 -66 163 313 17 99 32 -138 -209 24 205 55 73 -56 -106 -57 50
5925 50 285 92 -46 270 -31 -228 130 152 -8 -179 -13 114 -17 -97 222 -39 229 -95 62 374 -110
5946a10j08N3K57K4l00L47L1l02K0J65M9j00J21j27j32K4J67j17Q2p0n7j6j24
5969b23K81q0M0k20l3K01J50k90L12p7K8k55K76k6k4Nj68K94p5Q1r8r1K99n60
5993b53J46n5J22rP8p6K22J9k72j39K48j78Q3K9L4M3k00K26j88M15m66K38J64
6016B31q0k14m4K4n2K53m8j56j28J92m4j00K4N5J2k70J47K44l22J70R2J52j53
6039a5N5k5j1k01P3J29r0R1l78M16J07l08M96l37K06j84m8k0j52K29m4N0K8k14
6063a47J4J42j3K33k25k4j74K77k41L31j61J72m01J18O6J14j25j21J21j65K17
6084Hj45N6J40j9j02K34o7j79K72j22j16O1J08M0k16L4m0p1P8m9N8pJ40l67K48
6109b3j48O0P5J82J5j66J28l52K7n9J39Q4l04L74k54J1M00j79qJ3Q0r9r3k01J85
$$ plain form
5946 -110 -218 -165 92 116 -184 163 194 -108 -88 77 126 26 147 20 -112 -88 79 -38 44 -26 -83 -99 -223
5969 -223 58 -22 18 -202 -235 -34 116 -174 138 61 89 -166 110 84 60 65 -103 191 116 197 99 8 307 -253
5993 -253 -107 -162 -40 -49 29 -47 175 194 -78 -217 31 -147 -64 -35 -1 42 -158 68 -120 295 -171 67 231
6016 231 151 -63 -107 -83 -135 118 70 -86 -214 -22 -66 -166 -142 -87 -75 -345 -198 46 -276 -106 -14 138 -15
6039 -15 40 15 4 -197 -124 5 -85 6 -372 44 151 -157 339 2 208 24 -24 -44 -196 33 -11 39 67 -147
6063 -147 -133 9 -4 229 4 -20 -194 83 -158 173 12 184 -217 -99 -33 81 -44 -165 -44 -209 8
6084 8 -137 -81 59 40 -62 172 105 -74 198 76 -40 21 129 169 -47 -13 -53 -124 -46 -95 -37 -44 96 -271 -23
6109 -23 -171 -111 -36 146 161 -5 123 -229 -202 -261 -122 -38 -342 32 -222 -211 189 10 2 15 95 -4 -97 -298 -113
6134a13l0L9o4L28j41k67K64N3j80L35k54J09p3N7r9M8K5j03J67m2p9p1J30k2
6158A7K05k26J25j73J4K16m59L96k48L24o0j9l30M4M47j36L5m60K23J77o4l7j18
6181a07N4N6j0J42ol62L27k16L41K3l36o1L5P5R8J68q4m40N40k71L03m62L96j24
6205G9n6k08L26j16J01k25p0M51k85j52j20L1J56K79l48Q7J28k26L55k95Q9j33
6227a52l0J60OJ59n3r5J50j25m8k50K36K42j83l24J22J71J96l33L1J3J24K13j98
6250C2j3j18l5N85m97q3K93k20n3J50J43j17k34K31lj28j08J63k31j70O80j71
6272I6k58J98j69j26N42j76k14P2J2q5j6n7L68k27J30j62J32O8l92N34k35j22
6294h7Q6J08K7k00J31j59Q4J10O4j03q6o6J52l23M41j1k58j59L48m6j75K9j00
$$ plain form
6134 -113 -143 -104 -168 160 19 -248 16 69 -111 224 -30 79 6 63 -36 12 37 -66 101 59 -20 -91 39 17
6158 17 222 -4 121 -52 -38 178 -281 115 -133 191 131 112 -218 -174 273 137 172 -288 -65 112 48 11 -107
6181 -107 -53 3 -7 135 129 -233 94 -122 219 242 -94 -155 -120 -45 53 221 137 -303 237 -34 269 -193 203 79
6205 79 23 -185 141 25 126 -99 -169 282 -3 -155 -275 -244 -88 191 -157 -70 58 -168 187 -108 -19 -152
6227 -152 -182 -22 -16 143 90 -5 145 20 -28 -278 -42 200 17 -307 -185 -14 182 -151 -120 -107 17 230 32
6250 32 19 -99 -134 451 -46 -129 164 -56 -109 41 184 67 -167 64 61 -67 -175 -12 -243 -413 267 96
6272 96 -162 36 -133 -259 283 107 -107 -35 -23 -108 -124 -181 187 -40 90 -72 60 128 -264 270 35 -87
6294 -87 -1 107 134 -66 65 -94 -10 100 164 61 -25 -91 61 -262 179 168 -90 -249 99 53 -122 -93 -193
6317a93J71L7j24K11l87J34M69l77N8K57l36J72p3j05J72r2J10k97J06j00K15
6338B8r9j87J19K49k04K40j09r6j19m5L37j19J1k38N06k23J62n2R8n05l1J95J19
6361C7l2L27k15k25J71j3l98J79L27m04K09J18k62K44q8O7Lj16K27Ml22M54k37
6384E5J32j68jm3J20j42J32J4j22J57l34K41K34m06J15L9k30J33K77j24p1M7J16
6407A71j22k26L29k95K30l5k57J92j2N3kR2l10J48J2j55K25r4Q6j78K13O8j33
6430@j35J08j48M7J20J09j58K41l49L22K7k33j80Q2J55M7k8oo7n6K92l33l42L87
6454i8R3j54L01J22j54r0K16l1j52j48J00L0j30L13k94P3j06K7QR3J08j93J81
6477A15j29P8m5J06n7k66L50O0m05K0J73J1m9m5P2M3k82K34Mr3J39k3P4J1j81
$$ plain form
6317 -193 -22 15 -109 102 -285 -151 318 -59 -1 256 -80 92 19 -86 86 -6 104 -193 -87 -187 28
6338 28 -71 -258 -139 110 -94 146 37 -59 -178 -223 114 -5 6 -232 274 51 213 161 259 -246 -277 -82 37
6361 37 5 332 117 -108 63 50 -348 -169 158 -246 -37 81 -181 63 -25 42 45 -71 156 160 -162 292 55
6384 55 187 19 18 -25 95 -47 85 99 -23 134 -200 41 275 -131 -16 23 -207 -74 203 79 8 55 171
6407 171 49 -177 152 -143 87 52 -205 -13 -25 28 26 118 -192 -44 -32 -187 38 -56 30 -148 65 133 0
6430 0 -135 -27 -175 -128 -8 101 -57 184 -165 157 184 -49 -229 -147 8 55 27 21 -46 -102 190 -143 -485 -98
6454 -98 -5 -159 142 264 110 20 236 205 53 -95 5 35 -95 218 -76 -3 -109 -82 -74 19 127 -66 115
6477 115 -14 64 19 125 68 -198 152 212 -193 -173 0 11 -38 -83 -11 32 -250 -16 -12 -105 34 11 85 96 -85
6502h5k97M94J2k46K67k67j57J83J73k63K70j97R1K41j07k25l1J37k53K49J65
6523A54p1lj17R4j16M5O0j04Q7J63l25j20J97J42k37L11j40k14M25l14L01Ol45
6546a21o2J16Q9lj31K5J83k11J8O7J46M5n1K6j17j66K31p7l7J00l33N3L72R6l18
6571f0llK72k51J50P1l48K91j21Q8j85N13n95K47p7J3p7Q7n2j8J11Q8M1j66j89
6596a73L23j89k5r5J54K55m70K71j22j64K68J20q2l19M42j60K07l08J82j90p1
6617a46M6K54j34n4K0j22K67O3j29M1N3l59K11k35K18L04k61k5J51k72K9L44J4
6640B78l80K95j61k12L13k13MJ04k33N6J85k37K17K2j4o2J27q6J19j31j43J35
6662a7k85J81L81l26J12L0J06k05J53J2r3k48J67q2j68M24N8Lj04j29K4j4K61
$$ plain form
6502 -85 -382 112 124 -122 145 -122 -279 -96 77 -186 84 -113 -22 219 112 -113 -144 -7 -260 -11 154
6523 154 83 80 -37 57 -59 -14 46 -58 29 192 -133 -253 -56 86 -151 160 20 -194 231 -83 218 224 -121
6546 -121 -183 -67 22 19 -112 -87 96 -115 -97 -30 116 161 110 136 19 -147 84 7 -30 70 -263 -210 162 258 -60
6571 -60 -63 -66 206 -45 105 176 -172 119 -2 86 -99 414 -181 66 -11 2 -75 12 -40 -58 53 141 182 16 -173
6596 -173 150 -39 -64 -159 -5 250 -220 51 -71 -235 33 153 71 -248 194 34 241 -67 115 -75 -146
6617 -146 -100 154 20 -34 -14 -136 131 194 65 106 159 -200 11 -224 -6 298 37 12 163 -109 -80 264 278
6640 278 -102 193 32 -180 133 -80 -76 28 -205 -149 36 -201 16 38 24 -38 89 3 122 -9 -152 -17
6662 -17 -302 -121 260 -66 46 76 182 -23 130 142 49 -199 -32 -114 -282 142 200 203 99 -30 -6 -20 241
6685B41j81Oj4k58L08J9j26K70j82O7k86l2J34n3K14J18o1m64M36j89J11J24n04
6708c02N97k46j68K19o4L6M4j6j91L65m30K62o8j79L15j37q6L97k50j13K7J34
6730A46j90j09K54K2k20K71k21J72j5l60R9J56J83k33K61j91q4J36m8j46k13L39
6752Io3J6K40j59M5o1p2q5P1K33l8Nl61J82J62K14j50l01mJ09J71k27Q6l99M01
6777B4K07k05j84R1N6j07n5L2N8K61l53L0K01O4j88j55J84K9L7j99K93m12K21
6800g0L8m14N60j8k85K62j34N5O7o4j27J6k1J16J04n7J72l29J77O0j5j26J15q6
6824dn7R5j54J8J03j71j64N38k77k14K18J77k35N8J5J53k61J45L2j94J15L1K66
6847B33m27J75k4LoK26k4k17J88j04j8J63k77nK42J05m89N4K33m0Q0l0j31l1K22
$$ plain form
6685 241 60 66 52 -206 102 121 -5 265 83 150 -136 -168 -34 -87 127 245 184 -280 156 -33 78 202 -302
6708 -302 295 49 -119 100 36 72 116 100 -91 274 -156 106 38 -141 174 37 -49 348 98 -15 12 146
6730 146 -44 -153 101 123 -97 174 -47 125 110 -250 -151 5 188 -45 216 25 -59 77 29 -117 -330 9
6752 9 -54 -38 202 43 88 27 -45 -130 -59 174 136 141 -220 -38 124 338 188 -113 -117 -8 163 -64 22 -377 24
6777 24 231 26 -158 -67 -11 -118 -173 -141 -83 178 -175 -145 56 120 -68 -223 -39 -10 27 -172 121 -291 -70
6800 -70 -32 -446 114 96 -189 73 -61 -6 61 -3 -130 -114 -135 -19 85 28 200 -129 48 108 93 -33 82 -4
6824 -4 -61 34 -120 -102 1 -170 -334 204 -73 -287 -69 108 -127 -69 -54 99 -162 -17 15 -179 -64 -33 233
6847 233 -194 -19 -43 -40 -46 180 156 -61 127 23 5 168 -109 -114 128 233 -256 -202 31 -9 71 41 -90 -121 101
6872A01j30J16m3k22K46J88p9j14J41j32r6r1J82N4J16k70K99j80K5j47r3K88
6894A59J2J0J10l74J81q4N8n4k6OJ78k51l6K51j62o3K01q5j72k6L66q7l98N08
6918B22k93K13q0L1k57J38M2k61J70K14k75K99qLl11K8M7J31O6%O3k84J70o9O4
6943F3j2J83k29p1q1p8Q5J54q8K51j03j49M30l70j88K33Nk88J98QK16k34J93n2
6967G6r1N8k60J06K32k59K58j6j2LJ28j54k8j46K38k0l31R5Q1L90n77R2K91k74
6991a20K97j87j3K45k80J5N8j75P9K01m25K57j24L24k45L73m83K96k41K00k5j63
7013a36J77K3j13J33N9k0J43l34J01rM2j25K94k55l15K29l6P3n3K04k23K15o0
7036A4o5P1l6m0R9N8j74J65k31P4K49l06N7J89j3k58J48oj6p6J23J54k36j71L3
$$ plain form
6872 101 -29 87 44 -178 68 256 177 63 204 72 -24 -115 67 121 237 -33 266 86 111 -36 -129 159
6894 159 171 181 291 -83 98 14 72 18 -8 -2 176 -75 -111 140 -22 -85 116 31 -141 -167 199 112 -286 222
6918 222 -71 142 62 93 -164 -26 16 -245 -75 139 -136 163 155 158 -153 -125 -78 53 119 119 182 -102 68 -1 63
6943 63 51 234 5 -66 -147 -225 -140 14 -74 177 74 -75 355 -15 -203 30 35 -253 -55 -47 169 -65 128 76
6967 76 -15 43 -217 -111 121 -138 120 104 92 95 223 69 41 -105 133 113 -218 -123 -42 348 -229 -137 154 -120
6991 -120 177 -10 -23 222 -58 -43 15 -160 -81 120 -305 -48 -172 152 -93 280 -203 93 -148 52 27 -136
7013 -136 41 64 -49 84 143 123 266 -68 33 24 66 -59 235 -20 -335 -106 -142 -69 -122 82 -141 74 14
7036 14 -51 20 -16 -56 43 101 -73 92 -139 -65 184 -122 -65 124 111 -147 1 -5 -21 -97 26 180 -56 -227 -194
7061a94M28l12J28J8j84J33n0j48J77m3J93k07J39j59K96Q4k85m3q4j72L01j47
7083a31K26j4j0P5k0k26R1j26K67m9J26o1k46P8q5J32j81L09j91o2J15M9q6k04
7107b24L13Mj29J68K7j21L35m04M8m6J12M0l91P3L41j40j47Q1N8J1O1R6l12J23
7131b3J79l36J40k20J67l0M00k07k7J45k48k64K50N6J64J5l96M90P2m84J65n4
7153d6J87k61J2O4lj9p4K81n44K93J99L9m4K38l97QK4R7j63K7n9K63n43N79O9
7178B27k12L5J39k18L44m45J23M3j30k75N19m15K29J78o4j48k26M03J32pk46L26
7200C12k7l21PJ10o8J21r8j3j65q4K99j4J7j15J17j11J73j34J5j68L34j93j53
7223a59j29M98m23J65K42l08j7P8J28k57J88N1m08K77N5k61K99NK18o3J3j31l29
$$ plain form
7061 -194 234 -78 50 68 -116 17 -33 -181 -4 -47 146 -61 78 -81 215 299 14 -29 -113 -285 16 -131
7083 -131 95 81 71 146 126 -100 -9 -135 132 83 209 148 -98 -20 -105 27 -154 155 -36 -98 17 66 -20 -224
7107 -224 89 93 -36 132 159 38 373 -31 17 -29 83 123 -268 -195 146 6 -141 -60 -2 9 70 166 -146 -23
7131 -23 156 -180 -40 -260 -93 -123 277 70 43 188 -60 -324 -74 -18 146 161 -235 255 327 -157 8 -46
7153 -46 141 -120 -108 -44 -47 -66 -140 141 -403 -110 89 128 84 322 -75 -67 -43 54 -109 -82 -141 122 -421 158 227
7178 227 15 50 189 -29 315 -130 -7 36 -94 -369 150 -265 -36 142 78 -70 -296 107 239 232 -14 312
7200 312 285 -36 -29 81 13 134 36 23 -142 -226 73 59 76 -39 78 -33 140 6 21 -147 187 -6 -159
7223 -159 -288 210 -213 -48 194 -114 -131 -53 75 -182 6 57 -351 -74 -19 -280 19 24 242 179 192 61 -268
7246b68J01J74J02r3q3M71p15M46j49J51qK1q0L4j37J65j57L0J23j47j66L98j90
7269B3l41M9K04k8L50j95J05j82J78J62j49j80j54QM35l49k0J17r6J83l56J87
7291d9L34l2k31O7ql45L58m3n7l6n5K56k19j07K40j75K46k67p3M97j59k94K01
7314D9j35K64j25k21J2m2J59J46J06k69K1j53J63q2L28k21jk56N13l26j9J14j02
7337g7J22j60K8r8K59l1L06l41j63L5K35n20J29K89J42j47J34Jm74N06L4k55p0
7360a16K82j23R2k28M4j2l0M4J18j37n1K25m5J14Lj81j8N2m6p5K13l65N22k58
7384B4J01l39o0K26J03p8n8k8K21n3J30j08lK04j45j0k24L74k25o2k45J09OR5
7408d5J46k40m0L71k6k65Q6j6M6K21m17J22K87k47J29q5K39o0k16k8p2J92j23
$$ plain form
7246 -268 -167 7 109 16 -67 404 -311 135 -14 137 129 150 70 104 -33 132 -25 5 128 -19 -185 213 23
7269 23 -318 -269 -65 -93 257 62 167 -15 163 325 176 -4 -158 -150 285 -64 -84 33 -63 120 -236 -49
7291 -49 285 253 22 89 81 -264 94 51 -6 -42 -97 159 -60 -167 73 -102 144 -123 -196 301 142 -152 49
7314 49 -86 178 53 -168 -156 -198 -39 107 213 -56 -35 -188 -25 -107 221 0 -1 -257 256 -70 -89 25 -77
7337 -77 45 -115 -87 -185 74 43 349 8 -155 -120 115 -405 -276 13 155 8 142 143 -331 175 209 -46 -116
7360 -116 166 43 135 -93 -49 -61 -91 -47 71 -66 -117 108 63 177 180 -1 -19 33 -13 -88 125 -240 282 24
7384 24 125 -214 -274 -48 55 -23 -81 -109 112 59 189 81 78 282 137 127 -97 277 52 -10 -255 -146 -140 -45
7408 -45 101 -139 -179 192 166 -99 -13 -29 17 238 -179 -57 230 -17 112 27 266 206 -10 -38 -110 82 -41
7431d1j73J09L55m02J16j90PK07K18j01M5k28J98j41J22k21K74k08J20K36l38
7452c6k76M46k5l20J03L44k32K7j13J20P1l04L59p9j94k1l1J68L4K14j34l9k01
7475a19m7K14K3J72l25J48j59J32K25l25P7q2o0M04j16j00j19L25l22J87m9K9
7497A13K38k63l2j54o1O9n7L88k66J43l48M26j72j02L01j20k66K14OJ11o9k99
7519b00K30J4L4j57K02j48m1Q4n6K76kr7n1j96R7L4P6M1j42Q8j88J0J58J27j09
7544H4l14L65j26J33p8k19L24k09j55M11k18m9l0J18oJ2j33n0J65j99O8j46J48
7567a04J29j34J12R5k10J18O3J52l97K09j49J37k19K84o6Q9j14j61J41J42o7l8
7589A2q0J68j06J67q8k37J86J47l51J66J39K18o22K28j44J48k23K91k47K10L6
$$ plain form
7431 -41 -214 -105 250 -152 -36 -226 -219 -12 206 105 150 -78 120 -21 101 -120 154 -54 66 302 -36
7452 -36 -312 134 109 -211 -108 236 4 31 -82 38 109 -195 164 85 -109 -130 -161 7 41 255 121 82 -119
7475 -119 -166 48 71 243 -82 66 -93 39 264 -61 16 -66 -126 278 162 62 -57 268 -54 133 84 113
7497 113 351 88 56 -98 -159 -90 -147 241 -25 118 -230 196 24 -78 223 103 -163 51 57 168 99 -200
7519 -200 30 44 78 -79 123 -25 -66 18 -38 238 236 139 88 -108 -11 23 99 140 -2 86 -102 -92 66 193 84
7544 84 -230 135 9 142 64 -155 169 -40 -195 216 -2 -51 -81 37 31 43 -90 -140 25 -174 -106 -252 -104
7567 -104 25 -109 3 98 -112 6 69 221 -176 33 -116 21 -198 86 20 109 -5 -166 -25 117 50 12
7589 12 -68 100 -6 161 73 -164 22 169 -182 -16 123 341 -281 -53 -197 -49 -272 19 -228 -18 18
7610A8J8j62K45r5j05J14j04J3r4QJ16L43l37J55p6J9k60K28p3j59K1J78j53J26
7634a6K39m02P3j92N46l91L1O5K17j77j35L06k15K05j3J44j99j72M3j99Q3J88
7656B9K37j54N3j69J24j97k82O25n41J74J00J4N6K88l55m2L27k74L47n04J03O
7678c5j58K93j79l2N29m05J13k34J54m5j14J99q5j70rk12L06J7K81J61k97k02
7700a24J60o4J82K5l23K24j2j19J56j01j01M02l59R4j59J84J53k98J16k5L5L2
7722G8K5j12r9kJ23j9p6O3o4Pk5m0J29k07L85l20J42RO2j23L68k46j95J94r2j06
7748a41J35j57K6L20l71K7J94J0N5k60K2k47K46K31J75k26J07k18j38J42L33l68
7770a03K28%P7j10j14j1j9j8m9M3o0K4j9L79j91m50K54J36K7j14J48J01n00L61
$$ plain form
7610 18 36 -126 119 24 -81 33 -71 -58 -152 -144 -28 315 -22 133 57 76 -184 44 -29 -188 -167 11 -142 -16
7634 -16 223 -179 -106 -298 248 -143 -112 -47 170 -7 -142 164 -51 154 141 285 86 -86 -43 -242 -159 29
7656 29 266 112 165 -4 120 -77 -359 266 -275 -101 -1 13 69 357 2 -40 287 13 360 -144 -41 -35
7678 -35 -193 100 -79 -111 418 13 126 -108 46 1 -113 86 1 -169 -178 -390 -84 -67 214 375 78 -124
7700 -124 36 -28 154 179 -144 80 68 -51 105 4 -97 305 -54 40 -119 65 218 -80 36 11 46 78
7722 78 103 -9 -108 -110 13 -6 -82 -19 -83 -76 -101 -141 -12 -219 166 -154 -12 -3 59 -64 304 58 -137 57 -35 -141
7748 -141 -6 -163 -137 183 -188 -161 33 43 98 -162 -140 -387 -141 90 265 39 146 -72 -210 -68 265 -103
7770 -103 125 125 202 92 -22 -33 -52 -70 -119 -76 -136 -112 -131 248 57 -393 -139 -3 24 -90 58 159 -341 20
7794B0k01J95j01K70J5j02p8J00k10K69J01l84R7P8j32K24j61n2M7mP1n1L4j69
7818a24J06j3j11K8K5J54p0p1K95p9l74K10J38j87j21l6K38K58l63K1K19k60J96
7841G9J56j8k46j8l1L89j2l92r2J2J89j36N5j24J08j55o1N51j84k1j1l3R9j83
7865g9K33j06N9L5k81J95k27m3J83m3R8K9J08j54l5K42l29J20J16q8pJ53k61L25
7889B43j16J8R7k31M6J5j12J48j76RK52m72J29Q1k73O24l03J79j19j10L37q0p9
7912A07o1kj54M5M0J41p6J2j66J03o0m3n9L10j83n0m7L02j72j09Q3J14m4j88J20
7937c7O8k72N10m28J51r0p2L60j30L1n12K65K47J5k69M4J73n3j00K54j73j6J44
7960A10jj57q7K3P7K0Pp8J46p5K63k53P7R6j28l4k75J52l29M12j67J43J88J16
$$ plain form
7794 20 -181 14 -87 183 198 96 18 118 -92 177 278 -106 -9 69 -63 161 0 -52 -5 -9 62 11 45 -124
7818 -124 -18 -31 -142 -114 -89 65 -5 -76 219 140 -234 -24 114 -73 -194 -230 8 266 -97 -76 143 -117 79
7841 79 235 217 -29 -47 -78 311 299 -93 -185 -173 16 -120 -65 -189 -81 -236 -297 254 70 49 38 5 104 -79
7865 -79 154 48 107 142 -139 56 -171 -214 -31 -74 24 53 161 7 -28 214 -115 5 121 33 26 179 -82 243
7889 243 127 145 242 11 57 72 -40 108 -68 -59 193 -279 -150 -69 -342 282 -21 158 39 -71 266 186 107
7912 107 46 44 -110 -65 -25 116 40 52 -114 -11 -71 -114 -173 137 -46 -96 -143 159 -13 -122 -39 75 31 -157 -37
7937 -37 31 -241 269 -159 -8 -98 -170 190 60 91 -421 -156 91 106 -163 -119 54 1 -99 155 -18 -34 110
7960 110 109 -48 -135 -112 -35 -15 -8 -86 60 -15 248 -5 72 168 40 6 -269 -117 -446 -34 -201 -58 130 246
7984B46m2j37j14j09J23J42J0l3p2j18mk4J42M0P2L3l03K31k24J43R4k53J38j46
8008a65L80Qk63k75J13K89j84K12p8l5L52m33L70j04r4n4k7j89L10k23k66N13
8030A57j15j61J46n0j2j4L1R1J4J87j29P1k67M9K26k80K02l6j32J29j16Qk05J20
8054h6J91k49K26j43r1K15k4k0K94l08Nk6r9J97j12J91j33LJ22l7J46n47L24K41
8078B80k16k56K08j57L35J43l47j04n1K69j17J24l1J25k29p1j02L28l2L1j52j07
8100a29m3J87M6j54L42m50J11K90k23K4J85j13k3j13J26L5O9j96L9j12P5J4M0
8123B7O8j88J24k70L58m5j15NK09l27M09k95J07l27J39j52L72Pj78K6M0J49j79
8146c6LJ6J0r3O8L2j19J41N1j29K88n9q2J95j52l14K68n2K73l85j09Q3Q0N1J36
$$ plain form
7984 246 204 67 -47 -156 -33 109 119 86 14 -104 -108 -132 10 50 122 155 -148 83 -141 2 96 -157 -19 -165
8008 -165 215 223 -40 -315 -202 87 -97 115 37 2 354 -79 291 187 93 39 12 -177 133 -90 -356 157
8030 157 42 -119 27 -23 -35 -49 -18 73 87 274 145 216 -51 -2 224 -56 146 110 -22 107 -9 -1 -206 -86
8054 -86 105 -144 82 -61 -152 63 39 19 313 5 10 -16 -115 82 -30 161 28 31 153 116 262 -285 39 280
8078 280 64 -192 16 -141 194 337 -10 -114 -165 104 -13 111 80 205 -24 -95 -197 131 99 130 -22 -129
8100 -129 -172 15 61 -93 249 -201 -90 200 -23 1 186 73 50 -63 63 98 167 -29 10 -102 -27 -13 27
8123 27 95 -93 31 -239 119 74 -41 -36 173 -154 255 -40 67 -260 -121 -273 99 106 -72 -46 -6 143 -36
8146 -36 -33 -17 -7 -100 -32 0 -119 22 73 -56 232 173 91 286 134 -180 88 36 309 -76 -185 -102 -22 29 165
8171A65j47l09M01j20j81J12J49l1k81L72rj99J18j15J30p0M45m32R3k43
$$ plain form
8171 165 18 -291 110 -10 -191 -79 70 39 -242 130 121 -78 40 -75 55 -15 430 -2 91 -152
8191a52
$$ Imaginary data points
##PAGE= N=2
##DATA TABLE= (X++(I..I)), XYDATA
0@%%%%%%%%%%qJ6j6J6k4L2l5M3n6P2q4R4j14J36j60J87k15K52k90L30l79M35m96
33b64N62o34P14q04R01j007J126j255J394j547J715j897K096k315K556k817L103
50A627l418L765m151M579n054N589o198O894p700Q646r773J1140j2844J5042j7991
65i847K2183k8653M0049o5991K34169J724m26272Q4157J17216M9076J6231M198
77C8240o1443O1723K1965j44762j43207J07215J69626J10870J5013j61595j92246
88a78601P5971J38064O341j6796J3565K1660N4052l8227j46860r5291O7244J50010
100E1132Q3466o3078j44322o9469R5531Q1783n4821l0053N5250O1297N1111o5877
112E1950j63617k0410J35933J00306O237o5000p9218n792O0648M364r2067k9006
$$ plain form
0 0 0 0 0 0 0 0 0 0 0 0 -8 8 -8 8 -16 16 -19 24 -32 40 -44 50 -64 72 -88 99 -116 136 -154 176 -203 232 -264
33 -264 298 -336 378 -426 475 -532 594 -661 733 -814 901 -996 1100 -1215 1341 -1476 1627
50 1627 -1791 1974 -2177 2402 -2652 2937 -3261 3633 -4067 4579 -5194 5946 -6898 8144 -9847
65 -9847 12336 -16317 23732 -42259 191910 193634 -232638 -148481 -31265 17811 34042 38240
77 38240 -23203 38520 60485 -84277 -227484 -120269 49357 160227 175240 13645 -178601
88 -178601 -102630 35434 41775 24979 38544 60204 114256 76029 -70831 -166122 -98878 51132
100 51132 134598 71520 -72802 -142271 -46740 35043 -19778 -49831 5419 66716 117827 51950
112 51950 -111667 -132077 3856 104162 110399 45399 -33819 -39611 21037 25401 -66666 -95672
124i5672R8898O9184j3029o4877j09549p959J33243P9769l8730n8677p853M5194
136B9942J9072n4796o4714J2957J09382P8069o6180j13608m5009L8828P9716J8091
148D1750n4801k7607L0256M6807j1685q5066k8835P6323Q5190K5108o2076q7406
160e2042o25O4428L3480k7942m3322J4330M9084N708m5528o8011j2570Q4535O6406
173F7931k4807o0690m0681K3591N8778M765l7989j7404L1608N7570o448p4510
185a8286m3312K9376O9543K8471n3652n5082L535M1022L3242l2547n2431J8420
197c1701N4214K5210k3725o2819j8414N7156N0240r597m9737k2928L5259L3577
209C6735q406m0131l5676L1764N7832q020m8693l2344R988N3342K5398l7158l9654
$$ plain form
124 -95672 3226 72410 59381 -5496 -115045 -123004 10239 90008 51278 -7399 -15252 29942
136 29942 49014 -5782 -70496 -57539 51843 129912 63732 -49876 -94885 -56057 23659 41750
148 41750 -13051 -40658 -10402 36405 24720 -60346 -89181 -12858 72332 97440 35364 -52042
160 -52042 -52667 11761 45241 17299 -26023 -11693 37391 43099 -2429 -70440 -83010 1525 67931
173 67931 43124 -17566 -58247 -34656 24122 28887 -9102 -26506 5102 62672 56224 -18286
185 -18286 -61598 -32222 37321 65792 12140 -42942 -39407 1615 34857 2310 -50121 -31701
197 -31701 22513 47723 23998 -38821 -57235 -79 50161 40564 -9173 -32101 3158 36735
209 36735 28329 -11802 -47478 -15714 42118 34098 -14595 -46939 -36951 16391 41789 4631 -35023
222c5023O542M7546K5770l6912m1375K641M0185M0422k1487n3148m865L1664K6735
235B8695o053m3881j8622L2022L3161P42l8834l2705K6858M5555J0109l1921m0362
248c5236J1935M5843J1128k5940l4736j148M6041K4160l0266l7134q404L2992
260g65L4435j8695m0683j0652K9673L9280j1003m3197j0225K6684L5563L392m4079
273a0272k4602K4828L2114Q028k8549l0634J2653L1115J2159k0346l6776L123
285b7159L6595J4666j5542l0214r029L5329K6673j5434l0867j4175K6954L2694
297C0491r265l0592j6908J4603L6248K570l4174j8672J0914K9407J1700l0263
309c941k5157J0310K8608J9346k1000l3174O365K8118J6513j2143l3033m331K9793
$$ plain form
222 -35023 -28481 19065 44835 7923 -33452 -30811 9374 49796 28309 -24839 -29704 1960 28695
235 28695 22642 -21239 -39861 -7839 25322 26064 -12770 -45475 -18617 26938 37047 5126 -35236
248 -35236 -23301 22542 33670 7730 -27006 -28154 17887 42047 11781 -25353 -33757 -765
260 -765 33670 14975 -25708 -36360 -6687 32593 21590 -21607 -31832 -5148 30415 33807 -10272
273 -10272 -34874 -10046 22068 30096 1547 -29087 -16434 14681 26840 6494 -30282 -27159
285 -27159 9436 24102 8560 -21654 -30683 4646 31319 15885 -14982 -29157 -2203 30491
297 30491 21226 -9366 -26274 -11671 24577 27147 -7027 -25699 -14785 14622 26322 -3941
309 -3941 -29098 -18788 9820 29166 8166 -25008 -18643 9475 25988 13845 -19188 -23519 6274
322F274J9697q495l1041j4895K7067K5878n749k5477k1587J5227L2317j110k4047
335e941j6799J1117L2299M618k8118j8664O334K8281J4589k4451k3303M976K0115
348E053J7770j2086k6815j041J8419J7373m841k9610r191K1766J9629J259k1707
361d022j7123J6318K1522m24j7822j8631J0181K5579J938j6494j9792N1K8570
374I851J4473j8008k1684m363K1002J8596j4148k1480j755J8207K1275r030k6139
387a3203k990J4641J6766J376k3469j2500J3899J7659M288j9448j7939J3267K0353
400A2700M584j4813k2588M095K4140O786j1252j6183j489K0633J0349j1421j4827
413i286o144J5635J7579q989j7950o360R678J9602j006j9922p508Q390J7381M083
$$ plain form
322 6274 25971 17476 -13565 -28460 -1393 24485 18736 -6741 -28328 -13101 19216 18106 -5941
335 -5941 -22740 -11623 20676 25294 -2824 -21488 -15154 13127 27716 3265 -20038 -15062 5053
348 5053 22823 10737 -16078 -17119 1300 18673 13832 -15778 -24969 -3203 16426 17685 -4022
361 -4022 -21145 -4827 16695 16271 -1551 -20182 -10001 15578 17516 1022 -18770 -18719 9851
374 9851 24324 6316 -15368 -19731 1271 19867 5719 -15761 -17516 691 21966 12936 -13203
387 -13203 -16193 -1552 15214 16590 -6879 -19379 -5480 12179 16467 -2981 -20920 -7653 12700
400 12700 17284 2471 -20117 -16022 8118 14904 3652 -12531 -14020 6613 16962 5541 -9286
413 -9286 -15430 205 17784 8795 -9155 -15515 -5837 13765 12759 -7163 -14671 -6281 11100 15183
427A5183k0111j2046Q833J4615R396j0336j8741K338J5264R249o447j8690m13
440a1906J7146Q776n475j8891q417K0046J4739p615j4347r268J0520J7605k513
453A0400j4703r251P468J9362j44j5595q861K107J5552J0578j5066j3973M523
466g603J2550Q163j0897j5294L771J3096Q443n247j6931k590J3748R118n45j2948
480c166r468J0807J0627p88q963j1395O922J6327o87j0200r562M79J4648N538
494A1119j0566j0427l32J4561Q802j1684r871M58P811J3478m080j7524k785R798
508a242J0071o1j3836n397Q855R624J857j3105j0156J0458R835K99p189j1461
522a1448M044J4361K989q286j0225K88J3949M795q571q383l049R704J0783o604
$$ plain form
427 15183 -4928 -16974 -8141 6474 15870 5534 -13207 -10869 4395 13644 7197 -11493 -11906
440 -11906 5240 14016 8541 -10350 -18767 1279 16018 8403 -5944 -15212 -4692 12913 10400
453 10400 -4303 -13554 -6086 13276 13132 -2463 -11324 -9217 6335 16913 1847 -12126 -7603
466 -7603 4947 13110 2213 -13081 -9310 3786 12229 6982 -9949 -12539 1209 10327 9782 -3166
480 -3166 -12634 -1827 8800 8012 -951 -12346 -5424 10903 10216 16 -9546 -9067 5581 11119
494 11119 553 -9874 -10206 4355 13157 1473 -8398 -7940 -129 13349 9269 -8255 -11040 -1242
508 -1242 8829 8768 -5068 -10465 -1610 8014 9871 -3234 -13390 -2932 6903 7202 13 -11448
522 -11448 -7404 6957 9946 1660 -8565 -8277 5672 10467 1896 -6487 -9536 168 10951 4347
536D347j0194k367O987J0322m652j1129l53M509P598K718j1405n717O628Q011
550E303M202q107j0397K987R403N592n657j2537J998J1743K191l145q132m697
564i253R839P204l970p947n057Q155R965m133p636m514L520J2583p4j2197m536
579h051L721R686L866r954o442L495O665N067p389q807L677O027M265j828r595
594e597q17R117M804k706q834l493Q948N040k682n536n812N471Q949j949n162
609b59m618k26Q843J902o324l885k53P049N331o651n281P18M816O885m523r500
625e976Q21N240N715j62r556k559O635M517P89p294o112N142O431J155m625p350
641g189M550Q481j179l895n038m56Q981J839o603m251k25O620M998n004n249j403
$$ plain form
536 4347 -5847 -8214 -1227 9095 4443 -6686 -7039 -2530 5068 7786 -3619 -9336 -2708 5303
550 5303 9505 1398 -8999 -6012 3391 8983 3326 -9211 -7213 4530 6721 3576 -4556 -9253
564 -9253 586 7790 3820 -4127 -9184 -1029 8936 4803 -2833 -7347 -3827 8756 8682 -3515 -8051
579 -8051 -4330 5356 9222 -732 -7174 -3679 2986 8053 664 -8143 -4466 1561 5826 3998 -5597
594 -5597 -6414 2703 7507 4801 -4033 -7526 1422 6462 3780 -1756 -7568 -2097 6852 4903 -259
609 -259 -4877 -5103 3740 5642 -682 -4567 -4820 2229 7560 909 -4372 -3654 1162 8047 3524 -5976
625 -5976 -5155 85 5800 5638 -3918 -6477 158 4675 5464 -1830 -7942 -2800 3631 4786 161 -7189
641 -7189 -2639 5842 4663 768 -4270 -4726 4255 6094 -509 -4760 -4985 1635 6633 1629 -3620 -5023
657e023M316O565k959p340L52K244M652K362p108k924M654L595J133n720m091
672e292M335L521R68k447o720J830O384J227j623n185k840O603M077l399l859
687b420l053N033N759l022l750k413J810O891j000o743p97J759N109J769o884
702a952k930K725M116L191m136o438K611M576K684j962o581O80N848O38p72n013
718b715j468N844J695j825k627k729L225N126k317l433k895J784O012p1m461j570
734b425j58M201K993m604k523R13J861L301k409m086J165K127K697M3n744r56
750c604M140J777M61m085l624M788L971p97k896m250K896M571j499j579l270l17
766c317M979J575l068k256m05M093K782m562k889P34K035M275k388m825J402K587
$$ plain form
657 -5023 -707 5858 2899 -4441 -4089 -1845 2807 5169 -1939 -4863 -209 3386 4519 -1201 -5292
672 -5292 -957 2564 3532 1085 -5635 -3805 2579 3806 2183 -3002 -5842 761 4838 1439 -2420
687 -2420 -5473 -440 5319 2297 -1453 -3866 -2056 4835 3835 -2908 -3705 -1946 3163 4932 -1952
702 -1952 -4882 -2157 1959 5150 1014 -5424 -2813 1763 4447 2485 -4096 -3416 2432 3070 2298 -2715
718 -2715 -4183 1661 3356 1531 -1096 -3825 -600 4526 2209 -1224 -4119 -2335 3677 3606 -855 -2425
734 -2425 -2583 1618 4611 7 -2516 -1603 258 3559 1150 -2936 -1771 356 3053 3096 -2648 -3604
750 -3604 536 2313 2774 -1311 -4935 -147 3824 3027 131 -4119 -1223 3348 1849 270 -3000 -3317
766 -3317 1662 3237 169 -2087 -2492 1601 4383 -179 -3068 -2334 -299 3976 1588 -3237 -1835 752
782G52K213j82m712r66K615J102J411l018k819L097J797J94m84l473J025L737
798B289p15j388k612l72M516O65j986j252k004K747L613k378k322j612R03M358
814B450m74l630n39M69L500J328m341j405K060J569J356l074k702K703K215Q59
830B344j287l998R65L164P01m84l081j644L754J801j471j435j823K862K640k399
846F09j748l04P33L152j118l000P29j36K397J166l007j255R31J092K383j890l153
863b419J572J127J357j43k860m06K069Q30K60k093j387K458R87k84o72l074J840
880h38L393j169j606j736L43L503M15k452j079o18K613J862k889j132Q10O07K493
897B520j661k555J044Q32J831n01l562M58K078N09N78k425j398K468J371o64p19
$$ plain form
782 752 2965 2783 -1929 -2895 -280 822 2233 -785 -3604 -507 1290 1484 1000 -2473 -1448 2289
798 2289 1574 186 -2426 -2798 1718 2383 397 -855 -2859 -112 3501 1123 -1199 -2811 -1908 2450
814 2450 1976 -1654 -2193 -1724 1776 3104 -1237 -2642 -582 987 2343 -731 -3433 -730 1485 2344
830 2344 1057 -2941 -1976 1188 1889 1405 -1676 -3320 434 2235 764 -671 -2494 368 3008 609
846 609 -1139 -1443 -710 2442 1324 -1676 -947 -1083 1314 2480 -527 -1782 -851 241 2624 734 -2419
863 -2419 -847 280 1637 1494 -1366 -1772 297 1127 1387 -706 -2093 365 1352 1068 396 -2678 -838
880 -838 2555 1386 -220 -1956 -1613 1890 2305 -147 -1226 -1844 769 2631 -258 -1390 -580 27 2520
897 2520 859 -1696 -652 180 2011 1510 -2052 -1594 484 993 1571 -854 -2252 216 1587 923 204
914B04j863J004J912j237j69o48n64K355M17j499l52q20J534J409j689r30n97
931a533R51K620j199k191L93L17J613J071k878n32P79N96J558j262k091J289J137
948F38N94o54k763R60K471o02n94j522l83L126Q3j170n93j416J510K112j477j043
966g23l22L74K323p33j584L54l16J979K4k598K3J335J68P97j152j167J206M66
984D54M06n5j675j0J055L24O58j415j554K512K0k66K1j912J232J322r26l12o08
1003g29j10K153k35j558m83o2J496J446j855o36j4L13K262j088k196Q65K31J350
1021A150k60k252L46J789L04k86j563k25J174N07m19l27j328Q88J602n44n39j020
1039a003L51J545j62j047qo02J064O19r99o9P02q8R55j187r57J026k99O90L43
$$ plain form
914 204 -1659 -655 1257 20 -149 -797 -1361 994 1411 -88 -440 -1260 274 1683 -6 -936 -1533
931 -1533 -582 2038 839 -1352 -959 -642 971 2042 -836 -1368 -589 7 1565 303 -1788 -499 638
948 638 1232 578 -2185 -1225 1246 644 50 -1472 -1855 1271 1354 184 -409 -1825 -315 1797 320 -723
966 -723 -1045 -671 1652 919 -665 -311 -627 1352 1376 -1222 -1199 136 304 1101 -51 -1218 -12 454
984 454 860 805 -870 -880 175 499 1157 -258 -1812 700 720 454 475 -1437 -205 1117 191 -121 -729
1003 -729 -839 1314 1079 -479 -962 -1024 472 1918 63 -573 -587 -274 1988 900 -1296 -431 -200 1150
1021 1150 890 -1362 -1016 773 1077 791 -772 -997 177 684 265 -62 -1390 -502 1100 556 17 -1003
1039 -1003 -652 893 731 -316 -324 -926 138 757 -242 -311 391 303 1258 71 -886 140 -159 531 874
1058H74k280M90N37J265P04j366j742J369J8P33k54j675R49O71m65Q29m05j259
1076a007J641J92n98p54l65J499R54j932p28J58N89J668l86j803N55n6R33L94
1094I54k092Q29P41m54J087j794l79K181j046o30O05j207O71J268l27m05m84O90
1112B08R03k32j090J40j062N91J084J33q59n5l79J038j52o25M09p57J005N73j004
1131a31o20M84J96J021j057l97q8R15O35l98q41J78R36j055J282j693k56J504
1149F15n35N4j83l90N98J115j664J63l49J235M14j235L70q42M10M75L89j262Q95
1168B73l06Q7O58j42j475R05k54N26L07p01l6J44l25R28q06j44N35M22m77N83
1188G02j356J61Q17m86Q76j252n56J431J23n85K85p67O50M91p87K25m44M49O06
$$ plain form
1058 874 -1406 -916 -379 886 1590 224 -1518 -149 -131 602 348 -1327 -378 293 -172 657 252 -1007
1076 -1007 634 826 228 -526 -891 608 1562 -370 -1098 -940 -351 1317 931 -872 -317 -373 560 954
1094 954 -1138 -309 432 -22 1065 -729 -1108 1073 27 -603 2 -1205 -534 734 407 2 -482 208
1112 208 1111 879 -211 -71 -1133 -542 542 675 -184 -239 -618 420 268 -357 52 -705 300 873 -131
1131 -131 -751 -267 -71 950 -107 -504 -592 323 958 560 -281 -103 833 -222 1060 -633 -889 615
1149 615 80 134 -49 -439 159 1274 -390 -227 -576 659 1073 -162 208 -634 -224 251 640 -622 273
1168 273 -33 54 712 570 -905 0 -254 272 579 -122 -158 -14 -339 589 -217 -361 174 596 119 702
1188 702 -654 -493 324 -162 714 -538 -1094 337 460 -125 160 -607 43 534 -253 -28 -472 -23 583
1207E83n05p83L94j76R27J46j628N75M94J11K62l68q14J044m16J93j86p46J183
1226B90ll86L60l52k66P85m10k46J45n20R87K85p78j69K42l18R70o04o17P94p00
1247e11Q19R0n76O68o92k36J000n50k91O44m18K46N4r18N43R2M75J17j166k81
1267h91J377l16k4k0p11N89N61m91M9o7m13R89m69m37O8J69O49K69j432L04L11
1288F4n8M31p85j35N83r6L46M3p26K63J45j56M67l28l84N42k20R6Q7o73M89M11
1310D06l97j16r9k15R00m06j57K98r85P76O14o68K74m25j16P20k36o73L54K87
1330A36K86J12j038L97M50k91K82n84n96P98M48k80J22o81P52j16l98O40q24p0
1350d55Q82l18m99M33l75Q73n2q23J02K10j09L63n19P0L43o33N05M77p44p4L87
$$ plain form
1207 583 78 -705 -311 -487 440 586 -1042 -467 27 138 400 32 -782 262 -154 39 -147 -893 290
1226 290 287 -99 261 -91 -357 428 18 -228 -83 -603 384 669 -109 -278 -36 -354 616 12 -605 189 -511
1247 -511 308 398 -178 490 -202 -438 562 12 -279 365 -53 193 247 -671 -128 -36 439 556 -610 -891
1267 -891 486 170 146 126 -585 4 565 74 123 56 -357 632 163 -274 -206 -37 612 881 -551 -247 64
1288 64 6 437 -348 -483 100 4 350 393 -333 -70 75 -81 386 58 -326 216 -4 92 179 -494 -5 406
1310 406 9 -107 -206 -421 479 73 -84 214 -771 5 619 -49 225 -200 -316 404 168 -505 -151 136
1330 136 422 534 -504 -107 343 52 334 -250 -846 -48 400 120 242 -439 313 197 -201 439 -385 -455
1350 -455 427 109 -390 43 -332 541 489 -334 -232 -22 -131 232 -287 -217 126 -507 -2 475 -269 -343 44
1371D4N0L60k83o68O73m60M95J77n15L84k56j70N46l44p18P84J47j83J98r40P32
1392E3N84o94nk80R7N61j67l98L29m2L25J15n03j00K22o5N17q16J18M10k53L89
1414C97j56n88M55K78k38J02m22J71K21l20J48%k85RJ72m23P95k84p4L96l82q4
1436a12L33m72J55M97l51K23n4k12J78j24l78N29m84O50K82q13j8J90J31M84o44
1457a0k29L24MQ4m50j19O24p1q2k17k77J80P24n86K69J22m84L04N0k06j13n0l5
1480b44L56j61l15Q90o15L83j23m85L16J81m39N8m0J77K03n50N34P3l18k64M25
1501D2k49M32m37L3N26l10J20J54m64J94Q9o69P56l31k63Q12q9k54p7j18J56M02
1523D55p29L40j45k07N81l10j51L04j12K00j43k35L5J74p8K86o65J13K80o0L9
$$ plain form
1371 44 94 454 171 -497 176 -284 211 388 -127 257 1 -169 377 33 -685 99 246 63 261 -679 53
1392 53 637 -57 -62 -342 -245 316 149 -249 80 38 363 478 -25 -125 97 32 549 -267 -149 261 8 397
1414 397 241 -347 108 386 148 250 -172 -1 220 -100 48 48 -237 -228 -56 -479 316 32 -42 354 -28 -112
1436 -112 221 -251 -96 401 50 273 219 7 185 61 -317 212 -272 378 660 -153 -171 19 150 634 -10
1457 -10 -239 85 89 173 -277 -396 228 157 75 -142 -419 -239 485 -101 168 290 -194 110 160 -46 -159 -209 -244
1480 -244 112 -49 -364 526 -89 294 171 -314 2 183 -256 -198 -238 -61 142 -408 126 199 -119 -383 42
1501 42 -207 225 -212 -179 347 37 157 311 -153 41 130 -539 217 -114 -377 435 346 92 15 -103 53 455
1523 455 -274 66 -79 -286 295 -15 -166 138 26 226 83 -152 -117 57 -21 265 -400 -287 -7 -67 -28
1544b8J58m78M48N16q20L56k23j61L03k13J54K17l70Q7nl69N27N7pJ16k66k46
1566b47L49QK22j66m12J76L8o8M26j14m60K20q8L46q3l67J75J89k49L55m12n2
1588b14O95l38o3j73l5J38K82n86L29J4j82L00k29r8J49l81N57k79K5Q4q2Q4J64
1611A61l21J21L10n05K43J81k52J02L4k34L19j75l03M82J59r8l1l76jL95j66J49
1633A94k65p4L90l19n8K48j19J71j65m02M94k46m1M30l22J03o4J3J24Qk38P0K78
1656B10m73M08k26k48P83l74j1L07n90L66k56j22L57k57J83j81J37K05o6m82L83
1677E3L8k34P8M62l98O9J60j75l8O3j49J74l19J07J45k17J21M4j31K62nL2J33
1700B75n62L9L07r5M43n44J30L42l88m5J21k46N75l23l5K48k09m4K77j43k11L60
$$ plain form
1544 -28 130 -348 100 616 -204 152 -71 -232 71 -142 12 229 -141 -54 -59 -428 99 156 149 265 -1 -247
1566 -247 102 110 332 166 -246 -70 -32 -100 326 212 -248 -28 -116 230 147 -220 -45 144 -105 250 -162 -214
1588 -214 481 143 80 -93 -128 10 292 -294 35 49 -133 167 -62 -160 -11 -392 165 -114 -89 -5 -87 -3 161
1611 161 -160 -39 271 -234 9 190 -62 40 74 -160 159 -16 -319 163 322 224 193 -183 -184 211 45 194
1633 194 -71 -145 245 -74 -132 116 -3 168 3 -399 95 -151 -192 238 -84 19 -45 -32 92 100 -138 -68 210
1656 210 -263 145 -81 -329 454 80 69 376 -214 152 -104 -226 131 -126 57 -124 13 218 152 -330 53
1677 53 91 -143 -65 397 -1 68 228 53 15 78 -71 103 -216 -109 36 -181 -60 -16 -147 115 110 142 275
1700 275 -287 -248 59 -36 407 -137 -7 335 -53 -98 23 -223 352 29 -6 242 33 -11 266 123 -88 272
1722B72m35M46k90j88r1K82j55J39K68K2o3l31O8jJ87r6Q0j16R8J13k49L44l23
1745a9q6J39n5P2l8k65M83J5m04K71k46K6R7m56M88l14L20K5j70J19J5k9J49p4
1769F3k74L03k17lj22J49m0J76r4q9J55k13K50%l23K66m4J53j15J60l23M83n36
1792b35m1L25p7J4L54o13L77j9l46N17j58P9J37n66M31j73k3J67k93k80M73j60
1814a10J70J52l48l07L82k1j21L55l16O51o97K25J61j19l0L8k13L13k0j06o7o3
1836i1J26J70j87j09P3NJ86k98k04L91L8n6j00r6N9L76P5j28j38l00J62J82m26
1859b90M03j23J1J17kj38M74p24K82J51k37N2j3jL21m94L09j65PJ83j23j17Q5
1882c2k9N9j6Ll40N84l79j04L18k35J90k28M74l91J09k80O26l38J98j91R4o7Q0
$$ plain form
1722 272 -163 283 -7 -195 -286 -4 -159 -20 248 270 207 -124 -56 -57 130 34 114 -2 96 209 -40 304 -19
1745 -19 -105 34 -21 51 13 -252 231 246 -158 113 -133 -107 -10 -466 22 -292 28 53 -117 2 17 -12 137 63
1769 63 -211 92 -125 -128 -250 -101 -141 35 -59 -148 7 -206 44 44 -279 -13 -57 96 -19 141 -182 301 -235
1792 -235 -276 49 -28 -14 340 -273 104 85 -261 256 98 177 314 -252 179 6 -17 150 -143 -423 50 -110
1814 -110 60 212 -136 -443 -61 -82 -203 152 -164 487 -210 15 176 57 27 65 -148 165 145 39 -28 -91
1836 -91 35 205 18 -91 -18 -13 173 -125 -329 62 100 44 -56 -152 -93 283 358 230 92 -208 -46 136 -290
1859 -290 113 -10 1 118 116 -22 452 -272 10 161 -76 -24 -37 -38 283 -211 98 -67 -60 123 0 -117 -32
1882 -32 -61 -2 -18 -15 -355 229 -150 -254 64 -171 19 -209 265 -126 -17 -297 329 -9 189 -2 92 25 105
1905A05j72Q1j17J8M9m8K30J9q3L8q2J6K53o4l15N03n60M0J22k77K58j7q8J13
1929B2R9n5n9m4l4P3l84J42L85m03L63j41l46N07j01j91N5o7K64k31J47J05N4
1952A60j60j41K81j06J05j40p8K37m13L41J4j42O6j46j1L49k32J07M3l11m5J95
1974b7K63j53N2O5k97J24o5R6k66J41J69l9j5J50j28J1n7m15M20j54p2M75k27
1997E1j70K69l80L31j89M9pn8K42J58l85Q3O9N1j83o3R6K95m14J90K6j76J29J61
2021A75l11K87j54k33K91o1j25J48N8N9j54J9J15j25R2j08O9j10L39m31Q7J27
2043E4l22J59K32Q9k39r4J15j60J61J0j57j14M11m9l97N88j78J45l06l2K17k86
2065a53j72L46k06J71j34L53l28j10N25j33j38R7j05J70m6l9m2j02j01J27P0P
$$ plain form
1905 105 -67 14 -103 -85 -36 -84 146 165 82 120 38 54 307 243 -72 431 -129 -89 33 -244 14 -3 -91 22
1929 22 121 66 7 -37 -71 2 -382 -240 145 -258 105 -36 -382 125 24 -167 -112 -179 85 -146 1 106 160
1952 160 0 -141 140 34 139 -1 -79 158 -255 86 100 -42 24 -122 -133 216 -16 91 134 -177 -222 -27
1974 -27 236 83 135 200 -97 27 -38 58 -208 -67 102 63 48 198 70 81 24 -391 29 -125 -197 278 51
1997 51 -119 150 -230 101 -88 -39 -46 -104 138 296 -89 -6 63 114 -69 -132 -36 259 -155 35 61 -115 14 175
2021 175 -136 151 -3 -236 55 -6 -131 17 75 134 -20 -1 114 -11 81 -27 42 -68 271 -160 -73 54
2043 54 -268 -109 123 212 -27 -121 -6 -166 -5 5 -152 -266 145 96 -301 287 109 254 -52 -84 133 -153
2065 -153 -325 21 -185 -14 -148 205 -123 -233 292 159 21 118 13 183 137 98 56 -46 -147 -20 50 57
2087E7j32m1M31k91j51J02n7L16j62l41N55m00K46nn8k73K50j50p3M4L29p9K2
2110A39k55K82n4j61R2k5j56o6j58J33L65m60O38m90K51M5k36P8L8j13L08p6p5
2133D4J37n6m09J94J77k02N4r1K81k47J31k04K39l81N98l90J93n7j54k43K07J33
2155d6L84l34l4K3j01p2J79j91L81l07J00K90j72j94J10j78K63jk71M3r0L32j43
2178b9K70o5j46j88k19M62K4j91P4J31k24p3L58j52J17m39M39R2k65K02R4j96
2200G6r4j61N32k46m4L9n6J55l82Q6L1n3j82L91j34J19j15p7j17L64R2j03j91
2223g0J8J41J33l07L73m52K30K4l78K58j04N4J43k4j2%k44K83J51l28J15j03K77
2246A78O3m02K71j83J29j93J29J02j20Q6j95J40l6j22L61k77K7K63l63R3J98j24
$$ plain form
2087 57 -75 -116 315 24 -127 -25 -82 234 72 -269 286 -114 132 127 69 -204 46 -104 -177 -133 196 117 139
2110 139 -116 166 112 -49 43 18 -138 -204 -362 -229 136 -324 314 -176 75 120 -116 -38 0 -113 195 119 44
2133 44 181 125 -284 -90 87 -115 -61 -152 129 -118 13 -191 48 -333 265 -125 68 11 -143 -386 -179 -46
2155 -46 338 4 -30 -7 -108 -180 -1 -192 189 -118 -18 272 100 -94 16 -162 101 100 -171 -128 -218 114 -29
2178 -29 241 176 30 -158 -377 85 109 -82 -8 123 -101 -174 184 32 149 -290 149 241 -24 178 272 76
2200 76 -18 -179 353 107 63 102 46 201 -181 -95 -64 -117 -299 92 -42 77 -38 -115 -232 132 224 121 -70
2223 -70 -52 89 222 -85 288 -164 66 90 -288 -30 -134 -80 63 39 27 27 -217 66 217 -111 4 -99 178
2246 178 241 -161 110 -73 56 -137 -8 94 -26 60 -135 5 -31 -153 208 -69 -42 221 -142 -49 149 25
2268B5K6k08J06K68j83j1L5p6l8J22L8p0M6k43P8P0j85K17J6Q6j67L0k30L0J4
2293b04L61m10N59k28k64J6L9J77j93L68j46r5j28L1J52J49l60p5K89j16K1P6
2315A9j31O3j94K67Q3K3J47m55K94l49o9L45p2R4N0J11l46j09K45j03L20j94j62
2338a23P4K11k72L61l44J35L09l51K49l2k71K32kj57J31l19K77l80K24k05K67
2359A4j6J01j28K7J23p1k42Q4J62j43r1K40p8l37L46K3J55j50J66l64N2Q5l0n9
2383a31K82k63K24J0R4j28k23J29j6j21K20j54K6J80k07Q2j64Q4K41l25K08j1
2405C7Lj83J49k46Q7M18k30J64k85J7N6J78j62o9K16k97K01j79j55K34K10o2j75
2428g3K36k47P0l3r7K42j50K58J25j87l95K99j73K88l02k45M43m0j4K5M5k26M00
$$ plain form
2268 25 51 -157 -51 217 34 23 58 -18 -56 66 104 34 80 -163 -85 -15 -200 17 33 119 -48 -18 -248 -218 -204
2293 -204 157 -253 306 78 -186 -170 -131 46 -147 221 75 -20 -148 -117 35 184 -176 -251 38 -78 -57 19
2315 19 -112 -49 -243 24 107 130 277 -178 116 -233 -302 43 -29 65 115 226 -120 -229 16 -87 233 39 -123
2338 -123 -49 162 -110 251 -93 42 351 0 249 217 -54 178 176 19 150 -169 108 -272 -48 -253 14
2359 14 -2 99 -29 -2 121 50 -192 -108 54 -89 -180 60 -18 -355 -9 14 169 19 185 -179 -127 -42 -72 -131
2383 -131 151 -112 112 122 216 88 -135 -6 -22 -143 77 -77 -51 129 -78 4 -160 -76 165 -160 48 37
2405 37 40 -143 6 -240 -153 265 35 199 -86 -69 -13 165 3 -66 150 -147 54 -125 -280 -46 164 102 -73
2428 -73 163 -84 -14 -47 -144 98 -52 206 331 144 -251 48 -125 163 -139 -384 59 19 5 30 75 -151 249
2451B49j61m2j07L83ql85M85m43j5J14k46L07k2j24j17J52M6K1j96R6L47m14j10
2474a90l8K67J42o4r6K10k02j01M58m46K02J21j88j11J6P6J69n0m11Q9PL38j41
2497E7o6K07k29p1K19nm40K16M6P0J33j58mj63K80j82K03j56J48j11j59P2J15
2520B2m3J06k18J90j39MJq4N2Q3J8n8rk9j67m8L90J55m7p4J00m25L30l21Q5L11
2546A85j30j40Nk6k1K36r3N0J13k51j08K44j63NJ48n0p3m4K57J7l12J31q5k0Q3
2571d2M2PM04m62Q7j84L49L0j57k24M20l86J05L14k23j1P0l94N28ql29N4Q7N8
2595A35pk63L45j67j83O4j09K16j92L19j15l6j72R1R7q8m4J24n9J01k11J61K42
2618B49l20J58k42L35l2L8j37k1k35J42N7j23L03k55J12j15mL18l06M65k10J7
$$ plain form
2451 249 88 46 -61 322 314 -71 414 -29 -44 70 -176 131 109 -15 -132 20 66 87 -109 -13 334 -80 -190
2474 -190 -228 39 181 117 21 231 29 -72 386 -60 142 263 75 -36 -20 56 225 175 -236 -147 -140 198 57
2497 57 -9 198 -31 -102 117 112 -328 -112 -66 4 137 -21 -25 -188 92 -90 113 -43 105 -6 -165 -93 22
2520 22 -21 85 -133 57 -82 -78 -77 -161 -109 -26 -8 -66 -75 -104 -271 -319 71 226 179 105 205 -220 110 -211 -126 185
2546 185 55 -85 -80 -106 -127 109 16 66 179 -72 -180 64 -99 -94 54 4 -69 -113 144 161 -151 -20 -105 -125 -42
2571 -42 0 7 411 -51 36 -148 201 231 74 -150 270 -116 -11 303 80 69 139 -255 273 265 -64 -10 77 135
2595 135 128 -135 210 43 -140 -76 -185 31 -161 158 43 7 -165 -74 23 -65 -109 15 -44 57 -154 7 249
2618 249 -71 87 -155 180 148 186 49 28 -207 -65 -8 -131 172 -83 29 -86 -90 228 -78 387 177 194
2640A94k09J84q0J14j19N5l01J97j25J44Nj8m10J82M8J83L3k78J03j3O5k19L75
2663A10j73Q6n7q1mm7O3J21N1l1j12jK15p1k26J29J7M8O7n3j17J14j86K88k92
2688a42K87r5m2M0l4p8l7n6J01j05L1K73m36K83JK29j08j57J66o4k35J97K7nk12
2713a71P6l9l3J01j3OJ81k6R9q2j61mj20l6K14p7J06J64j32J99k37j14P6j11K05
2738G1k83K93k18L27j17j21r6K41l7l07L11M8k98L75l4j97P7j22J25m2m4L3K07
2761A92k36K74k96J57M0j89r9J38j43K45k88L10j10R7j95J26p0J5j08J91Ml1j58
2784a34J66k93J16J7J83nj13M07o13J10J52L46o02R1J96J63l9N5k21k70J89M6
2806e3J58Q5k92N3n2J20Q2o5J6p1nK0j41K03j44m0K8j49K15P9L12k07o1k61L63
$$ plain form
2640 194 -15 169 89 203 84 139 -162 35 -90 54 59 41 -369 -187 -139 44 77 -201 -98 -111 -46 -265 110
2663 110 -63 23 -34 -115 -119 -166 -103 18 69 38 -74 -75 140 69 -157 -28 -11 37 104 51 -66 48 -138 150 -142
2688 -142 145 50 8 48 14 -64 -101 -157 -56 -161 -130 143 -293 -10 -9 220 112 -45 121 57 -178 19 46 41 -171
2713 -171 -95 -134 -167 -66 -79 -73 108 82 181 99 -62 -66 -186 -222 -8 -85 21 185 53 252 15 -99 -23 -134 71
2738 71 -212 81 -137 190 73 -48 -144 97 60 -247 64 112 -186 189 155 -42 35 -87 38 -4 -48 -15 192
2761 192 -44 230 -66 91 131 -58 -157 -19 -162 83 -205 105 -5 92 -103 23 -47 -32 -140 51 55 24 -134
2784 -134 32 -261 -145 -128 55 50 -63 344 -269 -159 -7 339 -263 -172 24 187 148 203 -18 -288 -99 -53
2806 -53 105 190 -102 -49 -101 19 101 36 52 -19 -24 -4 -145 58 -86 -126 -98 -247 -32 47 359 152 91 -170 193
2831A93k97J51k24k6J75n8J05K08R1k47l57K91M1N5k7Q5K03l23J10q1j96M9m2
2854a21L13j70k24R1O5J74m6j66K00Q4k13N0m1j57L7L3o2L26j88L25n87K41k9
2877f5q7J14j2K60l58L48k01o2M44o29J35K13j96PK69m9k36L22l44O0k3k51L72
2900C1l2k87J05j4J8L01n1q6N8N5m33J6L45O8j25j83K93J60j80k17q3M93m90k3
2924b61K9o7J01N63m81K8l0L4ML42k73o6K6p9J20l2r6L40j91j76K04j55j9q4K23
2949DK90l08k96J89n0J55j55J66j71K61j15K54j4j96q1J59j90L46l9k08n2M4j71
2972a78K06j90J63n0P2K72k38nk95M00j11k56J98L05k10j00J98j16J3j83J75P5
2994A45j78J02l70J33J70O5n6R9k11Q7J04l3J11j57K49j34k35Q7J0K92l24j20
$$ plain form
2831 193 -104 47 -177 -203 -28 -86 19 227 318 71 -286 5 46 101 74 159 362 39 149 68 -128 -79 -121
2854 -121 192 22 -202 -111 -46 128 82 -84 116 200 -13 37 -4 -161 -124 -91 -153 173 -15 310 -277 -36 -65
2877 -65 -152 -38 -50 210 -148 200 -1 -63 381 -248 -113 100 -96 -89 180 131 -105 217 -127 -67 -90 -341 31
2900 31 -1 -288 -183 -197 -179 122 71 -15 43 98 -335 -319 26 94 -31 -214 79 239 59 -158 -241 252 -238 -261
2924 -261 -232 -299 -198 365 -116 -88 -118 -84 -80 262 -11 -77 -51 -130 -10 -42 -138 202 11 -165 39 -116 -135 -219 4
2949 4 294 -14 -310 -121 -171 -16 -171 -5 -176 85 -30 224 210 14 -67 92 -98 248 209 1 -51 -7 -178
2972 -178 28 -162 1 -49 23 295 57 52 -243 157 46 -210 -12 293 83 -17 181 65 78 -105 70 145
2994 145 -33 69 -301 -168 2 67 11 110 -101 -14 90 57 168 11 260 126 -109 -22 -12 280 -44 -164
3016a64o2N26j92J3l02K68K1Jk81L36j8l76L71k39l1K11k13J25J48L8r9j9n0Q
3040B0R7j74j29K96j17j24J33M8j41N0J05J4r6p3L13j84m8J19r7j53L6K29j09
3063A5m1j7j18R1k7K48j67j07J91p0rJ71l1o1k35L01k38J02J8o9L64o1k62j94
3087b06P7L58j93j56L16r5l22J92J57P0m12R6L93j32j31J7J98j27j28J89k39j3
3109i1R0j10R6j38J24k8J95j75n4J25L91k70p6N5j13k14M49j92k94m0L06j43K2
3132h5M3J48LL4l8K7j56J93r6M4j75q6K4K72l9k24J44l6j98M42l76N9Q6P0O5k53
3158a08j05J43K21r4j93K7o4L25j03K34j80k24N9P6j93M9L86l02M1o1O3L06j39
3181A64j78J58l03K27M1k67K29K71l75R0J05nj8j95j58K99k87K71j35m9r4J31
$$ plain form
3016 -164 -226 300 108 121 -181 87 108 109 -172 164 146 -230 141 -98 -129 82 -131 -6 142 180 81 62 12 20
3040 20 117 -57 -186 110 -7 -131 2 50 -91 -41 64 78 -18 -91 222 38 -10 109 12 -141 -105 124 15
3063 15 -26 -43 -161 -70 -97 151 -16 -123 68 -2 -11 160 129 68 -167 134 -104 -2 16 -53 311 250 -12 -206
3087 -206 -129 229 36 -120 196 101 -221 -29 128 198 -214 -118 275 143 12 29 227 100 -28 161 -78 -91
3109 -91 -1 -111 -15 -153 -29 -57 138 -37 -91 34 425 155 79 134 21 -193 256 64 -230 -270 36 -107 -85
3132 -85 -42 106 109 143 105 132 -24 169 73 117 -58 -144 -120 152 113 -111 33 -3 -201 241 -135 -76 10 80 145 -108
3158 -108 -213 -70 151 57 -136 -109 -173 152 49 283 103 -121 -62 14 -179 -130 256 -46 -5 -66 -3 303 164
3181 164 -14 144 -159 68 109 -158 71 342 -33 57 162 157 139 -56 -214 85 -202 69 -66 -115 -209 -78
3203g8N2p8J19O0r4J36mj13j76J8J66J32k97K86Rj23q9J92k17J17L57m52l08N80
3227A95p8n3j2k75J85J72j89L91m18L43l65J69m0J20j84K14j65N8j52R3%j94N83
3250C98o11L40k83R0j72N36k11l5j68r0J46J79l8P7j57J62m46L00L6J91l74J25
3272erR0l36L52M9j43r4L7O9q3K29j6k73j36L03m5q5K22j86l50M94j63J32k5J83
3297B11l15J31j62J67Q5l17K25Q9j2j31k3O9j42R0NJ08k27J25j26j02QJ03J67
3320B6q3K59k86J59jJ4pp4k70K45K09Q7j36R0k79Q3j87J58j52p8K16J24j30K45
3344B32k83L2k60K86o7J81q0k1m3o5P3k32L27j43j38R4L18k93M09l82K1J80O6
3367B12k09j35L56j80J35k0j81K36l78QK08r1N1K82l22j9Q9jk19K28R9l51K02
$$ plain form
3203 -78 -26 -104 15 75 -19 117 113 0 -176 -158 8 140 -157 129 138 15 -74 118 -99 18 375 -77 -385 195
3227 195 117 64 52 -223 -38 134 -55 336 -82 261 -104 65 25 145 -39 175 10 68 -84 9 9 -185 398
3250 398 -213 127 -156 -66 -238 298 87 52 -116 -206 -60 119 81 158 1 163 -283 17 53 244 -130 -5
3272 -5 -14 76 -260 92 141 -2 -96 -59 10 -73 156 140 -133 -269 34 -11 -96 126 -60 -410 84 -79 53 28 211
3297 211 -104 27 -135 32 117 -200 25 114 102 -29 -52 17 -125 -35 -30 78 -149 -24 -150 -252 -244 -141 26
3320 26 -57 202 -84 75 74 88 81 7 -263 -18 191 278 142 232 -47 36 -151 7 -145 -223 -7 117 -13 232
3344 232 -51 -19 -279 7 -60 121 41 20 -23 -88 -15 -247 80 -63 -201 -107 211 -82 327 -55 -34 146 212
3367 212 3 -132 224 44 179 159 -22 214 -164 -156 52 -39 12 294 -28 -47 42 41 -178 50 149 -202 0
3390@N1Rl9r1K94j89P9j83Q4l07K81J54M3k85R7Q7j64j19J80k1j23L62l39J79
3414D0o5J17n7L4r7l33K00K88O2Q6q2k42o7M08k98k7J34o1k40L4K07k67K72n5
3438iN1o1P1l63R9J10J09j08m4M07l59J35j26J58k70K4Q3K78l42J5L28k23K26
3461A89k55o1R3P2n4N2o7J38j66n1Q1J63J19k42k1L8j93L04L4q2M7j74qk50K53
3486d1K43k05j4k0J07j53N2N4l05K1L46J46k07k09J20J11j55L9P2n3j0j8O0K35
3510B16k92M29j78k50J67K5j85k53K17M14k58k03pJ12J50j48J01J22Lj99j62R7
3532h2L28j06j32J66k17lk99L54QP7k69K58q3j86J90M3j39k32K79L08j60J54k45
3555A2l7R6m34M87k9o2L9o3M9M0J20m14L36k64J57J26j54k7J30l33M74k46j45
$$ plain form
3390 0 51 60 21 -70 224 35 114 -69 15 -292 -11 143 186 -99 -2 85 -79 -198 -18 -39 -162 200 -139 40
3414 40 -25 92 35 69 -28 -361 -161 127 189 275 193 -49 -116 292 -6 -33 101 40 -200 -166 41 -226 46 -9
3438 -9 42 -19 52 -311 -212 -102 7 -101 -145 262 -97 38 -88 70 -200 -176 -93 185 -157 -142 186 -37 189
3461 189 -66 -127 -34 38 -16 36 -31 107 -59 -110 -29 134 253 11 -10 28 -165 139 173 91 138 -36 -44 -294 -41
3486 -41 202 -3 -17 -37 70 -83 -31 23 -282 -261 85 231 24 -185 -65 46 -109 -70 2 -51 -61 -79 -19 216
3510 216 -76 353 175 -75 92 117 -68 -321 -104 310 52 -151 -158 -46 104 -44 57 179 182 -17 -179 -82
3532 -82 246 140 8 174 -43 -46 -345 9 17 94 -175 83 0 -186 4 47 -92 -324 -45 263 103 257 12
3555 12 -25 71 -363 124 95 33 72 9 58 98 218 -196 140 -124 33 159 5 -22 108 -225 249 3 -142
3578a42K80l01M1l4J11J9k9n5J75j55k34P0J28J24o0mOJ00k05M1R1j24J33L0M0
3603D6j40R0n7J8J09j7j37K06j55mJ5N6Q2J8k40L04p8k90Q4N2M9j56R3K33n75
3628c94N39J37m86K63j96k4K32k28J13J6p3K3N5O2L8j95j55L38J25k35pj13J44
3651b1p6l7K55j43l5m6N7M5k8R9J1j6L2m0p8o4J45NK5J16k78j21K89j54N9O7K8
3678I6j12j30j49N04q9j1j7m5q8j2R5P9k72M5K06l31L27o0k63L74k82M3L76k99
3702a5J12P4n1q0R8j95PJ64r9J78k03O2j89j76K73j32K20q7L8J66k81k05J72K89
3726A40P7l07J7L70m28K1K59k37k56L84j49N7J21k65J98k03K90l38J85J98o7K3
3748I0J25k11j12J63J69l69J52j32L8J78j43J44j01m7q5K47Q2k29l7J55J15k26
$$ plain form
3578 -142 138 -163 -122 -156 -45 -26 -55 -110 65 -90 -324 -254 -126 -2 -62 -66 -60 40 -165 -124 -33 -157 -24 6 46
3603 46 -94 -4 -61 -43 66 49 -88 118 -37 -41 -26 30 112 130 -110 194 116 -174 -90 -38 11 -145 -52 181 -394
3628 -394 145 282 -204 59 -137 -161 71 -157 -44 -28 -101 -78 -23 39 77 -118 -273 65 190 -45 -52 -165 -21
3651 -21 -97 -134 121 -22 -57 -103 -46 -1 -29 70 81 65 97 57 -21 -85 60 65 90 206 -72 -193 96 -58 1 68 96
3678 96 -16 -146 -295 209 120 109 92 47 -41 -53 42 121 -151 -106 100 -231 96 36 -227 147 -135 -92 284 -15
3702 -15 97 171 120 40 138 -57 -50 114 15 193 -10 52 -137 -313 -40 -172 48 -39 -1 165 -116 -321 -149 140
3726 140 217 -90 -73 297 -131 -110 149 -88 -344 40 -109 -52 69 -196 2 -201 89 -249 -64 134 67 90
3748 90 215 4 -108 55 224 -145 7 -125 -87 91 -52 92 -9 -56 -141 106 188 -41 -78 77 192 -34
3770c4J67l42J16J45k51J08J06J71k45K0Q9q9K55m84K80l19K51J38J94j13k67
3791a04J76k53O3L77m10l8M65l12M8j87J46J08mo1j77J08K30j82l2j16K79P0k9
3814A65m54NK63K4j89q6K91K12k92K00j06j7J0J5J38k87J66O1N3l7p6q3q6K02
3838I2J25m23L04r9J67j74l08M66r9j97L71j70L0J0q0o2j8j17K70m1r0qR3K33
3862B75j69j04N8j70K16N7k58L35k71Q8n4J74j34q0O1J5L1n5m1O9j14r5K46mN5
3887A31n5k8j32J27K21m87N79l75J0j64J68L43l22p6J93J05j22P8r6K0k7j35m2
3910h6K50j96l0R7Pk80K18j41J2l1J93J89k65Q1M3l08L45o1j61j84J43J00j6M42
3934C61l35q2M30j46l44l7K26q6pJ51m5J38l65M0K40L1j75o6O5p1K87j56J1r5
$$ plain form
3770 -34 133 -209 -93 52 -199 -91 15 186 -59 -39 50 -39 216 -268 12 -307 -56 82 276 163 -104
3791 -104 72 -181 -118 259 -151 -189 276 -36 12 -175 -29 79 75 14 -163 -55 175 -7 -39 -155 124 194 165
3814 165 -289 -284 -21 3 -186 -272 19 231 -61 139 33 16 26 41 179 -108 58 119 172 135 59 -24 -110 92
3838 92 217 -206 98 -1 166 -8 -316 150 51 -146 225 55 85 95 15 -47 -65 -182 88 47 -43 -51 42 275
3862 275 106 2 60 -110 106 163 -95 240 -31 57 3 177 43 -37 24 39 70 15 -26 43 -71 -166 80 76 131
3887 131 76 48 -84 43 264 -223 356 -19 -9 -173 -5 338 16 -60 133 238 116 194 98 118 91 -44 -86
3910 -86 164 -32 -62 35 42 -238 -20 -161 -149 -180 13 202 -63 18 61 -247 98 37 -124 -308 -165 -65 -81 361
3934 361 26 -56 374 228 -116 -153 73 -13 -20 131 86 224 -141 -101 139 170 -5 -71 -6 -77 210 54 65 -30
3958c0L1J74j78L9K4r8j13J0J72N2k11K80o1k82M9J89jk00J69R0Q4l81K57L7O1
3983A63j52p4O7j46J00p4M8K99k02L4j01n2l8L63j50k23K62m28L97j58j18J83
4005@J62l10M60n04R0K00J39m91O47l83L0q4m1J99j68M2O0N3k71M00J5J0k55J84
4029A84l17l9P0m1j24L07K2K09k56o9K99m82M04k00qK33k51R5j56q7J87L4M6q7
4053b7k31Q4L27L2k15J74k51J85m0q8j4o7J15j10J10K40l92J63J43l53R7J82r8
4076c4J10j85J83j75O5r0M49l22K75k63L3N6j02k09J24P9k2k0J46q7p6m3n6L09
4100A45j61o1j00K16J58k60R5j85L77j53l24L36k6Nk58J80J54N2j17r0M7k6M4
4123D8J74j74j05K0M0J13J38j12L22m05k78K16K49q4j67R2J01j38j28R0j12J90
$$ plain form
3958 -30 1 175 -3 36 60 -38 -151 -141 31 83 -128 152 91 -191 -142 47 46 -154 15 105 189 -192 65 102 163
3983 163 11 -63 4 -142 -42 -116 -68 231 29 63 -38 -90 -128 235 85 -138 124 -304 93 -65 -183 0
4005 0 162 -148 312 -192 -102 98 237 -254 393 10 40 -44 -85 114 -54 -12 48 101 -170 230 245 255 0 184
4029 184 -133 -172 -102 -143 -267 40 62 271 15 -54 245 -237 167 -33 -41 192 -59 36 -120 -207 -20 14 60 -27
4053 -27 -258 -174 153 185 -30 144 -107 78 38 -50 -64 -131 -16 -126 -16 224 -168 -5 138 -215 -118 64 -34
4076 -34 76 -109 74 -101 -36 -126 323 1 276 13 46 102 0 -209 -85 -6 -28 -48 98 11 -65 -108 -164 145
4100 145 -16 -77 -177 39 197 -63 32 -153 224 71 -253 83 57 62 -196 -16 138 190 73 -17 30 4 48
4123 48 222 48 -57 -37 3 116 254 142 464 59 -219 -3 246 162 -5 87 188 50 -78 12 -100 90
4145I0l14L39j98J87j36J67j52J46j19L73k23l4K20j70m09M06k37J05n4pj70O9
4167a21K51k68J31J28l57J74K4j09m4l2K39o3M6K43l98L1r9M24j87O6j12n2n3
4190a38L7l6k7K74k06j58J93q2J68K26k45jl6l7R1k20N39m67J7L15j48PJ06j36
4214C6j09QR6j0j0k35N6K25K12r8j10K9k07j7J81j14K1J30N1j73k5j2K27j28j7
4239GK21L2m26K67J15r6k1k26k8K43l47M11o7k65K91j50k7J66k01K6N33n04P7
4262C1j4k10K41Qk72K47j73K40k89J7K08k20J34j89L99j83j43q6K19m6J37M2K6
4285A24l3j46m2L02k89K33J41l87J42k17K05k23N8K20Kn42K81M22j88k16J08o4
4307a09L0N5K88k48o7J22k8k2l0J68p7j43l6J10j76J19J45j68M9j82l0N4J99r5
$$ plain form
4145 90 -224 115 -83 104 -32 135 -17 129 10 383 160 126 346 176 -233 173 -64 41 -13 -20 -190 -121
4167 -121 130 -138 -7 121 -236 -62 -38 -147 -191 -223 16 -47 -1 242 -156 -125 -224 200 13 79 -33 -85 -138
4190 -138 -101 -137 -164 110 -96 -254 -61 -143 25 251 6 5 -31 -68 23 -197 342 -125 -108 207 59 66 172 36
4214 36 -73 -65 31 21 11 -224 -168 57 269 171 61 90 -117 -134 47 -67 -46 84 135 -38 -63 -75 152 24 7
4239 7 228 260 -166 101 216 120 99 -127 -155 88 -259 152 85 -180 111 -39 -66 100 -101 -75 458 -46 31
4262 31 17 -193 48 56 -216 31 -142 98 -191 -174 34 -186 -52 -241 158 -25 -168 -254 -35 -81 56 98 124
4285 124 91 -55 -97 205 -84 149 290 -97 45 -172 33 -190 -132 88 90 -452 -171 251 63 -153 -45 -109
4307 -109 -79 -24 264 16 -51 71 43 21 -9 159 82 -61 -97 13 -163 -44 101 -67 -18 -200 -230 -176 23 -72
4331g2K89n27K74Q8k37K01k25J56M2K06l55K85j62M6N3n3K35l61J44j42L04j98
4353im3K2K30N7L1m44l8J58K09m29J96j30L18l13L69k26J29P2j77q9J36J99n7
4376A71j88j37K97pj03N3Q1m08j9M58j13k88K11j04J1J46J64k33k05L78J08l95
4398a22J07O3J03j46J26J67k48J05m44L91j18N0Q1l12J6J38k43M89K02l45l5K28
4420B53k62K54k25j29L9P4Q4K0J06k61J28M4k03M1j8L19k53j56L25j88J70l37
4442a75O5Q4k28K16L06j38l4k33K97j8mp6O8m2o5Q8R8j98J7j22J13k06K05j63
4466a45L07j36j17l2Q0mJ36j83k6K45j76R1j9k00J55J13m4n7RkK41m2p6j9J7l9
4492G7j29q4J73J43o3j15j49q3M1Q4J63m5p0J0j67J90L8r8L4o4J79O4p0j63J83
$$ plain form
4331 -72 217 -310 -36 52 -185 16 -209 -53 -11 195 -160 125 -37 9 62 9 244 -117 27 -115 189 -9
4353 -9 -52 -30 200 257 288 -156 -194 -36 173 -256 -60 -190 128 -185 184 -42 87 159 -18 -107 29 228 171
4376 171 -17 -154 143 136 33 86 167 -241 -260 198 85 -203 8 -96 -85 61 225 -8 -213 165 273 -122
4398 -122 -15 48 151 5 131 298 50 155 -289 102 -16 34 115 -197 -181 -43 -286 203 405 60 25 253
4420 253 -9 245 20 -109 -70 4 88 108 214 -47 81 125 -78 -37 -55 264 11 -145 180 -8 162 -175
4442 -175 -110 -26 -254 -38 268 130 96 -137 160 142 138 62 130 88 23 111 209 11 28 -94 19 -187 18 -145
4466 -145 162 26 -91 -123 -43 -47 89 -94 -120 125 -51 40 21 -179 -24 89 45 -12 -3 -5 236 194 118 99 116 77
4492 77 -52 -136 37 180 117 2 -147 -230 -189 -105 58 13 -57 -47 -214 -24 14 -84 -50 -114 65 129 59 -104 79
4517G9J37j44r1K10k14P1K79k36j88K15k66J19Jl9n9p1J85j74L0K77j12J83j19
4540G3M0k22k2M59k77n9N4n8r1J08o2L41l44l5K8jn4K21M6j22j11N63m72P%O0
4566G0j26j04j12M88l66J40R6o1l20L95J6Q9k5j07L5j93J03n3o9M4p0j40L31k5
4590C6K28k65J42k5q7k06L91r9k55J18K69l20N03l87P5q8k29L11n3q7k12L88r4
4613E4O8l47k4J21J18l07L38J53j37K27l93J79j53J84k9p2q8J54J64p3k26L60
4635B71k60P4j14K11p0j25m1j43J79j59M45m37J97k0j91L57r7r5J14k27J00J49
4657A18j80K39o1P0j47j00P4J50j74j20L54k87n9j21M95p9l35J47J44K2m12J83
4679g9J51m0o1O4l65L71k68L68l3n6j84K48K2Oj21q5q5K98k87j80M59K04j99k53
$$ plain form
4517 79 216 72 -19 191 -23 48 327 91 -97 118 -148 -29 -28 -67 -126 -197 -12 -186 -156 121 9 192 73
4540 73 113 -109 -131 328 51 -8 46 -12 -103 5 -57 284 -60 -95 -67 -68 -122 99 145 23 -88 475 3 10 10 70
4566 70 -56 -160 -272 216 -150 -10 86 25 -295 100 116 205 180 73 108 -85 18 -35 -104 -60 -130 -270 61 36
4590 36 264 -1 141 116 29 -177 214 115 -140 -22 247 -73 430 43 118 30 -199 112 59 -28 -240 148 54
4613 54 122 -225 -249 -128 -10 -317 21 174 37 264 -129 50 -103 81 52 -20 -108 46 210 137 -89 271
4635 271 11 85 -29 182 112 -13 -54 -197 -18 -177 268 -169 28 8 -183 174 77 -18 96 -131 -31 118
4657 118 -62 177 116 186 39 -61 13 163 -11 -131 223 -64 -123 -244 251 172 -163 -16 128 150 -262 -79
4679 -79 72 32 -29 35 -330 41 -227 141 108 52 -132 116 138 144 23 -62 -147 151 -136 -316 143 347 148 -105
4703a05K02j76J94l07n0J89J13J11l36O6K3M57l75j68J84j50K00L8k61L49j36
4724F2J5%j45k58K00K73P6q6p9j41MQ9k33J23L11j91J04n09K62K37j03K08k61
4747d2n4P9J57k82K24R3k95P5P4p0J53q2j35K59r7K51r5m06K25j14K8J20J8N8
4771A42J26l00J01l5j29J22j10J59P7j1J0k88J68J62p0j50o9M8Q3K6m2M3k69K85
4795G9J04j93q1O3pm0K6Q2J29m77N29k40J21P2j73jr2RK33J64j56J59k16k59J65
4820@j48j26N03m21J76k1K0k37L43j46K8k75L03J45l66K75lr7l2O0l6M9L0j04
4844h0J72m2r6K7l17L62q8J03J43k67J13k09J42Q9k10K35j2K4J32Po7j12J35k24
4868d0mK65j62k7o4N7J40l7q3J4k25J73Jl6L44k48l23L51k73K41k44L06n9k02
$$ plain form
4703 -105 97 -79 115 -192 -242 -53 60 171 -165 -99 -76 381 6 -162 22 -128 72 110 -151 198 62
4724 62 77 77 -68 -326 -126 147 223 137 58 -83 -79 10 -223 -100 211 20 124 -385 -123 114 11 219 -42
4747 -42 -96 -17 140 -142 82 175 -120 -45 29 -41 112 30 -105 154 57 308 213 -193 32 -82 -54 66 84 142
4771 142 268 -32 69 34 -95 27 -83 76 153 142 152 -136 32 194 124 -26 -95 -47 36 62 20 63 -206 79
4795 79 183 -10 -91 -28 -35 -75 -49 33 162 -315 214 -26 95 167 -6 -7 -99 -90 143 307 151 310 94 -165 0
4820 0 -148 -274 229 -192 -16 -37 -17 -254 89 -57 -29 -304 -1 144 -222 53 50 -47 -79 -19 -55 -6 24 -80
4844 -80 92 50 -46 -19 -336 26 -62 41 184 -83 30 -179 -37 52 -158 77 65 89 221 228 161 49 184 -40
4868 -40 -44 221 59 32 -32 25 165 128 45 59 -166 7 8 -28 316 68 -255 96 -177 64 -180 126 67 -135
4892a35L17Ql71J86J15j18q4R6r7J76j20J0j3l8J08l2k74K69J45l03M08n03L61
4915A11pj16j14R6L62k68j19L1M4j31o6P7j32P7j68P8N63m23K50n9j91P2N2J6
4939C5J5Mj81q0M0M2N1j01K95P1j96k7k32K62j36nJ35k12M34k25P2P3m17K02J15
4964C4L0o8J14n3J10m36O77l35j07Ll79L53MJ30J06r0k59M52m75L91m61L94q4
4987E1o6j56o2M60l17L37l5l43K08o3J41n2r5j49L30q9o4k0R8l56O46l95L3k97
5011b55j11N91k05k55J90kJ74o7J1j92j7Q3p4N0l6K06j50l4K2L15l6l00J10K1
5035C9j76J06Q0q9KM3Qj3j45j62K03J70J93j55Ok75K72l3o6k65J14k9m5J10Q0
5060b7J42m7j14J05R7p5j24K49q9l33M39m35K69Om4rp9K31j46J02q9J83j60j32
$$ plain form
4892 -135 182 190 -181 5 120 2 -82 14 -83 93 -27 -17 -30 -68 40 8 -266 3 148 -155 253 -250 111
4915 111 104 -12 -126 -30 332 64 -55 -24 20 -111 -177 -100 -232 -155 -323 -245 318 -105 145 86 -105 -33 19 35
4939 35 50 54 -127 -207 -167 -125 -74 -175 120 191 -5 -32 -264 -2 -138 -143 -8 -220 214 -11 61 134 -283 -81 34
4964 34 64 -4 110 57 167 -269 408 73 -34 -31 -410 -57 -53 77 183 93 -166 286 -189 202 -259 135 51
4987 51 -15 -171 -233 227 -90 247 212 -131 77 14 155 103 8 -141 189 100 36 16 114 -242 404 9 42 -255
5011 -255 -366 225 20 -235 -45 -47 127 60 71 -121 -138 -55 -129 -79 -115 91 -59 -93 -71 244 208 -92 18 39
5035 39 -137 -31 49 -40 -38 5 13 0 -145 -307 -104 66 259 104 110 -165 107 74 8 -257 -143 -172 -217 -107 -27
5060 -27 115 68 -46 59 156 81 -43 206 117 -216 223 -212 57 63 19 10 -69 162 16 118 29 212 52 -80
5084h0K7J42k43N0O5n9q4L00J53j14j74k86M90k67J21N3l69OK37j59K44J82l87
5107a52J21k28Q0K51k3J56j91j03j57L76k56K18j15j00j63J81J41J33m03L61l38
5128b11M9K95l78L58p2l7j50J50m3O1l37J35L68j77l17L70k81K49n1o5l1K32j19
5151bP1n2l9M1j61J50J2R8k50J3p8K98j64J19l1M7j84K21k4m0j7L2o1o9j13N9
5177a24R6K1J95P1n42K59j72L84m27K71Kl55L48k1k9l78K41K02J7p7K52N9k90
5200CJ4k52K02J35N9O9J3l47OJ81l76M03k26J1n3J54k48J56J61q7Q9j15K34j02
5224H4j38n6m8L69k52J31Q1k10M9J43nk45L10l10K80k64N7M6q8J09j64L06l41
5247a56M14l09J53M0j51j56K48P7k48J75j72m6L63k49j75O4J11J10p1K6j66L63
$$ plain form
5084 -80 -53 89 -154 -104 -39 -98 -182 118 271 157 -17 -303 187 -80 41 94 -275 -269 -32 -191 53 235 -152
5107 -152 -31 -259 -179 72 49 205 14 -89 -246 130 -126 92 -23 -123 -286 -105 36 169 -234 127 -211
5128 -211 -162 133 -245 113 41 4 -146 4 -39 22 -315 -180 188 11 -306 64 -217 32 -19 -84 -115 117 -2
5151 -2 69 17 -22 19 -142 8 20 118 -132 -119 -197 101 -63 56 25 72 -112 109 85 45 28 60 -1 -70 -183 -124
5177 -124 -28 -7 188 259 -283 -24 -196 188 -239 32 34 -321 27 6 -23 -401 -160 42 59 -18 234 293 3
5200 3 17 -235 -33 102 161 230 243 -104 -98 83 -293 110 -116 -105 -158 -4 -252 -96 65 -22 67 -48 186 84
5224 84 -54 -110 -158 211 -41 90 171 -39 10 153 148 -97 213 -97 183 -81 -24 22 -66 43 -121 185 -156
5247 -156 258 -51 102 142 -9 -165 83 160 -88 87 -85 -131 232 -17 -192 -128 -17 93 22 48 -118 245
5269B45j59m3J28o9l3j61j28n4M35l1J3J01m7m43N34k36j42K9R8J05k3k84J38
5292b7K99q3l89K39M0n5j04lQ6K07j03k85L13k85J92J04k63M8N8P5j11O3L15n84
5316b53J49jM6o4j19L20k93K82k56K54j08k1J09k09M81m67J22P5k04k1K03Q0n4
5339E1k13L62k96r0K69k43J52r3l2R8J41Oj54J90M0m90K17J38j84K70j97j1J35
5362F6k91M05k09K69k22j5k1J57l38j07N17k50O5j53J27j29J5k1K65j34k95J86
5384a13j63K44J82k49K88j64j3j47P7R5R7j93J84M6j88j34J90k69K26PO5j20J99
5407A47om23L15J04j00j61j7o0K02p9P2o8J04J8j6j62J89L0k91K06j07p1J68J5
5431IO0j00J40m7J39k67M7R6P5m70N65l19J07R3k84M60k89L5J33P1k31J43l37
$$ plain form
5269 245 86 43 171 102 69 -92 -220 -274 161 130 143 244 197 -246 288 52 -90 -61 37 142 119 -165 -27
5292 -27 272 189 -200 39 79 24 -80 -83 3 210 107 -178 135 -150 42 146 -117 -69 -11 64 -47 16 331 -253
5316 -253 -104 -105 -59 -123 -242 78 -215 67 -189 65 -43 -64 45 -164 317 -150 -28 47 -157 -178 25 105 51
5339 51 -162 200 -96 -186 83 -160 -8 -101 -133 -35 106 112 -42 148 188 -302 -85 53 -131 139 -58 -69 66
5362 66 -225 180 -29 240 18 3 -18 139 -199 -306 211 -39 26 -127 0 -129 -114 -135 130 -4 -299 -113
5384 -113 -276 -32 150 -99 189 25 12 -135 -58 37 134 -59 125 171 -17 -151 39 -230 -4 3 68 -52 147
5407 147 141 -282 33 137 37 -124 -141 -201 1 -78 -6 -74 30 48 32 -130 59 89 -202 4 -103 -174 -6 9
5431 9 69 -31 109 62 201 -66 -19 77 152 -318 247 -72 35 128 -156 304 15 50 183 254 23 166 -171
5454a71O29m42j83K91p9p5J01P9l77L13l7J58j16k39J42j59J70p1o5O5J90k90
5476a66K86k05m06N05j55L73l74L0j18L6N5J23J26k84j52L43j90N0P1K51o3j7
5498A19k12mN5O3j19K35l22K26M4jm06N47l50L26j29j64j6K6L21k23J36k17L9
5521b6k4k22M04l36J23r1L9J76j7M1M2j39J60k23J14RJ53l15j75J82r0K37k0o3
5545f1K21k32J09p9J84l24K84j05%J71k15K65j80Q4m7P9k22J88p5K7R2k89K22
5568I7j51j22J01J33J94n74R7J38q1J05M7R0J30k58o0K2Q2J90p0j5q4lj15J18
5592A1j85N5J43L6m9n0k6j92N3J0P8M75m13J11J71Q9m26J52l0J84J5j35k8p9K49
5617B19k13j8P5Q4M0p8l05L03k75L2J94P0j40k27K57j4J37p3r2j03J72k2Q5J51
$$ plain form
5454 -171 458 16 -167 124 45 -30 71 150 -227 86 49 207 91 -148 -6 -165 5 -66 -131 -66 124 -166
5476 -166 120 -85 -491 14 -141 232 -142 -112 -230 -194 -139 -16 110 -174 -326 17 -173 -123 -52 199 136 119
5498 119 -93 -97 -42 21 -98 137 -185 41 85 84 -322 225 -125 201 72 -92 -108 -82 239 16 152 -65 -26
5521 -26 -50 -272 132 -204 -81 -172 -133 43 26 67 109 -30 130 -93 21 30 183 -132 -307 -125 -215 22 2 -61
5545 -61 160 -72 37 -42 142 -182 102 -3 -3 168 -47 218 38 122 75 154 -68 120 45 72 164 -125 97
5568 97 -54 -176 -75 58 252 -322 -225 -87 -168 -63 -16 74 204 -54 -114 -92 -10 180 110 95 11 8 -107 11
5592 11 -174 -119 24 60 11 -39 -65 -257 -204 -194 -116 359 -54 57 228 317 -109 43 13 197 212 77 49 -30 219
5617 219 6 -12 63 147 187 109 -196 107 -168 -136 58 128 -12 -239 18 4 141 68 -24 -127 45 23 108 259
5641B59l00O2Ok97M61j43k00K57k59K21Lj32j37L02k18M14n17L77m5n2k5j52L00
5664A85k26P5l96M93j93j04j70L88k09m9L20J19j00k62M03m21J9L68k22L13K0
5685C51l16j24N5J44j07M8j85J77J20k26K1q9R1M8K4j27Lj10K47k35J64L1j9j39
5709a53N02l07L6j07L1K32l08Nl3P9R6p7J4K05l45L61j75m7j90J42K00j22k6k6
5733a3j28J40O4j57Q9J23p0R3l12L67j31k43J42k54L65l18R0K69n1m4j32N8K18
5756A65j04k88L16O0j2j54j28L40j43J12j42p8J18J7r5k25K20K73l05J40O6m58
5778c05K53L0p4J55p3m1J9o5l9K69j59J74O3k43P2m8j39K20Qn9j0J57l55L70l07
5803a27M19j48o7%o2o5J87N6k50Q9j55J12K29m23J44N4K66k03J76m87K84J37l21
$$ plain form
5641 259 -41 21 27 -270 191 48 -152 105 -154 67 70 -62 -199 103 -115 299 -218 159 114 62 37 -115 185
5664 185 -41 34 -362 131 -62 -166 -336 52 -157 -206 114 233 133 -129 274 -147 -128 240 18 331 351
5685 351 35 -89 -34 110 3 51 -134 43 163 -63 -42 -131 -40 8 32 -95 -92 -202 45 -190 -26 5 -14 -153
5709 -153 349 42 78 -29 2 234 -74 -69 -102 -23 73 -4 10 215 -130 231 56 9 -181 -39 161 39 13 -13
5733 -13 -141 -1 63 -94 -5 118 48 141 -171 196 65 -178 -36 -290 75 -243 -153 116 65 21 -111 -53 165
5756 165 61 -227 89 149 137 -17 -145 195 52 164 22 -56 62 79 -16 -241 -21 252 -53 87 153 -305
5778 -305 -52 -22 -96 59 -14 -55 -36 -101 -140 129 -30 144 207 -36 36 -12 -151 69 77 18 8 165 -190 180 -127
5803 -127 292 144 77 77 15 -50 137 193 -57 32 -123 -11 218 -205 -61 -7 259 56 232 -255 29 166 -155
5826a55K17p9K27l12j45J18J88j28L06n9k45J67J30p9l24N4j44L72N2k28M2J02
5848G7n9J5L2k21J59k31J21J25L71m21J62J07k05J7n4j75q8L47k26J8j17L58j0
5871A02l69K39J94j68o3R6j92J88Q1K9k48M2M10m75J65K67m69Ln7J45R7r7J49
5894F9Q5k30pk27L24P6p3j01K13n04J39K69j34q6J67q2J03j88L70k34K50j70k3
5917Fp0O1J73m61M57lk06N9PJ01k99J74J56k24N1j75K42K1O8K13k67n6k38M52
5941B42n17R2K7K91m10N57k06j34P7k99O03l67J57r6j21N5o6L9J26l79K25n8j80
5964c42J90L41l42J03K58k19J64j01j94K90l75L50m96N27k62j45J09L72o7j96
5984c5J35K67l55J18j77J74j21j49L7N8J36k87K18o5J15q4N1n0q7j23J26K72P
$$ plain form
5826 -155 62 -17 210 -102 -247 -129 59 -69 237 178 -67 100 230 151 -173 -119 -263 109 161 -67 -25 77
5848 77 18 33 65 -156 3 -228 -107 18 389 -32 130 237 32 49 -5 -180 -268 79 -147 -129 -246 112 102
5871 102 -267 -28 166 -2 -65 31 -161 27 108 137 -111 -69 341 -134 31 298 -171 -168 -225 -80 17 -80 69
5894 69 154 -76 -83 -310 14 90 17 -84 129 -375 -236 33 -101 -187 -20 -102 1 -187 183 -51 199 29 6
5917 6 -64 -3 170 -291 166 163 -43 16 23 124 -175 -1 155 -69 -18 -193 49 70 138 351 84 28 -210 242
5941 242 -275 -183 -156 135 -275 282 76 -58 19 -280 323 -44 113 17 -104 -49 -115 -76 50 -329 -104 -162 -342
5964 -342 -152 189 -153 -50 208 -11 153 52 -142 148 -227 123 -373 154 -108 -253 -144 228 161 -35
5984 -35 100 367 12 130 -47 127 6 -143 -106 -48 88 -199 19 -46 69 -15 36 -14 -101 -224 -98 174 181
6007A81J2Qk44J79k7m56K20R4O6k37K66j72K73l02N2O1j05K1M8Q5j76L79j67k06
$$ plain form
6007 181 193 201 -43 136 109 -347 -127 -33 33 -204 62 -110 163 -139 -87 -26 -131 -110 -62 23 -153 226 59 -147
$$ [...]
8191h5
##END NTUPLES=NMR FID
##END=
