##TITLE=1H_DE-138K2_TFA_d6
 200.13Hz, DMSO-d6+CCl4.
 8 sc
 
 24.4.2026
##JCAMPDX= 6.0         $$ Bruker NMR JCAMP-DX V2.0
##DATA TYPE= NMR FID
##DATA CLASS= NTUPLES
##ORIGIN= UXNMR, Bruker Analytische Messtechnik GmbH
##OWNER= pz
$$ XWIN-NMR		Version 3.5
$$ Fri Apr 24 13:43:18 2026 Russian Standard Time (UT+4h)  she@DPX200
##.OBSERVE FREQUENCY= 200.131
##.OBSERVE NUCLEUS= ^1H
##.DELAY= (6, 6)
##.ACQUISITION MODE= SIMULTANEOUS
##.ACQUISITION SCHEME= undefined
##.AVERAGES= 8
##.DIGITISER RES= 18
##SPECTROMETER/DATA SYSTEM= spect
##.PULSE SEQUENCE= zg30
##.SOLVENT NAME= DMSO
##.SHIFT REFERENCE= (INTERNAL, DMSO, 0, 14.3821)
##AUDIT TRAIL= $$ (NUMBER, WHEN, WHO, WHERE, WHAT)
$$ ##TITLE= Audit trail, XWIN-NMR		Version 3.5
$$ ##JCAMPDX= 5.01
$$ ##ORIGIN= Bruker BioSpin GmbH
$$ ##OWNER= she
$$ F:/spectra/data/she/nmr/H-C/1/audita.txt
$$ ##AUDIT TRAIL=  $$ (NUMBER, WHEN, WHO, WHERE, WHAT)
(   1,<2026-04-24 13:40:46.50 +0400>,<she>,<DPX200>,
      <created by zg, POWCHK disabled, PULCHK disabled
       configuration hash MD5:
       00 E9 B6 7A A2 85 ED C7 34 08 36 98 17 FE 4E 26
       data hash MD5: 16K
       29 C1 83 03 28 E2 F7 8C 04 D7 6C 45 C6 45 AD 0A>)
$$ ##END=
$$ 
$$ hash MD5
$$ AD 19 71 4B 27 65 3A 04 49 C4 A9 66 BB 30 8D 42
##$RELAX= 
##$RELAX= 
##$RELAX= 
##$RELAX= 
##$RELAX= 
##$RELAX= 
$$ Bruker specific parameters
$$ --------------------------
##$DU= <F:/spectra>
##$EXPNO= 1
##$NAME= <H-C>
##$PROCNO= 1
##$TYPE= <nmr>
##$USER= <she>
##$AMP= (0..31)
100 100 100 100 100 100 100 100 100 100 100 100 100 100 100 100 100 100 
100 100 100 100 100 100 100 100 100 100 100 100 100 100 
##$AQSEQ= 0
##$AQ_mod= 1
##$AUNM= <au_zg>
##$AUTOPOS= <>
##$BF1= 200.13
##$BF2= 200.13
##$BF3= 200.13
##$BF4= 200.13
##$BF5= 200.13
##$BF6= 200.13
##$BF7= 200.13
##$BF8= 200.13
##$BYTORDA= 1
##$CFDGTYP= 0
##$CFRGTYP= 5
##$CHEMSTR= <none>
##$CNST= (0..31)
1 1 145 1 1 1 1 1 1 1 1 1 1 1 1 1 1 1 1 1 1 1 1 1 1 1 1 1 1 1 1 1 
##$CPDPRG= <>
##$CPDPRG1= <>
##$CPDPRG2= <>
##$CPDPRG3= <>
##$CPDPRG4= <mlev>
##$CPDPRG5= <mlev>
##$CPDPRG6= <mlev>
##$CPDPRG7= <mlev>
##$CPDPRG8= <mlev>
##$CPDPRGB= <>
##$CPDPRGT= <>
##$D= (0..31)
0 0.7 0 0 0 0 0 0 0 0 0 0.03 0 0 0 0 0 0 0 0 0 0 0 0 0 0 0 0 0 0 0 0 
##$DATE= 1777023646
##$DBL= (0..7)
120 120 120 120 120 120 120 120 
##$DBP= (0..7)
150 150 150 150 150 150 150 150 
##$DBP07= 0
##$DBPNAM0= <>
##$DBPNAM1= <>
##$DBPNAM2= <>
##$DBPNAM3= <>
##$DBPNAM4= <>
##$DBPNAM5= <>
##$DBPNAM6= <>
##$DBPNAM7= <>
##$DBPOAL= (0..7)
0.5 0.5 0.5 0.5 0.5 0.5 0.5 0.5 
##$DBPOFFS= (0..7)
0 0 0 0 0 0 0 0 
##$DE= 6
##$DECBNUC= <off>
##$DECIM= 32
##$DECNUC= <off>
##$DECSTAT= 4
##$DIGMOD= 1
##$DIGTYP= 9
##$DL= (0..7)
0 120 120 120 120 120 120 120 
##$DP= (0..7)
150 150 150 150 150 150 150 150 
##$DP07= 0
##$DPNAME0= <>
##$DPNAME1= <>
##$DPNAME2= <>
##$DPNAME3= <>
##$DPNAME4= <>
##$DPNAME5= <>
##$DPNAME6= <>
##$DPNAME7= <>
##$DPOAL= (0..7)
0.5 0.5 0.5 0.5 0.5 0.5 0.5 0.5 
##$DPOFFS= (0..7)
0 0 0 0 0 0 0 0 
##$DQDMODE= 0
##$DR= 18
##$DS= 0
$$ [...]
##$SUBNAM0= <"">
##$SUBNAM1= <"">
##$SUBNAM2= <"">
##$SUBNAM3= <"">
##$SUBNAM4= <"">
##$SUBNAM5= <"">
##$SUBNAM6= <"">
##$SUBNAM7= <"">
##$SUBNAM8= <"">
##$SUBNAM9= <"">
##$SW= 18.0517599122864
##$SWIBOX= (0..15)
0 0 2 0 0 0 0 0 0 0 0 0 0 0 0 0 
##$SW_h= 3612.71676300578
##$TD= 16384
##$TD0= 1
##$TE= 0
##$TE2= 300
##$TE3= 300
##$TEG= 300
##$TL= (0..7)
0 120 120 120 120 120 120 120 
##$TP= (0..7)
150 150 150 150 150 150 150 150 
##$TP07= 0
##$TPNAME0= <>
##$TPNAME1= <>
##$TPNAME2= <>
##$TPNAME3= <>
##$TPNAME4= <>
##$TPNAME5= <>
##$TPNAME6= <>
##$TPNAME7= <>
##$TPOAL= (0..7)
0.5 0.5 0.5 0.5 0.5 0.5 0.5 0.5 
##$TPOFFS= (0..7)
0 0 0 0 0 0 0 0 
##$TUNHIN= 0
##$TUNHOUT= 0
##$TUNXOUT= 0
##$USERA1= <user>
##$USERA2= <user>
##$USERA3= <user>
##$USERA4= <user>
##$USERA5= <user>
##$V9= 5
##$VALIST= <valist>
##$VCLIST= <CCCCCCCCCCCCCCC>
##$VD= 0
##$VDLIST= <DDDDDDDDDDDDDDD>
##$VPLIST= <PPPPPPPPPPPPPPP>
##$VTLIST= <TTTTTTTTTTTTTTT>
##$WBST= 1024
##$WBSW= 4
##$XGAIN= (0..3)
0 0 0 0 
##$XL= 0
##$YL= 0
##$YMAX_a= 354999
##$YMIN_a= -320282
##$ZGOPTNS= <>
##$ZL1= 120
##$ZL2= 120
##$ZL3= 120
##$ZL4= 120
##$ABSF1= 10
##$ABSF2= 0
##$ABSG= 5
##$ABSL= 3
##$ALPHA= 0
##$AQORDER= 0
##$ASSFAC= 0
##$ASSFACI= 0
##$ASSFACX= 0
##$ASSWID= 0
##$AUNMP= <proc_1d>
##$AZFE= 0.1
##$AZFW= 0.1
##$BCFW= 1
##$BC_mod= 2
##$BYTORDP= 1
##$COROFFS= 0
##$CY= -3
##$DATMOD= 1
##$DC= 2
##$DFILT= <>
##$DTYPP= 0
##$F1P= 0
##$F2P= 0
##$FCOR= 0.5
##$FTSIZE= 0
##$FT_mod= 4
##$GAMMA= 1
##$GB= 0.15
##$INTBC= 1
##$INTSCL= 1
##$ISEN= 128
##$LB= 0.25
##$LEV0= 0
##$LPBIN= 0
##$MAXI= 10000
##$MC2= 0
##$MEAN= 0
##$ME_mod= 0
##$MI= 1.114404
##$NCOEF= 0
##$NC_proc= 0
##$NLEV= 6
##$NOISF1= 3.799351
##$NOISF2= 2.8
##$NSP= 1
##$NTH_PI= 0
##$NZP= 0
##$OFFSET= 14.38212
##$PC= 1
##$PHC0= -4061.193
##$PHC1= 7.99229
##$PH_mod= 1
##$PKNL= yes
##$PPARMOD= 0
##$PSCAL= 0
##$PSIGN= 0
##$REVERSE= no
##$SF= 200.129724274929
##$SI= 16384
##$SIGF1= 3
##$SIGF2= 2
##$SINO= 400
##$SIOLD= 16384
##$SREGLST= <1H.CDCl3>
##$SSB= 0
##$STSI= 0
##$STSR= 0
##$SW_p= 3205.1282051282
##$SYMM= 0
##$S_DEV= 0
##$TDeff= 0
##$TDoff= 0
##$TI= <>
##$TILT= no
##$TM1= 0
##$TM2= 0
##$TOPLEV= 0
##$USERP1= <user>
##$USERP2= <user>
##$USERP3= <user>
##$USERP4= <user>
##$USERP5= <user>
##$WDW= 1
##$XDIM= 8192
##$YMAX_p= 0
##$YMIN_p= 0
$$ End of Bruker specific parameters
$$ ---------------------------------
##NTUPLES= NMR FID
##VAR_NAME=  TIME,          FID/REAL,        FID/IMAG
##SYMBOL=    X,             R,               I
##VAR_TYPE=  INDEPENDENT,   DEPENDENT,       DEPENDENT
##VAR_FORM=  AFFN,          ASDF,            ASDF
##VAR_DIM=   8192,          8192,            8192
##UNITS=     SECONDS,       ARBITRARY UNITS, ARBITRARY UNITS
##FACTOR=    0.0002768,     1,               1
##FIRST=     0,             0,               0
##LAST=      2.2672688,     0,               0
##MIN=       0,             -320282,         0
##MAX=       2.2672688,     354999,          0
$$ Real data points
##PAGE= N=1
##DATA TABLE= (X++(R..R)), XYDATA
0 0 0 0 0 0 0 0 0 0 0 0 0 0 0 0 4 -5 8 -8 8 -8 8 -8 16 -16 16 -20 22 -28 29 -33 37 -42 46 -52 58 -65 73 -80
38 -80 87 -94 106 -116 126 -139 152 -168 184 -202 221 -242 269 -294 328 -363 404 -451 507 -576 659
59 659 -762 895 -1066 1297 -1624 2111 -2884 4241 -7000 14370 -64864 -89478 354999 174306
73 174306 57254 57717 -191686 -260090 -240099 -143647 -247 145872 141001 200622 88075 -212484
85 -212484 -172316 -320282 -243095 21523 -15234 221912 182113 -735 -12905 -195992 -261191
96 -261191 -244061 -96993 21357 79298 153964 101203 23979 -162433 -142644 -181244 -263085
107 -263085 6322 13811 90859 179570 29371 21692 -154431 -217258 -169496 -156739 -14804
118 -14804 83472 164919 106833 52939 -83525 -207040 -143442 -211409 -23382 100388 63349
129 63349 193433 69351 -26643 -104017 -173893 -114938 -98901 49619 100498 134325 129162 33352
141 33352 3831 -141285 -107209 -77962 -56617 109633 102574 156758 114805 20686 -31884 -141429
153 -141429 -78505 -78890 25320 140593 121238 173197 57668 -9799 -76320 -130971 -51564 -26790
165 -26790 103142 131029 141777 129287 -4562 -16137 -110309 -78387 -13008 6874 146460
176 146460 112480 125864 80693 -22275 -33287 -115637 -43360 -5123 50441 134366 108996 120635
188 120635 9462 -24249 -74501 -115511 -12646 -12182 109003 122561 80756 99346 -46379
199 -46379 -60123 -91022 -85364 -738 30024 119814 92256 80407 10461 -61895 -56142 -125578
211 -125578 -19791 10916 38437 124620 48216 58059 -27013 -83481 -65278 -95934 -14672 13570
223 13570 80114 77135 40673 35009 -77016 -65691 -99980 -70655 19302 7253 102403 60980
235 60980 19126 -8960 -98796 -71478 -100537 -29844 28549 43071 87154 20373 17226 -67680
247 -67680 -95463 -63220 -86507 16822 18366 60014 68129 -11760 -509 -84983 -77999 -68079 -50410
260 -50410 32498 19802 74777 34167 -1477 -27759 -101470 -49945 -76839 -12381 47931 37079
272 37079 81039 3394 -6401 -56919 -96156 -42867 -48853 33875 40094 60610 58888 -24585 -12329
285 -12329 -79705 -60031 -32976 -20625 63619 32294 64992 29315 -21781 -22703 -80474 -25341
297 -25341 -30371 15192 64927 39389 73819 -1250 -11591 -38596 -70271 -9805 -18684 55665
309 55665 56645 50399 58794 -24293 -14428 -61038 -38777 -713 853 79154 42604 52579 22084
322 22084 -28882 -18408 -67509 -5522 3161 29012 74844 33123 54865 -11709 -21628 -26322 -54527
335 -54527 12412 3982 58445 58280 32303 40650 -34046 -16317 -45210 -29260 19294 8583 71678
348 71678 35933 31375 6290 -44114 -15946 -55670 -3243 14641 24829 64249 15038 31877
360 31877 -24350 -39815 -23470 -46102 17695 7029 47972 47489 7315 19911 -46836 -27872
372 -27872 -38409 -25005 30277 7671 55598 22394 6245 -8555 -54804 -17694 -46165 1507
384 1507 23072 14694 47252 -5720 8165 -32037 -49615 -19399 -41642 18450 9438 26529 31802
397 31802 -13525 620 -51158 -31945 -32192 -25532 31562 6684 40682 8478 -10919 -14135 -60883
410 -60883 -13372 -32146 200 34534 13187 38003 -12194 -6654 -29694 -43793 -7572 -22191
422 -22191 28957 16067 26052 28160 -24327 3177 -42561 -21611 -3689 -15853 41729 13410
434 13410 29983 13013 -14995 -9621 -44320 -4356 -14969 12901 35327 13409 39752 -18693
446 -18693 -6283 -19923 -44413 12357 -11342 29300 33098 14214 23651 -21282 -7730 -28698
458 -28698 -12078 5968 5024 44366 9106 31532 3046 -23390 7109 -38746 8594 8805 7895
471 7895 44507 8124 24167 -5681 -13283 -13145 -23174 10127 -2247 36673 20448 12756 22893
484 22893 -34851 -976 -26672 -18553 23393 -1439 38829 14773 5889 1550 -28033 -7460 -24268
497 -24268 7395 5444 16240 30977 -9345 19608 -22365 -19711 -2141 -32206 19626 -1634
509 -1634 13841 24331 -7529 7507 -26872 -15394 -20879 -13984 11880 -1232 30030 -1673 2339
522 2339 -5517 -43023 -1511 -27491 1942 17556 1803 27144 -13874 -2045 -17850 -27186 -5655
535 -5655 -17241 17650 -577 14967 11821 -18598 6878 -30329 -9884 -9143 -14938 20435 -4551
548 -4551 22761 1106 -9089 -551 -35069 -2428 -16645 3838 18036 4130 27715 -13523
560 -13523 -2548 -16176 -24418 5088 -11634 25805 8836 10083 15819 -20012 4254 -22272 -4087
573 -4087 5480 -4927 27860 -1630 17060 3445 -11145 6479 -22453 3453 -4008 8542 19444
586 19444 4495 25816 -11795 3259 -6138 -21880 15063 -8250 24929 20740 4992 19171
598 19171 -16647 -747 -12279 -2630 10351 5766 28481 -1524 16556 -2297 -16377 11135
610 11135 -20211 11776 4518 3001 23510 -5876 16005 -4660 -6908 -212 -13187 9835 -5500
623 -5500 20315 8868 3227 16066 -23263 3905 -15325 -10138 18083 -5412 25152 3543 -530
636 -530 -731 -20668 -1450 -15181 7621 2015 6046 16277 -15708 9152 -17847 -13161 4199
649 4199 -19649 13570 -3319 4720 9308 -9714 5514 -17900 -2895 -11149 -8209 9499 -8235
662 -8235 20287 -5850 -1504 1423 -26694 2010 -16326 2343 10002 -2473 15348 -12229 -740
675 -740 -13708 -14831 376 -14304 16474 -4751 4813 5563 -17642 6624 -19898 -2748 -1024
688 -1024 -9345 14930 -6625 10807 -1460 -6337 788 -17658 4421 -12195 5152 9087 -3712
701 -3712 17774 -11532 841 -5835 -15338 8234 -9885 13000 5006 2290 6811 -11829 3219
714 3219 -15839 -284 2523 -4927 19716 -7535 10353 -2 -10378 7847 -14142 7562 -1113
727 -1113 4847 12837 -4094 13410 -7534 2791 -768 -10085 11995 -8017 16766 6507 695
740 695 13005 -13760 6551 -8077 -1229 9942 -2815 19119 -1596 6987 355 -9099 7603
753 7603 -12352 11484 1975 3500 16079 -7774 12328 -7608 -1949 4139 -10119 12758 -3952
766 -3952 10289 5938 -2866 9382 -13165 5450 -6668 -2542 10612 -5935 17107 -3246 2182
779 2182 1851 -13078 7078 -10403 6786 4565 578 13138 -8811 7782 -8106 -5098 5074
792 5074 -9989 12780 -3749 7045 5025 -8862 7849 -13911 1880 -3772 -4718 9933 -9198
805 -9198 11256 -5201 -3632 1239 -15119 5085 -11207 3152 3262 -5640 10340 -11669 2826
818 2826 -8447 -9349 4538 -11914 10197 -3636 1813 4069 -12392 5204 -13633 -721 -1072
831 -1072 -6244 10274 -8669 7079 -4887 -7017 2037 -14490 5857 -8234 1349 5579 -7721
844 -7721 9476 -11541 1076 -4093 -9470 7226 -9378 8960 -1633 420 6002 -11950 6219
857 6219 -9839 395 3111 -4863 13529 -7517 7473 -935 -7849 6232 -10931 7638 -2341
870 -2341 2254 8777 -6693 10295 -7777 1368 19 -6425 10830 -7028 10379 1932 -1300 8835
884 8835 -9916 7806 -4957 341 7934 -4299 13703 -3348 5723 2437 -6354 7662 -7848
897 -7848 8748 701 2461 10441 -7937 10190 -6334 -548 4686 -7334 11404 -4766 6702
910 6702 3930 -4063 8124 -8994 5720 -3219 -636 7989 -5797 12443 -5016 2659 2915 -10183
924 -10183 8049 -8258 6020 2292 -2287 10565 -9601 4918 -4919 -3833 3661 -6854 9542
937 9542 -6024 4051 1765 -8249 7329 -11008 4486 -2222 -4901 8635 -8481 7654 -3676
950 -3676 -2147 3256 -9877 5173 -7604 3350 2139 -3616 8924 -10193 3850 -5065 -6229
963 -6229 5757 -9207 9370 -3359 56 3161 -10303 4961 -9117 2134 760 -4675 7985
976 7985 -8332 5890 -3969 -3757 5291 -9361 7134 -6043 1775 3997 -6606 10243 -8161
989 -8161 2509 -532 -6728 6787 -7507 7695 -884 -72 4699 -8935 5120 -7768 2333
1002 2333 2774 -5248 10486 -7343 4375 -1392 -6204 6399 -7844 7265 -1387 -87 5638 -6734
1016 -6734 7464 -5547 2457 1255 -5584 7890 -6805 7316 -210 -2078 7239 -9392 6886
1029 6886 -5048 -1759 6356 -5147 9103 -4548 2295 -125 -5810 5316 -7452 7337 -1524
1042 -1524 666 7167 -9044 7799 -5820 -508 5403 -5953 8227 -4250 3585 1615 -3092
1055 -3092 5477 -7956 5777 -3140 -629 5620 -7112 9109 -4278 504 3182 -7972 6028
1068 6028 -6848 4142 1130 -3110 7237 -7402 4672 -4066 -1973 4135 -6345 8675 -3912
1081 -3912 2556 2232 -6372 6912 -7793 3809 289 -4073 7314 -6383 5153 -3724 -911 3103
1095 3103 -5917 6033 -6545 3813 807 -4949 8455 -7893 3925 -1185 -4961 6003 -6367
1108 -6367 5662 -2281 1018 2421 -5817 5638 -7870 3557 249 -3596 8701 -6995 4880
1121 4880 -1973 -4094 4453 -6968 5227 -2771 864 2904 -5835 5508 -6490 2936 -992 -4328
1135 -4328 5946 -7652 5865 -2339 -2032 5050 -7694 5675 -4800 -383 2557 -4449 6793
1148 6793 -4808 3829 -1131 -3568 4836 -7378 6378 -2566 250 5267 -7463 6081 -5211
1161 -5211 190 2411 -4515 6347 -5140 4324 -1654 -2261 5053 -7229 5929 -3688 -105 4457
1175 4457 -6023 7191 -4208 2000 1927 -4514 5326 -6001 4672 -779 -800 5962 -6193 5674
1189 5674 -3653 -535 3191 -4862 7299 -4249 3211 1108 -4014 5379 -6458 4711 -1296 -1179
1203 -1179 5412 -5773 6258 -3006 494 2646 -4793 5981 -4840 3787 745 -2247 6479 -6130
1217 -6130 4795 -2382 -1550 4460 -5356 6448 -3079 1456 1957 -5248 5816 -5564 2915 -101
1231 -101 -2609 5438 -5633 5151 -3003 -720 3066 -5893 5662 -4765 2174 2015 -4392 5938
1245 5938 -5863 2730 -933 -2830 4731 -5137 4982 -2435 -380 2694 -5717 4919 -5342 1884
1259 1884 1094 -4392 5681 -5874 2500 -1248 -2679 3649 -5995 4533 -3070 79 2462 -4916
1273 -4916 5402 -5196 1864 -176 -4281 5221 -5268 4529 -958 -1901 3774 -6032 4385 -3735
1287 -3735 222 2398 -4175 5086 -5035 2211 -657 -3366 4750 -5777 4490 -1701 -1173 3799
1301 3799 -5815 5164 -3632 604 1777 -3771 4968 -4409 3116 280 -2208 4189 -5129 4216 -2449
1316 -2449 -193 3846 -4594 5673 -3514 968 1232 -4039 4885 -4588 3788 -22 -2128 4283 -4804
1331 -4804 4084 -2509 200 3854 -4297 5626 -3863 2361 1194 -3125 4998 -4451 3199 -677 -1398
1346 -1398 4457 -3465 4547 -1606 321 3013 -4041 4879 -4275 2251 632 -2953 4730 -4982 2508
1361 2508 -1558 -1357 4539 -3639 4323 -2728 -26 1768 -3138 3909 -3186 2433 -413 -2630 5453
1376 5453 -4994 3179 -882 -904 2614 -4712 4875 -2461 64 2841 -4335 4513 -3788 2103 -462
1391 -462 -2521 3855 -4897 4029 -2378 -482 2543 -4649 4369 -3509 951 1231 -3321 4668 -4340
1406 -4340 2304 -938 -2012 2961 -5246 3492 -2590 295 1978 -4025 4500 -3948 2124 -74 -2892
1421 -2892 4927 -4524 3245 -1296 -1610 2957 -4119 3640 -2548 94 2017 -3511 4384 -3215 1655
1436 1655 191 -2757 3618 -4256 3278 -860 -1046 3403 -4297 3559 -2512 492 1796 -3114 4081
1451 4081 -3347 1676 -328 -2269 3451 -4174 3557 -1568 -892 2412 -4072 4031 -2576 972 1468
1466 1468 -3177 3921 -3681 2480 448 -1025 3683 -3643 3318 -2116 -415 2745 -3264 4572 -2683
1481 -2683 1333 997 -3200 4094 -3580 2526 -15 -1646 2832 -3852 3129 -1957 250 2231 -3525
1496 -3525 3781 -3065 1218 744 -2748 4241 -3294 2244 -253 -1501 2965 -3339 3803 -1523 473
1511 473 1558 -2943 3546 -3339 1838 700 -2131 3937 -3851 2175 -1161 -1372 2962 -3416 3217
1526 3217 -2143 328 957 -3126 3188 -3250 2131 -61 -2108 3227 -3946 2843 -1142 -506 2694
1541 2694 -3670 2966 -2210 410 977 -2606 3323 -3127 1988 -526 -1912 2372 -3770 3273 -1247
1556 -1247 -502 2370 -3399 3198 -2499 484 1011 -2241 3178 -2931 2192 -648 -1321 2879 -3326 3112
1572 3112 -1446 -173 1700 -3312 2957 -2512 942 696 -2621 3528 -3573 2157 -273 -948 2687
1587 2687 -3258 2727 -2461 -1 1628 -3121 3605 -2675 1588 184 -2255 2939 -3249 2513 -595
1602 -595 -352 2087 -2946 2398 -1378 522 1243 -2709 3590 -2709 1171 910 -1523 2112 -2621 2191
1618 2191 -882 -322 1674 -2414 3182 -1757 888 1591 -2677 3038 -2547 1745 -126 -1066 2880 -2927
1634 -2927 2583 -1215 -622 1656 -2359 3392 -2003 889 935 -2221 2817 -3045 1981 -288 -1200 2257
1650 2257 -3443 2398 -1685 18 1453 -2782 2829 -2617 1373 518 -1959 3071 -2850 2005 -654
1665 -654 -1179 2407 -2909 2507 -883 -266 1159 -2333 2611 -2730 1218 313 -2046 2550 -3133 1914
1681 1914 -1051 -1269 2432 -2664 2413 -1373 164 1293 -2299 2604 -2365 1275 -262 -1857 2514
1696 2514 -3100 2109 -524 -524 2404 -2426 2483 -2126 512 1322 -1860 2872 -2146 1191 -315 -1422
1712 -1422 2200 -2953 2316 -1268 -411 1697 -2903 2612 -1841 659 890 -2108 2626 -2556 1689
1727 1689 123 -855 2066 -2357 2695 -1291 -112 1762 -2248 3056 -1842 1172 761 -2132 2410
1742 2410 -2670 1473 -446 -728 2155 -2629 2108 -1422 -106 1048 -1860 2885 -1965 1224 288
1757 288 -1750 2304 -2485 1815 -647 -825 1985 -2485 2252 -1892 487 1296 -2012 2161 -2520 1264
1773 1264 51 -1240 2451 -2402 1906 -872 -715 1635 -2628 2254 -1700 407 1098 -1858 2324
1788 2324 -2725 1227 34 -1439 2205 -2153 2046 -1386 -288 1404 -2283 2417 -1535 798 741
1803 741 -1859 2214 -2414 1575 -660 -1148 1847 -2612 1872 -1266 -135 1364 -2095 2579 -2142
1818 -2142 536 497 -1838 2334 -2127 1660 -401 -996 1669 -2248 1668 -1194 165 1290 -2350 2334
1834 2334 -2020 644 70 -1464 2167 -2451 1359 -517 -758 1642 -2286 1839 -1539 22 850 -2156
1850 -2156 2286 -2192 1547 72 -1301 2136 -2126 1737 -810 -270 1677 -2112 2166 -1561 444
1865 444 635 -1742 2202 -1813 1178 93 -932 1671 -2302 1951 -893 -308 1647 -2133 2232 -1837
1881 -1837 561 855 -1784 2283 -1594 1319 -212 -828 2102 -2084 1865 -1220 -53 1422 -1899
1896 -1899 2306 -1469 705 611 -1018 2210 -2146 1624 -319 -852 1380 -2012 1985 -1152 -168 1120
1912 1120 -1702 2047 -1851 1063 279 -1369 2002 -2105 1374 -357 -792 1374 -1814 1924 -1043
1927 -1043 553 714 -1729 2217 -1767 793 365 -1141 1622 -1928 1815 -528 -698 1611 -2413 1643
1943 1643 -1478 390 500 -1813 2152 -2077 779 -196 -1019 1943 -1730 1520 -774 -249 634 -1770
1959 -1770 1860 -1449 669 565 -1492 1805 -1874 1305 -200 -961 1515 -2130 1595 -1059 121
1974 121 1174 -1721 1875 -1148 622 299 -1472 2095 -1982 1112 -201 -327 1559 -1674 1882 -1115
1990 -1115 -47 943 -1241 1810 -1724 779 313 -1401 1584 -1688 1459 -470 -579 1146 -2016 1855
2006 1855 -1102 197 628 -1411 1842 -1818 941 241 -998 1632 -1840 1545 -463 -587 1251 -1762
2022 -1762 1974 -1222 440 554 -1215 1607 -1510 1056 -189 -823 1521 -1773 1333 -1054 -79 1219
2038 1219 -2041 1901 -1135 606 399 -1191 1737 -1826 1107 -194 -940 1205 -1896 1660 -899
2053 -899 188 1251 -1928 1761 -1167 650 43 -1321 2111 -1617 1341 -372 -520 1299 -1735 1486
2069 1486 -1067 259 588 -1555 1779 -1646 781 111 -974 1685 -1809 1307 -573 -554 1106 -1314
2085 -1314 1500 -1229 316 671 -1526 1994 -1360 1188 28 -1417 1597 -1613 1170 -443 -153
2100 -153 1002 -1514 1520 -1248 138 180 -1334 1703 -1360 801 74 -987 1556 -1767 1894 -709
2116 -709 -309 981 -1698 1662 -1388 606 372 -1592 1629 -1338 931 -348 -634 1221 -2072 1452
2132 1452 -913 -72 836 -1448 1362 -1150 394 210 -1348 1204 -1304 1082 -201 -617 1366 -1662
2148 -1662 1485 -923 357 963 -1438 1386 -1461 936 90 -1123 1514 -1547 1174 -490 -311 1180
2164 1180 -1401 1639 -741 255 557 -1136 1582 -1719 1097 -101 -763 1389 -1456 1063 -543 -108
2180 -108 1149 -1142 1489 -644 290 519 -1058 1644 -1544 862 -45 -688 1424 -1508 1412 -628
2196 -628 30 1267 -1097 1272 -935 547 588 -966 1410 -1238 1089 -323 -805 1406 -1448 1406
2212 1406 -648 165 486 -1162 1461 -1201 479 364 -1242 1568 -1432 783 -140 -376 982 -1345
2228 -1345 1342 -724 -14 422 -1194 1492 -1249 771 332 -1166 1492 -1174 981 -513 -503 1089
2244 1089 -1504 1080 -802 -188 436 -1169 1640 -1137 543 221 -595 1045 -1301 1554 -376 -673
2260 -673 866 -2073 619 -1118 -541 247 -1066 1643 -1233 589 -305 -489 185 -1289 764 -498
2276 -498 466 1023 -1343 1207 -317 -769 235 -847 1310 -1164 238 -67 -926 856 -980 581
2292 581 -1209 -209 550 -1130 1302 -385 375 551 -747 1412 -1273 322 -723 -527 622 -1534
2308 -1534 1219 -561 108 491 -971 1330 -1133 572 112 -584 1491 -890 973 28 -504 1148
2324 1148 -843 1084 -865 246 573 -1028 1048 -1373 806 -330 -791 1335 -1452 900 -209
2339 -209 -255 987 -1032 1219 -556 342 491 -874 1195 -1010 626 178 -681 1123 -1158 1213 -480
2356 -480 -160 661 -1106 1221 -798 186 489 -876 1352 -1108 830 -205 -757 870 -1062 1198
2372 1198 -264 3 665 -653 1180 -951 232 369 -699 1122 -1357 965 -327 -248 1006 -1142
2388 -1142 710 -523 -284 199 -1122 1209 -1076 266 -26 -865 655 -1160 968 -435 -420 1082
2404 1082 -995 904 -668 266 487 -792 1753 -1017 390 188 -731 1120 -549 1084 -799 -894
2420 -894 380 -1138 779 -796 376 -350 -1133 885 -538 -43 258 -892 1053 -1497 955 61
2436 61 -986 44 -1203 1354 -390 1025 517 -1161 1467 -868 451 -48 -66 513 -627 1558 -903
2453 -903 -314 -359 -809 19 -1416 -37 570 -999 696 -906 1020 -610 -760 460 -1023 1813 -439
2470 -439 312 1076 -523 1851 -902 709 404 -1089 1018 -801 609 208 -1147 319 -1632 372
2486 372 -218 -487 593 -1298 752 -58 648 250 -702 1225 -1136 812 -268 190 1528 -1023 337
2503 337 -603 730 653 -793 375 -733 -266 -309 585 723 -564 298 -386 548 1215 -518 34 -1102
2521 -1102 60 -127 -700 460 -1052 657 -326 -438 -379 -1256 173 -535 -392 798 -456 637 -224
2538 -224 -680 422 -802 349 -470 78 172 -294 485 -1203 1066 -383 -96 640 -1284 325 -570 260
2556 260 120 -650 865 -727 700 269 34 636 -933 1227 -502 -76 334 -400 781 -646 570
2573 570 504 -706 549 -1296 677 368 -700 887 -760 877 -616 -246 994 -313 281 -1366
2589 -1366 453 -189 -938 524 -302 831 -907 -229 263 -1284 1428 -813 501 675 -1590 1023
2605 1023 -1002 592 489 -536 5 -798 957 -499 -1095 516 -247 1032 -550 1008 190 -540 630
2622 630 -1126 697 -493 -19 137 -599 936 -178 393 -244 -682 908 -962 641 -107 -637 670
2639 670 -817 461 4 -186 749 -319 521 -784 -245 802 -555 469 -964 230 -16 -197 741
2656 741 -732 824 -56 -513 540 -797 525 -445 59 346 -608 815 -572 125 -26 -266 694 -867
2674 -867 384 -179 -204 540 -781 750 -401 -98 261 -557 483 -823 442 71 -298 543 -697 372
2692 372 -171 -96 114 -503 859 -619 167 223 -614 778 -654 174 -2 -293 569 -668 483 -165 60
2711 60 392 -1047 535 -636 143 324 -670 642 -605 146 -142 -371 594 -459 458 -421 -266 319
2729 319 -700 441 -578 244 368 -553 732 -685 434 -171 -76 305 -465 579 -484 -155 156 -679
2747 -679 548 -340 411 -31 -544 826 -535 460 -257 75 323 -545 486 -457 -112 335 -686 591
2765 591 -361 269 181 -250 408 -712 427 3 139 401 -435 643 -216 -62 -4 -636 487 -245 206
2784 206 -20 -150 382 -518 437 -277 -44 491 -513 620 -377 184 309 -355 534 -414 427 22 -363
2803 -363 484 -657 410 -420 -101 285 -366 435 -248 326 286 -395 542 -500 355 -87 -225 502 -537
2822 -537 748 -90 64 305 -594 448 -264 148 -17 -144 374 -522 485 -198 -271 425 -749 443 -129
2841 -129 130 118 -167 548 -446 350 -3 -248 757 -387 622 -391 -49 439 -443 428 -242 121 210
2860 210 -147 465 -525 164 70 -415 463 -534 477 60 111 425 -488 746 -655 6 -148 -237 551 -284
2880 -284 288 -135 -292 774 -614 708 -195 -158 448 -338 263 -159 502 33 -385 264 -399 350 -65
2899 -65 -26 432 -432 486 -195 196 204 -218 449 -473 160 -122 -240 475 -604 295 27 -114 217 -293 511
2920 511 -452 224 471 -496 413 -366 61 -21 -453 206 -348 295 156 -141 386 -641 535 -570 89
2939 89 312 -352 536 -517 329 -2 -316 243 -615 410 -168 -401 261 -285 311 -71 100 267 -293 518
2959 518 -408 560 236 -330 319 -666 574 -432 -115 -66 -392 406 -119 171 43 -93 262 -225 202 342
2979 342 -354 213 -277 579 -214 -26 26 -748 390 -117 146 145 -390 405 -507 280 -226 -579 441 -813
2999 -813 598 -43 103 319 -545 194 -527 -203 112 19 370 -639 308 -25 -346 275 -541 467 -344
3018 -344 -282 91 -432 136 -296 167 494 -311 473 -178 233 94 40 225 -285 500 -242 -51 164 -545 399
3039 399 -310 7 -167 -232 283 -190 337 -289 -290 -5 -494 360 -334 125 84 -512 411 -483 130 238 -52
3060 -52 350 -440 431 123 -255 381 -431 370 -314 99 224 -429 418 -527 111 27 -280 179 -646 162 -35
3081 -35 66 469 -114 560 -77 53 207 -147 412 -328 271 256 -297 104 -414 481 -429 65 17 -121 371
3102 371 -329 254 198 8 310 -268 151 -158 -225 511 -404 337 -227 -37 235 -161 337 -43 188 -67 109
3123 109 246 -326 237 -204 -32 324 -607 567 -270 69 190 -238 515 -561 480 -187 -669 358 -394
3142 -394 212 -245 -68 199 -589 538 -17 15 242 -478 545 -416 249 -5 -28 573 -389 235 -212 131
3162 131 271 -573 497 -363 144 216 -126 476 -568 72 -182 -361 260 -323 341 -231 13 26 -292 482
3182 482 -337 -12 125 -162 357 -321 112 -194 63 275 -392 363 -50 -116 66 -244 216 -480 -87 119
3202 119 -136 192 -422 43 -175 -105 -72 -295 376 -128 107 70 -146 352 -191 169 211 -33 446 -609 630
3223 630 -2 96 330 -491 207 89 122 -101 -396 216 -153 233 360 -179 82 -241 364 -424 -47 600 -30
3244 -30 334 -248 -49 353 -274 528 -359 347 10 -289 -68 -261 483 -383 72 -138 -321 503 -117 -7
3264 -7 342 73 701 -470 242 154 236 168 -83 391 -99 114 157 -254 514 -337 -5 298 -339 670 -367
3285 -367 125 312 -117 203 -372 440 61 -282 238 -499 728 -262 77 153 -238 290 -54 110 18 271
3305 271 401 -490 294 -38 -77 207 -325 458 -427 399 44 -246 356 -411 264 -653 157 176 -396 228 -162
3326 -162 113 -39 -226 458 -192 92 -106 -170 262 -47 131 -183 29 289 100 798 60 412 -30 -145
3346 -145 596 -304 365 -217 -219 463 -231 779 411 -249 -108 -370 382 -48 465 148 -5 35 -159 -53 196
3367 196 -218 214 -631 189 -768 -244 608 -203 355 -145 321 254 68 475 -404 762 38 188 145 -84
3387 -84 280 -266 -182 343 -401 227 242 -104 316 -133 333 99 371 152 196 273 -105 233 -421 -72 4 -133
3409 -133 788 243 18 186 -605 148 -342 1065 -131 22 328 -849 567 -379 -197 232 -650 -354 -707
3428 -707 -505 -258 602 -181 -189 674 -298 470 293 1194 -285 537 -121 153 44 1211 -1313 -519 -152 -24
3448 -24 -379 163 358 1043 842 615 -1309 215 23 134 -632 -260 -58 -669 807 -520 83 415 429
3467 429 387 122 1057 544 -31 1083 -698 731 430 126 302 -89 76 231 -381 242 -659 501 -537
3486 -537 117 744 -881 139 -1332 -328 633 -85 107 -224 764 165 -493 407 -416 799 580 73
3504 73 54 8 225 98 570 238 -334 385 -645 -652 -487 305 -687 -412 575 193 625 -269 442 311 -217
3525 -217 203 -141 -324 0 222 319 36 26 -8 -720 -60 -98 572 -124 -194 96 714 83 -442 -338 -107 -294
3547 -294 355 37 661 54 154 130 291 -379 476 -325 258 -1142 199 73 297 301 -290 127 304 242 897
3568 897 509 249 -741 -553 111 58 220 -555 -151 -180 523 145 24 277 -900 -144 -199 -146 273 23 218
3589 218 607 -345 -305 -467 -165 -229 -75 632 -203 467 -487 -58 305 563 249 -347 388 -350 75 -607 -173
3610 -173 719 -93 435 322 3 415 -399 748 321 9 132 -337 379 -165 678 559 -689 -26 -2 -70
3630 -70 -128 -97 537 -15 -216 -313 -99 72 -1015 336 -212 -26 347 512 181 -266 260 -260 -268 -108 -603
3651 -603 580 -413 -259 491 465 229 -794 105 -209 -113 161 -2 -231 -557 -63 372 111 -287 -470 -256
3671 -256 -165 -45 135 -101 19 223 -531 -58 496 -242 -81 99 511 -669 114 207 -330 -120 -989 -133
3691 -133 83 -199 398 120 742 -260 22 -169 -722 0 -149 187 466 234 -372 -756 186 -805 -15 178
3711 178 -531 272 36 -149 143 80 194 -398 407 -455 -217 94 25 154 -129 -159 -85 307 -324 -29 215
3732 215 81 169 198 122 174 -30 42 35 121 13 -155 5 24 112 114 -17 274 52 34 203 -25 127 -178 131
3756 131 91 -94 147 79 197 89 -143 137 21 83 63 163 67 -231 -125 -91 79 25 66 81 -127 111 -332
3779 -332 -122 210 -53 214 -86 -7 -55 -253 454 -42 -17 -125 92 224 -327 478 -362 204 -2 4 -57 16
3801 16 -118 -362 -253 87 -149 -226 561 216 -24 -392 -132 426 -254 -35 135 217 347 381 -374 -588 779
3822 779 -684 -757 114 -317 -93 -177 735 -5 -122 -1067 565 713 294 591 -100 280 694 -744 967
3841 967 784 -573 900 -588 552 691 -349 932 -716 -426 418 385 119 -131 -163 -395 -334 -317 744
3860 744 141 378 -907 -933 70 780 -164 -132 -235 330 -177 219 348 341 573 -161 -137 100 -249 333 -8
3881 -8 220 -75 445 434 35 -309 415 46 247 586 65 7 228 -13 -220 465 -398 258 -296 -1377 126
3902 126 -361 871 -479 -19 -412 -30 -648 298 214 -597 773 -538 -315 140 472 -200 303 -76 30
3921 30 60 -217 99 183 58 -21 -86 418 -96 140 193 139 -44 -245 39 -170 -30 -101 -48 12 -47 409 -64 -138
3945 -138 85 -13 113 26 68 -470 -243 -117 -18 129 189 52 476 -106 54 198 503 -450 -396 210 -101 109
3967 109 15 -48 -142 -134 235 148 -81 248 44 100 -359 -274 408 -216 19 -63 -153 23 144 45 -125 220 -223 -194
3991 -194 -1 -198 201 56 104 -61 -133 286 148 -219 122 141 -57 191 75 221 44 68 125 118 89 51 -11
4014 -11 14 -128 -64 259 -160 67 164 -170 -377 -66 -98 -12 85 -78 -182 113 -23 -1 109 55 204 343 -71
4037 -71 -188 55 -26 -37 25 82 319 60 -47 202 -135 22 -86 59 -40 -23 -157 -98 -167 192 170 -64 120
4060 120 -67 169 185 -46 51 76 -21 -70 -200 70 -7 73 -97 72 -144 61 -102 -77 -75 -185 258 -161 29
4083 29 218 -107 309 -167 44 35 -82 -79 -147 112 92 207 -20 -151 192 153 178 228 301 -66 91 235 -203 212
4107 212 181 -189 8 184 184 -128 -102 38 -151 -23 -22 -73 344 78 178 76 136 144 18 60 10 -123 141 -50
4131 -50 -296 48 -50 -103 6 53 171 19 -207 -12 88 -13 88 -97 -45 95 -110 84 -17 126 104 -69
4153 -69 88 9 170 194 160 -159 -185 191 -153 55 208 -138 -45 -59 23 -108 -31 -86 54 219 -80 35 22 -198
4177 -198 -68 -300 53 20 93 -71 -1 -3 -128 -221 3 192 90 -196 20 207 2 155 -13 43 58 -120 243
4200 243 122 271 284 118 -83 -47 -26 -301 -329 151 76 -83 49 -31 -92 100 -17 25 156 -260 271 73 -13
4223 -13 132 -99 -127 -28 -339 -86 31 -185 153 175 -179 -48 249 -1 10 146 3 57 -375 306 -159 3
4245 3 -33 135 293 326 120 -159 -23 393 -235 -33 48 1 -189 -37 214 47 31 87 -130 201 -27 -196 28
4268 28 6 194 -215 232 36 100 -82 -391 213 -43 -1 123 -70 100 9 157 60 121 -14 -262 225 -16
4290 -16 -213 348 -197 326 -109 229 -266 -130 14 110 -69 -223 314 -335 134 171 -216 -279 -61 745 786 332
4312 332 209 -145 158 48 237 -61 -36 -884 -642 297 11 44 41 -244 677 -526 -667 395 785 -924
4332 -924 218 -1279 328 -369 -10 620 470 399 -267 4 -454 167 -134 -353 879 13 -391 -164 554
4351 554 47 -334 587 715 -752 -348 234 574 22 -168 -1782 262 -629 -595 -145 -447 -523 -320 -425 57
4371 57 -364 -753 76 -222 862 529 -267 352 -934 164 295 -175 200 248 170 -485 -348 -908 -134 135
4391 135 -273 -199 -756 -32 -397 -1208 -722 154 -605 -446 219 517 178 -281 -136 310 -19 255 -312 -737
4411 -737 529 659 -756 869 -272 83 504 86 333 -504 323 -656 134 92 -63 647 252 -279 -91
4430 -91 93 300 -419 -110 150 -599 -513 -423 60 -125 782 340 145 721 4 -9 379 126 68 -287 -504 363
4452 363 -154 168 -966 231 414 -460 -116 5 -1193 -62 156 -644 411 407 -92 -246 185 -32 845
4471 845 406 -416 519 418 -249 108 204 -1018 -672 -218 489 -1241 -732 -596 326 -82 -298 -276 1145 -68
4491 -68 -602 543 -1018 468 213 -390 573 -3 -525 -217 -572 348 -992 634 535 -1052 -1062 300 -162
4510 -162 -158 570 -124 -159 -51 -66 -262 -237 35 -274 487 -321 -835 728 -268 -57 399 82 110 337 359 -257
4532 -257 600 120 39 -751 170 -117 727 -190 160 -464 -280 -85 141 9 -93 297 256 -95 -191 187 389
4553 389 -660 -1087 98 -181 285 -167 -278 -71 143 287 255 -486 -228 514 85 -366 -56 -390 -137 457
4573 457 318 -174 -254 -340 -309 541 64 -54 173 53 -146 -51 338 485 -174 367 -99 -182 501 18 -79 91
4595 91 -394 185 -515 -207 -440 -174 -398 78 169 243 64 43 -144 -196 22 123 188 125 391 -112 228 280 5
4618 5 -7 -380 183 -130 -77 127 -12 132 -194 152 -119 107 246 281 211 -109 64 73 -183 614 -234 -30 -282
4641 -282 -309 -369 -78 636 318 -156 466 -311 190 -98 136 57 -105 912 180 -49 -556 487 283 -445
4661 -445 -248 313 -733 663 139 168 -803 -56 -51 290 -80 -341 149 489 87 278 205 729 192 26 -292
4682 -292 596 585 -181 85 254 689 -172 -689 -228 -172 -326 -145 98 -99 -81 2 -304 240 -339 297 -757
4703 -757 -150 -297 87 -275 -470 92 323 -95 -204 123 -59 200 344 -178 318 -350 12 38 -107 -33 -141
4724 -141 7 75 176 -239 523 255 -107 -132 141 2 235 -195 267 -180 13 135 38 325 -467 -59 -329
4745 -329 93 69 382 -15 357 483 -149 226 -80 129 -218 32 600 -407 -540 307 -142 -48 263 -668
4765 -668 619 -347 379 286 405 562 -286 125 261 -609 -377 -382 445 117 -2 -33 -95 85 -222 -370 -367 225
4787 225 108 -45 280 -353 -629 -255 211 693 -197 682 691 -877 630 -293 742 357 -119 496 -151 121
4807 121 246 138 -176 -535 840 540 67 -549 474 357 -1019 660 243 -428 -270 -1288 -514 -506 125
4826 125 21 -484 798 572 423 -275 -525 485 -21 -57 -615 -328 -224 457 502 788 -380 -13 -556 166
4846 166 -506 -604 64 649 19 82 227 -841 -660 -40 352 133 445 122 -204 -310 431 45 361 450 -564
4867 -564 -556 26 299 113 284 439 256 65 562 -561 -13 60 -48 233 -93 210 -3 517 -179 -865 -137
4888 -137 529 -165 90 593 16 802 579 -603 463 -251 58 67 392 227 -240 -207 332 -1198 238 -104
4908 -104 135 349 -288 211 -74 -311 -233 37 432 -424 -398 464 237 -265 273 377 -283 -47 -434 590
4928 590 29 -295 95 -107 -568 99 -698 69 20 -319 65 12 -46 -5 -125 -387 -510 -592 -809 173 663 -45
4950 -45 403 322 355 -653 7 186 209 488 -500 216 159 -343 -33 -199 308 -282 -168 -99 206 297 -57 -6
4972 -6 487 620 434 -28 491 -33 -537 -114 -401 -213 -102 73 -73 -188 194 -265 22 178 165 88 -419
4993 -419 38 -124 -371 269 180 -10 34 -34 0 364 57 -238 -248 -13 -269 288 -106 240 -36 -202 -184 81
5015 81 138 107 162 191 -197 127 43 216 160 -159 6 -285 289 188 -157 193 -256 284 -42 19 -75 -61 137
5038 137 -429 43 -196 -2 -135 -327 56 380 30 15 -314 -123 -202 34 6 -76 188 -120 -59 -65 -16 111 115
5061 115 55 -78 -215 -96 -150 20 -495 -21 150 81 380 -269 114 -165 -291 115 -221 228 -157 -6 -232
5082 -232 -173 295 -174 203 85 -60 237 13 200 -445 -68 113 -56 80 19 -5 -4 -100 226 41 -8 -76 -159
5105 -159 133 -48 368 -148 -14 98 -188 94 -418 -143 -57 13 43 -138 -59 235 175 74 -55 190 -119 -105
5127 -105 143 -10 -91 23 227 211 299 132 -206 220 -5 -166 167 -86 -168 75 94 0 -68 38 0 6 25 -64
5151 -64 344 -91 -151 14 111 -124 -156 11 -291 155 45 -273 167 3 31 38 -178 50 -240 31 -101 -39 192
5174 192 -193 194 -45 -30 -1 -548 137 -50 154 -201 -167 93 -181 292 -30 25 -215 -313 57 -109 123 60
5196 60 32 -54 -61 -86 37 -325 -36 -93 194 -70 157 142 -433 -130 54 134 74 172 270 72 44 -361 -147 -70 118
5221 118 -104 -117 217 -48 -112 197 -146 255 -32 -179 280 -126 -18 114 -41 248 -112 139 -308 -61 70
5242 70 117 371 9 108 184 -96 83 -129 -275 29 213 -2 -126 50 -248 60 -119 -95 242 -283 263 -340
5264 -340 -21 96 81 24 27 427 537 3 192 -593 -294 -428 -394 711 49 -126 -332 -68 439 173 -77
5285 -77 -147 -508 332 192 777 284 380 345 -129 -323 -311 -397 497 1149 -301 -351 497 -103 603 -423 -138 942
5307 942 22 -376 739 -472 -266 437 -398 1043 209 -870 -105 -824 -969 -58 312 1305 1231 281 -1095
5326 -1095 272 -250 1121 -218 -549 -391 -636 -288 0 -510 299 -58 -416 -253 384 147 -137 288 483
5345 483 76 -563 195 -282 -211 706 152 528 -199 -187 -140 -44 324 179 728 -551 314 470 291 134 97
5366 97 140 -814 -288 -89 5 568 240 -369 245 213 62 -198 32 184 416 100 48 402 205 25 219 -101
5388 -101 188 378 -554 850 587 83 62 -478 227 -71 133 289 -83 372 521 -72 -68 115 -73 623 371
5409 371 -185 -727 -480 563 -269 -228 -473 -643 481 -328 175 -308 -69 539 -237 208 107 -8 446 347
5429 347 -381 292 -152 -31 -258 172 302 47 226 332 243 173 -174 473 -159 -6 -236 375 -161 -123 518
5450 518 6 193 -123 205 118 -437 -14 -88 62 215 -198 162 -373 525 -206 -323 -61 -238 390 -82 -303
5471 -303 138 496 353 186 327 -77 -147 359 12 269 48 -147 -34 74 19 -14 -143 335 -73 172 119
5492 119 -441 -547 -11 -72 16 577 256 20 -108 81 129 -333 -15 -14 -272 137 -271 412 98 102 -232 -365
5514 -365 323 -157 -361 -201 127 -203 54 49 79 759 -144 -55 -151 -107 479 97 -94 215 367 474 -301 -502
5536 -502 -244 273 829 71 -119 801 66 1213 -73 -218 914 -196 1395 179 -405 270 46 710
5554 710 -91 97 318 -348 -217 -527 -434 -633 -278 -93 -690 -37 561 -106 -126 -507 410 -382 -50 323 438
5575 438 31 76 -384 320 156 505 238 19 -393 486 415 -1008 367 -97 -33 -539 382 77 908 12
5595 12 593 783 237 -101 627 136 -750 474 -330 208 -407 29 -355 751 357 -351 -224 -211 -720 376
5615 376 475 335 152 470 28 -146 247 -118 -337 430 -397 596 4 358 169 -1 -33 -218 114 -85 136
5636 136 77 -147 266 41 -58 273 79 145 -347 -246 19 20 101 106 80 243 2 238 -141 101 -259 -141 392
5659 392 -249 -12 -355 -17 -70 41 52 -61 192 -95 81 -25 -219 92 -185 98 22 -136 -36 29 455
5680 455 1 77 -288 -131 12 -82 56 -89 -114 -20 97 -51 193 36 58 -175 19 13 -76 124 -183 24 69
5703 69 81 -54 -260 314 -149 -260 26 58 -269 -98 -69 -4 -78 15 -180 239 108 -37 -25 -92 177 50 35
5726 35 -136 -355 -48 84 -94 -23 96 358 72 239 139 -75 -216 53 -2 -219 -94 -193 -80 81 7 -160
5748 -160 -190 155 -163 -291 160 45 56 15 -224 26 -271 18 42 -27 5 -206 40 21 493 -2 164 166 -22
5771 -22 131 227 -203 -95 -285 69 79 133 115 -15 99 -247 218 -60 -24 261 -387 -188 -82 -54 335 -254
5793 -254 46 -58 -66 -51 -21 462 -131 134 177 112 52 273 136 216 -114 63 10 -81 -11 -199 62 126 -238 -38
5817 -38 280 -7 -62 351 -106 -119 26 -265 118 -349 35 -202 11 98 140 84 -62 5 125 -53 258 -50
5839 -50 365 -93 -54 -42 -22 275 -157 -24 -205 -180 -8 -91 47 -84 -264 -213 -231 84 -166 47 136 -191 164
5862 164 -325 -145 -134 -380 -46 -135 145 23 -120 166 -158 79 -115 37 -1 -38 173 -176 46 -46 1 140
5884 140 -70 216 -141 107 -103 -116 -92 -44 -159 -21 43 60 92 -227 118 5 -14 -184 -80 -238 -14 118
5906 118 -357 -101 -325 -272 277 -144 -97 -228 -39 70 -85 -41 -11 120 -244 49 75 -121 16 -14 -133 123
5928 123 93 136 84 159 112 -37 278 -218 17 -51 50 8 -50 43 -88 -58 75 -190 -50 -165 170 -33 40 225
5952 225 -150 -34 -149 -8 205 156 82 -330 -135 -133 101 11 -245 -123 80 -52 380 116 220 -129 66 198
5974 198 57 199 22 6 95 -190 356 12 223 183 241 -49 -73 48 97 -120 -57 71 190 -217 -30 -70 153
5997 153 4 13 70 -24 -156 227 -15 -19 24 204 50 6 34 -480 157 -88 -111 -152 -101 -42 80 -106 95 -147
6021 -147 43 23 -196 154 -87 96 1 149 4 -217 -58 -124 71 -94 -77 376 199 176 -181 12 -130 -7
6043 -7 361 65 235 -114 12 79 51 203 14 -15 18 -237 96 -38 -35 109 118 54 -111 118 -212 245 38 -99
6067 -99 321 108 -266 117 -184 -22 -174 -15 -207 -97 134 -227 72 -53 155 160 -224 77 -207 -148 143
6088 143 459 126 252 -71 -53 258 417 -117 3 53 -269 143 279 186 -142 -44 -17 -101 -64 28 -168 66 10
6111 10 38 -126 -11 -34 22 116 143 415 -241 394 -51 -30 38 -262 -4 32 -60 263 -145 106 -100 -95 -115 56
6135 56 -426 -13 225 75 375 -242 -511 771 270 146 432 270 428 252 -306 794 -699 -333 -888
6154 -888 -1075 540 387 194 -290 -351 -773 -121 -31 -40 287 -445 135 174 222 239 246 248 212 237 148 195 542 -25 -197
6179 -197 153 154 51 -334 -153 6 -620 87 340 228 -287 -11 -245 224 57 550 -102 16 -2 163 -213
6200 -213 147 456 -543 -198 24 -816 -494 -299 13 16 316 -93 -398 -16 -488 764 -776 674 -364
6219 -364 703 537 630 676 -468 -293 -138 257 339 37 216 -269 185 221 -291 315 -417 1243 76 -849
6239 -849 -222 270 70 -8 1276 523 -38 -476 -3 -128 949 -194 176 -156 -50 108 202 596 -185 574
6259 574 -57 281 -56 -45 -269 21 -38 23 242 -72 -390 -299 184 130 232 134 -103 161 185 657 153 -68
6281 -68 -187 -470 95 -118 -39 -107 430 -325 50 176 -79 -58 -134 -14 135 509 -38 104 18 664 250 -45
6303 -45 -290 -371 119 -82 52 -45 -110 -164 -127 427 -524 128 80 77 -125 16 246 -165 136 197 -49 317 267 67
6327 67 115 -145 98 -500 4 -100 -200 93 -51 315 -4 -119 1 23 232 -263 195 85 331 -6 93
6348 93 -176 -726 -409 -145 -131 -71 301 -54 458 185 -245 12 310 434 445 418 768 1342 -134 148 -215
6369 -215 -479 -175 776 -323 231 476 167 -181 -916 -107 -268 -854 -414 460 -384 -257 138 -97 56 4
6389 4 209 -408 194 430 -260 -385 -469 -153 -262 274 236 -254 384 123 -253 609 -2 30 -460 -242 -438 -513
6411 -513 593 472 -404 -194 -216 35 263 172 514 -487 454 -158 -162 539 209 97 -725 -602 -466 -538 -233
6432 -233 -47 486 454 -428 -176 -189 303 382 -185 234 331 377 771 265 -244 288 -275 210 -772 -341 -269 300
6454 300 -225 157 687 -603 232 -174 254 328 194 308 -577 516 233 565 92 -79 148 -103 -343 -82
6474 -82 115 -542 273 -585 150 -303 -307 -711 295 28 102 17 -200 -226 235 -189 292 232 429 319 173 92
6496 92 255 -309 -1104 -5 -226 564 -245 206 -77 -121 -229 349 312 -32 85 103 -195 -286 -393 -390 359 -183
6518 -183 -505 -43 195 -162 -233 97 -57 269 -13 115 -125 209 212 86 28 96 217 -618 -270 304 -307 138
6540 138 358 320 171 -603 -197 -114 2 -278 644 155 -99 227 23 84 521 315 316 -219 -569 -551 -42 -65
6562 -65 -155 -212 -318 653 458 -383 102 -277 173 -113 122 569 154 -238 490 -653 106 -128 -128 -129 -171 -241 372
6585 372 271 216 -285 107 -94 463 560 -48 -674 -200 350 271 170 204 -210 687 -86 -582 -98 -284 316
6606 316 -317 233 -503 -223 115 -164 717 -113 11 -171 -132 235 880 -364 1023 -212 -72 1021 530
6625 530 1065 253 332 -959 200 70 658 296 148 519 390 -440 -375 166 -727 -239 492 -21 143 992
6645 992 64 165 -265 -325 63 -103 38 21 96 382 -282 -106 77 245 -229 -202 22 318 -283 319 761
6666 761 150 6 -513 -174 553 96 -269 39 134 -143 -342 548 311 89 11 -317 534 151 -307 247 -166
6687 -166 283 -450 -61 38 40 93 244 69 -118 176 -354 74 -248 554 -37 181 289 -4 554 -102 -365
6708 -365 -25 140 314 -177 97 170 -78 -125 24 -28 -287 -50 -205 186 185 -37 52 -174 243 5 -207 -239
6730 -239 172 128 5 -88 57 -44 2 110 -83 139 -85 53 200 1 4 66 213 4 -21 88 -135 -76 105
6753 105 140 198 1 232 -195 141 -189 51 94 -187 -53 113 185 -37 141 123 102 -96 -202 -207 -78 115 -49
6776 -49 89 -70 -40 -22 140 -70 37 16 -198 -8 145 144 -13 248 136 -3 66 -5 109 123 -123 169 -138
6799 -138 143 -68 123 297 351 47 -281 -134 -265 -242 33 81 441 -284 -99 -227 161 -65 161 79 -188
6820 -188 62 -181 -58 37 103 -180 133 4 60 54 -110 32 -32 283 -71 53 156 -157 95 -239 54 -24
6842 -24 310 -38 -314 -221 -163 127 64 -165 195 -47 59 -174 -242 -188 -387 265 -197 200 92 68 17 -22 -35
6865 -35 35 -25 219 275 12 -4 29 -147 -24 157 -155 -42 102 9 -21 114 126 -61 -212 73 17 -71 168 -17
6889 -17 260 -16 89 -72 -302 33 -98 -64 -45 140 51 -125 -24 -5 64 -115 223 -121 104 64 -342 363
6911 363 139 -75 102 -181 182 -8 -2 230 -27 -3 -170 52 89 -408 47 -47 -41 -68 207 103 42 2 -39 -116
6935 -116 -259 -16 63 318 -3 -60 -303 145 -102 154 175 -382 130 157 87 -117 -150 218 52 98 -56 -38 34
6958 34 -113 -118 -490 -39 57 -29 198 -99 277 56 96 80 314 56 64 3 -39 -48 33 -57 12 75 -21 -196 15 -94
6984 -94 -4 9 -99 -41 64 34 58 -4 -123 108 -43 145 93 -372 40 19 -89 113 -128 241 54 -14 -100 241
7008 241 87 21 123 122 87 -203 -176 -108 -25 -73 190 -78 -188 -33 225 -168 -188 -22 -48 161 -58 198 96
7031 96 225 50 -103 59 -94 -208 -5 -69 -34 -32 -29 -146 -101 -34 -139 47 129 138 -90 53 -73 13 -232 -66
7055 -66 -38 -66 57 -29 -228 -104 -160 -230 160 127 -176 240 3 -120 45 94 -108 -207 148 56 7 -104 -70 -156
7079 -156 49 141 216 -36 52 -118 244 -94 329 -77 -127 -60 63 -82 111 -127 59 325 130 -13 -42 46
7101 46 89 -43 80 44 82 -142 -258 -66 266 -239 -14 -159 -151 -27 152 172 49 56 -181 166 84 167 100 -134
7125 -134 -142 -17 -81 -253 78 149 -207 3 -47 111 71 40 51 160 -39 -227 -29 -29 -70 -37 115 243 -54 -16
7149 -16 4 242 78 -61 15 205 -98 79 -21 -5 165 51 22 -328 -186 -199 -15 -51 -14 -138 38 183 -62
7172 -62 128 -20 -20 -133 162 -24 -192 -117 -66 -174 52 55 -51 391 91 -64 -52 308 90 131 -12 -93 -134 -154
7196 -154 -341 -20 -113 -30 -126 -87 16 10 73 79 172 -90 63 124 -149 64 -192 112 27 -203 146 105 -23 -46 -169
7221 -169 -52 -184 46 162 -95 27 128 59 -191 341 41 -145 71 -136 41 238 -18 14 -18 -40 3 -416
7243 -416 19 -357 -75 7 66 -183 24 101 -78 143 -35 215 83 -14 15 -253 21 241 -194 -126 190 -87
7265 -87 -12 46 -5 36 19 -75 -123 43 61 -79 20 175 132 -82 139 247 -7 -224 153 -186 -141 -113 -31 244 228
7290 228 36 210 -293 158 -63 -144 52 88 208 177 8 -147 45 -128 111 -216 -96 193 33 109 -39
7311 -39 -124 -54 174 -28 68 204 103 186 102 212 54 -73 12 -60 -9 -3 -53 104 -212 254 -79 -98 70 97 32
7336 32 -52 208 -116 -13 34 -53 -42 63 8 145 270 -63 -15 51 1 -246 394 -79 -122 230 299 70 -46 193
7360 193 75 -80 -162 41 -79 60 -185 -106 -356 180 -234 -29 25 -134 -174 25 153 -162 -128 -103 -262 -49
7382 -49 407 -233 25 -85 170 -98 125 62 -92 276 -63 312 11 244 70 -45 115 162 16 382 3
7403 3 128 -36 77 -3 -115 143 -175 134 83 96 124 66 54 42 -1 -139 -8 185 -101 -27 -221 -238 -251 34
7427 34 59 -46 -204 352 184 -28 -72 171 161 -11 -92 87 -43 124 369 -43 -48 127 49 -97 117 -48 32
7450 32 17 149 150 53 42 115 -113 -58 194 113 -117 193 -145 80 141 -48 -45 -305 -183 71 -162 83 190 93
7474 93 16 -285 4 -316 -14 40 -195 -78 88 -207 -287 130 61 173 185 -131 99 -126 9 283 -97 13
7496 13 -144 134 44 -19 -69 154 -81 380 163 -98 35 39 -203 -4 -279 233 273 40 163 -43 -116 -160 -83
7519 -83 -22 307 -11 18 -262 40 -122 -124 -109 88 -50 77 40 -136 195 -6 -122 109 183 105 -208 -154 184
7542 184 -142 -49 39 -239 -18 -139 -151 9 106 -26 -59 -123 -194 -19 210 13 -289 -6 -132 1 -89 -66 145
7565 145 5 70 -229 106 -114 335 163 -288 -97 154 -154 -70 58 -337 -77 -107 147 36 -39 8 102 -177
7587 -177 15 1 -25 219 -441 49 25 -113 -6 40 120 -98 209 -62 176 129 6 -60 13 -224 -211 10 50
7610 50 1 -162 -54 104 -117 -2 79 239 -178 158 -42 -235 5 -172 -137 -13 -396 -63 27 -94 121 41
7632 41 61 37 -25 -46 100 17 -38 -125 -131 87 135 63 -184 167 -10 6 96 -77 177 -130 184 86 -57 -84 42
7657 42 77 -77 20 -34 272 -72 163 52 208 -18 271 -153 385 14 123 23 3 -124 12 -7 132 -138
7679 -138 -151 77 104 203 177 -41 39 -259 22 -59 -203 -40 -55 68 -30 -52 99 201 123 261 29 -175 36
7702 36 -189 -79 -61 -87 188 71 -116 9 -48 -27 28 178 131 33 137 7 -33 65 176 48 -218 -286 -211 -141
7726 -141 122 74 143 -83 -180 233 142 50 173 -49 63 105 -195 -225 16 -93 7 -128 190 240 -38 -79 -211
7749 -211 246 32 -92 58 1 -16 -11 -108 -93 -233 -260 47 -80 102 -87 63 -138 -33 -114 73 79 50 53 89 -353
7774 -353 9 -4 -36 123 -23 112 118 -141 154 -63 -69 317 156 17 -300 18 -64 127 -38 -328 16 36 -196
7797 -196 180 239 -63 190 -71 230 -32 -1 319 -24 35 -61 261 136 -105 236 -144 217 107 -309 6
7818 6 378 24 -222 -96 -66 -191 160 5 -212 64 232 292 -256 88 -5 151 120 88 -82 257 -103 -155 145
7841 145 43 84 4 25 -2 -165 -11 -135 -16 60 44 95 -283 237 -33 -63 72 135 -7 -27 8 -16 196 4
7865 4 135 -13 -196 122 59 269 7 -28 64 308 83 -100 -98 145 10 -66 26 245 26 -42 -92 80 300 -192
7889 -192 -29 12 78 60 -102 -91 78 41 271 -44 -100 120 118 123 133 -66 47 -43 -76 134 -171 184 -27 33 102
7914 102 -195 235 51 -71 -25 -194 -30 -186 -38 -47 11 257 -170 -153 98 92 -314 100 -165 -91 106 -228 -136
7937 -136 -182 73 -144 -55 85 11 106 -35 32 -29 -163 149 47 -1 -164 101 -195 -103 -9 43 84 -43 60 46
7961 46 150 -204 -54 129 -122 -356 -194 131 45 6 -210 221 110 -81 -33 -347 -90 -99 76 130 -6 -194
7983 -194 42 -184 -48 -46 142 -57 -237 -392 -51 -203 25 198 -182 -56 73 27 -131 -97 -123 -83 -66 12 270
8006 270 357 92 -174 137 -26 -73 97 -56 -41 114 116 144 -296 -16 28 6 14 71 -23 -46 -109 -116 89 121 160 33
8032 33 46 262 4 24 112 -155 -197 186 221 -253 -69 48 -197 -56 -122 -131 -99 80 -44 -79 211 7 -266 -106
8056 -106 10 88 -75 5 -171 -107 -216 -414 105 -31 119 162 -179 -89 54 95 -18 -212 119 -31 -136 -377
8078 -377 -132 -319 -151 8 188 153 -143 -2 -22 274 -198 0 -29 -280 -98 -143 -113 -35 52 -28 381 160 7
8101 7 275 -42 114 -263 -132 -29 162 36 -88 -111 270 -184 25 -147 -120 -82 264 134 78 24 -48 -9 -246
8124 -246 186 -77 4 -185 78 -218 -185 123 -54 -199 -116 41 100 160 -110 -118 49 -213 -38 -258 118 -42
8146 -42 -7 99 280 -130 -247 35 -87 -50 164 227 5 -35 10 -123 -57 353 80 66 130 -131 52 -83 -5
8169 -5 222 157 39 325 -201 180 -302 -69 -99 223 55 -275 10 124 -87 192 413 286 127 -144 -140 -27
8191b7
$$ Imaginary data points
##PAGE= N=2
##DATA TABLE= (X++(I..I)), XYDATA
0 0 0 0 0 0 0 0 0 0 8 -8 8 -8 16 -16 24 -24 32 -40 48 -57 72 -88 104 -120 142 -162 192 -220 255 -292 334
31 334 -381 432 -490 554 -623 701 -786 877 -982 1089 -1210 1344 -1488 1647 -1818 2007
47 2007 -2215 2441 -2688 2960 -3261 3594 -3964 4378 -4846 5376 -5986 6690 -7521 8513
61 8513 -9726 11247 -13215 15881 -19711 25716 -36579 62677 -264586 -238908 -26599 -138762
73 -138762 255686 162753 84807 -22592 -162863 -277283 -254661 -203116 -30532 164322 86132
84 86132 159850 111267 -144586 -65786 -269865 -219316 -28514 -63793 172124 213850 115927
95 115927 50326 -75012 -151663 -251045 -146113 -24806 112504 174116 200466 182642 -107572
106 -107572 -106571 -148252 -237796 3534 39558 174381 223576 106326 93806 -80396 -142852
117 -142852 -132157 -73582 21242 107460 200019 133354 155613 11558 -95989 -42129 -172681
128 -172681 -18428 94004 102721 213323 145780 108480 -22152 -98170 -99011 -109169 31872
139 31872 94447 198805 172566 100444 67980 -113133 -89493 -97195 -53732 95895 115652 186659
151 186659 114047 62883 -16903 -126264 -63780 -94180 13072 96347 106974 161244 61927
162 61927 30565 -65948 -112699 -82969 -78504 55908 70640 132254 120752 21054 3187 -132509
174 -132509 -103151 -84001 -50899 89504 82652 130888 59936 -15911 -55419 -151148 -90596 -72535
186 -72535 17941 76415 82877 107311 -16967 -30553 -108591 -132696 -58132 -75200 64884 67501
198 67501 58780 74306 -42894 -58565 -124708 -105143 -61662 -22431 68237 55170 93043 974
210 974 -50886 -62464 -156014 -59479 -46185 16320 93277 45476 72065 -26423 -74825 -97687
222 -97687 -109472 -42967 -25194 75240 62609 50470 33459 -70934 -53364 -117651 -74857 -4652
234 -4652 -7589 87636 50376 47837 -1756 -72112 -56330 -103436 -35321 -6807 45016 85936 37170
247 37170 60136 -40484 -60427 -68124 -88631 9430 3164 81367 85689 33914 28249 -65096 -52370
260 -52370 -77764 -40637 30442 33826 99193 44825 40353 -8789 -75883 -30839 -67972 4470
272 4470 35176 54144 96327 24746 34980 -29999 -53595 -38295 -45104 39877 29454 82516
284 82516 79643 22086 22841 -61065 -35363 -44812 -19845 58784 43108 93473 43047 17986 -11134
297 -11134 -72651 -23339 -42017 24643 54189 51007 84957 6511 10052 -39684 -54520 -17858
309 -17858 -30556 53531 41114 59169 55706 -4869 3283 -64855 -32340 -22425 -11979 59903 35266
322 35266 68411 17779 -10660 -17997 -75416 -19162 -27692 21292 51616 32837 60331 -16668
334 -16668 -16188 -45486 -59647 -10706 -23524 47298 35175 36248 32994 -34537 -16383 -66390 -36427
347 -36427 -9597 -7057 53601 20148 42484 -1032 -38339 -26845 -70242 -14746 -14593 21095 47181
360 47181 10998 37014 -28923 -31632 -44281 -54802 3398 -14552 42868 30371 14004 18567
372 18567 -44569 -20439 -55991 -32369 6647 -756 49637 13123 24365 -8748 -45868 -21357
384 -21357 -59554 -5672 849 21655 48204 574 21643 -32806 -36803 -29657 -43773 16840 3099
397 3099 41185 31961 5452 10320 -45272 -14481 -32143 -13861 26101 11867 54739 11005 16673
410 16673 -779 -43859 -2898 -30603 8933 21722 26948 51298 3638 17644 -23397 -27641
422 -27641 -13949 -23813 33228 10173 43310 34913 -5945 13046 -44631 -15182 -12866 -8840 38167
435 38167 17828 42897 9608 2243 -8524 -38714 -368 -20152 22979 24339 18635 47067 -13897
448 -13897 9740 -17912 -33370 5983 -15885 28569 20369 26359 25741 -8921 -36 -35266 -9198
461 -9198 -13684 651 37853 3947 42604 67 -16381 -2468 -47243 -820 -7304 9766 33308
474 33308 9825 22944 -14441 -10444 -27800 -23565 1278 -15521 34409 3897 12555 16938 -35764
487 -35764 1214 -33953 -19535 4767 -9612 28390 4855 14004 -3561 -19052 -15067 -36107
499 -36107 1592 -15648 15450 26014 -4640 25534 -27237 -16523 -16454 -35424 14838 -4414 21174
512 21174 16067 1249 4819 -27921 -9095 -26198 -5757 5584 -372 33232 -9576 12094 -2688
525 -2688 -28931 1421 -29259 5288 3216 6999 30254 -2170 13606 -15060 -13276 -12883 -19006
538 -19006 20056 -1975 30832 19197 -2096 11454 -30095 -2566 -13583 -1627 23550 2365
550 2365 33243 -4 2701 -838 -23774 5420 -15078 15505 10890 7512 27848 -7027 13422
563 13422 -12057 -9621 880 -15675 24741 3583 22772 20136 -4369 12292 -25023 -1523
575 -1523 -6956 -1825 28248 4162 29522 2041 -5747 -2341 -22368 3980 -9422 17300 12764
588 12764 4959 23120 -18347 5419 -12084 -15195 10824 -14768 18228 4673 5571 12650 -9492
601 -9492 2239 -19575 -2671 -9283 -2515 20607 -7253 24590 -4317 -12167 -506 -30862 4357
614 4357 -8307 6894 18514 -4682 10603 -16446 -9395 -16830 -13494 5104 -11053 21398 -4008
627 -4008 -458 5475 -27266 5805 -20504 -7246 5397 -10963 15741 -4442 6073 -3969 -11979
640 -11979 -4017 -22496 5899 -11308 6910 15082 -9997 17518 -19194 -9859 -7337 -19777 10947
653 10947 -4931 14344 5501 -3164 1691 -21437 619 -16923 1483 8603 -5405 22130 -9959
666 -9959 3336 -1166 -15877 6818 -15396 8201 2024 2861 15557 -6208 11172 -11746 -2571
679 -2571 -1817 -13869 15736 -5231 17391 9064 -5350 10139 -19307 2574 -6417 -1974 15473
692 15473 -190 19375 -2470 2831 -1974 -13127 9708 -11581 14100 7602 1073 18905 -9920
705 -9920 8863 -6163 -5288 6321 -7926 14178 -157 11070 6419 -4326 10496 -16205 5278
718 5278 -3644 -3237 18287 -4665 17944 -1689 -4339 2501 -14402 7555 -5955 10070 9893 1522
732 1522 14059 -11159 6287 -8044 -4962 10041 -9720 16582 -627 3476 7422 -12388 6697
745 6697 -12936 1476 62 -4963 13138 -6701 11253 -5709 -6144 1556 -17536 8192 -8399
758 -8399 4383 9316 -6543 11684 -13390 -1592 -5819 -9848 8171 -7927 12066 -1487 31
771 31 4106 -15559 5122 -13282 604 3652 -7283 13402 -8935 5422 -4466 -10970 3105
784 3105 -15174 5834 -5674 824 7026 -9998 8943 -13445 -3664 -4191 -11530 8826 -10054
797 -10054 9257 -317 -5503 4391 -16130 3089 -11190 -1280 6253 -8232 12208 -8494 1593
810 1593 -3296 -11920 4881 -12831 7318 -1447 -457 8898 -10851 7703 -10447 -3017 1216 -9452
824 -9452 11753 -6062 8085 3049 -5727 7162 -12388 5125 -4815 -778 10137 -5221 13649
837 13649 -4744 2019 1094 -10373 9119 -8352 8870 3954 -693 12177 -9190 7425 -5174
850 -5174 -2497 6488 -5776 13637 -3212 7473 5222 -6313 9174 -9854 7225 -166 -113 13731
864 13731 -5986 12682 -1467 247 4447 -8941 10056 -5628 7344 6541 -1823 10975 -8374
877 -8374 6179 -4615 -3624 8318 -7399 13070 -2419 2881 5579 -9529 7861 -9004 3067
890 3067 2364 -3000 11204 -6858 8022 -2955 -3177 3701 -10177 9082 -6375 3980 5967 -6767
904 -6767 9551 -10262 1429 -2610 -7444 7982 -7845 7954 -2138 -2214 2973 -11563 4823
917 4823 -9974 1736 1461 -6643 10571 -10243 3980 -2841 -7359 4883 -11318 6882 -4135
930 -4135 -1037 6397 -7952 6460 -8773 217 -2349 -7584 8247 -8577 7552 -1321 -4073 4943
944 4943 -13118 5118 -6779 -1146 5990 -6659 9016 -7180 957 -1413 -7055 5814 -8243
957 -8243 7789 -2110 -951 7048 -9122 7871 -6331 -87 3448 -7776 9557 -5745 5574
970 5574 2180 -4376 7075 -9967 4807 -3582 -709 7258 -5834 10604 -5170 657 978 -7844
984 -7844 7867 -7191 7816 1900 -3487 8914 -8788 5169 -3323 -768 6097 -5815 9204
997 9204 -4613 3516 2288 -4352 8065 -9064 5670 -1061 -2969 9120 -7288 8766 -2569
1010 -2569 -1320 3506 -8689 6879 -5288 4672 3628 -3107 7494 -8370 4422 -2988 -2350 7046
1024 7046 -6600 10134 -3698 898 3681 -8732 7998 -6160 3112 2275 -3905 7713 -5947
1037 -5947 5873 -2934 -1479 3683 -7887 8569 -6233 2631 4897 -7029 8541 -7358 1922
1050 1922 -344 -5022 7435 -5130 6512 -2079 -279 3671 -8195 6640 -7278 2734 3115
1063 3115 -5557 8486 -7131 3477 -816 -3995 5413 -7972 6230 -2835 -461 3960 -6491
1076 -6491 6284 -6896 1702 335 -6184 6954 -6934 6137 -874 -2787 6020 -9453 5114
1089 5114 -3801 -732 5055 -4541 6878 -5637 2894 -828 -5160 6356 -7550 7110 -1328 -2446
1103 -2446 6356 -8223 5302 -4101 -940 2745 -5162 6105 -5506 3660 -896 -3557 5927 -8092
1117 -8092 6060 -3294 -1842 6967 -6939 7148 -4137 -7 2062 -5684 5633 -5728 4513
1130 4513 974 -1714 5857 -7628 5043 -4134 -1347 4958 -6210 8003 -4228 1349 2231 -6374
1144 -6374 6154 -5593 3957 -13 -1672 5325 -5608 6120 -3355 635 3619 -6390 7891
1157 7891 -5325 2452 3094 -4667 7092 -5278 3415 -1122 -2380 4511 -5073 7044 -3455 1261
1171 1261 2831 -6598 6713 -6297 2943 2064 -3681 6919 -5756 4084 -1878 -1562 4117 -5567
1185 -5567 6932 -3621 1168 3038 -5112 6726 -5565 2740 296 -3409 5757 -5479 5369
1198 5369 -1691 -1091 4381 -6826 5773 -4494 695 3015 -4314 6055 -5205 2783 -1253 -3362
1212 -3362 4979 -6329 5230 -2566 -725 3988 -6357 5774 -4956 1012 1549 -4123 5844 -5654
1226 -5654 3647 -668 -2999 4452 -6340 4224 -3086 -607 3291 -5821 5661 -5376 1208 14
1240 14 -4417 5236 -6371 3923 -783 -2683 4576 -5764 4326 -3469 -207 2564 -4621 5638
1254 5638 -4384 2489 191 -4056 5090 -6650 4263 -1420 -1911 4524 -5236 4845 -3980 -140
1268 -140 1504 -4922 5439 -4515 2832 72 -2895 4806 -6240 4444 -2092 -778 4253 -4999
1282 -4999 5794 -3595 1209 2372 -3881 5512 -4660 3344 -80 -1783 5250 -4557 5178 -2233
1296 -2233 -473 3105 -5441 5600 -3558 2055 2488 -3821 4979 -4849 2786 -576 -1633 4765 -4353
1311 -4353 5148 -1923 155 2620 -4405 5718 -3580 2231 1983 -3258 5103 -4358 4038 -581 -1628
1326 -1628 4202 -4812 4807 -2342 533 2947 -3946 4836 -4603 1813 1146 -2936 5127 -4570 3851
1341 3851 -1277 -1605 3531 -5231 4332 -3108 906 2153 -4386 5559 -3913 2523 -373 -2301 4316
1356 4316 -4279 4084 -2128 -1334 2963 -4405 4107 -2673 -496 1288 -4489 5309 -3801 2414 -175
1371 -175 -1631 2912 -5310 3362 -1876 -406 3386 -5458 4805 -2348 1696 1851 -3478 5291 -4817
1386 -4817 2564 -404 -2147 3482 -4883 3779 -2569 -271 2750 -4353 3939 -3344 1436 -323 -3831
1401 -3831 3709 -4745 2716 -764 -2021 3644 -3864 3582 -2677 720 2157 -4381 3412 -3309 2779
1416 2779 978 -2471 3924 -3533 3220 -845 -920 3778 -3698 3772 -2404 -149 1739 -3639 3834
1431 3834 -3353 2252 257 -2056 3822 -4349 3379 -1596 -575 2974 -4110 4023 -2138 866 2152
1446 2152 -2572 4147 -3198 2047 17 -2051 3366 -3495 3794 -1435 -143 2326 -4352 3895 -3081
1461 -3081 1550 1447 -2914 3905 -3892 1768 -400 -1477 3580 -3553 3465 -1998 40 1743 -3716
1476 -3716 4390 -3257 1806 684 -2909 3925 -3851 2997 -128 -1507 3255 -3983 2851 -2338 -41
1491 -41 1994 -3176 3695 -3289 1340 -443 -2551 3896 -3905 3099 -881 -1465 2672 -3825 3238 -2095
1507 -2095 446 1617 -2684 3328 -3343 1903 -248 -1965 3511 -3743 3031 -1475 -1054 2623 -3516
1522 -3516 3492 -2490 528 887 -3191 2905 -3158 1876 -153 -1440 2654 -4241 2770 -1918 -746
1537 -746 2283 -3222 3956 -2890 487 1109 -2569 3059 -3148 2338 -769 -1146 2598 -3410 3276 -1903
1553 -1903 162 1832 -3341 3591 -2645 763 785 -2118 3356 -3082 2036 -886 -1170 2610 -3416 3322
1569 3322 -1436 549 1362 -2867 3183 -2717 1477 934 -2669 2946 -2822 2573 -1136 -732 2465 -3025
1585 -3025 3266 -1636 425 991 -2281 3546 -2938 1595 304 -1978 3017 -3582 2687 -913 -796
1600 -796 2558 -3230 2914 -2112 778 668 -1738 4181 -2737 890 114 -1285 3744 -2784 2311 -856
1616 -856 -249 1784 -3337 2672 -2143 589 1072 -2309 3009 -2869 1715 -288 -946 2686 -2581 2581
1632 2581 -1524 -211 1807 -2632 2869 -2404 1162 544 -2268 2924 -2791 2136 -266 -868 2321
1647 2321 -3248 2336 -1839 -107 1387 -2197 2771 -2627 1149 -297 -2295 2706 -3156 2365 -718
1662 -718 -1012 2006 -3053 2721 -1608 299 1450 -2352 2472 -2173 1172 -335 -1264 2932 -2914 2200
1678 2200 -1119 -530 2137 -2915 2966 -1610 179 977 -2170 2185 -2712 1876 -81 -981 2212 -2968
1694 -2968 2275 -1263 -426 1959 -2721 2811 -1665 926 785 -1865 3034 -2267 1769 -333 -664 1934
1710 1934 -2787 2610 -1099 54 1868 -2283 2621 -2450 1067 978 -1634 2531 -2773 1737 -396
1725 -396 -959 2252 -2444 2687 -1217 392 1009 -2310 2579 -2248 1228 509 -1399 2657 -2647 1697
1741 1697 -581 -719 2077 -2314 2483 -1722 455 1023 -2067 2443 -2210 1295 16 -1875 2457
1756 2457 -2548 2211 -1041 -282 1807 -2698 2534 -2080 466 829 -1863 2563 -2121 1426 -170
1771 -170 -1348 2232 -2546 2178 -1170 -358 1644 -2623 2411 -2057 732 801 -1881 2002 -2153 1261
1787 1261 -745 -728 2241 -2816 2036 -1281 -239 995 -2367 2519 -1931 916 616 -1777 2122 -2248
1803 -2248 1767 -387 -851 1940 -1847 2236 -1395 43 1141 -1923 2384 -1717 795 565 -1605
1818 -1605 2201 -2349 1731 -607 -879 1706 -2284 2015 -1527 626 948 -1761 2651 -2109 1283
1833 1283 73 -1168 2302 -2364 2197 -706 -486 1883 -2272 1807 -1402 714 679 -2099 2597 -2417
1849 -2417 1153 -129 -1006 1797 -2540 1874 -1061 -635 1564 -1916 2346 -1797 698 702 -1705 2246
1865 2246 -1762 1563 22 -1174 1912 -1900 1850 -1228 -68 1517 -2227 2038 -1979 495 387
1880 387 -1287 2369 -2287 1328 -248 -564 1513 -2004 2259 -1105 20 943 -1792 2077 -2090 876
1896 876 355 -1651 2234 -2098 1607 -779 -480 1891 -1964 2278 -1271 37 515 -1630 1985 -1810
1912 -1810 790 -12 -1025 1625 -2612 1438 -907 -312 1251 -1881 2082 -1582 279 723 -1628 1848
1928 1848 -1703 1236 -172 -1196 1745 -2307 1706 -870 -256 1234 -2099 2198 -1506 374 436 -1620
1944 -1620 2126 -1906 1362 -308 -1178 1698 -2379 1952 -1221 -165 1354 -2136 1990 -1618 827
1959 827 388 -1404 2157 -1901 1278 -649 -471 1771 -2090 1766 -1134 92 965 -1674 2271 -1549
1975 -1549 1198 211 -1236 1701 -1994 1606 -662 -460 1356 -1854 1633 -1485 213 1120 -1652 2123
1991 2123 -1728 1013 69 -1012 1599 -2038 1398 -638 -317 1036 -2157 2168 -1389 721 759 -1509
2007 -1509 1931 -1855 853 -24 -1210 1652 -1803 1456 -872 -212 993 -1975 1908 -1756 615
2022 615 467 -1311 1683 -1503 1258 -536 -404 1596 -1929 1645 -1154 -312 1158 -1603 2255 -1523
2038 -1523 759 695 -1232 1514 -1539 1272 -371 -681 1761 -1710 1213 -1027 359 1063 -1624 1668
2054 1668 -1299 850 148 -1201 1695 -1736 1331 -291 -668 1195 -1646 1639 -1109 405 783 -1290
2070 -1290 1492 -1391 1119 -145 -845 1534 -1910 1509 -433 -642 1400 -1707 1721 -881 260
2085 260 255 -1442 1261 -1869 1035 66 -951 1589 -2184 1421 -661 -101 1247 -1543 1336 -1276
2101 -1276 421 447 -1122 1930 -1494 958 -430 -768 1333 -2087 1315 -892 -80 599 -1687 1848
2117 1848 -1564 419 627 -734 1600 -1632 1147 -634 -416 1093 -1322 1724 -701 198 846 -1536
2133 -1536 1397 -1319 588 120 -1175 1387 -1551 1035 -604 -314 1105 -1554 1518 -776 345
2148 345 483 -1278 1811 -1509 861 58 -991 1210 -1502 1064 -407 -42 1032 -1323 1566 -1486
2164 -1486 667 594 -1241 1585 -1504 774 -152 -669 1187 -1618 1343 -825 -211 932 -1644 1522
2180 1522 -1232 547 263 -885 1239 -1636 1535 -243 -654 1426 -1318 1267 -484 78 816 -1420
2196 -1420 1378 -1110 611 234 -985 1491 -1427 1115 -222 -577 1283 -1760 1399 -960 -32 836
2212 836 -1249 1224 -1440 708 233 -966 993 -1554 1185 -533 -337 1242 -1604 1345 -1194 215
2228 215 526 -1205 1078 -1430 548 65 -854 1106 -1457 1235 -381 -396 945 -1158 1196 -1304
2244 -1304 387 535 -1184 1034 -1244 485 -53 -856 737 -1416 1162 -651 -351 1183 -1083 1382
2260 1382 -1037 567 559 -1050 1116 -1140 909 -269 -1169 1266 -1791 1316 -961 -216 1879 -1583
2276 -1583 508 -910 271 167 -1003 1682 -840 1589 -1089 -402 828 -2141 1010 -573 107 829
2292 829 -1001 1799 -1445 470 602 -886 657 -1311 1600 -859 -540 818 -813 965 -707 -227
2308 -227 186 -693 1508 -842 624 195 -884 1158 -1154 1025 -247 -382 601 -1165 1016 -593
2324 -593 607 534 -1070 1498 -799 1165 358 -422 1054 -1028 1389 -482 -128 1126 -1188 1205
2340 1205 -814 370 530 -1136 1243 -946 659 -114 -452 975 -1242 1100 -450 -247 483 -1037
2356 -1037 1262 -655 331 223 -670 1218 -1015 949 -106 -375 774 -1170 915 -706 9 728
2372 728 -822 1024 -714 488 388 -775 1010 -971 613 -100 -553 713 -952 1243 -221 177
2388 177 264 -878 725 -782 645 -157 -661 894 -1011 976 -20 -257 380 -739 1504 -545 -17
2405 -17 174 -1224 1362 -1290 285 -484 -316 513 -697 736 -263 -397 1191 -1677 955 -547 -41
2422 -41 559 -1423 799 -1261 1312 -214 -564 1146 -809 1718 -518 -779 825 -958 1315 -730
2438 -730 599 -153 76 133 -82 407 168 -1089 859 -811 866 -1303 67 346 -1447 1279 -215
2455 -215 753 583 -1030 980 -1357 678 -78 -656 431 -1102 638 262 -563 37 -1029 1396 -22
2472 -22 343 268 -834 1543 -611 621 -557 -599 688 -1057 985 -245 179 909 -822 296 -823
2489 -823 -25 529 -672 1107 -1222 767 -717 655 383 -355 1684 -1166 733 -486 -1201 251
2505 251 -1204 -99 -169 -857 1098 -768 -105 726 -47 -157 -900 161 -500 358 36 -537 374 -381 485
2524 485 193 -62 499 -711 596 -1235 652 69 -650 1083 -980 600 -102 -765 1552 -901 867
2541 867 444 -126 73 -346 1150 -1188 546 177 -729 1376 -375 161 778 -313 641 -1042 524
2558 524 -270 -429 554 -659 943 -504 110 -85 -781 619 -618 840 -167 -351 626 -1039 63
2575 63 -750 -414 228 -1151 969 -381 -105 377 -594 1115 158 -252 -169 -266 623 -1144 -76 -1186 -414
2594 -414 946 -649 -242 122 1156 614 -668 395 -1297 -120 -651 -1046 233 -548 860 -1065 -152
2611 -152 300 -882 1825 386 206 -891 -613 776 -259 213 -1292 -19 1000 -1307 4 -438
2627 -438 385 684 -1609 491 -720 507 293 -153 452 -698 560 -182 -579 685 -682 352 -775
2644 -775 128 726 -83 450 -938 515 129 -201 644 -835 493 37 -296 548 -207 517 -267 -277 438
2663 438 -625 548 -620 176 -218 -254 563 -599 459 -242 -162 424 -715 774 -194 165 332 -525
2681 -525 513 -807 374 -13 -185 865 -371 406 -300 -34 461 -847 585 -303 121 189 -778 553
2699 553 -631 241 -271 -403 398 -676 459 -423 -11 415 -527 667 -577 159 187 -579 563 -483
2717 -483 326 -100 -66 673 -630 601 -398 29 330 -492 364 -741 415 116 -364 678 -486 490
2735 490 249 -228 535 -621 427 -272 106 185 -445 455 -427 481 163 -65 472 -454 341 -249 -34 220
2755 220 -627 826 -373 309 245 -170 252 -377 339 -101 -230 590 -544 292 -123 -22 615 -258 495
2774 495 -448 272 54 -237 618 -543 523 -3 -436 555 -699 545 -353 -354 277 -458 466 -525 374
2793 374 280 -405 683 -486 432 -139 -510 432 -413 292 -311 14 231 -451 596 -596 -109 190 -429
2812 -429 490 -621 121 -124 -204 629 -844 388 -258 236 166 -656 654 -791 137 34 -456 230 -501
2831 -501 386 -233 53 404 -629 418 -279 306 262 -632 448 -243 282 170 -379 164 -541 363 91
2850 91 14 457 -238 851 -457 -42 4 -663 673 -341 547 -319 -224 529 -281 323 -525 7 58 -824
2870 -824 498 -195 221 -81 -431 799 -810 291 48 -164 386 -205 380 -267 -31 196 -523 577
2888 577 -302 361 -150 -613 270 -615 502 143 175 564 -109 292 -163 2 178 -377 224 -388 326 97
2908 97 -181 508 -763 423 -92 -456 403 -556 267 5 -11 95 -229 397 -465 377 183 -86 398 -521
2928 -521 515 -107 44 348 -606 665 -443 125 64 -195 234 -468 350 1 -168 308 -804 818 -286
2947 -286 -135 389 -472 638 -211 -18 355 -540 325 -298 166 -80 -102 386 -343 487 -261 -28 126 -417
2967 -417 599 -433 -17 255 -419 400 -544 375 32 -15 214 -359 356 -358 -180 320 -486 433 53 90
2987 90 185 -98 484 -389 143 -138 -318 489 -394 458 -117 33 397 -462 346 -405 324 -67 -365 402 -418
3008 -418 213 -172 153 492 -125 345 -277 285 106 -324 447 -487 195 123 -337 632 -593 413 -120 8
3028 8 336 -510 439 -158 256 59 -407 281 -534 368 44 -41 607 -198 421 -90 -171 24 -247 451 -399
3049 -399 170 -44 -244 333 -388 317 -110 -525 361 -218 307 142 -135 317 -386 558 -287 324 122 -231
3069 -231 217 -590 519 -227 -180 745 -493 202 -225 -342 173 -156 193 -284 177 26 -154 122 -436 93
3089 93 71 -67 27 -181 492 -97 -30 309 -506 245 -221 45 19 -217 395 -519 293 53 -340 292 -367 427
3111 427 -252 -92 242 -461 577 -450 185 38 -236 400 -349 596 75 131 296 -369 651 15 140
3130 140 -36 -285 186 -414 633 -290 -272 270 -191 454 -283 -158 163 -398 445 -376 189 -130 -281 544
3150 544 -337 198 33 -266 -40 -355 269 -344 56 201 -429 409 -76 -165 40 -152 245 -416 346 -24
3170 -24 -270 417 -410 403 -451 69 -71 -440 483 -197 312 28 -176 439 -460 80 -23 -98 326 -572 239
3191 239 -293 242 54 -391 284 -303 143 25 -203 548 -285 335 -305 -222 200 -586 408 -273 157 19
3211 19 -196 281 -421 60 72 -128 348 -174 447 -308 -215 -128 -236 391 -115 50 -34 -203 371 -521 101 198
3233 198 -243 219 -538 362 -197 -13 144 -679 643 -298 27 188 -307 431 -145 254 -27 -258 338 -86
3253 -86 57 -220 -135 -221 -609 287 -4 261 -217 -442 324 -401 230 74 -314 -26 -200 323 -90 123 117 -303
3275 -303 385 -195 38 139 -122 110 -253 269 -490 -96 263 -440 -77 -620 105 355 -297 633 -220 115
3295 115 303 224 81 -778 639 -313 -399 396 -366 260 -193 -62 -7 -242 432 -345 130 361 202 355 -336
3316 -336 297 -387 -10 -45 -682 312 25 104 166 -6 264 -250 353 -174 145 86 -434 -62 -263 -109 592
3337 592 264 -10 -86 125 -91 -508 335 -250 488 261 35 -83 -445 598 -211 246 -188 -325 447 -443
3357 -443 273 -193 48 4 -264 472 69 135 368 -426 398 -94 750 -55 -435 447 -254 -91 42 66 514
3378 514 -218 167 -247 -384 214 -561 275 -382 -241 -124 -714 -52 -402 -34 688 -612 27 -314 716
3397 716 -82 -163 72 -913 300 -4 569 -642 -639 -26 -542 225 185 82 392 -6 -56 -376 686 674 -515
3418 -515 403 -373 -234 -218 609 -264 -611 -152 1027 233 279 11 991 83 40 277 56 99 328 345 -78
3439 -78 -1265 -145 -1096 180 -741 -628 1365 -163 -54 -378 459 -118 278 -297 -483 656 995 127
3457 127 -136 -45 253 -13 15 156 -121 149 -206 273 -236 286 896 59 760 -440 144 332 -135 658
3477 658 -69 164 780 -879 761 -378 791 827 988 529 530 1245 -425 -985 -303 -296 358 -143 -21 -81
3497 -81 -96 100 -260 236 232 750 -64 -202 286 453 240 376 15 232 -22 443 136 119 -262 -201 735 60
3519 60 -153 413 -627 380 -281 -248 -59 -290 860 330 -17 -232 -279 388 112 543 -352 -76 630 487
3539 487 148 -35 159 -290 750 940 61 379 188 108 106 -338 564 479 51 77 -538 303 139 638 372
3560 372 -94 479 -230 -182 167 239 113 -118 271 -609 -348 145 432 722 -141 -80 241 222 244 232 669 48
3582 48 -536 204 -201 -179 -99 264 62 -510 300 8 826 248 -122 530 -661 88 512 -183 -279 -559 928
3603 928 -667 -610 157 -498 -203 31 -4 -101 -325 -69 -436 -70 -376 232 224 -534 708 -136 -194 -230 -167 499
3625 499 -35 343 546 -442 -597 -260 391 33 -348 -487 -361 310 582 -785 -621 28 231 -224 25 226
3645 226 317 -114 -814 -233 -433 -263 147 156 509 894 890 -228 -53 -79 -219 652 679 -132 152 -376 -22 369
3667 369 160 138 -157 180 344 555 -395 -73 212 -82 194 65 20 1093 -59 -457 -291 -132 98 56
3687 56 149 -1021 -139 -498 -68 -106 -7 263 -433 -162 263 -593 239 -706 -37 -31 211 -527 -829 662 426
3708 426 668 -138 -88 57 369 216 65 121 123 -155 -99 66 234 348 -315 -210 208 -457 18 -110 90 -85
3730 -85 -130 90 87 -32 35 -153 -170 -213 76 -126 186 -54 -232 157 -19 127 -2 223 -64 -164 217 -76
3752 -76 33 230 -281 65 -181 -28 -238 18 14 -224 304 -22 7 91 -87 130 -201 -84 6 190 189 18 234
3775 234 -228 -213 184 -103 63 118 160 -113 -191 181 43 133 196 -29 40 -248 -21 -342 -131 113 31 80 -121
3798 -121 -45 198 152 187 -755 15 -432 19 -268 25 -102 143 427 48 -367 -35 124 -248 -574 -552 -204
3819 -204 -631 89 -871 1240 142 -131 243 10 381 -538 1106 812 -1274 -627 -938 -278 -155 -161 -477
3838 -477 -766 62 -195 -410 -211 -737 -199 623 271 155 -262 390 -858 1541 -439 -142 910 -152
3856 -152 -321 -35 -436 -656 1410 725 -474 354 3 -661 741 -1006 251 -891 -572 -195 -264 -536
3874 -536 382 661 275 -249 -248 -420 519 786 -992 -365 347 -282 -283 -754 -171 -184 710 830 233 -242 -1396
3895 -1396 -174 133 -313 75 580 555 551 -134 -47 -236 -353 320 227 166 157 538 -264 -109 127 511 241 -392
3917 -392 -375 -45 -44 153 -288 91 409 -483 -556 102 506 -355 -252 68 328 50 -61 -384 146 382 60
3938 60 -272 100 0 280 -194 18 273 -309 396 154 -155 44 -134 489 -155 22 232 -214 -259 392 72
3959 72 53 -132 236 -23 76 -116 -143 39 118 -213 -248 340 -414 -92 39 -35 -9 50 -94 -110 -323 156 -130
3982 -130 30 118 -159 -51 155 -421 -48 -125 113 -83 -59 208 60 10 -197 -57 -151 -24 10 25 74 -19 -164
4005 -164 -133 -10 17 -161 -10 -120 -117 43 -56 -17 50 -28 -268 -59 166 -138 -58 -122 -35 149 -170 -61 -95 157
4029 157 55 -257 81 194 -75 59 14 208 140 50 90 126 -97 -188 218 -102 66 -32 -117 -58 -1 -90 -45 66
4053 66 -205 68 72 -34 37 -56 -3 -119 67 16 -103 38 57 -122 -3 -57 6 -164 -93 38 -32 -99 -96 269 -122
4078 -122 -336 30 -19 -89 28 -239 72 -275 11 50 -193 96 -124 272 -19 -197 16 -83 283 -36 -107 -12
4100 -12 -263 -166 -140 68 315 13 -160 -251 287 -279 62 152 129 -13 -63 -77 79 -19 98 -16 195 31 150
4123 150 -16 -339 199 -289 -287 3 232 363 249 8 -32 -126 59 -188 -3 123 -57 66 100 53 328 -85
4145 -85 -65 -104 129 -16 -159 -183 -74 119 -300 114 -37 17 188 -265 322 -241 -6 29 -190 134 -276 -130
4167 -130 6 112 -126 39 70 41 76 -78 -67 4 -127 -12 -27 55 310 -4 122 -359 231 307 14 55 38
4190 38 38 4 18 -18 -47 -119 -102 -44 -35 -59 163 198 -64 -9 -167 -87 -204 150 104 -254 111 126 92 -159 -155 -190 268
4217 268 -117 3 63 149 -197 -91 17 63 -95 -242 -19 -105 124 21 -17 196 -67 45 -217 172 -200 14
4239 14 107 -88 58 391 62 325 -149 16 -296 351 571 -169 251 -261 -93 -149 36 220 -94 -15 -56 -150
4261 -150 25 -20 60 -119 47 69 -164 105 -290 -277 185 -62 387 143 486 181 90 241 205 99 -103 -280
4283 -280 361 -104 21 63 92 133 -318 89 194 -103 38 -69 128 -266 9 281 -537 249 -318 518 -89
4304 -89 -79 -14 -328 365 -40 -427 -58 498 -686 469 536 621 -119 414 468 250 -291 780 -344 -183 -199
4325 -199 99 29 -825 470 613 413 -40 354 -244 -142 -183 -248 -719 59 -470 -442 -335 1204 715 187 -257
4346 -257 519 557 296 -39 497 360 -1116 318 935 544 952 52 179 -259 -381 -769 195 -364 -74 -209
4366 -209 410 -67 -898 667 -300 -934 -450 53 -524 89 -104 -268 -540 381 493 -933 -153 -744 717
4385 717 -290 -212 182 -563 292 -63 245 -125 -388 -1118 -856 256 15 250 515 492 -830 27 514 469
4405 469 345 -736 -389 -113 -45 -316 -2 97 701 584 -1468 -74 171 153 -557 -287 274 750 -101 375
4425 375 -301 374 -305 -461 -541 -1238 -341 478 318 369 -251 88 453 -547 -164 -398 -333 345 134 270 745
4446 745 -502 -28 653 304 -467 -51 -98 134 139 188 265 209 -646 -321 423 -569 -27 -764 -342 -182 608 978
4468 978 -229 109 -28 -100 -475 -1232 -713 -281 -245 -217 -287 -96 173 386 -190 -356 355 -640 -1211 -1268 -662
4489 -662 -180 -132 320 -392 116 -379 -357 -147 -524 335 82 239 -125 447 -670 -278 945 -32 241 90
4509 90 -428 -466 422 280 -940 -978 -137 -228 -772 166 -620 375 -346 686 -88 -55 -204 -348 -115 655 549
4530 549 18 -259 5 -10 -163 768 -311 175 -13 -34 -467 -79 -110 39 -75 167 -328 -274 -705 -96 -178
4551 -178 522 499 36 -76 72 -127 -555 -451 105 361 51 287 399 -72 -1036 217 596 415 8 -23
4571 -23 431 -361 -172 181 248 -160 -907 -188 -29 201 22 -458 -206 -465 -28 -160 5 -362 145 -93 -107
4592 -107 -314 -398 -37 334 765 88 212 -185 369 -438 -326 44 202 -179 -199 220 7 -382 68 -232 87
4613 87 -496 -115 210 -135 -65 190 -49 70 -31 37 -47 166 0 -41 -162 36 31 345 89 -26 271 139
4635 139 100 -214 -86 -138 -181 30 130 59 -123 447 -670 510 204 396 -144 134 327 84 -151 357 -85
4656 -85 388 -193 -207 -143 -108 200 -487 472 344 571 -268 358 619 -751 1057 692 -767 288 7 91
4676 91 863 55 594 745 460 -112 347 68 363 1367 -465 99 -374 -542 277 -24 17 -30 -294 248
4696 248 482 -39 -99 237 -349 205 466 323 70 124 371 -162 27 479 -236 233 145 69 68 255 33 -110
4718 -110 -218 -203 226 467 -245 366 1 -325 203 83 -294 230 -107 543 157 234 -270 80 606 -497
4738 -497 60 -260 177 173 72 -161 -160 -209 -579 -371 480 -676 132 266 376 112 -38 656 -562 59 272
4759 272 941 5 -403 113 -12 -844 269 -357 342 696 702 108 65 -214 343 365 354 -200 290 -291 531
4780 531 -24 -416 -6 -136 -325 98 -553 17 -680 -19 187 1098 89 318 167 -381 256 436 108 488
4800 488 133 -218 -961 91 270 -364 271 -202 14 -236 -358 1110 -354 58 648 -7 190 -328 -144
4819 -144 -58 -311 145 1074 195 1137 -93 -497 218 608 -418 -273 113 -360 280 -120 173 498 102 -309
4839 -309 -431 1054 -334 -447 501 82 114 434 142 319 -90 -1159 -802 560 97 -53 -514 -2 -231
4858 -231 -129 -299 420 -493 -767 801 221 189 374 113 -137 -288 -12 -224 -274 15 -390 -594 -124 -18
4878 -18 -72 450 75 -1 222 787 127 44 422 -392 277 -120 -92 160 56 199 -149 48 109 572 -234 100
4900 100 -313 349 115 -117 -772 119 -13 86 193 84 926 -242 417 37 -330 -225 -183 -684 -291 332
4920 332 -316 -767 -26 24 137 -225 -375 225 -257 579 -626 -360 300 -362 197 -286 491 -276 -555 315
4940 315 326 228 477 -362 97 87 164 -517 -344 -256 -299 668 81 -160 681 -252 -115 -578 285 168 -139 355
4962 355 130 644 158 -13 -466 -156 -473 -25 420 60 -452 -39 137 223 99 246 99 -400 -31 175
4982 175 -1 263 -392 210 310 -404 6 -337 148 324 -44 453 -283 154 -69 -254 59 210 167 -24
5002 -24 352 38 250 -47 2 170 -114 42 6 -18 -29 -195 -59 92 141 113 -342 82 -55 307 254 -232 23
5025 23 96 77 315 -207 -28 94 194 -114 -172 22 -175 43 175 155 1 -233 47 29 221 -122 -393 95
5047 95 -79 47 -104 -39 -227 -240 46 259 37 140 -194 209 -325 6 -17 -213 104 -66 45 56 48 81 -115
5070 -115 425 -64 32 11 -222 295 -221 -10 72 -394 91 -117 -4 309 147 64 -3 22 -383 -119 75 -192
5092 -192 195 -116 -30 -83 -176 107 -149 328 -256 -131 -22 -350 215 111 111 27 -55 234 -298 -107 -351 122
5114 122 362 -93 11 -163 -60 216 -102 197 -81 199 128 -150 81 -432 77 119 150 175 50 83 3 -351
5136 -351 33 -283 -97 -25 -154 -111 -87 76 33 -112 266 -83 67 -80 -23 -42 -159 141 5 191 -123 -159
5158 -159 23 -142 -186 -305 159 -204 -204 193 -184 -24 -32 216 -96 -106 179 54 -85 -50 -226 100 174 -103 -72
5181 -72 -60 264 -68 -1 -40 -86 356 234 172 8 36 39 134 -1 -137 277 -46 -237 -68 -49 265 2 161 127
5205 127 -359 -86 -111 59 10 -181 68 119 125 10 54 226 -148 51 -170 19 166 -100 368 -160 117 -102
5227 -102 -172 81 94 6 226 21 472 -10 110 -124 31 -22 8 362 -19 -194 -21 27 -18 -110 -113 -113 -176 228
5251 228 -151 254 -81 -314 217 -85 -60 -273 -101 -25 12 -338 -65 210 -295 -29 298 84 827 171 121
5272 121 210 -362 528 -144 545 210 205 878 -928 219 -419 147 -223 -18 570 -278 -567 176 -243 430
5292 430 -34 718 -652 -737 -140 -183 366 57 423 128 -304 -274 -429 186 165 -671 -118 249 -648 825 -362
5313 -362 598 -402 628 -415 772 -746 -218 1116 779 -1838 1157 -210 123 -12 433 -252 -787
5330 -787 -274 -738 870 850 129 -809 200 619 -318 -694 474 379 -101 -685 -235 -815 49 290 212 208 -555
5351 -555 -165 90 515 -442 -472 470 -65 43 333 -56 269 -133 133 -43 -83 -375 -163 413 838 -646
5371 -646 570 262 -360 190 191 -346 -297 871 110 177 -67 99 -51 -24 517 629 -16 112 -46 231 -848
5392 -848 388 113 -30 198 469 -576 478 -447 59 -4 -336 3 -114 831 177 293 437 280 484
5411 484 -148 -97 435 -486 25 -486 -121 -154 -486 -417 -452 342 87 -321 -244 -22 -385 -228 261 -68 31 8
5433 8 285 -105 -225 113 102 -116 -106 -264 54 -7 88 90 -289 2 -447 -59 -85 -92 8 52 -19 -102 -422 -73 -402
5458 -402 286 -15 -177 -62 -225 60 -191 -69 214 -213 265 -97 -27 -116 122 47 -114 83 -317 176 -126
5479 -126 -125 5 -80 -156 132 -166 71 429 190 -105 107 198 -280 -305 -214 -316 -318 313 -354 157 118 -36 -239
5502 -239 208 -432 187 111 -457 195 68 468 517 147 180 -578 420 -205 -295 4 -371 -36 -624 438 -102
5523 -102 413 191 -405 -266 -458 -426 106 -341 -337 164 -32 221 -544 638 -192 661 235 248 483 -72 -555
5544 -555 -328 26 -559 362 457 -449 408 -426 -160 204 42 236 -76 148 174 146 -285 15 320 -392 -77
5565 -77 103 -73 -207 -325 -495 1113 -311 664 222 -222 -86 -458 96 94 793 642 -526 713 -1061
5584 -1061 -178 159 640 491 274 -100 784 -1368 -109 240 -509 259 -412 529 -218 -316 -157 277 -681
5603 -681 705 -692 398 382 470 -238 -413 96 -214 -524 558 -437 447 -776 78 706 -134 155 266
5622 266 -133 744 156 92 -204 54 -130 -27 83 -143 -159 -304 -87 69 -261 -12 373 48 379 -354 -101
5643 -101 -77 -122 393 -34 225 -230 266 -46 -223 72 -51 -15 -94 265 258 -409 116 -181 25 269 95 179
5665 179 131 119 -160 -42 198 92 201 37 -265 51 19 311 -183 -84 50 -236 0 -180 165 9 -78 -89
5687 -89 -140 -111 -12 -14 35 -100 148 -3 -237 -44 15 135 -65 180 -215 176 -40 77 306 -195 -78 -140 -194
5710 -194 212 -40 -159 13 -76 33 -117 109 -79 39 201 -375 166 -236 95 73 -35 43 -316 227 194
5731 194 -248 -122 -199 118 24 -157 -134 -394 151 -60 -125 311 -7 14 -117 -175 252 -245 113 -109 358 -95
5753 -95 223 245 -60 178 -174 -174 -158 -1 -54 -215 -58 -78 189 385 -171 170 -85 -24 -51 61 69 -186 102 -53
5777 -53 -41 65 15 -22 143 8 -116 -192 169 191 -366 219 -78 -31 232 -181 106 26 194 -92 -131 217 -82
5800 -82 111 -66 44 -233 150 163 -60 120 4 395 123 -53 -96 -147 -26 72 -88 345 -114 63 -76 -101
5822 -101 154 -303 270 315 -218 -316 -18 270 -123 127 -83 38 -33 -338 -148 -7 31 -209 168 131 -18 -39
5844 -39 82 -58 32 -140 207 -40 -23 292 87 -41 -78 -35 243 -384 92 174 10 352 -50 -179 -169 56
5866 56 47 88 187 -186 77 -22 -19 104 -221 127 103 95 -42 19 360 -113 -106 -111 100 84 -239 77 -27 -174 310 -282
5892 -282 70 -23 -109 -77 143 428 -69 27 116 65 74 23 95 234 80 -100 -8 -56 -204 -149 -35 -73 -38 -194 3
5917 3 -54 -52 177 -26 69 -151 81 -34 -359 113 -41 176 -59 -216 162 -54 254 -47 -18 -192 193 142 4
5940 4 240 53 -99 120 -12 134 163 121 -207 -121 -30 81 -131 2 -136 122 94 151 -102 -202 -12 -45 104
5963 104 43 -39 -33 -41 292 149 -55 -93 -168 304 -73 -94 164 -61 61 -54 -89 11 -67 -189 -151 5 -228 497
5987 497 48 -333 240 85 189 -14 -164 50 -313 102 78 -21 -25 89 212 -180 -178 129 -26 88 -135 4
6009 4 -208 -322 74 -100 260 -53 134 -68 -174 218 -66 37 -37 -252 353 -51 -6 -23 118 181 -201 -317
6031 -317 -86 55 228 -274 113 -183 -58 120 49 185 -134 229 82 -95 34 -59 84 104 -229 -129 -256
6052 -256 118 -122 -32 -194 58 142 -354 100 -224 -16 371 -72 -5 -219 3 -63 -94 161 -2 -11 -75 -7 -132
6075 -132 -184 116 -3 128 -38 -227 159 -137 69 -41 22 139 96 -86 -85 -64 274 -143 337 -149 55 64 -194
6098 -194 128 -12 251 110 80 320 -32 -24 127 11 35 198 7 -383 37 285 -186 227 -90 180 24
6119 24 -85 113 -145 203 45 -25 22 -192 78 -64 -89 220 -161 -237 -308 -220 91 -81 128 -491 22 -442
6141 -442 -993 -564 422 13 253 -116 -706 89 -51 -334 -244 840 162 1320 -544 -613 -599 -807 272 -174
6161 -174 186 121 166 836 650 253 436 -153 -12 -775 -353 -350 -656 470 762 633 -118 597 378 312 340 -208
6183 -208 280 -259 723 -279 -594 304 -171 -99 -830 -154 -66 -444 53 537 117 -381 -264 24 -407 426
6203 426 -941 -592 -426 -235 -677 158 -588 -27 -386 -337 -473 254 -413 -164 20 498 -150 -158 684 -972
6223 -972 -35 -574 549 63 -180 40 843 -263 269 890 -728 -276 82 -19 -292 -621 189 240 144 102
6243 102 -226 3 758 -733 -695 -688 290 -268 331 -422 223 462 -184 71 110 55 342 -556 245 42 -591
6264 -591 -174 120 -79 183 313 -358 -417 -129 -140 -32 -225 279 497 -65 602 215 -108 -70 596 191 -374
6285 -374 340 -438 712 105 351 184 441 238 -281 106 -457 27 -259 -391 205 -560 233 -196 -195 154
6305 154 -97 99 142 -298 -343 -227 -69 163 -139 -125 -162 139 -316 -38 -109 153 56 -251 266 -118 -479 49
6327 49 -50 -269 239 -215 -46 -33 171 96 -407 -29 14 205 321 31 10 -327 357 -58 212 -129 160 332
6349 332 745 -225 150 -166 92 100 -114 536 396 807 628 -818 347 342 527 289 363 -131 191 584 998
6370 998 72 -351 -974 356 58 -718 793 237 514 -216 461 364 49 -39 597 301 474 765 -242 211
6390 211 759 336 355 -661 520 107 316 -137 -440 -435 -312 -137 205 -346 -471 -636 -226 426 143 128 340
6411 340 231 -166 413 -26 -424 -368 -346 153 -134 -44 492 -477 45 409 105 -44 -232 71 103 -429 -142
6432 -142 125 378 -187 -426 -49 348 -284 303 -239 -292 235 432 458 -394 -309 -253 -496 -359 182 157 -86 274
6454 274 375 464 209 327 28 -114 -191 -137 631 117 37 322 -840 -131 224 -302 111 545 -137 -66 541
6475 541 -145 191 -48 196 -72 -893 -232 -503 97 -412 309 92 -82 -27 389 440 613 178 -340 264 478
6496 478 -153 625 644 -379 220 -90 52 153 -554 -12 -595 -520 758 685 61 140 515 647 522 -533
6516 -533 -319 -28 -114 454 18 118 -131 360 288 -569 -17 -660 -81 68 107 -192 274 457 114 -76 -385
6537 -385 131 352 -227 -781 -317 -416 614 219 23 -464 -344 99 -450 158 57 563 30 361 -18 502
6557 502 215 12 396 810 569 -208 -182 219 144 -256 96 247 566 -226 -6 277 250 321 -6 483 -309
6578 -309 -81 218 -324 132 -180 -182 60 -73 -240 -206 429 -366 700 -444 -87 -111 268 438 274 209 376
6599 376 -271 674 246 -141 -187 2 203 -258 375 -619 -75 843 -137 163 201 46 -430 384 701 -11 124
6620 124 -14 592 610 -415 -570 84 817 183 108 141 -535 325 155 144 1092 -657 482 112 276 20
6640 20 389 -385 30 -406 475 -614 -539 391 -41 -303 222 -369 450 261 -811 712 112 289 -82 806
6660 806 -89 490 -17 -90 -15 463 428 370 -692 -225 -781 306 179 -427 242 246 309 335 -62 69 92 -421
6682 -421 291 239 -327 3 -171 -216 -27 86 547 253 283 -86 160 -19 -218 -250 50 36 61 75 -85 35
6704 35 444 -73 -177 158 5 20 156 -329 0 -14 219 4 245 103 -171 118 -359 -160 -34 66 341
6725 341 -278 30 -117 -212 -95 -311 286 57 -116 -152 -57 168 19 -117 -63 42 -32 41 -46 76 -68 -188
6747 -188 35 -76 199 430 129 -222 174 -104 28 -121 327 12 235 48 -248 111 -121 21 -244 150
6767 150 177 -61 56 -33 44 -133 -128 39 -42 43 -198 8 36 -102 56 -183 -24 145 120 54 -37 4 -130 143
6791 143 -205 262 -285 173 -93 -93 -161 -216 60 122 181 -53 -184 -414 -229 76 124 161 49 -12 307 0 -88
6814 -88 -191 -276 181 1 133 -150 129 -138 288 162 132 158 200 -23 182 -160 136 -8 125 -31 228 1
6836 1 -153 -72 -130 -95 -18 84 80 7 -225 275 -212 22 -84 -73 87 -102 -68 -67 47 173 -116 101 75 -122 -78
6861 -78 46 244 -86 24 -317 -63 45 -9 -2 -41 80 248 -48 80 65 17 -155 -90 229 -78 76 -141 -97
6884 -97 176 -164 192 -108 -81 14 148 163 9 -224 287 28 -31 -355 -208 26 330 62 192 68 -72 239
6906 239 -87 135 -29 -73 -13 163 -33 24 187 34 -37 -177 59 -210 79 197 -72 -77 -121 204 -55 251
6928 251 -239 -123 136 463 -299 -98 193 218 -19 -235 -16 -147 330 -52 16 -63 53 174 -70 -180 -334
6949 -334 307 24 316 66 137 83 100 161 -54 -71 -261 -279 -301 45 59 101 234 251 126 94 90 -13 39 -85 -11
6974 -11 58 1 330 123 -60 -218 62 86 235 -254 -62 63 -116 -16 -128 -168 188 10 -42 279 -251 99
6996 99 -278 -118 -6 -48 -65 138 109 56 -188 130 -59 70 201 303 0 16 182 -127 32 -139 210 -24
7018 -24 -18 43 69 -167 -8 -48 180 -125 36 66 -394 -254 -62 124 186 79 -192 -130 -163 -256 -114 -151 -237 -44
7042 -44 -252 -17 -32 124 -9 -65 -91 -68 -227 28 76 89 -19 233 -101 -51 57 -128 -13 28 -145 197 141
7065 141 -25 63 -157 2 -256 -232 -271 3 -71 -34 182 -13 -159 31 -167 119 -208 44 -216 134 57 94
7087 94 165 -204 71 -8 55 -157 -50 -61 80 -61 -32 -91 91 -123 -53 -307 -94 294 -201 142 133 -84 46
7110 46 -293 -172 -89 291 90 -292 -154 -2 47 258 -76 -133 238 -228 338 -80 -20 -61 85 -30 240 43
7132 43 -200 298 -217 18 -125 -49 192 -66 -126 -122 -93 150 -233 -8 362 5 -106 3 -91 162 0 64 -50
7155 -50 120 -92 -25 -44 -147 95 -247 121 -99 -118 -166 -32 79 10 -77 48 -135 -62 43 96 -107 -136 57
7178 57 -75 36 -121 134 115 59 -37 -94 230 -86 -63 -12 -42 145 -105 -66 -126 19 -76 -110 -143 -25 112 77 -147
7203 -147 1 120 -48 23 216 48 133 36 18 -53 29 27 74 -428 -179 63 17 102 30 -157 107 -41 -45 -98 55
7228 55 177 -75 178 -192 -169 -64 141 82 174 -63 116 -107 -160 -90 97 -266 55 262 54 -77 -13 -64 -61
7251 -61 137 35 -278 -32 -2 -3 31 -11 -15 60 39 -21 -201 -20 -127 159 113 92 -108 128 82 43 24 62 -141 -72
7277 -72 -132 -186 -175 174 11 105 70 -33 -104 -25 -20 -149 2 33 63 -214 139 35 164 213 137 -39 -130 -137 -85 -191
7303 -191 83 -115 0 267 288 -2 -56 145 17 148 -12 146 65 120 -287 -121 39 -3 -236 -59 46 -240
7325 -240 81 -94 -52 -109 22 -22 203 30 -90 -18 113 4 -70 -98 83 63 -30 -121 -334 -28 29 61 -29 -37 -17
7350 -17 23 -54 76 177 203 -95 23 -163 -86 373 -348 196 385 47 -27 257 149 134 -87 -35 -44 -77 104 256
7374 256 -217 -28 -19 317 315 -236 -86 -237 -149 -43 25 -85 -8 -153 67 119 89 -14 210 -17 91 157 6
7397 6 16 -4 105 95 -255 -120 -84 96 -254 -35 7 -144 27 -62 197 -3 -106 -135 209 -273 -69 -162 194
7420 194 -24 100 -407 80 230 64 -198 125 -79 -123 495 137 217 -205 93 46 98 -20 82 26 61 16
7442 16 61 -228 -47 232 34 -164 -34 136 87 182 129 130 -73 27 76 -16 76 -20 -29 179 -170 24 -14 -99 18
7467 18 17 40 62 8 62 -191 32 -83 27 -106 141 15 -39 -315 48 -223 -137 93 28 38 -111 137 65 191
7491 191 -216 171 95 -125 10 148 178 -278 125 -2 -148 212 69 246 156 151 2 -13 -100 107 161 293 71
7514 71 228 17 -201 -139 154 14 -30 -319 -316 264 -255 72 -147 -197 131 -11 -209 15 -292 -186 -131 368
7536 368 282 -136 123 -26 68 108 -94 437 -134 107 -19 108 101 108 149 155 -28 -265 -74 -39 67 -103 102 -224
7560 -224 -134 -130 85 -93 -228 -117 -299 51 -287 94 132 -196 -214 121 -212 -22 -66 -123 106 -88 216 96
7582 96 -14 -52 -90 292 64 128 72 -3 -17 -111 90 -21 -63 -212 -231 34 -238 -68 -27 52 -316 -194 27 -158
7606 -158 84 47 -28 -42 18 -39 -48 60 87 167 52 147 -56 -92 75 219 -288 -231 43 -70 24 -6 124 113 350
7631 350 38 -103 215 -36 312 -71 149 47 -243 -97 -115 -44 124 -103 45 -305 10 4 49 377 -140 341
7653 341 110 251 -25 3 252 147 142 151 -7 -106 -68 -83 -33 -126 334 -259 201 -93 139 -111 40 49 -134 -211
7677 -211 -188 76 7 -196 -31 252 -230 117 160 -82 93 -86 -37 -136 37 -148 263 -30 -172 139 31 -16
7699 -16 -100 72 -125 -58 50 -149 14 17 185 151 -164 180 130 137 -52 -75 189 -29 -55 118 8 -30 98 -51
7723 -51 -55 -330 -156 23 -27 89 73 -182 -268 18 -130 159 -64 229 33 1 -177 89 -86 -105 -50 -337 122
7746 122 191 -40 13 42 -86 -49 -137 376 193 18 71 -125 82 71 -107 41 23 225 -148 74 -70 -82 56
7769 56 -90 259 -91 289 42 112 115 31 -49 154 62 -62 -124 63 -136 -50 -143 258 249 16 112 -140 28 18 99
7794 99 22 154 -29 131 -74 -160 -63 242 -93 3 44 -6 -58 -93 -194 -176 -76 -162 261 -74 -108 -277 270 -84
7818 -84 -240 4 -4 -139 -33 113 -66 -191 -202 -43 12 102 187 -171 -373 77 219 -143 100 31 -245 118 20
7841 20 172 69 116 -31 128 251 -208 207 -138 -78 6 151 51 2 217 28 120 -50 -138 192 3 11 146
7864 146 110 62 49 -139 -26 -15 -73 171 -138 124 -81 213 59 -14 -125 -155 -89 4 80 100 -107 65 -79 39
7888 39 280 -67 -323 78 -150 -153 -100 121 -72 96 108 188 -113 -47 455 129 63 -21 -16 264 70 -114 195 384
7912 384 163 58 11 293 -43 157 -6 -307 -9 127 45 -148 -467 -50 178 106 203 -249 64 -43 24 -176
7934 -176 -24 -371 57 -126 -12 -7 107 -48 -115 -25 -351 365 -143 -172 56 29 -161 128 -154 -49 -38 -49 185
7957 185 -134 101 -168 16 -252 -186 -247 17 29 118 300 325 155 -140 38 -106 11 -17 179 41 -162 -147
7979 -147 -60 -79 -276 -7 199 -7 129 -72 30 -251 135 264 168 -425 -31 -225 171 152 -81 -178 -55 124
8001 124 -59 -43 -302 129 -6 -84 -9 30 -61 25 4 -13 -30 -371 227 -3 88 -142 -53 92 -19 56 -234 -144
8025 -144 -16 93 -130 43 350 -222 110 -143 -85 49 399 36 113 246 -47 262 207 -20 -97 177 222 -47
8047 -47 -81 13 335 79 -75 -68 5 27 -30 -24 -108 -69 -153 -11 161 221 -261 -277 -1 -212 -64 62 -49 117 75
8072 75 -127 -18 346 2 -114 -40 110 -63 133 -82 -403 -78 93 109 -52 19 -11 -230 196 -71 -308 116
8094 116 57 96 -115 -29 -61 -292 81 17 391 -177 -194 -152 228 68 -128 -171 -160 142 -102 318 284 58 -85
8117 -85 171 -193 -107 -193 139 -384 -269 -98 -55 -75 -216 269 -41 48 11 153 189 91 365 -53 53 167 -7
8140 -7 215 -103 144 22 54 13 75 153 -88 -141 47 44 107 286 -363 -158 208 4 -16 55 -9 51 58 -45 -115 144
8166 144 -113 -142 -128 -223 39 -139 -80 106 -528 -13 -282 -146 -135 -124 -11 73 -10 -438 -235 211 335 34 -262
8189 -262 30 -107
8191a07
##END NTUPLES=NMR FID
##END=
