##TITLE=1H_DE-137_3_TFA
 200.13Hz, CCl4.
 8 sc
 
 6.4.2026
##JCAMPDX= 6.0         $$ Bruker NMR JCAMP-DX V2.0
##DATA TYPE= NMR FID
##DATA CLASS= NTUPLES
##ORIGIN= UXNMR, Bruker Analytische Messtechnik GmbH
##OWNER= pz
$$ XWIN-NMR		Version 3.5
$$ Mon Apr  6 16:17:51 2026 Russian Standard Time (UT+4h)  she@DPX200
##.OBSERVE FREQUENCY= 200.1313
##.OBSERVE NUCLEUS= ^1H
##.DELAY= (6, 6)
##.ACQUISITION MODE= SIMULTANEOUS
##.ACQUISITION SCHEME= undefined
##.AVERAGES= 8
##.DIGITISER RES= 18
##SPECTROMETER/DATA SYSTEM= spect
##.PULSE SEQUENCE= zg30
##.SOLVENT NAME= CDCl3
##.SHIFT REFERENCE= (INTERNAL, CDCl3, 0, 14.3821)
##AUDIT TRAIL= $$ (NUMBER, WHEN, WHO, WHERE, WHAT)
$$ ##TITLE= Audit trail, XWIN-NMR		Version 3.5
$$ ##JCAMPDX= 5.01
$$ ##ORIGIN= Bruker BioSpin GmbH
$$ ##OWNER= she
$$ F:/spectra/data/she/nmr/H-C/1/audita.txt
$$ ##AUDIT TRAIL=  $$ (NUMBER, WHEN, WHO, WHERE, WHAT)
(   1,<2026-04-06 16:16:12.15 +0400>,<she>,<DPX200>,
      <created by zg, POWCHK disabled, PULCHK disabled
       configuration hash MD5:
       00 E9 B6 7A A2 85 ED C7 34 08 36 98 17 FE 4E 26
       data hash MD5: 16K
       AE 8D 95 3C B3 04 70 ED BB 13 54 42 FF 76 34 23>)
$$ ##END=
$$ 
$$ hash MD5
$$ 22 43 C3 5E B7 E2 A1 2E FF AD 96 52 E2 BF B7 39
##$RELAX= 
##$RELAX= 
##$RELAX= 
##$RELAX= 
##$RELAX= 
##$RELAX= 
$$ Bruker specific parameters
$$ --------------------------
##$DU= <F:/spectra>
##$EXPNO= 1
##$NAME= <H-C>
##$PROCNO= 1
##$TYPE= <nmr>
##$USER= <she>
##$AMP= (0..31)
100 100 100 100 100 100 100 100 100 100 100 100 100 100 100 100 100 100 
100 100 100 100 100 100 100 100 100 100 100 100 100 100 
##$AQSEQ= 0
##$AQ_mod= 1
##$AUNM= <au_zg>
##$AUTOPOS= <>
##$BF1= 200.13
##$BF2= 200.13
##$BF3= 200.13
##$BF4= 200.13
##$BF5= 200.13
##$BF6= 200.13
##$BF7= 200.13
##$BF8= 200.13
##$BYTORDA= 1
##$CFDGTYP= 0
##$CFRGTYP= 5
##$CHEMSTR= <none>
##$CNST= (0..31)
1 1 145 1 1 1 1 1 1 1 1 1 1 1 1 1 1 1 1 1 1 1 1 1 1 1 1 1 1 1 1 1 
##$CPDPRG= <>
##$CPDPRG1= <>
##$CPDPRG2= <>
##$CPDPRG3= <>
##$CPDPRG4= <mlev>
##$CPDPRG5= <mlev>
##$CPDPRG6= <mlev>
##$CPDPRG7= <mlev>
##$CPDPRG8= <mlev>
##$CPDPRGB= <>
##$CPDPRGT= <>
##$D= (0..31)
0 0.7 0 0 0 0 0 0 0 0 0 0.03 0 0 0 0 0 0 0 0 0 0 0 0 0 0 0 0 0 0 0 0 
##$DATE= 1775477771
##$DBL= (0..7)
120 120 120 120 120 120 120 120 
##$DBP= (0..7)
150 150 150 150 150 150 150 150 
##$DBP07= 0
##$DBPNAM0= <>
##$DBPNAM1= <>
##$DBPNAM2= <>
##$DBPNAM3= <>
##$DBPNAM4= <>
##$DBPNAM5= <>
##$DBPNAM6= <>
##$DBPNAM7= <>
##$DBPOAL= (0..7)
0.5 0.5 0.5 0.5 0.5 0.5 0.5 0.5 
##$DBPOFFS= (0..7)
0 0 0 0 0 0 0 0 
##$DE= 6
##$DECBNUC= <off>
##$DECIM= 32
##$DECNUC= <off>
##$DECSTAT= 4
##$DIGMOD= 1
##$DIGTYP= 9
##$DL= (0..7)
0 120 120 120 120 120 120 120 
##$DP= (0..7)
150 150 150 150 150 150 150 150 
##$DP07= 0
##$DPNAME0= <>
##$DPNAME1= <>
##$DPNAME2= <>
##$DPNAME3= <>
##$DPNAME4= <>
##$DPNAME5= <>
##$DPNAME6= <>
##$DPNAME7= <>
##$DPOAL= (0..7)
0.5 0.5 0.5 0.5 0.5 0.5 0.5 0.5 
##$DPOFFS= (0..7)
0 0 0 0 0 0 0 0 
##$DQDMODE= 0
##$DR= 18
##$DS= 0
##$DSLIST= <SSSSSSSSSSSSSSS>
$$ [...]
##$SUBNAM0= <"">
##$SUBNAM1= <"">
##$SUBNAM2= <"">
##$SUBNAM3= <"">
##$SUBNAM4= <"">
##$SUBNAM5= <"">
##$SUBNAM6= <"">
##$SUBNAM7= <"">
##$SUBNAM8= <"">
##$SUBNAM9= <"">
##$SW= 18.0517328524113
##$SWIBOX= (0..15)
0 0 2 0 0 0 0 0 0 0 0 0 0 0 0 0 
##$SW_h= 3612.71676300578
##$TD= 16384
##$TD0= 1
##$TE= 0
##$TE2= 300
##$TE3= 300
##$TEG= 300
##$TL= (0..7)
0 120 120 120 120 120 120 120 
##$TP= (0..7)
150 150 150 150 150 150 150 150 
##$TP07= 0
##$TPNAME0= <>
##$TPNAME1= <>
##$TPNAME2= <>
##$TPNAME3= <>
##$TPNAME4= <>
##$TPNAME5= <>
##$TPNAME6= <>
##$TPNAME7= <>
##$TPOAL= (0..7)
0.5 0.5 0.5 0.5 0.5 0.5 0.5 0.5 
##$TPOFFS= (0..7)
0 0 0 0 0 0 0 0 
##$TUNHIN= 0
##$TUNHOUT= 0
##$TUNXOUT= 0
##$USERA1= <user>
##$USERA2= <user>
##$USERA3= <user>
##$USERA4= <user>
##$USERA5= <user>
##$V9= 5
##$VALIST= <valist>
##$VCLIST= <CCCCCCCCCCCCCCC>
##$VD= 0
##$VDLIST= <DDDDDDDDDDDDDDD>
##$VPLIST= <PPPPPPPPPPPPPPP>
##$VTLIST= <TTTTTTTTTTTTTTT>
##$WBST= 1024
##$WBSW= 4
##$XGAIN= (0..3)
0 0 0 0 
##$XL= 0
##$YL= 0
##$YMAX_a= 111127
##$YMIN_a= -121186
##$ZGOPTNS= <>
##$ZL1= 120
##$ZL2= 120
##$ZL3= 120
##$ZL4= 120
##$ABSF1= 10
##$ABSF2= 0
##$ABSG= 5
##$ABSL= 3
##$ALPHA= 0
##$AQORDER= 0
##$ASSFAC= 0
##$ASSFACI= 0
##$ASSFACX= 0
##$ASSWID= 0
##$AUNMP= <proc_1d>
##$AZFE= 0.1
##$AZFW= 0.1
##$BCFW= 1
##$BC_mod= 2
##$BYTORDP= 1
##$COROFFS= 0
##$CY= -3
##$DATMOD= 1
##$DC= 2
##$DFILT= <>
##$DTYPP= 0
##$F1P= 0
##$F2P= 0
##$FCOR= 0.5
##$FTSIZE= 0
##$FT_mod= 4
##$GAMMA= 1
##$GB= 0.15
##$INTBC= 1
##$INTSCL= 1
##$ISEN= 128
##$LB= 0.25
##$LEV0= 0
##$LPBIN= 0
##$MAXI= 10000
##$MC2= 0
##$MEAN= 0
##$ME_mod= 0
##$MI= 1.114404
##$NCOEF= 0
##$NC_proc= 0
##$NLEV= 6
##$NOISF1= 3.799351
##$NOISF2= 2.8
##$NSP= 1
##$NTH_PI= 0
##$NZP= 0
##$OFFSET= 14.38212
##$PC= 1
##$PHC0= -3705.505
##$PHC1= 10.3923
##$PH_mod= 1
##$PKNL= yes
##$PPARMOD= 0
##$PSCAL= 0
##$PSIGN= 0
##$REVERSE= no
##$SF= 200.129724274929
##$SI= 16384
##$SIGF1= 3
##$SIGF2= 2
##$SINO= 400
##$SIOLD= 16384
##$SREGLST= <1H.CDCl3>
##$SSB= 0
##$STSI= 0
##$STSR= 0
##$SW_p= 3205.1282051282
##$SYMM= 0
##$S_DEV= 0
##$TDeff= 0
##$TDoff= 0
##$TI= <>
##$TILT= no
##$TM1= 0
##$TM2= 0
##$TOPLEV= 0
##$USERP1= <user>
##$USERP2= <user>
##$USERP3= <user>
##$USERP4= <user>
##$USERP5= <user>
##$WDW= 1
##$XDIM= 8192
##$YMAX_p= 0
##$YMIN_p= 0
$$ End of Bruker specific parameters
$$ ---------------------------------
##NTUPLES= NMR FID
##VAR_NAME=  TIME,          FID/REAL,        FID/IMAG
##SYMBOL=    X,             R,               I
##VAR_TYPE=  INDEPENDENT,   DEPENDENT,       DEPENDENT
##VAR_FORM=  AFFN,          ASDF,            ASDF
##VAR_DIM=   8192,          8192,            8192
##UNITS=     SECONDS,       ARBITRARY UNITS, ARBITRARY UNITS
##FACTOR=    0.0002768,     1,               1
##FIRST=     0,             0,               0
##LAST=      2.2672688,     0,               0
##MIN=       0,             -121186,         0
##MAX=       2.2672688,     111127,          0
$$ Real data points
##PAGE= N=1
##DATA TABLE= (X++(R..R)), XYDATA
$$ [...]
1875hNj53J21J88q8O4m31K34m5J71j6j19J70k02Q0J01L8k89J99k08L55L0j4O5
$$ -8 -3 -156 -35 153 65 129 -302 -68 -113 58 42 -77 93 -109 -29 72 110 -179 20 -188 167 197 183 248
1899B48k46L9Q2Rm8J21l00n1J20J53q2M0O4p2j87J57k87L39J28k41L6j10m6m0
$$ 248 2 41 123 132 84 205 -95 -146 -26 127 45 85 149 77 -110 47 -240 99 227 -14 22 -88 -134 -174
1923a74onj5L36j65m5P6p2O5j03J52m08K12J33J1rK13k43k4M05l61k14J99m7J91
$$ -174 -180 -185 -200 136 -29 -74 2 -70 -5 -108 44 -364 -152 -19 -8 -17 196 -47 -71 334 -27 -241 -42 -89 102
1948A02j60J0J2PJ24j73J00r1J52p0L9J38k11pl0q6j74M27l15J44p2J40J46l5
$$ 102 -58 -48 -36 -29 95 -78 22 -69 83 13 52 190 -21 -28 -58 -144 -318 109 -206 -62 -134 6 152 117
1972A17k50L8L14l41J43p8j44K77M1j20M5r0J25r0J52Nl7l6k25R4%l8K70l99K78
$$ 117 -133 -95 219 -122 21 -57 -201 76 117 -3 42 -48 77 -13 139 144 107 71 -154 -60 -60 -98 172 -227 51
1997E1Q8o4j92K43m11L32N0J08l34l8L12l23J04J43N0k65J93j16R6J5r7K01o3
$$ 51 139 75 -117 126 -285 47 97 205 -129 -167 145 -178 -74 69 119 -146 47 -69 27 42 -55 146 83
2020H3J26l28J61j51L4J09J22k00j9o4L52m30L41K1k83K84r6o9j21O8N2K6j91
$$ 83 209 -119 42 -109 -75 34 156 -44 -63 -127 225 -205 136 157 -126 158 62 -7 -128 -60 -8 18 -173
2043a73J97L3j02j97K30p0J03N2j33r2R8K60k08J28m43L84k53J51K69j06j54j7
$$ -173 24 57 -45 -242 -12 -82 21 73 -60 -152 -54 206 -2 126 -317 67 -186 -35 234 128 -26 -43
2065d3O5J4nJ13k61M5J34M7j02K8J56j54r0q9J22l68N74k25k05K68n1Q3J19Q5
$$ -43 22 36 31 144 -117 -72 62 109 7 35 191 37 -53 -142 -20 -388 186 -39 -244 24 -27 56 175 260
2089B60l06J48q4L6J48o6l9j22QQr7K07j09j25%L65j71j41o0K09k40J18K50p0
$$ 260 -46 102 18 54 202 136 97 -25 -17 -9 -106 101 -8 -133 -133 232 61 -80 -140 69 -171 -53 197 127
2113A27P6k63p7K89j73l1K68j70l0k2q0J22Mk36L43j40L7q7m8K20N7l40L82K3
$$ 127 203 -60 -137 152 -21 -52 216 46 16 -6 -86 36 40 -196 147 7 44 -43 -91 129 186 -154 228 251
2137B51J37n03K06q8J37k13R8J74L6l63J07j14J18J84o1j09K07p8J8l84K89N7
$$ 251 388 -115 91 3 140 -73 25 199 235 -128 -21 -135 -17 167 106 -3 204 126 144 -240 49 106
2159A06j46R3o9J39qJ4k14J86j54K18n9l49P5L12j55mJ93k57L64k55j6Rj43J55
$$ 106 -40 53 -16 123 115 129 -85 101 -53 165 106 -243 -168 144 -11 -15 178 -79 285 30 14 23 -120 35
2183C5Kp0j34J87J13j90J11k5k50k0K85R7kl65K88k86K9L8J8J44p1J02J39l55
$$ 35 37 -33 -167 20 133 -57 54 29 -221 -241 44 141 139 -226 62 -224 -195 -157 -139 5 -66 36 175 -180
2207a80J76J95k95j50J78J81m12L16J05m55K39J45K6j25%K56k73j02n7p1M84k89
$$ -180 -4 191 -104 -254 -76 105 -307 9 114 -341 -102 43 69 -56 -56 200 -73 -175 -232 -303 181 -108
2229a08J07j98K85jk3k4J03p9Kj30Q2J3j68J38j82R1N4M3r1K01L7j7n1j42O1K09
$$ -108 -1 -199 86 85 62 38 141 62 64 -66 16 29 -139 -1 -183 -92 -38 5 -86 115 152 135 84 -58 3 212
2255B12l62j24N88j68j01P7rO1l11L0K60k95J37j84K59kj51K43p8j19J40K8MJ5
$$ 212 -150 -274 314 146 45 122 113 174 -137 -107 153 -142 -5 -189 70 68 -83 160 82 -37 103 131 135 150
2279A50K2o0k72J87J2N6K7k64l0K57Ql07K92p8r6J06L8%L72m53K1L6P0o4J6p6
$$ 150 172 112 -160 27 39 95 122 -142 -172 85 93 -214 78 0 -96 10 48 48 420 -33 -12 24 94 30 46 -30
2305c0J59j97K05m20K58K40o0k06NJ11j49M08m52L34j98o9K03l05K07l33M30M6
$$ -30 129 -68 137 -283 -25 215 155 -51 -46 65 -84 324 -128 206 8 -61 142 -163 44 -289 141 187
2327A87l51N0j72K84J4L38j68p1p2K81n18R7l6K36l01QJ89k29P8J77J24j26j14
$$ 187 -164 -114 -286 -2 12 350 182 111 39 320 -198 -101 -137 99 -202 -194 -5 -234 -156 21 145 19 -95
2350i5N04n14J26p4n3K22l7l22K40o4j36K05L08l13Q9kOJ09m27L22j55O5K0k23
$$ -95 409 -105 21 -53 -106 116 79 -243 -3 -67 -203 2 310 -3 86 84 90 199 -228 94 -61 4 24 -199
2374a99J77O6j54NQ1l5K55j0l47J22l0j03M85l00j11J56m11K54P8J31M3q4k0j58
$$ -199 -22 44 -110 -105 -24 -59 196 186 -161 -39 -69 -172 313 13 -98 58 -353 -99 -21 110 153 69 49 -109
2398a09j58K19O1O7p0J26k64J58j62K90J5k38J72Q8K9l01J62k10j36K22J5n1j4
$$ -109 -267 -48 13 80 10 136 -128 30 -132 158 173 -65 107 195 224 -77 85 -125 -261 -39 -24 -75 -89
2421h9K45N4k47J32l11J88N0J32j92M4j87K78j35P7j43oJ23j50J39N5k28J05R5
$$ -89 156 210 -37 95 -216 -28 22 154 -38 6 -181 97 -38 39 -104 -110 13 -137 2 57 -171 -66 29
2444B9J10j90J3Lk14J31J44J62j4L1n07N6L16q5K84l73K50l16N2K32k61J33O3
$$ 29 139 -51 -38 -35 -249 -118 26 188 174 205 -302 -246 70 -15 269 -104 146 -170 -118 114 -147 -14 49
2467D9q3k35K29q7j63L35l20L02O9j61L16j94J2n9J91k26K23l71J79r3q7L04k99
$$ 49 -34 -269 -40 -127 -290 45 -275 27 96 -65 251 57 69 10 201 -25 198 -173 6 -87 -174 130 -169
2490a69K43R5j86j3j29R3L74j09k96O7n5N5K85l87q5J93n8J06J30m7k12j32K18
$$ -169 74 169 -17 -30 -159 -66 308 199 -97 -30 -85 -30 255 -132 -217 -24 -82 24 154 107 -105 -237 -19
2513a9j40L74l59k13J56K17K15m9j68k09K83k19J28j85L52r4k16J29l8L0k12K15
$$ -19 -159 215 -144 -357 -201 16 231 182 14 -195 88 -131 -3 -188 164 70 -146 -17 -55 -25 -237 -22
2535b2l3J50M8j53L3k9R3L3j78j34J06J85j39k72L75o9k5K72k46j47KJ08q0Q6
$$ -22 -55 95 143 -10 23 -6 87 120 -58 -192 -86 99 -40 -312 63 -6 -31 241 -5 -152 -150 -42 -122 -36
2559c6rj69L97l06J42l65J31K61Q0o1k58K16l37N02k45J82j67J06R2l61J7N58
$$ -36 -45 -214 183 -123 19 -346 -215 46 126 65 -193 23 -314 188 -57 125 -42 64 156 -205 -188 370
2581C70k08k99L51k04J25k73J99M1m6j86N1J13J39l99R3J28L2k7k65K14M9j50
$$ 370 162 -137 214 10 135 -138 61 102 56 -130 -79 34 173 -226 -133 -5 27 0 -265 -51 -2 -152
2603a52J33K36j96j84L90j50o6J18k43L15k89J43O9M9j94j33J65k90K81k2j15
$$ -152 -19 217 21 -163 227 77 11 129 -114 201 -88 55 124 173 -21 -154 11 -279 2 -20 -135
2624a35J80J95m00R0k59K64JK20k64J99k49K64j1L9p7o4M1j70J77n6r5m4K43k42
$$ -135 45 240 -160 -70 -329 -65 -64 156 -108 91 -158 106 95 134 57 -7 34 -136 41 -15 -110 -154 89 -153
2648a53J45L9J92l33R1N5n5j23N0N24m46P0J03j09r5J40k87M57l45K88n8P7j01
$$ -153 -8 31 223 -110 -19 36 -19 -142 -92 432 -14 56 159 50 -45 95 -192 265 -80 208 150 227 126
2671A26p2r8p0j3n5J80K43j6j58p4J09l66m8M18k20N4r0O24m83j7J52Rk37L02
$$ 126 54 -44 -114 -127 -182 -2 241 225 67 -7 102 -264 -312 106 -114 -60 -150 474 -9 -26 126 135 -102 200
2695B00k66p9L13k24Q5k6N7j8l15M19l97M82k16%J57j37K53k56J40P9j19k35J36
$$ 200 -66 -145 168 -56 29 3 60 42 -273 146 -251 231 15 15 172 35 288 32 172 251 132 -103 33
2718C3j45j65M79k00J90k42Q3J5q7l1J46K1j79R9j10q5K97J0l31K39k36K87p9
$$ 33 -112 -277 202 2 192 -50 33 48 -39 -70 76 97 -82 17 -93 -178 119 129 -202 37 -199 88 9
2741IJ16j2j52J69j15k49J15J71m9J21k66J12K4j6o8Q6o8L8R3l39L47J5M8k4j85
$$ 9 125 113 -39 130 15 -234 -119 52 3 124 -142 -30 -6 -22 -90 -4 -72 -34 59 -280 67 82 130 106 -79
2766g9J74M4j25k66L29J5p4l95K91K00k0m5j01J4L0o3J68p9j38J9J99l48L41n
$$ -79 95 139 14 -252 77 92 18 -377 -86 114 94 49 -52 -38 -8 -71 97 18 -120 -101 98 -250 91 86
2790H6oJ37k02k9N0j69K06j99L45j22O6l41R4M5O5j24N6n7J75j56M09l73j6M1
$$ 86 80 217 15 -14 36 -133 73 -126 219 97 163 -178 -84 -39 26 -98 -42 -99 76 -80 329 -44 -60 -19
2814a9j27J95j94K71q8m24L67R8k01J24KQ3K2l9j32P3L29m69K11j76K94j51J14
$$ -19 -146 49 -145 126 38 -386 -19 79 -122 2 4 87 109 70 -62 11 340 -129 82 -94 200 49 163
2837A63j34k40M22k86R8j93L07l33K77r8j61K79k24O9K54J49n13L35j73Q9j0l78
$$ 163 29 -211 211 -75 23 -170 137 -196 81 -17 -178 101 -123 -54 200 349 -164 171 -2 87 77 -301
2859c01K02K46k26o3K23k30L17q7J86j64j68K46O3k69j23o9L59j37k58K84k67
$$ -301 -99 147 -79 -142 81 -149 168 81 267 103 -65 181 244 -25 -148 -217 142 5 -253 31 -236
2880b36J55L15l01J93P8k46P4J9L26l24L34m55j1J50q8Q5m04K35Q7p4J41l05L09
$$ -236 -81 234 -67 126 204 -42 32 51 377 53 387 -68 -79 71 -17 68 -336 -101 -14 -88 53 -252 57
2903E7J77n03K45l0m9J8j7R6j47QJ77O3m8O0j04j14KN4j92K97j21J23q8K49l02
$$ 57 234 -269 -24 -54 -103 -85 -102 -6 -153 -145 32 95 47 107 3 -111 -109 -55 -247 50 -71 52 -36 213 -89
2928h9K15l07J16O2j13L45J34m43M09k80J13k39K84m49K63l6q0O4r6j60L18J7
$$ -89 126 -181 -65 -3 -116 229 363 -80 329 49 162 -77 207 -242 21 -15 -95 -31 -127 -287 31 48
2950D8P2n1J6q7J55j04k13J30K2kM0K8j45q1J39J44j88K13o3J10q6J41l44J33
$$ 48 120 69 85 -2 153 49 -164 -34 -12 -14 26 54 -91 -172 -33 111 -77 136 73 183 97 238 -106 27
2974B7k07L38jj04J17k21J56l50J10m0J71J06O6l01M37k71j03L07m60J08n6j23
$$ 27 -180 158 157 53 170 -51 105 -245 -135 -175 -4 102 168 -133 304 33 -70 237 -223 -115 -171 -294
2996b94L99k45J19k46K03q6K61k6K9k63L32l37J56M1j53p6K90J21j81j09K58K3
$$ -294 105 -140 -21 -267 -64 -150 111 85 114 -149 183 -154 2 43 -110 -186 104 225 44 -65 193 216
3018B16k83q6k48J36J27J26R2j71K1J70j92J40k22L91n3O2m01J00J27k31K31M6
$$ 216 -67 -153 -401 -265 -138 -12 80 -91 -70 100 -92 48 -174 217 164 226 -175 -75 52 -179 52 98
3040I8k71K06J44j16j61J38j42K79j92k7L27n18L26j80Q1k26K44p2J07j08j04
$$ 98 -173 33 177 61 -100 38 -104 175 -17 -44 283 -235 91 -89 -8 -234 10 -62 45 -63 -167
3061a67O6P8L3j2j12J04qR6q9j52J97R4p7M4P9j60p3J31K9j70o9K57j82L08j68
$$ -167 -101 -23 10 -2 -114 -10 -18 78 -11 -163 34 128 51 95 174 14 -59 72 101 -69 -138 119 -63 245 77
3086G7l04L40Jl25J64p6J99p4J68m15L30L12m60N9Q3q3J80j40r6P7k14J27j99
$$ 77 -227 113 114 -211 -47 -123 76 2 170 -245 85 397 -63 -4 79 -4 176 36 -60 17 -197 -70 -269
3109b69L41ko2K7OP4j25j18m1QM80n15K46J04k93J28k04j36L44j17J21j03O5J39
$$ -269 72 70 8 35 41 115 -10 -128 -169 -161 319 -196 50 154 -139 -11 -215 -351 -7 -124 -3 -106 -41 98
3133I8l40K63k83K13J90k01J68j29Q3j81J11J9k4j01Q5p4K32j81J40m5O8k06K45
$$ 98 -242 21 -262 -49 141 -60 108 -21 62 -119 -8 11 -13 -114 -29 -103 129 -52 88 43 111 -95 150
3156A50K06m02Q5l71L73o6P1O4n8K14k39j37M5j35L18j56J66j97q0K08L9J61l40
$$ 150 356 -46 39 -332 41 -25 46 110 52 266 27 -110 -65 -200 118 -38 128 -69 -149 59 98 259 -81
3179h1O4k63Q3R0M9K17j14j0J8k36J90Lk07K57k07LK29K0n7j28L2m7J16K58m07
$$ -81 -17 -280 -197 -107 -58 159 45 35 53 -183 7 10 -197 60 -147 -144 85 105 48 -80 -48 -95 21 279 -128
3204a28J03J77k72L63j96J05j28l6j3j90K94lj99r1q1K00K29j40n1J6K2N6nq0
$$ -128 -25 152 -120 243 47 152 24 -12 -25 -215 79 76 -123 -214 -295 -95 134 -6 -57 -41 -19 37 32 -48
3228d8J1J15L16n08K1R6j45K17j21L44l47J84M2j87j23j0J2n0K31m0k36J24r8
$$ -48 -37 78 394 -114 -93 3 -142 75 -46 298 -49 135 177 -10 -133 -143 -131 -181 50 10 -226 -102 -200
3251b00O0M8K26k5j38l2j01n7Q1N5J08O0o7j19N9N8j00K38k17L54m8k93J35q0
$$ -200 -140 -92 134 109 -29 -61 -162 -219 -138 -83 25 85 18 -101 -42 16 -84 154 -63 291 243 -50 85 5
3275En4K10k49J02j30O5K63m78N05m39J51K03k80M3J45j7MK5m3J13l9j77J81k23
$$ 5 -49 161 -88 14 -116 -51 212 -266 239 -200 -49 154 -126 -83 62 45 49 74 31 144 105 -72 109 -114
3299a14l1o3j33L28n1j74K10r1J34P8p2N0k01O6L5M8l35K71K97q1k96K17k03J80
$$ -114 -145 -208 -341 -13 -64 -238 -28 -119 15 93 21 71 -130 -64 -29 19 -316 -45 252 171 -125 92 -111 69
3323F9j25OJ29j23L8j05M43l95K11m0n1j82L05k81j27J98o0L6M4J78K46j39l28
$$ 69 -56 -50 79 -44 -6 -111 332 -63 148 108 57 -125 180 -101 -228 -30 -90 -54 -10 168 414 275 -53
3346e3Q7l77M12k08R8L5j45N1J20k8j14j6L23l8k06kMJ75J5k87L96P1j93J48p8
$$ -53 34 -343 69 -139 -41 -6 -151 -100 20 -8 -122 -138 185 147 -59 -61 -57 118 133 -154 242 313 120 268 190
3371A90j59j95K64j10L1J53nl08N1J05J45k19j28J93L1J78j08l35k5J33K53k37
$$ 190 31 -164 100 -10 21 174 169 -139 -88 17 162 -57 -185 8 39 217 109 -226 -251 -118 135 -102
3393a02K26j04j63Q3j92J65J0J90k17M8K44j85j41R8K20j23k68K88j81M50l44
$$ -102 124 20 -143 -60 -252 -87 -77 113 -104 -56 188 3 -138 -40 180 57 -211 77 -104 346 2
3414Bp9K60m35L22j81J16o2j8r6J25k5K12j63J18j73J38k30K44J21j68j27L21
$$ 2 -77 183 -252 70 -111 5 -57 -75 -171 -46 -71 141 -22 96 -77 61 -169 75 196 28 -99 222
3436B22l46Q2j49L38l04L89k04R6m1o6L8K1j61R2K00j10n9P3k16N3J0o5P8P4r3
$$ 222 -124 -42 -191 147 -157 232 28 124 83 17 55 76 -85 7 207 97 38 111 -105 -52 -42 -107 -29 45 -48
3461d8J59o2j01j48K84k0j88M9K72j07O3j73K49l41L0j9j6L51l03k35L51j85J60
$$ -48 111 49 -52 -200 84 64 -124 -75 197 90 153 -20 229 -112 -82 -101 -117 234 -69 -304 47 -138 22
3484B2q7Q9Q7k1L5k57L89m24J27JPM6k34K44l9N6k62j60N8K99L7l11L04J6K02
$$ 22 -65 24 111 90 125 -132 257 -167 -40 -39 -32 14 -220 24 -15 41 -221 -381 -323 -24 13 -298 6 22 224
3509B24m42K12j08J90j88K04K35j76k77j02J26J24L3k37L24j59J60j29jj18N2
$$ 224 -218 -6 -114 76 -112 92 327 151 -126 -228 -102 22 55 -182 142 -17 143 14 13 -105 -53
3530e3N6j32Q0k55J03K99J4k87l0K84K13n54J74L6K6K7j01r0J68L6J79l21L6n3
$$ -53 3 -129 -49 -304 -201 98 112 -175 -205 79 292 -262 -88 -52 -26 1 -100 -190 -22 14 193 -128 -92 -145
3554a45K4K47j93J51j6jj98N06j72j05o8J34l2j30J14J20m47J8J42J63j36K55
$$ -145 -121 126 -67 84 68 67 -131 375 203 98 30 164 132 2 116 236 -211 -193 -51 112 -24 231
3576B31p2q8l65m8K62jN4R4q2O1J94m75J7N05k39k3o8j13L1L6K66m73M95j1l31
$$ 231 159 71 -294 -342 -80 -81 -27 67 -15 46 240 -235 -218 287 48 25 -43 -156 -125 -89 177 -296 199 188 -143
3601a43R6j30J61k04p4M42k31J19J51j26j54J9k5J04J30j96K53k46k1J4P0L64
$$ -143 -47 -177 -16 -220 -294 148 -83 36 187 61 -93 -74 -99 5 135 -61 192 -54 -75 -61 9 373
3623C73l33N1m14J16L01k85K60K88j94r5O5k52K44J79k01Jj48j22K26m1j20J74
$$ 373 40 91 -323 -207 94 -191 69 357 163 68 133 -119 125 304 103 104 -44 -166 60 19 -101 73
3645G3J43j23j22m4Q8j37K01J31k75k28K58m9L41l00L30k40n8p5P7Jk73L41p1
$$ 73 216 93 -29 -73 15 -122 79 210 -65 -293 -35 -84 257 -43 287 47 -11 -86 -9 -8 -281 60 -11
3668a1P4j68j29J19J85k66J14J13l6O5j9j38j23M60l63M2J65M3j95M8J45l27K32
$$ -11 63 -105 -234 -115 70 -196 -82 31 -5 60 41 -97 -220 240 -123 -81 84 127 -68 -20 125 -202 30
3691C0j60J87J38l04J21j67J64j60J5KK71Rj26l2pP4R8P0j76o5R3L5j12k32J67
$$ 30 -130 57 195 -109 12 -155 9 -151 -136 -134 137 146 20 -12 -19 55 153 223 47 -18 75 110 -2 -234 -67
3716f7J46k50l6K69k99M36j91L8K0j65J72k3N6j70O1p0Q6j82K44n2K84m62J62
$$ -67 79 -171 -207 62 -237 199 8 46 66 -99 73 50 106 -64 -3 -73 13 -169 75 23 307 -155 7
3739GJ01l9NJK29k88J51k25j35N8J8K21j88J88j95q3J05J41O0j79j2j3K88k03
$$ 7 108 69 74 75 304 16 167 -58 -193 -135 -117 104 -84 104 -91 -174 -69 72 132 -47 -59 -72 216 13
3763A3l7J51k2N4N1j92k69M75Rl32J53Q8N7J07k42q1J34k54qj76N16l11LK25j2
$$ 13 -24 127 105 159 210 18 -251 224 233 -99 54 142 199 306 64 -17 117 -137 -145 -321 195 -116 -113 112 100
3788A00j78J94m7k03J12j5J31k25L0pJ63nj5m33L22k49L04J19j28J61l85J50J70
$$ 100 -78 116 69 -134 -22 -37 94 -131 -101 -108 55 50 35 -398 -76 -325 -21 98 -30 131 -254 -104 66
3811F6k25K38O4j96L7K35j24L0j45j3j8K95k08R8j43J28k02L0Q6J17l79K10J96
$$ 66 -159 79 143 -53 -16 219 95 125 -20 -33 -51 244 36 134 -9 119 -83 -53 33 150 -229 -19 177
3834A77p2j06kj58O7J70m1n3J05m5M4J13l4J0k3k20J52j12N7j91N1L1m0q2M98
$$ 177 105 -1 -3 -161 -94 76 35 -18 87 42 86 199 165 175 152 -68 84 -28 29 -162 -111 -80 -120 -202 296
3859B96m08L08k74M02k91J35n1j91Q0R2J55j74k10P7J70K8n0j76K0K08j43j00
$$ 296 -112 196 -78 324 33 168 117 -74 6 98 253 79 -131 -54 116 144 94 -82 -62 146 3 -97
3881i7J03OJ59l24M52j72j0r8o0O8j91O6L19l93M45l22k18J71P9o1NJ69j47q9
$$ -97 6 12 171 -153 299 127 117 19 -41 27 -164 -98 221 -172 273 -49 -267 -96 -17 -78 -73 96 -51 -140
3905a40K29K90l47q7k5R7P0oj0j09K60m77K05L6kK1J8l64L20K8R6q4p1N06m11
$$ -140 89 379 32 -55 -80 17 87 81 71 -38 222 -255 -50 -14 -16 5 23 -341 -21 7 103 19 -52 454 43
3930D3j26L3j20J92l3l52K87K08j14l06J67k3K41k05J56r1J37k54K86j01l5q1
$$ 43 -83 -50 -170 22 -11 -363 -76 132 18 -288 -121 -144 97 -108 48 -43 94 -160 126 25 -10 -91
3952i1l3M24j72k08J02j16Q9M9P4j81Rj02K50K4j81J7M47m80K43L8r2k92R7K0
$$ -91 -124 300 128 -80 22 -94 -5 44 118 -63 -54 -156 94 118 -63 -46 401 -79 164 202 110 -182 -85 -65
3976f5j43K30l57K91j99L02k02p9J3L81l59K86j95L46j23m1J01o9J02l50M62k7
$$ -65 -208 22 -335 -44 -243 59 -143 -222 -209 172 -187 99 -96 250 127 86 187 118 220 -130 332 305
3998C05o22K39k07J12J04Qj5k01J68J50J35j44j11K34j07m7j41J97k23O5J94j52
$$ 305 -317 -78 -285 -173 -69 -61 -76 -277 -109 41 176 32 -79 155 48 1 -140 57 -166 -101 93 -59
4020e9K1p9R9J58k67K47n3j44J69l1j71K17M7J4j24m16N61j80O6o3k77J93J96
$$ -59 -38 -117 -18 140 -127 120 67 -77 92 61 -110 107 154 168 44 -372 189 9 75 12 -265 -72 124
4043A24k13j9J65l76J67R8J99j71NO7Q8n2l37K07J41j5j56J6J0K44k91L45k53
$$ 124 -89 -108 57 -319 -152 -54 145 -26 -21 46 134 82 -255 -48 93 78 -78 -62 -52 192 -99 246 -7
4066gj05J98j07P3L9l2R7J1J00j31J51j90k05L75n28L19m2K18l16L5l08J89M63
$$ -7 -112 86 -21 52 91 59 156 167 267 136 287 97 -108 267 -261 58 16 234 -82 -47 -355 -166 297
4089B97k09k17M0J77k88K43J00m28N02l59Q5j04L18o39N20K61k70l0R3l04O6K30
$$ 297 88 -129 -89 88 -200 43 143 -285 217 -142 -57 -161 157 -482 38 299 29 -1 92 -212 -146 84
4111H4m02M27j84K8m0L58k80J02N0P3k13K0J91m14J00J56k19k5O9L29n82L24j23
$$ 84 -318 109 -75 -47 -87 271 -9 93 143 216 3 23 214 -200 -100 56 -163 -188 -119 210 -372 -48 -171
4134a71J04J84Q8k92J12k20O9J41P9n3k61p1J23L71Q1j69k49O45k54k65Q9j33
$$ -171 -67 117 205 -87 25 -195 -126 15 94 41 -220 -291 -168 203 284 115 -134 511 257 -8 81 -52
4156e2Q8l15J75J04P6n8j08K08k43J53n2r0K56J19r7p3k2K97n62J34n4O7k55K66
$$ -52 36 -279 -104 0 76 18 -90 118 -125 28 -24 -114 142 261 164 91 69 366 -196 -62 -116 -49 -304 -38
4180c8J09O2j36J11j56P9k5k16J44R0N8j79J76L6j34kR2J23j41k88q2K56k62n6
$$ -38 71 133 -3 108 -48 31 6 -210 -66 24 82 -97 79 115 -19 -21 71 194 53 -235 -317 -61 -323 -379
4204c79M53J86l95Q5Q0r4m7k7J40j87qoJ77l2q3J41j43K3R7K1O0K5K0j4o9L0k28
$$ -379 74 260 -135 -50 30 -64 -111 -138 2 -185 -193 -199 -22 -54 -137 4 -139 -116 -19 2 62 87 107 93 24 54 -174
4231a74J32M6j2R0n2j75J34l3L6J20j7O5J4m64R9R3P6M8l04M37j96L49k34j07
$$ -174 -42 4 -8 82 30 -145 -11 -44 -8 112 95 160 174 -290 -191 -98 -22 26 -278 159 -37 312 78 -29
4255b9J02r0L3j33J12k22M44p9k54J83k32K14K92k77M9j22K8R0K5k69O5J53m7
$$ -29 73 -17 16 -117 -5 -227 217 138 -116 67 -165 49 341 64 113 -9 19 109 134 -135 -70 83 36
4278C6j1l3rq1j02L28k23L6J98m1k6j76L80l65o5J5L1K47p8j5jj45P0R9p2r7J5
$$ 36 25 -8 -17 -98 -200 128 -95 -59 139 98 72 -104 276 -89 -154 -139 -108 139 61 46 45 -100 -30 69 -3 -100 -85
4305h5NQ3R7l4Q6q6M6k73J91m5J88o0q2J10j75Q5k9p6n8K36j30PMl1j41L42j55
$$ -85 -80 3 100 66 152 66 112 -161 30 -15 173 113 31 141 -34 51 22 -54 -112 124 -6 1 5 -26 -167 175 20
4332B0P1j7p8J4n7K64j74k55M19l63P6j5K9O6j05j05K27J21j18j69K96k03J7o
$$ 20 91 74 -4 10 -47 217 43 -212 207 -156 -80 -95 -66 0 -105 -210 17 138 20 -149 147 -56 -39 -45
4356d5J39j56K04j51j57K51p6q0n8M71k53r1o0n2J78J69l04J20j30J29k89L14
$$ -45 94 -62 142 -9 -166 85 9 -71 -129 342 89 -2 -62 -114 64 233 -71 49 -81 48 -241 73
4378G3l12K77L3l19M32k37L4J00r4l10J54J98N7M3K5k04P1l0k24L0J71M3j17J21
$$ 73 -239 38 71 -248 184 -53 -19 81 -13 -323 -169 29 86 129 154 -50 21 -9 -233 -203 -32 11 -106 15
4402A5K69l59n8M07k56jj38L18j60N2j69J21k76K25j65L12l65K22L6M7l33L25
$$ 15 284 -75 -133 274 18 17 -121 197 37 89 -80 41 -235 -10 -175 137 -228 -6 30 77 -256 69
4424F9Jj88K25O1j03N1q5j73J94n0j15K53k42j58J43J39J79J16l95r1k5J17J74
$$ 69 70 -118 107 168 65 116 31 -142 52 2 -113 140 -102 -260 -117 22 201 317 -78 -169 -194 -77 97
4447I7L9qMO0k31L39k66n2J28j81K9J54l71O4K56L6K2O3n05L37j03K61k80J91
$$ 97 136 128 132 192 -39 300 34 -18 110 -71 -42 112 -259 -195 61 97 119 182 -323 14 -89 172 -108 83
4471H3j62j63j56L17J04m1j03j0K65j27k41L68K8j55L6k1J3j22K07j76K45l51
$$ 83 -79 -242 -398 -81 23 -18 -121 -131 134 7 -234 134 162 7 43 22 35 -87 120 -56 189 -162
4493a62J02r6K41p5J46k36j13J75J0j20J62J15j22k50K55j79K10j85L9K39l32
$$ -162 -60 -156 85 10 156 -80 -193 -18 -8 -128 34 149 27 -223 32 -147 63 -122 -83 156 -176
4514a76J60k26L09J97k52Mqj54K3j19J69L7jK30m05L58q8J63j58PJ40k08K0j44
$$ -176 -16 -242 67 264 12 16 8 -146 -123 -242 -73 -36 -37 193 -212 146 58 221 63 70 210 2 22 -122
4538a22K94k88K28k9o5J00k31j29M62l45p5Q0K46k1J16l33o2N13n24J79J43l30
$$ -122 172 -116 112 83 18 118 -113 -242 220 -125 -200 -120 126 105 221 -112 -174 339 -185 -6 137 -193
4560a93K24n4o8K9J57L57m74J91j28M4j12k9L12l13k46L88J73n7r2j40J45k14
$$ -193 31 -23 -91 -62 95 452 -22 169 41 85 -27 -56 256 -57 -303 85 258 201 109 -31 114 -100
4582a00o6K27k52K11K34M3m62K83m9R2l16j2M42k39L9l35L36j47J80j27k5k4J90
$$ -100 -166 61 -191 20 254 297 -165 118 69 161 -155 -167 275 36 75 -260 76 -71 109 -18 -43 -67 123
4605A23J98o38J85J75k12M99j59r1j70L2L24k89J93J28n12Q3L1j3J66k3l1k37
$$ 123 321 -317 -132 43 -169 330 171 80 -90 -58 266 -23 170 298 -214 -131 -100 -113 53 30 -1 -238
4627b38J61k3j8L15pn25M62j29J41q3O9n8R5l15M96k22j51L7K85m6k24J09l33
$$ -238 -77 -100 -118 197 190 -335 127 -2 139 56 125 67 162 -153 343 121 -30 7 292 246 22 131 -202
4650b02L31k42P2k8K35l45J96q2L34m77M73k60K18j98q4j63K60j05j17L81l00
$$ -202 129 -113 -41 -69 166 -179 17 -65 269 -208 265 5 223 25 -59 -222 38 -67 -184 197 -103
4671a03K99k30J48j6M4k31J42m0K4j73K08j66L7J33k4p2J86p1m60P18k11k48J57
$$ -103 196 -34 114 98 142 -89 53 13 37 -136 72 -94 -57 76 52 -20 166 95 -365 353 142 -106 51
4694E1K0k67J56K34k70K02j9l2J01j25mn3j3k0K2R7j00P6j16Q3Q5P6o1j86K33
$$ 51 71 -196 -40 194 -76 126 107 75 176 51 47 -6 -19 -39 -17 80 -20 56 -60 23 108 184 123 -63 170
4719A70j56n8j12J9j19M18j34j92L28P7j15p3j22M1L03m15K43O1M9k46ml1j45
$$ 170 14 -44 -156 -137 -256 162 28 -164 164 241 126 53 -69 -28 275 -140 103 164 213 -33 -37 -68 -213
4742b13K29k17J82Q5k1Jp0K98m0k24N3k17J17j46J84j75K94P3j68k85J91o6K60
$$ -213 16 -201 -19 66 45 46 -24 274 234 10 63 -154 -37 -183 1 -174 120 193 25 -260 -69 -135 125
4765A25l59K2K64l5p2j29J62j01K93l06L24p9j32O4k00pM4j2mJ67J5J42r4O4p9
$$ 125 -234 -212 52 17 -55 -184 -22 -123 170 -136 188 109 -23 41 -159 -166 -122 -134 -138 29 44 186 92 156 77
4790G7j18J50O6j20L3j41J38k32L19j84k54L60m92M92J0ok19O8m4M33m38R4n9
$$ 77 -41 109 175 55 88 -53 85 -147 172 -12 -266 94 -398 94 104 98 -121 -53 -97 336 -102 -8 -67
4813f7R7K9J11Q3l53K66k27l8M16l35K89l02L6J09j02O5k38J02J14J8K3k19j92
$$ -67 30 59 170 253 -100 166 -61 -99 317 -18 271 -31 5 114 12 77 -161 -59 55 73 96 -123 -315
4836c15J51J66n9J60m83J94L13k14R5m5j2j1J99o3j78L04k33j88L52l63J73LK63
$$ -315 -164 2 -57 103 -380 -186 127 -87 8 -37 -49 -60 139 76 -102 202 -31 -219 133 -230 -57 -54 209
4859B09k08r7J72m9k98K65q8j49L3K42q2K19n5p1R6l04L23j83q2L03k33o4J58
$$ 209 1 -96 76 27 -271 -6 -94 -243 -210 32 -50 169 114 43 139 -165 158 -25 -107 196 -37 -101 57
4882E7k05p7K73O9j50kL7k0k00K45K8k8M6k37k2m5n1N34l53K23k15j56K43j16
$$ 57 -148 -225 48 117 -33 -35 2 -18 -218 27 55 27 73 -164 -186 -231 -282 252 -101 122 -93 -249 -6 -122
4906a22J72J23k90K01k2j24j8j40L34k19L46k36L0o2L0J19K24m14P7L24l32K62
$$ -122 50 173 -117 84 62 -62 -80 -220 114 -105 241 5 35 -27 3 122 346 -68 9 333 1 263
4928B63m13J87k4Lo5j0Q8Q6k62N56k80k15K75j00mo3J86k27Q0k16J18o6J78L1
$$ 263 -150 37 13 16 -49 -59 29 115 -147 409 129 -86 189 89 85 22 208 -19 61 -155 -37 -103 75 106
4952A06j54j04K55j46nk23lK36L6k61J92O2J70j62K47k58j02J95J70j18p2q6J80
$$ 106 -48 -152 103 -43 -48 -271 -274 -38 -2 -263 -71 -9 161 -1 246 -12 -114 81 251 133 61 -25 155
4975A55o7j43L81n44K04j76M1o2M49o4j13R5J27n51K35K82l72L19l44j7L70m55
$$ 155 88 -55 326 -218 -14 -190 -149 -211 238 174 61 156 283 -268 -33 249 -123 196 -148 -165 205 -250
4997b50L48q3rm2J24Q1k01K37j35k73L99r2k11%L05k38K4p5k2M7j9K97j46Q0l76
$$ -250 98 15 6 -36 88 169 -32 205 70 -203 196 104 -107 -107 198 -40 -16 -91 -113 -66 -85 212 66 146 -230
5022b30K92j39m5K49pp4j85L88m02K58k36j06K47n9L2K06l32J06K4m2K85k13Q4
$$ -230 62 -77 -122 127 120 46 -139 249 -153 105 -131 -237 10 -49 -17 189 -143 -37 -13 -55 230 17 101
5045A01j17K0J28k46L55j49l58O9KL00J37l27j27j2K05J02j92J4J46K36k83j66
$$ 101 -16 4 132 -114 241 92 -266 -197 -195 105 242 -85 -212 -224 -19 83 -109 -95 51 287 4 -162
5067a62j15K43J35l49K36J09p6k03L59j40M8J14j69Om4J23j34k69L15P6k46J59
$$ -162 -277 -34 101 -248 -12 97 21 -182 177 37 85 199 30 36 -8 115 -19 -288 27 103 -143 16
5089A6J79k51J24M6n5K40k66J86l12PK8L4MP5M8j76K76k68j52J67J42K3j97J38
$$ 16 195 -56 68 114 59 299 33 219 -93 -86 -58 -24 -20 55 103 -73 203 -65 -217 -50 92 115 -82 56
5113E6j87O3L7j15Q6l5K30q4n0p2m5R3P7LM3j15Q0j47j89M11lnj70M2r2K03m2
$$ 56 -131 -68 -31 -146 -60 -95 135 51 1 -71 -116 -23 54 57 100 -15 65 -82 -271 140 137 132 -38 4 -88 115 73
5140G3k20O8m9J93j01j83J68K6r5k4lR3J78j29j61K19j15J16J96l93N0J26j42
$$ 73 -147 -79 -128 65 -36 -219 -51 -25 -120 -144 -147 -54 124 -5 -166 53 -62 54 250 -143 -93 33 -109
5163a09K8q2J86j84J48N3r6j66j8L21j09p7K80k90K11j88o1L74j19j71p2L9J10
$$ -109 -81 -163 23 -161 -13 40 -56 -222 -240 81 -28 -105 175 -115 96 -92 -153 221 102 -69 -141 -102 8
5186HJ17m01R3K39M0k0J8N1j47J20k58K13m21K45L19kM6l11K4o0J30j44K58L1
$$ 8 125 -276 -183 56 96 76 94 145 -2 118 -140 73 -348 -103 216 214 260 -51 -27 -87 43 -101 157 188
5210A88l5j2k14J95k34J03J79k77m3L14k70J2l2L98l15J34J75k24J07k76K0Q4
$$ 188 153 141 -73 122 -112 -9 170 -107 -150 164 -106 -94 -126 272 -43 91 266 42 149 -127 -107 -23
5232b3J8k6k9J30p0j61O9j0L15P6j82J37l66K69k9j32N8P1l33L52J1n44K43j44
$$ -23 -5 -31 -60 70 0 -161 -92 -102 213 289 107 244 -122 147 118 -14 44 115 -218 134 145 -399 -156 -300
5256c00L29J5Q5k42J80n3k47N9Q6M8Q3j98M9J45k51J97k66M01J27j16o2J82j35
$$ -300 29 44 129 -113 67 14 -233 -174 -88 -40 43 -155 -106 39 -212 -15 -281 120 247 131 69 251 116
5279A16j69L2J65m23K16J23J75k24J13K66l32K1j81M5O1j06L20l3k86J28R1j68
$$ 116 -53 -21 144 -279 -63 60 235 11 124 390 58 79 -102 -57 4 -102 218 185 -101 27 118 -50
5301e0nL8j83j03N58q9j52l5m5K18p5j50J14j14K45l1q3j94J35j02P2k71K13K47
$$ -50 -55 -17 -200 -303 255 166 14 -21 -66 152 77 -73 41 -73 172 141 58 -136 -1 -103 -31 -302 -89 158
5325A58p0J28j72k51K73J92l09K38j0j71j10k11L85q2j38K83j88l8L39j39p3J51
$$ 158 88 216 44 -207 66 258 -51 187 177 6 -104 -315 70 -12 -150 133 -55 -93 246 107 34 185
5347A85k64p6PK21j92J89J61k04Q5l40J01J20k14K11k3Q8J70J10o20K4K43L52
$$ 185 -79 -155 -148 73 -119 70 231 27 112 -228 -127 -7 -221 -10 -33 55 225 335 -285 -261 -18 334
5369C34l11n7Jj05P4p5L92j19j18K25k38k37K43K8J15j28j0J65j08j63L41j94
$$ 334 23 -34 -33 -138 -64 -139 253 134 16 241 3 -234 9 37 152 24 14 179 71 -92 249 55
5391E5n4L36l62K3J86j64j1j03k08L51j8P3j49J62k68R9J46nL6k2o8K6k03J83
$$ 55 1 337 -25 -2 184 20 9 -94 -302 49 31 104 -45 117 -151 -52 94 89 125 103 35 61 -142 41
5415D1r2L3j3Q3J31N2n38L64K25k71k30L94j24J75j43O8j60k00O1J57j32n5L0
$$ 41 -51 -18 -31 52 183 235 -303 61 286 15 -215 179 55 230 87 155 -5 -205 -144 13 -119 -174 -144
5438a44j64K47J08K7j9K49m54J78M3J00k94K40M1kj9l01n2M1J85l1k27L42J24
$$ -144 -308 -61 47 74 55 304 -150 28 71 171 -123 117 158 156 137 -164 -216 -175 10 -21 -248 94 218
5461B18j70k13N9L66m47K56N0j13J55r8j20oQ1K04k27K33N4k36m09q0M88l5o1
$$ 218 48 -165 -106 260 -187 69 119 6 161 63 -57 -63 18 222 -5 228 282 46 -363 -443 45 10 -51
5484e1lrL4J4p5J46j25j09j3L45l63R4K38k44J0pM37l66k28M19l07J03K54m53
$$ -51 -54 -63 -29 -15 -90 56 -69 -178 -191 154 -209 -115 123 -121 -111 -118 319 -47 -275 144 -163 -60 194 -259
5508b59K68j2k10J12J16j86K24p7J75M4j06n1M2L9L6l0J2k46K70K2p0j96J79j90
$$ -259 9 -3 -213 -101 15 -171 53 -24 151 195 89 38 80 119 155 125 137 -109 161 183 113 -83 96 -94
5532i4J24j26J3K29j55J76j12Q3j51j61L34j19k03J10q5L54j55j24l60N49j75
$$ -94 30 -96 -83 146 -9 167 55 138 -13 -174 160 41 -162 -52 -137 217 62 -62 -422 127 -48
5553d8J38k72O3O7K6J33k2K2j20N5J03n4j35j37J49J21k01O9j47K59O3j17kj39
$$ -48 90 -182 -119 -52 -26 107 85 107 -13 42 145 91 -44 -181 -32 89 -112 -43 -190 69 132 15 13 -126
5577a26P0J41p7p0j59K21j0p0j60M1K12j51O5k69L88R6j54nj31J23k17K86k4n2
$$ -126 -56 85 8 -62 -221 0 -10 -80 -240 -199 13 -138 -73 -342 46 142 -12 -17 -148 -25 -242 44 20 -32
5601c2M8j29k5J26kl2Kj38L84m12J23K8O1K07L8l03L5L1j69O23l46l6J13j50q0
$$ -32 16 -113 -138 -12 -14 -46 -44 -182 202 -210 -87 -59 2 209 247 -56 -21 10 -159 464 118 82 195 45 -35
5626c5L9j87L47l21K36j02J10KJj04J31R4j37K00j10m72N58j14p0N9m56L05K96
$$ -35 4 -183 164 -157 79 -23 87 89 90 -14 117 211 74 274 164 -308 250 136 66 125 -331 -26 270
5649B70K3k65P6j58k8K59l6n7n8K23j66J07j96j5J89k27K6J46oj69k6M70m21l2
$$ 270 293 28 104 -54 -82 177 141 84 26 249 83 190 -6 -21 168 -59 -33 113 107 -62 -88 382 -39 -71
5673g1J35K64k26Q5k57m3L1J15k27K95k93K54J04l82J98l8j28O20n64K77o5J17
$$ -71 64 328 102 187 -70 -113 -82 33 -194 101 -192 62 166 -216 -18 -56 -184 436 -128 149 84 201
5695B01j89l7L87n04J76J03L4k10K39k24J81j38J83L60n16R3k99j4J67J56n89
$$ 201 12 -25 362 -142 34 137 171 -39 200 -24 157 19 202 562 46 139 -160 -174 -7 149 -440
5716d40N80m23J32J06J67j54k06K47QQ4J0K7k18J30k55K39K18j74m9j7j47K00
$$ -440 140 -283 -151 -45 122 -32 -238 9 17 101 111 138 -80 50 -205 34 252 78 29 12 -135 65
5738F5j67J74m9M3j54K3J1%r7K97j72j23L26j90J19k91J58L8J5l2J26j55o2O0
$$ 65 -102 72 23 66 -88 -65 -54 -54 -151 146 -26 -149 177 -13 106 -185 -27 11 26 -6 120 -35 -97 -37
5762c7J44k47J58j12n8J12J1j6K78k47R3l33M44k57PL4J0K89l34j3r2L13k9o8
$$ -37 107 -140 18 -94 -152 -40 -29 -45 233 -14 79 -254 190 -67 -60 -26 -16 273 -61 -74 -166 147 118 50
5786E0k77L79M4j2j02o0j47Q3K68k94k73K90P9P2KO0k42J99K24l21k39K06q3J5
$$ 50 -227 152 196 184 82 22 -125 -42 226 -68 -341 -51 28 100 102 162 -80 119 343 22 -217 -11 -94 -79
5810g9qq8K06J13j57R4j54o6J51o6L14M1j32r0k43K33L3J48k08N7j07J25j84j3
$$ -79 -87 -175 31 144 -13 81 -73 -139 12 -54 260 301 169 79 -164 69 102 250 42 99 -8 117 -67 -80
5834h0J06N8j79K45k48J44l3n2L40k20l0M2q7j87K48k29J73MJ28j46J31k96M64
$$ -80 26 84 -95 150 -98 46 13 -39 301 81 51 93 6 -181 67 -162 11 15 143 -3 128 -168 296
5857B96qj81j55K23k86K28l72J73j53K29m6L2K17l61L21o5j02J08j61j21P9r4
$$ 296 288 107 -48 175 -111 117 -255 -82 -235 -6 -52 -20 197 -164 157 92 -10 98 -63 -184 -105 -199
5879a99J19ML49n14K85j41J43l1J6j03j81J44J39J58j37R6j90r6J33J87l93J33
$$ -199 -80 -76 273 -241 44 -97 46 15 31 -72 -253 -109 30 188 51 147 -43 -139 -6 181 -212 -79
5901g9K26o4K4q1j91M8J96n5j73O0R5J59q0j06J07k10K20K7l7k47K39j62q4j05
$$ -79 147 83 107 26 -165 -117 79 24 -149 -89 6 165 85 -21 86 -124 96 123 86 -161 78 -84 -168 -273
5925b73L65j73J20J71l36L02J11j40k79L7K87k29J0p9j79M06J17j77l34K25J16
$$ -273 92 -81 39 210 -126 176 287 147 -132 -95 192 -37 -27 -106 -285 121 238 61 -273 -48 68
5946F8j34J59O0j70j73K05j46J94j31k37K92o5J26k13L38j44j14o1K50o7n2LK35
$$ 68 -66 93 153 -17 -190 15 -131 63 -68 -305 -13 -78 48 -165 173 29 -85 -146 104 37 -15 -12 223
5969B23l46J10J80P6k33q1N3j82J93L03l13P1j00K7J07j13M6J46k59K20j65K39
$$ 223 -123 -13 167 243 10 -71 -18 -200 -7 296 -17 54 -46 -19 88 -25 21 167 -92 128 -37 202
5991B02j98j01O6p6J48j11J06j11K76k15k36J28J95J35q0k38J91l35L54j85K16
$$ 202 4 -97 -31 -107 41 -70 36 -75 201 -14 -250 -122 73 208 128 -110 81 -254 100 -85 131
6012A31j76Q6OK3p9JO6j13P1J15K16p98M69o6K6j16K75p7k69K72j72J96m3j20
$$ 131 -45 41 47 70 -9 -8 58 -55 16 131 347 -451 18 -48 -22 -138 137 60 -209 63 -109 87 44 -76
6036g6k0J14k75K20j22K48p0l1j0K71k55K45j79q6K45l30J48r3J26k10K91j29
$$ -76 -96 18 -257 -37 -159 89 19 -12 -22 249 -6 239 60 -26 219 -111 37 -56 70 -140 151 22
6058B2K73k08M0r5p6L4r2K78m31M01J72L2k36j61Q7k02K42j50L2q9J08R7k32J8
$$ 22 295 87 127 32 -44 -10 -102 176 -255 146 318 350 114 -47 40 -162 80 -70 -38 -127 -19 78 -154 -136
6082a36J91j08j3J77j14n5N4M2m64L74N3J15k57K13j55mJ74j25J61J3m17K58K08
$$ -136 55 -53 -66 111 -3 -58 -4 38 -426 -52 1 116 -141 72 -83 -87 87 -38 123 136 -281 -23 185
6105A85l53L30J41l18K3L5M9K1j19l7K08n3j30J29j08M5K15m12N5L18j98j04r
$$ 185 -168 162 303 -15 8 43 92 113 -6 -43 165 112 -18 111 3 48 263 -149 -94 224 26 -78 -87
6128h7Q5k0N3k8j67m5L87k5k75L2K35k29L05j70j80L03j03j26j28J39k74L53p9
$$ -87 -2 -22 31 3 -164 -209 178 153 -122 -90 145 -84 221 51 -129 174 71 -55 -183 -44 -318 35 -44
6151d4J29j58p8k7J50k45J93M29m19l5l4J63N0K15l71J76k45J28R7P9l14K07J24
$$ -44 85 -73 -151 -178 -28 -273 -80 349 -70 -105 -139 24 74 289 -82 94 -151 -23 74 153 -161 46 170
6174A70J08l41J26mn7J2O2j63J06joJ68k6q6o8k29K36j37N8K11n0r0J26k03J45
$$ 170 278 -63 63 59 2 14 76 -87 19 18 12 180 154 68 0 -229 7 -130 -72 139 89 -1 125 -78 67
6199F7j42j53RK69j19J34j15K7L4j6k6j4j9J3j32nK3%J73j89J26%K03j47k66K46
$$ 67 -75 -228 -219 50 -69 65 -50 -23 11 -5 -31 -45 -64 -51 -183 -188 -165 -165 8 -181 -55 -55 148 1 -265 -19
6225a9q0J92j94k4J29K33m21K7P8K17J86k96j40K60k47J41J05l56%K68L6J21m20
$$ -19 -99 93 -101 -125 4 237 -184 -157 -79 138 324 28 -112 148 -99 42 147 -209 -209 59 95 216 -204
6248b04N42m00J03j04kj03K34j09J10K94j81J7l1k57J50lj47L21l03J61j45K74
$$ -204 338 -62 41 -63 -65 -168 66 -43 67 361 180 197 166 -91 59 56 -91 230 -73 88 -57 217
6270B17k94q5J41m1J06m4J10k06J55L5J54q2Rl07m3J79L2K49m17P0L5k81K76R0
$$ 217 -77 -162 -21 -62 44 0 110 -96 59 94 248 166 175 -132 -175 4 36 285 -132 -62 -27 -308 -32 58
6294E8m0K66n70J72K16k98K59l26L01l4N1k34M67k88J37j01p9J3R5l86K55j33
$$ 58 18 284 -286 -114 102 -196 63 -263 38 4 55 -179 288 0 137 36 -43 -30 65 -321 -66 -199
6316a99K77j52k04L41N5j48J97k01K0J68k09n6J64J26l34M33j6m19K17j97K5Q2
$$ -199 78 -74 -278 63 118 -30 167 -34 -14 154 -55 -111 53 179 -155 278 262 -157 60 -137 -112 -30
6338c0N3l34K41J71l25L17J13q0j81J97j55Q9M9k05J8m6L96l66L33k90j3nL78
$$ -30 23 -311 -70 101 -224 93 206 126 -55 142 -13 76 125 -80 -62 -108 288 -78 255 -35 -48 -53 325
6361C25q9m95K50J29k06J38L0j2k5p8J69k85J7K86Lk1Nl69K48j44J28K1k84L22
$$ 325 236 -259 -9 120 -86 52 82 70 45 -33 136 -149 -132 154 157 136 141 -228 20 -124 4 25 -259 63
6385F3J68m18n6K23m8k5J31j63K55j73L8K39k31J13l21J08j93M33l00L39k26o2
$$ 63 231 -187 -243 -20 -68 -93 38 -125 130 -43 -5 234 3 116 -205 -97 -290 143 -157 182 -44 -106
6407a06J26R1n7P6J52m31R2j68O9L25l52J02J66k86N38n22K54J7l21L60J78k00
$$ -106 20 111 54 130 282 -149 -57 -225 -156 169 -183 -81 85 -201 337 -185 69 86 -235 125 303 103
6429A03j09N0j6r7k66K66n6J99rj3j46m2K53l16J77P1k92M66k41j60J28m3J35
$$ 103 -6 44 28 -69 -335 -69 -125 74 65 52 -94 -136 117 -199 -22 49 -243 223 -18 -178 -50 -93 42
6452D2q8qM5N8l3K78l50K50l26K48j35j67J64J89k54J30MjR3k57k99L13K66k09
$$ 42 -46 -54 -9 49 16 294 -56 194 -132 116 -19 -186 -22 167 -87 43 47 46 139 -118 -417 -104 162 -47
6476d7kQ3o7j69J24j8K81l9k50O1K23l27J49j17K5L2l3R2rj02J60P1j79j35K27
$$ -47 -49 34 -33 -202 -78 -96 185 146 -104 -43 180 -147 2 -115 -90 -58 -91 1 -8 -110 50 121 -58 -193 34
6501C4j56N5jk11K65J31o1j28j06K99j91r6R5J46P3k8r1o5k4%j76J90n6K01J4
$$ 34 -122 -67 -68 -279 -14 117 56 -72 -178 121 -70 -166 -71 75 148 120 29 -36 -60 -60 -236 -46 -102 99 113
6526A13k56K20jl2K0k98K1L13j06R3j63L02j61j8RL6j3N2k5k09r5L04J67k60j50
$$ 113 -143 77 76 44 64 -234 -213 100 -6 87 -76 226 65 47 56 92 79 131 106 -103 -198 106 273 13 -137
6551a37k2K74m5k4j9Q6l29K63R8O5j19l14K26J9m6m15M15L08k37j6n1k17L71K
$$ -137 -159 115 70 46 27 113 -216 47 145 210 91 -223 3 22 -24 -439 -24 284 47 31 -20 -237 134 136
6575A36k52J80J67j98j80j51M41r8j03K1J54k76J27Po4j08m0K13j73L38k1l4m39
$$ 136 -116 64 231 33 -147 -298 143 45 -58 -37 117 -159 -32 -25 -89 -197 -237 -24 -197 141 120 86 -353
6598c53L10K26q2p9q7J31k23J66j1J28j02OJ95k28J8Ok37L08m7K50k92j82L70
$$ -353 -43 183 101 22 -65 66 -157 9 -2 126 24 30 225 -3 15 21 -216 92 45 295 3 -179 191
6621A91R5l79q6R7J9J14L4l84L91k74L37l44K84J7k80L50k31L26l83L0K55l18
$$ 191 286 -93 -179 -82 -63 51 85 -299 92 -182 155 -189 95 112 -168 182 -49 277 -106 -76 179 -139
6643a39K79j86J33P1j4K40n31J03L8Q1R3l2k12L02l83K73j95j68J39L1J41oj1
$$ -139 140 -46 87 158 144 384 -147 -44 -6 75 168 136 -76 226 -157 116 -79 -247 -108 -77 64 58 47
6666D7%j5J09j91q6K68q9j92K18j65o5K27j10j25K64J08j09J84m79M08p5J0j07
$$ 47 47 32 141 -50 -136 132 43 -149 69 -96 -161 66 -44 -169 95 203 94 278 -201 207 132 142 35
6689C5j15n2k29O17j38N3J41k16n9m6j03j7P1J93K61l37j10K52l89J93j40j68
$$ 35 -80 -132 -361 256 118 171 312 96 37 -9 -112 -129 -58 135 396 59 -51 201 -188 5 -135 -303
6711c03L23k38L60l68m2M51l62P7R1l10L46j96N3k46M64j36N3J29j92Kr1PJ71
$$ -303 20 -218 142 -226 -268 183 -179 -102 -11 -321 25 -171 -118 -364 100 -36 17 146 -46 -44 -135 -128 43
6734D3j95J06Q7j30j41M78k69j8J70j82l0J14j3J36n2O4k55J29N7m15L72J28j90
$$ 43 -152 -46 41 -89 -230 248 -21 -39 131 -51 -81 33 20 156 104 168 -87 42 99 -316 56 184 -6
6757fj73K78n7j73O7j44M18J06m42R4J2J35j97K9l3j26l3O8K01J01m02R4J59k24
$$ -6 -179 99 42 -131 -64 -208 210 316 -126 -32 -20 115 -82 -53 -86 -212 -245 -177 24 125 -277 -183 -24 -248
6781b48R2L20r9k08p1r1J62J59m1j10O1j71J79K28K12l90k6j13K35j2M0q1M1J72
$$ -248 -156 164 65 -143 -214 -305 -143 16 -25 -135 -74 -245 -66 162 374 -16 -42 -155 80 68 108 27 68 240
6805B40K6j88Q4k10P5k56L39l70J78J47l29J27K91n5k54K21j11J05K6K9l3j02
$$ 240 266 78 162 -48 27 -229 110 -260 -82 65 -264 -137 154 99 -155 66 -45 60 86 115 82 -20
6827b0r9K45q2J37n12O18k25j07K62j54o3J48j2m1j15J09l98J16K1K13j72J10
$$ -20 -119 126 44 181 -331 287 62 -45 217 63 0 148 136 95 -20 89 -309 -193 -172 41 -131 -21
6849b1Q0j07o5K77O3o4m01K07J16Lj70R0Q3n6l8k42O4K28r1n4L46l16K09k07k8
$$ -21 59 -48 -113 164 227 163 -238 -31 85 88 -82 8 91 35 -3 -245 -181 47 -44 -98 248 -68 141 -66 -94
6874i4K52J9m31K50kK24k52r6J89k59Q3k28J67K37l0M0j33J53k26O5j8L47n21
$$ -94 158 177 -254 -4 -6 218 -34 -130 59 -200 -117 -345 -178 59 29 69 -64 89 -137 -72 -90 257 -264
6897b64L21J2j81k23L19j18M0J10l3N4j13j00M1J94k05J73k92M54j79M34m67l0
$$ -264 57 69 -112 -335 -16 -134 -94 16 -17 37 -76 -176 -135 59 -146 27 -265 189 10 444 -23 -53
6919e3L54l12Q4k52J8p3M41m97K73r9K67o4j25j82J92O7q1J23P5k92K71j71p4
$$ -53 301 -11 73 -179 -161 -234 207 -290 -17 -116 151 87 -38 -220 -28 39 -42 81 156 -136 135 -36 -110
6942a10L4o5J39LK15k63j37K61j28J0J61n0N8q7K62k59L2k2j88m3L01j35k83L35
$$ -110 -76 -141 -2 1 216 -47 -184 77 -51 -41 120 70 128 41 303 44 76 54 -134 -177 124 -11 -294 41
6966D1J94m16L69j90L9k1l9M1l03K01K63K70m15nj06R1P7r8K04m16L23k80J08
$$ 41 235 -181 188 -2 37 16 -23 18 -285 -84 179 449 34 29 -77 14 91 -7 197 -219 104 -176 -68
6989f8J47n1k03J29M4j92Q0K46k43q9K54oj51L76k50J26m4k89K77m2k38j3R8L35
$$ -68 79 28 -175 -46 -2 -194 -114 132 -111 -200 54 48 -103 273 23 149 105 -184 93 51 -187 -200 -102 233
7013B33j3q3j68N1p1m9L4J56J10R8m35l2K0J31o5K76k21j87J72j00L36q3k57j2
$$ 233 220 137 -31 20 -51 -100 -66 90 200 298 -137 -169 -149 -18 -83 193 -28 -215 -43 -143 193 110 -147 -159
7037a59M09m90K11m7K62j62l7r7J69j45J6J68j17K61m12K18p7M16k69L6k18k02
$$ -159 250 -240 -29 -76 186 24 -13 -110 59 -86 -70 98 -19 242 -170 48 -29 387 118 154 -64 -266
7059b66M26m68L08j76K89J0k47J69o1J30m6M4l04L50Ol63R2J06K74j01r0K1k59
$$ -266 160 -308 0 -176 113 123 -124 45 -16 114 68 112 -192 158 164 -199 -107 -1 273 172 82 103 -156
7082a56P8R7J1K86m7m56P9K83j17m2l11K42J47j08Q0k36K36J17j60j76K88p2k50
$$ -156 -78 19 30 316 269 -187 -108 175 58 16 -295 -53 94 -14 66 -170 66 183 23 -153 135 63 -187
7105a87K19j05J78n4qJ10j55k54L34P9J33l62L8j53J08R8m2K00r9M8j27r4K66
$$ -187 32 -73 105 51 43 153 -2 -256 78 157 290 -72 -34 -187 -79 19 -23 177 78 126 -1 -95 171
7128A71L1k73L5K63l02r9K35L2kj86Q4j21L42O5j62L5Q4j6l96K81j20L8k96J57
$$ 171 202 -71 -36 227 -75 -174 61 93 91 -95 -11 -132 210 275 113 148 232 216 -180 101 -19 19 -277 -120
7152a20J90m0L1L8m03M46j61J18j49j97M18q7k48J94j62K53k56n7M22l94J78l
$$ -120 70 30 61 99 -304 142 -19 99 -50 -247 171 84 -164 30 -132 121 -135 -192 230 -164 14 11
7174A1m4n5K18L2k70J88L1k6j19L24k58M2j25k5J27n46L63N4J12k51j1J0J89k25
$$ 11 -33 -88 130 162 -108 80 111 85 -34 290 32 74 -51 -76 51 -495 -132 -78 34 -217 -228 -218 -29 -254
7198b54K13K91k61J38k93K35R8k69K9M6L56m95R8K99m41K88j33J50l79M20k85
$$ -254 -41 250 -11 127 -166 69 167 -102 -73 -27 329 -166 -68 231 -210 78 -55 95 -284 136 -149
7219a49M56l24J42l00J69j38J21J96q0j69rK59m84R0L05j02jJ12J02j11J11q3
$$ -149 307 -17 125 -175 -6 -144 -23 173 93 -76 -85 174 -310 -220 85 -17 -18 94 196 85 196 113
7241A13j42R9k92K70k70J61K0R7L3j61k62K58J9L08k08q0o6J60j44k4l3K45j95
$$ 113 -29 70 -222 48 -222 -61 -41 56 89 -72 -334 -76 -57 251 43 -37 -103 57 -87 -111 -144 101 -94
7264i4KJ64r9J62m7qPr5L3p1K68j80l35K67P0M8k45Q9p6k3J40L47n31l0K56Q7
$$ -94 -92 72 -27 135 88 80 87 -8 25 -46 222 42 -293 -26 44 92 -153 -64 -140 -163 -23 324 -207 -237 19 106
7290A06O8j02j74K76j03k83L22J57j41j47Q9l4J22o9r8j44L80j5k65J96k46K39
$$ 106 174 72 -102 174 71 -212 110 267 126 -21 68 34 156 87 -11 -155 225 210 -55 141 -105 134
7312A34L8J5p2mk14k4o3M87l85l9O1j64k8K62K58k36J07K37j42l3l13MP9L4J12
$$ 134 172 187 115 111 -103 -127 -190 297 -88 -127 -66 -230 -258 4 262 26 133 370 228 195 -118 -114 -35 -1 111
7337A11O0l15K31j17j39J81J84o6P9M9k27k91L2P1J22jJ0j41J22kJ03j00O6r9
$$ 111 171 -144 87 -30 -169 12 196 130 209 258 31 -260 -228 -157 -35 -36 -26 -167 -45 -47 56 -44 22 -77
7361g7M1K83m31J05K6j92N65j45j78k10J77QJ68o60N99j63R9j24J94l21J39K28
$$ -77 -36 247 -184 -79 -53 -245 320 175 -3 -213 -36 -28 140 -520 79 -84 15 -109 85 -236 -97 131
7383A31k07P9J75J18l55r9M27q5k84N3l5o0L8n8K58J59o81M16J9J46n20L67J1
$$ 131 -76 3 178 296 -59 -158 269 184 -100 -47 -82 -142 -104 -162 96 255 -426 -10 9 155 -365 2 13
7406A3J62k99J90k77L8QJ69R0j78j5K10k49j10J65Q2K9M5k18J59l3j43L13k41
$$ 13 175 -124 66 -211 -173 -165 4 94 -84 -99 111 -138 -248 -83 -1 28 73 -145 14 -19 -162 151 -90
7429i0Q1J15j11Q8j56j08K27J04j8j37k6J53l32L16m0k59J40K32k50K07j73K10
$$ -90 -9 106 -5 83 -73 -181 46 150 132 -5 -31 122 -210 106 66 -193 -53 179 -71 136 -37 173
7451A73J43j94j15j63K33j60J75J2j63L94k96l17J63N3p9J31m7m7K27j87J69Q7
$$ 173 316 122 7 -156 77 -83 92 104 -59 335 39 -278 -115 -62 -141 -10 -57 -104 123 -64 105 192
7473A92k48J80M1j70k78J86JL04j56k26J90o7p4J33J16j18L7j98J41K34k79q4
$$ 192 -56 124 165 -5 -283 -97 -96 208 52 -174 16 -51 -125 8 124 6 43 -155 -14 220 -59 -143
7495a43M1N1j35J76L07k52j61L00l66J39r9o6J76K2J98k75K6n5K77l78L09r9J
$$ -143 -102 -51 -186 -10 297 45 -116 184 -182 -43 -142 -208 -32 -10 188 -87 -61 -116 161 -217 92 -7 -6
7518fK0L7R8R0k62M6Q3j33j7J97k24o2r3L01J01j75k42K36k3JJ80K53k12k92k06
$$ -6 14 51 149 239 -23 23 106 -27 -44 153 -71 -133 -226 75 176 1 -241 -5 -28 -27 153 406 194 -98 -304
7543c04L51q5k65K63l3K71n3l90K54J35j54r3k3K75m22L14k12J63q3J37OJ51j20
$$ -304 47 -38 -303 -40 -73 198 145 -245 9 144 -10 -103 -126 149 -273 41 -171 -8 -91 46 52 203 83
7566H3N3j17Jj02q5L3J8L0j18L02k72M7K10m9J32J49l83J19J1L1R8k48n9K11n9
$$ 83 136 19 20 -82 -167 -134 -116 -86 -204 98 -174 -127 83 34 166 315 -68 51 62 93 191 -57 -116 95 36
7591C6k17L92j94q4n1K70j37j04q0J28j08J25j0n3K34j09n1K06j34o1k21R0R5
$$ 36 -181 211 17 -67 -118 152 15 -89 -169 -41 -149 -24 -34 -87 147 38 -13 193 59 -2 -223 -133 -38
7614c8K19j08k48K35m5j42J62O7m03M32K56m03q0K7n2M6L5M9j92L47k38J09j74
$$ -38 181 73 -175 60 15 -127 35 102 -301 131 387 -16 -96 -69 -121 -75 -40 9 -183 164 -74 35 -139
7637a39N4Q5Q1k28J01J5j8J94l05Q1r6o6p9J28M48k38K57j46j38k34R4K23l25
$$ -139 -85 0 81 -147 -46 -31 -49 145 -160 -79 -175 -241 -320 -192 256 18 275 129 -9 -243 -149 74 -251
7660b51M09j07j20j05J40K5q4q6L72l51J86j72L80n2p4r7j16J73P7j14r6n0J80
$$ -251 158 51 -69 -174 -34 -9 -93 -179 193 -158 28 -144 236 184 110 13 -103 70 147 33 -63 -113 67
7683F7j6k79L55o1J09k86K50p2p0j58J50M55m70J26K3q4k52j24M05j95M6J49k14
$$ 67 51 -228 127 66 175 -111 139 67 -3 -161 -11 444 -26 100 123 39 -213 -337 68 -127 -81 68 -146
7706a46J50O8J35k55j2J0R4j60m1R4l33O60k03p8J76j95j50K00q4K39k69P4j60
$$ -146 4 72 207 -48 -60 -50 44 -116 -157 -63 -396 264 61 -17 159 -36 -186 14 -70 169 -100 -26 -186
7729a86J58J06m4M8j45K82k10n8M8K93l2k56J03J3k17J63J6L3k59M00m51J16l5
$$ -186 -28 78 34 82 -63 219 9 -49 -1 292 260 4 107 120 -97 66 82 115 -144 256 -195 -79 -114
7752a14J83p9j0j27K25O5j99j11K26K1l12K71r0J07j28J34K19P1l34Q5k91J64
$$ -114 69 -10 -20 -147 78 143 -56 -167 59 80 -232 39 -51 56 -72 62 281 352 18 103 -188 -24
7774b4R1q8L52j47k02r1J24j84M64k01n3J39n44L02K55k28J69l22K39Q4q7k36
$$ -24 67 -21 331 184 -18 -109 15 -169 295 94 41 180 -364 -62 193 -35 134 -188 51 135 48 -188
7796a88O5L78o8P0m86R2l1L29K9j03l28L43r8j13J60j78j83L33R5j3N4j18k6J26
$$ -188 -123 255 187 257 -229 -137 -168 161 190 87 -241 102 4 -109 51 -127 -310 23 118 105 159 41 15 141
7820A41Q4l40K89k75J01J02j0j78J78r1J6j53J63j23L81k01k1n3J78j72j15J57
$$ 141 225 -115 174 -101 0 102 92 -86 92 1 17 -136 27 -96 285 84 63 10 188 16 -99 58
7842E8O9Q7m69K56l6Kj2j9J2m8J88q2k40N29k90j63P2j23J87j49J95p3J32j6J25
$$ 58 127 214 -255 1 -35 -33 -45 -64 -52 -100 88 6 -234 295 5 -158 -86 -209 -22 -171 24 -49 83 67 192
7867A92r6j22o7J60o5L09k61j29K45k80J47j61K40k62oL87k35J72k87J01R5n6
$$ 192 96 -26 -93 67 2 311 50 -79 166 -114 33 -128 112 -150 -156 231 -4 168 -119 -18 77 21
7889B1%j63M54l52J50l2j03p4L4q2O8j02K59j91J62P3N5p1J1m7n3N6N9l3r9n7
$$ 21 21 -142 312 -40 110 78 -25 -99 -65 -147 -79 -181 78 -113 49 122 177 106 117 70 17 73 132 99 0 -57
7915e7j6J21O5k71K89j27k13L28j49p4L23j74K5K07j41p4J43kj46k14P7p8J03
$$ -57 -73 48 113 -158 131 4 -209 119 -30 -104 219 45 70 277 136 62 205 203 57 -157 -80 -158 -55
7938e5K40j23j58p2J10o2J62p3J64l56K43J14q5J63j40k57K42J12j03k00K00N7
$$ -55 185 62 -96 -168 -58 -120 42 -31 133 -223 20 134 49 212 72 -185 57 169 66 -134 66 123
7960A23K7k6m65M02N6R3k68Q4J2J11QM0j47l5J09j0j03o1n4K24j20J74k40J19
$$ 123 150 124 -341 61 117 210 -58 26 38 149 157 197 50 15 124 114 11 -50 -104 120 0 174 -66 53
7984E3j97J61j35r4K11j97M01p0l78N88o03K48N6j12K14j96J26j96K26k19o8p6
$$ 53 -144 17 -118 -212 -1 -198 203 133 -245 343 -260 -12 44 -68 146 -50 76 -120 106 -113 -181 -257
8006b57J86J24R7k65K87k46J2M8Q0j95J68l6j66J38K07k49q9J74j19j85%K80M6
$$ -257 -71 53 150 -115 172 -74 -62 -14 66 -129 39 3 -163 -25 182 -67 -156 18 -101 -286 -286 -6 40
8029D0k08K61p3j34O1n0K65l10N2J58k6R1J6K1k57J7J37L9J59k59j83J49qK47
$$ 40 -168 93 20 -114 -53 -103 162 -148 -96 62 36 127 143 164 -93 -76 61 100 259 0 -183 -34 -42 205
8053B05l18K20q0K3Q4k18J22j91J89O4j9l35R2K41j54L13j64k71m1jL08M5Kj12
$$ 205 -113 107 27 50 134 -84 38 -153 36 100 81 -254 -162 79 -75 238 74 -197 -238 -239 69 114 116 4
8077Dj76K27P5j91O2J88J14n82M52j53K19k6Q7j46j96J10N8K46k11j01r5J84j10
$$ 4 -172 55 130 -61 1 189 303 -279 173 20 239 213 300 154 -42 68 126 372 161 60 -35 149 39
8100C9J04p8M0J8j12j01j38L05r2Q1k07J14R1o7J38l3k07L33j64K80k29j55J76
$$ 39 143 65 105 123 11 -90 -228 77 -15 66 -141 -27 64 -3 135 102 -105 228 64 344 115 -40 136
8123A36O0m16M45r3j76j2Kl7L17O8k97K7O2k63K71m09K18P4k6%K6R7p4L7m3k02
$$ 136 196 -220 225 132 -44 -56 -54 -91 226 294 -3 24 86 -177 94 -315 -97 -23 -49 -49 -23 74 0 37 -6 -208
8149b08L59j29j16o6K30l99j7L66k19J02L06j82l45K80K26j30p7j06J82o1K2O0
$$ -208 151 22 -94 -160 70 -329 -346 20 -199 -97 209 27 -318 -38 188 58 -19 -125 57 -4 18 78
8171G8k19l6J82LL4J11j16j11J61K7k10K12l1J3l25N05m19R5J24j15
$$ 78 -141 -177 5 8 42 153 37 -74 87 114 -96 116 85 98 -227 278 -141 -46 78 -37
8191c7
$$ Imaginary data points
##PAGE= N=2
##DATA TABLE= (X++(I..I)), XYDATA
0@%%%%%%%%%%%qJ6j6J6k4L2l6M4n6O8p7R0j12J35j54J78k08K41k80L23l69M21
$$ 0 0 0 0 0 0 0 0 0 0 0 0 -8 8 -8 8 -16 16 -20 24 -32 36 -41 49 -63 72 -82 96 -112 129 -151 172 -197 224
33B24m79N43o13O90p74Q68r72J084j206J341j488J649j826K019k232K464k717
$$ 224 -255 288 -325 365 -409 459 -513 571 -635 706 -782 867 -959 1060 -1172 1292 -1425
50a425K994l299L637m012M430m898N427o029O720p523Q469r607J1007j2777J5102
$$ -1425 1569 -1730 1907 -2105 2325 -2573 2854 -3175 3545 -3978 4491 -5116 5891 -6886 8216
65H216j8315K3102l1141M8257j51305N9142O7144n3146J55222m9312N3263k9920
$$ 8216 -10099 13003 -18138 30119 -121186 -62044 5100 -48046 107176 57864 111127 81207
77H1207o7179l5592m9527m0721O8304J7603j7805Q9946Q763J8842N438p3959n319
$$ 81207 14028 -21564 -71091 -111812 -43508 -25905 -43710 46236 54999 73841 79279 5320 1
90Am5454J1237p87n1089O6953M9835j3156L5902j0291j5126j2519p439l8402j2663
$$ 1 -45453 -34216 -35003 -86092 -19139 30696 17540 53442 43151 28025 15506 8067 -30335 -42998
104d2998j0560K2902M6435k3838J8596L8593j8110J2160m1053j3092k0845R764
$$ -42998 -53558 -30656 15779 -8059 10537 49130 31020 43180 2127 -10965 -31810 -22046
116b2046p033k716K2722Q027L7364k154j1887J110k9283J5123l4345n672j246
$$ -22046 -29079 -31795 -9073 -1046 36318 34164 22277 23387 -5896 9227 -25118 -30790 -32036
129c2036O532L8249j899j37J6069K367j1766j4919j5413j5049P214L29J1448J0364
$$ -32036 -25504 12745 10846 10709 26778 29145 17379 2460 -12953 -28002 -20788 -20459 -9011 1353
143A353m367L4008k527j4559p677j0471k775j1622j290K647K044K8304q39P434
$$ 1353 -3014 30994 28467 13908 6231 -4240 -7015 -18637 -19927 -17280 -15236 13068 12229 19663
157A9663r434M954o712j3057o951p772K639Q353R389N333p073K0840n234m709
$$ 19663 10229 15183 8471 -4586 -11537 -19309 -16670 -8317 1072 6405 -668 20172 14938 10229
171A0229j3346k508j416p070P088J91J856J1175M878L324j1209m34J11n823l674
$$ 10229 -3117 -5625 -7041 -14111 -7023 -6832 -4976 6199 11077 14401 3192 2758 2869 -2954 -6628
186f628n282N802J287Q544K52j660L455J218j851o017n147L119m879Q393n397
$$ -6628 -11910 -6108 -4821 3723 3975 2315 5770 6988 5137 -880 -6027 -2908 -7787 606 -4791
201d791N357q51N874K332o864k154K171j017j2o481N082k579N943j691J505k025
$$ -4791 566 -285 5589 7921 1057 -1097 1074 57 45 -6436 -1354 -3933 2010 319 1824 -201
217b01J785L936m198l247j10K89K418l890K086j541K396M399j890l98k299M277
$$ -201 1584 5520 1322 -1925 -2035 -1746 672 -3218 -1132 -2673 -277 4122 2232 1834 -465 3812
233C812k354l145k026L35J192J003J459K86r61O905l162N9n922K064j123k239
$$ 3812 1458 -1687 -3713 -3378 -2186 -1183 276 562 -399 6506 3344 3403 -2519 -455 -1578 -3817
249c817J4Q26O76N221J288J373n167L959l256j691m776oJ531J181L442J587n92
$$ -3817 -3803 -2977 -2301 2920 4208 5581 414 4373 1117 -574 -5350 -5356 -3825 -2644 798 2385 1793
266A793L575K73j332p033j37p21j241N55P24M072J555M814m06l783j550r50k254
$$ 1793 5368 5641 4309 -2724 -2861 -3582 -4823 -4268 -3544 528 2083 6897 6491 2708 1158 208 -2046
283b046l597j274M376N7N759Q8J982j593O43j653n353l510R87K45K352L63N721
$$ -2046 -5643 -6917 -2541 -2484 3275 3363 5345 3752 4395 2742 -2611 -6121 -5134 -4889 -2537 -2174 3547
300C547m01M238j278l471m290j411l75j973m38L894K107M267P32J040l343j010
$$ 3547 3146 7384 6106 2635 -1655 -3066 -3441 -5414 -5852 -1958 149 4416 5148 6188 2845 1835
316A835j457m470k321j70L906K032K291K824M48M31j294l173l749l552K931j211
$$ 1835 378 -4092 -6413 -6583 -2677 -645 1646 4470 4918 5349 4055 882 -2867 -6419 -3488 -4699
332d699K296J713L846J393N66o51k800l353m69k310k85j229N627J782K397L76
$$ -4699 -2403 -690 3156 4549 5115 4464 1664 -1689 -2158 -4468 -4753 -5982 -355 1427 3824 4200
348D200O71j994j882k430k207k424K386J424K924N72K816Q29j012j155l161k315
$$ 4200 4871 2877 995 -1435 -3642 -6066 -3680 -2256 668 1240 4056 4885 3873 2718 -443 -2758
364b758j458O68P42K36L458K488Q27n17j431q34l709L64k266M86O21L440J683
$$ -2758 -4216 -3548 -2806 -2570 888 3376 4203 3686 2255 1421 -2288 -1924 -4190 -3704 -3083 357 2040
381B040O30L20J093k674j048l009J71j640J740J450J335J206J685Q4j285j682
$$ 2040 2670 2990 4083 1409 361 -2648 -2477 -4117 -2377 -927 408 1614 3299 3383 2098 416
397D16q88k525L93n08J853M47J946K047q96l5o20j354j531j302J1J57J412J913
$$ 416 -472 -2997 -2604 -3112 -1259 -812 1134 3181 2285 2250 1630 276 -1255 -2557 -2546 -2389 -977 936
415I36O14O15k94P46k341j188j202P5j10J030O73J598J78J164j160l25j627Rj121
$$ 936 1550 2165 1871 2617 276 -912 -2114 -2039 -2149 -1119 -446 1152 1330 2494 1334 1009 -618 -609 -1730
434a730l24O23J024N76J224M23n0j432M77j624m55q07R18J74Q35J181K10q6o6
$$ -1730 -2054 -1431 -407 169 1393 1816 1766 334 811 -813 -1268 -2075 -1157 -983 -148 1033 1243 1157 1091
453A091m66q99j029M07l95N35O95N31O25n25Q19r87o72l03j78n1n33Q94R18k94
$$ 1091 625 -274 -1303 -896 -1291 -756 -61 470 1095 570 1389 402 -270 -573 -751 -802 -1335 -441 477 183
473A83R06m70N47j434Op40K16r0Q83J38M43P8J62q26l0k14m7p90M98Q45l09J67
$$ 183 1089 619 1166 -268 -262 -1002 -786 -876 7 145 588 666 828 2 -28 -242 -289 -1079 -581 264 -45 122
495A22N50N9l38l63P0j059L87L33L2J74K36P72q20k1Nl84k97O9L46m08L80P85
$$ 122 672 731 393 30 100 -959 -572 -239 -207 -33 203 975 155 134 139 -245 -542 -473 -127 -535 -155 630
517F30l37M71n97L55j089K69m71J73J44P62K84j14k70O44r43n6m03K8k86L13N11
$$ 630 293 764 167 522 -567 -298 -769 -596 -452 310 594 480 210 854 -89 -145 -548 -520 -806 -493 18
538A8N12o4L49qm25n68r3n43j13O62j5P33J08M21q3r29J18j9p89k68N21M76j47
$$ 18 530 466 815 807 382 -186 -279 -822 -935 -273 -288 445 553 974 891 -38 80 61 -728 -996 -475 1 -146
561a46O15L53K29r47P5k19q99K08k52O69L84N3R64o87M39n39n19p73L05j67k2
$$ -146 469 822 1051 104 179 -40 -939 -731 -983 -314 70 123 1087 400 839 300 -219 -992 -687 -854 -876
582h76N27M84L41J18K09M4p30l19k91m17J95K97N22M5N19L40n83j50k76m70n79
$$ -876 -349 135 476 594 803 847 117 -202 -493 -910 -715 -418 104 149 668 1008 425 275 -1 -471 -1050
603a050K87J91K15M63J59O10n5k10n57k92l29j10k25O94K8J034o60O96m87J22
$$ -1050 -763 -572 -357 106 265 875 820 610 53 -239 -568 -678 -903 -209 -181 853 193 889 402 524
623E24o41m38j09k9l2Q88NP23l7L9o01k42l95l79j87J9P68J77K42N51p2k2l85
$$ 524 -117 -555 -664 -693 -725 163 168 891 854 893 292 50 -345 -724 -911 -892 -124 53 295 846 774 752 367
646C67l88m80k94L53J79J90L12M87Q7m01k2k28p38j13k06M85J44M14J42N34k45
$$ 367 -21 -501 -795 -442 -263 -73 239 726 813 412 390 162 -576 -689 -895 -410 -266 148 290 824 579
667E79k01k85l73l10J03k35N01J43J85K99K8N3o3m89j63j87r9L74L40l42K40L63
$$ 579 378 93 -280 -590 -487 -722 -221 -78 107 406 434 487 424 -65 -228 -415 -514 -140 200 -142 98 461
689D61k02p5n3j46l20J6r5O13k71L69K15Jj91M5n36m9l46K07K20J6J77oJ94K39
$$ 461 259 184 131 -15 -335 -319 -414 199 -72 297 512 513 322 367 -169 -218 -564 -357 -137 -121 56 50 244 483
713D83K31m76o18J80k19K16m6J46K88K17J29m2m93o0M7o43K23J59K25K10j08M43
$$ 483 714 238 -380 -200 -419 -203 -249 -103 185 402 531 489 -4 -64 -17 -660 -437 -278 -53 157 49 492
735D92q0m23j10p6l2O8N3k92P04k24J83qj23l00J48m16K26l41N58M3p8M40j29
$$ 492 412 -11 -121 -197 -229 -161 -108 -400 304 80 263 255 132 -168 -20 -436 -210 -551 7 50 -28 412 283
758B83j50k95j25M06m05J64j06R9L14J61O2m3l85p6n6j41l9N02k34R1M6nJ45j7
$$ 283 133 -162 -287 119 -286 -122 -228 -129 185 346 408 365 -20 -96 -152 -293 -332 170 -64 27 73 68 213 196
782A96R1l82r5L1k64L36P4j99K24J37M6R6p4m83J3j32L44j3J71j59J31j09L11
$$ 196 287 -95 -190 -159 -423 -87 -13 -212 12 149 195 291 217 -266 -253 -385 -41 -54 117 -42 89 -20 291
805B91m92R1j31J36p0N3L10l2n4k09j41K55j43N5j0Pp7R7J42n2K39O4k65k77K05
$$ 291 -201 -110 -241 -105 -175 -122 188 156 102 -107 -248 7 -136 -81 -91 -84 -161 -64 78 26 265 329 64 -213 -8
830hl11J31Q0K57J82k62K10j27j44Q9k78j67Q4J3K21J41K70j25l18K0J58J06k36
$$ -8 -319 -188 -108 149 331 69 279 152 8 97 -181 -348 -264 -251 -30 111 381 256 -62 -42 116 222 -14
853a4k44P4k6N8J73J54n3j42j45j24J99k13r1M50r8Q9q0K35l4K8k57n6N1k27L79
$$ -14 -258 -184 -210 -152 21 175 122 -20 -165 -289 -90 -303 -394 56 -42 47 -33 202 168 196 -61 -117 -66 -293 86
878H6j06J12K5J92p1M1n7l20k51K66J29j06R9j34K46n1J77k37k52k8Q2o1k9N5
$$ 86 -20 92 117 309 238 279 222 -98 -349 -83 46 -60 39 -95 151 100 277 40 -212 -240 -158 -219 -248 -193
902a93N91k31j82L90l44l0k8j58J37k22m6K53P7L26l9o41N41l68Qn4m0O1L76Q6
$$ -193 398 167 -15 375 31 1 -27 -185 -48 -270 -316 -63 14 340 301 -340 201 -167 -159 -213 -253 -192 184 270
926B70j50J68r4j96l12N7j81M88l75K90K2K13J29j9j94l01K56l24J09J8pM35k52
$$ 270 120 288 194 -2 -314 -257 -438 50 -325 -35 -13 200 329 310 116 -185 71 -253 -144 -126 -133 302 50
949E0O5j87M09j15j71L2k34j2K44l8M5J09O1k2k16o7j17o6P4r2L49J6k99K75m1
$$ 50 115 -72 337 222 51 83 -151 -163 81 43 88 197 258 236 20 -47 -164 -230 -156 -248 101 117 -182 93 52
974E2R9l63J39J40l30J84j53L15l2l0L5j89K17o6j97K35l10j06M31j1k83rK79
$$ 52 151 -212 -73 67 -263 -79 -232 83 51 21 56 -133 84 18 -179 56 -254 -360 71 60 -223 -232 47
997D7K01l79K84j69l21K07j1K30Nj21K48j71J22l04j02J0K08l04L75k45K97J38
$$ 47 248 -131 153 -16 -337 -130 -141 89 94 -27 221 50 172 -132 -234 -224 -16 -320 55 -190 107 245
1019B45n6l8M4k94l7j12J16J25J40k11j53N16j79k48q1J95k10Q0J47j16L58p9
$$ 245 189 151 195 -99 -136 -248 -132 -7 133 -78 -231 285 106 -142 -223 -28 -238 -158 -11 -127 231 152
1041A52O1j07O1n65N97k82j86Q2J50R1j05L0r0J92j37j31n1J79J00k00j30L87
$$ 152 213 106 167 -398 199 -83 -269 -187 -37 54 -51 -21 -111 81 -56 -187 -238 -59 41 -159 -289 98
1063I8J07l1j79j39k2O1P5J2o1j74K11ln1R6m1q3l41M53J18p8J04r2rj0j23M13
$$ 98 205 174 -5 -144 -166 -105 -30 -18 -79 -253 -42 -45 -96 0 -41 -124 -465 -12 106 28 132 40 31 21 -102 311
1089C11l77j32R9J07l0J0n1K6k4j08J59n5l0J15j87K67J7ml6p4j9K10p7j79J00
$$ 311 -66 -198 -99 8 -22 -12 -63 -37 -61 -169 -10 -65 -95 20 -167 100 117 113 77 3 -16 194 117 -62 38
1114C8j32J61k31K70k63K71O1l91K75j24J59k22K68k6lj00L0J29r3l1M1j29K20
$$ 38 -94 67 -164 106 -157 114 175 -216 59 -65 94 -128 140 114 111 11 41 170 77 46 87 -42 178
1137A78k05j44K01J04l33N07k00R4l26J63k03J79j27j62J08L46j26k07N70l76
$$ 178 -27 -171 30 134 -199 308 108 202 -124 39 -164 15 -112 -274 -166 180 54 -153 417 41
1157D1k07K61k26k13L91o0J28k2r1J39l21J81k1J62k37Q8O3R4j11l4j98L12j68
$$ 41 -166 95 -131 -344 47 -13 115 93 2 141 -180 1 -20 142 -95 -7 56 150 39 5 -193 119 -49
1180d9K05Pk51J65k03J20J21j98J48J41n65L98Q7l64M52l15J82J1p8J02Q3r9k7
$$ -49 156 163 -88 77 -126 -6 115 -83 65 206 -359 39 126 -238 214 -101 81 92 14 116 199 100 73
1203G3j18o5K20k3o6J30j86K74k5j43j75O6j25o0K52j53Q2j08P5o3J83%L23n39
$$ 73 -45 -110 110 87 21 151 -35 239 214 71 -104 -38 -163 -223 29 -124 -42 -150 -75 -138 45 45 368 -171
1227a71O5J32k30L05r1P8K05o0k28P4R5q0j69J44l27K28n3JK10K4j22k08j77L79
$$ -171 -106 26 -204 101 10 88 293 233 5 79 174 94 -75 69 -258 -30 -83 -82 128 152 30 -178 -355 24
1251B4Q3l78J84j88M82j84k68K82J2k3J01j55k21L88j10J37N1m48J06L8J00r8
$$ 24 107 -271 -87 -275 207 23 -245 37 49 26 127 -28 -249 139 29 166 217 -231 -125 -87 13 -85
1273h5K95Q7m47J36P2M09l60k3j25p9L09k05J58k48J30j33k15K74r0J50j44K29
$$ -85 210 297 -150 -14 58 467 107 84 -41 -120 189 -16 142 -106 24 -109 -324 -50 -140 10 -134 95
1295I5j86j1p0L82l27J95R8k04j06K59j93K15j86j68J59K15j91K23r6k10l7J42
$$ 95 -91 -102 -172 210 -117 78 176 -28 -134 125 -68 147 -39 -207 -48 167 -24 199 103 -107 -144 -2
1317bJ29K0k21j03L03M6j15K1j29K7j06K28j22M5K37j43R1j11J32k39L7k19L07
$$ -2 127 147 -74 -177 126 172 57 78 -51 -24 -130 98 -24 21 258 115 206 95 227 -12 25 -194 113
1340A13k73J51k92L72j38j97N8K77j33J60k14Q4K6jJ68P5k35j42R9k6L02m73N67
$$ 113 -160 -9 -301 71 -67 -264 -206 71 -62 98 -116 -32 -6 -7 161 236 1 -141 -42 -68 234 -239 328
1363C28p1k79o6P3N1l7l75M91J19r9m09L51m13O42l26j2Q4j33J31O9l96J24K00
$$ 328 257 -22 -88 -15 36 -1 -376 115 234 135 -274 77 -336 306 -20 -32 52 -81 50 119 -277 -153 47
1386D7k7J20j00J00l40K28k03J84M4j73P7J4J68j87J47O2m06L60k58M0J70P3M5
$$ 47 20 140 40 140 -200 28 -175 9 53 -120 -43 -29 139 -48 99 161 -245 115 -143 -103 67 140 185
1409A85m21R6j43J47K57m47J90J87j10K5J63l44K9r9K19j17M00j38m0m9k64M63
$$ 185 -236 -140 -283 -136 121 -326 -136 51 -59 -34 129 -215 -186 -285 -66 -183 217 79 39 -10 -274 189
1431A89j70q9o5o8M39l1n63K62j8M2j87R3L09j07l84M30M7J8k45J22k2j32j80
$$ 189 19 -70 -135 -203 236 205 -358 -96 -114 -72 -259 -166 143 36 -348 82 129 147 -98 24 2 -130 -310
1454c10L30k69P8J90o8O7r1K35l26K92k58M3K97j94q9O9N2J4q1L6j71m9K76J8
$$ -310 20 -249 -171 19 -49 18 -73 162 -164 128 -130 -87 210 16 -73 -4 48 62 -19 17 -154 -203 73 91
1478I1o4M5l92L88m1j30R7o9J27j89L96l02l3P8J47j82P0K9j24K05j68j3Kq9J55
$$ 91 27 72 -320 68 27 -103 -6 -75 52 -137 259 -43 -76 2 149 -33 37 66 -58 147 -21 -34 -32 -121 34
1503C4J01M4o8N2k99L96l12K28r8p2k65K13K32p3k6q7j20P7ml1J0N8n9k0KJ4P2
$$ 34 135 179 111 163 -136 260 -52 176 78 6 -259 -46 186 113 87 0 -120 -43 -47 -78 -68 -10 -69 -89 -87 -73 -1
1530aq8p2L21m5n5L6k29K4J75r8N2M9J14l54j51K33j34K17j62K12k33J89J72j37
$$ -1 -89 -161 160 115 60 96 -133 -109 66 -32 20 69 183 -171 -322 -89 -223 -6 -168 44 -189 0 172 35
1554C5r5m7M02n02L83J5o7K22l80J85N8q6l06J41K3J15M8k19J17m7n6J86r7O3
$$ 35 -60 -107 295 -207 176 191 124 346 -34 151 209 123 -183 -42 -19 96 144 -75 42 -5 -61 125 28 91
1578I1n3j98K27pM7k31m3L34k64K36j09K47k26m5O9j30k5m3P2R7L5j86J59L0j09
$$ 91 38 -160 67 60 107 -124 -167 167 -97 139 30 277 51 6 75 -55 -80 -123 -51 46 81 -105 54 84 -25
1603b5J32J09ln0j82j81K5%J62L75n78K35J11nk91K81p9P0r2Rj43J10j7J72l09
$$ -25 107 216 213 163 -19 -200 -175 -175 -13 362 -216 19 130 125 -166 115 36 106 14 23 -120 -10 -27 145 -164
1628a64K13P3j80K08m37K91q0N1L43l59j24K55k55P9J09j86J45k02N6j26M02M5
$$ -164 49 122 -58 150 -287 4 -76 -25 318 -41 -165 90 -165 -86 23 -163 -18 -220 -164 -290 112 157
1650A57r8j57l8J3jL41l35J24j7N6p3j82L3K82l2N6k55L5Q6p2j50J60N6Q3j58
$$ 157 59 -98 -136 -123 -124 217 -118 6 -11 45 -28 -210 -177 105 73 129 -126 -91 -5 -77 -227 -67 -11 72 -86
1675h6j4O5nn4J29l24O34l66k20L12j01p0qQ3q5J45k11J54M3R5K15o70J88K80
$$ -86 -100 -35 -40 -94 35 -289 345 -21 -241 71 -30 -100 -108 -25 -110 35 -176 -22 21 116 331 -339 -151 129
1699A29j37l3l61O66l65J62j61J4J05J61j54j11O4K7pk5m0J6J76p1j23Q8P9J4
$$ 129 -8 -41 -402 264 -101 61 -100 -86 19 180 26 -85 -21 6 -1 -26 -66 -50 126 55 -68 20 99 113
1723A13k1j45q8o7O7O8K29j44j55K39o0n4L74m11L4M2K2q9p0O6o6K77L9k01k77
$$ 113 92 -53 -141 -208 -141 -73 156 12 -143 96 36 -18 356 -55 -21 21 43 -46 -116 -50 -116 161 200 -1 -278
1748b78L44j97K10J85l0j23n1O1m7O9k48K28j23J03R9l66J71n4k45J43q1K8K88
$$ -278 66 -131 79 264 234 111 60 121 74 143 -105 123 0 103 202 -164 7 -47 -292 -149 -230 -202 86
1771H6K4M4m07N61m11M0n3j9J01k5L31k35m50M13J05N9l58J47l3K86j25Pq1R3
$$ 86 110 154 -253 308 -103 -63 -116 -135 -34 -59 272 37 -413 0 105 164 -194 -47 -80 206 81 88 7 100
1795A00J23k35j55K16P4M3J9l32J36L28m71R7m6K5K91l46K64j40K6Q9j89K39j48
$$ 100 223 -12 -167 49 123 166 185 -147 -11 317 -154 -57 -103 -78 213 -133 131 -9 17 106 -83 156 8
1818HLK13l00j61L60pk43O2L17j14k69k11o6J71P19l48j74L3M0l4O0j98K55j74
$$ 8 11 224 -76 -237 123 116 -127 -65 252 138 -131 -342 -408 -237 482 134 -40 -7 33 -1 59 -139 116 -58
1842e8j99R1l2J96p9M5m8K00J14o7J8k55K52k72N4o1O3L85k14k74J40n8R2l7r
$$ -58 -257 -166 -198 -2 -81 -36 -84 116 230 163 181 -74 178 -94 -40 -101 -38 347 133 -141 -1 -59 33 -4 -13
1867a3J41O2j11O3q6j07J50m60K66Q9L9k23L92l13K56j94k0N4L18l59m5K53k26
$$ -13 128 190 79 142 56 -51 99 -361 -95 -6 33 -190 202 -111 145 -49 -69 -15 303 -56 -101 152 -74
1890g4J39p7p3J42Q3r2lp7l1L03m1k26J17J49k29k68L91J06j42l25J18qR4J09
$$ -74 65 -12 -85 57 140 48 45 -32 -63 240 199 -27 90 239 10 -258 133 239 97 -228 -110 -118 -24 85
1914H5l22K76r4J24J71k16k57K79K9j55J52L4m29K44J14K36k70J92m1J49l16q0
$$ 85 -237 39 -55 69 240 24 -233 46 75 -80 72 106 -323 -79 35 271 1 193 152 301 -15 -95
1936i5J09%N2j70K27l2J76m29K39p8R8l3J87j23p9j39k07L07J17m2k18K07k22
$$ -95 14 14 66 -104 123 91 267 -162 77 -1 97 64 251 128 49 -90 -297 10 127 85 -133 74 -148
1959a48j3J71k35L11m1o7p4J51N1j10r3J32J19j65K11k20P9j63L79m35J58J12
$$ -148 -161 10 -225 86 45 -22 -96 55 106 -4 -97 35 154 -11 200 -20 59 -104 275 -160 -2 110
1981A10R2k31o0J21n8p8K68j87J86l01J13j37j9O2K51J1k41P0K4J10l76L69N6
$$ 110 202 -29 -89 32 -26 -104 164 -23 163 -138 -25 -162 -181 -119 132 143 -98 -28 -4 106 -270 99 155
2004A55J7Qk8J4k01kO2Ol8k0L8l01M65l81L07j77j5J67k10L90j06k25K24L3r4
$$ 155 172 180 152 166 -35 -37 25 31 -7 -27 11 -290 175 -206 101 -76 -91 76 -134 256 150 -75 149 182 88
2029H8J07j60n0K78m7j86j83J37j62O9j61J78L57l46K19k8l53M22k74j51L17j13
$$ 88 195 35 -15 263 216 30 -153 -16 -178 -109 -270 -92 265 -81 138 110 -243 179 -95 -246 71 -42
2051d2j38K47k3O3O0j61J59k74OK22k01j03P3J6J86l22K07Q1O3j42P7k5J81k16
$$ -42 -180 67 44 107 167 6 165 -109 -103 119 -82 -185 -112 -96 90 -232 -25 56 119 -23 54 29 210 -6
2075fq3P5J24j59R4K04j29L9k69m1jJ42jL0J82n36L68J74q1m38lJ69p6K0J66L1
$$ -6 -89 -14 110 -49 45 249 120 159 -110 -151 -152 -10 -11 19 201 -335 33 207 126 -312 -315 -146 -222 -202 -36 -5
2101eo4J06r0R4k7N8r5k05J85n0j69J29N7L7j75k7K28k13J25L03l8l65M61m43
$$ -5 -69 37 -53 41 14 72 -23 -228 -43 -93 -262 -133 -76 -39 -214 -241 -13 -226 -101 202 164 -201 260 -183
2125a83K11k8j56J90M7o5l1N5l37M51l6j62j41J28K26k48K62l02L59L08n30K29
$$ -183 28 0 -156 34 81 16 -15 40 -297 154 118 -44 -185 -57 169 -79 183 -119 240 548 18 247
2147B47j60j09j56Q5J76k71K50K65k61k53J58K7l59N66l18j83N46k24o8j08K81
$$ 247 87 -22 -178 -93 83 -188 62 327 66 -187 -29 -2 -361 205 -113 -296 250 26 -42 -150 131
2168A31m24P3K21L7K26m57n8P4L35j62j71N7M9RrK36J3k76j7K51k82J29K1j34
$$ 131 -293 -220 1 38 264 -193 -251 -177 158 -4 -175 -118 -69 -60 -69 167 180 -96 -113 138 -144 -15 6 -128
2192a28J73J34n73L98M4J24l22M35l01l1l3M7K2N7k33K67k0j80o8K57j25p5J39
$$ -128 45 179 -394 4 48 172 -150 285 -16 -47 -80 -33 -11 46 -187 80 60 -120 -188 69 -56 -131 8
2215Hr0K08l29L59j38k11J04J17K8j69K7j15K83j58o0r1o0N43n9j54k72L09L3
$$ 8 -82 126 -203 156 18 -193 -89 28 56 -113 -86 -201 82 -76 -136 -227 -287 256 197 43 -229 80 113
2238A13M7J04k71j44j43J55J6j4L4j62K34J13k20K85p4j52j62J74J2J03q4k5M6
$$ 113 160 264 -7 -151 -294 -139 -123 -137 -103 -265 -31 82 -138 147 73 -79 -241 -67 -55 48 -36 -61 -15
2261a5J8j12J95k19K00j84O5J75j77l5N2pj5K85O5k38k59J13j28K02q3k05K17
$$ -15 3 -109 86 -133 67 -117 -52 123 -54 -89 -37 -44 -59 226 291 53 -206 -93 -221 -19 -102 -307 -90
2284i0j3J43j25K19M2j28P3j45K65j80l55N46k40j37r3K68j04N0L1kj27N4K49
$$ -90 -103 40 -85 134 176 48 121 -24 241 61 -294 252 12 -125 -218 50 -54 -4 27 25 -102 -48 201
2307B01l91M47q3k40k2J92m4J47r9o0j8j0p3K29k07m4J13J35j60lL8l5j18R1j3
$$ 201 -190 257 174 -66 -88 104 60 207 108 48 30 20 -53 176 -31 -75 38 173 13 10 48 13 -105 -14 -27
2332b7K72mj81k9k43M46j25l33j4k0J62J27k57K32L26m56J6n5J37%J1n6K07k15
$$ -27 245 241 60 31 -212 234 109 -224 -238 -258 -96 31 -226 6 332 -124 -108 -163 -26 -26 -15 -71 136 -79
2356g9K12j12l2J6L16l76J29Q5l92M36k29K41j00J9j27nl49J38L01Q3l30j10J44
$$ -79 133 21 -11 5 321 -55 74 159 -233 203 -26 215 115 134 7 2 -347 -209 92 175 -155 -265 -121
2379a21J69j86r0L75j61L7j80J54M3J60l99K73K4l7l87K46L49l37j5J57o1J01
$$ -121 48 -138 -228 147 -14 23 -157 -3 40 200 -199 74 98 61 -326 -80 269 -68 -83 74 13 114
2401A14k25K11J7J26l47J86L19m27K3N6j23K42k03l1J2R9J06k40M26l28q3L4R0
$$ 114 -111 100 117 243 -104 82 401 -26 -3 53 -70 172 -31 -62 -50 49 155 -85 341 13 -70 -36 54
2424E4J56m32M47r2k65J48P2nk02N4P3p2K74j19J36j87j62K63P0j82J2m40K41
$$ 54 210 -222 225 133 -132 16 88 83 -119 -65 8 -64 210 91 227 40 -122 141 211 29 41 -399 -158
2447a58L95j67k71M0j18J24J41m5K28m06O1K74n4J0n0r9K09k05J36k3k26P4K30
$$ -158 237 70 -201 -161 -279 -155 -14 -59 169 -237 -176 98 44 54 4 -95 114 -91 45 22 -204 -130 100
2470A00o4K2J11k03RJ45k9j5O2k76K16j45Ok64M73j81K24j80l1K38k67M4K08m21
$$ 100 36 58 169 -34 -25 120 91 76 138 -138 78 -67 -61 -325 148 -33 191 11 -20 218 -49 -5 203 -218
2494b18P5O0j0K0p4M51j66N8j45l2l23L5M40k73J92j48m0m4J59j49K03j72J00
$$ -218 -143 -83 -93 -73 -147 304 138 196 51 19 -304 -269 171 -102 90 -58 -98 -142 17 -132 71 -101 -1
2517ak38J78k0p9q0K60K60m41O1K30k36O2k43J49rJ56Mj8k71K41K30k27N2j24
$$ -1 -239 -61 -81 -160 -240 20 280 -161 -100 130 -106 -44 -287 -138 -147 9 13 -5 -276 -35 195 -32 20 -104
2541a04K42o5l27O1J81r6k81P9L82p1J58m24K10j57K19N9k96J78J0o1M11l96L4
$$ -104 138 73 -254 -193 -12 -108 -389 -310 72 1 159 -265 -55 -212 7 66 -230 -52 -42 -103 308 -88 -54
2564e4K06l91M29j51j43K29r7J72M0l52M7j06J41j39J31K82k50O7j85K92k54j13
$$ -54 152 -239 190 39 -104 125 28 200 240 -112 -65 -171 -30 -169 -38 244 -6 61 -124 168 -86 -199
2586a99J36N4K8K6j9J53l51M88k85j38o1J96q0J34Lm85K98L36l94J42J86l16J38
$$ -199 -63 -9 19 45 26 179 -172 316 31 -107 -168 28 -52 82 85 -400 -102 234 -160 -18 168 -148 -10
2609a0m5K5n0K70j36j36j61L60p4O0p0j56J72j77N8K49n03M65P8n09R2K02M1n2
$$ -10 -55 -30 -80 190 54 -82 -243 117 43 103 33 -123 49 -128 -70 179 -324 141 219 -290 -198 4 45 -7
2633gO3L7k50J10nj34K75km5k34L73j56Q7k44J36k76J53m5J72j09L28K2j97o5
$$ -7 56 93 -157 -47 -52 -186 89 87 42 -192 181 25 112 -132 4 -272 -119 -164 8 -101 227 249 52 -13
2657a3j23K30q6J76J37n27N9J86k69P4R3p0J58j16K2J05j86O1J25K2k67K11J53
$$ -13 -136 94 8 184 321 -206 -147 39 -230 -156 -63 -133 25 -91 -69 36 -150 -89 36 58 -209 2 155
2680A55m66K92K02l41L02P1J04k80J67k22l9m5K14m7r1K61l35P0M73k42j66p5
$$ 155 -311 -19 183 -158 144 215 319 39 206 -16 -55 -100 114 67 -24 237 -98 -28 445 203 37 -38
2702c8J10o0m2O9l99N24k35j43M20m46J11l4R1n6J58Kq8K83l72Q7r9M25j21j1
$$ -38 72 12 -30 39 -360 164 -71 -214 206 -240 -129 -163 -72 -128 30 32 -56 227 -145 -58 -157 268 147 136
2726A36l81K8K51K8n1J80k28l0k4Q4J4j1j15P8Q9j02N8J24j19m8Q5N2k03K69j59
$$ 136 -245 -217 34 62 11 191 -37 -67 -91 -7 7 -4 -119 -41 48 -54 4 128 9 -39 46 98 -105 164 5
2751Ej47K62j76J22j45O3m4j60L18k60K00l6J7J17n1k2k8k32L7K93q1o0J67j27
$$ 5 -142 120 -56 66 -79 -16 -60 -220 98 -162 38 2 19 136 85 63 35 -197 -160 133 52 -8 159 32
2775C2j49R1M6j91Q1P8P8p9Q5R1R9j18l22J07OK63k09j30J29O7j65J32j86J35
$$ 32 -117 -26 20 -171 -90 -12 66 -13 72 163 262 144 -178 -71 -65 198 -11 -141 -12 55 -110 22 -164 -29
2799b9K33k55l5l9K1K98j82r4m8L18J01m48N9m7J77o2o1K10Q5M8o18K57L21p6
$$ -29 204 -51 -86 -125 -104 194 12 -82 -130 188 289 -159 -100 -147 30 -32 -93 117 202 250 -368 -111 210 134
2823A34l94J46K19n5kj98pJ08J00R9j26J01l09J56J84J72l56R0j22N1j35K62j27
$$ 134 -260 -114 105 50 48 -150 -157 -49 51 150 24 125 -184 -28 156 328 -28 62 -60 -9 -144 118 -9
2846iK58M2l63J80rr9j8N2k06O0K73N0j08j87K7K12k83Q7j44K32l12K98M4k13
$$ -9 249 291 -72 108 99 0 -18 34 -172 -112 161 211 103 -84 -57 155 -128 -41 -185 47 -265 33 77 -136
2870a36J24J53j46J14J60k98j29R5L98l75J04k38L93n27L96j10P7j00J09K09k6
$$ -136 -12 141 -5 109 269 -29 -158 -63 335 -40 64 -174 219 -308 88 -22 55 -45 64 273 247
2891B47k83k57L18k40L50q0J01k09J19mk48N40j91k5k0j44k8O5Q4J52n2M3l53
$$ 247 -36 -293 25 -215 135 55 156 -53 66 62 -186 354 163 138 118 -26 -54 11 95 247 195 238 -115
2914a15K04m38K33j07K76k72J93j74lj9J65J08Jk26K61k93J08j12J66O1k64L24
$$ -115 89 -349 -116 -223 53 -219 -26 -200 -203 -222 -57 51 52 -174 87 -206 -98 -210 -44 17 -247 77
2936G7j64L41k84K11k10jr0L8J98j77J50or3J25n65K34j9L32k19J8K21l7k4k30
$$ 77 -87 254 -30 181 -29 -30 -120 -82 116 -61 89 83 -10 115 -450 -216 -235 97 -122 -104 117 80 56 -174
2960a74J35J06J1M5l19K84l3J00n7r7J00j38m4R1o2j27J87l47O02k56j40Q7k59
$$ -174 -39 67 78 123 -196 88 55 155 98 1 101 -37 -81 10 -52 -179 8 -339 263 7 -133 -46 -305
2983c05J73K68j08k75K86j03J00j53J50P8M6j06l27M74k20r1oL64k35P2P7l70
$$ -305 -132 136 28 -247 39 -64 36 -117 33 111 157 51 -276 198 -22 -113 -119 245 10 82 159 -211
3005b11L82j70J35j26j9p7k9R0L5j14J67j82K15rj06K03l01K17l27K45K11k00
$$ -211 171 1 136 10 -9 -86 -115 -25 10 -104 63 -119 96 87 -19 184 -117 100 -227 18 229 29
3027B9m7K5n1p0P0k6n4K41K2O6l20m4K98k59J72J5j01K10K0k69J68L42l86r6k0
$$ 29 -18 7 -44 -114 -44 -70 -124 117 139 205 -115 -159 139 -120 52 67 -34 176 196 -73 95 437 51 -45 -65
3052f5M4k21M01j66J28j84P9J51k30K04l2N7l33J7QL3J22Q2j46J19j62Q4L27k55
$$ -65 -21 -242 159 -7 121 -63 16 167 -63 141 109 166 -167 -150 -142 -109 13 95 -51 68 -94 -10 317 62
3076F2k89J36J96k63L57j40j05J57K08o47J07K95l13K59m3L0J11k7j02O8p2j14
$$ 62 -227 -91 105 -158 199 59 -46 111 319 -328 -221 74 -239 20 -23 7 118 91 -11 57 -15 -129
3098a29K79J87k53l97K97P5j78K50J93k82p2J32j06M2jOr0J21k15J78j40K06r2
$$ -129 150 337 84 -313 -16 59 -119 131 324 42 -30 102 -4 38 37 43 -47 74 -141 37 -103 103 11
3121A1O3q2l31K19N3p4q4L31o9J13j61l37L50L06q4j50p1M0k55L83l20O5O1k45
$$ 11 74 -8 -339 -120 -67 -141 -225 106 37 150 -11 -348 2 308 224 74 3 43 -212 171 -149 -84 -23 -268
3145b68L50k72J16L9l3QR4L7N7j37J58J21J2l91J86q3m0M3M3qJ8q4j22pJ09K4
$$ -268 82 -190 -74 -35 -68 -60 34 71 128 -9 149 270 282 -109 77 -6 -46 -3 40 32 50 -34 -156 -163 -54 -30
3171c0j85l3L01k31K78j59j08J19K00J37k97j62JM2l4K52j12J21M0jp4r7N0q7
$$ -30 -215 -248 53 -178 100 -59 -167 -48 152 289 -8 -170 -169 -127 -161 91 -21 100 140 139 65 -32 18 -69
3195f9K17K0r2l8M0j95R9K52k54L7K59m46O5k2R1k52K67M2k22J65J04P5j06k41
$$ -69 148 168 76 38 78 -117 -18 234 -20 17 276 -170 -105 -127 -36 -288 -21 21 -201 -36 68 143 37 -204
3219b04J08L5K56r1j94pNK4M4J3K22l97L5K10m8k56L00k61K68n2K8Q9Q9o3k08
$$ -204 -96 -61 195 104 -90 -97 -92 -68 -24 -11 211 -186 -151 59 11 -245 55 -206 62 10 38 127 216 153 -55
3244e5j1LM34l13l4j19Q7Q8l1j65P0J77j69jo1ML1o6J07j08P4j24L26j80k23J73
$$ -55 -66 -63 371 58 24 -95 -8 80 49 -116 -46 131 -38 -39 -100 -96 -65 -131 -24 -132 -58 -182 144 -36 -259 -86
3270h6K26K0l5j86L08pj44j85J70l48J51q6j39M23p3K9j67J32j58K42j26K26p4
$$ -86 140 160 125 -61 247 240 96 -89 81 -267 -116 -202 -341 82 9 38 -129 3 -155 87 -39 187 113
3293A13l34N45l71P5j14J27K02l24J65j59j54K85j4pj66K23k01J25J3rL0k38J44
$$ 113 -221 324 -47 28 -86 41 243 -81 84 -75 -229 56 42 35 -131 92 -109 16 29 20 50 -188 -44
3316d4M3J29Pl64M0J90p8o5P8KL16l09J19k50L79K5o7j80L3m59O63k37p6J63o4
$$ -44 -1 128 135 -229 -189 1 -77 -142 -64 -62 254 -55 64 -186 193 218 151 -29 4 -455 208 -29 -105 58 -6
3341fJ80p3O4k73j1K70l42J30Q7M3L0j69J34k40p1R5L35j03jk39L71k68k9J24
$$ -6 174 101 165 -108 -119 151 -191 -61 26 69 99 -70 64 -176 -247 -152 183 80 79 -160 211 -57 -86 38
3365C8N5j20K52j86O6M2l9m31K88n7J14l0j65K72j41J10J10k58J09j6J34J9l07
$$ 38 93 -27 225 39 105 147 108 -323 -35 -92 22 -8 -173 99 -42 68 178 -80 29 13 147 166 -141
3388a41K28P3j91Ql07K31m3K28j94J09O6j81j5K3Q8j08R2OJ55l5k51J03k9L3K99
$$ -141 87 160 -31 -23 -330 -99 -142 86 -108 1 67 -114 -129 -106 -18 -126 -34 -28 127 92 -159 -56 -85 -52 247
3413B47k67K63k77J54j63J10O2R0k97K11j11Ml7nO9j12L8q1Q1j1J43J22m93J90
$$ 247 -20 243 -34 120 -43 67 129 219 -78 133 22 26 -11 -16 53 -59 -21 -102 -21 -32 111 233 -260 -70
3437g0O2J81k11n6m2J43pJ38k38J49k89J47J69J64o2j48m7J13p6l64L07KJ20j06
$$ -70 -8 173 -38 -94 -136 7 0 138 -100 49 -240 -93 76 240 178 30 -17 96 20 -344 -37 -35 85 -21
3461b1K0J43r1J06j69J54j1m4l5Q2j01J39k38J72k29J44J5j44O8N1k11k9K76k6
$$ -21 -1 142 51 157 -12 142 131 87 52 134 33 172 -66 106 -123 21 36 -108 -40 11 -200 -229 47 21
3485B1K9J58l98J80K69k66K42j77j18J41k7K35k39l49K13J08L4j32m7P6Q5Rl67
$$ 21 50 208 -190 -10 259 -7 235 58 -60 81 54 289 50 -299 -86 22 56 -76 -123 -47 38 47 -320
3508c20K40K16k40J11j46J21J37k04J46j08K13j89J52j82m8K9J19j48J11J30j38
$$ -320 -80 136 -104 7 -139 -18 119 -85 61 -47 166 -23 129 -53 -101 -72 47 -101 10 140 2
3529BO4j18OR9n2M7Q8l36K56l7K16k59j7Q2R8q2r0M9k39K88l13L22l5J39m85K62
$$ 2 66 -52 -46 53 1 48 136 -200 56 19 235 -24 -41 41 139 57 -33 16 -223 65 -248 74 39 178 -307 -45
3555d5J52k46L38j45q6L5K2Mp6J96J86k70N5K72m64O8L64m44J7J31l7j6m4o6j55
$$ -45 107 -139 199 54 -32 3 25 29 -47 149 335 65 120 392 -72 -4 360 -84 -67 64 27 11 -33 -99 -254
3580b54K05Q9R7p4j82J32j27N5K19l13RJ21J26J8k63J24m0Q3lj95OJ12O5K9O0
$$ -254 -49 40 137 63 -119 13 -114 -59 160 -153 -144 -23 103 121 -142 -18 -58 25 22 -173 -167 -55 10 39 99
3605I9j21J71j64L4k05L26o6P0J11j75k3J55k01p3J96k12K77L3k32j68K3O1J6
$$ 99 -22 149 -15 19 -186 140 74 144 255 80 57 212 11 -62 134 -78 199 232 0 -168 -145 -84 -68
3628f8j02J05J4L67k25j58Q7J35j95M0jn2P9J4L50l51j38J14J15j81J78N7k93
$$ -68 -170 -65 -51 316 91 -67 20 155 -40 0 -1 -53 26 40 390 39 -99 15 130 -51 127 184 -109
3651a09m4L36k42Q5J04j98N6O8j18K47m51J16j03K32j15j6L42N8j53j46Q8j72
$$ -109 -153 183 -59 26 130 -68 -12 56 -62 185 -266 -150 -253 -21 -136 -152 190 248 95 -51 37 -135
3673a35q5Q7r9n5N97m8l18k43N26k52J90j08J69k24k46J48K89j71L7n0pj22L4
$$ -135 -220 -133 -232 -287 310 262 -56 -299 227 -25 165 57 226 2 -244 -96 193 22 59 9 2 -120 -86
3696h6N9O7o5k39Q0J38K00J4K3l15J54J19j57K35k35j88J57o2J86m1r2n8J46k02
$$ -86 -27 40 -25 -264 -184 -46 154 168 191 -124 30 149 -8 227 -8 -196 -39 -101 85 44 -48 -106 40 -162
3720a62J49k18K89m7J6m4k37K59J1J27j20L2l9R8rm27N61k60n8R7l13L89N3k8
$$ -162 -13 -231 58 11 27 -17 -254 5 16 143 23 55 16 114 105 -322 239 -21 -79 18 -295 94 147 119
3744A19j87J88ol19K27o2j42m2L04K24k69j38M4L9N6j04q4J63n0J7j64K13j61
$$ 119 -68 120 114 -205 22 -40 -182 -224 80 304 35 -103 -59 -20 36 -68 -152 11 -39 -22 -186 27 -134
3767a34O0j95J02j32K53k13J76J5J67K5k56R0j85Q8K29l84J42K39Nk18P1J74k30
$$ -134 -74 -269 -167 -299 -46 -259 -83 -68 99 124 -132 -42 -227 -139 90 -294 -152 87 92 -126 -55 119 -111
3790a11J09o9L11l05L14r8j76N4J30N6k77j54M28k50R2J46j37O0q8k6l09L09j18
$$ -111 -2 -71 240 -65 249 151 -25 29 159 215 -62 -216 212 -38 54 200 63 123 35 9 -300 9 -109
3813a09jN0k64L94j95J17q4k4J84J61l36R0M7J31M9k09N1N9j01j7m3J70k34J25
$$ -109 -110 -60 -324 70 -125 -8 -92 -116 68 229 -107 -17 30 161 210 1 52 111 10 -7 -50 120 -114 11
3837A1k3N7O8k09J99l06L70l41L17j52M5j09j48L6K57n2K30j95K1r7M2n8P1m2
$$ 11 -12 45 113 -96 103 -203 167 -174 143 -9 36 -73 -221 -185 72 20 250 55 76 -21 21 -37 34 -8
3861hj54K25j56L29j50j85r0L61j96L50l44K3l0j58K98j49O3J84l87Q8J48j07
$$ -8 -162 63 -93 236 86 -99 -189 172 -24 326 -18 5 -25 -183 115 -34 29 213 -174 -86 62 -45
3883d5k25N18o1j84L4n6MM4n4L36m03L9J33j93K00p8K33J94m59K16n46L71J87
$$ -45 -270 248 187 3 37 -19 -15 29 -25 311 -92 -53 80 -113 87 9 242 436 -23 193 -353 18 205
3906B05j26K8j34r4P2M5o2j60L58m95N46j02R8J1l11K24J9k42P7q3J29q7j86L82
$$ 205 79 107 -27 -121 -49 -4 -66 -226 132 -363 183 81 179 190 -121 103 122 -120 -43 -126 3 -84 -270 112
3930A12K6l49P9L77o80L79q0K53j73J66l86R2K46l69L61J75k41L7J79m7j02j60
$$ 112 138 -211 -132 245 -435 -56 -136 117 -56 110 -276 -184 62 -307 54 229 -12 25 204 157 55 -105
3952a05rK07O6ln1o5J73m84K57J17l41K04l9J06J82Mn29M6N41j45j10J62l17K51
$$ -105 -114 93 159 156 105 40 213 -271 -14 103 -238 -34 -73 33 215 219 -310 -264 277 132 22 184 -133 118
3976A18j04K10o2l32J71K8l28M17j18J09ml3j08mm6k55O40m37J93j57K65R8l35
$$ 118 14 224 162 -170 1 29 -299 118 0 109 105 72 -36 -40 -86 -341 299 -138 55 -102 163 261 -74
3999g4j42J46q7K2n0K29l1j44L75k64L2r8r8K31j14L8K61m33K62L7p1k29K1O4
$$ -74 -216 -70 -157 -135 -185 44 13 -131 244 -20 12 -86 -184 47 -67 -29 232 -201 61 98 27 -202 -181 -117
4023a17L34o8j52k4L6j51J15J31k45m9K02K8Q6k68q6J85J78k26J26k99K16L74
$$ -117 217 149 -3 -27 9 -142 -27 104 -141 -190 12 40 126 -142 -228 -43 135 -91 35 -264 -48 326
4045C26l51q4J1J39m2r9Q3r1n5K9K14j88L07l18J66J06l63J95O7j59j34L09J7
$$ 326 -25 -109 -98 41 -1 -100 -17 -108 -163 -134 80 -108 199 -119 47 153 -210 -15 52 -107 -241 68 85
4068H5k88J24o2l4K99j75O9K01o2j94J27k29K42r8m4j24J33ko1J29n9J32o3l51
$$ 85 -203 -79 -141 -175 124 -51 18 219 157 -37 90 -139 103 5 -39 -163 -30 -32 -93 36 -23 109 46 -305
4092c05J51O6K14j01P4K87n67J89k52M68l3R4l71R4J73j75J71m52K68L1j49r9
$$ -305 -154 -88 126 25 99 386 -181 8 -244 224 191 285 -86 8 181 6 177 -275 -7 24 -125 -224
4114b24M56k08k2k04L96l69K80q9L2J49j5j51l0j49j19K29j46L20m09K38K70j32
$$ -224 232 24 2 -202 194 -175 105 16 48 197 182 31 1 -148 -267 -38 -184 136 -273 -35 235 103
4136A03L1m9j06k18J35M1O3j73OK60J78q9m15K22L0j87K73R1j28k84o6L80L9P
$$ 103 134 85 -21 -239 -104 -63 0 -173 -167 93 271 182 -233 -11 19 -168 105 196 68 -216 -282 98 137 144
4160A44j11j00M41l36O1j12j90R8j06o9K85m4J79m25L24J56J8k28j9K71m66K23
$$ 144 33 -67 374 38 99 -13 -203 -105 -211 -280 5 -39 140 -285 39 195 213 -15 -34 237 -229 -6
4182fk32J94M0N9m7j49q2J55J39l97j54J85M46k69K86m43L44l3RJ6kJ00j72J2
$$ -6 -238 -44 -4 55 8 -141 -223 -68 71 -326 -480 -295 151 -118 168 -275 69 36 45 61 59 159 -13 -1
4206aj44N6q1L08l15RK05j25K77j60j64M22j34k54J52o6l1m4L62j52M9k42J12
$$ -1 -145 -89 -170 138 -177 -168 37 -88 189 29 -135 287 153 -101 51 -15 -46 -90 272 120 169 -73 39
4229C9n3L4k3R0j42l0J72j06K0N7L7l8q5o2L0L4J04J36j46j3l5k64M57J10m34
$$ 39 -14 20 -3 87 -55 -85 87 -19 1 58 95 57 -28 -90 -60 -26 78 214 68 55 20 -244 213 323 -111
4254a11J48k18K12K05j79j28J82J42m22J8J98J58n4M5m48K95p9j47J10p9j56J65
$$ -111 37 -181 31 236 57 -71 111 253 -169 -151 47 205 151 196 -252 43 -36 -183 -73 -152 -308 -143
4276a43L12l58J06Rk7K59q7K10k77k09J71j0LN8J69j41l25L05j16%J77q7k45L0
$$ -143 169 -189 -83 -74 -101 158 71 281 4 -205 -34 -44 -41 17 186 45 -280 25 -91 -91 86 -1 -246 -216
4300b16L19k64M55j97j64J08K01j63j08m2K13q8n8lk93K96J83P9m52K73n1J0j43
$$ -216 103 -161 294 97 -67 41 242 79 -29 -71 142 54 -4 -7 -300 -4 179 258 -194 79 28 38 -105
4323a05J1J13K07j39k19J89L5l2Q3l78L65o1J40k47R2k07K30P6k05O6J08k8k82
$$ -105 -94 19 226 87 -132 57 92 60 143 -235 130 69 209 -38 54 -153 77 153 -52 14 122 94 -188
4346a88Q5q1J94j52K00k96L36l46L59J5l8j7N5k22n9m5K24K68k99j09K16j01J67
$$ -188 -103 -184 10 -142 58 -238 98 -248 111 126 88 71 126 -96 -155 -200 24 292 -7 -116 100 -1 166
4369A66n3k15Q5J39m8j06jP3j60J16l03ML6K37K8k5l8Q8m6r7O7O4pk5Kj01K50
$$ 166 113 -102 -17 122 74 -32 -33 40 -120 -4 -307 -303 -267 -30 -2 -27 -65 23 -23 -120 -53 11 4 -21 -19 -120 130
4396A30k2k86J78m8J64j65N3K5k86L74k10K41l4k03K34k37K08j88K9K58m54J59
$$ 130 108 -178 0 -48 116 -49 4 29 -257 117 -93 148 114 -89 145 -92 116 -72 -43 215 -239 -80
4418h0P5L8J6k30J31j38J98k71M43k42q4L11k87Q3K51j21jm8q8J95l71L74k74
$$ -80 -5 33 49 -181 -50 -188 10 -261 182 -60 -144 167 -120 -37 214 93 92 44 -44 151 -220 154 -120
4441a20R1J26k73o4K00K83m35J14R0M1q3K16j20Q7j1q1k07K56j14L0k42n5M31
$$ -120 -29 97 -176 -240 -40 243 -192 -78 12 53 -30 186 66 153 142 61 -146 110 -4 26 -216 -271 160
4464A60Q9n1j83K53j90k0j50N1m1l0Q0k44N12j36o5JL6m5N4p3p0n0J27m5L5J08
$$ 160 249 198 15 268 78 58 -92 -41 -82 -112 -32 -276 236 100 35 36 72 27 81 8 -62 -112 15 -30 5 113
4490A13mM9k85K66Q3k99J17R2l08r4M1J84Pr7P0K2K22k75p2L56O3k67K52l31K92
$$ 113 109 158 -127 139 222 -77 40 132 -176 -270 -229 -45 -38 -135 -65 -43 179 -96 -168 188 251 -16 236 -95 197
4515A97l33N0J61p8N0k1J22j40k17L60j16Q5j61O1L8Q7k5q9J91l58K78J29j35
$$ 197 -136 -86 75 -3 47 26 148 8 -209 151 35 120 -41 20 58 145 120 31 222 -136 142 271 136
4538A36K6q4j87K21k92K9K88r4P6k44J19k65K18k91L14k72M07j3l14K60q7k0j57
$$ 136 162 78 -109 112 -180 -151 137 43 119 -125 -6 -271 -53 -344 -30 -302 105 92 -222 38 -49 -69 -226
4561b26J78J01J69r1k39J13Mj59J35k68N50l64K55n93N66j42m0J57l33J17o1j18
$$ -226 -48 53 222 131 -108 5 9 -150 -15 -283 267 -97 158 -435 131 -11 -51 106 -227 -110 -171 -289
4583b89K74J14Ol05Q1J01j4l8k84K90M7Q7j14K10j27n3J01L0l7l0J35n3j66K4
$$ -289 -15 99 105 -200 -119 -18 -32 -70 -354 -64 -17 70 -44 166 39 -14 87 117 80 50 185 132 -34 -10
4607a0J32o1p1k2J03o4p9l4P6j78J93P1j37J52k26J78J14m18L59J50l17M1K69
$$ -10 122 61 -10 -32 71 7 -72 -106 -30 -208 -15 56 -81 71 -155 23 137 -281 78 228 -89 -48 221
4630B21k91N2q5j5K36k4n4o4r1m5Q8R9n3k4r3L6J70j78J1o6K37K9p9M3L8J27l19
$$ 221 -70 -18 -103 -118 118 94 40 -24 -115 -160 -72 27 -26 -50 -143 -107 63 -115 -104 -170 67 96 17 60 98 225 -94
4657i4K10k00L81l64K25l91K13J00j83L69l41J00lQ7j21j92K34l2j32P6np4L67
$$ -94 116 -84 297 -67 158 -233 -20 80 -103 266 -75 25 22 109 -12 -204 30 -2 -134 -58 -63 -137 230
4680B30j84P7l35K09J36k76L16k96J56l88O20r3q8J33j33k73J44j45J13L3j0k58
$$ 230 46 123 -212 -3 133 -143 173 -123 33 -355 265 172 84 217 84 -189 -45 -190 -77 -44 -54 -312
4702c12M88j68P6j95m6M03J63l70j23O2J81j28m14L35p8K09Q1j73j76K13j30J23
$$ -312 176 8 84 -111 -157 246 409 39 -84 -22 159 31 -383 -48 -126 83 164 -9 -185 28 -102 21
4724B1j32M6pK20k53n8J67j72P8K09K16l32k8L01j96j39M5P5m20L87J0Q5qj36
$$ 21 -111 -65 -72 148 -105 -163 4 -168 -90 119 335 3 -25 276 80 -59 -14 61 -359 28 38 123 115 -21
4748b1MN7P3l23L25j33j20Q0N4k17Q8J36M4j76j71K34l6Q0Pj93K31J34o07P04
$$ -21 -17 40 113 -210 115 -18 -138 -58 -4 -221 -133 3 47 -129 -300 -66 -102 -22 -15 -208 23 157 -450 254
4772B54n83K02J05K8o1K99l43J21J0O6k19j6N5O3R5k42L30j7j55J48k16J16k61
$$ 254 -329 -127 -22 6 -55 244 -99 22 32 98 -121 -137 -82 -19 76 -166 164 147 -8 140 -76 40 -221
4795b21L55k57l7J5L43j15k50L61k35l51O79k52LL4J73k06k03K37n5J51J11k82
$$ -221 134 -123 -160 -145 198 83 -167 194 -41 -392 287 35 38 72 245 39 -164 73 18 169 280 -2
4817bM1O6j14P2j53J59k68j26L68o7r8p0K50o6J34Q8m88K81K5l16J41N28m53r5
$$ -2 39 105 -9 63 -90 69 -199 -325 43 -24 -122 -192 58 -8 126 214 -274 7 32 -284 -143 385 -68 -163
4841a63K71L7l92L05qj0j19J88j09rn7j0m6j36K75J52r4J67k8m77M56j46l9M8
$$ -163 108 145 -247 58 50 40 -79 109 0 -9 -66 -76 -122 -258 17 169 75 242 214 -263 193 47 8 56
4865E6l16K22J62q5N2k68K5K71j45R2N7j37k10K51l9Pk11L51j73q6K37k04L6L6
$$ 56 -260 -38 124 39 91 -177 -152 119 -26 66 123 -14 -224 27 -12 -5 -216 135 -38 -124 113 -91 -55 -19
4889a9J47l1J04j06k61P2P7J49M5j57l1j06L58o6k09J41k40M13o5k64M3q5J10
$$ -19 128 97 201 95 -166 -94 -17 132 177 20 -11 -117 241 175 -34 107 -133 280 215 -49 -6 -91 19
4912A9l66K04K21%Q9j54J0m3J13l17J93O7j74K45q4L3j14J49q2JM6j08M5J50j18
$$ 19 -347 -143 78 78 167 13 23 -20 93 -224 -31 36 -138 107 23 56 -58 91 9 10 56 -52 -7 143 25
4937B5k1k19J96K98j50J51j53j84K9j38L49L8l65p7K95l96K91k5P8j47J83J65
$$ 25 4 -215 -19 279 129 280 127 -57 -28 -166 183 221 -144 -221 74 -322 -31 -56 22 -125 58 223
4959B23j93j59J78N5m6k81L43m2l0j50L50l87K42J51j11k91K27L9k07R0n3j05
$$ 223 30 -129 49 104 58 -223 120 78 48 -102 248 -139 103 254 143 -148 79 118 -89 1 -52 -157
4981a57J61L7k49J98J4l9J64o6k36K22k11K02m1K1L07l73R0l6L4M6l5j4lj5J03
$$ -157 4 41 -208 -10 4 -35 129 63 -173 49 -162 40 -1 20 327 -46 44 8 42 88 53 39 36 21 124
5006A24pN3J76m63J09o3Kk46J9O11n9l06q5J56J9r1m4N8l1j35M65l96J85j0J33
$$ 124 117 170 346 -117 -8 -71 -69 -315 -296 315 256 -50 -135 21 40 -51 -95 -37 -68 -203 262 -134 51 41 174
5031A74j72K5n8J89j33P5P1j31k4j36N9O2J14L1l20J9J10jj96L66k56N00k99p7
$$ 174 2 27 -31 158 25 100 171 40 16 -120 -61 1 115 146 -174 -155 -45 -46 -242 124 -132 368 69 -8
5055hk78K16k27K7jK69j78J24Jm2N18p01L40k72J24J4Q5J24k07JJ66r1K02m16
$$ -8 -286 -70 -297 -270 -271 -2 -180 -56 -55 -97 421 -280 60 -212 -88 -74 11 135 -72 -71 95 4 206 -210
5079b10L88m4j10j20J30j90J20p0Q3k4j23j21N00k17K31k96K32L4k74K35k49L04
$$ -210 178 134 24 -96 34 -156 -36 -106 -23 -47 -170 -291 209 -8 223 -73 159 193 -81 154 -95 209
5101B09j10o3rK22k43J21j32O6j40J53j95J55K64l42l2k5K39j46r3P2K40l23M1
$$ 209 99 36 27 249 6 127 -5 61 -79 74 -121 34 298 -44 -76 -101 138 -8 -101 -29 211 -112 -71
5124g1P4k04J79j61J01J40k12M70j96K4J80l66j9M3R1p7l0K38j60J88k58j88L43
$$ -71 3 -201 -22 -183 -82 58 -154 316 120 144 324 -42 -61 -18 73 -4 -34 204 44 232 -26 -214 129
5147A29l0j33j39J89QOQ4o6j30J47Q6m9j56k5J14p4K16j81j4J8J20J78l87j62
$$ 129 99 -34 -173 16 24 30 114 48 -82 65 151 102 -54 -79 35 -39 177 -4 -18 0 120 298 -89 -251
5171b51L04j33jP2K52k48j95O8j09K13Q8K71j74k68lM2J68k97L41n6m60M15J0
$$ -251 53 -80 -81 -9 243 -5 -200 -132 -241 -28 60 331 157 -111 -114 -72 96 -201 140 84 -376 39 49
5194D9j54R9r9L12j92J23j44R4q4k3J42j93J16Q8J22K45l17n15L20K03k51P9Q6
$$ 49 -105 -6 -105 207 15 138 -6 88 4 -19 123 -70 46 134 256 501 184 -331 -11 192 -59 20 106
5217A06j7L7k30N0L77l94j01J94O3k02P9J44r1J0N7M1m5o2qk69L67l15n1J67K74
$$ 106 89 126 -104 -54 323 -71 -172 22 85 -117 -38 106 15 25 82 123 78 16 8 -261 106 -209 -260 -93 181
5242A81j66J3j55R7k5k5N2N1J31k9L0m88K82q2J09J8J3P5kk03oM5o5L3J08n6j78
$$ 181 15 28 -127 -30 -55 -80 -28 23 154 125 155 -333 -51 -133 -24 -6 7 82 80 -123 -129 -84 -149 -116 -8 -64 -242
5269b42M37l25K66k81J85l2J36j1j51j55K6K29k12J51J02k64J58k28J75J7J03
$$ -242 195 -130 136 -145 40 8 144 133 -18 -173 -147 82 -130 21 123 -141 17 -211 -36 -19 84
5290H4m4j27j39J70J35m23K45K3N0o2J13J69n34L74J41r7j60m6O7J42k50M58m30
$$ 84 40 -87 -226 -56 79 -344 -99 -76 -26 -88 25 194 -340 34 175 78 -82 -128 -61 81 -169 289 -141
5313a41J04j8K21k24M00l93K04J8k73K91l24J24mP4j48p4O5J7J98M6l13J89j30
$$ -141 -37 -55 166 -58 342 -51 153 171 -102 189 -135 -11 -15 59 -89 -163 -98 -81 117 163 -150 39 -91
5336i1J26r3K66l30K06O8k08R7k5p8P7J42j17k02J86l08N08k10k8K12j18q3p3
$$ -91 35 -58 208 -122 84 152 -56 41 16 -62 15 157 40 -162 24 -284 224 14 -14 198 80 -3 -76
5359g6o0KKK25j79M8k44M72k94Q6J6j2j32L10m50K41J89k57J57k73K73J25k2n33
$$ -76 -136 -134 -132 93 -86 -38 -282 190 -104 -18 -2 -14 -146 164 -286 -45 144 -113 44 -229 44 169 147 -386
5383c86N74l48O9K93l02L28j48l32M91k78QM7j00J91r6l22L69j88O6M0n9J93j67
$$ -386 188 -160 -91 202 -100 228 80 -252 239 -39 -31 16 -84 107 11 -311 58 -130 -64 -24 -83 110 -57
5406e7K33j23o3K28m4j14j14PK90m40R1Q0j53L86j48J4J15k45P3l3J97l22O9O6
$$ -57 176 53 -10 218 174 60 -54 -47 243 -197 -106 -26 -179 207 59 73 188 -57 16 -17 180 -142 -73 -7
5430gM8N8m28N10k73o2J4L22k84J5J04M7k11K7P9K13l22L09k01m3J37k02Q8R8
$$ -7 41 99 -329 181 -92 -154 -140 182 -102 -87 17 64 -147 -120 -41 172 -150 159 -42 -85 52 -150 -62 36
5454C6L04k86j74m1K35n0k25L63k84j21N38m30L02k56L35l45l4m5N8K07j53J33
$$ 36 340 54 -120 -161 74 24 -201 162 -122 -243 295 -135 167 -89 246 -99 -133 -178 -120 87 -66 67
5476F7j80K20o9Q6n8j13J9j4l8J96j90J35n0q1n2L1K47p8K69m26J6L27m78M01
$$ 67 -113 107 38 124 66 -47 -28 -42 -80 116 -74 61 11 -70 -122 -91 156 78 347 -79 -63 264 -214 187
5500A87Jl24P3L6Q0M3j53K15j28m4k06L09m2j51j98N74l70J53L2l03M95Q0m33
$$ 187 188 -136 -63 -27 53 96 -57 158 30 -14 -220 89 47 -104 -302 272 -98 55 87 -216 279 359 -74
5523g4J25J54j18k56J98L11m32J83j4Oo5N3J10j90K0r6m86O89j77K20j97Q5j01
$$ -74 51 205 87 -169 29 340 -92 91 77 83 18 71 181 -9 11 -85 -571 118 -59 161 -36 49 -52
5546e2k7o6K29j19lJ15j10K02k19j9m8K36p9j87p9K29K66m74M04k16J91l6pj95
$$ -52 -79 -145 84 -35 -38 77 -33 169 -50 -69 -117 119 40 -147 -226 3 269 -205 199 -17 174 138 131 -64
5570f4O6J2J75j05k17K50r2n5j48J86K3j46m9J77L5P1j63J35l2L8M1l92QP2Q7
$$ -64 2 14 189 84 -133 117 25 -30 -178 8 31 -115 -164 13 48 119 -44 91 59 97 138 -254 -246 -174 -87
5595h7J52k42R7l2K42j42j26K04P6q8Q2q1j64L4nk02N9J34K14l05J37j28K17k17
$$ -87 65 -177 -80 -112 130 -12 -138 66 142 54 136 55 -109 -75 -80 -282 -223 -89 125 -180 -43 -171 46 -171
5619a71J57j70K56J6j02k19L95l7o0k65N8p3Q5J28m7j1J03J90k06j0p8l8j77L91
$$ -171 -14 -184 72 88 -14 -233 162 125 65 -200 -142 -215 -130 -2 -49 -60 43 233 27 17 -61 -99 -276 115
5643A15j28k9Q0m4j2p3J04k80K65m9j14M28m56O2J58j33J4Q9J63L2l25K73j05
$$ 115 -13 -42 38 -6 -18 -91 13 -267 -2 -51 -165 263 -193 -131 27 -106 -92 -3 160 192 -133 140 35
5666C5l28K97J66l18M18k40j80J29J21l66P2N5K40q2j77J07J28kRj55L4K33j85
$$ 35 -293 4 170 -148 270 30 -150 -21 100 -266 -194 -139 101 19 -158 -51 77 75 84 -71 -37 196 11
5689A1L32l93r6M09l79K90lj17j86K70K4j72j55M42l45L96l83L48l46J92k08J25
$$ 11 343 -50 -146 263 -116 174 171 54 -132 138 162 -10 -165 277 -68 328 -55 293 -53 139 -69 56
5711E6o7j51J81l86J47J9k2K66k06K45n0j91M47m49K88k52J88J2N8o3k01J01J8
$$ 56 -11 -162 19 -367 -220 -201 -223 43 -163 82 32 -159 288 -161 127 -125 63 75 133 70 -131 -30 -12
5734a2J53J55m1k83Q7k17L6J78Qr6n7K38j57L4l06L60j75R8P2l36K72L16k70n9
$$ -12 141 296 255 -28 59 -158 -122 56 64 -32 -89 149 -8 26 -280 80 -95 3 75 -261 11 327 57 -2
5758bK40j99j81K68j40P2j10J50p4r2K42p6k62j06N18m66J72j30L30k76K78m9
$$ -2 238 39 -142 126 -14 58 -52 98 24 -68 174 98 -164 -270 248 -218 -46 -176 154 -122 156 107
5780A07R1k2k29J48r2r4J10o4j6j19L35n0l39L57J10l08K86k86J58M8j9l18K47
$$ 107 198 176 -53 95 3 -91 19 -45 -61 -180 155 105 -234 123 233 -75 211 -75 83 131 112 -206 41
5803D1J37j81R1k39K99j22j69J91j8l5L21k82j65K23l00J49P5J5m54L92K55l76
$$ 41 178 -3 88 -151 148 26 -143 48 30 -5 316 34 -131 92 -208 -59 16 31 -423 -31 224 -152
5825a52K29R4o4l86L22r4N1m2J79j5j59O4nJ9j85K06K7M9j07k41JJ82J09L43n56
$$ -152 77 171 107 -279 43 -51 0 -42 137 122 -37 27 22 41 -144 62 89 138 31 -210 -209 -27 82 425 -131
5850a31K17j9k92L84P5k08J41k35m8j71K37L09l50J2Q9j47M5J98N9o9J1k83K66
$$ -131 86 67 -225 159 234 26 167 -68 -116 -287 -50 259 -91 -79 10 -137 -92 106 165 96 107 -176 90
5873I0l3k1R4k2j7m2m4k02J66J2j11J40J62j24N6m6MJ50j58j11j3J71j30N4j25
$$ 90 57 36 130 108 91 49 5 -197 -31 -19 -130 10 172 48 104 58 62 212 54 -57 -70 101 -29 25 -100
5898a00k7O6J2n3M01m02K31j03J7o7N0L6k53J99J3p2Q2p4P6L6j35R6M5l25K14
$$ -100 -127 -61 -49 -102 299 -103 128 25 42 -25 25 61 -192 7 20 -52 30 -44 32 68 -67 29 74 -251 -37
5923c7N2K6R9q2J00j5k48K37r4J8r1R0j68J18j83J39L5K00j60J49n5J51j50j38
$$ -37 15 41 140 58 158 143 -105 132 38 56 -35 55 -113 5 -178 -39 -4 196 36 185 130 281 131 -7
5947gJ84j67K1r0N2P5K19l04R2k13r3L31j83n5J12P3Q1J2k64K84j24k6l0l1L8
$$ -7 177 10 31 -59 -7 68 287 -17 75 -138 -231 100 -83 -138 -26 47 128 140 -124 160 36 10 -20 -51 -13
5972a3J64j07l2l5o5k4N3K06j93J14r3L39l78J1J03PJ7L8p3p7J42k46K75j48K4
$$ -13 151 44 12 -23 -88 -112 -59 147 -46 68 -25 314 -64 -53 50 57 74 112 39 -38 104 -142 133 -15 9
5997Il07L96J12l65J41K7M5r5K95l30m6O2j3K71j33j23q8K24K10n25K40l7k95
$$ 9 -298 98 210 -155 -14 13 58 -37 258 -72 -118 -56 -69 202 69 -54 -142 82 292 -233 7 -30 -325
6020c25L01J67l32M8L27k11P3n0k11J65m9J04j2K7L31l05JP0j83J50j9j50L23
$$ -325 -24 143 -189 -141 186 -25 48 -2 -213 -48 -97 7 -5 22 353 48 49 119 -64 86 67 -83 240
6043B40k91O0J56j56m2Q7j68Q7Q5j51J8L06j47k12J04K18l41M0L23l27K19l6R9
$$ 240 -51 9 165 9 -33 54 -114 -27 58 -93 -75 231 84 -128 -24 194 -147 -107 216 -111 108 72 171
6066A71j41j46L59l01N5k73K95n2j22j1L06k64K19o8MQ7j92l7J99r3no2j24K46
$$ 171 30 -116 243 -58 -3 -276 19 -33 -155 -166 140 -124 95 27 31 118 -74 -111 88 -5 -10 -72 -196 50
6090E0J05k23J73j63j04K99j74p2J28j79J20L17l13o8L77l26MR2n4n5j1R4k90
$$ 50 155 -68 105 -58 -162 137 -37 -109 19 -160 -40 277 -36 -104 273 -53 -49 43 -11 -66 -77 17 -273
6113b73L34J93j52j54J52j4O8l28K16p6J18l8L5j30J12n2pj62K06lk28L83p3j34
$$ -273 61 254 102 -52 100 86 154 -174 42 -34 84 46 81 -49 63 11 4 -158 48 45 -183 200 127 -7
6137gQ7k22L8L33l59J04N0J77k95j4L15l04K38k04M5L82l44r0nP5pj46K50J32
$$ -7 80 -142 -104 229 -130 -26 24 201 -94 -108 207 -97 141 -63 -18 364 20 -70 -75 0 -7 -153 97 229
6161B29p9l8M0k9n6M0l9r3K67l47Q5J61j01m0L7j70K00j21n8L54k63l5J0L4k90
$$ 229 150 112 152 123 67 107 68 -25 242 -105 -20 141 40 0 37 -133 67 -54 -112 242 -21 -56 -46 -12 -302
6186c02K21K81l12j81L78l2l0J90m45p2L45O0k63j19L34R9j79L26l44%O8Lj16
$$ -302 -81 200 -112 -293 85 53 23 213 -232 -304 41 101 -162 -281 53 152 -27 299 -45 -45 23 26 -90
6209i0J74j23q8J31J71m3l31J17M2j0K41j77J10m2l50L7J33P5J16j73L57k19K86
$$ -90 84 -39 -127 4 175 132 -199 -82 -40 -50 191 14 124 82 -268 -231 -98 -23 93 -80 277 58 344
6232C44j67m1j32l32K71k1k3R5k32K82k9k08N7j52M63o0P4l11L24k4k50J42j82
$$ 344 177 136 4 -328 -57 -78 -101 -6 -238 44 15 -193 -136 -288 175 115 189 -122 202 178 -72 70 -112
6255a12J80k94J44M6O2q3o2K94k75N3P2K02j52j11r4K68k41K2O1L0k7O6l4J57
$$ -112 68 -226 -82 -36 26 -57 -119 175 -100 -47 25 227 75 -36 -130 138 -103 -81 -20 10 -17 49 15 172
6279A72n4j55k64K35L9o6M38m75J12K71l38J11j13J52j78Q3J14k91J80K17j53
$$ 172 118 -37 -301 -66 -27 -93 345 -130 -18 253 -85 26 -87 65 -113 -30 84 -207 -27 190 37
6300C7M6j53K7J94k10P8k41J22J51j02Q8j69Q9Q8L2j41J13j25J33P4q0j26m4M25
$$ 37 83 -70 -43 151 -59 19 -222 -100 51 -51 37 -132 -43 45 77 -64 49 -76 57 131 51 -75 -119 306
6324C06k51J19j20K52m5k29j66K15j22NKJ86k62L98k94J29l23J10n5N8N2K3P3
$$ 306 55 174 54 306 261 32 -134 81 -41 -36 -34 152 -110 288 -6 123 -200 -90 -145 -87 -35 -12 61
6347F1j06J84k36J55j16k0RQ5P2j69N8P4Q0J83j56k21J18J81l97m4J55J60l95
$$ 61 -45 139 -97 58 -58 -78 -69 16 88 -81 -23 51 131 314 158 -63 55 236 -161 -205 -50 110 -285
6370b85O5L06r5K11l88J31p6J41K80q6j26Q5j50J32j08j55K83oq3M8j06m2J50
$$ -285 -220 86 -9 202 -186 -55 -131 10 290 204 78 163 13 145 37 -118 165 159 76 124 18 -24 126
6393A26j84J00l3k43K49J90j29K1k75M26n69L61J0J42k17J57j69l93J81J73N2
$$ 126 -58 42 9 -234 15 205 76 97 -178 248 -321 40 50 192 -25 132 -37 -430 -249 -76 -24
6414b4L29k41j5N9P9k89k80O07p5Qk77J86k92%O1Q7L2K53j62l8R4j43J4j49J08
$$ -24 305 64 49 108 187 -102 -382 225 150 158 -119 67 -225 -225 -164 -77 -45 208 46 8 102 -41 -27 -176 -68
6439f8k5M7J45o5j90K8L3p3M49k85J88j55J19k78Q6k22M97ql88K06l48L44j93
$$ -68 -93 -46 99 34 -156 -128 -95 -168 281 -4 184 29 148 -130 -44 -266 231 223 -165 41 -307 37 -156
6462a56P4m8L21j50L2K5j39K79M7m08K01k08J83R8k97K24j35J45l0J4L24l53L37
$$ -156 -82 -130 191 41 73 98 -41 238 285 -123 78 -130 53 151 -146 78 -57 88 58 72 396 43 380
$$ [...]
8191E7
##END NTUPLES=NMR FID
##END=
