##TITLE=1H_DE-136_TFA
 200.13Hz, DMSO+CCl4.
 8 sc
 
 7.4.2026
##JCAMPDX= 6.0         $$ Bruker NMR JCAMP-DX V2.0
##DATA TYPE= NMR FID
##DATA CLASS= NTUPLES
##ORIGIN= UXNMR, Bruker Analytische Messtechnik GmbH
##OWNER= pz
$$ XWIN-NMR		Version 3.5
$$ Tue Apr  7 14:42:08 2026 Russian Standard Time (UT+4h)  she@DPX200
##.OBSERVE FREQUENCY= 200.1313
##.OBSERVE NUCLEUS= ^1H
##.DELAY= (6, 6)
##.ACQUISITION MODE= SIMULTANEOUS
##.ACQUISITION SCHEME= undefined
##.AVERAGES= 8
##.DIGITISER RES= 18
##SPECTROMETER/DATA SYSTEM= spect
##.PULSE SEQUENCE= zg30
##.SOLVENT NAME= CDCl3
##.SHIFT REFERENCE= (INTERNAL, CDCl3, 0, 14.3821)
##AUDIT TRAIL= $$ (NUMBER, WHEN, WHO, WHERE, WHAT)
$$ ##TITLE= Audit trail, XWIN-NMR		Version 3.5
$$ ##JCAMPDX= 5.01
$$ ##ORIGIN= Bruker BioSpin GmbH
$$ ##OWNER= she
$$ F:/spectra/data/she/nmr/H-C/1/audita.txt
$$ ##AUDIT TRAIL=  $$ (NUMBER, WHEN, WHO, WHERE, WHAT)
(   1,<2026-04-07 14:39:48.78 +0400>,<she>,<DPX200>,
      <created by zg, POWCHK disabled, PULCHK disabled
       configuration hash MD5:
       00 E9 B6 7A A2 85 ED C7 34 08 36 98 17 FE 4E 26
       data hash MD5: 16K
       38 01 B1 B7 E7 10 3E 14 28 4C 79 2E 32 15 A4 A9>)
$$ ##END=
$$ 
$$ hash MD5
$$ 7D E2 5D C5 90 7B D1 8E 8D CA 9F 05 25 B1 58 8B
##$RELAX= 
##$RELAX= 
##$RELAX= 
##$RELAX= 
##$RELAX= 
##$RELAX= 
$$ Bruker specific parameters
$$ --------------------------
##$DU= <F:/spectra>
##$EXPNO= 1
##$NAME= <H-C>
##$PROCNO= 1
##$TYPE= <nmr>
##$USER= <she>
##$AMP= (0..31)
100 100 100 100 100 100 100 100 100 100 100 100 100 100 100 100 100 100 
100 100 100 100 100 100 100 100 100 100 100 100 100 100 
##$AQSEQ= 0
##$AQ_mod= 1
##$AUNM= <au_zg>
##$AUTOPOS= <>
##$BF1= 200.13
##$BF2= 200.13
##$BF3= 200.13
##$BF4= 200.13
##$BF5= 200.13
##$BF6= 200.13
##$BF7= 200.13
##$BF8= 200.13
##$BYTORDA= 1
##$CFDGTYP= 0
##$CFRGTYP= 5
##$CHEMSTR= <none>
##$CNST= (0..31)
1 1 145 1 1 1 1 1 1 1 1 1 1 1 1 1 1 1 1 1 1 1 1 1 1 1 1 1 1 1 1 1 
##$CPDPRG= <>
##$CPDPRG1= <>
##$CPDPRG2= <>
##$CPDPRG3= <>
##$CPDPRG4= <mlev>
##$CPDPRG5= <mlev>
##$CPDPRG6= <mlev>
##$CPDPRG7= <mlev>
##$CPDPRG8= <mlev>
##$CPDPRGB= <>
##$CPDPRGT= <>
##$D= (0..31)
0 0.7 0 0 0 0 0 0 0 0 0 0.03 0 0 0 0 0 0 0 0 0 0 0 0 0 0 0 0 0 0 0 0 
##$DATE= 1775558388
##$DBL= (0..7)
120 120 120 120 120 120 120 120 
##$DBP= (0..7)
150 150 150 150 150 150 150 150 
##$DBP07= 0
##$DBPNAM0= <>
##$DBPNAM1= <>
##$DBPNAM2= <>
##$DBPNAM3= <>
##$DBPNAM4= <>
##$DBPNAM5= <>
##$DBPNAM6= <>
##$DBPNAM7= <>
##$DBPOAL= (0..7)
0.5 0.5 0.5 0.5 0.5 0.5 0.5 0.5 
##$DBPOFFS= (0..7)
0 0 0 0 0 0 0 0 
##$DE= 6
##$DECBNUC= <off>
##$DECIM= 32
##$DECNUC= <off>
##$DECSTAT= 4
##$DIGMOD= 1
##$DIGTYP= 9
##$DL= (0..7)
0 120 120 120 120 120 120 120 
##$DP= (0..7)
150 150 150 150 150 150 150 150 
##$DP07= 0
##$DPNAME0= <>
##$DPNAME1= <>
##$DPNAME2= <>
##$DPNAME3= <>
##$DPNAME4= <>
##$DPNAME5= <>
##$DPNAME6= <>
##$DPNAME7= <>
##$DPOAL= (0..7)
0.5 0.5 0.5 0.5 0.5 0.5 0.5 0.5 
##$DPOFFS= (0..7)
0 0 0 0 0 0 0 0 
##$DQDMODE= 0
##$DR= 18
##$DS= 0
##$DSLIST= <SSSSSSSSSSSSSSS>
$$ [...]
##$SUBNAM0= <"">
##$SUBNAM1= <"">
##$SUBNAM2= <"">
##$SUBNAM3= <"">
##$SUBNAM4= <"">
##$SUBNAM5= <"">
##$SUBNAM6= <"">
##$SUBNAM7= <"">
##$SUBNAM8= <"">
##$SUBNAM9= <"">
##$SW= 18.0517328524113
##$SWIBOX= (0..15)
0 0 2 0 0 0 0 0 0 0 0 0 0 0 0 0 
##$SW_h= 3612.71676300578
##$TD= 16384
##$TD0= 1
##$TE= 0
##$TE2= 300
##$TE3= 300
##$TEG= 300
##$TL= (0..7)
0 120 120 120 120 120 120 120 
##$TP= (0..7)
150 150 150 150 150 150 150 150 
##$TP07= 0
##$TPNAME0= <>
##$TPNAME1= <>
##$TPNAME2= <>
##$TPNAME3= <>
##$TPNAME4= <>
##$TPNAME5= <>
##$TPNAME6= <>
##$TPNAME7= <>
##$TPOAL= (0..7)
0.5 0.5 0.5 0.5 0.5 0.5 0.5 0.5 
##$TPOFFS= (0..7)
0 0 0 0 0 0 0 0 
##$TUNHIN= 0
##$TUNHOUT= 0
##$TUNXOUT= 0
##$USERA1= <user>
##$USERA2= <user>
##$USERA3= <user>
##$USERA4= <user>
##$USERA5= <user>
##$V9= 5
##$VALIST= <valist>
##$VCLIST= <CCCCCCCCCCCCCCC>
##$VD= 0
##$VDLIST= <DDDDDDDDDDDDDDD>
##$VPLIST= <PPPPPPPPPPPPPPP>
##$VTLIST= <TTTTTTTTTTTTTTT>
##$WBST= 1024
##$WBSW= 4
##$XGAIN= (0..3)
0 0 0 0 
##$XL= 0
##$YL= 0
##$YMAX_a= 265643
##$YMIN_a= -301824
##$ZGOPTNS= <>
##$ZL1= 120
##$ZL2= 120
##$ZL3= 120
##$ZL4= 120
##$ABSF1= 10
##$ABSF2= 0
##$ABSG= 5
##$ABSL= 3
##$ALPHA= 0
##$AQORDER= 0
##$ASSFAC= 0
##$ASSFACI= 0
##$ASSFACX= 0
##$ASSWID= 0
##$AUNMP= <proc_1d>
##$AZFE= 0.1
##$AZFW= 0.1
##$BCFW= 1
##$BC_mod= 2
##$BYTORDP= 1
##$COROFFS= 0
##$CY= -3
##$DATMOD= 1
##$DC= 2
##$DFILT= <>
##$DTYPP= 0
##$F1P= 0
##$F2P= 0
##$FCOR= 0.5
##$FTSIZE= 0
##$FT_mod= 4
##$GAMMA= 1
##$GB= 0.15
##$INTBC= 1
##$INTSCL= 1
##$ISEN= 128
##$LB= 0.25
##$LEV0= 0
##$LPBIN= 0
##$MAXI= 10000
##$MC2= 0
##$MEAN= 0
##$ME_mod= 0
##$MI= 1.114404
##$NCOEF= 0
##$NC_proc= 0
##$NLEV= 6
##$NOISF1= 3.799351
##$NOISF2= 2.8
##$NSP= 1
##$NTH_PI= 0
##$NZP= 0
##$OFFSET= 14.38212
##$PC= 1
##$PHC0= -3705.65
##$PHC1= 12.7923
##$PH_mod= 1
##$PKNL= yes
##$PPARMOD= 0
##$PSCAL= 0
##$PSIGN= 0
##$REVERSE= no
##$SF= 200.129724274929
##$SI= 16384
##$SIGF1= 3
##$SIGF2= 2
##$SINO= 400
##$SIOLD= 16384
##$SREGLST= <1H.CDCl3>
##$SSB= 0
##$STSI= 0
##$STSR= 0
##$SW_p= 3205.1282051282
##$SYMM= 0
##$S_DEV= 0
##$TDeff= 0
##$TDoff= 0
##$TI= <>
##$TILT= no
##$TM1= 0
##$TM2= 0
##$TOPLEV= 0
##$USERP1= <user>
##$USERP2= <user>
##$USERP3= <user>
##$USERP4= <user>
##$USERP5= <user>
##$WDW= 1
##$XDIM= 8192
##$YMAX_p= 0
##$YMIN_p= 0
$$ End of Bruker specific parameters
$$ ---------------------------------
##NTUPLES= NMR FID
##VAR_NAME=  TIME,          FID/REAL,        FID/IMAG
##SYMBOL=    X,             R,               I
##VAR_TYPE=  INDEPENDENT,   DEPENDENT,       DEPENDENT
##VAR_FORM=  AFFN,          ASDF,            ASDF
##VAR_DIM=   8192,          8192,            8192
##UNITS=     SECONDS,       ARBITRARY UNITS, ARBITRARY UNITS
##FACTOR=    0.0002768,     1,               1
##FIRST=     0,             0,               0
##LAST=      2.2672688,     0,               0
##MIN=       0,             -301824,         0
##MAX=       2.2672688,     265643,          0
$$ Real data points
##PAGE= N=1
##DATA TABLE= (X++(R..R)), XYDATA
0 0 0 0 0 0 0 0 0 0 0 0 0 0 0 0 0 0 0 0 0 -3 8 -8 8 -8 8 -8 10 -16 16 -16 21 -24 25 -29 33 -37 41 -49 53 -59 66
41 66 -72 81 -88 100 -110 119 -133 145 -161 177 -194 216 -238 263 -291 324 -362 407 -459 521 -600
62 -600 702 -835 1019 -1298 1752 -2631 4900 -22277 -5718 176093 265643 172593 67029 12380
76 12380 -64644 -83084 -5671 59933 97474 164465 166406 43170 -84911 -151466 -209432 -217594
88 -217594 -124357 -16874 43743 99925 120291 47819 -45604 -82495 -99432 -96439 -21954 84890
100 84890 149445 183925 177603 83320 -34058 -82518 -107065 -135904 -85954 32617 91962 78627
112 78627 61526 10944 -89083 -142783 -123099 -98528 -55096 39883 113500 119652 105131 64603
124 64603 -21829 -76693 -55264 -29238 -14467 46979 116201 110772 53193 -5648 -70445 -117203
136 -117203 -108513 -72110 -34920 24537 79659 69567 21401 -9566 -40835 -77374 -65405 -10563
148 -10563 33765 71601 110516 97695 31599 -18178 -44653 -80972 -88544 -35442 23503 51842
160 51842 67650 55681 624 -46654 -63401 -81444 -79566 -18048 51965 73892 76918 74634 34120
173 34120 -24135 -53016 -61317 -57175 -14409 39399 56265 53883 50310 12246 -50401 -75525 -64474
186 -64474 -51965 -23064 27996 56747 52883 41353 14097 -30569 -49104 -32346 -17207 2283
198 2283 44067 69641 53276 25192 -1293 -39014 -62058 -48791 -27159 -9935 22177 47713
210 47713 32109 -556 -19662 -37709 -52743 -37165 -3278 24808 50982 67117 49565 14809
222 14809 -6190 -25863 -47633 -38957 -1721 23428 30938 35212 23518 -8029 -35695 -52942 -61444
235 -61444 -44186 -2770 27021 36852 45488 42791 13947 -17678 -28851 -28897 -19099 7800 34135
248 34135 43003 41301 29974 -79 -31955 -43443 -41691 -35789 -14643 12910 25103 22719 14427
261 14427 -4820 -26872 -30156 -18618 -8543 6174 30408 43407 34832 16896 -1581 -17491
273 -17491 -23250 -17916 -8718 5686 22795 25367 9614 -7339 -19073 -33075 -39655 -25789 -2421
286 -2421 15143 26021 29385 21476 6840 -8552 -22489 -25736 -10653 10197 22540 27942 29867
299 29867 19454 -1773 -20773 -31393 -33088 -22280 -4130 11302 19287 21086 13111 -3805 -18664
312 -18664 -23979 -20727 -10930 5313 20430 28667 28460 19122 1908 -13582 -18136 -15555 -10758 -1697
326 -1697 11240 19405 14362 774 -12892 -19239 -20125 -18027 -10294 3258 15953 18955 12710 5425
340 5425 -1421 -8074 -11745 -6655 4836 14260 17811 15651 9084 -1861 -13803 -21813 -21737 -13059 126
355 126 9977 13095 11813 6049 -4378 -14332 -18030 -13669 -4777 7828 18399 21740 19232 12800 1836
370 1836 -11491 -18287 -15709 -9121 -115 9422 14426 12412 5040 -5802 -15632 -17819 -12833 -6677 47
385 47 9874 16474 13201 4707 -1177 -5257 -7941 -6572 -2105 4114 11456 13577 7405 -223 -4483 -9621
401 -9621 -14565 -10329 -284 4658 6281 7842 4449 -3178 -7979 -8643 -8623 -3942 5450 10648 10502 10022
417 10022 6822 -1180 -6984 -8558 -9164 -5406 3650 8875 7840 6522 3946 -4640 -13378 -13120 -8856
432 -8856 -4009 3467 10079 11259 9089 5640 -1948 -9134 -8348 -4060 -2772 845 8881 11923 7298
447 7298 2038 -3007 -8528 -10507 -8303 -4946 -6 7090 8362 3429 645 -497 -4860 -7153 -1977
462 -1977 2606 3930 6651 8254 3364 -1434 -2204 -4619 -6697 -3830 1985 3179 3288 3816 125 -5187
478 -5187 -6344 -6818 -7794 -2269 6096 8257 6213 6717 5118 -1672 -5591 -5055 -3652 -1141 4257 6801
494 6801 5212 5007 2705 -5563 -9886 -7246 -5945 -5568 -10 5621 5255 3578 2932 -1483 -5422 -3394
510 -3394 -970 -880 4170 9334 7083 3416 2772 -33 -5555 -5824 -2796 -2289 -1011 2885 2437 -1135 -1941
527 -1941 -2839 -5481 -4765 -835 922 2533 5644 5529 1346 531 1525 -1078 -2892 1057 4390 3142
543 3142 2391 2340 -1148 -4473 -5212 -5596 -5520 -1267 2819 2708 2654 3572 954 -3509 -4254 -2643 -1898 174
561 174 4481 5822 5326 4768 1735 -2731 -3527 -3562 -4212 -2929 2017 4383 1570 1265 1640 -1592 -4587
578 -4587 -3129 -1554 -1163 994 3578 2260 1061 1044 -840 -3060 -1833 166 59 1223 3645 2145
594 2145 -991 -967 -161 -2822 -3473 255 2658 2266 2350 1641 52 -885 -2034 -3908 -2769 951 1883 722
612 722 1856 2536 -268 -2369 -1622 -2285 -2670 732 3176 2436 1968 2776 927 -1595 -1464 -1245 -1959 193
630 193 2785 1688 466 1527 394 -3243 -3989 -2230 -1483 -736 1156 1622 1457 1698 721 -1449 -1530 -85
648 -85 137 273 2485 3266 886 693 972 -1109 -2817 -1397 -86 -395 172 520 -34 -634 -1165 -2602
666 -2602 -2841 -787 953 909 1667 3187 2045 288 151 -250 -1241 -868 904 1696 1454 1644 803 -410
684 -410 -1581 -2556 -3280 -1830 -581 46 -18 1363 1703 173 -1138 -506 72 -169 545 1426 1349 1329 688
703 688 30 -1103 -1036 -750 -892 -27 892 608 -223 -662 -1141 -2000 -2126 -536 289 717 929 1361 1327 908
723 908 -302 -1074 -1142 -204 -54 685 1816 1728 146 -756 -251 -1048 -2019 -1658 -505 162 254 377 166 237
743 237 -161 -705 -573 527 1117 784 1443 1852 1384 -164 -1020 -828 -883 -720 -286 0 87 -67 -190 -523
763 -523 -821 -961 -781 80 678 1050 1002 888 1051 520 -125 -470 -367 274 90 217 -41 143 -215 -958 -1392
784 -1392 -447 -171 -153 601 1171 1116 187 -120 -168 -528 -817 -551 45 850 928 1110 756 350 -512 -1413 -959
805 -959 -253 -170 15 464 829 510 -189 -424 -556 -774 -382 -316 689 509 315 570 454 535 -375 -152 43
826 43 514 417 79 -90 -76 -463 -727 -850 -571 198 310 217 345 327 103 31 -104 24 96 334 158 453 559
849 559 -159 -547 -582 -848 -630 -814 93 575 487 258 378 472 -368 -520 132 343 374 466 359 626 132 -337
871 -337 -647 -771 -848 -717 -200 148 310 53 399 596 103 -421 -615 -106 185 253 39 174 418 80 -173
892 -173 -183 201 -247 -114 -497 -13 -300 -24 -222 -173 -118 232 81 128 -118 252 -439 -592 -290 -204 -268 341
914 341 907 944 579 601 101 -342 -599 -697 -372 -396 -56 14 663 530 -27 -357 -641 -373 -365 -680 -287 451 498
937 498 411 461 449 -34 -204 -424 -632 -180 109 120 31 389 64 -421 -217 -208 -350 -573 -71 -82 -354 -170 -318
960 -318 119 -42 0 308 363 302 -66 -214 86 150 44 157 506 327 280 140 -381 -238 -594 -756 -949 -282
982 -282 278 173 170 232 454 -206 -426 -327 -138 -204 -121 218 1019 778 442 574 295 -391 -829 -539 -350 -382 -529
1005 -529 -168 106 49 -12 -225 44 -5 -406 -90 153 305 288 533 670 858 462 3 177 17 -103 -700
1026 -700 -745 -318 -180 -443 -434 27 130 148 -146 85 -158 -175 58 240 127 736 749 294 601 438 -28 -252
1048 -252 -95 -179 -458 -344 189 -72 -414 -197 -134 -9 -539 -636 -97 213 209 105 466 621 307 336 382 489
1070 489 162 -113 -70 99 21 -10 3 -295 -178 -286 -628 -260 -296 -261 -342 -62 296 480 618 621 568 283 537
1093 537 11 26 197 -113 -121 -104 29 78 175 -211 -103 -259 -498 -464 -147 -440 -78 212 355 743 195 310
1115 310 179 148 -285 -173 -54 127 31 -256 168 -13 -6 -382 -268 -232 -144 -825 -261 51 44 -57 300 468 72
1138 72 102 98 60 -335 -148 -101 -285 -40 176 34 -96 106 169 -231 -54 39 62 -215 107 -28 230 332 154
1161 154 -11 -132 37 -304 -183 -36 -165 -7 15 120 -49 -107 -152 -103 -97 -275 -127 -88 5 212 179 198 106 10
1185 10 -167 268 -27 -328 -188 -159 75 60 -28 46 -15 -735 -495 -249 -225 140 -100 -43 158 453 -39 -138 126
1208 126 18 0 -246 6 143 -374 4 127 67 111 63 -268 -348 -190 -365 -163 -51 -31 -73 -92 417 56 58
1231 58 192 -23 159 -338 51 128 246 118 191 95 57 138 -215 39 262 -243 -409 23 25 112 -62 57 68
1254 68 111 313 49 61 97 380 5 -131 227 247 -157 -118 219 -263 -201 -483 -115 -131 -149 -226 86 46 133 -226
1278 -226 -54 162 79 -62 -177 274 219 -60 112 211 50 -304 -222 -87 -320 -195 -337 -47 114 -242 -42
1299 -42 -51 136 -244 -70 150 350 30 75 -37 2 93 45 158 354 214 -242 -140 -517 96 260 -253 139
1321 139 298 132 -15 27 43 31 -13 -25 167 -179 227 -37 262 -85 244 39 -70 123 -115 -145 75 386
1343 386 -227 -7 -54 264 -59 -8 321 -188 57 -124 -384 99 216 -153 62 -3 152 -37 -62 88 200
1364 200 39 84 91 237 111 -156 -6 -166 -190 -312 -346 -357 -51 -117 -153 333 -224 85 -126 -7 16 -37 130
1387 130 238 43 302 -32 241 -157 4 74 -129 -26 23 -20 -197 14 -32 186 206 -46 -40 -315 -150 120
1409 120 15 -40 128 233 175 -217 -78 -152 123 38 -105 -78 18 33 -88 -185 -150 14 -5 38 -199 -92 -66 -6
1433 -6 54 124 82 8 -8 -11 118 1 164 25 46 -123 52 50 -109 -146 122 -47 99 200 -63 -20 -73 131 -29
1458 -29 211 153 147 -45 -57 157 -128 -171 -146 -150 11 -359 -325 -11 -190 -48 211 -34 -86 -158 230 -131 -20 -105
1482 -105 -11 12 -104 2 -81 -206 74 -235 -57 -157 -164 121 -11 -40 -45 -160 -40 -281 -7 273 271 204 -61 199
1506 199 -151 -145 52 -71 -2 159 -429 -10 -138 44 148 67 11 96 23 -181 195 164 19 -161 -37 83 -136
1529 -136 16 134 209 369 250 295 -46 -241 -43 25 -80 -50 -400 186 59 -138 99 157 131 -32 78 -87
1551 -87 -29 151 21 87 -396 207 310 134 -299 180 107 -6 -194 -200 -141 -144 88 -74 -44 95 279 -115 30
1574 30 40 -56 81 269 26 19 82 155 -143 200 202 6 178 -266 69 -84 -279 -86 -56 8 -230 109 -342 -227
1598 -227 -130 -163 -51 132 -229 11 93 413 154 196 77 -78 250 40 -86 83 183 60 -56 31 111 172
1620 172 -138 -129 -103 -149 -93 -72 126 139 -89 91 -202 93 -229 -212 -54 93 275 30 35 39 -38 55 -298 -8 43
1645 43 105 -180 95 -213 -1 -5 -166 172 -145 105 -202 244 -7 37 11 94 176 3 116 20 -131 -106 95
1668 95 -5 -283 -102 -230 -95 27 12 -161 57 225 52 -76 -183 -257 63 289 40 -67 19 -19 120 -107
1690 -107 -96 -88 129 148 -60 -128 -105 26 42 117 -344 -38 386 133 -134 9 -62 123 263 -21 -38 471 319
1713 319 -90 34 -9 54 23 86 60 75 6 299 244 88 -48 36 -156 -37 48 -325 65 290 -27 71 314 -231
1737 -231 -99 -310 71 -36 188 -200 62 162 -223 169 215 73 -39 -136 -65 420 142 156 83 -50 -195 -16
1759 -16 113 31 133 -152 -121 -141 -80 225 -11 -87 144 157 -110 -61 -154 -159 51 74 123 177 75 -434 200 56 -156
1784 -156 -103 32 -179 -92 -351 212 79 -205 96 144 178 -38 8 -27 130 25 -11 -179 93 100 79 6 -49 193
1808 193 -219 -77 -73 -183 -26 -31 110 33 52 -189 114 125 24 -52 55 213 242 151 -131 208 -147 209 -282
1831 -282 -33 -2 -90 -318 136 180 44 -49 -222 105 190 118 -196 -87 17 18 -52 -7 89 -286 125 85 37 78 -177
1856 -177 46 105 63 20 52 32 -171 184 -114 -227 331 -205 -97 137 163 213 154 137 -113 -52 -124 -211 -26 418
1880 418 53 -186 77 -19 -10 -32 154 220 -39 48 -88 -91 -38 233 -2 15 -440 144 2 -229 174 -36 42 -374
1904 -374 44 -218 -110 -225 111 78 -159 92 -69 -36 -150 -49 -53 -152 -30 205 -73 202 160 -179 -245 -156 -205
1927 -205 -13 137 312 61 265 -198 172 139 -212 -62 -118 -47 -28 -334 -248 -25 113 -222 -157 206 -62 36
1949 36 -78 120 108 35 71 -87 -47 143 212 118 -89 -101 -98 0 27 -102 35 -135 65 -167 -55 -185 107 67
1973 67 -203 -77 107 -84 -8 199 60 18 -59 136 190 104 -135 -240 -146 -20 159 48 219 50 170 113 -143
1996 -143 152 -99 -97 -73 -279 -2 -10 157 -5 115 93 116 -4 -157 35 301 49 -20 139 45 16 36 -212 157
2020 157 -94 -34 18 -2 278 246 59 179 -125 247 -62 62 -300 -66 -51 -173 342 46 -19 5 3 -66 -18 267
2044 267 -167 34 293 35 351 71 209 -30 -67 60 174 61 -86 52 12 201 79 18 -142 96 15
2065 15 -35 210 4 -57 -204 -209 127 -142 -329 296 -117 -91 -173 142 -148 81 -216 -67 295 7 153 -160
2087 -160 -133 293 -171 -161 -12 91 72 46 64 8 -3 -299 3 -12 -72 -132 60 -65 60 199 53 139 212 -64
2111 -64 79 174 12 -313 -187 179 -54 55 -84 3 18 54 -162 64 247 92 107 -12 -59 102 15 92 61
2134 61 36 -16 -42 -45 447 -159 -64 -60 -198 -17 -31 71 -83 35 -226 -48 -35 38 77 -103 -208 -263 -30 -130 -6
2159 -6 18 -216 14 -62 -45 159 45 231 7 207 -15 186 239 96 -355 -112 -50 -84 47 -202 -29 84 -28
2182 -28 -267 -77 -177 -196 22 -145 -7 178 -82 35 55 -4 -41 4 331 92 118 213 -108 -33 -270 -63 -92
2205 -92 -20 192 199 192 58 156 -20 -306 -15 -123 -76 -78 -139 -99 -12 182 104 217 -243 8 -57 61 -50 -71 58
2230 58 -435 -58 186 114 417 -96 256 14 141 -35 30 315 99 -70 -49 -80 -249 -34 70 -187 22 162
2252 162 60 -63 -157 -16 51 114 -193 145 -68 8 -6 -69 185 -45 -71 -19 148 -242 -110 -27 139 66 116 -16
2276 -16 -35 70 -40 186 -47 31 199 180 240 202 -68 -108 -38 -153 -83 -38 305 11 132 49 -81 49 -72 200
2300 200 104 -301 3 85 -21 0 14 -169 -120 -63 -7 38 416 -80 -289 148 -302 -16 207 161 227 218 -4 109
2324 109 20 -57 338 -144 6 0 -111 173 52 -106 226 239 5 140 -52 -244 -139 348 145 -122 166 -4
2346 -4 -15 43 127 -203 55 -18 -42 99 -104 -281 -35 -3 -81 120 153 11 -45 -151 94 202 7 91 51 -49
2370 -49 101 177 -144 -56 -87 -200 112 190 48 -123 240 6 -239 -317 90 -55 -77 120 -262 87 65 181 137
2393 137 172 18 -149 152 -34 131 -29 -333 -85 -21 48 -129 -179 4 -74 40 -45 108 -87 -128 -37 100 173
2416 173 67 -40 -99 -53 -28 -82 129 -218 -284 16 22 106 28 -17 -197 2 -137 97 9 -71 153 103 -60 0 52
2441 52 -4 -325 -322 -15 -71 16 -140 233 157 206 -145 -89 113 34 -63 -90 -110 -163 -411 108 95 -149 36 -118 -106
2466 -106 -242 -9 52 105 117 81 -236 27 26 149 -55 -67 12 -136 -112 -206 295 -63 -177 -32 71 27 147 161
2490 161 -99 -262 -90 129 -170 93 121 -41 244 -141 125 38 -18 -88 123 -53 -266 149 76 -126 -319 -187
2512 -187 -53 -16 105 -4 22 56 221 -211 0 -19 267 -135 -148 222 -1 257 -259 84 -27 63 91 -59
2534 -59 -221 -185 103 36 240 -217 53 43 -186 162 65 219 166 107 -34 44 14 -121 -73 181 36 127 73 -394
2558 -394 -168 -14 92 -199 -244 309 240 88 -73 114 104 -154 233 171 -84 16 277 110 -157 132 -91
2579 -91 -230 162 -65 40 -114 100 24 245 -138 52 -38 -125 -76 207 -54 -93 52 50 252 -144 85 -67 -9
2602 -9 -184 -19 141 205 129 -42 73 -80 -38 4 103 18 -40 2 320 113 55 234 -49 -15 -45 -1 173 176 -66
2627 -66 15 39 -122 249 54 64 -96 -91 82 35 -91 145 22 158 236 71 -107 155 9 -497 -132 24 -142
2650 -142 0 -88 -19 95 10 267 45 -33 7 168 81 36 138 -156 -228 -45 180 136 -39 -300 -276 -9 45 -80
2674 -80 -59 235 -98 -212 184 -52 -40 230 -14 -120 -42 132 42 -110 -227 98 72 -127 -58 -80 -98 -39 203
2697 203 -57 -275 204 -3 182 151 136 87 -176 -56 -62 66 146 -132 18 178 155 -6 129 -16 -53 137 -153
2720 -153 141 -378 144 26 -207 -275 -88 112 -92 95 94 89 -29 102 408 -128 -357 -5 -120 -123 -160 221 140
2743 140 -33 -21 -22 102 69 4 77 118 -174 -160 106 -29 -108 80 439 49 15 41 -102 36 -83 63 -158 -82
2767 -82 19 227 -15 -251 68 111 6 -281 -20 -23 -95 41 -160 -133 -159 -15 -176 -43 -135 135 -67 -40 -35 127
2791 127 -118 -140 -214 31 -58 -95 108 230 104 116 203 258 -66 -350 91 12 42 191 -117 22 16 -68 68 5
2815 5 -22 -157 300 -52 93 -65 207 131 244 15 157 -225 94 -30 -37 -25 27 -142 -45 -111 -126 188 -209 197
2839 197 113 -128 -112 -64 -220 63 74 -19 58 -70 -77 117 -117 -103 11 18 80 -53 -4 2 -37 -274 -92 55 11 -53
2865 -53 -29 160 -203 -95 135 -92 158 -54 -103 264 4 -125 2 201 -265 -124 -198 -153 -88 -199 -221 -270 128
2888 128 -13 55 9 7 140 -76 -56 160 75 111 102 -91 -231 118 -137 -164 -53 -96 7 -74 -200 158 82 -150
2912 -150 -131 -22 32 -36 -197 11 73 -79 153 160 -99 26 -255 -197 -205 -102 -147 -44 217 -121 -108 -49 221 -126
2936 -126 -71 -37 275 -132 -173 -14 178 -313 92 -319 -195 -84 -65 -9 22 -97 214 -76 86 190 -152 459
2958 459 50 141 -7 128 103 -244 -262 6 26 -173 23 21 73 13 -25 -36 -88 235 -44 26 -353 -79 50 -16
2982 -16 16 -46 52 -95 197 16 -45 127 97 174 -15 51 61 -270 154 -34 37 257 61 -65 -122 177 34 39
3006 39 -144 57 -58 -85 -91 279 -237 48 -24 -9 -24 35 -217 -64 50 -78 352 30 -111 124 26 -63 -22 -140
3030 -140 66 124 288 -123 -87 -81 44 16 -216 92 37 82 -302 -20 -64 -265 71 -75 120 49 13 -224 189
3053 189 -73 -69 -148 57 -280 24 -252 -176 178 -80 -85 -48 13 317 -199 72 74 -13 20 -46 87 28 -190 61 156
3078 156 -97 -36 -149 -208 -19 130 -134 45 17 23 2 -100 -56 0 -71 -19 126 181 68 -291 -238 -226 -114 94
3102 94 13 -165 51 154 -300 -124 27 -173 -190 -209 78 90 15 -111 -111 -59 -184 232 328 14 12 -108 110 -10
3126 -10 -103 -122 -126 -175 280 -169 -75 -134 54 -183 -106 286 -77 123 2 29 -128 32 14 -88 -195 76 -62 71
3150 71 84 -18 171 -99 319 111 -82 225 -65 130 -90 -106 129 -193 119 126 106 7 -228 156 414 69
3172 69 -78 -51 -118 16 118 -93 18 53 31 -222 -50 -104 147 -140 66 316 -284 -11 -98 8 183 204 -48
3195 -48 -214 -408 -45 -260 -49 82 -22 140 -7 26 -43 -99 -110 -33 132 -78 185 272 88 -309 -247 95 55
3218 55 50 -15 -134 106 -151 83 -210 85 299 24 72 46 322 157 46 101 74 -234 305 1 -32 214 -131
3241 -131 206 -79 64 88 2 264 -72 -112 64 -53 62 -21 45 54 116 50 64 -70 -133 -67 -292 62 95 67 38
3266 38 226 122 -19 14 174 -143 130 -251 114 25 -53 -118 94 -110 34 328 11 -110 -41 16 51 134 175
3289 175 -132 191 92 175 -126 -57 72 129 -114 -354 31 87 18 -148 -274 61 -70 26 -15 -7 -3 215 92 -232
3313 -232 331 -16 143 -98 -74 -259 -43 -161 257 -121 105 -106 -110 130 -228 -102 -203 -101 8 124 -167
3334 -167 -8 -42 40 74 37 -62 -73 -11 122 -166 -31 -151 158 -80 -215 93 1 -52 -14 23 -183 34 -11 14
3358 14 -125 -45 -58 -16 246 -54 107 -150 38 55 400 -24 -146 81 87 102 -278 200 -39 -74 -45 157 -59
3381 -59 44 -101 94 98 113 -163 105 115 226 -26 -45 -37 -48 160 -72 -119 -194 60 125 -25 -57 87 -193 355
3405 355 -136 17 -39 -157 31 0 -77 -92 156 -195 218 -201 -21 -9 -37 102 -59 -41 -86 -42 221 390 35
3428 35 -167 -172 -171 -110 103 -116 -384 -13 -40 83 182 8 -17 94 143 133 -149 270 10 87 44 -143 188 -132
3452 -132 -41 13 281 189 4 427 -105 -54 148 -70 -137 73 -24 141 26 188 292 -60 -29 -140 -35 -80 -142
3475 -142 67 -64 156 71 78 1 -92 -162 -28 136 -5 -123 174 22 -81 31 -3 -259 -11 -169 -20 -173
3497 -173 -70 30 -112 -192 122 163 -21 -106 -223 110 -66 -133 -172 -194 79 -59 138 -76 -29 -101 -225 33 62
3520 62 -282 42 -137 103 51 -18 -63 187 49 -29 84 23 172 -41 35 35 -91 -91 107 208 7 134 -150 32
3544 32 -189 91 -3 -180 433 60 35 71 108 65 -105 59 181 93 17 106 -6 -143 287 95 45 2 -244 -183
3568 -183 -50 -17 218 -8 -81 -169 191 -59 275 207 176 -183 -13 -217 84 -4 -172 98 -109 -125 -52 30 -22
3591 -22 -127 60 -310 -125 220 -106 120 -232 160 24 310 95 109 -37 -139 -39 7 -201 -331 231 -87
3612 -87 -94 54 24 -162 103 148 -192 11 150 147 -256 63 -169 -27 -22 -181 -69 -10 195 -260 -5 4 85 -39
3636 -39 49 -93 -52 171 375 162 128 21 -87 -114 49 189 38 -20 90 213 52 -3 142 -233 -151 227 3
3659 3 -279 -2 296 161 71 119 -75 228 295 -220 -37 -177 -4 -104 -38 42 135 -20 36 -68 196 -104 172
3682 172 99 13 146 220 -10 -143 -135 74 -50 209 190 127 164 -69 47 176 50 65 25 -104 51 36 86 -137
3706 -137 -130 -18 241 183 114 44 -298 -248 -64 84 78 30 -66 -186 -27 -97 69 -31 210 38 -177 7 1 -3 120
3731 120 261 -100 -41 216 15 -122 359 -336 -54 -248 -105 -48 -168 -75 -117 -160 -11 -103 108 247 -162 121
3753 121 -166 45 252 76 -61 218 -156 -40 375 94 -73 96 -60 157 145 -358 46 63 -240 23 -227
3774 -227 -180 -72 55 99 46 -118 -47 10 198 -121 -171 176 -20 -3 27 -105 110 5 -56 -150 -15 -222 -29
3797 -29 -86 115 211 2 -60 -56 58 -123 208 -213 -14 163 134 -84 25 -7 -85 -166 -30 235 -34 62 -189 480
3821 480 -118 -98 30 -23 -21 -130 259 122 71 14 171 -1 163 142 -38 -289 -216 -222 -115 -70 -25 70 -47 -264
3845 -264 136 185 10 19 51 12 101 -159 57 -18 180 68 -158 -116 292 5 -3 70 19 196 72 153 62 16 -67
3870 -67 -32 -213 135 47 -4 175 -222 -81 9 -272 104 -31 117 -47 -81 59 -31 24 -168 203 -85 -102 38
3893 38 -121 64 111 -400 72 -31 -161 133 -236 20 -6 -102 -49 31 -259 -13 -135 -103 87 -56 -214 149
3915 149 -84 -45 73 -255 -153 -99 -59 197 -92 -83 188 -91 -68 274 -105 -58 -180 -215 -167 -219 -41 -65 15 -319
3939 -319 -35 327 131 -180 87 98 -99 -60 -172 207 -215 -235 -174 -115 339 -262 -210 -133 -3 162 133 204 -118
3962 -118 -43 93 10 73 52 38 -178 -4 -6 -157 142 -15 256 163 -488 -159 18 -132 29 134 13 -304 -107
3985 -107 -15 125 -115 28 -71 125 100 -91 -204 -11 -18 2 158 19 -59 -21 -112 68 -93 -101 -174 -39 -31 -133 -51
4010 -51 -230 75 -331 131 -74 2 109 205 -10 -1 44 -105 30 -182 168 -70 22 -65 131 81 64 54 60 27 -306
4035 -306 167 71 252 -154 191 -161 -258 137 -100 -32 8 -395 8 -32 -114 207 -174 27 112 -162 -27 -39 355
4058 355 -64 -42 51 -205 22 -81 -150 152 16 58 -91 -32 56 -26 256 15 117 46 32 -72 264 43 194
4081 194 -68 -262 -76 -18 81 -104 59 -83 89 -166 -87 -101 -323 56 -262 -134 -201 66 127 5 -131 78
4103 78 -182 -134 210 -18 71 -2 92 -158 144 -182 147 -59 157 315 -148 -12 -102 -64 -154 154 94 -60 -95
4126 -95 -279 -74 -28 81 138 -148 168 -29 -174 163 98 58 69 -124 -94 -15 -142 -9 189 -142 258 42 72
4149 72 14 5 141 370 56 14 150 47 -115 -294 -256 -165 -330 30 45 -45 0 -250 127 47 -99 64 105 -19
4173 -19 178 93 -238 -85 24 -121 -15 392 -127 -27 80 -175 -13 -46 -207 106 131 -92 -19 -27 -311 66
4195 66 50 -5 -4 337 -65 23 -67 -297 44 -163 101 102 -76 23 148 -73 -62 -39 -45 -122 -149 -186 -216 105 279 51
4221 51 -106 -12 166 8 -73 205 236 232 64 -37 87 148 102 -102 -84 212 81 19 -266 5 160 107 -39 -32
4245 -32 132 85 275 175 46 -140 233 -114 -140 41 -78 30 213 -10 112 -136 42 -26 21 -157 -201 -42
4267 -42 115 -272 34 -119 94 90 -24 -54 155 -70 -230 -288 120 103 59 -40 3 24 95 11 -106 62 239 -179
4291 -179 41 88 282 37 -21 207 -231 -3 143 -42 -3 -127 -4 131 30 -191 -377 -239 -103 -24 64 -43
4313 -43 -333 98 29 -100 -180 59 326 -32 101 -240 -90 -236 106 289 155 263 -204 -44 -190 -98 -72 68
4335 68 -58 -176 -85 92 -96 104 130 -10 153 80 -84 -148 -238 -13 84 60 61 -129 133 -15 -271 154 163 -66
4359 -66 29 161 -179 132 -102 -203 92 153 141 55 4 -178 -42 59 -179 152 419 -95 -26 -244 160 -2
4381 -2 -92 116 87 92 -4 -216 -219 -114 75 122 36 -167 -77 -151 48 25 14 16 -222 118 249 21 -42 -8 -26 -135 218
4408 218 1 -7 145 -81 3 48 -162 40 216 -167 54 115 87 -9 330 -16 -207 51 -18 -30 -104 -191 160 -270
4432 -270 16 141 205 3 -141 1 65 63 141 38 -71 -220 -32 -12 -57 -131 -116 76 -89 -69 43 -53 3 -61
4456 -61 -236 -49 -78 -204 127 -82 -195 -18 -212 7 -66 -85 -74 123 66 -76 167 -62 290 99 -33 242
4478 242 -119 -153 -204 58 -153 -222 -160 -236 48 -76 69 123 90 -65 -331 -80 114 32 50 35 122 43 -14 -101 -33
4503 -33 -2 133 66 94 -2 -74 -9 -42 125 70 37 -151 46 6 206 -390 -283 50 115 55 -9 -189 -63 -252 143
4528 143 254 116 -123 -88 264 -78 261 -104 -57 -29 -108 -129 135 100 136 51 154 -83 -318 142 86 43 -1 -190
4552 -190 -41 53 196 171 -176 37 -83 -173 20 -160 93 190 -87 -7 120 5 138 203 -356 -122 110 125
4574 125 -236 414 226 -154 -78 -104 -16 130 31 -124 -12 68 231 139 -6 202 -12 -102 30 -78 217 164 -60
4597 -60 81 -20 39 116 46 100 144 85 188 -219 -191 -131 -108 60 -123 8 -94 -86 -80 23 257 123 26 -29 -149
4622 -149 -29 100 -99 -85 78 -73 55 -255 -209 6 62 30 -150 8 -17 -61 -71 -11 -173 -1 -105 -17 -239
4645 -239 71 101 195 224 105 142 2 84 115 28 -256 -135 -107 128 -152 -62 -137 -24 -61 161 -163 141 -30 -230
4669 -230 135 250 212 67 211 97 -223 -42 2 26 -87 49 -91 41 49 -162 -3 115 -104 -167 -216 -68
4691 -68 227 -69 24 -291 -130 81 -15 340 190 68 -194 -20 -52 -32 -54 83 60 -244 -154 137 51 -188 5
4714 5 236 -100 119 16 -155 -48 36 6 21 136 172 -160 -400 -92 -169 -143 44 -331 104 -151 19 206 110
4737 110 445 125 -220 -50 75 106 48 104 -195 205 -22 -231 -36 170 -237 -6 -219 52 314 -211 -169
4758 -169 -49 -197 -85 -52 -250 -239 31 190 -5 13 19 169 -150 -161 57 97 21 35 84 -108 -215 132 188 94
4782 94 -53 218 -171 -157 4 -178 11 137 125 126 107 -116 -105 52 -274 -137 395 -368 -12 52 -3 -251 186
4805 186 73 -291 32 -61 81 90 274 22 31 -80 105 -55 61 -8 -56 -14 106 408 97 28 -160 41 99
4828 99 -277 -32 -236 -104 69 320 -25 -112 60 30 -87 -74 220 101 -156 167 151 107 -1 159 -26 135
4850 135 35 19 62 117 183 47 -27 -24 153 134 -23 63 -37 139 -143 -179 247 -160 -34 -172 -14 1 3 29 -97
4875 -97 27 308 42 337 143 182 -35 -87 115 9 -28 105 -139 39 -119 -71 235 69 -18 -68 19 -290 -451
4898 -451 -82 317 -37 299 21 -133 41 -125 258 163 -43 144 98 -248 -128 -101 -151 -161 25 54 -28 -104 51
4921 51 34 -262 -118 138 -211 13 -67 81 102 -128 -15 16 -37 11 -30 194 -289 193 194 62 -130 -90 20 76
4945 76 23 -28 82 214 -93 96 -208 168 68 -11 -224 -124 -30 125 57 165 130 41 213 95 88 -62 -183
4968 -183 239 223 -48 43 18 -85 -115 -37 25 -63 79 -126 -242 -74 241 27 3 -95 -56 -66 236 -63 -133 -277
4992 -277 30 392 -77 -79 -125 149 66 150 -102 -162 66 62 -153 -201 93 22 13 122 -255 -213 74 -17 -154 289 40
5017 40 -43 -76 -57 118 165 -89 22 -95 -266 -160 -5 217 97 109 -154 -318 -20 -186 -65 41 -66 18
5039 18 -12 -206 -40 -265 180 244 -15 -10 126 164 -3 60 -49 82 191 -146 158 272 -176 -24 103 27 89
5062 89 280 216 307 60 -34 -139 161 109 160 148 172 -71 72 -20 29 248 -166 118 103 106 48 -217 140 87 29
5087 29 51 -84 -58 -86 73 37 -6 -103 2 15 -85 -58 43 171 -303 -11 -109 -494 225 -116 -85 -34 -84 44
5111 44 -220 -99 173 118 -1 -402 -349 50 216 39 -159 116 183 196 5 -74 136 138 39 141 219 -62 -51 42
5135 42 -260 -162 -72 -146 30 25 45 56 -212 16 162 -203 -237 -176 -296 -199 149 -58 -197 -25 -257 -108 -138 -136 -188
5160 -188 -76 -70 125 -233 165 92 128 -138 -27 169 -176 0 7 -75 -227 120 -57 103 -192 41 -190 -134 -158
5183 -158 -118 41 -80 100 -15 100 -60 -45 -105 187 -127 -130 108 75 -14 26 -290 28 -101 115 82 64 142 44
5207 44 -150 213 119 -90 152 -75 -129 -186 107 100 -308 -239 213 -25 266 -125 106 57 -157 -25 181 13 83
5230 83 22 130 114 -186 249 -31 -118 -154 -123 95 -132 6 64 -352 -241 -99 90 -302 -25 349 -82 -7 -313
5253 -313 -156 0 -53 22 6 143 121 -33 -161 0 93 353 139 -195 -64 -83 233 -55 -83 -106 184 -47 58
5276 58 105 -107 160 -11 335 96 -22 18 -141 50 -87 87 -98 46 122 94 134 -11 106 -352 -51 134
5298 134 -96 -307 47 112 -301 69 -86 -155 -28 50 209 -67 27 -159 -111 253 -15 -81 -286 -212 -157 35 -18
5321 -18 49 -91 -166 51 91 110 16 143 10 200 247 -39 -4 94 -312 266 133 -341 -32 -6 109 -274 -332 -58
5345 -58 -120 13 10 -5 194 331 -142 -150 -78 -110 4 -75 -91 14 -171 -8 9 -118 -79 356 -98 39 -105 36
5369 36 118 86 -51 -83 -59 14 76 -318 31 -31 -211 -58 60 -106 10 31 22 -153 -19 -46 91 -49 -141 74
5393 74 14 122 -43 -301 -67 -39 -83 43 77 145 -280 150 -166 -164 -234 391 85 -118 138 0 149 -284 -102
5416 -102 6 125 -5 -46 68 -89 63 101 -211 45 55 259 -110 138 91 -92 -24 35 88 -203 -33 -101 -88
5439 -88 -33 -71 6 49 -99 197 46 -82 101 4 -220 -193 -133 -109 -36 -102 124 -283 -153 269 -18 -314 -62 66
5463 66 115 -133 -271 -84 238 86 147 58 -51 141 269 -25 166 212 92 69 -24 55 129 -109 13 -43 218
5486 218 95 -111 -96 21 102 -74 -251 37 51 52 300 -66 -44 -138 -24 -142 -16 -37 149 43 -70 85 -117
5509 -117 -7 119 -29 82 50 142 -3 241 150 -96 14 117 -117 88 30 94 -120 -313 -165 2 312 107
5531 107 -5 39 279 350 -118 281 285 161 59 173 -152 -72 25 -27 66 -124 168 153 243 -130 4 6 -233 -211
5555 -211 -115 85 -167 189 -105 39 -167 61 -5 132 222 279 55 210 -14 -54 -40 -162 108 -8 -155 73
5577 73 -74 29 -72 -132 64 -392 270 59 123 -123 -63 -70 -113 -86 -69 140 5 -95 5 -57 65 59 110 213
5601 213 280 80 60 118 -124 -20 -76 -30 149 113 86 236 144 82 -96 69 106 240 177 201 73 77 -54 -19 -133
5626 -133 -99 -25 -102 -292 -172 127 11 -40 50 76 -110 -121 -96 -15 -76 224 175 -68 -75 15 134 -188 -209 4 32
5651 32 54 -16 220 107 24 230 -53 -116 -189 82 -396 -110 -164 196 126 100 -159 11 65 -70 -50 275 162 44
5675 44 23 -137 98 100 301 -163 -29 -216 186 -43 79 -4 -33 262 121 -127 -66 52 -130 -195 -160 -49 -354
5698 -354 -285 260 274 -160 -64 -20 -44 -236 -96 -26 -256 108 -138 8 -10 -39 -15 -80 138 -67 -354 18 -52 -81
5722 -81 -12 -131 103 -129 -137 -192 -36 -72 95 -26 -43 282 -19 -51 137 -61 -140 141 -288 -64 119 125 -207 -42
5746 -42 88 221 -135 -7 170 136 86 266 -77 238 224 -37 44 154 122 -53 -12 76 -28 -50 -8 115 -94
5769 -94 -318 -24 -2 -74 154 -254 -56 127 43 121 -27 82 257 40 132 97 349 131 -55 -135 115 -152 2
5792 2 -41 102 -32 122 -29 -283 188 157 -27 17 -107 -390 36 -253 267 75 2 123 -270 -31 -21 -219
5814 -219 12 151 60 19 67 180 10 42 -119 -190 65 82 16 -66 -42 77 195 159 -22 79 -29 -104 259 163
5838 163 209 -102 35 -266 223 138 -241 157 236 69 -113 234 84 -75 -121 -40 -67 -129 11 23 -212 178 -94
5861 -94 -49 -267 -66 -3 -132 -41 -11 70 103 155 70 169 -350 235 -303 -88 -46 42 -254 -56 43 108 -63 -61 92
5886 92 -59 11 -60 100 196 -90 -44 225 57 98 27 -197 -158 123 149 176 -224 -17 -30 -175 24 123 121 142 65
5911 65 22 116 122 77 176 88 -81 -296 197 -17 -114 97 240 113 71 -74 314 157 21 260 137 122 -194 -21
5935 -21 -175 -165 295 -3 -114 36 42 -284 -72 -103 -129 224 47 66 -109 -149 21 -89 240 30 199 274 -174
5958 -174 148 28 133 291 -115 -84 226 -66 -43 -9 8 272 -166 -197 161 20 -104 135 -77 -8 77 233
5980 233 -38 195 -78 15 323 72 150 -22 -80 -82 -23 -25 -71 72 -67 -218 -39 143 13 -1 145 24 -92
6003 -92 260 -158 137 -294 -66 -19 103 11 109 -55 -48 68 30 28 62 103 -28 -216 -73 -50 -299 83 -83 27
6027 27 -91 -127 26 -46 -193 -37 -170 -124 13 -125 83 -61 24 214 211 -23 -159 -137 65 60 -21 -3 171 -181
6051 -181 -501 74 108 81 -142 -82 196 128 -105 -104 -32 147 139 -251 -106 -79 -156 228 104 -87 42 -35 -185 -155
6075 -155 -96 -29 27 -89 46 4 -80 -68 162 -37 -111 -46 55 176 -2 87 -222 40 332 115 57 -273 165
6098 165 -214 -19 -29 87 22 -29 -72 -56 -47 -131 182 72 -155 38 -231 1 135 -283 223 84 52 -46 -218
6121 -218 -139 -135 -200 380 -17 147 241 67 3 -59 211 -18 -129 71 -312 -21 -29 -5 116 -76 121 -162 34
6144 34 19 -226 164 -192 34 27 -54 -32 182 -194 17 -164 -93 -48 -159 65 -126 -179 163 -333 236 -25 -73
6167 -73 -168 -24 309 -46 -56 -61 106 -41 113 -120 -119 0 81 -97 99 -202 44 -268 -249 122 64 -125 -176 -168
6191 -168 -302 -29 -12 -163 96 129 -89 1 60 -128 -180 -245 72 404 161 -36 -80 -38 -41 44 -176 -15 55 -12
6215 -12 25 142 72 109 13 -21 -204 186 -44 -158 217 -153 -74 -121 35 77 84 -144 -43 107 41 45 112 -295 241
6240 241 89 346 174 203 -54 5 81 -266 144 -247 150 -222 -138 -182 -82 -168 -29 -69 -47 43 10 -52 41 -95
6264 -95 -220 -315 -85 151 103 -6 -117 93 78 -2 160 -3 222 27 -198 300 -92 -11 117 -7 85 -42
6286 -42 -15 -137 -190 -133 -137 167 279 -79 92 23 44 -228 -76 -226 -12 -216 142 -58 19 48 -37 190 37 119
6310 119 -69 -141 -182 110 -6 53 -89 49 4 -47 -215 -116 221 -153 -203 101 65 -6 -125 -104 89 -41 61
6333 61 115 86 124 73 53 -124 -61 168 -188 76 81 46 15 99 -105 -262 -181 -174 -142 -120 160 155 -20 -158 -190 -108 -62
6360 -62 84 34 -37 205 6 164 202 -217 209 165 -203 120 -5 -171 -202 213 -63 -22 -98 125 5 -120 32
6383 32 127 -216 -17 79 215 -2 -165 -64 -55 88 -84 125 203 -76 13 -238 -87 -21 173 238 117 63 -204
6406 -204 50 138 -60 0 -52 -211 -53 56 -51 -160 255 -103 -167 29 129 39 102 -188 409 -158 191 9
6428 9 19 -90 -16 158 28 -368 -105 95 9 282 297 212 -73 202 -16 91 6 218 -136 66 147 95 -60
6451 -60 -28 -231 -116 -71 149 16 145 -61 -85 160 77 -48 -242 150 -21 46 39 -301 -89 45 135 57 -77
6474 -77 -17 -11 -252 -158 -153 -84 100 11 -79 93 -104 66 141 -68 -10 -31 87 69 -48 -105 101 75 23 -237 -147 59
6500 59 46 211 -48 -127 -37 153 -60 -309 -328 -29 205 -15 59 180 -118 -280 -63 -219 -160 -78 209 -61 67
6523 67 -107 -181 -1 398 -75 17 -157 53 -438 -52 9 -99 -5 143 -248 154 158 -131 168 62 23 -125 -19
6546 -19 -113 -31 212 -26 152 -114 -40 -101 50 -153 30 6 -172 -12 -57 15 -112 -32 -72 142 146 -124 -164 56
6570 56 56 -61 -39 41 -84 289 -17 5 -74 -37 153 35 142 239 121 -64 -112 -63 64 -59 77 154 -14 -75
6594 -75 75 -236 247 -48 44 -90 -108 207 -356 235 2 134 -78 175 -7 122 17 37 -141 -71 -16 -215
6616 -215 138 377 -73 -65 174 24 -89 102 33 20 237 -47 249 -203 -36 -69 -13 177 -28 -227 -100 274
6638 274 -9 -152 -188 93 -285 139 -137 -69 103 -39 -10 -1 -11 -110 329 -183 185 40 -62 -180 86 71 63
6661 63 -36 202 113 -54 210 -173 257 80 -80 -171 259 123 59 172 -78 305 -50 -44 265 246 -5 -91 -30
6684 -30 128 -97 -42 -260 71 -224 -364 -106 158 -22 -39 -27 27 222 -68 151 241 43 33 35 -122 262 -80
6707 -80 189 166 -10 -218 4 154 45 -22 45 -8 -1 108 50 -100 -31 -29 75 -302 -206 -6 82 100 190 -97 -103 -93
6733 -93 -91 97 -268 -156 28 103 35 -47 -27 -56 -120 -90 -55 -59 -118 -183 -20 -24 -93 -133 -90 134 7 191 121 -39 -272
6760 -272 -22 175 112 9 -135 -133 62 108 418 -112 -208 83 -126 23 76 32 71 -97 -115 -139 -156 -108 -43 -17 78
6785 78 217 7 -101 -72 44 451 -142 100 141 132 189 -29 -264 -252 -286 3 17 -285 -167 140 57 186 -28
6808 -28 8 40 -124 -42 -86 -162 101 27 9 -134 -6 -2 -27 241 -88 139 -44 40 -55 -115 197 25 -23 -5 -7 119
6834 119 -34 -18 160 140 175 -411 47 -116 167 96 0 -189 109 -91 105 80 76 65 30 53 142 -13 87 -123
6858 -123 -310 -24 -12 45 -36 403 4 -52 175 -91 85 -67 -116 159 -117 11 95 -29 -189 -118 -144 100 146
6881 146 -125 -176 33 61 144 -37 302 20 -84 71 53 -108 -219 124 253 357 -29 97 -47 206 -39
6902 -39 45 78 222 -89 196 -24 -113 90 -29 -1 259 32 17 69 -111 34 -34 148 -153 0 210 -184 -29
6925 -29 -395 -232 160 127 4 54 -172 172 68 44 188 -119 -174 39 145 -148 120 81 -95 -167 5 57 -131
6948 -131 125 222 -55 -21 151 98 163 100 -75 68 -19 -49 -56 -36 35 -178 -41 -2 232 258 281 -83 109 -109 24
6973 24 171 74 15 90 69 -20 12 -15 333 193 -203 16 -75 118 44 -194 304 29 78 -142 5 11 -1 -12 -96
6998 -96 -24 -58 -211 -147 -358 -293 24 -134 -7 20 2 -129 96 3 -258 41 62 158 -175 89 -6 -228 56 -27
7022 -27 -177 125 63 109 38 36 -270 -40 -6 -163 15 -161 -93 66 -177 -27 14 163 223 137 64 185 -308 -76
7046 -76 200 106 268 -67 109 69 -80 216 142 63 106 75 -74 129 -69 -99 -48 -187 -184 -138 116 131 232 144 217
7071 217 -201 -105 -87 85 40 -148 -65 -54 -95 178 -26 138 -188 230 -311 129 -25 -281 -193 151 221 -117 -137
7094 -137 -102 129 16 257 106 -55 -179 356 163 62 31 -45 -157 56 -36 -166 158 7 -120 -80 -174 117
7116 117 -219 103 161 -187 -10 26 72 -182 -75 -93 -177 -302 182 -334 -74 -118 278 255 125 65 3 185 -35
7139 -35 86 -27 -21 -165 62 65 161 155 245 -29 42 -187 -248 65 -57 -164 -96 -155 -45 -61 -25 -329 -115 264 -51
7164 -51 -140 -12 -53 -47 -177 83 -90 95 175 -282 -322 50 38 -47 -23 18 1 179 -344 162 -16 -47 12 230 175
7189 175 145 192 158 212 40 -12 -110 -26 -95 -268 -239 -46 32 169 -223 34 337 64 -36 -187 91 69 32 -63
7213 -63 -152 180 -16 298 -50 -47 87 146 -9 -82 67 0 18 209 -190 -95 6 7 -67 -162 152 206 -72 -117 -174
7238 -174 -96 -149 162 -19 -124 -59 -316 -132 90 -232 -48 235 54 -171 111 29 87 -243 28 -227 48 164
7260 164 42 138 129 -130 -162 -205 -276 65 102 93 167 176 227 37 -78 -196 122 -73 -87 114 -15 127 -37 64 104
7285 104 98 141 157 24 -236 -216 41 -226 -286 31 98 -84 165 157 -188 -27 -145 -17 280 29 81 -119 -97 82
7309 82 -182 288 -111 -107 23 110 1 205 178 -248 113 75 -42 -163 -195 22 9 -49 87 82 -145 310 71 150
7333 150 -212 -102 63 12 179 -55 86 206 -51 217 -120 -90 138 -65 -287 -6 47 -40 219 -27 22 90
7355 90 -14 -143 -129 11 61 213 2 135 -82 -46 5 -7 165 129 469 -94 10 130 -15 380 35 135
7377 135 42 -7 -10 -202 241 305 79 83 -63 -57 -289 -143 27 -105 208 -246 86 73 220 -81 64 -70 312
7400 312 108 12 143 -128 17 42 41 -133 69 -74 -235 -40 -185 69 -136 67 -105 93 111 -50 23 24 -125
7423 -125 120 141 78 68 13 -34 123 -144 33 72 -96 -161 -78 -62 -121 7 77 -26 -218 -59 -424 -258 -138 -385
7447 -385 56 120 -26 -95 -93 -177 -51 -163 -214 -89 141 120 195 -109 41 -84 -80 170 -79 110 -201 -233 283 137
7471 137 81 -42 215 -132 31 22 138 -76 114 -83 -150 355 111 140 -46 176 -45 172 -99 -100 108 -158
7493 -158 1 89 164 35 122 -97 -255 -103 -185 -82 94 17 170 197 93 -238 101 -133 -256 -65 -158 -130 79
7516 79 147 -174 -105 -13 88 -287 -45 -167 122 -186 -46 -196 129 -55 241 -186 -142 262 36 -178 27 -89
7538 -89 -95 -2 -353 -33 85 -76 -28 76 -103 -137 69 -134 27 228 118 124 221 121 112 -17 -7 -116 2 255
7562 255 -118 -141 243 299 296 -51 77 -3 -121 57 107 -45 -131 202 -33 157 139 -13 39 -180 -9 -104 1
7585 1 -265 -49 -118 192 -39 -66 76 175 -99 -118 -317 215 -60 -374 185 54 3 137 -83 -225 88 16 184
7608 184 -206 -261 100 109 176 222 121 -70 110 184 -17 -143 -55 185 -348 15 -168 -36 149 -72 -3 29 82
7631 82 108 -58 167 116 105 40 -133 -106 99 -261 9 66 -122 -29 112 -110 -17 -121 35 15 -4 -22 185 39
7655 39 -12 358 -121 21 -69 -78 34 -126 -171 172 -140 -111 -177 258 -470 -178 0 217 -193 -39 35 -30 54 -69
7679 -69 167 -195 -184 28 95 -115 178 75 -91 -113 1 -118 -115 -187 38 -90 419 10 -182 -159 -87 -18 25 -93
7703 -93 190 -123 115 232 67 32 -34 261 -49 114 4 64 40 340 -83 -111 164 -154 -15 154 -47 340
7725 340 -80 93 -229 -88 41 60 -80 49 153 278 1 248 71 127 30 41 86 111 -14 -40 -6 -133 -100
7748 -100 50 -51 -145 173 -67 9 -59 144 -28 -234 -81 -58 -37 -156 187 -110 90 -303 -1 57 42 47 100
7771 100 -97 -92 -10 124 184 -16 -43 248 -166 13 -23 15 180 -87 36 1 -88 -33 6 142 -22 20 97 62 -142
7796 -142 -299 -134 67 -17 409 40 -53 56 68 77 -20 -199 49 259 102 -229 -161 43 -165 45 141 209 2
7819 2 37 -172 -108 -119 151 -107 77 189 12 6 22 119 -145 -130 89 107 219 -179 -336 97 -102 275 22 286
7843 286 92 -321 -61 155 -86 -6 110 -129 0 51 10 1 -76 -76 141 199 -12 129 90 -110 43 304 19
7866 19 32 -95 -29 -77 93 228 115 -56 16 54 19 167 73 -16 77 64 -148 139 -186 38 227 119 -185 -29
7890 -29 -67 47 123 -402 -117 20 60 -271 11 -23 230 156 190 164 49 208 90 228 -250 38 319 -105 160
7913 160 120 -216 -233 -92 234 -226 42 -106 -172 46 -196 82 -184 -10 -65 -132 185 -216 17 156 276 -129
7935 -129 -8 104 241 488 -26 -213 84 -256 -73 25 172 33 117 -80 -70 -45 -199 118 39 152 -152 -5
7957 -5 125 102 144 -209 -123 -59 45 93 -169 -81 -46 133 86 146 62 -90 282 -87 123 -36 55 244 127 -12
7981 -12 -52 247 282 36 -122 -22 -61 28 -194 168 -124 -135 -130 -94 -62 249 -68 -78 -158 51 146 222 -15 173 75
8006 75 83 48 51 63 -265 14 51 38 -237 137 116 61 107 160 -158 31 137 107 172 59 -198 150 -8 -28 167
8031 167 -175 118 -68 233 -51 27 -4 -27 10 175 221 11 22 -116 -29 -249 23 -208 -16 144 330 -24
8053 -24 -211 24 173 90 -140 167 96 260 221 -91 303 -155 152 -252 -303 -28 -116 -103 44 157 -70 -57 -47
8076 -47 213 32 253 40 -114 173 63 -3 63 -37 25 -97 -49 -372 -28 -102 24 240 12 -41 -49 163 47
8099 47 175 125 90 220 -42 -18 121 99 -167 -185 -86 -151 17 13 30 -21 -151 35 111 -121 9 96 58 20 -91
8124 -91 50 203 22 22 -138 -233 -55 189 -84 -75 122 -114 89 -7 -19 -176 87 -22 -127 -102 209 110 -71
8147 -71 -95 -104 -181 91 -127 -302 -101 215 47 96 273 99 44 -151 1 155 62 60 -98 192 55 254 13
8170 13 -262 83 -232 -71 -85 20 14 -10 -208 51 57 81 124 42 301 -34 -79 10 -112 -144 -27
8191b7
$$ Imaginary data points
##PAGE= N=2
##DATA TABLE= (X++(I..I)), XYDATA
0 0 0 0 0 0 0 0 0 0 0 0 0 -8 8 -8 8 -16 16 -24 24 -32 37 -47 51 -64 72 -83 96 -112 129 -150 170 -195 221
33 221 -250 284 -317 356 -400 447 -500 556 -618 685 -757 839 -926 1022 -1127 1240 -1367
50 -1367 1508 -1660 1831 -2020 2233 -2470 2745 -3058 3422 -3853 4371 -5008 5810 -6860 8304
65 8304 -10416 13820 -20229 36618 -174915 -301824 -66191 -40267 57369 149805 162893 63169
77 63169 7418 -78934 -130240 -74645 51000 106398 164698 222479 191986 67418 -27686 -110119
89 -110119 -179085 -166452 -70390 -1854 43809 86977 68275 -31413 -107197 -131939 -133523 -88764
101 -88764 12344 86358 122599 157025 136490 27657 -53420 -53842 -53450 -56159 11430 93786 103657
114 103657 80212 53501 -29664 -129447 -151872 -121050 -83603 -10732 71310 89553 68634 52798
126 52798 -4016 -91318 -106154 -45096 7416 49238 106308 133040 103829 53335 -13228 -89727
138 -89727 -115988 -80262 -40794 -2327 57300 88327 50881 -4176 -45287 -89606 -107518 -63041
150 -63041 -4114 33459 79760 115243 82629 15457 -21350 -43216 -65567 -50234 -2561 31196
162 31196 55684 72223 38564 -27001 -57118 -60763 -74847 -59571 3088 50406 60494 60167 39108
175 39108 -10641 -43094 -45577 -45390 -23850 33125 70950 61957 47782 29903 -20157 -68640 -73302
188 -73302 -55550 -31794 11823 50904 51755 35866 17742 -23661 -66409 -63572 -32353 -6101 28359
201 28359 68044 74968 51824 25882 -10586 -52097 -58077 -31112 -9959 9266 39695 49777
213 49777 22202 -9944 -34333 -58465 -60946 -34445 -5880 18752 49879 60210 33397 4572
225 4572 -7425 -22692 -34130 -16499 15024 33813 42342 37796 11246 -18065 -32432 -45121 -53029
238 -53029 -31443 5137 22778 24342 24397 10942 -14786 -28927 -28506 -21374 335 31033 46413
251 46413 44226 36531 17759 -14179 -35587 -34690 -25431 -9651 14275 28690 24282 14161 -1446
264 -1446 -29715 -50236 -43620 -22593 -3371 17369 36719 41502 31424 12260 -11380 -26948 -23031
277 -23031 -10583 1409 18434 35678 32770 12654 -5503 -19491 -33608 -37020 -24294 -4623
289 -4623 12174 22172 19267 6705 -3946 -12090 -20917 -20112 -3690 15486 25531 28842 24508 10303
303 10303 -5534 -16406 -22041 -19969 -6668 9049 16429 15890 10069 -2605 -18256 -27260 -26194 -16657
317 -16657 -1017 14925 22782 22931 17900 6888 -9460 -20069 -16284 -4646 6757 14671 21150
330 21150 22706 13805 -3945 -21332 -27974 -24236 -16045 -4922 8782 19389 18756 8317 -3243
343 -3243 -11763 -16329 -15641 -6697 7116 18853 23473 20585 11582 495 -9006 -15557 -17442 -11460 -198
358 -198 8260 10110 7506 1325 -7662 -14279 -15622 -12455 -3635 8281 16005 15109 10079 4504 -3258
373 -3258 -9773 -9523 -3835 2861 9972 13031 10571 5235 -1441 -11518 -19189 -17054 -7625 -25 6224
388 6224 12191 13512 6585 -2971 -10972 -14106 -10362 -2139 4438 11003 17112 15587 5768 -2643 -6382
403 -6382 -11294 -12921 -6247 2176 6474 9397 9153 2544 -5632 -10307 -12216 -11943 -4923 5178 10247
418 10247 11494 10559 3894 -3648 -5492 -6258 -6636 -1352 7594 9536 6579 4393 1472 -5711 -10370 -9719
434 -9719 -7567 -2720 4705 7715 5908 4138 1795 -5917 -10119 -5579 379 3025 6661 10222 8153
449 8153 2743 -2031 -7098 -9758 -6468 -2177 -289 4143 8946 5887 -601 -3458 -5917 -10289 -7975
464 -7975 -445 3673 6651 10686 9691 2760 -2161 -3722 -6518 -6260 -921 3275 4650 6222 5199 -1298
480 -1298 -5531 -5107 -6989 -8314 -3094 3893 4955 4077 4954 1755 -2753 -3331 -3162 -2356 2462 7623 6686
497 6686 4098 4451 916 -6069 -7088 -4176 -3789 -1987 3222 3512 891 88 -1587 -6555 -7003 -2191
513 -2191 -505 502 6573 9239 5208 2522 1478 -2003 -4792 -1730 1194 1570 3580 5595 1754
528 1754 -2285 -3932 -6544 -8501 -4836 -708 -51 2989 6770 4008 -1238 -1349 -938 -3301 -2252 2371
544 2371 4878 5113 6026 4333 -500 -2799 -3221 -5398 -5218 -728 1503 775 1299 1960 -1227 -3419 -3005
561 -3005 -2534 -1955 1350 3729 3109 3056 2932 -543 -3147 -1231 -177 -1271 381 4159 3346 506 -77
578 -77 -1021 -3957 -4174 -1917 -694 747 3463 3937 1130 89 -750 -3087 -3669 -849 561 146 2631
595 2631 4589 1563 -1824 -1460 -1174 -2806 -2059 229 1945 3170 3210 690 -1153 -762 -1731 -3883 -1530
612 -1530 1897 1856 1559 2537 1220 -2331 -2618 -2069 -3357 -2540 1132 2528 1838 2500 2165 -302 -1636 -582
630 -582 -1276 -1373 1572 3534 1534 841 1647 106 -2491 -2577 -1682 -1767 -6 1296 -47 -260 32 -821 -2714
649 -2714 -1196 52 -257 1314 3705 2710 313 480 530 -1232 -1436 -111 725 1333 1975 685 -369
666 -369 -936 -1543 -3423 -3164 -724 408 361 1267 2034 86 -687 -74 -384 -862 437 1797 2160 2280 1802
685 1802 486 -710 -1201 -2122 -2586 -928 807 555 -108 745 310 -968 -1650 -1424 -950 -491 1254 2079
703 2079 1563 2000 1206 81 -562 -518 -346 -563 99 893 488 -209 55 -446 -1584 -1356 -706 41 358 465
723 465 198 -160 101 -840 -987 256 791 760 1416 2454 1729 70 -776 -759 -1272 -1296 -540 137 608 807
743 807 503 -712 -861 -1346 -1801 -1552 215 1259 1069 1349 1906 1484 192 -197 -462 -658 -231 70 264
762 264 551 -72 -449 -637 -1032 -969 -915 -212 754 809 883 623 509 263 -207 -259 165 642 1137 552 104 480
784 480 -288 -1271 -1241 -207 -231 -429 232 730 455 287 -434 -535 -523 -304 -5 544 974 552 425 285 292 -422
806 -422 -640 -456 449 264 596 590 544 -226 -514 -901 -1382 -933 -709 -118 639 762 353 -59 17 -27 -406 -203
828 -203 225 338 759 328 243 93 -197 -848 -943 -448 -266 -49 -118 -10 247 -35 -103 -236 109 597 556 585
850 585 526 309 -269 -618 -581 -471 -855 -628 94 695 -32 -164 417 14 -464 -665 -59 176 330 449 462
871 462 590 160 -311 -617 -52 -429 -668 212 48 155 -80 -74 132 -319 -343 -78 244 514 774 475 200
892 200 89 81 -632 -364 183 369 84 155 344 106 140 -139 -476 -272 -290 -54 -338 15 242 -323 -195 138
914 138 -160 -388 -108 305 387 143 192 397 -14 -411 63 215 353 146 -113 165 220 -321 -538 -340 -168
935 -168 -260 -36 102 483 318 309 -168 -193 -208 -131 -134 362 314 156 37 236 157 5 -342 120 95 224 -41 77
959 77 504 -328 -489 -417 -91 -433 -560 155 466 376 369 -48 21 -53 354 -43 97 354 314 174 194 229 181 -319
983 -319 -864 -367 -245 -438 -809 -206 34 -60 -254 -78 253 113 73 397 261 305 142 152 175 115 243 130
1005 130 393 62 -276 -250 -161 -412 -511 -499 -130 -243 -443 -192 319 490 230 -138 151 258 136 321 459
1026 459 733 902 460 -66 -113 -170 -272 -302 -342 -294 -564 -283 -363 -448 -148 -169 -257 67 407 605 289 589 506
1049 506 286 249 564 208 57 12 -71 301 -144 -368 -216 -196 -306 -467 -566 -227 -398 -130 6 224 303 48
1071 48 306 783 583 244 171 234 252 15 -305 -195 -34 -162 -331 -238 -400 -53 -117 -471 -185 -320 -62 33
1093 33 363 329 476 489 685 547 282 100 207 -167 -435 -46 57 -212 -269 -521 -230 67 -161 -567 -323
1114 -323 524 -308 147 190 423 147 -33 209 256 168 202 -85 75 81 -212 -289 -48 178 -67 -360 243 78
1136 78 -61 -241 34 229 21 66 37 103 46 10 -200 -97 31 -159 -210 82 12 -290 8 50 -182 -268 -91
1159 -91 -431 -11 131 -150 20 87 456 197 -202 9 95 -162 -299 -253 -111 138 -14 422 187 55 16 -468
1181 -468 -96 9 -305 -210 170 88 106 -12 375 44 -87 -80 68 -41 -95 -73 2 138 46 -171 -111 -59 -78 -72 -435
1206 -435 173 -168 -151 -64 299 432 123 206 331 371 -158 -90 -170 -25 134 27 118 224 324 -37 -255 -86
1228 -86 -53 -368 -325 -194 -132 192 340 110 96 113 89 29 5 -116 -45 -8 140 46 -28 72 214 61 -162 -154 -122
1253 -122 19 -285 -66 -65 564 203 39 -19 26 312 267 58 -146 206 -39 158 132 -180 75 -107 -201 -349
1275 -349 -420 -199 0 -110 344 38 9 271 56 135 -67 52 -256 11 48 220 255 269 55 31 174 -158
1297 -158 -243 -230 -90 -311 -107 -35 201 26 -8 205 -17 -103 -59 -54 296 -58 167 220 83 382 158 -164 150
1320 150 -77 -78 -232 -50 -64 -54 -210 10 46 66 131 74 -129 -223 27 -376 296 -56 -41 368 32 -21 66 56
1344 56 -191 276 -39 -23 150 226 -75 -227 -6 -57 39 -6 -52 -147 163 134 17 -51 89 11 -116 -227 101 186
1368 186 13 87 53 -147 -4 -3 132 1 -43 -21 205 -279 -176 -420 -110 172 165 189 112 4 58 89 -213 109
1392 109 -23 86 -232 448 133 -73 154 196 0 -256 -137 -388 65 -271 -259 -124 -57 12 119 40 99 -156
1414 -156 -478 -64 -181 -144 155 -47 -16 15 329 -17 -237 -238 -13 -245 -340 125 182 25 -191 232 -81 -45 111
1437 111 -164 38 -35 -169 80 -10 276 103 160 55 28 -384 31 15 -160 22 9 164 217 -81 117 -125
1459 -125 121 20 -143 120 -199 0 18 246 209 -113 -143 38 -438 -368 151 -179 -11 -33 64 260 18 0
1481 0 54 112 216 78 -96 -57 293 121 93 53 328 -79 -262 52 -411 -235 -148 -243 -11 -216 200 88 -5
1504 -5 69 -101 -98 72 284 -65 -94 -105 379 113 148 149 18 -203 163 35 -71 176 -209 -238 -170 251 37 -88
1528 -88 4 -34 45 -109 -25 61 125 -12 255 47 -99 181 -264 192 46 -254 -334 -17 -85 -133 -88 21 154 90
1552 90 98 -225 -417 100 -47 -213 -174 17 118 6 244 82 316 117 -188 -3 -164 1 -68 -253 -157 41
1574 41 -199 -20 -37 89 -384 40 63 41 -37 148 -54 115 140 12 -128 162 49 -182 266 172 161 54 201
1597 201 238 -206 -131 -9 111 -133 -113 274 144 158 -5 42 6 -37 72 -301 -150 256 20 27 112 238 90
1620 90 76 -276 -29 -65 86 -163 -216 -21 -176 295 93 231 184 147 11 84 52 -134 72 325 249 -101 194
1643 194 166 -60 -94 186 -173 5 -155 -70 2 86 -66 -186 -20 220 75 -71 390 -302 -31 160 -51 136
1665 136 66 57 -65 132 189 -90 177 95 -58 -90 -172 -47 -53 -275 0 71 6 -221 -191 -116 124 197 41 -5 -39
1690 -39 -132 116 113 -70 204 -9 -88 -148 145 220 243 -84 99 -101 -57 -123 -15 -100 -314 -259 97 204 131 154 188
1715 188 40 133 120 183 -224 -84 -27 61 474 2 -32 15 209 -191 46 15 224 223 35 52 18 5 -76 -191 -5
1740 -5 63 -49 31 -57 179 128 70 -106 -32 63 25 -37 -24 -263 20 15 -124 -24 241 220 -4 -76 -224 163 -186
1765 -186 -97 -132 11 100 62 245 -117 -88 -129 29 101 43 -68 146 96 -19 125 76 -160 -205 180 129 49 -51
1789 -51 298 -149 -91 -62 186 -62 -122 271 2 336 43 -185 112 -115 -68 144 57 295 18 -132 50 224
1811 224 -24 -22 -122 83 72 193 -134 -192 131 51 -193 -21 -206 -161 86 -29 -1 -23 189 0 233 -148 -5
1834 -5 -141 -29 173 -135 -154 -332 -77 -11 145 81 -118 -7 36 -16 -156 -48 15 -60 -58 90 -84 -10 -97 -136 48
1859 48 -74 -97 60 -86 -193 152 -207 210 199 58 -8 38 -152 17 -35 -238 -58 -50 2 -106 -240 -165 -82 -65
1883 -65 72 -225 -246 319 -187 275 53 94 -120 247 -185 -35 151 -1 -163 -33 345 -15 1 54 -218 74
1905 74 -87 -33 51 -241 223 -74 211 -183 -43 52 107 -117 -227 43 215 24 -136 -13 105 -59 -65 151
1927 151 -26 -203 -173 112 -84 -171 -254 -161 105 -56 -9 -64 -194 -112 -52 -152 84 -119 -176 -12 -100 -46 -73 249
1951 249 -49 60 -145 -143 5 -66 277 -184 14 11 -79 237 -14 -246 218 36 -302 -9 331 194 259 50
1973 50 -21 80 -203 -205 -158 -56 278 179 -13 -71 -284 -32 85 -116 36 -65 -95 -17 -111 64 41 61 -26 196
1997 196 85 -215 8 -51 87 80 -29 -59 -132 18 271 -54 -217 129 145 107 96 101 54 10 -278 -25 -19 43 68
2022 68 -31 87 -205 59 -6 -74 132 174 -172 -79 -343 11 -120 -166 64 -48 81 -49 49 -139 -87 -41 25 -215
2046 -215 -3 -307 170 -331 0 263 -74 377 -84 121 -463 114 -325 -2 293 -54 0 -104 157 180 -56
2067 -56 120 -57 -53 -168 -174 -121 -33 71 -8 47 109 -101 -29 85 -143 126 -65 -38 15 106 123 275 -30 -19 -8 -42
2093 -42 -16 172 112 -28 192 -92 75 33 -100 -207 -75 94 124 189 35 -203 135 -13 -62 43 -260 -56
2115 -56 -155 326 -12 -29 -81 13 -20 -13 152 -39 -52 -34 -185 102 -178 64 2 87 59 161 90 -131 -56 153 -54
2140 -54 123 -292 119 40 -74 30 -75 -103 23 -56 -5 -49 236 20 2 -24 7 91 -9 211 178 234 -34 15
2164 15 37 -68 4 -19 -108 259 -76 -90 -265 20 198 53 12 -35 -170 112 79 145 236 -206 39 129 -48 64
2188 64 77 -221 26 176 220 -87 -209 -195 225 80 18 69 14 122 149 -110 12 145 -149 57 67 -4 20 -244
2212 -244 326 -137 171 -126 21 -399 182 -40 22 34 -39 97 -15 141 -261 -58 8 36 28 138 -13 -61 133
2235 133 -52 -154 46 334 -117 -170 -75 170 -173 -61 77 46 -101 32 -130 -17 -63 28 -152 -112 268 34
2257 34 -57 23 244 154 280 255 -63 -227 -103 41 121 -56 69 35 139 -147 141 134 255 -57 -14 -257 -102
2280 -102 -13 -132 168 -137 332 -103 74 158 87 -148 -166 42 53 -139 -107 -30 9 -19 -166 -110 -113 -218 23 111
2304 111 44 288 -92 -24 55 -94 20 11 133 35 -152 -230 -52 -294 92 -51 112 52 12 91 31 -306 168 -5
2328 -5 -97 -56 19 80 31 107 74 111 182 -36 -69 -203 -118 -26 -59 -58 -137 346 -91 74 -71 34 -113 -51 13 -155 138
2355 138 -53 485 101 -79 171 -275 -14 246 84 -36 -37 -38 -122 12 35 -58 -15 -103 137 70 52 70 97 435
2379 435 4 262 -57 -44 96 87 12 234 162 -256 4 -124 -204 42 -48 -83 -37 5 51 -18 66 82 45 18 -181
2404 -181 -29 11 165 -25 29 -42 56 -85 237 -104 19 417 -188 -67 2 -97 260 345 53 131 -541 -6 72
2427 72 84 100 19 131 -215 -62 -103 -11 -254 92 58 122 -239 159 173 93 -26 58 34 254 219 -211 28 20 -74
2452 -74 -73 -125 -48 30 26 158 -267 -81 185 -192 153 96 -296 14 230 -10 62 38 -131 48 -139 283 228 116
2476 116 -131 144 149 -95 -182 -24 71 28 227 -5 63 -155 36 36 14 166 116 -103 -193 -164 59 -84 -108 69
2500 69 -27 65 53 -30 105 -215 101 38 15 31 -13 73 73 129 56 80 117 -125 -119 64 8 55 244 -40 -2 -169 -26
2527 -26 54 -103 184 180 231 239 -202 85 28 54 505 -46 -40 361 -54 107 211 121 -112 -179 -60 113 210 296 283
2552 283 175 106 84 38 146 -10 -79 57 -37 -59 101 126 -31 72 146 39 -42 -279 210 -100 -7 -149 38
2575 38 41 190 78 -46 133 55 26 59 88 103 30 -133 -129 185 -86 44 195 -103 -111 104 63 -97 71 -80 4
2600 4 -51 -150 16 -175 108 -260 -135 -85 -141 -171 54 -206 16 191 -121 -69 104 -128 169 50 -219 36 203
2623 203 -207 -122 -26 120 59 -57 149 -137 -14 2 -28 169 -163 64 -87 153 -214 254 308 -105 -100 91 -57
2646 -57 -145 102 -147 65 -105 6 66 -152 -12 -29 172 291 8 -23 -22 134 -27 -108 7 33 -36 163 24
2669 24 64 -167 -101 -109 159 -22 -238 -200 51 160 169 -147 -64 42 -249 110 -75 77 331 -142 -111 122 -236
2692 -236 197 100 -115 -171 -5 295 194 -107 114 -74 76 -44 50 -102 -307 -161 -207 -78 19 140 -157 -246
2714 -246 -232 -31 9 -211 30 30 103 58 -111 -170 -62 237 -82 -46 41 169 -142 64 -379 96 158 23 58 111
2738 111 110 23 106 -16 210 172 115 236 -480 57 92 -38 82 101 -62 -76 -34 -28 160 18 6 195 -259 -28
2762 -28 200 22 32 -160 439 73 -158 -220 -40 -288 -25 14 15 -6 -31 -177 -83 -6 -54 155 224 292 28 254
2786 254 117 12 -75 -150 -191 -25 129 277 -133 -120 55 -92 269 45 -27 57 358 -13 158 -78 45 82
2808 82 131 -13 303 130 -121 -49 155 24 -121 -271 -12 29 -177 243 -117 179 -133 30 287 -65 -78 3
2830 3 30 13 179 10 -58 -78 169 -51 230 64 -169 -156 -113 56 59 84 37 54 184 234 1 94 82 75 15 -113
2856 -113 262 -15 59 124 78 176 137 -6 3 114 199 129 143 102 104 -6 -104 -187 68 38 32 -4 -115 -105 -219 201 108
2883 108 -272 -302 -148 139 -229 -52 20 -152 -126 364 69 -68 -3 45 -61 36 146 -27 110 54 -67 171
2905 171 -366 -215 -238 113 340 -62 45 18 -120 173 -62 -2 83 150 -340 -155 21 80 439 291 -115 97
2927 97 125 137 -199 -13 56 35 -146 -85 77 -157 -120 -80 -98 -80 -187 -39 228 359 103 -146 131 251 46
2950 46 -23 411 333 86 -40 71 199 115 -199 -8 430 -11 -37 -162 237 -88 -112 -97 -163 -148 134 -62 65
2973 65 -46 101 -143 -133 -84 -92 -23 -130 -179 9 7 102 -83 93 -73 10 -59 26 7 -82 138 134 193 -117 -126 56 130
3000 130 46 4 212 97 214 206 116 4 -392 14 -63 -74 -58 -215 90 -37 -137 -219 -197 281 -164 -40 -123 -58
3024 -58 200 -204 -113 131 133 167 -93 -218 194 15 -79 138 115 -17 33 -84 -332 59 169 274 -81 104 47
3047 47 179 -64 -149 -73 217 -162 108 61 84 -75 150 59 157 22 24 243 -223 85 -196 -187 -114 -112 23 -160 150
3072 150 0 -191 88 25 -150 56 150 -13 3 71 51 -46 -23 -116 -68 16 13 216 129 10 41 26 90 -102 336
3097 336 158 -266 -139 57 59 -52 7 -203 4 -48 -112 265 262 138 -25 -71 59 33 39 -192 -12 145 -234 -75
3121 -75 -188 -97 -25 -125 25 -24 -110 166 4 -72 -9 -33 47 -71 136 -92 -104 38 -70 113 -192 -23 92
3144 92 -7 104 -18 -57 -132 33 -38 281 -149 138 -16 138 31 68 -28 -35 -156 46 -93 -3 82 -117 -9 -108
3168 -108 89 -421 116 -146 176 -21 -86 161 -66 82 144 -78 -162 204 -174 -38 315 158 -125 266 231
3189 231 -3 -56 89 29 178 -44 127 76 -20 -31 -15 -121 198 128 128 -170 519 180 127 -60 194 -145 31
3212 31 -17 -342 145 143 78 -180 132 -41 -158 -5 187 191 58 204 -43 28 312 104 -109 48 -80 30 -24
3235 -24 -186 26 59 -124 91 -4 1 119 397 -148 31 29 -71 80 -256 1 -36 36 -162 110 158 -47 296
3258 296 -39 -79 91 -195 -79 154 -149 -121 58 14 -216 151 210 83 54 -24 139 -112 -178 142 195 -285 242
3281 242 -62 -4 -142 278 201 -210 172 -123 237 -89 53 -40 72 199 42 104 -14 -80 73 -141 -284 -243
3303 -243 24 125 -265 -71 239 -6 -123 177 -20 27 -199 -133 -95 1 -13 169 -16 -40 94 191 175 -94 122
3326 122 182 67 -26 105 -67 -208 -126 144 171 -97 14 -31 66 -350 110 164 -151 -130 -144 39 -132 148 -101
3349 -101 -34 102 9 71 -125 161 -87 -2 -147 164 90 -415 -160 -188 -32 70 -3 -91 -23 -165 99 -40 -88
3372 -88 236 -13 15 204 -180 -33 216 52 217 -31 234 -94 -165 94 -117 13 90 13 -19 377 -128 312
3394 312 56 -122 25 -338 -126 179 155 243 -133 6 214 -55 55 -50 -31 82 47 -274 131 112 79 139
3416 139 131 75 -29 52 -52 212 -54 -147 243 115 75 14 -39 48 -25 -4 -119 175 167 89 -39 54 -223 174 254
3441 254 257 255 63 381 -220 -135 -10 -6 -134 89 21 177 141 -28 99 68 -251 35 121 34 35 -31 30 99 149 -212
3467 -212 -354 1 -271 -52 -38 -10 -191 -153 -17 -75 99 92 8 62 -227 -63 198 146 30 -180 30 -241 -35
3490 -35 62 19 207 14 9 43 -67 -78 25 -38 -25 -47 -106 40 57 -54 -28 20 -43 -121 -96 143 -17 -6 -16 243
3516 243 -322 106 -74 375 110 162 -262 -30 82 253 121 120 86 -11 125 -226 -80 203 88 36 -247 -194
3538 -194 248 229 36 -100 -93 -226 2 -221 320 36 11 -150 37 18 219 -216 -8 -134 -242 63 -95 266
3560 266 -280 51 -45 -154 22 160 58 189 282 63 40 125 -44 -32 -88 -8 -73 97 51 -67 -316 -114 -33
3583 -33 -136 81 -163 -325 68 -68 73 93 135 -67 199 68 -98 352 -107 89 110 -93 -188 73 93 8
3605 8 -114 156 6 -399 -187 -68 285 -70 -249 26 274 -11 -73 216 -79 170 -259 -78 25 -53 150
3626 150 -55 53 -225 91 -49 -39 -58 197 21 -182 -9 -111 10 45 191 -33 91 3 100 -127 471 2
3648 2 -211 176 148 324 -1 -92 118 -35 183 -151 -164 69 -78 -141 14 113 223 -116 75 -125 55 -82
3670 -82 -308 79 86 -81 52 61 152 24 26 -155 135 -83 79 -240 -279 -1 21 127 -123 -42 22 234 187 10
3694 10 -72 -160 -198 -15 -115 -7 -64 194 -32 30 314 -124 116 -105 -156 -60 -47 74 -143 -76 70 82 -204 -274
3718 -274 31 -144 -164 -178 328 186 113 118 1 89 235 1 -345 155 -146 201 92 31 -23 42 -82 36 -148
3741 -148 -215 91 -7 -68 -160 187 65 -144 -97 82 -100 71 -226 -160 -144 -16 -50 4 234 49 -22 -183 67
3764 67 130 90 -55 84 -74 -4 124 -105 67 144 -150 86 -32 -194 -40 228 126 -197 -70 -32 81 45
3786 45 87 -261 -232 -172 175 19 -36 -21 -86 -341 -98 -27 53 255 153 -281 -156 201 40 59 50 88 225 -128
3810 -128 32 69 123 46 37 -76 146 -94 67 -155 19 62 112 -51 -87 53 -13 48 -59 -38 -48 97 1 -64 151
3835 151 147 -148 258 -70 -39 -366 -45 -50 -12 -312 55 -10 167 -18 -43 174 170 123 1 163 -141 28 -122 91
3859 91 13 -46 -42 -197 -44 -267 -101 -25 291 -54 -21 -113 304 160 4 73 -199 146 -21 -82 -70 135 -28 51
3883 51 -15 -43 -136 -18 -153 82 -115 -83 167 135 -168 149 56 225 95 -23 82 -199 383 -103 130 -144
3905 -144 94 162 -234 -32 161 -183 -38 221 4 21 -284 74 -70 -214 48 -133 236 -56 -42 -26 -30 -71
3927 -71 -103 -226 -47 124 171 -71 196 32 241 -59 16 17 -272 154 229 117 -71 -122 133 135 -5 -91 174 222
3951 222 45 -299 -41 66 -109 208 -176 70 53 -99 163 85 -19 37 -121 -290 -186 283 164 37 -215
3972 -215 -54 -12 281 230 -94 0 -26 -123 51 231 -144 -80 -25 141 -105 -162 -60 13 -108 37 134 -22 209
3995 209 222 235 -11 -86 -37 131 -24 131 -110 179 180 40 47 315 210 175 96 147 178 -117 -76 -164 -115 173 -52
4020 -52 -43 176 278 -39 -6 -239 -200 -271 -74 58 146 103 -111 -65 -149 45 40 -505 131 -136 -34 -30 193 -32 -181
4045 -181 -22 -31 93 30 -125 -44 46 -248 -65 -281 74 -128 -49 286 -87 -51 114 -189 -167 90 -3 -68 7 -15
4069 -15 120 -165 -170 237 48 -36 -18 -130 51 119 -501 -6 66 31 -63 -81 -1 -67 -51 168 162 154 237 44 -18 -150
4095 -150 69 62 -6 66 291 22 273 -106 17 56 151 27 -90 -82 -175 -96 -43 39 68 -109 35 34 44 21 -108 -56
4121 -56 138 -90 -14 -75 -150 13 273 38 -195 28 -92 19 -29 -298 -116 -60 -22 50 -57 -5 -56 65 109 -117
4145 -117 -25 -101 -167 -149 55 71 127 131 279 61 -13 285 -143 236 140 -54 107 -26 -4 -114 -214 -239 -18 16
4169 16 53 28 -105 37 39 49 18 -117 -63 31 48 129 171 -20 90 -154 67 -192 43 4 246 115 129 1 58
4194 58 102 69 89 335 312 -9 -83 95 152 -265 126 34 -106 -84 54 -22 -71 -44 -4 -26 317 356 28 215 47
4219 47 -30 42 -45 -210 -187 -1 79 -145 -167 52 -71 99 -318 40 80 -124 281 86 83 -11 -44 252 -107 5
4243 5 177 75 -16 112 66 100 191 78 -269 74 56 -101 -33 -136 21 49 -204 -81 -65 132 -260 113 -163
4266 -163 233 -175 -47 -99 214 -118 -209 6 -32 101 -56 139 -147 -134 193 48 -168 -37 2 34 11 -83 242
4289 242 -74 89 -126 -177 -22 1 -57 -47 -36 106 -71 144 94 124 -3 226 -219 -60 128 -111 172 -94
4311 -94 207 -20 -63 -149 -4 -176 -174 -94 -218 -24 -27 65 10 350 155 69 -53 153 43 271 100 -388 141 -7
4335 -7 -180 292 70 201 -1 -120 87 74 -187 68 -51 -109 -82 40 -71 275 328 -32 -33 244 -19 -18 -68 265
4359 265 27 86 175 -292 -212 7 111 -108 71 133 -143 -5 -192 110 -113 50 184 400 -35 222 134 -99
4381 -99 86 -117 174 -152 -99 -111 -6 64 197 -54 118 -105 -302 -32 98 -180 356 5 -54 164 -119 -159
4403 -159 -93 -115 -70 -231 207 100 221 -153 -108 84 39 102 -7 -31 -60 73 -222 97 -67 -347 -159 56 72
4426 72 -3 -191 -87 -21 -229 -70 -178 -143 -55 -45 129 75 -211 -58 105 -46 -223 84 -151 -161 -111 83 72
4449 72 8 130 -10 -26 -125 98 80 247 52 -128 -50 -124 74 139 -168 36 -61 118 -200 -81 141 141 -155 -44
4473 -44 -66 63 -88 -226 172 -108 -27 -127 -204 88 -86 118 84 -29 15 30 -65 -80 -282 120 323 -210 -43
4496 -43 -87 415 136 -101 23 127 42 -315 190 139 37 51 113 -117 -353 67 -142 42 30 -249 249 -248
4518 -248 -244 -149 -62 47 -157 178 -139 170 -34 104 14 25 50 -228 247 162 148 47 119 233 -108 28 -157
4541 -157 -46 205 38 185 -95 -104 -179 136 18 -12 -430 5 267 279 -50 -151 22 -504 99 149 -8 166
4563 166 100 -96 228 194 -145 115 51 -82 107 55 25 -73 -146 -11 -120 184 170 53 -142 -151 -10 144 133 432
4587 432 200 50 61 26 -57 158 3 107 -15 136 63 242 82 -100 -77 237 -238 -184 132 140 132 30 35 -87
4611 -87 78 55 298 -333 -8 277 146 -319 5 241 -265 -224 59 -31 -292 330 256 176 -87 -127 -410 431
4633 431 -86 150 180 -45 -61 -229 41 61 47 -27 -302 -22 -167 -182 47 52 -207 52 -56 115 35 125 73 -196
4657 -196 143 -11 -195 -204 -26 -34 262 35 -58 31 -2 -8 -184 202 -32 20 182 -2 -41 -41 -108 -118 -166 -31 142
4682 142 -63 47 204 91 -11 -91 104 343 -4 -156 41 -8 29 -210 -52 -96 103 -36 -22 -41 -215 -118
4704 -118 120 201 27 163 -155 88 93 53 -203 115 81 -240 -14 92 52 289 80 26 -60 -30 246 165 -27
4727 -27 -60 81 -57 70 -96 -157 -295 -25 -43 139 -91 -18 33 -306 -24 68 0 231 -53 38 -86 203 4
4750 4 85 -169 -10 1 -137 94 -243 105 64 -336 -187 71 -54 -152 -212 -51 6 56 10 252 47 84 33 -114
4774 -114 8 -36 -215 96 -41 154 34 -240 -27 60 145 89 138 166 -196 46 -119 119 112 -16 -82 274 49
4797 49 -204 -78 -87 155 78 -69 70 -277 -4 76 189 -197 -48 73 -104 269 257 -28 -191 13 -26 -62 -79
4820 -79 134 -3 5 -173 127 205 -142 20 -163 -120 24 274 -65 188 -100 -73 3 -235 -63 66 -84 89
4842 89 20 222 -143 56 -123 75 -4 -297 97 -129 181 57 49 -8 74 3 -135 -145 128 325 -63 176 -90
4865 -90 -88 87 -144 -179 -15 -125 -146 19 -109 220 -51 25 257 188 51 112 3 59 -41 -21 165 -33 -209
4888 -209 -6 42 -81 55 128 15 284 -116 102 -154 -4 66 -4 -127 -38 209 -229 -116 53 -82 192 88
4910 88 283 88 -30 -49 -79 73 -53 -43 -220 69 -201 231 -91 56 -290 -17 -157 63 -43 231 -66
4931 -66 281 133 0 92 -183 131 88 -118 -46 -82 -17 51 108 247 -146 244 43 -5 34 12 -192 285 -80 48
4955 48 -173 -65 86 342 106 1 32 12 -87 54 -17 -102 -68 -42 -119 -20 70 339 224 -86 16 -491 12 -304
4979 -304 70 -90 -216 16 -42 254 -499 -32 108 40 -12 -29 208 100 -33 43 9 58 72 145 -419 225 35
5002 35 -59 146 -150 49 175 39 170 349 -33 55 60 -176 289 139 19 66 21 -267 -2 -294 65 43 -156
5025 -156 184 -45 -275 129 208 -43 -16 155 -254 71 -89 232 1 35 -80 -8 -100 -209 -46 169 -91 -112
5047 -112 -43 71 -41 88 -73 -122 30 -56 -3 -41 85 154 -328 21 -134 -116 -25 -3 -149 13 -26 1 30 -79
5071 -79 -137 -128 68 -51 91 -45 238 79 261 -33 31 174 -114 193 -23 -4 117 78 171 85 218 3 -121
5094 -121 -29 103 -42 53 122 103 -165 -34 -27 -28 243 91 -270 -415 -25 4 36 -12 95 87 -80 -79 113 118 40 135
5120 135 257 -83 -4 -26 -98 -37 -123 194 13 57 -5 21 54 -59 -148 -198 78 -162 -282 261 -108 -107 -23 74 95
5145 95 177 116 23 -16 -49 116 -109 -145 -32 -225 52 -72 27 -266 126 -139 -94 -35 -225 -105 174 71 -119
5168 -119 9 218 170 -133 -18 63 -339 170 -131 -50 140 -137 133 3 78 -23 -158 52 -243 64 -108
5189 -108 -88 79 -57 193 -265 158 -103 -179 -99 -70 -11 -39 247 70 -4 -99 19 106 13 -67 189 6 65 152
5213 152 68 102 179 -286 0 -214 132 -29 -196 -106 56 115 -84 -32 12 95 5 201 -64 -207 200 97 -26
5236 -26 -5 137 212 -62 26 -120 -190 73 -163 -39 -115 275 123 176 -134 -54 -101 35 -114 -31 -53 -36 -51 65
5260 65 -2 100 -128 4 -5 -230 -85 143 -45 -105 8 -309 -46 -107 -186 -206 32 -89 174 35 -18 -7 6 -129
5284 -129 -159 -56 28 -36 -136 -101 157 28 161 156 80 -330 86 41 -259 -241 -188 -173 -111 -5 66 14 141 10 -113
5309 -113 94 -19 107 172 30 -130 160 -359 -154 -346 55 -112 132 -37 -43 289 -26 -25 46 -171 -203 94
5331 94 63 138 56 198 196 -186 17 236 59 -72 57 -101 93 -56 -111 -109 -112 48 78 70 -147 -66 167 -48 174
5356 174 14 -185 96 247 265 135 22 7 101 59 -83 161 -175 21 8 43 -35 104 82 -278 261 161 -122
5379 -122 -171 -142 -243 -146 223 -325 -77 55 164 -16 -202 126 -139 -2 -156 -77 197 -64 -143 -153 74 144
5401 144 -14 105 379 309 6 278 186 -141 -11 36 46 34 130 -3 -126 -112 205 56 -1 16 -91 -64 -7 55
5425 55 97 -72 89 110 67 -12 248 -72 -36 -40 -105 -157 82 120 200 50 297 72 -26 18 -160 110 0 -55 45
5450 45 -32 -20 99 -197 129 18 -292 -164 21 10 57 -278 -95 -44 -33 -171 -118 91 70 -40 102 223 -193
5473 -193 72 25 160 -114 42 224 76 171 175 79 36 -468 150 -123 -67 160 72 80 8 118 70 26 -146 165
5497 165 96 32 172 -3 120 10 -74 -146 168 189 91 83 -349 -224 -141 154 136 79 -16 28 -179 -5 221 -54
5521 -54 231 -268 -159 -82 -147 70 -132 -56 19 5 -113 23 264 69 158 -164 -60 34 -93 25 165 -80 -228
5544 -228 44 -2 -207 -147 20 4 94 -135 -103 73 11 -14 8 187 80 -38 -117 -115 20 101 -338 -208 166 -5
5568 -5 132 -260 237 -30 96 -71 33 -157 72 129 -90 122 27 107 4 129 -221 130 46 -15 -86 108 48
5591 48 -35 -257 31 112 -15 196 -56 184 151 242 155 -85 165 197 -27 11 -312 53 29 -90 91 48 78 -327
5615 -327 -104 -217 -272 -18 -15 58 -53 -101 77 94 -93 -47 47 100 66 -240 -47 3 172 34 68 15 263 -123
5639 -123 41 -273 193 21 -264 -101 -174 231 -47 1 77 107 -82 68 -104 181 -382 -212 283 15 -69 265
5661 265 85 76 -208 -229 137 56 -170 207 117 -152 15 -133 -70 3 229 187 -105 -208 31 -253 11 46 68
5684 68 -133 231 57 -185 -145 -70 67 175 42 -123 121 -74 -122 -86 -41 -11 -107 59 226 -132 -201 -239 30
5707 30 113 15 229 -26 83 51 -183 126 -193 5 -122 278 -117 -33 -49 70 342 -142 -342 62 152 -10
5729 -10 55 -91 31 75 -110 50 -29 117 -68 -239 -7 72 101 179 31 -168 -152 -387 -141 86 -242 122 -176
5752 -176 97 97 -137 59 28 -37 125 21 96 63 186 9 0 -24 91 214 -123 -177 3 100 156 -25 104 -29
5776 -29 127 -158 -60 -163 -143 81 -143 -54 -215 25 190 -30 -38 74 -43 240 161 -284 -200 -20 84 151 140
5799 140 -99 67 349 -244 47 -160 112 254 56 -203 135 104 137 95 49 -38 -38 184 39 -11 -106 124 167
5822 167 91 104 -12 105 -154 286 -133 44 72 -75 63 -46 49 355 149 -140 -227 59 -83 3 -43 -56 42
5845 42 0 79 248 297 102 -110 -84 87 120 48 109 -207 -47 -52 -23 53 -235 -51 25 20 3 99 178 -144 326 277
5871 277 194 211 -229 -23 -16 37 47 -77 56 117 -51 -39 86 -59 -122 206 66 85 -182 -141 135 -11 458 -197
5895 -197 318 -112 -28 -171 -289 -17 -355 -9 -215 -234 140 18 85 -188 74 -69 272 -4 -172 -106 49
5916 49 -151 -95 -73 -91 23 -151 -145 38 140 107 1 -16 43 142 -151 17 13 -25 -132 -134 149 104 35 109 238 49
5942 49 -2 -25 -357 74 -297 -25 -9 140 12 -197 -110 102 -280 276 -237 42 132 -71 26 58 64 101 -119 -197
5966 -197 7 22 9 -134 419 -291 211 21 157 -63 -81 -241 175 290 -29 191 68 37 -76 -355 -45
5987 -45 -198 3 104 -72 -97 78 281 38 -216 21 71 117 13 61 184 3 18 130 50 -63 186 117 -118
6010 -118 74 80 92 90 -223 -7 117 -119 -25 30 -27 229 -35 81 -35 -5 -101 -229 224 74 -88 41 65 -87
6034 -87 52 171 35 -34 17 -81 82 103 -6 119 -56 -111 176 39 -26 -194 254 -127 -205 -150 -65 -315 143
6057 143 250 254 -94 59 35 170 -85 257 24 -8 138 213 -151 -131 -2 -44 -34 249 -7 -62 -173 1 6 -65
6081 -65 50 235 13 -181 58 -34 -109 99 146 22 -43 137 -277 201 121 -54 -16 148 250 157 -152 148 41
6104 41 61 -175 -47 179 -17 133 -20 73 -351 323 -111 118 -223 154 84 47 -77 -62 -6 -18 -116 -179 80
6127 80 -131 -261 -159 -130 40 234 124 5 -66 117 -45 218 78 228 243 -45 92 -50 183 100 163 -13
6149 -13 -195 199 -246 -201 83 58 -199 169 79 -355 -167 39 -43 -112 -189 143 376 18 -85 -38 124 45 -44
6172 -44 -150 -41 -29 246 124 -10 -209 86 63 -128 158 -220 -6 46 -69 -9 79 223 81 66 -126 -27 172
6195 172 9 -94 69 -26 -3 -119 118 114 -62 60 22 -144 82 -228 44 356 272 20 -72 -51 161 101 -20
6218 -20 -10 -15 -108 -165 73 -34 -130 12 -247 -88 -48 7 -53 -276 178 8 -98 151 141 -33 101 123 -175 108
6242 108 49 58 294 188 71 187 -23 8 69 151 -102 -3 -175 -167 -217 106 -103 -188 181 211 41 112 -12 -96 22
6267 22 144 -5 177 10 121 -101 -74 112 30 13 -184 5 -91 -110 8 -124 46 120 135 27 -59 -346 -147
6290 -147 52 -104 -64 96 4 -96 88 -136 99 -31 -211 24 27 34 -190 333 -85 112 -89 -158 27 -146
6312 -146 -88 51 -99 59 126 252 -1 119 106 -190 -42 70 331 94 159 -63 -7 -110 113 -88 59 64
6334 64 302 -17 -293 110 125 35 -7 -105 -36 -128 136 -112 -77 56 -102 131 -90 -140 129 165 1 14 66 -63
6358 -63 190 237 -34 79 -68 74 148 148 112 178 -124 -282 -35 63 141 27 -24 -130 -99 -90 122 -27 -38 69 -115
6383 -115 138 131 235 -27 -97 -131 5 47 28 131 7 23 277 3 -39 -115 150 -315 -80 168 -140 26 -197
6406 -197 -57 -5 -57 -73 62 98 84 -80 89 -235 -68 -168 -134 -289 -1 -43 164 233 -60 -33 -34 -306 64 -46
6430 -46 -243 132 -105 -221 136 -273 -1 83 -120 37 -52 133 117 7 -70 141 85 -76 77 -69 -14 284
6452 284 -137 202 -68 12 -291 35 -147 -117 -115 171 44 78 107 -156 125 246 71 -12 38 -38 108 -70 -61 143
6476 143 221 -54 -51 14 -271 91 50 -21 49 -11 -229 17 -77 136 54 15 109 189 36 -44 -186 102 257 -49 62
6501 62 -62 -99 21 -135 -140 -99 -99 217 58 71 126 149 23 -86 -78 -294 204 -50 -13 -6 11 -109 -12 9 -132 21
6527 21 -58 -66 89 -36 -13 213 -48 254 -57 -140 -179 -47 140 -49 -32 -95 107 58 41 -38 118 187 -12 51 349
6552 349 -44 182 23 83 0 -118 15 -117 140 -69 207 -72 -92 -36 184 136 -181 43 -122 106 68 -83
6574 -83 46 158 72 -106 238 -119 349 36 -81 -90 168 460 226 31 67 -159 -252 16 -88 -159 -65 131 -280
6597 -280 104 16 -36 14 161 93 149 -177 151 -215 63 -48 296 272 93 -130 115 -33 -46 39 -111 -11 -262
6620 -262 117 13 139 -24 193 -17 -147 -475 237 30 -88 41 -96 74 -44 196 -174 -69 169 -73
6640 -73 80 -96 46 -68 66 -110 -281 -308 -285 99 -23 137 -117 -330 98 139 -242 246 -297 -56 -222
6661 -222 34 1 68 269 187 -127 172 54 83 -167 10 117 -364 10 -92 143 -205 153 -98 129 -103
6682 -103 3 112 239 -52 -47 -57 19 66 51 100 -87 68 337 -304 2 -38 -221 -198 -157 -10 209 158 -112 -83
6706 -83 193 172 53 150 -5 -94 -76 -38 156 -148 -239 140 -277 -165 95 115 -92 120 106 191 121 72 -100 -94 98
6731 98 21 -250 -152 -11 159 109 2 1 -165 68 -40 6 -9 -116 69 305 55 273 18 -76 188 67 69 4
6755 4 -69 134 65 -2 233 -44 -144 291 249 85 -60 -169 112 -97 -80 41 15 122 80 -91 -66 15 -129 -134
6779 -134 -235 -49 -149 245 57 105 -18 123 -21 236 34 -65 65 -209 -132 -95 -245 243 149 -8 -74 -241
6801 -241 118 -391 101 -63 197 191 -90 -12 -149 -69 -196 86 425 -68 -39 -141 -27 -55 -22 -25 -78 119 -65
6824 -65 -184 287 -84 215 55 116 5 -107 -103 94 113 -132 40 -243 141 201 69 40 -450 233 -18 -202
6846 -202 134 -183 108 -95 -214 122 -45 -132 -131 254 -197 -214 -96 -13 230 116 106 -102 -28 134 23 -8 -35
6869 -35 54 143 -104 9 262 -5 -91 -63 202 -33 225 -179 22 -253 144 138 39 -172 67 -105 294 26 -312
6892 -312 -335 -29 -115 67 194 -74 -14 32 -63 88 -200 -107 -10 -61 -219 135 -28 -184 -46 -311 15 -115 -141
6915 -141 5 -103 140 -70 -361 138 270 -193 -116 -147 156 -64 -343 -354 156 2 279 -204 32 159 105
6936 105 116 56 -137 69 92 -46 -6 -164 -63 120 124 103 -130 -98 -35 6 -138 -175 136 117 183 38 34 -187 215
6961 215 82 259 -152 121 159 -71 261 407 119 184 3 333 156 -163 -7 159 -82 270 269 87 93 -157
6983 -157 -210 -195 279 -127 157 -116 110 -131 52 -268 -57 56 -44 -304 -236 -228 254 186 -105 -25 45 -9 -98
7006 -98 28 12 184 -238 23 48 133 -162 373 -225 -181 -47 -109 -237 -42 74 -76 -47 -52 154 66 -73 -5 -234
7030 -234 -64 -3 215 58 128 -91 -267 258 -191 111 -287 39 -262 294 6 -286 -49 37 6 -264 -202 -114
7052 -114 -129 47 302 6 173 316 -188 56 27 249 -56 71 197 -142 -224 -3 84 -150 -157 103 -57 -21
7074 -21 -58 335 -63 91 30 -304 0 -127 70 -38 -159 31 169 37 165 -4 -167 98 -166 -26 99
7095 99 58 91 -286 49 -17 85 -45 52 46 -3 -50 -189 -104 3 11 30 -138 -83 66 -79 -81 -51 155 -125 -75 -349
7121 -349 17 -181 33 -195 154 206 -177 -84 -131 -29 19 6 -77 101 152 37 -51 231 -340 174 -4 189 -92
7144 -92 -161 -364 -14 118 138 -54 11 -88 -23 166 -81 97 88 80 51 13 5 118 261 82 165 37 8 120 256
7169 256 208 -60 -8 118 -87 69 80 -54 249 -202 -142 -122 -168 30 125 47 6 -61 29 -134 105 98 -54 311
7193 311 -27 41 378 37 -13 -37 -1 216 -218 -50 40 87 -191 -74 259 166 -107 -120 147 128 59 82 73 -111
7217 -111 192 -102 -14 42 -27 -338 1 -12 -185 25 13 2 -95 295 -262 -121 -1 -163 165 -1 -233 119
7239 119 11 67 -104 -202 190 163 3 188 -125 14 170 40 185 172 -182 -301 220 23 49 -89 152 284
7261 284 -114 -35 -127 2 93 -71 35 -239 -16 47 40 34 -357 217 86 247 -256 150 131 -53 216 71 -205
7284 -205 -371 357 40 227 -78 268 33 53 15 60 -147 -182 -60 102 -154 -10 272 -46 -117 -8 6 268
7306 268 -25 259 -60 103 15 38 207 21 115 -138 252 -87 111 -216 104 89 50 150 -11 51 81 -85
7328 -85 74 165 122 -42 191 44 -14 -241 -48 134 104 318 126 56 224 76 -224 -140 101 161 96 -9 -156
7351 -156 -115 2 199 -248 -133 224 1 244 -49 17 -185 120 -156 -166 -203 -68 134 -195 -6 -172 49
7372 49 -169 1 -109 20 109 -19 111 259 -173 -260 144 -24 139 -2 159 -166 128 -35 -92 -146 -218 26
7394 26 -267 92 92 -82 -90 -213 -136 -268 80 287 193 -35 -244 -96 -48 -157 -453 29 157 67 -55 101 -108
7417 -108 181 -29 134 83 -16 119 119 23 226 -220 125 87 211 217 -34 -196 -52 -37 45 245 225 -347 128 4
7441 4 -37 69 -191 60 229 118 -70 79 153 120 -6 -100 345 310 0 -31 81 72 101 -138 -51 71 102 -231
7465 -231 58 -137 87 -50 7 -285 -18 -144 -295 90 -157 -80 -99 -85 159 -109 -163 -29 -36 68 165 -94 -298
7488 -298 111 56 -169 -85 41 -107 80 306 -97 204 0 61 92 -125 -70 203 13 154 -60 -12 68 -79
7510 -79 -64 -22 -36 154 62 -215 -12 -92 140 7 21 -177 -3 55 -288 -176 -35 -100 -161 90 295 55 -167
7533 -167 -1 55 97 -1 -28 -159 -147 20 70 364 -224 143 -49 -45 320 327 35 -60 106 113 255 -25 156 77 -42
7558 -42 -50 425 8 -348 -286 -37 8 150 31 -63 -75 70 -96 73 111 -180 -92 -200 28 313 -28 184 -194
7581 -194 337 -213 -231 -83 27 128 -36 21 153 -113 -220 -124 -250 -63 -90 -61 28 133 -89 328 -197 -137
7603 -137 45 104 257 293 143 -138 -271 -213 -132 173 -47 64 19 64 -32 42 -2 273 14 -11 33 -20 58 138 175
7628 175 -211 131 96 -254 -23 -89 -293 59 -12 -83 -260 -33 -106 305 -114 63 152 277 104 201 146 -41 -106
7651 -106 -46 -72 18 -75 -38 75 -178 -252 -140 -57 178 -33 39 118 -92 -235 -17 -217 307 2 58 -138 213
7674 213 124 279 265 -256 -27 -163 -78 -203 90 -150 -28 -141 -70 -113 -275 -64 -21 238 -9 -127 350 -129
7696 -129 51 225 238 -304 -148 -20 33 83 -323 -58 2 -196 48 25 -5 118 -341 -71 337 107 122 -87
7718 -87 -332 -94 75 25 -27 188 -117 -37 65 6 -5 56 9 -39 -124 86 30 -100 -37 -100 174 -236 -163 -180 3
7743 3 373 63 -146 207 14 282 3 -6 -2 -200 71 -95 116 167 361 60 38 241 -83 41 -39 -180 155
7766 155 3 76 -91 44 47 82 4 109 135 -73 133 59 -112 -169 42 -67 40 -249 -233 -124 42 212 434
7789 434 137 -166 113 -13 -186 -306 -78 -5 -12 -88 65 161 261 -111 -67 223 18 -170 -224 -1 88 195 123
7812 123 -75 156 -80 242 -216 217 -33 232 123 -108 -39 248 146 -12 -115 29 -154 117 -74 -41 127
7833 127 47 -146 -74 124 -162 46 -154 169 -69 153 72 -56 -154 -53 323 207 14 31 -87 29 265 227
7855 227 60 112 51 133 26 -231 87 35 -60 -7 47 231 -42 179 135 -48 -120 -238 -50 25 59 -42 -103 100
7879 100 -80 105 68 -93 -50 -130 134 67 -14 -155 -58 245 -300 344 50 54 -60 -167 -91 -251 177 -47 354
7902 354 3 -36 -56 205 296 40 -50 -68 190 141 -179 -49 84 -10 -44 -60 236 77 -15 -267 -118 -31 -204 184
7926 184 5 192 -56 122 95 101 122 -30 -27 -29 -55 213 152 -184 96 109 -149 63 -98 271 -155 162 81 -61
7950 -61 -65 207 44 -53 59 39 40 -158 -134 76 90 125 -43 67 -214 67 86 423 -215 236 51 -272 142 -127
7974 -127 220 -233 -194 -306 47 -69 34 -52 36 96 -64 -90 8 53 72 -143 -55 -35 8 -177 85 -218 230 42
7998 42 54 -228 205 -115 -133 6 -8 -50 18 275 159 62 7 -81 -223 -212 46 138 -95 137 182 -20 -121 72
8022 72 -109 -117 -3 -1 24 51 -106 -133 51 -236 -146 -37 -79 -10 47 19 -33 -55 92 137 -75 57 -208 251 151
8047 151 -283 -105 58 29 81 -181 -66 -17 -98 -126 65 -131 -3 -27 -17 -24 67 -219 193 139 305 -258 15 -126
8071 -126 32 13 266 3 132 -21 75 -7 105 -407 -194 -175 -14 -73 118 66 193 144 -101 235 -161 -105 17
8094 17 125 34 149 55 -51 94 21 -90 -9 -94 221 169 -205 -208 32 -6 -31 100 -74 133 -58 -1 153 144 109
8119 109 246 -9 66 28 63 36 167 150 104 325 49 28 -144 -57 -81 -128 116 56 299 -46 -137 160 -62 -71 10
8144 10 -4 -177 124 -91 11 -215 -113 -109 -427 -42 -120 11 213 30 -100 -57 28 68 78 0 156 -39 155
8167 155 -177 -31 -156 59 264 -132 164 145 -38 -95 324 49 -42 305 9 -105 105 -147 -43 -44 -119 196
8189 196 68 -168
8191a68
##END NTUPLES=NMR FID
##END=
