##TITLE=1H_DE-136_21_TFA
 200.13Hz, CDCl3.
 8 sc
 
27.3.2026
##JCAMPDX= 6.0         $$ Bruker NMR JCAMP-DX V2.0
##DATA TYPE= NMR FID
##DATA CLASS= NTUPLES
##ORIGIN= UXNMR, Bruker Analytische Messtechnik GmbH
##OWNER= pz
$$ XWIN-NMR		Version 3.5
$$ Fri Mar 27 14:45:11 2026 Russian Standard Time (UT+4h)  she@DPX200
##.OBSERVE FREQUENCY= 200.1313
##.OBSERVE NUCLEUS= ^1H
##.DELAY= (6, 6)
##.ACQUISITION MODE= SIMULTANEOUS
##.ACQUISITION SCHEME= undefined
##.AVERAGES= 8
##.DIGITISER RES= 18
##SPECTROMETER/DATA SYSTEM= spect
##.PULSE SEQUENCE= zg30
##.SOLVENT NAME= CDCl3
##.SHIFT REFERENCE= (INTERNAL, CDCl3, 0, 14.3821)
##AUDIT TRAIL= $$ (NUMBER, WHEN, WHO, WHERE, WHAT)
$$ ##TITLE= Audit trail, XWIN-NMR		Version 3.5
$$ ##JCAMPDX= 5.01
$$ ##ORIGIN= Bruker BioSpin GmbH
$$ ##OWNER= she
$$ F:/spectra/data/she/nmr/H-C/1/audita.txt
$$ ##AUDIT TRAIL=  $$ (NUMBER, WHEN, WHO, WHERE, WHAT)
(   1,<2026-03-27 14:43:52.93 +0400>,<she>,<DPX200>,
      <created by zg, POWCHK disabled, PULCHK disabled
       configuration hash MD5:
       00 E9 B6 7A A2 85 ED C7 34 08 36 98 17 FE 4E 26
       data hash MD5: 16K
       D7 1F 97 FD 24 C7 F8 37 2E F7 21 4F 7B EA BB 18>)
$$ ##END=
$$ 
$$ hash MD5
$$ 72 39 C0 B6 3B 23 D9 04 D9 3A 09 86 32 72 05 02
##$RELAX= 
##$RELAX= 
##$RELAX= 
##$RELAX= 
##$RELAX= 
##$RELAX= 
$$ Bruker specific parameters
$$ --------------------------
##$DU= <F:/spectra>
##$EXPNO= 1
##$NAME= <H-C>
##$PROCNO= 1
##$TYPE= <nmr>
##$USER= <she>
##$AMP= (0..31)
100 100 100 100 100 100 100 100 100 100 100 100 100 100 100 100 100 100 
100 100 100 100 100 100 100 100 100 100 100 100 100 100 
##$AQSEQ= 0
##$AQ_mod= 1
##$AUNM= <au_zg>
##$AUTOPOS= <>
##$BF1= 200.13
##$BF2= 200.13
##$BF3= 200.13
##$BF4= 200.13
##$BF5= 200.13
##$BF6= 200.13
##$BF7= 200.13
##$BF8= 200.13
##$BYTORDA= 1
##$CFDGTYP= 0
##$CFRGTYP= 5
##$CHEMSTR= <none>
##$CNST= (0..31)
1 1 145 1 1 1 1 1 1 1 1 1 1 1 1 1 1 1 1 1 1 1 1 1 1 1 1 1 1 1 1 1 
##$CPDPRG= <>
##$CPDPRG1= <>
##$CPDPRG2= <>
##$CPDPRG3= <>
##$CPDPRG4= <mlev>
##$CPDPRG5= <mlev>
##$CPDPRG6= <mlev>
##$CPDPRG7= <mlev>
##$CPDPRG8= <mlev>
##$CPDPRGB= <>
##$CPDPRGT= <>
##$D= (0..31)
0 0.7 0 0 0 0 0 0 0 0 0 0.03 0 0 0 0 0 0 0 0 0 0 0 0 0 0 0 0 0 0 0 0 
##$DATE= 1774608232
##$DBL= (0..7)
120 120 120 120 120 120 120 120 
##$DBP= (0..7)
150 150 150 150 150 150 150 150 
##$DBP07= 0
##$DBPNAM0= <>
##$DBPNAM1= <>
##$DBPNAM2= <>
##$DBPNAM3= <>
##$DBPNAM4= <>
##$DBPNAM5= <>
##$DBPNAM6= <>
##$DBPNAM7= <>
##$DBPOAL= (0..7)
0.5 0.5 0.5 0.5 0.5 0.5 0.5 0.5 
##$DBPOFFS= (0..7)
0 0 0 0 0 0 0 0 
##$DE= 6
##$DECBNUC= <off>
##$DECIM= 32
##$DECNUC= <off>
##$DECSTAT= 4
##$DIGMOD= 1
##$DIGTYP= 9
##$DL= (0..7)
0 120 120 120 120 120 120 120 
##$DP= (0..7)
150 150 150 150 150 150 150 150 
##$DP07= 0
##$DPNAME0= <>
##$DPNAME1= <>
##$DPNAME2= <>
##$DPNAME3= <>
##$DPNAME4= <>
##$DPNAME5= <>
##$DPNAME6= <>
##$DPNAME7= <>
##$DPOAL= (0..7)
0.5 0.5 0.5 0.5 0.5 0.5 0.5 0.5 
##$DPOFFS= (0..7)
0 0 0 0 0 0 0 0 
##$DQDMODE= 0
##$DR= 18
##$DS= 0
##$DSLIST= <SSSSSSSSSSSSSSS>
$$ [...]
##$SUBNAM0= <"">
##$SUBNAM1= <"">
##$SUBNAM2= <"">
##$SUBNAM3= <"">
##$SUBNAM4= <"">
##$SUBNAM5= <"">
##$SUBNAM6= <"">
##$SUBNAM7= <"">
##$SUBNAM8= <"">
##$SUBNAM9= <"">
##$SW= 18.0517328524113
##$SWIBOX= (0..15)
0 0 2 0 0 0 0 0 0 0 0 0 0 0 0 0 
##$SW_h= 3612.71676300578
##$TD= 16384
##$TD0= 1
##$TE= 0
##$TE2= 300
##$TE3= 300
##$TEG= 300
##$TL= (0..7)
0 120 120 120 120 120 120 120 
##$TP= (0..7)
150 150 150 150 150 150 150 150 
##$TP07= 0
##$TPNAME0= <>
##$TPNAME1= <>
##$TPNAME2= <>
##$TPNAME3= <>
##$TPNAME4= <>
##$TPNAME5= <>
##$TPNAME6= <>
##$TPNAME7= <>
##$TPOAL= (0..7)
0.5 0.5 0.5 0.5 0.5 0.5 0.5 0.5 
##$TPOFFS= (0..7)
0 0 0 0 0 0 0 0 
##$TUNHIN= 0
##$TUNHOUT= 0
##$TUNXOUT= 0
##$USERA1= <user>
##$USERA2= <user>
##$USERA3= <user>
##$USERA4= <user>
##$USERA5= <user>
##$V9= 5
##$VALIST= <valist>
##$VCLIST= <CCCCCCCCCCCCCCC>
##$VD= 0
##$VDLIST= <DDDDDDDDDDDDDDD>
##$VPLIST= <PPPPPPPPPPPPPPP>
##$VTLIST= <TTTTTTTTTTTTTTT>
##$WBST= 1024
##$WBSW= 4
##$XGAIN= (0..3)
0 0 0 0 
##$XL= 0
##$YL= 0
##$YMAX_a= 153110
##$YMIN_a= -197091
##$ZGOPTNS= <>
##$ZL1= 120
##$ZL2= 120
##$ZL3= 120
##$ZL4= 120
##$ABSF1= 10
##$ABSF2= 0
##$ABSG= 5
##$ABSL= 3
##$ALPHA= 0
##$AQORDER= 0
##$ASSFAC= 0
##$ASSFACI= 0
##$ASSFACX= 0
##$ASSWID= 0
##$AUNMP= <proc_1d>
##$AZFE= 0.1
##$AZFW= 0.1
##$BCFW= 1
##$BC_mod= 2
##$BYTORDP= 1
##$COROFFS= 0
##$CY= -3
##$DATMOD= 1
##$DC= 2
##$DFILT= <>
##$DTYPP= 0
##$F1P= 0
##$F2P= 0
##$FCOR= 0.5
##$FTSIZE= 0
##$FT_mod= 4
##$GAMMA= 1
##$GB= 0.15
##$INTBC= 1
##$INTSCL= 1
##$ISEN= 128
##$LB= 0.25
##$LEV0= 0
##$LPBIN= 0
##$MAXI= 10000
##$MC2= 0
##$MEAN= 0
##$ME_mod= 0
##$MI= 1.114404
##$NCOEF= 0
##$NC_proc= 0
##$NLEV= 6
##$NOISF1= 3.799351
##$NOISF2= 2.8
##$NSP= 1
##$NTH_PI= 0
##$NZP= 0
##$OFFSET= 14.38212
##$PC= 1
##$PHC0= -3708.047
##$PHC1= 15.1923
##$PH_mod= 1
##$PKNL= yes
##$PPARMOD= 0
##$PSCAL= 0
##$PSIGN= 0
##$REVERSE= no
##$SF= 200.129724274929
##$SI= 16384
##$SIGF1= 3
##$SIGF2= 2
##$SINO= 400
##$SIOLD= 16384
##$SREGLST= <1H.CDCl3>
##$SSB= 0
##$STSI= 0
##$STSR= 0
##$SW_p= 3205.1282051282
##$SYMM= 0
##$S_DEV= 0
##$TDeff= 0
##$TDoff= 0
##$TI= <>
##$TILT= no
##$TM1= 0
##$TM2= 0
##$TOPLEV= 0
##$USERP1= <user>
##$USERP2= <user>
##$USERP3= <user>
##$USERP4= <user>
##$USERP5= <user>
##$WDW= 1
##$XDIM= 8192
##$YMAX_p= 0
##$YMIN_p= 0
$$ End of Bruker specific parameters
$$ ---------------------------------
##NTUPLES= NMR FID
##VAR_NAME=  TIME,          FID/REAL,        FID/IMAG
##SYMBOL=    X,             R,               I
##VAR_TYPE=  INDEPENDENT,   DEPENDENT,       DEPENDENT
##VAR_FORM=  AFFN,          ASDF,            ASDF
##VAR_DIM=   8192,          8192,            8192
##UNITS=     SECONDS,       ARBITRARY UNITS, ARBITRARY UNITS
##FACTOR=    0.0002768,     1,               1
##FIRST=     0,             0,               0
##LAST=      2.2672688,     0,               0
##MIN=       0,             -197091,         0
##MAX=       2.2672688,     153110,          0
$$ Real data points
##PAGE= N=1
##DATA TABLE= (X++(R..R)), XYDATA
$$ [...]
1656g0K41j91m3L16k00m7k89J60N58m73r2L7q4J32j63K39j28M88l19J6J56j74
1678G0k76N45k18k06K59M1k59mK04k69R9K80m56Q1Q9j33M28M4l20O3Ok36J10K27
1702A69l5o1J49k63L05k85K75J92o73N17J60n77L17k85j04R8J68j2p1M9m80R88
1724E41p43J54k8M6J01k27j5Q28p80k76M97k20L49k43k8K68m26L39L96j017K79
1745b05j29K30J24k8J13j84j87K81j7N0k97O7J21j54J38K89j69J59q5j99K18j93
1767e7o9L77k64K07k85L1K60l61M6J92j06m0K47k37K60K10l32m35M42m37K06M12
1789B67m39J33j12J04j84J41J59K9J3k97J03J50l5K4j03k44L38k41K11m5j73L78
1811A77k37K99l35l0L11j07j37J57n7J0k69J71KK39n9o6Oj60l4J33K19Q6m18J1
$$ y = [-70, 171, -20, -63, 253, 53, 6, -283, -123, 435, -38, -130, -93, -177, -45, -208, 31, -97, 391, 72, 88, 244, 70, -206, 339, 121, -85, 174, 215, -44, -48, 156, -113, -14, 266, -190, -109, -20, -153, 275, 319, -1, 62, 68, -168, -58, 169, 134, 73, 222, -41, 264, -21, 254, 446, -227, 290, 450, -127, 190, -95, -199, -101, 67, 55, -16, 33, -447, 541, -202, -48, -76, -30, 71, -156, -171, 657, -123, -399, 98, -122, 227, -16, -44, 224, -202, 137, 533, -484, -205, -334, -104, 20, -8, 105, -79, -266, 15, -2, 48, -249, -182, -61, -215, -77, 212, 43, 202, 117, -82, 136, -57, -126, 251, -13, 194, -91, -60, 200, -161, -115, 77, -29, -69, 178, -59, 201, 411, 79, -356, 86, -351, -145, 267, -172, -39, -151, -47, -231, -90, 69, 98, 111, -186, -83, 67, 32, 56, -47, -291, 47, -194, 17, -28, -201, 177, -60, 239, -96, -126, 185, 78, -59, 98, 41, 51, -218, -47, -45, 194, 135, 69, 75, -85, -119, 14, 233, 319, -99, -88]
1835h8j61J76J03J16k95M5J07J18k69N3k95M28O2k20J70k89J50j07J12J07m0j55
1857a72M09m14K82l36J90L0NJ73m04L08k14K75k02O9j3k18L47n9P6j38q5pJ43
1880D5JQ3j20K09j72k88M31j01j6qK9m8m0jl8o4j0P5N6J7J31k30m8p7J01n0K11
1907G8j50J05M6r7J13jJ51j61k83L3R1j14K22k9p4L59k12j9k32K85j15P2k58K37
1931D7r5m0j2K19j05J80j69q1J14o4j04J61j10j7K25k70J10Mo1J10k04J46J09
1954I3p4L9j94J92k96J81J64J7j02O9p8j51J47K72j53k11m7O3j38K8P2K45j29
1977IO3j21o4J04K41p0k88J17k60J86j29L95j27R0o9N1j63n1J99j54O8j6K32j27
2001A16k82K77r5p5Jj9K57k1k71R5Q2n8j51N2J60J6P4j95J34Qj71Q7J8j16nQ5
$$ y = [-88, -249, -73, 30, 146, -149, -104, 3, 121, -148, -95, -390, 38, 100, -120, 50, -239, -89, -196, -84, 23, -17, -172, 237, -177, 105, -231, -41, -11, -6, 167, -237, 71, -143, 132, -70, -1, -14, -232, 115, 56, 132, -6, -91, -98, 45, 46, 129, 9, 218, 46, -242, 189, 88, 72, 64, 93, 45, 5, 4, -34, -98, -108, -33, 23, 40, 171, -59, -107, -184, -83, -133, 78, -72, 33, 79, -18, 95, 94, 245, 84, -199, -166, -75, -189, 33, 4, -70, 289, 77, 58, -174, 111, -4, 68, -190, 47, -48, -88, -100, 119, 14, 194, 25, -56, 58, -6, -110, 51, -59, -76, 149, -121, -11, -7, -68, 42, -162, -16, 93, 19, 58, -136, 56, -240, -59, 105, 122, 20, 89, 11, -140, 7, 279, 126, -85, -132, -69, -207, -179, -107, 138, 9, 72, -49, -113, -9, 232, 162, -126, -9, -269, -83, -212, 183, 56, 146, 77, 128, -35, -86, 113, -41, 27, 11, 243, 116, -166, 111, 16, -59, -58, -77, 180, 159, -112, -17, 65, 7, -144, -92, 68, 84, 158, -37, 97, 105, -66, 21, 39, -77, -82, 3]
2027CL1j83L09j34K2j6o1j6k40M08k20l2J59J31k18J2p7Q2J5J71k68J13J24n2
2051F3j77l6J38j8k7K27J41m53K20j69J22N8j67j40K80M4k5n6r1J01j01M9R4j22
2075d5K38k83L24j97r4p7K57j42R4n1QJ65k08J65j52J14R8m83L57j6j01J46l1
2098H6%k97L67k99L53k09l06L95q1j60p8K52r2O4J43J18m8k69K62l2l20K27Q8
2121A64j79J03j77NL38k39j13J97J2j26l0mJ62n9N8k7j74J35k06J07N9R0r3N9
2145F2j03R1J8P9m64Q26l43k70k7M74n94L14J13Rj26l44L29N8p3l2p3l4k06J45
2169a71J78J16pk06J14K70k02q2p4Q7j86K58j0j74J97k44J15Q5Q4q1Q9l55m1K00
2193d0J07l14K65k22K6N78n49O35j98o74M86j33j45K84n29L73q8M59k03J19j93
$$ y = [3, 34, -149, 160, 26, 48, 32, -29, -45, -285, 123, -97, -129, 30, 161, -57, -45, -122, -40, -25, 146, -122, -9, 115, 63, -114, -150, -12, -30, -57, 170, 311, -142, 78, -91, 31, 89, -78, -218, 62, 106, 81, 25, -66, 35, -66, -17, 77, -45, 193, -90, 234, 37, -57, -134, 123, -19, 75, 24, 32, 197, -11, 154, 2, 116, 214, -269, 88, 72, -29, 117, 86, 86, -211, 156, -143, 210, 1, -305, 90, 9, -151, -229, 23, -69, -5, 138, 256, 208, -61, 201, 169, -151, 76, 164, -15, 88, -89, -84, 254, 15, -98, 99, 111, -15, -45, -49, 113, 54, 112, 85, -89, 46, -160, -53, 6, 96, 3, 62, -41, 50, 68, 147, -317, 509, 166, -104, -131, 343, -251, 63, 176, 185, 59, -285, 44, 102, 29, -3, -76, -110, -316, -171, 7, 123, 116, -90, 24, 294, 92, 10, -64, 23, -163, 95, 85, -89, 108, -136, -21, 64, 148, 67, 156, -199, -240, -40, 67, -247, 18, -204, -178, 400, -149, 486, 288, -386, 100, -33, -178, 106, -423, -50, -138, 321, 118, 237, 44]
2214D4l8K94k1l67M23o93M3J01M88m07j37N24o22N03k3q2j78J38J34k18q6K40
2236F0k25J49J26O2l45K91K6j56j53Q2O8Lk0Q7k40K7L98j80p4j74J88J1J53j01
2260F3p2RJ27M6k9j43p8K39r7j35J58j46q8K86k57K76j17j42L68m46K40j61J44
2283D5k20K74j92N7PQ2j2q6K37j46j94K80J14l09Q6M3j37J4J13k5o0L0O5l5p1
2308d0j05J94O5m1j53J27k4J35l03J43O4r3P7k47L51k64J52k5N5j85J91r4J42
2331A22Q5r3j36J04j24Q1L0k45K16Q8l23L78l40N9J44mj59M6K28p3r2M0j32j17
2355b17J83k7Pk06K43j69K80m1j87L41n0p6J6j61r4J24k47K47Q3m8K2j2R8k23
2379a14J20m8Po2%p6L08r0k3M6J78r5M8l77J31o3J05qj03J38j49K50j18jr5K12
$$ y = [44, 6, 300, 279, -88, 335, -358, -315, -214, 274, -133, -270, 254, -368, 135, 112, 30, -148, -10, 124, -94, -180, 60, -165, -16, 110, 172, -173, 118, 144, -12, -165, -83, -15, -12, -32, 55, -185, -158, 240, 60, -14, -188, 0, 11, 164, 63, -9, 0, 127, 173, 144, 1, -77, 162, 65, -70, 88, -58, -146, 140, -117, 159, 42, -100, 268, -178, 62, -99, 45, -175, 99, -93, -36, -29, 53, 41, -45, 192, 46, -148, 132, 246, -63, 23, 66, -71, -57, 56, 31, -29, 1, 66, 31, -40, -145, 49, 114, 73, -80, 47, 23, 158, -145, -2, 62, -31, 46, -201, 150, -114, 38, 13, 68, -117, 74, -20, 122, 207, 114, -22, 82, -42, 39, 69, -176, 40, 128, -195, 183, -157, -98, 46, 42, -117, -71, 157, 84, -8, 32, -100, -217, -34, -61, -54, -260, -17, -186, 94, 53, -134, 207, 157, 81, 97, -64, -158, -34, -281, -34, 49, 1, 23, 11, 109, -114, 6, -42, -35, -97, -97, -173, 135, 45, 22, 68, 246, 151, 199, -178, -47, -110, -5, -13, -116, 22, -127, 123, 5, 4, -91, 121]
2405A21m80M51j97L21k19J4L08k95r9o1L4Q0k1q8K21k0J83l33o2O4K11j1m7k75
2429b00P4K3L00k52m7M03j54l09O0OJ25M0k1n7r4J47J26k08K34j32j2l8r1q8J61
2454dr8J57J40L5l16J83P3j94J55k13j06R7k27M89J8k29M44l96Po5L94m50K02
2477I6J26j94j25jJ50j26O5J17k07j0J64p1m8j29J78J27L2j92o7P9O1J68k58J43
2501G8L2k89Q7R6k3Q3j67L6q9K11Nj45P9k37L10N7r4j50J66l55L20R4n4n1j93
2526a93N75l37j20JJ28J37k18J83j4j45m5L0O3O2k24J92k9P3j8q6j6J22r9o7K30
2551A85j99j81K41j19J93j38j60K6k4J38J08k24L19k32nj15kK26Pj11Jj3J26P7
2575A24o2j96M4K43r7j37j39M19k34J53k28jJ20L4n2K49k87J09j70O1l7K73Kl07
$$ y = [121, -359, 92, -105, 216, -3, 11, 319, 24, -75, -136, -102, -22, -43, -131, 90, 70, 253, -80, -142, -78, 133, 122, 75, -200, -126, -103, 197, -55, -102, 301, 147, -162, -102, -96, 29, 69, 48, -9, -103, 44, 170, -38, 196, 64, 52, 14, -77, -165, -4, -102, 55, 195, 230, -86, 97, 170, -24, 131, -82, -188, -91, -318, 171, 189, -40, 404, 8, 15, -50, 344, -106, 96, 222, 28, -97, -98, 52, -74, -9, 108, -99, -109, 55, -16, -64, -193, -15, 112, 144, -48, -115, -36, 25, 193, -65, 78, 110, -179, -92, 4, -19, 64, -103, -67, -156, 55, 60, -85, -6, -243, 67, 124, 30, -120, 46, -309, 11, 105, 51, 0, -193, 382, 45, -75, -74, 54, 191, -27, 156, 142, -3, -48, -18, 45, 107, -117, 75, 46, 119, 101, 15, -1, 121, 22, -45, 185, -14, -195, 46, -73, 120, -18, -178, -152, -176, -38, 70, -154, 165, -67, -72, -187, -189, 37, 44, -67, -66, -79, 47, 124, 62, -134, -90, 153, 56, -81, -220, 199, -35, 118, -110, -111, 9, 43, -9, 240, -47, 62, -108, -47, -84, 189, 191, -116]
2599a16J17J11j12j54K48j80o3M3RRn8J96k8j40M6P6m2P3j17J19l4o0pM5j50J35
2625c4j6j25J44K05q2j05K24j74j04oJ23N5K0j97J30j23J95N2j69K6Q8k35K27
2648A19m8r1p6PK40k89K45M6l42R7J22m0M6J12n6M2K45l11k9N3j25J13k66K57
2672G1J13n7j24J51k66K74l17J60p6J2j20K32Jl8j90K69j40O5JL1k96K02j6m1
2696i9K9K5J38O9n3L2l3N1m8j81l0K11j99Q7J06j26m1j14N1LK18k18P9J6p9K23
2722A17j01p1R1p8K30k1J01j92P9j63J04j39K87j22j53j05L33N1k61j31m7J82
2744iRJ88q7R6k47J35j76K23O6p8k14J28l8J3j2j41r6L06j37p6K76j16J33j64
2768a8k55M88k40K4J15l13J41l9J37n6J69n9m2j80K91k25K7K03l47J58o7J60j03
$$ y = [-116, 1, 112, 0, -154, 94, -86, -149, -106, -97, -88, -146, 50, 22, -118, -72, 4, -38, 35, -82, 37, 3, -57, -64, -19, -169, -34, -50, -175, -31, 174, 92, -13, 211, 37, -67, -73, 50, 105, 125, -72, 58, -65, 130, 182, 13, 39, 127, -108, 119, 71, -20, -96, -89, 151, -138, 107, 153, -189, -92, 30, -10, 36, 148, 92, 134, 379, 68, 39, 92, -33, 80, -186, 71, 184, 127, 3, 154, -112, 162, -155, 5, -71, -59, -179, 53, 54, 16, -174, 95, -45, 20, 21, 52, -244, -42, -58, -99, -70, -45, 93, 162, 109, 141, 108, 159, 111, -70, -100, 111, -88, -1, 105, -21, -62, -176, -125, -122, 96, -122, -43, -27, -106, 117, 16, -55, 36, -42, 188, 167, 268, 76, 155, -8, 96, -43, 244, 122, -31, -136, 197, 248, -13, -144, -191, -9, 0, 188, 101, 197, -50, 85, -91, 132, 198, 120, -94, 34, -4, 9, -3, -144, -240, 66, -71, -147, 129, 13, 146, -18, -273, 215, -25, -1, 114, -199, -58, -97, 40, -16, 153, 94, 52, -128, 163, -62, -35, 168, -179, -21, -88, 72, -31]
2791c1L32k02l19L59k45J72j22J90k43J71k28K30k15pQ8J45j76Q0n4R7L5j75J54
2814C6k07K29oj78K43r4m9M2o4%P1O6M2k21Q3J8r3J36j41J37j11J65O6j46RJ14
2840A47r4k6O4J03m7k92J75J54j67j16L71l37L08J4l81K63Rk22P6j49J39M5L5
2863G2j01j46J54K0M3q1K78l8j1l65J94k4J11k14J68m7o4k1L47j93l7q5n4L4m7
2888a07L16m36J83O7N9o8j58Q1J6P6N1j44o9O5K9J59L3L3j37Q9p2j69K25r5k61
2913b34K55N6j09K9P5j37K08j59l4J09J55j34j32j32J55J57K0k7k49J21K28l01
2935h0J78k94N4K09j19J80q9M4j76o6K16O4n6N0o9j45j48L23mM2K8q2l4L0j56
2960a00J25Q1pj98j8K61L8k78P4J87n55L19J90l1jr6o2R8Q8j53J14K24k52j11
$$ y = [-31, 301, 99, -220, 139, -106, 66, -56, 134, -109, 62, -166, 64, -151, -158, -70, 75, -101, -21, -75, 22, 57, -118, 36, -171, 58, 52, -126, 117, 23, -26, 16, -48, -48, 23, 89, 131, -90, -7, 11, -82, 54, -87, 50, -61, 104, 170, 24, 33, 147, 53, 27, 91, 194, 147, -145, 30, 184, 17, -99, 272, -65, 243, 257, -124, 139, 148, -74, 2, -147, -8, 37, 72, -29, -175, -21, -1, 42, -39, 239, 201, 190, -175, 19, -5, 106, -108, 60, 13, -51, -72, 275, 82, 45, -40, -94, -60, -107, 209, -227, -44, 23, 82, 14, -144, -63, -47, 29, 80, -64, -133, -68, -39, 120, 153, 186, 49, 138, 66, -103, 122, 27, -234, 21, 77, -32, -3, 72, -65, 143, -16, -50, 59, 214, 80, -52, -184, -29, 128, 148, 121, -128, -7, 221, -80, 98, -196, -142, 67, -52, 128, 39, 83, -93, -159, 57, 121, 65, 115, 46, -99, -247, 76, 72, 114, 142, 60, 26, 56, -100, 25, 106, 99, -99, -117, 144, 182, -96, -22, 165, -390, -71, 119, 88, 87, -9, -71, 27, 115, -38, 76, 300, 48, -63]
2984f3J32n7r0M09m18J53j11P3l6r0K96L4j93j6k33J71J04K4Lr7R7q2l4q3R6J32
3010A21p5l9K4r1o5R2Q9k12P2J02J43k21K01m2j92L83j49k85L57n6r8l7o6j06
3034a50L37j11q0j2L9j8N6Kl55L60L3j16j37L95l56O6M1j00mL21l63K26l7n8p6
3059i7k0j5J77k43J34J5j1Q0m0N5j96J51j98J18J95J50j41j6j00l9J77k77J09
3082c2k05O5J94QN4j45J64m5q6j66P3P0RJ06k7L2L8R5k47j03K47k02J51N4k57
3107a55L65k02j08J32J22J0l17J82m0N4l2KR6Qq9m0qp6k2O5j52K32n75O08p5Q4
3133F9r3J36K6l5j8m7O0jj5J2L6j99nK0K8L13l39J48k79P9J77J02k80R7J58m7
3159A03n4J0j12mN4N3K5l32L67j5j27K38k58L3r4J20j30L32l3k39L2j5J0J41J73
$$ y = [-63, 69, 12, -78, 331, -87, 66, -45, 28, -8, -98, 198, 232, 39, 23, -210, -39, 65, 89, 92, -5, 92, 10, -24, -107, -11, 121, 46, 7, 31, -60, -125, -33, 56, -156, -84, 18, 161, -60, 141, 99, -93, 290, 141, -144, 213, 157, 59, 22, -44, -150, 187, 76, -4, -16, 23, 5, 61, 63, -292, 68, 101, -15, -152, 243, -113, -47, -6, -106, -110, 211, -152, 74, 37, -21, -97, -117, -132, 45, -198, -64, -49, -60, 20, -20, 35, -161, -10, -208, -90, 105, 255, 114, 98, -2, -41, 136, -141, -32, -237, -172, 22, 30, 84, -61, 103, 58, -28, -194, -121, -51, -42, 64, 37, 69, 107, 202, -45, -148, 99, -103, 48, 102, -155, 210, 8, -100, 32, 154, 164, -153, 29, -11, 43, 11, 13, 109, 117, 28, -12, -20, -96, -118, -53, -205, 27, -548, 60, -15, 69, -24, 112, 138, 103, 85, 38, 98, 97, 82, 94, 130, -69, -74, -54, -26, 287, -52, 96, -183, -104, 73, 175, -105, -8, 150, 103, 49, 59, -53, -57, -3, 50, 75, -257, 110, 95, -32, 206, -52, -19, -113, 7, -123, 209, 176, -63, -31, -46, -36, 105, 278]
3184B78l33K9p1J3K09P3m9l33J88k91L68q2m4J23p4p5K85j77K15p7j80l77R72
3207E90k72r64J44M76K16m35L64p1j72R7l4LM9N8p0Q8L3k25K23k63M2JJ74k3j7
3232A2k0P4R8k73K02k48K49k49J03P9P5k2m9j34J70J36k24K6n2J97M5j21Jj96
3256a21j43K35J60j49K34k79N5K03l05J77j3j19k7n0L82j42k70L17k60J42M1k16
3278a48K42K48p69O34K6m49K17K35l17N2k64J91j03J88M1m9P9l0j83J23l1J0P
3301e0j35J31L1J20j71J55J0N4j23j23K9J03j85K16J04k58l3K91k37J2L3k2J84
3324A36k08J12j81J39j88K06Q4k20J82L3r4R0j35L5j2p8R8J07J9k29Q2J66M6j71
3348A9o1J44p3N8j58j3o4J10J19k30K67q3j79J62l5O4l9N0j5M2J2j76J2N9J29
$$ y = [278, -55, -26, -97, -84, 125, 198, 149, -184, 4, -287, 81, -1, -45, 78, 4, -71, 214, 37, 252, 175, -5, -382, 590, 318, -646, -502, -26, 190, -245, 119, 48, -124, -27, -61, -58, -9, 49, -21, 67, 100, -125, 98, -165, -123, -122, 52, 29, 12, -8, 66, 164, -109, 93, -155, 94, -155, -52, 27, 102, 80, 31, -103, 67, 203, -21, 5, -47, 150, 195, 74, 75, -121, -264, -29, 131, -18, 216, -63, -8, 195, -110, 67, 54, -65, -92, -142, 240, 98, -172, 145, -115, 27, 68, -148, 94, 342, -427, 207, 233, -216, 1, 236, -81, -29, -293, -102, -205, -17, 24, -25, 54, 24, -159, -36, -67, -57, -50, -185, -54, -23, 97, -74, 81, 91, 145, 22, -101, -72, 31, -154, 62, 166, -92, -125, 166, -71, -59, -26, -48, 136, -72, 40, -141, -2, -190, 16, 100, -120, 62, 95, 1, 91, -44, -9, -21, -99, -1, 106, 125, -104, -22, 144, 190, 19, -42, 102, 29, 87, -71, -84, -148, -38, 81, -149, 118, 35, -144, 18, -17, 47, 8, 58, 43, 85, 97, -79, -67, -8, 121]
3373A21J29j97pj06M1Q8l0J07l81M65k38J82j95j32K49k6O7qk34L7j03l0J46j58
3397b13K85j0j92K42k89L60K50k07j03J07o2q86O37J29j97J16k95M01j70J65l8
3418C0J63l67J76J40k0P0k92L2J87rk5r6N5q9j99L96l03J14R2k34J36j00J29N0
3442C6j48K56m0r7j2j42L46o5p1J29j31r4l3l1L21j81k9K22j36j33L0q2J72j87
3466a00Jq0J86r1J14o8N1p4p1J0L27k72J75k9J03k79J27J54K3r0j29J46r3R1q8
3491D4n1K5Q2J70l52j0M0O7j33K78j17R9l1j39J43j04j37K40k35R1O7r4J29j02
3515c0J63j47j55L12p5q9j18q0M37l0l28J92R3j97J12o2J00l32K09k61L77j70
3537g9L58l29m4J84j37k5M3K10k92J78r9J9j63L2M04k21J49m9k09o6K4j28K72
$$ y = [121, 250, 53, 46, -60, -19, 69, 39, 146, -235, 230, -8, 174, -21, -153, 96, 70, 137, 129, -105, -68, -171, -201, -55, -213, 72, 62, -130, 112, -177, 183, 433, 226, 123, 230, 168, -718, -81, 48, -149, -33, -328, 73, -97, 68, 30, 193, -174, 2, 142, 122, 192, -100, -68, 119, 110, 85, -11, 44, -45, -244, 152, -151, -37, 55, -179, -43, -143, -14, 36, -112, 144, 104, 7, -5, -147, 199, 134, 63, 192, 61, -33, -66, -97, 224, 43, 14, 236, 100, -33, -3, -85, 87, -100, -99, -179, 7, -84, 30, -38, 13, -61, -132, -122, 205, -67, 108, 79, 182, -97, 30, 184, 207, 117, -12, 134, 41, 132, 44, -7, 18, 100, 270, -82, -92, -52, 15, -118, 160, 43, 142, 111, -28, 115, 11, -126, 114, -121, -30, 37, -57, 72, -30, 133, -14, -169, 143, 68, -21, -139, -219, 218, 188, -140, 52, 145, -52, 60, -2, 98, -234, -25, -286, 91, -79, 279, -50, -94, 90, -47, -72, -29, 181, -111, 67, -32, -13, -176, -144, 260, 39, 188, 139, -70, -136, -112, -240, 32]
3560C2r6J94k82J92j40K6L2J27j61L8J48k4n2L4k16L84k65M8j4l4N7l0q6J81j51
3585e8nJ30O3k96L7O6J54n3p2K7j27J96p3J47l7J48l91O8J07p1o5J53j86R3rN4
3611@J21k75K59p2l4p2L14k77j15J57q4R4N7k26K64M9r0l4l6j39L69r1j64jl3
3636e9P0J18l20J22K03l12K56j89J80q8m1J07m9J33k05R9q3J35j53L3NK34j99
3659cp0J84k87J68J67r7m8J46l08J75L8o6rq4j22K31q5K55j24J16k41J11m9m5
3683d7p1N3K15j83J84k01J14J13j33J61j31j32K51o9j06j92K05N3J2j68J48n4
3705B2J56k40K72k41J61k56J29j02K96j14r1j61J42om2K04k06K8J79j11P0l9K07
3728B57m28K17j02k2l0O3K03j04L7l3j5K03k34j17O1o4J92l4j36M3J17K4p2J0
$$ y = [32, -64, 130, -152, 40, -100, -74, -42, 85, -76, -38, 110, 86, 34, 68, -148, 236, -29, 19, 5, -29, 28, -2, -88, 93, -58, -63, 67, 130, -166, -129, -63, 91, 38, -34, -7, -134, 62, -11, 136, 99, 247, -144, -76, 31, -40, -105, 48, -138, -45, -54, 0, 121, -154, 105, 33, -1, -73, 241, -36, -151, 6, -78, 16, 73, -153, 111, 160, 70, 36, 0, -139, 230, 139, -25, -26, -59, 11, 129, -191, -69, 134, -178, 78, -111, 69, -19, -60, 47, -2, 131, -74, 25, -58, 77, -76, -43, -38, 196, -3, -73, 111, -176, -8, 159, 62, 14, 160, -148, 27, 65, -1, -10, -94, -216, 15, -70, 185, 61, 177, -64, 47, -2, -47, -118, -65, 150, -33, 151, -50, 64, 177, 44, 205, 74, -58, 193, 124, 18, -174, 31, 84, 96, -72, 76, 22, 178, -62, 210, -31, 130, -126, 3, -99, 197, 83, -8, -169, -27, -33, -75, 129, -77, -49, 130, 19, 89, 50, 257, -171, 46, -56, -78, -108, -45, 158, 54, 91, 58, 43, 246, 12, -105, -44, -108, 84, 50, -86, -43, 74, 98, 26, 36]
3752C6j32J85O1k39j2J83J14j37R2k64l5MK00q3L9j6o2J18j94K00o2Q0K03l29
3776e0J00j06K12o4q9M0J7j28J56p9l9M9m0J39n9o9j13L61l01J39j46j5L19j56
3800G8j57n3J75N3K7j39J1M3O3k2k07K03j04q2K9J34J28j57K8P8k47J03n0P0J81
3825A86k64J64j08k1J0J34o6j42J1Q9j3o6K82l51J88P3j35K0l7R3l6j04J05mO7
3850G5m6oj61l2L37j99J46k10L5Q5K3l0O6nj02K61j25j71J73rk67j3J05J19r0
3875d1K08k34PN0O8L7p1k31K63r9J62j00m3lk1n4n1M23k57J94l06K42o4k2q3K1
3901ep0J79P6k53J10P2k01K43j83r5k6K06k9q3q8K27po3o0J78j98L4J1Nl2J85
3927A33j96oJ07j37J37N3k73R2M6J26n5j6Kq8L8j30J45l7L78j60j85J48K2l2o8
$$ y = [36, -96, 89, 150, -89, -101, 82, 196, 59, 151, -113, -148, -144, 56, -27, 12, -4, -66, 52, -142, 58, -4, 76, 279, -50, 50, -56, 156, 92, 3, 43, 60, -68, 88, 9, -30, 19, -21, 118, 59, -10, -123, 238, -63, 76, -70, -85, 234, 78, -79, -132, 43, 96, 123, -16, -5, 38, 101, 79, -128, 75, -29, -111, -82, 52, 180, 23, 51, 129, -118, -15, -65, 5, 186, -78, 86, -22, -43, -33, 101, 35, -107, -96, -7, -20, -86, 196, -155, 33, 106, -29, -9, -46, 47, 11, -93, 12, 8, 75, 29, 23, -138, -170, 167, -32, 114, -96, -61, 24, 47, 17, 83, 78, -24, 237, 112, -59, 114, 105, -162, -175, -70, 49, -41, 167, -67, -60, -10, 58, 95, 24, -207, 56, -43, 119, 19, -24, -27, -48, -102, -153, 270, 13, 207, -99, 143, 79, 57, -26, -5, -75, 104, 180, -73, 37, 109, -92, 151, -32, -127, -153, 53, 24, -59, -147, 80, 73, 10, -50, 128, -70, -36, -25, -20, -52, 133, -63, -69, 38, -99, 38, 91, -182, -90, -44, 82, 27, 11, 13, -75, -37, -167, -22, -59, 319, 159, -26, 122, 144, 112, 44]
3952D4L8k18L12O0j99P1k59K76k4q4j98J02L7K86N9m72J74J95K88n32L96l70l2
3975e0J20J60j31j70r4J72J86j73J94l19J70k84J46o53O80j85L76K6k92j00m9
3996b70oq7L32j12p5L34M41m20K73l04n47rK91J22K4M6L0j66O6n7m0R0L3J18l33
4021b26K95j1j5p3o0L8j13p4L41j00K5K25l64L7L0P7o5L3O3O8l20L82k04j57K55
4046H7k32J31J30j33J0LJ08l5o2Q6k07J04k4P2j12J36k56K22J13QL5k43J2R0L8
4071H1n5N4j72p3L64k23P9j41M2K15l12K70j28j08J02P7n9j22J89k1k8o3O1r7
4095f8R2j70J31P2j20R3J75o5k02k8OJ19p6L0j39L81j01n1k9k7p4M7or8qM33n83
4122b66J4o1M6L95MO6j21K9J27l19j4J37j93L09j69J13j10JL24m74L31k37j07
$$ y = [44, 82, -136, 176, 236, 37, 108, -151, 125, 101, 17, -181, -79, -42, 244, 303, -169, 5, 200, 488, -44, 352, -18, -50, 70, 230, 99, -71, -165, 7, 193, 20, 214, -105, 65, -219, -73, -726, -46, -231, 145, 171, -121, -221, -270, -276, -363, -31, -143, -218, 116, 557, 137, 410, 106, -441, -450, -159, -37, -13, 33, 63, -103, -37, -94, -134, -44, -11, 107, -226, 69, 58, 43, -30, -90, -52, -165, -239, 102, 2, 27, 252, -112, -75, -45, 32, -33, 0, 63, 131, -189, 193, -11, -168, 87, -145, -14, 116, -17, -7, -4, 104, 69, 7, 93, -114, -10, -34, 38, -74, 62, -194, 28, 141, 149, 184, -59, -47, 43, 81, 26, 80, -92, -165, 199, -24, 55, -86, -44, 171, -141, 129, 1, -107, -5, 72, 13, -109, 80, 59, 31, -32, 29, -68, 24, -146, -15, 57, -63, 30, 205, 140, -62, -90, -84, 35, -41, -11, -150, 231, 130, 79, 50, 23, -51, -4, -10, -108, -116, 317, -266, -252, -313, -267, 128, 132, 198, 77, 106, 233, -86, -100, 37, -156, 153, -16, 97, -13, -12, 312, -162, 169, -68, -175]
4145a75K19j25K35k94P5J86L4j77L06k33K7l3j10j07J22m5J03k72M16k02P8M1
4167F9n1rj33J29J16q8k28J43L8j13k2K02k02K60q4MQm1p0K02k03j12J48J43K9
4192A35j17J04k01K13P5m3k16R3j09L3k1j29M63l41j11J15J23J84m11L44l8n1
4214I4r0J13j19j16J26j19j6J57j79K03m3j10J6J22k88L00mk41J66k13J48N0r1
4237a34%J06j0J17k31J53J43j26J90j66n6J38l7Oj00j2J29k9p5k6o1pm4R4J21
4262H3j29j08L48k40N7j18M2K9K6J79j54l2K55n3j64l3j56J69QO9k51M03k76K61
4286B15j89j15J82o2m6n3R7l4p0r6J81J06l5j55J66N5j14k6o3P9l2L7J64l74K10
4311B8k4j79M9O6J21J45pk79n7J35K08j39p7p1O8J33p2q9N3J52j50M8mj18K08
$$ y = [-175, 44, -81, 154, -140, -65, 121, 155, -22, 284, 51, 78, 45, -65, -172, -50, -95, 8, -264, 152, -50, 28, 69, 18, 9, -124, 5, 121, 33, -195, -52, -14, -127, -149, 53, -149, 111, 27, 31, 39, -2, -72, 130, -73, -185, -37, 106, 135, 18, 122, -79, 134, 209, 166, -50, 43, -66, -33, -54, -183, 280, -61, -172, -57, 66, 250, -161, 183, 145, 94, 4, 117, -2, -118, 8, -111, -127, 30, -149, 54, 11, -99, -83, 39, -249, 51, 47, -194, -28, -241, -93, -43, -134, -134, -28, -38, 79, -152, 1, 144, 18, 208, 42, -14, 124, 87, 93, -7, -19, 110, 81, 6, -20, -81, -88, -132, -38, 83, -46, -154, 194, -46, 11, -107, -65, -36, -10, 169, 15, -17, 238, 185, 21, -12, -168, 1, 9, 78, -173, 230, -46, 215, 26, -89, 93, 31, -15, -68, 29, -5, -75, -171, 10, 116, 81, -74, 92, 147, 33, 7, -56, 23, -9, 28, 192, -182, 28, 4, -175, -126, -60, 61, 206, 199, -80, -137, -2, 206, 67, -10, -81, -13, 120, 48, -41, 12, 164, 14, 62, 58, -60, 148]
4336A48rj81J21R1j96J6P3m6k2k8M4p1J48q6k37K04J04J1k7l17J20K13m9m7J04
4361H1N8j46j51K02j06j19K95k79K60j47L8j20J11J09k17J6K77q2k02O0J11O8
4383A17j64J76n1j45p5K96j31k14L40k9j30J8K93l29o2p0J08j06K31MM8k93M3
4406a25L66K2J21k30J63j18k46K38j75L19m0m39R1J65N6k12r3K82k12L00j84k9
4428B0J03J12k78r6K89k15J5m3O9m2l0K6J61m8jj69QJ5J94j94J08j61J26J47l88
4453b72K67j34K43k2j45J03Pr3J24Q9j87K40k44L4J31no5Nj17j2K59k79J23j80
4477a30R8J41o1k06M32k92K70j38k03K74j87l3J08J1m9J53k92O2J69k51J50k7
4499aM0k31J59J09j82l1K43k23o7o0N2j10M10j52m1J43q9J49k00K87k19k1J23
$$ y = [148, 139, -42, 79, 170, -26, -10, 63, 17, -5, -33, 11, -60, 88, 2, -235, -31, 73, 84, 57, -260, -140, 73, 24, -23, 81, 139, -7, -158, 44, -62, -181, 114, -165, 95, -52, -14, -134, -23, 86, -131, -115, 162, 80, -122, -62, 49, 117, -47, 129, 78, -67, -142, 154, 23, -191, 149, 120, -10, 8, 301, -28, -90, -160, -52, -158, 73, 77, 125, -168, -125, 241, 263, 384, 154, 317, 199, -47, 191, 16, 335, 295, -144, -53, 112, 168, -44, -137, 145, -67, 233, 49, 20, 123, 235, -43, -139, 150, -65, -50, -93, -24, -66, -96, -70, 91, 43, 42, -127, -119, -104, 90, -104, 4, -157, -31, 116, -272, -5, -139, 104, 82, -63, 40, 47, -46, 78, 167, -20, 220, -24, 10, 141, 136, 71, 76, -41, -53, 206, -73, 50, -130, -32, 109, 48, -158, 274, -18, 252, 114, -89, 185, -2, -35, 73, 84, 35, 188, -104, -42, 127, -124, 26, -1, 39, -192, -33, 76, -106, -137, 106, -117, -184, -244, -192, -302, 108, -44, -85, 58, -31, 118, -82, 205, -14, -35, 88]
4522H8J43k43Q9J97k18j29j2j09K00Q5k16O2p5lK47M2m5j6j63n6J20j06R1J41
4546A14q1M0M2n2J54m48L40N6j48J2J16k91J18J20j82J41j89j2K63k11J12P9k52
4569a59J67J39j22J85k70q4J36k19J26jK04k04M7k7j53J04L37j41j90k1K58j41
4591b9p1L9%J15p6p2k7J59n4q6k0K89m36L02o2L0K1L5k70K13J66j07j32n2P4O3
4617A2j96J38j63K02q1M9q4J24l6p3mK92k68m1L4L24k68j15K09j8j47OL13k01
4641Hj72J74J66j92N9J47j90Q7p4j0l15K24k01J57P9J89q9j38l3K30l4P2j89j31
4665a76J40J16l0l3J06j87J79j95J19k17R1K93k73R8J03o6m4N2k7j3L4k12M12
4688B70j99j12P8j9K19m03K37Lp9j1j39O0J48k02r1K31p1k54K39J69k07J92J82
$$ y = [88, 231, -12, 77, 274, 56, -73, -85, -194, 6, 91, -125, -63, -138, -141, 106, 148, 103, 87, -76, -132, -12, -118, -27, 114, 33, 73, 115, 63, 217, -231, 109, 165, 17, 29, 145, -146, -28, 92, -90, 51, -138, -150, 113, -98, 14, 93, -159, 8, 147, 25, 210, -60, -144, -8, -227, -101, -102, 102, -102, -55, -82, -235, -131, 206, 65, -125, -146, 112, -29, -100, -61, -61, 54, -22, -94, -121, 38, -16, -102, -122, 167, -269, 33, -29, 1, 22, 57, -213, 0, 166, 59, -73, -125, -51, 12, -184, -46, -209, -7, -88, -39, -123, 1, -35, -108, -112, 180, -88, -129, -95, 229, -39, -154, 55, 37, -110, -104, 209, 8, -164, 10, 176, -16, 43, 190, 0, 87, 13, 3, -312, -88, -289, -132, -53, 136, 47, -91, -124, 106, 72, 144, -45, -176, -36, 80, 50, 17, 123, -64, 115, -80, 39, -178, -87, 206, -67, 31, 134, 68, 24, 76, 49, 36, 70, -142, 270, 71, -41, 37, 18, 237, -166, 71, 74, -5, -16, -155, -95, 53, -149, -240, -9, -80, -334, -95, 74, -133, 59, 241]
4711B41l06j13K22L4L1j33K4L1l83L51J43j46K48k22j09J40j68N4K21l93N7J55
4733b1J38k64J20L0N1k18N6K16k20K17k34J07o1J13j7P5rjj84J14L3l2K3j94J76
4758A4p2N0l1LL1q3J35J5J03q3Mj60O4J12r7J48m3m6Q0k41K07j46LL3J21j40l7
4785e6j85L45k33J01L6j55J01N0j92R3PJ18J33r7l9k14K12n5J00j26J52K94n40
4808a50J18O0n7j8j33O0N9J16j72K04j45J8Lm8k2K32k12o5J60l2k1K93l26m1K20
4833A01j0j0j10M9q7J63o7K2o5KJ28q1j36J57J2j45qJ24J2n1K6k23L27j30p1J53
4859H2j51J60Mj87J50k2mk4p6J9M1m5r1J64l9L5p7K17j12j19r8K90j57J6m6l7
4885a07J58m0j27P8O6J5k3j04J06R7l1m5o4K86k62m67K81J15r3J18j93K08k3M3
$$ y = [241, -65, -178, 44, 78, 109, -24, 0, 31, -352, -1, 142, -4, 244, 22, -87, 53, -115, -61, 160, -233, -176, -21, 117, -147, -27, 3, 54, -164, -108, 108, -112, 105, -129, -22, -83, 30, 13, 88, 79, 78, -106, 8, 41, 9, 32, -162, 14, -58, -8, -39, -36, -5, -88, 47, 62, 165, 82, 86, -74, -10, 102, 5, 153, 110, 64, 144, -97, 110, -36, -33, 0, 121, -19, -56, -241, 104, -129, -28, 8, -147, -46, 4, -188, -95, -88, 30, 163, 66, 27, -187, 25, -30, 70, -56, 96, 390, -150, -32, 28, -29, -47, -180, -120, -61, 55, -117, 87, -58, -40, -37, -85, -107, 125, -87, -152, 8, -24, -45, 248, -78, -119, 101, 91, 81, -29, 20, -67, 96, 29, 51, -14, -12, 116, 35, -101, 56, 68, -77, -85, 39, 51, 0, 26, -197, 130, 0, -71, 82, -69, 91, 95, -92, 58, 36, 32, 8, -68, -49, -8, -53, -144, 20, -19, 16, -61, 156, 44, -75, -173, 117, -40, -24, -70, -107, 51, 11, -116, -38, 28, 43, 20, -84, 22, 119, 88, 43, -21, 265, 3, -464, -183, -68, -161, -43, -236, -28, -51, -8]
4909hj8L7o2J71q1J4j22j37M8J68oj82O5K39l31J91j3m0O1J8P9j5K85k60p7K47
4935B71l56k6R0K7j83M1J38j11K09R2m8k77J74k75J97M6Q7j21Q2mk74L26q7%p7
4960e9j5J54J8M4j16M3k10K85j14j27J13k00K82m5O5k25J53j40L44l18J03j31
4982i6K9J2J4J8l8N9J84j35j21m9K09j05J3k86K40j06o6J15n5J16j6J16p8J23
5006I7j0j24J04p8J82j15R6j09j32J14j76J63j92J56j31J86j71K8K44k87R9M5
5028a1N8j70J98p1P0N1l96M91n9k21L01k75j7J60q9k74L31k13O8L87n02k2Q2J99
5052G6P5j8j23k23J74O2k9Kn8K4l3N5P0l2m1J90j31jJ12j24J04o6jJ25k85K54
5078A58n0m4r6j05K80j86M8o3K2p3p2J15n6K49k27J45j34N4rJ20j35J34l5m3n1
$$ y = [-8, -26, 11, -51, 120, 39, 53, -69, -206, -158, 10, 4, -178, -113, 126, -205, -14, -27, -67, -6, 12, 91, 76, 361, 101, 24, 271, -85, -111, -21, 6, -177, -136, 2, -109, 100, 192, 144, -133, 41, -234, -37, 9, 96, -25, 57, 53, -221, 105, 18, 18, -59, -74, 80, 98, 142, 26, 69, -141, 144, 30, -97, 16, -184, 98, 53, 118, -107, 46, -94, 250, -68, 35, -96, -67, -55, -41, -23, -61, -2, 182, 47, -74, -123, 86, -19, -6, -292, -52, -158, -224, -109, -164, -48, -64, 52, -26, 97, 87, -37, 67, -11, 171, 56, 152, 43, -89, 25, -151, 12, -180, -24, -155, 31, -140, -112, 132, -155, -56, -11, 47, -123, 75, 4, 74, 125, -271, 220, 161, -60, 241, -34, -51, 109, 20, -254, 77, -136, -68, 319, -183, -205, -123, 76, 151, 133, 10, -213, -39, 23, -6, -4, -62, -38, -71, -16, 54, 22, -19, 171, 40, 39, 151, 27, 131, 65, 64, 189, -96, 158, 108, 64, -32, -137, 143, -43, 5, -58, -36, -109, -181, -66, -122, 127, -100, 45, -89, -35, -44, 76, -59, 75, 40, -3, -54]
5103e4j47L17P7j74n2LL4O5J4j33Q9j63J13p3J59o5p5m3J45K3J4L9r0J05j12J69
5129A85Lj83J53l19K40q3j48K86j29MJ36j44J34K8j07k3Q0n9J85q0q6k43K26N1
5153A07k04J90K6j13R2j65J45J0j5%k1k1O4l8M0j60N5J18M4j31J76k15p3K63j44
5178C0l7J1j88P4J50j95R0M8J74k59J41J22ml4n8r9j20pP5J2r2K73r3m4K41l71
5204a60K20p9J08J72l57K84r2j48KJ81j62j00J87j44L8J28q0N3J5K5L2l27J60
5227d4N4j98N1R5J24k5j21K9ML5K28k60Q8j65R3p8J43j4j3k51L45j85O0O1J26
5252A82m13J72J45p1k05J65j64lL80r5l12J71M41J16o79J36P1n0j07L41k43N2
5274C0k4J15q3j23L03k30q6J20J86j18j37p2jJ3j8J61l6q2J88k0p5J00l74J06
$$ y = [-54, -201, 116, 193, 19, -33, -30, 4, 69, 83, -50, 39, -124, -11, -84, 75, 10, -65, -108, 37, 60, 74, 113, 23, 128, 16, 185, 188, 5, 158, -161, 79, -4, -152, 134, 5, 9, 145, 1, 135, 163, 56, 33, 113, 54, 239, 159, 73, -170, 56, 107, -97, 93, 119, 6, 98, -67, 78, 88, 73, 73, 52, 31, 95, 57, 97, -63, -8, 110, 154, 23, 199, -16, -89, 174, 30, -7, 4, -184, -110, 40, -155, -65, -17, 157, -102, 39, 161, 157, 123, 65, -34, -154, -161, -86, -74, -166, 107, 14, -30, 211, -160, 60, -19, 89, 261, -96, 188, 96, -52, -50, 131, -31, -131, 56, -88, -50, 78, -2, 51, 66, 91, 123, -204, -44, 10, -188, -137, -42, 82, 57, -64, -35, -31, 4, 232, -28, 60, -105, -12, -90, 53, 39, 26, -225, 120, -65, -5, 56, 182, -231, -59, 86, 15, -190, -25, -189, -192, 188, 93, -219, -48, 393, 509, -170, -34, 37, -13, -120, 221, -22, 30, 6, 121, 38, -85, 218, -12, -98, 22, 208, 90, -47, -119, -120, -107, -125, 36, 0, -82, 106, 86, 11, 111, -263, -157]
5298a57P8l8NJ29j82J72J63jl19Q4RN8QP6k06R2J26l15J05J50Kj46J52j58K53
5323A40J9j92J2jrJ20o5J43k63L71j38Qj90M4Q3r3J11j64M6r0J0J04j01N5m4J17
5349C3j06J17L6j20K28k55N0j7N9q0J38j28oK5P2M8Oj68L6k2jP0Q6j95J1J25m
5376C8Q9j73o2J77l9R3q6k0j23L30l34J30j69J93o4L6%P0j73J26m7L8q5J37o8
5401A4m15M11J62j46j61J58M2Q0j26J49k08O8L4p6M9j86J69o7j81J00J53Jk02
5424a78K63rk17J54j52K92j59l4N0Q0q9P8r4r9L59l17l7K21j17O2J76k27j28m4
5448a66J60K6n9J99q5q9k7r4J13j52J97O6j65m9N4J99J0l15L53j62l0k50K41L5
5472A0j8Q4m2Oj48N2k0K3q8J43K27l19K25J3q8o3k38L10kJ6r7k8J12M2m5K0%k87
$$ y = [-157, -79, -117, -112, 17, -165, 7, 170, 169, -150, -66, -57, 1, 9, 85, -121, -29, 97, -218, -113, 37, 39, -107, 45, -113, 140, 159, -33, -21, -22, -31, 89, 24, 167, -96, 275, 137, 145, -45, -1, 82, -11, 100, -64, -18, -108, -98, 6, -95, -40, -84, 33, -73, 44, 80, -40, 188, -67, -17, -34, 25, -55, 83, -45, -51, -26, 46, 94, 100, -68, -32, -54, -55, 15, 101, -94, -83, 42, 38, 127, -46, -108, 69, 30, 123, 37, 17, -106, 224, -110, 20, -149, 44, -20, 16, 16, 86, -87, 39, -8, 30, -55, 82, 14, -401, 10, 172, 26, -135, 23, 65, 145, 19, 168, -40, 28, 62, -14, 35, -151, 18, -49, -230, -130, 23, 24, -178, 85, 76, -141, 13, -139, 153, -6, -40, 10, 90, 1, 79, -15, -114, 245, -72, -109, 112, -5, 57, 233, 6, -122, -166, -6, 20, -39, 160, 75, -14, -41, -135, -22, -174, 23, 89, -76, -125, -71, 128, 138, -177, 176, 14, -16, -266, -25, 10, -8, 76, 34, 40, -108, -56, -76, -53, -141, 2, 229, -90, 135, 148, 60, -3, -241, 69, 67, 83, -14, -42, 70, 112, 67, 87, 87, -200]
5500b00L42j49M8R3k77Q5j30J71j9J23j48J02mj15l8R6m3K92m05J5J06q5K9P7
5524c4J28j8J56k1j82l6Oj83J48q8r4J48Q4Q7j80j40J94J30K9j50N1Mj74K15l18
5549b38P8K27KO8k81P8PK23l07J21j1P6mn8J99j16j15L40n29L38r9PJ20o1l7J04
5575A32k65J24J0R1r8j6NJ0J67r7j52N9J08o7O8K51l25R8j71J39k01K52m3k89
5599b10L38k00r3L67j13k53J05j44n0K37o2OM00J85m50O3k73K84k89K72j57k77
5621c14L07j32J99k27J07K30j36l9K73k08j43k2k50P3L57n17L99q5L6mLK55l74
5644b12j1J17K24j48R5R7j01r6R0j48R3J7k60L56j24k3l8R2J63l09J78k08M5J6
5668i5K83l13K0K08k79L02j74J08k5n8m6N3P7L6r2j36J08j01R7j20L6M5J66J5
$$ y = [-200, 142, -7, 41, 134, -143, -58, -188, -17, -36, 87, -61, 41, 37, -78, -116, -20, -63, 229, -176, -161, -55, -140, -111, -34, 94, 76, 232, 211, 29, -7, -1, -184, -36, -124, -218, -70, 14, 101, -79, -219, -25, 105, 134, -16, 35, 39, -135, 80, -238, -160, 67, 69, 137, -144, -66, -59, 164, -143, -22, -33, 43, 39, -19, 180, 64, -51, 289, -240, 98, -1, 6, 126, 65, 28, 132, -133, -9, 1, 92, -6, -22, -17, -7, 160, 63, -89, -30, 78, 11, 79, 330, 5, 103, -68, 71, -130, 122, 79, -210, 128, -72, -165, 202, 89, -164, -59, -203, -253, -16, -78, -72, 328, 513, 63, 126, -147, 137, -152, 120, -37, -314, -7, -139, 60, -167, -60, 170, 34, -5, 268, 60, -83, -105, -355, -282, 75, -442, -43, -128, -92, -96, -93, 162, -212, -223, -106, 118, -30, 65, 162, 61, -35, 55, -93, 0, 17, -243, 113, -11, -34, -72, 20, 183, -126, 52, -156, -111, -95, 188, -125, -105, 103, -176, 126, -48, 60, 35, -23, -69, -16, 61, 97, 5, -131, -23, -124, -27, -147, -111, -66, 100, 115]
5692A15j33J59q6j05k7j25J41J47j84J25n6j63K20Q8j31o4n3J45J23k87k0p5K34
5715a2j1K18k37K9J02l58J81J15K18l02J07J06j23J12k17J00l0j46L14j05k26
5736a65K34O1j02l1n4K3J61j99J10k7J01m9m1j10M0nK81o9k31J29j8J2j24K2m1
5761i2K69nj59J06j08O6k86P2J46J70k06J22J9N4l53K02p1o1j1O5l1j5J10m8o0
5786a05J21r9J75j18O0J85k76J6oJ37j24J04l1L5J09k91J29l5N3J44l37J23K11
5809A80k01k2K7j34K56Q1k33r2J26j1K2J09j51J29Pk64n8M01j94J06j91J8J9K15
5833A45l45K36r7l1J72j11j44J47K55j64p2j1n7k1K96j99n1P6J29j73j0j17J77
5856C0P7m1O3k21J98j13j07J23J68o8k12Q6J13mj87K35n4j91J30jl6Ll0J40k27
$$ y = [115, -18, 141, 55, -50, -77, -202, -61, 86, -98, 27, -29, -192, 28, 116, -15, -79, -132, 13, 136, -151, -171, -246, -12, -23, 195, -42, -13, 89, -269, -88, 27, 245, -57, 50, 156, 33, 145, -72, 28, -2, -148, 166, 61, -165, 69, 130, 28, -3, -57, -34, 127, -72, 38, 11, 112, 63, 22, -88, -48, -53, 228, 159, -72, 57, 39, 51, -73, -51, -92, 177, 172, 13, 119, 11, 77, -209, -137, 9, 179, -27, 95, 114, 168, -185, 17, -54, -115, -126, -61, -92, -107, 3, -45, -105, 16, -83, 92, -26, 34, 219, -57, -41, -47, 90, -34, 70, 39, 74, 183, -108, 21, -14, 39, 183, -154, -31, 180, -21, -43, -16, -150, 106, 187, -46, -138, -12, -23, -1, 108, -43, 86, 93, -171, -229, 172, -22, 84, -107, -89, -70, 145, -200, 36, -61, -92, 80, -31, -175, -28, 227, 63, -9, -20, -77, -98, 198, -1, -52, 24, 153, -20, -30, -147, 30, 107, 66, 129, -92, 106, -7, -114, 9, 177, 109, -103, -17, 96, 92, -95, 140, 86, -105, 25, 24, -12, -9, -39, 101, -126]
5881a26p4lJ94K88l51J18mk07K11l0Lp1L39l07j53K24J4R8J77m15j47J80k8K16
5905A46j10l8p5J11j82K99l88L86l0l2m7j56J83r2m4j57K88j71j35L14J4k92L46
5928A38l83L58q3MQ2r2K17k41J35J9k62J63q3J14j2K0j6Q9l29J38J46j49J15j4
5952G4j3l26P2Q9J36J52j43P0J4k83K91j73j01R1N9J08j18J59j15Q5j60r1J10
5975a3j7J34j28Q4r8M8Q7k2r9j0p7r7L35j35j0k35J28K44pj87k24M50k01J55j00
6000Ej13K5R6j79K74j11j10L77j77k71P4M3K4P5j73L6J1N9nK55k14R8M4p8k5K1
6026F1j28k8J0J71L5k00j82J91kO2K8M4J0q6O9J0j98K23l1J45j02j17j4J42k87
6051a74J65j34J63QR5j70o6K22J26j18nq4O8j74P5J2l9p9K89l62K29J15k30J7
$$ y = [-126, -200, -203, -9, 279, -72, 46, 42, -165, 46, 16, 19, -52, 287, -20, -173, 51, 65, 163, 340, -75, -222, -42, -70, 146, 36, -2, -77, 34, -148, 151, -237, 149, 119, 87, 40, -116, 67, -25, -69, -226, 62, -109, -244, 70, 84, -208, 138, -245, 113, 30, 34, 116, 24, 241, 0, 135, 154, -108, 55, -28, 86, 74, 94, 78, 167, -162, -24, 122, -27, 88, 74, 61, -265, -193, -104, 32, 184, 41, 111, 125, -158, 133, -40, -141, -50, 9, 117, -1, 158, 43, 128, -32, -123, -13, -30, 104, -24, 60, -38, 10, 97, 75, -24, -34, -111, -208, 127, -8, -18, -253, -125, 119, 112, -75, -299, 151, -50, 105, 5, -108, -83, 13, -166, 108, -3, -113, 264, 87, -184, -110, -67, -43, 32, -141, -105, -94, -35, -40, 215, 1, 99, 143, 65, 40, 61, -67, -95, -85, 86, 121, -79, -261, -70, -72, -10, 18, 62, 72, -14, 55, 65, -133, 90, 59, 204, 102, -15, -29, 113, -174, -9, -143, 20, 28, 123, -47, -113, 109, 235, 117, 112, 28, 96, -78, -3, 9, -30, -109, 180, -182, 47, 162, -68, -51]
6075e1J12j58K4Q2k04K52n7J07rk33l5K24l8K85j88j4j73J96j20J49k33k1J34
6098C1r1m7K4mJ90J5r2j26J78J0Pj53K40k12k71Q4M0L15p8o2R5l00K74QL2j41
6124c4M1J35r8j19J65j71k2M8J43j25k9j71K69m9O5j89R6M0j95J46j8J46o0j06
6148i2k0J26J7l10K53j0j28N7N2j58L40j14j2K4l2q9j79J47j3K4J51j21P8P6j6
6173E1J1J81l89L00j49j10K48k25JJ06j2l8M6l0J5K1n4L2L2j17J05J20j41J1J10
6198A25j73L2r7J58j35K16j65J4k2J04j02Pk02K98R3j10n6j52J63n8J80j55jk6
6222f4k3J50l4k28K44l7p9JJ03m5J58j55j77Q4J44P5p9r7J9J80L6j18r7k19L95
6247A37Mm6j24n3N4J25m9N6J02k78K9pKJ8K3M1o2J52k55J70k48J99ln3Q1j83J67
$$ y = [-51, 61, -97, -73, 9, -195, 57, 0, 107, 98, -135, -170, 54, 16, 301, 113, 99, -74, 122, 2, 151, -82, -103, 31, -60, -107, -83, -87, 103, 118, 26, -100, 78, 88, 95, -58, 182, -30, -301, -217, -177, 138, 60, -2, 93, -207, 67, 75, 107, -34, 7, 142, 44, -75, 90, -81, -103, -55, 88, -37, -66, -237, 32, -17, 48, -141, -45, -5, -200, -54, -72, 74, 14, -92, -112, 14, 31, -279, -26, -36, -164, -107, -55, -213, 127, 13, 1, 25, -7, -96, -275, -128, -141, -117, 34, -87, -9, 67, 51, 62, 243, -146, 154, 5, -105, 143, -82, -81, 25, 13, -25, 21, -9, 6, 27, -27, 5, 37, -80, 25, 145, 4, 15, 125, -48, -16, -113, 45, -90, 126, -39, -25, -47, 57, -45, -38, -240, 58, 151, 41, -15, -167, -4, -62, 118, -37, -38, -64, -87, 63, 29, -199, 45, 8, -71, -70, 33, -12, 146, -9, -186, -102, 42, 117, 38, -59, -40, 140, 176, 58, -39, -258, 137, 141, 95, -29, -82, -28, 97, 48, 104, 206, -72, -43, -50, -48, -30, -7, 34, -28, 124, -131, 39, -209, -10, -13, -66, 15, -168, -1]
6274aj24R6J90p4n4Q6k4n7p4J71k04m3J14K72Lm02J22N6n3N7Q1q8n2m9J02J39
6300A90k55J65Nl9Q9j12J86k38P0k15K73r1Q3j54J97j04j2K6J66k23l7L2mJ28
6324A26n0k18K13o9R1p1j08j3J28Q5J2l3k36O2j23J71R6rq5m8J88q5J28l59l3
6349b40K54J34l4j48j43J65q0L08k11R0j26J43l2l6k50K94j39J16j68J80N9j45
6371ir9K5J89k60J85k1r2j5N7R3m0N7Kr9J8L5j24R5K45l94K82k04l9K32p8j3P1
6398I9j05N4j13k63L53M8k9k55L22ll4K4J8O8j47k28j8L05k01K4J19l02K40J31
6422A07k11K02j67J93p6O1r0r6P1R2J03l15K21j10O1j85J84K6J8K6k25Q5J42j59
6446d2j1O8j8k46K54J08N2l56M09k03j05J51k51J55j25J94j04Q5j7O3K8J2M%M
$$ y = [-1, -125, -29, 161, 87, 33, 119, 95, 38, -36, 135, -69, -112, 2, 274, 277, -125, -3, 53, 0, 57, 138, 50, -2, -51, 51, 190, -65, 100, 105, 66, 155, 43, 229, -9, 61, -154, 119, 28, 111, -43, 154, 50, 38, 64, 230, 7, -30, 2, -2, 126, 76, -142, 71, 2, 93, 22, -86, -99, 29, 114, 126, 93, -143, -81, -204, -33, 63, 54, -31, -79, 109, 24, 152, -207, -240, 14, 148, 114, -34, -177, -12, -92, 216, 5, 95, -31, 112, 80, 44, -206, 88, -51, 65, -103, 77, 136, -9, -108, -83, 106, -154, 31, 10, -82, -97, -40, 53, 13, 70, 72, -27, -9, 26, -98, -3, 242, -152, 130, -74, -113, 119, 41, 28, 99, -6, 48, -65, -328, 25, 73, 44, -211, 111, 108, 74, 98, 116, 184, 37, -191, -209, 96, -105, -81, 38, -264, -24, 107, -104, 98, -69, 124, 48, 109, 19, -77, -6, 86, 189, -126, 95, -15, 46, -139, 45, 71, 89, 115, -110, -25, 117, -42, -53, 15, -3, -249, 5, 113, 165, -191, 218, 15, -90, 61, -190, -35, -160, 34, -70, 15, -2, 61, 89, 101, 105, 105, 109]
6471A09k19K56L4k55J2OJ64j50j90J89K63p1l0r9lOq4L9m5m8J87k00N8J50p9l12
6497c12L87j50J50j57j88K2K83P3o7j90K90n0k28J98N5k11P2K09l68K92L1l00
6519a59l2R1j3J3N8J06r4P2o8L9k8j21L69l08P2LK31l83J20L7nNj4l1J49j14q1
6546h6K75j47P0q1j09L9k4J27n9p7O2kj14P5q2J72J66j72j41J39R6k32J13n0O0
6571A8RJ22J0k40K82j54Ok44K56J9p7J10J14l84K96k14M3K18m07J79L5j13J50
6594C4r5J05k8j7Q0j43L06l19J0J09L9k19J13Qp8J78j37p9l8J78l78L38J92j61
6618bj62J14J6nP6m0Q3L16r92M60K91l11K00j65K67k44M0j03J76l7n4J85j21k6
6642c8K06o4r2j07J69k43J49P1j82K36k37R3J19p8L8r4Q7J9k73J71j3M02k45k29
$$ y = [109, -110, 146, 180, -75, -63, -57, 107, -43, -233, -44, 219, 148, 118, 19, 16, 22, -62, -23, -68, -116, 71, -129, -71, 79, 0, -312, 75, -75, 75, -82, -270, -248, 35, 108, 41, -149, 141, 91, -137, 61, 116, -95, -23, 186, -182, 110, 141, -159, -191, -100, -113, -100, -42, 64, -30, 42, -26, 13, -15, -136, 233, -75, -3, 0, 231, -152, -32, 5, 0, 5, -9, -40, 109, -5, -86, 189, 42, 112, 31, -78, -39, -63, 64, 5, -72, -10, -12, -126, -51, -133, 39, 205, 33, -108, 31, 127, -105, 8, -42, 18, 27, 149, 159, -81, 201, 47, 53, -191, 65, 84, 7, 117, 231, -153, 143, -71, -28, 190, -217, -38, -3, -116, 34, -61, 44, 16, -1, 79, -64, 242, -77, -67, 42, 81, -138, -25, -17, -95, 83, -54, -133, -171, 7, -371, -33, 159, -2, -164, -50, -34, -39, 37, -3, 80, 396, -596, -136, 155, -156, 44, -121, 146, -98, -58, -161, 15, -22, -76, 109, -12, -38, 168, 104, 12, -95, 74, -169, -20, 51, -131, 105, -132, -39, 80, 2, 40, -54, 33, 52, -221, -50, -63, 339, 94, -135]
6666a35J38j15L54k70Ol1J78j02K30l34m2J42j63J5J02J10k3L8j48Q7n5O9l6J30
6690A45l7j29j3r3K4nK07j79J50q5L0Q5l59K89j61P1J47o2m5J03r8Q8K7k21L14
6715A93j38k7R3n5j80J53L0j47J51n4K1R0q4j67K5J29l3j82M05j35j88K58l09
6738a51L7L6J4M4j01N5nO5K6L3J77k72J55J4j01j54M27jj67m9L1N2m5m7j42J43
6764G4k21P0n0l5K35l9N4l3q0O9j15J42j94K25j70N5j22J09O2J6K58l75P3J6R1
6789A15o8J73j24j78K60l76J58L2J31k20P4K02j50o2J26Q2n5r8M2j05N2K1p6L61
6813C17l14j4R5l10O6J86oj55J80J14j42m0m7m9O1J8k9J84j97JK07k9l4L9j86
6838h4O1j48K20R9q2rP6j44m2nJ32j32J4p8J19j8J38j99O1%j56L29k30K1m6J9
$$ y = [-135, 3, -112, 242, -28, -22, -53, 125, 23, 253, -81, -123, 19, -144, -129, -27, 83, 60, 98, -50, 37, -18, 51, 15, 145, 108, -21, -34, -127, -103, -108, 99, -80, 70, -15, 15, 100, -259, 30, -131, -60, 87, 25, -20, 83, -15, 73, 100, -121, 193, 55, 28, 121, 66, -114, 39, 69, -78, 73, 19, 40, 130, 46, -121, -96, 33, 0, -182, 223, 88, -100, 158, -151, -114, -78, -64, -20, -121, -66, -71, -6, 20, 53, 230, -42, 113, 127, 26, -128, 299, 298, 131, 82, 113, 165, 120, 73, -69, 74, -147, -77, -127, -162, 73, 34, 88, 55, -25, 44, -71, 71, -123, 102, -68, -13, -135, -26, 36, 52, 310, -65, 8, 24, 115, 47, 220, 96, -82, 178, -198, -40, -8, 123, -97, -23, 179, 29, -33, 93, 175, 120, 22, 64, -41, 11, 32, -44, 317, 3, -11, 84, -226, -160, 26, 20, -135, 45, 159, 17, -23, -70, -119, -58, -40, -69, 115, -82, -81, 126, 97, 63, 102, -84, -23, -171, 49, 148, 66, 57, 133, -11, -53, -58, 74, -58, -44, -122, -3, -21, 117, -82, -21, -21, -177, 152, -78, -57, -103, -84]
6864h4jJ25k43J19MJ08J82J7k36q2J9K47k72R4N5p3k7j1J80k11J69llk72L52k1
6890A32k69R0O2q5k0M5J30j65pj9N5J19J26l08J01QMM7p7P6o0j9N6n2j1L3J44
6917A36k50O5J39K4o1j70J60k06L41l58K68O8L3k61K74k03j68J00K47k5j05j6
6939C2M6m34L58O7L1Kk57L58k76P8l3O5j77O7J23j09p8M8K1J46J03j04jj44m7
6964a15P6q0P4mk15O4L95k88J48k1k45K94j92R0K13k41N2J31k18Q6n5N1l9J56
6988A17k12O7P6j70j16L68j24J49k02R4j83J91k44K02j13k0J13Q6l7j99K97j33
7010Gmo9J71j55J44J22K76o37J07j16J85JoK16j93j89K29J67k79K8j8r3J00J01
7034I5k72o0J5J41K00J8k24J22J71j20j60J90j91J05o1K6R5J29k96P2J41j94M8
$$ y = [-84, -85, 40, -203, -84, -80, 28, 210, 227, -9, -91, -72, 175, -97, -3, 52, -21, -48, -59, 121, -90, 79, 76, 73, -199, 153, 132, -137, -47, 15, -70, -90, -45, 85, -80, -87, -106, -51, 68, 194, -114, -13, -5, -1, 46, -31, 45, -15, -34, 22, -30, -41, -8, 136, -114, -49, 90, 114, 53, -117, 43, -163, 178, -180, 88, 156, 189, -72, 202, -1, -169, -69, 178, 153, 48, 32, 78, -356, 2, 69, 100, 102, -155, 203, -73, 5, -28, 37, -140, -73, 50, -59, -137, -89, -68, 78, 181, 77, 76, -68, -115, -39, -119, -45, -49, -264, -200, 195, -93, 55, 34, -211, 83, -109, -19, 194, -47, 5, 136, -82, 4, -51, 0, -39, 117, -95, -28, 48, -122, -238, 130, 6, 155, -47, 47, -136, 55, -189, 13, -100, -120, -7, 79, 42, -157, 140, 7, 3, -66, 105, -50, 94, 216, 492, -145, -38, -154, 31, 32, 26, 242, 49, -140, 89, 256, -23, 5, -13, -106, -6, 95, -177, -237, -222, -81, 119, 137, -87, 35, 206, 86, -74, 116, -75, 30, -31, -5, 90, 219, -77, -5, 136, -58, -10]
7057a0j6j51L02j42R9m8jj3j11N2l3k6kJ85L4l7j81j19K85k38J51L5p6J22j09
7082d8J81j96K0k8J48j15L0N5m8j2J02q5k7J4j29J78Q0j0o0J26N0l26Q0O9J3n6
7108FL5P0j22o0R6j25J77K3j25k42J95P2J7q8J84j37p8K12l13K34l8L4M9j69K11
7133A18j1j68K01k28K50l40j04K05J39j35j3J36n6m7o4k1J28l7K40l08J47L4k25
7156a59kJ84J72m82J77o0L30O1k32qN4l1k6O9J33k01PoJ3j58J47j76K40o4k23
7181b41K66N8j13K8j34J67J0rR9k83J1K0l3J84p8J51j56K03q3j75N3o3J71j47
7205i4J7P6j50l0J33MP2j84J43J08j94J40j33J54L6J61l38j3q5K47Q6r1k32R5
7229g2LK11k57N4O6K2k3L2l04L44j64J70K9j38J64l81L25j86K43l81N8J43R2j04
$$ y = [-10, -26, -177, 125, -17, 82, 34, 33, 20, -91, -39, -72, -98, -100, 85, 119, 82, -99, -218, 67, -171, -20, 15, -61, 61, -48, 133, -63, -43, -71, 77, -38, -8, 47, -1, -13, 89, 4, -23, -9, -138, 40, 120, 110, 50, 176, 226, -100, -20, 49, 62, 6, 41, 111, -11, -71, 25, -100, 77, 100, -25, -267, -72, 0, 17, -71, 113, -24, -102, 110, -203, 31, -7, 27, 76, -93, 118, 107, -61, 140, -88, 162, -178, -282, -77, 62, -73, -86, 50, -6, -53, -117, -138, -10, -47, 193, -115, 32, 66, -159, -161, 23, 195, -287, -110, -170, 160, 221, -11, -19, 35, 4, -22, 47, 180, -21, -14, -20, -7, -165, -18, -194, 46, -18, -241, 25, 83, -30, -2, -136, 31, 41, 32, 131, -152, -141, -121, -154, 30, -48, 103, -53, 150, 67, -108, -55, -118, 53, -94, -77, -1, -151, -181, -48, -44, 28, -156, -13, 95, -99, 41, -92, 62, 98, 259, -79, -92, -177, 70, 156, 65, -167, -72, -69, 142, -115, -61, 5, 27, 4, 36, -268, 76, -88, 82, 111, -27, 137, -244, 81, -105, 138, -243, -185, -42, 50, -54]
7253e4M1o3o3j88L43j41K33n9k00J14o9K30k64R1j34J44J11j5l3j51L19q4R8l01
7277i5K34j90m9J17q8K25j56j8K08j81K39k64K95j69j56J99k27M2M8j15K27j16
7299A0j39j07R3J80q8r6J49J10k43J73r4J50j31p2K03j44L9koP6j10J08Q0l83
7323b44K63M5j35M2PMN6k6j90J82Mk6o9N2K29l65K87j86J16k78K46R7J21k38Q
7348BQ1j68J88J32Rm70K01n0L6rK4l3p4n0K00k84L90j59m6J16N6j12k6J84qq4
7374D6nL8j46J05KJ47k36J74j61L07k18J73l86P5O8J62m9J41k03p3m2or0k7K08
7399DQ8j60j11J26J09q2K91k75J09o1Q5p0J3L6q5k34J44K1J51r1j7M2N9j70j6
7424i4J46m4K9L0r0N4J5j12r9L21k03L3Q3M9K6N2l3j43Q9k10J58j18L67k86K6
$$ y = [-54, -13, -76, -139, -327, 16, -125, 108, 49, -151, -37, -106, 124, -140, -49, -183, -39, 72, 57, 24, -127, 192, 108, 206, -95, 139, -51, -100, 17, -71, 154, -2, -20, 188, 7, 246, -18, 277, 108, -48, 151, -76, -34, 14, -101, 126, 10, -129, -236, -143, 37, -51, -147, 2, 112, -131, 42, -52, 98, -33, -105, 98, -46, -7, -9, -15, 61, -49, 59, 139, -244, 19, 64, -71, -29, -22, -18, 38, 12, -178, 4, 8, -18, -87, -35, 194, -171, 116, -70, 46, -232, 14, 111, 232, -6, 2, 83, -85, 103, 235, 244, -226, -25, -75, -39, -48, -24, -57, -131, -181, 19, -265, 125, -34, -80, 36, 92, -20, -46, 138, 130, 46, 41, 79, -67, 38, 40, 187, -49, 125, -36, 271, 53, 226, -160, -85, -17, 145, 96, 237, 34, -39, -81, -87, -177, -204, 4, 92, -68, -179, -53, 56, -26, 265, -10, 99, 38, 123, 53, 66, 102, 17, -217, -73, -52, 99, 8, -9, 33, 92, -78, -94, 52, 8, 37, 67, -23, 31, 46, -66, -165, 156, -47, -14, 69, 118, 144, 196, 163, 20, 109, -101, 57, -61, 306, 20, 46]
7449D6j39M3K38R0k85J65l21P6K56k98K23j57J56j67p2J98Rj77NO1J12l3O6j69
7473g4J53J2K0k6k55K97j92K6rK55j33o5K0Q0j52R7jj14P5J03Q4q7L4n7j52J44
7499H3j66P8M2k05K09M4L1r3p5K06m2j59K6k20R5J73L3k04K65l13K01M6M7q1j
7524B0M3j45K12n7o5r4J32l23R6R8Q9m0J8k9%M2L5j88L9P2j59K88q0%P6O1j37
7551DK09l68K37m4N8k07M9J34j95K98k42LK43j44r3J26J37p1l8k72J28J25k29
7574a52K42j97n2K63p0k98K81j3Q1J03m44L10jj4J26l6r4r5J16M7N4j59R9n5n3
7599a1J7q2N2k1J8J41kL5r3Pj26J62j12L2j98K85j18M5Q7j68j72J46J24j70J52
7624C0l7j1k00J05P2Jj12J37j79K05J86j45J12j05k63K30N7k2j04l1J05j6o8n0
$$ y = [46, -93, -50, 188, 278, -7, 158, -163, -87, 169, -129, 94, -63, 93, -74, -146, 52, 61, -116, -111, -50, 62, 29, 95, -74, 79, 91, 111, 85, -170, 127, -65, -39, -48, 207, 74, 9, 29, 109, -43, 54, 53, -61, 14, 117, 201, 114, 148, 91, -61, 83, -83, -5, 37, -168, 41, 85, 116, 23, -52, 154, 112, -47, -21, -241, -146, 27, 60, -144, 121, -192, 9, 55, 102, 21, 20, 63, -82, 130, 73, 8, -86, 46, -277, -181, -83, 6, -34, -16, -45, -45, -3, 32, -156, -117, -45, -204, 84, 4, 4, 80, 141, 4, 213, -155, 82, 38, 96, -111, -62, 72, -123, 175, -67, -64, 179, 35, -58, 68, 205, 134, 96, -176, -48, 77, -152, 90, -107, -159, 104, 34, -264, 17, 4, 85, 188, -256, 54, 53, 39, 165, 129, 35, -60, 56, 103, 157, -2, 97, 42, -11, 6, -76, -24, -45, -27, 114, 112, 147, 54, 61, -65, 97, -15, 17, -181, 104, -14, 31, 118, -50, -222, -76, 48, -122, 30, -7, -18, -218, -113, -41, -40, -152, -15, -194, 11, 197, 52, 164, 59, -204, 26, 83, 61, -43, -74, 31, 15, -53, -103]
7648a03Q3j08J58q5P5L51j83j19J23k91L53l84L72l43P0LJ18j12J40q6J94k93
7670f7K79m39K74j44j82L29J20j8l53J87J58r0l28K47L69l61l4j25r3L52k21L62
7692B22l47j81j5K84N41q18L28N13n35k0J23N72r00l68N84N7k77L49n42n00J167
7713B37n92M88p60P86j87J12k35N2K36k80R1L09j55J01l07o9M23m96K50j49M3
7734a02J37k6Pk0k01k0O1J00K24j27K31l52j7J34k37K57j84K39p5J27n0K4j27
7757Cp2J9j81L93j91k7N4P2m7k2J15o5j89LO1K60j82m5K9O2P1j29KJ31k86N62
7783D01o25m44Q89l44l27N57n65O67q38N35m15Q39k29m54M85m24N80k07K98j41
7803B38k30k33L09j21J20r9J29k07L16k08j04K09j95J08L8k1Lq7J35j16o7j08
$$ y = [-103, -20, -128, 30, -55, 20, 371, 188, 69, 192, -99, 254, -130, 242, -101, -31, -28, 90, -22, 118, 32, 226, -67, 212, -227, 47, -97, -279, 50, 170, 152, -201, -14, 144, 54, -274, -27, 342, -19, -53, -178, -271, 81, -140, 222, -125, -306, -321, -37, 504, -314, 14, 527, -8, -28, 95, 667, -233, -601, -17, 40, -237, 112, -430, -930, 237, -355, 133, -627, 159, -28, 84, -151, -99, 137, -143, -52, 257, 102, 203, -104, -173, 250, -246, 4, -145, -102, 35, 9, 16, -4, -205, -225, -164, -64, 160, 33, 264, -88, -105, 29, -208, 49, -135, 104, 29, 156, 106, 130, 3, -69, -50, -231, 162, -29, -56, -2, 70, 23, 1, 116, 51, -138, -135, -74, 186, 4, -41, -12, 50, 121, -8, -6, 125, -161, 401, -224, -668, 221, -123, -450, 107, -458, 209, -629, -94, -509, 330, 101, -353, 132, -292, 288, 81, 379, 238, 8, -225, 84, -37, 83, -16, 113, -94, 222, 14, -90, 119, -76, 32, 70, 49, 52, -35, 100, -16, -83, -191]
7825a91L13l8l4j41L32k03k5j3j85L24n4n9j60J15K9k00K30k48J88j70J92l82
7847c80M48k71M16n08N03l21K4K0K3o80M38N07k81J45p2Q5J9j09R1O8m0m98P23
7870C50n33k4M90q57K48k37P04J25k86r9J45j70J85J18%j57j24J69j0k59K2L7
7892a63R3l6Q2k19J04J36L2l8N2j88m6K07j35J44J9O3k98K71j00Qj2l4j5J1R2
7917C0L7j24L1n0j23J94J25k9l47J85K19m8k53k9J7J56k1k55L24j45j9K4m9J45
7941ek1n5K38j84lm7J92j25mk05J66R6l7J94k38J01P9k01J70k82O2J85Jk30K41
7966H8JJ42l50J63O7J5l14k02J70L58q4m3p1K2Q4Q4m3p8p1L7J29p0k0%m3K09m28
7993b48J69J42J31m61L91k79K14m7j28L6L5K16k32R2r9J31j37n1J43j63J20J18
$$ y = [-191, 122, 84, 50, -91, 241, 38, 13, 0, -185, 139, 85, 26, -134, -19, 10, -190, 40, -208, -20, -190, 2, -380, 68, -203, 213, -295, 208, -113, -89, -69, -46, -726, -288, 219, -62, 83, 11, 96, 115, 6, 97, 165, 125, -373, 350, -183, -207, 283, -574, -326, -563, 141, 266, -20, -119, 26, -144, 41, 159, 159, 2, -122, 47, 37, -222, -200, -163, -70, -106, -24, -243, -139, -3, 29, -9, 43, -145, -191, 16, -119, 25, 44, 107, -191, 80, -20, -12, -24, -58, -73, -62, 30, 67, -57, -26, -76, -199, -5, 120, 91, -256, -71, 148, 100, -153, -182, -165, -9, -30, -285, 39, -106, -125, -101, -150, -5, -26, -81, 157, -27, -30, -77, 115, -10, -14, -219, -53, 43, 6, 200, -38, 63, 142, -59, 111, -171, -109, 76, 77, -153, 88, 89, 231, -119, 44, 111, 126, -188, -390, -220, 138, 54, 11, -60, -38, 46, 130, 87, 9, -62, -25, 104, 34, 14, 14, -29, 180, -248, -79, 63, 194, -267, 124, -155, 59, 12, -116, -80, -45, 171, -61, 31, -68, 63, -74, -125, 18, -145, -25, 93]
8015I3K5k54J01J02m4M3k28K23R6q0j80P6p0j16J74J43j16J6K9O4k50O4O0L0K29
8040B30j39q6j17J59q5Q9n3J95L2r8Kl44K77r2R2l3J2p2n7L47l84J29O8j14O8
8065B6N8r0J33k65L08l7j18j05J62l13J34J88j57K46l66J94J00j87lpJ69J7m9
8088C8j70J35M17n44L09K17o60K39K62j87j94J82J68l26J34j01J43J70j13j15
8108Dj91J6J94QN7P4j62N2j81N8O8j47J65j75J86q7K59k43k41K09J51m7j31jP0
8133c5jO7j26J0J85j53J22o5lJ12k18M1M4l2J50J7Q40q74j78O1L1J40j46j7N6
8158B8M7j5q8j59K85j19l4K87K23m23ml5J0L06j47l95K34j1L5j11J6L9R9J3L3
8183A14K00l08N0j7m2m2l8R4
$$ y = [93, 118, -136, -35, 67, 23, 66, -162, 61, 157, 77, -103, -27, -97, -213, -39, 104, -12, 4, 33, 97, -153, -89, -29, 1, 230, 91, 5, -112, 47, -38, 51, -2, 193, 225, 127, 129, -215, 62, -30, 62, 29, 41, -31, -88, 259, -125, 4, 72, -42, 26, 84, -6, 127, -138, 170, 133, 15, -90, 72, -241, -107, 81, -76, 170, -196, -2, 98, -89, -92, -99, 70, 87, 38, -132, 3, 420, -124, 185, 402, -258, -19, 243, 56, -138, 44, 212, -114, 20, -81, 62, 232, 119, 4, -187, -171, 23, 31, 88, 162, 0, 52, -129, -71, -3, -150, 15, -160, 26, -61, 198, -45, -286, -77, 74, 27, -104, -105, -35, -36, 31, -95, -85, 100, -53, 69, 4, 1, 113, -105, -64, -20, -52, 98, 115, 955, 81, -97, -36, -5, 135, -11, -28, 28, 75, 60, -28, -187, 98, -21, -55, 232, 455, 32, 28, -7, 3, 309, 162, -233, 1, -10, 25, -86, -70, -31, 68, 81, 114, 314, 6, 56, 39, -3, -45, -83, 11]
8191A1
$$ Imaginary data points
##PAGE= N=2
##DATA TABLE= (X++(I..I)), XYDATA
0@%%%%%%%%%%%%Qj6J6j6K4l2L2m0N4o2P2q8J04j20J37j61J90k15K43k81L20l60
34a91M07m62N19n82O53p28Q11r02J002j110J228j356J497j652J821k008K211k434
52a276K684k962L270l619M013m461M983n594O322p209Q314r738J1653j4377J8600
67A0603k6091M3388j60916o4075K13931j2826k7618k6570M298L5310J22846L0705
79A42985p8107o3955L1214K6747K2833R64o4384r5759J2260P6542J2983n7967
91c3644l8408j8879P245N8306O0073k6988n2411J9873O1415K6634Q389j0898n4316
104F391l5897N0339N1825l5869o5771j9455Q573K3044L5189o735n8267j8056N0675
117a4014L8868l399r479j6630j6890K6559M7000p573m6830j6957J0097N815J1472
$$ y = [0, 0, 0, 0, 0, 0, 0, 0, 0, 0, 0, 0, 0, 8, -8, 8, -8, 16, -16, 16, -24, 30, -32, 40, -48, 56, -64, 73, -88, 102, -113, 130, -151, 169, -191, 216, -246, 273, -309, 344, -384, 427, -475, 527, -583, 645, -711, 786, -866, 955, -1053, 1158, -1276, 1408, -1554, 1716, -1903, 2110, -2351, 2632, -2962, 3360, -3849, 4465, -5273, 6380, -7997, 10603, -15488, 27900, -133016, -197091, 16840, 4014, -23604, -50174, -45876, -10566, 112280, 142985, 64878, 923, 32137, 58884, 81717, 82681, 18297, -77462, -65202, 11340, 24323, -33644, -72052, -90931, -83686, -25380, 34693, 7705, -44706, -24833, 36582, 63216, 71605, 60707, 6391, -29506, 20833, 72658, 36789, -28982, -48437, -39864, -16820, 18369, 11634, -46633, -64689, -14014, 24854, 21455, 11976, -4654, -21544, 5015, 52015, 44442, -2388, -19345, -9248, -3433, 8039]
130H039P337k9553l3311K0899M5025R135j9250j3529m970Q128K6037J0465k8827
143E625k8705N617J7588N578J349q692k1273j057K7962J5539j4893j7428m559
156a7349M319J7171J8731q206k3148L56K0815R106n665j0014j4846q853J0290
169g293J3444m743j2755l187M802R324J3519J711j7891j2675J0885J5049j158
182I032j0692r049k070J0030J4453j16j2135n314M415M356M170K796p486j2580
196a0190K125J3822N555o926r401n140K713R177K201j0926q970N470R993N129
210D632K513n44m764p01Q016N015n025q546m865j391L790N506l151j0080k620
225a2215Q561O635j836m965m104QO838O919p38l499J420L193K283K035R23o771
$$ y = [8039, 15376, -14177, -47488, -26589, 18436, 27571, 8321, -5208, -10178, -2050, 23987, 34452, 5625, -23080, -17463, 125, 5703, 7052, -1640, -22913, -23970, 3992, 19531, 4638, -12790, -17349, -13030, 4141, 22872, 14666, -8482, -8126, 12689, 21795, 16130, 6116, -8730, -17583, -7293, 6151, 1408, -11347, -14534, -9732, -408, 13111, 14822, -3069, -15744, -4859, 10190, 9032, -1660, -10709, -12779, -2749, 11704, 11588, -547, -5861, -1446, 2910, 7080, 9876, 2390, -10190, -8065, 5757, 11312, 4386, -5015, -10155, -7442, 1735, 3936, -6990, -15960, -10490, -497, 4632, 7145, 6601, 1837, 1136, 9152, 14167, 9142, 596, -4269, -5660, -1870, 3636, 485, -9595, -12215, -3654, 2981, 1145, -3820, -7924, -7916, -1078, 5841, 5103, 1604, 3024, 6217, 8500, 10535, 11458, 4687]
241D687r149q02M437J97o119n078l10N908P241J115m141j211M564M093m18l98
257D616m05k700j473L000L723k453n624k635R98K516J253l392m426L85N979K875
273B237k765j529Q11P98J418K651M58l053o18J709P75O28J88k094l660N05L436
290A895m25m680k370O88K015J374k92j764N10L386K301j002j62J622n14j983J187
307A786K623r96l625j121J499J484j28k580k697j79J463p93k068O51J851R62J296
324e72L453K783J21p71JN25m51k375l877k653N13J339j168k181O2J771J323L63
342a794K40P54J129J011P60Q44J668Q51j003j715k97L06j323l045k800K26J618
359b570q65j822K82K137J893L59P08J669J149P53L76M95M34q15k629k122R43K80
$$ y = [4687, -4462, -5264, -827, -630, -6749, -11827, -12137, -6229, 1012, 2127, -2014, -3225, 1339, 5432, 5014, 4616, 4211, 1511, 38, 3038, 6761, 4308, -1316, -3951, -2953, -437, 816, -2576, -7002, -6617, -638, 2237, -528, -2057, -1246, -448, 970, 3621, 4079, 1026, 408, 2117, 2892, 3520, 3708, 1614, -2046, -1541, 1895, 1470, -3210, -5580, -4892, -2877, -1503, -1795, -3559, -3049, 337, 2638, 1636, 1474, 3096, 2582, 599, 1786, 4409, 3413, -212, -1333, 166, 1650, 1522, -1058, -3755, -3934, -2471, -3264, -5332, -4681, -2830, -1868, -572, 2881, 5664, 5785, 5014, 5015, 5540, 5089, 2714, -1163, -3816, -3303, -1964, -3132, -5313, -5251, -3480, -2157, -1794, -1554, -800, 329, 1340, 2100, 2944, 4612, 5463, 4460, 2745, 2448, 2754, 1431, -1614, -4414, -4188, -2570, -3435, -5257, -4975, -2838, -945, -586, 122, 1791, 2940, 3693, 4069, 4564, 4998, 4183, 1554, -568, 375, 655]
377F55k992k737M92J681o70j72P64J655J799J654P5M4J184O74j631j210R88k22
395B031k142j842P36j24m25j06q5p70J510J668p01j242J353J491p39m63J109Q14
413B073p30N0J58q75O5J89k226j579J987R90k385q04K491J633j177K0P81l9J53
432G75M6j007n27J300j0k070J80K593M20j783k0J585J03j290l61m63l46M24K49
451b02j115o22J544j99j364Q96J638K71q02Q58J106J26K67K53j178j232J194q14
469F25k737n50J149m89j005K68R86J136O42L90k12O35J892o53j412K77J630k61
487B311j890l13J066m44j459q43l20r2N0q96o96J520J838L8l53J927K030l69p74
506B331K72Q0j048r62r54j182J5J24r29p10R70J089l06j90J494N97oM03O4m70
$$ y = [655, -2337, -5074, -4582, -2901, -3571, -3743, -2979, -1324, 475, 2129, 2204, 2248, 3432, 4106, 2475, 1265, 2253, 2031, -111, -1953, -1217, -1341, -1766, -1872, -1957, -2727, -1217, 451, -250, -1492, -139, 1352, 613, 150, 1259, 2073, 1343, 1393, 1551, 676, 741, 930, -1296, -2875, -888, 102, -2283, -3087, -596, 1037, -140, -120, 661, 622, 775, 821, -186, -713, 587, 577, -1493, -1313, 1280, 1700, -83, -103, 1482, 1585, 295, -66, -529, -875, -451, -202, -1317, -1939, -395, -594, -1958, -1062, 576, 847, 45, 903, 2009, 2135, 2402, 2655, 1477, 245, 1439, 625, -2112, -2662, -1513, -2002, -3007, -2739, -1753, -617, 25, 415, 203, 838, 2730, 2077, 665, 942, 2572, 2311, 421, 108, 1174, 730, -729, -1572, -1892, -1984, -1934, -2830, -3526, -2006, -168, -130, -483, 1444, 3474, 3105, 2331, 2603, 2683, 1635, 673, -281, -1463, -1448, -1324, -2253, -2963, -1993, -904, -1210, -1400, 94, 691, 685, 1088, 1152, 682]
526F82L53P10r76q46P89K69j219j011N80N4n25k77L15J36R12K61q71p8J666Q41
546A765j364m69J063M44j200m63P10r6l54l52n84k51Q22j01r94L51J633M66j556
565e30P20J008k62p30j36l69l48K92O3q45N98J206L12n44L44N28l45j175j52l59
585g24n59K17M4m96O66J115L53l57K90R40j99q67k26J81r4r6j11m0J01M22o59
606i9j127L20P11l20j161K42J047K03l09O09R12M80k4j78k27P1n8o70j240J09
626g09M61m91j055K59R39j71l25M81L34N29M04L60j20L09O55j79r73k21J50n81
646E6r16k66J49l70J77J34N2M13P81K95n71N48Q16k34q41J18N04J27n24j6k10
667B22M6J23j131l34l4P83p99o96P07J178R4j04M59N12K06o6q2n28p4k4r69j84
$$ y = [682, 1035, 1745, 769, -77, 712, 981, -238, -1249, -669, -615, -1140, -1417, -1102, -966, -54, 207, -664, -742, 924, 1765, 401, -68, 995, 1439, 239, -224, 486, 390, 36, -316, -900, -1151, -329, -430, -1424, -1073, 560, 1026, -530, 190, 1198, 936, 206, 70, -299, -647, -355, -292, -1137, -539, 667, 979, 435, 779, 1307, 962, -213, -365, -724, -1283, -1066, -1022, -1518, -852, 263, 616, 259, 549, 1489, 1290, 423, 197, 378, 284, 188, 77, 37, 138, 560, -99, -1226, -906, -195, -515, -1676, -1434, -387, -184, -493, 116, 1028, 1508, 1484, 1306, 1079, 1150, 1092, 422, -818, -709, -248, -739, -1794, -1535, -596, -767, -1092, -611, -277, 252, 656, 1016, 896, 1205, 1860, 1681, 708, 487, 637, 56, -860, -1126, -977, -1347, -1170, -1036, -984, -571, 210, 505, -66, 482, 1298, 1064, 223, 341, 845, 972, 448, 432, 222, 268, 391, -740, -1074, -1108, -325, -1124, -1820, -1113, 65, 159, 55, 514, 1026, 1232, 1166, 1084, 556, 482, 458, -511, -695]
689f95N61j07j70l86M76K15k10q0J97q6L92J72o1m16P51K46m58k34N69l77m3k31
711B5p80j45J027P0n84J40L24N63j383O65j65K08n28k99O86O28K60K37o55L16
731F10L10k81j441K67O76l11k73m92N19J75J81o7j29K94O14o39o61O08K51K1o77
752d45P28M28O4m97N21n25p93k09Q10j716Q10J9n4K57j1J337j72j90J83j42l56
773D7J171r58R9J93k48j005J96j49Q97j020L23o15Q63J29l92J96k88P40K30j70
793B39j0O96l24p6m94K32L6m06n5k6j98N2p6k82J76J38K50l30J22M42J58n2J91
816D03Q1K77j96j82l11j96Qk90l35K16J17K14j23J23N7K34K31m35J21J00J30k38
838Fk67K94K00J7J01j95K43j79q4n50lL46n0m62k6N95Mk39J0N79j73J22o2l42
$$ y = [-695, -134, -241, -411, -797, -321, -106, -316, -396, -199, -285, 107, 279, 218, -198, 553, 799, 341, 107, 676, 299, 256, 25, -755, -900, 127, 197, -387, -247, 77, 640, -743, -78, -243, -35, -563, -862, -176, 452, 712, 949, 294, 610, 920, 639, -802, -535, 141, -170, -443, -935, -416, -241, -60, -127, -256, 38, 652, 13, -648, -40, 211, 232, -445, 283, 711, 775, 278, 799, 274, -519, -728, 82, -1634, -824, -805, -859, -602, -613, 724, 552, 362, 545, 403, 47, 1218, 260, 359, 552, 304, -701, -505, -654, 243, -777, -454, -1069, -206, -77, -469, -273, -561, 179, 409, 239, 229, 925, 601, 525, 31, 263, 299, -107, -162, -188, -386, -334, -410, -692, -516, -378, -128, -458, -336, 106, 264, 212, 403, 484, 761, 565, 383, 72, -124, -116, -406, -741, -525, -408, -194, -317, -194, -137, 97, 328, -107, 14, 114, 244, 6, -261, 33, 233, 250, 351, 156, 399, 220, 136, -414, -417, -71, -121, -583, -609, -14, -10, -249, -239, 340, 167, 289, 227, -115]
862a15M26J36j64l80K89L51m05k16Q6o9O1j85j50J27n2n9N6pP7J18J54j0rR2M
887A56k5O0J63k65K23k43l54j2M8J6o04J40M20J00O9j73L90J69L45l12J8J83l2
910D80j30l89N4J78k28p29L52K97nk14J61k23K92N5J22p2J19K88l32m4K57J17
932D06j88l30J79j70j11j02J21j77J7Q4J54j05J35L05q3j15O2J11K10k9j04l35
954f5J11K00n01L2k53K14K46j94j52K50qm1J08J60O4L7j60j12J92J45k47K3O2
977A11J38k20K0O4n6L5l07R4o8q6q3%J60J81o6J60j4J0K03k95J62k8R4O7l20p
1003e1L1jJ48k16j61R8N6k15KK93j33Q6J24k06K87O6J79l12J50L04l45k16L6K
1027FJ29m54k08J14k4J93j01K06k9M04p9k26K91L19k95m34K53m8J76k58L0j41
$$ y = [-115, 311, 447, 283, -97, 192, 543, 138, -78, 8, -61, 0, -185, -335, -208, -260, -319, -263, -270, -193, -75, 79, 69, 60, 152, 156, 131, 191, 354, 89, 312, 69, -285, -297, -249, -233, -837, -697, -277, -177, -108, -281, 109, 278, 623, 311, 329, 512, 480, 350, -39, 15, 193, -35, -764, -412, -115, -120, -334, -173, -396, -104, -49, 73, 1, 120, 408, 76, 32, 289, 406, 218, -112, 67, -103, -214, -316, -195, -372, -355, -271, -117, -222, -87, 218, 135, 20, 82, 193, 403, 374, 270, -65, 46, 246, -255, -223, -476, -262, -16, -210, -362, -112, -120, -161, -53, 107, 171, 208, 48, -64, 128, 273, 26, 49, 111, 249, 29, 49, 113, 57, 92, -215, -121, -189, -275, -358, -358, -198, -17, -83, 77, 63, 73, 276, -19, 143, 115, 209, 276, -44, -51, -20, -21, 127, -89, -250, -152, -96, -311, -309, -16, -149, -63, 61, -145, 142, 208, 387, 75, 225, 529, 184, -32, 4, 6, 135, -319, -527, -413, -437, -244, -345, -139, -168, 236, 157, -69, 222, 541, 246, -188, 65, 17, 193, -65, -35, -176]
1049a76M01l84l3R1j63K34r1k26L96NQ4m8L48l74J72K01l78k5L1O1k28q0J2k2
1073a92l1m2P5q4J19K82j32J19K96J41k95k27J4K62m98m27M76j62R9j90L06m05
1095d96M65J50j68l5J31J20j84J38m0M2q0J15q4NRj49J00j77L0L1q4j68M31L6
1119A38j27o3M8j1K58K3l32K93q0O7l65m6L13l6k60L2Pj32K50K01m3m6L02k32
1143A59j30J62j35m6j56o2K19j81K35l69M88o9M47l16j78L28k70kk73K12ll21
1165b61J32k00M9R1Q1O2m7K09p07R65m41L5L91l26P5J3j24j17K77k31O1k0n9N7
1189c5j52j00M7K40r6J0J5M24J9r3l35K34J8l35O8l7L25l61P1j0j16Q4k11K67
1213e9K16k17L2qL8J60P0m15Q3J52j39K1j76K91m5k02N8J27m4O6L3q1O3K2j13
$$ y = [-176, 225, -159, -192, -101, -264, -30, -121, -347, 49, 54, 138, 90, 438, 64, 236, 437, 59, 34, 65, 126, -102, -182, -170, -192, -223, -265, -190, -274, -155, 127, -5, 114, 410, 551, 256, 29, 43, 305, -193, -620, -144, -306, -207, -397, -91, -496, -31, 119, -49, -84, 47, 167, -17, 121, 81, 123, 43, 158, 74, 79, 88, -61, 39, -138, -108, -77, -161, -329, 102, 138, 11, -52, -4, -15, 243, 266, -66, 227, 147, 214, -151, -197, 116, 80, -180, -148, -141, -273, -23, 178, 135, 89, 391, 159, 29, 191, 56, 10, -146, -208, 11, -170, 65, -304, 184, 115, 562, 246, 68, 396, 126, 124, -149, 63, 60, -261, -129, -329, -280, -189, -108, -46, -93, 116, -591, 374, -67, -32, 359, 33, 108, 121, -3, -120, 157, -74, -13, -33, -92, -35, -187, -287, -240, 0, -96, -86, -71, 353, 372, 279, -56, 178, 196, -139, -71, -108, 217, -144, -73, -83, -199, -115, -326, -59, 157, -60, -28, -36, 2, 162, 232, -183, -100, 52, -87, -66, -242, 49, 4, -198, -140, -13, -57, 9, 42, -39, 24, 46, -67]
1238f7j5J07q4O0J94r6N0o4r6P4M0j43j49J62J8k70J74K25n7k01N7J97m8lp9r7
1264a11M9j9j03K06j09P6k13K8L9K77k49R9K29j41l38J73p0K39JN15j89m45L93
1287C37m95J44M12Q9l40k10l1J43K29k71l13K07K1M6k2rq0K91P2j76q0J33q4K12
1311B25j62lJ26k82J04k23k29R61o85j1J8j40J22k52K03K51k66N91k38j89O44
1332E65j99j59o87J007q42R9J31K09j37k16J39j66K53j64l8k5K26j67J9m1J51
1353d2K41m16K79k6j93K13K89J30m58L70p03K85k28J69K68n21L65J39j28KL8j22
1375d9K71k78K10j63j14L2L9K7k1o8J47J39l20K48j82J29j0N0k71L18l1J09j59
1398E3m9j48p0J46l8p9j0J72O0j06J22k4j83K56q1o5K13m2k12N7oP2oj71k6L07
$$ y = [-67, -82, 25, -59, 1, 195, 99, 149, 85, -11, 63, 103, -40, -189, -27, -9, -279, -105, 120, 63, -138, -81, 116, 68, 65, -14, -111, -62, -81, -184, 22, -87, -11, -224, -196, -157, 120, -129, -30, 199, 58, -280, -107, -177, 62, 63, 578, 389, -56, 337, -158, -14, 398, 487, 147, -63, -94, 49, 278, 7, -306, -99, -78, -32, -54, -63, -143, 148, 220, 44, -36, 97, 13, 225, 63, 60, 186, -96, 8, -215, -444, 517, -168, -179, -161, -301, -179, -431, -228, 23, -243, 348, 110, -79, 565, 366, 207, -480, 527, -315, -216, -85, 124, -13, -229, -90, -256, -3, -167, -205, -230, -4, -171, -152, -193, -42, 199, -217, 62, 36, -157, 56, 345, 475, 17, 387, -316, -31, -259, -90, 178, -343, 22, 161, 33, 35, 73, -49, 222, -56, 154, -9, -123, -91, -52, -25, -46, -114, 33, 172, -148, 100, -82, 47, 37, 87, -184, 134, 103, 212, 53, 4, -144, -214, -68, -106, -185, -195, -23, 37, -69, 53, 29, -154, 102, 21, -44, 169, 127, -85, -28, -34, 38, 32, -139, -165, 142]
1424A42n0o1j54K46q3n7K59k69Rj70O8Q2K6r5M2J02J18q7r2j48J58J18rp8j10
1449i3K10j92j21K04j96K88l2l07J29j62L05L6j57K73J41l47J78K6o3pK2j35p6
1472g6J53m5k73J00j69M01J4J31k43lK93m8P9l37l42L95M0q3j11K21j95J86j55
1495f7R2J13k80P1J14m9j17J17J36q1k19K63J49j82j42J23k3N2r5N3P0j79r8L7
1519a42L06o3k6q4M9J89k10j16J9K04M8k29N1K05j64k3k07K53j58J08k5p5nJ35
1543D0j22J94l9k46R2K60j57n0KL2P7q4kL4j87K54J9p1j1J4J37k37M9j37J91J00
1569A52j93O7N5Oj01M3k25K14n3J08J29k27j9K93r2k44J4O5Jj00K07n7l2j95K30
1594D6j32J12k9J67j80j63J46RK17k96K02j48Q4K08m57J73L7k8l24K35J63j95
$$ y = [142, 92, 31, -123, 123, 40, -17, 242, -27, -18, -188, -120, -38, -12, -107, -65, 37, 155, 68, -24, -172, -14, 104, 95, 17, -93, 117, -75, -196, 8, -188, 100, 68, -239, -110, -272, 33, 69, -88, 185, 326, -21, 157, 183, 120, 113, 135, 0, -76, 77, 32, -241, -141, -310, 91, 105, 236, -7, -10, 283, 235, 314, -23, -365, 30, 70, -13, -124, 97, -98, 88, -67, 25, 138, -142, -71, 43, -6, -123, -6, 130, 49, -170, 93, 242, 60, -82, 41, 18, 70, -25, 28, 98, -81, -179, -142, 164, 101, 75, -9, 40, 229, 19, -97, -78, 126, 174, -55, -4, 201, 37, 14, -193, 60, -98, 10, -15, -90, -95, 40, -82, 112, 73, -173, -81, 179, 22, -28, -26, 6, 83, -1, -3, 31, -156, 98, 117, 46, 35, 49, 186, -51, -2, -139, 52, 152, -41, 26, 81, 87, -14, 29, -196, 18, -35, 73, 202, -25, -44, 249, 157, -87, -73, -8, -7, -107, 100, 43, 11, -184, 46, -86, 26, -3, 164, -16, -179, -33, -24, 193, -103, 99, -49, 35, 243, -214, -41, -4, -32, -356, -121, 42, -153]
1616a53j95J67K82j06r2o6M3J48KJ5K05j06O3k96K55n31L98j79J54j61q3K64k11
1639a83M06l40J13J18j89K03j74k5L2J62r5q3r5K23k27K55J16l10L71j89r9j19
1661a29K33J4j92J9M08m33K03k87J65q2j0Q8K46j29m27q1L30j15j84J79L61j55
1683B2L35l68k99M53Lj77L34k29j17J42Lk12j41j38K18j00K41j73j68N31R1m67
1705b16L88l92L08J87o22M0L32p0KQ7j56K88j22m41J65j47J67J43M54l95N2L17
1727C69m67K54p8K4J57j90m2n2j61J36o3o9N93o99N23m91J44L27j92K53j00k89
1749a13OL5P0j35o7M83m93J49L18m02K47l99K26j02K65k48M59n73J52K55m09K90
1771A4j69J08k15J36K63M2l43J68K12m65J79r3K6l6N1QL8j14K38j40J33L25l07
$$ y = [-153, -348, -181, 101, -5, -97, -163, -120, 28, 30, 45, 250, 144, 207, -89, 166, -365, 33, -146, 8, -153, -236, 28, -183, 223, -117, -4, 114, -75, 128, -46, -71, -39, 123, 28, -55, -150, 73, -154, 101, 217, -93, 278, 89, -10, -129, 104, 118, -74, -55, 353, -80, 123, -164, 1, -81, -91, -3, 243, 114, -313, -394, -64, -179, -363, -184, 177, 22, 357, -11, -310, 143, 146, -31, 303, 74, -43, 99, 102, -110, -251, -389, -171, -271, -30, -203, -371, 160, 251, -216, 172, -220, 88, 275, -347, -307, 25, -45, -43, 44, -112, 176, 54, -387, -222, -369, -202, -59, 395, 0, 52, 369, -98, 156, 78, 102, 259, 69, 27, -25, -186, -50, -113, -182, 411, -288, 235, -256, -112, 215, 23, 276, 176, -113, -107, -72, -2, -137, -204, 279, -214, -65, 253, -149, 98, -301, -75, -177, 88, -160, 299, -274, -122, 133, -276, 14, -155, -47, -262, -126, 137, 179, -164, 4, 216, -249, -70, -163, -137, -173, -122, -114, -76, -190, 48, -92, 41, 366, 59]
1794E9J75m45J52J21l2j40P3k3J19k09J13K5J96k32RJ99Pk25O4j9J28j62q6k73
1818d06l7N34n4j56K43j45J12n5k11J93r8m1J8K37j38j10OJ14j31R5o7L56k17
1841D2k62M72j84m4k70j00N60k14k61J34R7J66j70Ql3J76j46J7j67Q4r0K37k16
1864a64K57n1RLJ62k35K17j51j5J14l55J23J18Q1l69L42N7Kj13k84L97n5Q9r7
1888H2j19J3K2k13N8j24N7J09J49J15j52j9k28J58J93M6j88r2R7N6l1p9J35j43
1912i8N9j78J69J31k2j83K10j28J2O7M1p6p5Lm2l2K36r9J07j95N6R5m5q4j4J07
1938B2j11J75r8n8J11L2k5j87J17r2j3Q6L4O2j74K47j56P3o0p8J95j70M6J39j7
1963A00l6j62LJ30N1j1J60o8k01N0j04o6r4M08l46J01J23l1k14Q7K36r5j06J63
$$ y = [59, 234, -211, -59, 62, 30, -110, -37, -60, 59, -150, -37, -12, 184, -48, -39, 160, 167, -58, 6, -13, 115, -47, -133, -406, -443, 91, 37, -119, 124, -21, 91, 36, -175, 18, -80, -121, -103, 134, -4, -114, -108, 6, -125, -30, -97, 259, 42, -220, 252, 68, 24, -246, -346, 214, 0, -261, -127, -30, 136, -34, -26, -59, 117, -29, -12, -179, -95, -185, 52, -164, 93, 42, 51, 54, 216, -19, 198, 47, 32, 146, -209, -86, 32, 113, -256, 86, 143, 145, 32, -252, 145, 90, 179, 82, -37, -24, -2, -215, -157, -281, -224, -115, 34, 149, -3, -22, -250, -92, 101, 147, -41, -133, -36, 20, -11, -90, 45, -98, -39, -217, -48, 83, 61, -122, 88, -40, -28, 39, 80, 4, -71, -68, -110, -142, 94, -5, 102, -93, -37, 58, 13, -71, -85, 22, -89, 86, -12, -70, 41, 73, 48, -139, -22, -114, -127, -41, -7, 55, -119, 128, -28, 45, -15, -93, 102, -68, -22, 117, 100, 64, -98, -95, 35, 86, 75, 235, 167, -34, 16, -88, -154, -248, 160, -186, -85, 38, 7, -207, -120, 116, 21, -85, 78]
1987G8k7R3k54J5j22J72M2J8J12j17j68J11K1K4N7R9j59J47n4j6o5p8K31n0p4
2012C6L0o7j85K70j3k05K17nk55K96k3k13J08N0K14l86K58j71j74J27k0M25k38
2035G6k01j7M3J65J08j59J10j27q4J09J54j04j34o0O1J3n3K93r2k53J41j41R8
2058e4N9N5j03o1J8Q9k21K03J70jk4m0j47q3J05jl4J46K7j56J86r0L5kK47l63
2084d0J25o3k17LL04j30K72q0o8j66n5J42j0o5p8M3n2L6J38J66j65L8O3K5l92
2109b26L20k76Q3K41m3j46K91m42L11k42K81k06m3K87k86K8R5J6Nm8Q2j79J52
2132E5n4j6R3j52J45Q4Q4l72L90k34l0m9K63k09n7O2K7k29J88k08R1K53m28N27
2156B24m78K56k85L35j06K57k14K78k32j24K0K4J95k40K2m3J20p1M6l2j05J40
$$ y = [78, 51, 144, -110, -95, -217, -45, -3, 15, 127, 10, -158, -47, -26, -2, 55, 154, -5, 142, 88, 72, 7, -71, 160, 110, 36, 66, -1, -186, 84, 71, -134, 83, 78, -177, 119, 96, -117, -9, 41, 255, -131, 127, -44, -218, -91, -111, 314, 76, -125, -142, -99, 66, 174, 15, 125, -2, -86, 23, 177, 73, -61, -121, -60, -47, -100, 193, 101, -152, -11, -152, -54, 5, 60, -43, -104, -86, 3, -218, -15, 155, 154, 130, 90, -57, -140, -35, -36, -70, 76, 103, -53, 133, 43, 78, 76, 323, -40, 85, 22, -195, -192, 112, -18, 254, 174, 106, -60, -115, 27, 17, -48, -126, -83, -135, -99, 39, 205, 40, 78, 141, 166, -226, 94, -182, -99, 142, 99, -47, 244, -198, 113, -129, 152, -54, -97, 190, -96, -68, 27, 43, 48, 0, 82, -97, 55, 1, -15, 78, -74, 71, 155, 239, -133, 257, 23, -7, -56, 207, -2, -59, 3, 30, -199, -11, -219, -128, 125, -303, 224, -254, 2, -283, 52, -54, 203, -11, 267, 35, -89, -69, -45, 150, -90, -68, -111, 9, -62, -16, -48, -153, -13]
2178a3k0J6o8R3k4k1k1J31l2j50O5J42n32N85J21j67N4M4q1k82N69k90l36O97
2202D80k73n65m29Q70O6l95P11l79J39j66kn36O60l32L12j61n7J92n21N5j19J72
2224b78O57m82L72o44L65j76K9j36M26p5n3J78k23J71j18j37L1j11J27N3J25j43
2246d2N5K16j92J6k12J32J29Mk55K62j44P2K7q5qr3p8P5J5J89j5j61j3K28J23
2271B45l33P8j78J48N6j2j63L46p3j80J17k4rK05j78k2J12k50J43k67L23o5n9
2294d0J76j26J28j50J31j60N2K1l0K5M0J62l69K81j60k8J6k4k1L2L1P2l4j42J21
2319Dk7J53p4Nn6Nj40K5r8J72J42r8O4qj03N7r8K26j21j07J36j57K09j18J3j6
2345a0j08J21m0n1K86k51q9Q5N5m3Rj02J69j55J01J70r4j91K55q4J18j54j79K11
$$ y = [-13, -33, -17, -85, 8, -16, -37, -58, 73, 41, -109, -44, 98, -434, 151, 272, 105, 159, 203, 122, -160, 409, 119, -217, 480, 207, -358, -787, 83, 149, -246, 465, 86, 225, 59, 57, -479, 181, -151, 161, 0, -57, 135, -386, -331, -450, -278, 379, -103, 269, -375, -10, -186, -157, -293, 133, 58, 5, 183, -40, 131, 13, -124, -93, -204, -77, -24, 101, -42, 13, 229, 37, 53, -159, -27, 102, 106, -149, 113, -31, 41, 68, -17, -25, -118, -196, -121, -106, 83, 68, -93, -106, 122, 245, -88, -10, -188, -40, 16, 4, -159, 187, 114, -66, 51, 27, 18, 223, 45, 23, 135, -115, 28, -239, 84, 19, -40, 136, 10, 138, -12, 119, -41, 11, 32, 2, 27, 67, 229, -140, 141, -19, -47, -31, -55, -76, -44, -13, 59, 25, -117, 4, -23, 130, 56, 61, 5, 10, -130, -105, -203, -31, 111, 13, 77, 69, -34, 23, -75, 151, 30, -77, 59, -98, 111, -7, 6, -10, -118, 3, -37, -88, 198, -53, -142, -57, -2, -45, -36, -138, 31, -124, -23, 147, 53, -138, 117, 33, 151, -3, -182, 29]
2369B9j25J33J55N0l64K54j53k2M9Q9j53Q0j59R2o0P6K7l0M2k20P2K81L3n28M03
2394E1k10Q1P9K14l78K14M1p2j30K4J49L0j98Q2M8j47J36m5J4o0n6J81j11O4j1
2419a0qj5L6R0O7o8l2j8j17pJ01o8K09p5Q8k61K37j41P2j31N7j56R6m2K6K84l60
2446a46J06J07m4N3J69l87R6j0J02k10K27o2J5j45M7J3R6k30K49R8l65K07j52
2469a66L45k64M4j63J90J27n4oj51O9j44M9J15L3J26L4j53l4p6M8n0J08R7p5O1
2494A10l9m3N9q3J03J10k50M0j41J59k9R4j87J26J01j67j7Q0L40m19L9J93j5j94
2518c0k8JO7j75M01k35J2J42j76n4J14j19Q6j72M56k92k4K23k23R5O5j20j32J68
2542E0K03l47k0Q9Q4o9j2r3K04n9J21j39J43j31o6O3k4J55k1N4l02J75j27J87
$$ y = [29, -96, 37, 192, 242, -122, 132, -21, -43, 6, 95, -58, 22, -137, -45, -105, -29, -2, -32, 10, -210, -138, 143, 176, -352, 51, -159, -78, 1, 215, -163, 51, 92, 20, -110, -86, 63, 93, -105, -23, 25, -122, 14, -31, -17, -77, -133, 48, -63, 1, -10, -18, -33, 3, 93, 160, 92, 60, 42, -75, -82, 19, -49, 160, 85, 173, -88, 149, 8, 80, -51, 6, -150, -54, -96, -70, 214, -146, -40, 67, 23, 76, 245, -142, -46, -56, 46, -164, 63, 1, 16, -129, -82, -69, 27, -203, 46, 144, -221, -14, -166, 179, -85, -41, -204, -14, 113, 59, 53, -98, -29, -173, -124, -9, 24, 150, 184, 31, -3, -79, -31, -81, 27, 124, 49, 110, 71, 28, 87, 4, 107, 217, -33, 7, -134, 25, -4, 90, -97, 29, 130, -37, -54, 26, 366, -53, -14, 179, 164, -30, -58, -57, 10, -165, 236, 1, 13, 155, -21, -75, 39, -80, 6, -166, 290, -2, -26, 197, -26, 69, 134, 14, -118, 50, 253, -94, -114, -25, 59, -10, -22, -115, 89, 30, 151, 12, 155, 24, -42, 21, -3, 152, 131, 185, -117, 58, -69, 118]
2566A18j73O9k31J70q2K28j10J99k18N7K5J28n5l60O0O3J48m7r5K49j24O0k48
2589a69K46%j97R9j7o4L25k22p8j11J41o3J02J53j43Jp1J07j73L0J2pP0J01j30
2614e8j15K55j26Mr4K0J26p1R9k90L62n3o3Q2j49N4k2K4P3j03m8O3J88p3l1j10
2640e6j09O55n80J10p7q6J18P6l4n0M8j6P3j06k8N3j0o9k04M28j77j3J97j2j33
2665bk1K04l55K80j32r4K05K4l6k54J26J97k03L6P0j28J45K6J09j07r9l9m2J62
2689G2j49K32p5j24P1j88J62R1j31M8Q6j31j18K46j5J26Qk92P8J57r4o8pP2q2
2714b5Rk6j7L6m1K17O0j62k1P7j37R1j56j6k6J72j5k8j43K29l15J87J24j81J15
2739HJ22m1o3L8k17J7J42O2j73K4n1L55l66J37j49K74j64nM5K30k24j41K44k32
$$ y = [118, -55, 14, -217, -47, -129, 99, -11, 188, -30, 27, 52, 180, 125, -235, -175, -112, 36, -11, -106, 143, 19, 79, -169, 77, 77, -120, -21, -38, -102, 223, 1, -77, -188, -47, -110, -8, 145, 2, 3, -68, 39, -134, -104, -92, -99, -29, 72, -58, -173, 82, -44, -40, -134, -114, 12, -59, 40, -250, 112, 59, -4, 78, -71, -17, -39, -15, 58, -45, -93, -30, 158, 85, 54, -56, -165, 490, -90, 20, -57, -143, -25, 51, 17, -33, 15, -1, 72, -34, -62, -9, -19, -88, -292, 136, -41, -54, 143, 131, -2, -23, 181, -174, 106, -26, -120, 85, 109, 73, -181, -55, 142, -61, -25, 45, -83, 62, 88, 197, 90, -9, -48, -90, 72, -77, 155, 80, -44, 27, -161, 1, 92, -39, 9, 95, -36, -154, 92, 77, 203, 211, -81, -3, 154, 60, -8, -15, 57, -25, -16, -42, -59, -23, -64, 153, 213, 51, 30, 107, -30, 61, -95, -111, -137, 35, 20, -8, -151, 78, -237, -50, 74, -107, 8, 130, 89, 26, 64, -153, -136, 6, 68, -105, -81, -132, 223, -143, -6, -155, 119, -45, -50, -5, 225, 1, -140, 104, -128]
2763a28J02L8j62J67l0JJ82j46J8k83K23j02J22J1o5J02l2l7N9q2J08j61J82r2
2787ej48L05j54o1R2P4k36pP3M8K66j43k39Q4J55j36JJ16N3k52J09j27J92N5j9
2812I6j9l0k91K36N7Q1j28p0J57M0L6j0l9l15K66J57l24rkK7J01pJ6j03O9j34
2838a42J08j46j59L76J13j30p1K75k60J23j86K50j86k53K95J4K9mq3J11j93J26
2860G%m2J1l1J31k91J86q5KK01o1k49J67N9r8K95k81j59J80P4lj10l3J27n2J14
2886E9n0K5j4q1o7L71p1j32N8j11L7J04j38k98K21P8On5j15L01q9K9j85J21r9
2911i5q5q1L78j06j7k2l7Q8K06k87J2j03mJ59m2q5r1L49k99J62o1MJ00j93J67
2936A7Q7j32K40j87R5m27K42P5O1L2j52L6k7n4L3J62l7k45K75mj0J20j80j38j7
$$ y = [-128, -26, 12, -150, 17, -13, -12, 170, 24, 42, -241, -18, -120, 2, 13, -52, 50, 18, -19, 40, -42, 66, -95, 87, -5, -153, 152, -2, -63, 29, 103, -133, -140, -67, -19, 247, 104, -135, -51, 104, -32, -31, 85, 138, -114, -5, -132, 60, 115, 96, 77, 47, -244, -8, 49, 130, 2, -68, 89, 129, 165, 155, 116, -199, 67, 224, -100, -109, -111, -84, 17, 10, 26, -77, -8, -142, -34, -180, -339, 37, 150, 20, -51, 224, -36, 87, -99, 151, -35, -288, 7, 21, 50, 46, -37, 74, -119, 7, 7, -35, -24, -55, 76, -215, -29, -114, -112, 89, 28, -221, -54, 5, -93, 202, -79, -238, -58, 16, 13, -97, -130, -3, -55, 59, 9, 34, 20, -61, -128, 243, 172, 40, 98, -13, 24, 128, -10, -308, -87, -9, -3, -58, -173, 128, 39, 68, -117, 4, -95, -180, -261, 117, 11, -6, -28, -65, 23, 229, -58, -46, -149, -153, 6, -36, -121, -212, 137, -162, 0, -61, -57, 43, -150, 17, 104, -28, 212, 25, 120, -307, -65, 10, 71, 103, -49, -13, -40, -94, -61, 101, 64, -181, 94, 90, 80, 200, 20, -118, -135]
2961a35J22J59J2j28%L9Q9l44L56r9k28Q5K5oK02j91j4K77o7j10j05p6L1K00M8
2986A42k1J7k60r3J68J98j10L3no3J02j03j72K49O3j85r5K16j48N7j14O9Q2j29
3010a02K03j30Q4o9rm2Q9r3P2l3K6L2O5o6j16o1K48k13J01J54o9l38K64R0k88
3035b01P0M14l70P9J48j37j63J96j4l8n8K25N3j58o7J79j68L7j59K85p2p7K33
3058B37k58k3m3K72O7l07K95k63j35L27k96M0K9l9J77o1n9J00r5J86Rq7m1OP0
3083A08j82Q1n7q6P3j37J58j09K26j79n5L84k16L0m0J03j28jJ5n1j46K84k1k08
3107a54L91k84R8P1j03J80k23j9nj25L25k94J97j16J35k05P5KN0r4J67m76K45
3130a62K32l6K33l02o2P2j0J80j65J42j05k33J26M0J14L2j72mK4J53p0k5K02l70
$$ y = [-135, -13, 146, 158, 30, 30, 69, 158, -186, 170, 71, -157, -72, -47, -53, 149, -42, -56, 221, 154, 44, -61, -137, -106, 94, 142, 121, 138, -122, -215, -47, 151, 41, 74, 69, 6, 108, 5, -167, 82, 145, -40, -135, 81, -67, -10, -124, -55, 27, -102, 101, -29, 55, -14, -23, -65, 24, -69, 3, -30, -4, 28, 93, 27, -89, -150, 98, -115, -14, 140, 71, -267, -3, 87, -201, -131, 283, -87, -8, 140, 3, -160, 36, 22, -16, -74, 151, 204, 46, -21, 158, -10, 27, -132, 153, 81, 4, 237, -21, -44, -87, 185, 252, -55, 240, -23, -158, 169, -127, -87, -58, -97, 80, 19, -40, 60, -35, 151, 160, 73, 32, 38, 108, -74, 7, -50, -136, -63, -200, -42, -151, 75, -104, -159, 225, 9, 39, -1, 102, -26, -27, -12, -63, -209, 75, 54, -154, 237, -47, 51, 122, 19, 199, -24, -43, -48, -173, 152, -142, 55, -61, 74, -131, -56, -54, -4, -98, 69, -407, -162, 70, 34, 267, -35, -97, -25, -35, 145, -20, 122, 17, -216, -90, -50, 64, 96, -76, -80, -56, 97, 27, 2, 204, -166]
3154a66L27j39K35k01R1j31R9N4J2j10j04K39k93K03l60K69j4j63K14k0q4J33
3176I1j52K14j42k5o5J4K30m2j78m5J88k7j69L10j34k79K90o5j19J14L7K58l39
3199c5R0p6j04P47p27L1K82Mk48J30n21N63j39K2N9N2j29o0K91L7k21JLl6J18
3224A34j12l2o0j71J33J15K04k95K87q2l0j65oL0J25J7j07K6K7Nk28K62m2j70
3248a35J32R8J94k18Oq8K84l83j01J18O8J25k13L0J34r9J46n0j72J53Rllk9j49
3273a46L0Q0k6oP7K13q45L50M23j97K06j63P5%j33J14N3k56K27j09j76K41r9P4
3297GR9M7k07m5K81k28k3J74o8j97J92M3j50J21q3m7J79j19o9M6j33K21K18j51
3321A08k16O5L2r5K88j78N5L7j72o1J17L07j49r6J16j84Q0P9j22r6J08Q7k63J47
$$ y = [-166, 161, 22, 257, 56, 147, 16, 115, 169, 181, 71, -33, 206, -87, 116, -244, 25, 11, -152, 62, 42, -42, 91, -61, 153, 11, -14, -79, -65, 165, 123, -55, -100, 88, 61, -108, 202, 68, -211, 79, 14, -105, 9, 46, 304, -35, 55, -21, -125, 622, -105, -74, 208, 212, -36, 94, -427, 136, -3, 19, 78, 130, 1, -59, 232, 269, 48, 49, 52, 16, 134, 22, -10, -70, -241, -108, 7, 211, -84, 203, 121, 91, -74, -80, -50, 75, 92, -15, 11, 38, 43, -185, 77, 35, -135, -3, 95, 289, 71, 77, -11, 273, -110, -211, -93, -25, 100, -113, -83, 51, -48, 98, 48, -124, 29, 38, 35, 32, 3, -146, -116, -36, -62, -68, 9, 222, -623, -273, 150, -47, 159, -4, 71, 71, -62, 52, 105, -151, 76, -33, -209, 32, -67, 7, 106, 153, -54, -99, 182, -46, -69, 105, 37, -160, 32, 75, -75, 46, -37, -84, 95, -24, -93, -47, -180, 41, 259, 108, -108, -43, -11, -106, 182, 4, 59, 96, -76, -137, -20, 287, 138, 42, 158, -26, 54, 133, 11, -85, 23, 110, -153, -6]
3345fJ67l86J65J60J73k93J89j22j39J36P4n4j71J01M5R2j6k47R0J15p9J15q8
3368B1r2K73k12J66q8j67J78l6K6j81r6K76j76J63j8P8n5l8j6l13J83qN7l0K06
3393A01j30q4K09j71O2j13K09L12j36j33K5m9l06K66j09J2N52l68p18N23k99L45
3415@Lp9L62j12n00K37O39m46R6l53J21j57J81l26L58k01R8L8O8lm80N44M2P3
3439B03j94p4j0J18R8j54r1J17q3K2m4K6R4j55J36j15L12l86K39j02p7J69K60
3462C09l39M9o4O1n7m1J05j42K19j73J62k0j02j77J0O4J77k08L76k68K5J07K0
3485I3j11N3J11k90J06K3R3j4N9k84RK93k08l7P8mK5l1P9o7L5KK05j44J4j0o1
3512A7j0p9K7K04k41L04j34j35J58k18K73j31p5L8o3j30L93j01r4N2q6M6l0m1
$$ y = [-6, 161, -225, -60, 100, 273, -20, 169, 47, -92, 44, 118, 64, -107, -6, 39, 131, 115, -132, -42, 73, -6, 109, 21, -71, 202, -10, 156, 68, -99, 79, 43, 69, -112, -208, 68, -108, 55, 37, 115, 60, 22, 6, -307, -124, -132, -75, -105, 101, -29, -113, 96, -75, -13, -126, 83, 395, 259, 126, 151, 102, -204, 62, -47, -35, 517, 149, -569, -46, -345, 0, 3, -76, 286, 174, -326, -89, 550, 104, 200, -153, -32, -189, -8, -334, 24, -177, -79, -41, 27, 24, -456, 88, 130, 203, 9, -65, -75, 43, 141, -13, -104, 13, -70, -48, -92, -66, 28, -127, 9, -106, 206, -180, 59, -43, -120, 49, 309, -30, 19, -45, 16, -41, -82, 23, -119, 100, -73, 89, 69, -33, -210, -200, -136, 41, -167, 209, -59, -34, 73, 93, -18, 35, 146, -144, -38, -15, 78, 64, 123, -161, -152, 141, -67, -104, -26, -30, -5, -36, 43, -24, 11, 13, 218, 74, 88, 78, 17, 7, -72, -45, 159, -82, 222, 88, -47, 111, -107, 166, 35, -40, -2, -65, -195, 198, 97, 3, 55, -31, 15, -15, -56]
3536e6l5PR3j67J26N4j9J10k78K70Kl49Q2m5K75K2j13%RJ50j59K6l4J21M4j48
3562a2L7r3K24j11p8J91j50j42J77l4N0r8r9J21o7J80j95J09J50j62n3Q0O3q5
3586Cn2m3J24j54J46R9j25J71j37R0j48j72L1L60k10N2Q9r5l49J96P6Q9L4M4Q7
3611B06k22P5k34K36q4NJ23o6j76J40j8l1K32k68J6O4j12J50j24j14J52J21j65
3634i4K03p2J56l22J84j35p4K23j81P8K8J37k98P3K74k34o5L4J11l1j14R0n3Q7
3658EJ00k62J07j17K30j42K00j33J57J16l56P7J76k37P2q1oM2J6j27p4J12O6o7
3682a26J97j37K12k59l0K70k9j02K61k85r5K2K42k01N6M9J2Q3k30J6K80j83p3
3705e0QL2N0K55j67k10Lk0J69j56J40L8n3j06J07j60N3r6M1P6P6n8M5Q2j63k3
$$ y = [-56, -91, -84, 9, -158, -32, 22, 3, 113, -165, 105, 107, -242, -160, -205, 70, 92, -21, -21, -12, 138, -21, 5, -29, 92, 136, -12, 25, -68, 156, 45, -33, 158, 8, -134, 43, 9, 59, -39, -138, -17, -84, 96, -99, 10, 160, -2, -55, 25, 88, 3, -49, -92, 32, -122, 24, 123, -2, 169, 32, 122, -26, -198, -167, 193, -17, 35, 124, 29, -320, -124, -48, 41, 75, 119, 206, -16, 59, -175, 61, -23, -18, 105, 39, -137, 3, -15, -46, 186, -82, -66, -2, -114, 36, -88, -202, -50, 71, -94, 109, 37, 193, -129, 55, -80, -154, 69, -112, -34, -6, 131, -167, -94, 180, -54, -119, -85, 26, -5, -119, -29, -82, 5, 105, -157, -50, -167, 63, -79, 121, -12, 145, 261, -95, -18, 158, -79, -7, -88, -94, -52, -36, -163, -237, -125, -59, -126, 71, -66, 146, -113, -143, 127, 98, -4, 257, -28, -123, -101, 141, -60, -4, 45, 57, 140, -90, -74, 206, 23, -50, -42, -10, 40, 295, 128, -82, -79, -99, 70, -86, 54, 92, 39, -67, 40, -120, -67, -163, -122, -46, 30, -28, 17, 99, -64, -87]
3731h7R3Q3q4p1j2O4L2J40o4j33j5q2J12j05K71j68J57l7Q0k50O0j97M23k20N3
3756D3m5k29J74N1pm2J8J79m8r1m4JJ21q9J56k61J81o1Qk3q5K98l38J84j75J71
3782D7j50Q1J42q7k96K96K3m2J97q8r6l7L1O0k12K75j12k6n6J49k80J05J00k4
3806@o2K8k36M38k89J87J89k29k08N6J00n9R2N0l4j30K33j26KK5PL3k68K01j60
3831a60K74J75n2k68L3J5j35O0J08J09j62j49K8J29Q9l12L51j89R1j31K36j75
3853c5M3o4r1K20k23O6J34q1Qmj31J45OL2J7l9m8j14J61P7j07Ooq8jJ88n0J9O8
3882A08p0Pm8R9k02P6J03n6k22K08n7R1K0J36k38j34Q1Q1L9j12J02J38r7p1RJ44
3908A35L9k27j92K62j65J40O2N8L1k23K45q2n6J57j11j46n1K98M2k19j84L30p2
$$ y = [-87, 6, 89, 5, -66, -78, -14, 18, 158, 94, -39, -54, -136, -24, -129, 142, -26, 131, 94, 174, -76, -16, -213, 210, -10, 43, -2, -231, -57, -6, -13, -55, -37, 142, 94, 3, -41, -40, 81, -8, 148, -113, 68, 7, 15, -8, -93, 205, -133, 51, -124, 47, -103, -22, 120, 33, -263, 33, 56, 14, 211, 123, 27, -10, 21, 81, -131, 144, 32, 6, -50, 99, -181, -76, 24, 0, -62, -34, -270, 168, -121, 66, 255, 26, -182, -126, -26, -85, 7, 57, 23, -107, 126, 0, 2, 27, 34, 67, -201, 0, -160, 114, 289, 237, -31, 2, 17, -118, -58, 50, 159, -3, -152, -124, 5, 94, -218, 133, -56, 35, -96, 140, -35, 8, -56, -147, 73, -150, -84, 50, -31, -23, -27, -158, -13, -7, 25, 42, 3, -45, -159, 2, 79, -28, -22, -28, -116, -117, 71, 21, 40, 108, 38, 45, -3, 96, -106, -30, 73, 17, -205, 3, -54, 37, 57, 193, -45, -179, -98, -17, 22, -90, 12, 150, 53, -18, -9, 135, 174, -53, -245, 17, -148, -8, 54, 112, 143, -80, 165, 83, 27, 184, 73, -73, -124, 174, 216, -3, -187, 143, 71]
3931G1m3p4K23j88N6j8j45J04K1j32J74L1q3R4j2j37j20K39n0kj52L14k54J32
3955D9n2p2J49j4l4p4r2Q2J03j04J8J29k1J13l24J8M56n1n41J02q9L60l60M50
3979B01k4j37j87J56J03m3k58O94r9o90j90N62k11l30Q48m04M40k18n37M20j36
4000d0K90m76K69n39K76J33J11l86J19N97l75N3o3K5j37J48j24P0K07j66k37M18
4022A73j59j23R3k2%l4R0J63j54J1k17J25P7R6j13L8L4o3K5O1n8j59Q9K24j71
4047B6k9N8m3O6L9k2j24J59P7p2k0j80J89l61K55N5j25J20j04kJ51q2K68l68P1
4072BN0K5j45R4m6R1n9j05m7L44j02n5M8j50j16K73Q9k42n2J12j3L9J89m54M76
4097B46k81Q4k1m5N0j6j25J00P0j22P1L3m4j52O6k08L26K1k37P5J42j2j4k7L34
$$ y = [71, 28, -46, 177, -11, 45, 27, -118, -14, 7, -125, 49, 80, -3, 91, 79, -58, -178, 61, 11, 9, -143, 171, -83, 49, -3, -75, 74, 60, 26, -48, -140, -58, 45, -59, -41, 88, 67, 180, -144, -126, 330, 279, -262, -160, -249, 111, -249, 201, 177, 40, -147, 9, 112, 69, -189, 505, 406, -284, -474, 88, -123, -453, 395, -9, 431, 213, -324, 96, -40, 250, -226, 43, -496, -220, -87, 24, -362, -243, 354, -21, 32, -31, -6, -143, 5, -119, -49, 158, -8, -245, 173, 14, -109, -16, -38, -38, -72, 18, 181, 27, 38, -179, -54, 23, 119, 6, 44, 78, 15, 40, 101, 43, -116, -27, 197, 26, -3, 55, 12, 78, 117, 95, -29, 130, 207, 135, 115, -65, 124, -237, 18, 73, -52, 68, -36, -38, 113, 31, 299, -69, 2, 52, 77, -68, 26, -20, 71, 12, -93, -140, 204, 102, 47, 95, -55, -171, 102, 191, -51, -103, 9, -4, 35, 224, -230, 246, -35, 49, 28, -17, 33, 17, -108, -8, 62, -60, 11, 44, 0, -152, -86, -294, 32, 53, -184, -109, 33, 21, 7, -20, 314]
4122C14k55LP4Rj77r1J83j2R3j06O0j6R1j58J86k81j04J42p0K35p6l0J88j46j80
4147a24P2L8R2n1q6R9K02j88j46J52Q1j41J08l1o7J7k55K08M3q7k30J24K13Q1
4171A24l5R1r9r1j85J21J43j24J09J02m06K79J79j48j07k5O1M4K91l92n7P9J97
4194A51O9j67J76j76J26j59M1O6L3P4j84j10M8q5J6M9K26j33j49O4L5j00K45k02
4218d6J61J9l81K39M2k04P4N3m4O0L03j56n8j35L51k80j30J70k77J55P2JM9j06
4242f8K01r0j38K81j29R0j14j70K17m6Jp2o9J60M5Q8j33j28j29J43m9J87j32O0
4266Fk93K85j44J45m0J09J4o2J96j50k08J82j00P4M7n5M0j12K05l26R0J13%q4
4290f8J08j95J78j1O0N1Po7Jl7j22N6k0lL3K6k01K18l0j5q7O7J0L2R4mL3j54k4
$$ y = [314, 59, 62, 136, 145, -32, -123, 60, 48, 141, 35, 95, 79, 170, 12, 198, -83, -187, -45, -115, 120, 44, 14, 202, 56, -124, -52, -14, 78, 27, -59, 40, 242, 54, -92, 60, 141, 0, 108, 77, 10, 27, -228, -20, 23, -64, -294, -170, 43, 124, 89, 180, 81, -10, -195, -74, 69, -55, 54, 156, -250, 29, 208, 60, -47, -72, -11, 33, 324, -68, -125, -46, 151, 220, 53, 229, 53, 179, 20, 61, 127, 160, 234, 50, -60, -12, -97, -81, -32, 194, 61, -88, -24, 11, -89, 156, -46, 115, 134, -247, -8, 34, -170, -96, -43, -87, -27, 276, 120, 62, -73, 278, -2, -132, 38, -239, -84, -12, -11, 38, -68, 133, 43, -95, 186, 57, 147, 33, -137, 80, 34, 35, -37, -106, 54, 99, 187, 54, -74, -203, -60, -109, 78, -54, 6, -287, -2, -146, -1, -41, 68, 82, 20, 216, 66, -142, 40, -60, 14, 61, 6, 46, -66, 139, -187, -97, 16, 16, -68, 40, -155, 23, 12, 72, 123, 130, 63, 64, 27, -95, -39, -59, -62, -29, -3, -204, 14, -16, -31, -118, -51, -41, -9, 85, 81, 114, -40, -64]
4319f4K80k04k7Q4J56l61K29j58p7O1RO4K59l18r1K21o6l9m5P7k8O2n8M9k46J01
4345a30K24j97k09K58o0J65j00l3J08O6J4J3j06K3N6j78J61j6M3k16j09K32j91
4368a82R0N5K34j77P9j14J70j99N5N2m7L7q8J13k7m7j26N4p9r9J72J40r9j7J42
4393I2N2k50J92j27K5n3m9JJ88k7k8m3k5j20K05m4K05l49K81rkj24j33J61N7j13
4419c7j22J36j10K33j88J6L73j79j18j65J90j69QJ55K27k35l7N3p8Q9j17m6K27
4442A06j5j48j89Q7L31r6j80K26p8o9q0P1K12j73O1J28k24q7K74k78K79k67N7
4465e2O8j11j90L23l5l7mK01L6j11j31R6k19K72O8r0n2P9kq6n1M7q9J36l7n5J6
4492a0m3m3L14j85j97J46OK56l19j78K49k74K47K4r3Ok0j25K49N3j45j63K78l9
$$ y = [-64, 216, 12, -15, 69, 225, -136, 93, -65, -142, -81, -72, -8, 251, -67, -158, 63, -3, -42, -87, -10, -38, 24, -34, 15, -231, -130, 94, -103, -312, -54, -114, 51, -49, -82, 26, 92, 106, 119, 13, 36, 92, -86, 75, 59, 102, -114, -223, 9, -182, -92, -37, 197, 20, 99, -15, 155, -44, 11, 63, 16, 53, -35, 78, 51, 4, -122, -68, -147, -246, -74, 66, -33, -50, 92, 144, -106, 86, -41, -16, -69, -118, -117, 71, 44, 16, -27, -52, -172, 33, -11, 194, -155, 126, 117, 115, -9, -142, 19, 76, -37, -159, -23, -133, 100, -88, -72, 301, 122, 4, -161, 29, -140, -132, 23, 250, 15, -22, 31, -47, 42, -75, -121, 106, 91, -57, -246, -159, 172, 76, -104, 122, 44, -25, -105, -34, 178, 5, 66, 194, -30, -117, 157, -121, 158, -109, -52, 16, -95, -285, 38, 3, -34, -38, 163, 199, 88, -43, 53, -166, 106, 174, 84, 32, 111, 109, 23, -28, 19, -70, 66, 29, -26, -10, -53, -96, 218, 33, -164, -18, -12, 244, -75, -253, -4, -278, -31, -7, -100, -94, -114, -239, 10, 63, -82, -245, 33, -6]
4516fj82q2L72l4j29J01m20J60J11Q5P3j25m2J81K5J8r2j56jK73j31Qp3n6j1J41
4542HJ48j56nk78M03k66J07Q8j31K47j52K1j62O3M4K3o3j09J33L6j61J35r6J41
4566A8k02N2K52k58L3o2J96P6k43K43k75K60j74J36J7k80K00J61j12j1j57L0Q4
4589a6J20j93J20k1L2n0l2J7n5N1j39L44l1j7o5K1m5j72J50j42O9M8N1j4o1q4
4615a14J99j9rk4K04j04o4k08J53K03m79J79N3R4N0j03k3R2m4Q3k74K0m5K85q8
4640A7j48J86O9m3l03L39l1k3Lo0N8R8p2j52nk14N63k07q4N3j22j84J80P6j0m0
4666e6o7J57J9j88J00j04L16k05J14L8k57J80j41n3K32O1j36J5R3k35P6N0R7j60
4690e4J92k32J53R5k38M8R4j83j05L14k22J14j16K23j97N4J35j28M7O8Q0j71r
$$ y = [-6, -188, -270, 102, 68, -61, 40, -380, -220, -109, -24, 49, -76, -118, 63, 88, 106, 14, -142, -143, 130, -1, 7, -66, -122, -133, 8, 156, 0, -5, -283, 120, -146, -39, 49, -82, 165, 13, 34, -128, -65, -21, 2, -61, -170, -37, -1, -162, -27, -123, 18, -184, -132, 120, -138, -105, -167, 29, 105, -138, 105, -170, 90, -84, 52, 69, -211, -11, 150, 38, 27, -130, -100, -16, 104, -89, 31, 10, 42, -8, -40, -23, -78, -27, -166, 178, 147, 130, 65, 86, 41, -131, 19, -123, -54, -6, 45, 31, -30, -114, 85, 66, 57, 33, 237, 133, 69, -139, 14, 217, -262, -83, -30, 64, 114, 11, -12, 80, 36, 119, -155, -135, -180, 105, 17, -131, 55, 124, 81, -222, 117, 86, 63, 66, 6, 64, 162, 90, -62, -67, -281, 282, 75, -9, 44, -78, -262, -82, -6, -16, -56, -123, 34, 53, -135, -35, -139, 177, -28, 86, 124, -133, 47, -94, -147, 85, 146, 10, 25, 118, -117, -41, 9, 106, -54, 138, -94, 59, 154, -84, -36, 58, -125, -230, 84, -138, -24, -140, 83, -114, -60, 75, -53, -6, 62, 142, -29, -38]
4713c8P2r0R2Q8j96O0Q4r0J08j35J76qj51j93J55K07n8j03q4K18k08M0J60j98
4737i2K01j36m4L7K10k83J43l4j7m3L0J79m32L17j66J17L3o5n0J78j19J57j8l2
4761G1q6NM2j06Q3j32J96j60M7o4Q1J43j30N8MJ23j95P9PN1j02n5M7Q8J16l1p9
4788A01l05K27N2L4j23q2J0J38K8n3q2R1n1l4Q2j65O3n8RK86j38j68J86l97L93
4813D4K7j13J09Jm7n2J96j62O4l2j57K78j21rJ86j78k15O3L89k82j8N1K29k35
4837A6j16M8J09j08K4o4o7K0n4l0K4j6O0K94L4m2k19m5K13l40L33PJ1r6j30K11
4863G7j11j04J55j37J60L6k47M30p7j04Q3j03k13K73k15j15L49q4p1p4O5J50p9
4886D4m7p6J46m4j17k9J44p6J09j11J01j91j26J3M13k08L5J68k10O3K39r1k55
$$ y = [-38, 34, -56, 36, 124, -72, -12, 72, -18, 90, -45, 131, 123, -28, -221, -66, 141, 83, -20, -104, 114, -94, -54, 106, -92, 109, -27, -71, -34, 176, -107, 36, 2, -15, -58, -28, 151, -281, 36, -130, -13, 20, -45, -95, 83, -36, 121, 103, 71, -15, -10, 32, -74, 9, -123, 73, -87, -40, -104, -23, 120, -10, 48, 52, 175, -20, 59, 66, 117, 15, -40, 7, 95, 211, 180, 101, -204, 23, 75, 109, -14, -96, -86, 52, 80, 27, -55, 36, -15, -49, 33, -132, -69, -127, -118, 168, 30, -138, 48, -349, 44, 71, -42, 67, 68, 21, -31, 165, 3, 67, 35, -122, 156, 35, 26, 212, 34, -181, -118, 271, -11, -29, 22, 251, 16, -100, -52, 57, -51, -27, -91, -158, -138, -192, -222, -198, -214, -154, 140, 174, 132, -87, -132, 81, -259, 74, 81, 92, -4, -134, 77, -34, -138, 17, -120, 40, 76, -171, 259, 182, 78, 161, 58, -155, 118, -97, -212, 137, 53, -18, -92, -27, 123, 44, -3, -79, 67, 23, -94, -123, 21, -55, 54, -57, 44, -147, -273, -260, 153, -55, -20, 148, -62, 1, 240, 149, -106]
4909a06J00l8K12j09n0j3J14j0J59m56R1L47q0n4l3K1q7o9j02m9K30k2k3J55M6
4934A74j96Pj02QJ19j45k2Q2p%r5R5J01l3R1N7j61j07K33q1l2MM3n8J60j4Mk9
4962I6j9mL5r3J59j69j11L9o3j07K23Q7k84K11J40k48J84N9k02O5K8k13L3J14
4986d0N9n9O4j27P2j07j9J98J8o5L0j24KJ63j89L5J46k49m7L32j24p8m6L0NN5
5012f5MJ7J26N8k11P4Qo5Q1k21M24k19J17Pm9k35K7J28n7p3J79j08K18Qj36j48
5038a11K85j94J50k68j24L69%j56J15p3L7j36J3K23k97L27j31j02n6J76r3K8J86
5061A68k49L5j04K79q4l2J08K6k03J62n6L2p8Q8q9QPn2Q1Jk1j30J23Qj30L4J65
5088I7l14L20k5j7o8j4P3k12J75J0OJ1k47J83l29K27K08k08L5J56k52o0L06l55
$$ y = [-106, -6, -44, 168, 59, 9, -4, 110, 100, 259, -197, -106, 241, 161, 107, 74, 95, 8, -61, -163, -212, 18, -4, -27, 128, 174, -22, -15, -117, -109, 10, -135, -157, -75, -82, -82, -177, -82, 19, -14, 77, 134, -27, -134, 99, 18, -14, -10, 33, -25, 135, 121, 125, 96, 77, 73, 108, 15, 174, 5, -106, -67, -130, -237, -14, 73, -211, 0, 140, -108, 76, 135, -67, -2, 26, -187, -154, -40, 19, -40, 24, -103, -31, -138, -157, 41, 59, -6, 24, -100, -98, 65, -124, -89, 57, -192, -239, 93, -31, -109, -155, -125, -120, -65, -61, -44, 82, 140, -71, 3, 11, -54, 27, -194, 230, 11, 128, 135, 86, -149, -122, 6, -51, -124, 55, -53, 165, 173, 37, -111, 174, -20, 130, -138, -262, 107, 107, -49, 66, -7, 30, -106, -93, 130, -167, 160, 29, -73, -129, 47, -46, -18, 168, -81, -46, -150, 129, 45, 13, 121, 147, -56, 106, 50, 82, 4, 92, 3, 11, 18, -34, 47, 48, 27, -103, 20, 28, -102, -68, 97, -217, 103, 78, 61, -7, -21, 52, -160, 15, 25, 31, 42, -205, -22, -351, -124, 84, -124, -89, 67, -185, -245, 61, -294]
5112b94L13p5j14K31k00J44J03j79J5J22L9j62lJ30j8J40j31N3j88q5K05r9K1
5135c2K10m85L0L53j93L5j0K52o0j76J32J18k04M3m3N2m5l7J82O9k35q8L4L7M2
5160a9K57k01j58J20Nj47J45n3P0o7K53k27p9J88n5J22j28j0J0J81l30K27p3J49
5184A80r3r2J21j06L6j43J56k02K66k07R0j42L80o1l27p8j9L33N5l77M47k28K34
5207B23m53L33R9k96J64k64L77j26%j62J22r5M8M6r0K19j07l8O2r3J42j34J14
5230I1q1j45J41O7r3J4M5j1m6j61J6K01q5k71J18L6J74p5M4N1p6RN6l1J31L1L12
5257D62r3n0p70M39j89N95n46J96j41j3J82j18N0j75Q9j1P5r3K68p5j20M1O5q5
5281a7Q9r7K42k85O0n4J19j67K73l30J50n7j7J88j49J53p9%k76L69jj52k90L25
$$ y = [-294, 19, -56, -170, 61, -139, 5, 108, -71, -56, 66, 105, -57, -60, 70, 52, 192, 61, 114, -74, -159, 46, -53, -32, 178, -307, -277, 76, -117, -82, -92, 160, 100, -76, 56, 174, -30, 13, -30, 22, -23, -60, 122, 191, -44, -132, -98, -61, -19, 238, 37, -121, -1, 4, -143, 2, -51, 19, -48, 205, -22, -101, 87, 32, 154, 26, 16, 26, 207, -123, 104, 31, 180, 87, -5, 116, 10, 46, -97, 59, -143, 123, -84, 6, -136, 244, 183, -144, -222, -241, 92, 147, -230, 217, -11, 223, -230, 103, 202, -94, 70, -194, 183, 57, 57, -105, 17, -78, -30, 16, -74, 145, 38, 0, 62, -31, 111, -23, 91, 10, -135, 6, 73, -20, -6, 39, 28, -18, -179, -163, 38, -47, -318, -200, -164, 10, -65, -21, 30, -46, -37, 19, -12, 119, 150, 462, 369, 319, -451, -12, -201, 394, -152, 44, -97, -110, 72, -46, 4, -171, -82, -93, -18, -111, 157, 82, -38, 3, 68, -17, 72, -25, 217, -68, -8, -62, 57, -110, 163, -167, -17, -74, -91, 97, -52, 101, 22, 22, -254, 115, 114, -38, -328, -3]
5305ck9n2j15K26J05O5l53j6j06L27l0j01p1J80m1J20l00L7J16P6j85l6N8NJ94
5330G1j00K28m29M05j90j27K10p9j30K17j18o8N4R7j04K06n9k33R7J56k07R6l
5353a0OJ45l60L21j30p3R2K7j01L51l05K5P8j40j99L50j98K7Q2Q4M0k0M9k02J53
5378I2k8l07L32r6N4k23K54k9k04L16k7j25J1r8J16J95p5k21K9R8j32K41k46K81
5402B08l82L38j36j23J90n7j75Q7j51J52M6j14K57r8P7%q6j15J48j77J22l6j15
5425a40K57l30J32J31L1J72j41j75OMJ36k79O7K95q6p9l0O3j13l5N9J63k27J95
5449G6j3q2J08j32m0K46J1l19K13m6j21J1K1J99o2o4J75k95N9J02q5n9M7J78j65
5474c7L7K41k54j31K21k5O0k41K67k95O5K71l29J00l8M3m1k5M6J6j6o4J92r7l8
$$ y = [-3, -32, -84, -199, 27, 132, 197, -156, -172, -278, 49, 19, -82, -153, 27, -14, 106, -194, -157, -41, 35, -150, -186, -128, -123, 71, -29, 199, -230, 175, -15, -142, 68, -11, -141, 76, -42, -110, -56, 41, -63, 143, 84, -149, -52, 104, -103, -7, -10, -4, 141, -219, 102, -28, -101, -9, 18, -83, 268, -37, -12, 66, -74, -273, 77, -121, -94, -12, 72, 112, 92, 141, -61, 92, 64, -243, 89, -7, 47, -176, 78, 49, -155, 161, 134, 9, 20, -78, 38, 233, 158, -63, -34, 64, -68, 173, -73, 208, -174, 164, 28, -95, 95, 38, -137, -50, -201, -49, -3, -117, 140, 42, 119, 119, 33, -82, 66, -111, 11, -25, -140, 117, -213, -81, 50, 81, 253, 112, -63, -57, -53, 83, -196, -129, 166, 80, 1, -29, 34, -79, -114, -55, 108, -119, 76, 63, -19, 89, -43, -83, 163, 174, -145, 68, 22, -99, -88, -67, 132, 70, 6, 181, -114, -55, 47, -38, -97, -50, 128, -37, 0, 241, -13, -144, 77, 52, 112, -129, 138, -157, -92, 179, -150, -50, -88, -45, -86, -111, -65, -49, -65, -129, 63, -34, -72]
5499g2K33j48J74k59K39j71J4mj46M1j24Q7L02j65J1k2K30k57J13k0m9j03J50
5522E4M5j06J43m90L13Q8nL8k96K31r9M4J36r6l1J27k31r6J79l8J18J54j31RN7
5547A17m5m5L1j87J27p3j2j33M00j17o3j85M5K73k98J39N3j44K21j20k17J62K31
5570A60o5p8J29j66p0q9K67J40k14p0O5Jj38K54j7kr5O5R2m50J48J55j13K88k11
5595a4Q7L8P7j62O8p7J32k78J04R1j12L3KP2j71L2L36l76J8j2J78j28j3J15M8
5620H8or5K7l4r7J97k33J97k05K25pq4N2R9O5j96J56j74j92K19Q3n5Q2k28J30
5645A4RQ5MRm1k77L32j8kl5j80J31m3j13J87m0K35l01j4J31r4pJ04L3l8j59J58
5672G0r2pn6L18j12l78J7K34o8J41J10l44K60k08Mk2N9m3J1o1P0R1o0J80j25M0
$$ y = [-72, 161, 13, 187, -72, 167, -4, 10, 6, -140, -99, -223, -136, 166, 1, 12, -10, 220, -37, 76, 56, 7, -96, 54, 99, -7, 136, -354, -41, 47, 42, 80, -216, 15, -84, -40, 96, 0, -31, 96, -135, -231, -52, -90, 28, 182, 51, 60, 117, 72, 27, 58, -129, -2, -75, -87, -220, 180, 63, 0, -185, -140, 133, -165, -26, 27, -117, 104, -16, -233, -71, 160, 95, 17, 146, -20, -90, -179, 88, 228, 14, -56, 9, 10, -128, 126, 109, 107, 12, 77, 169, -281, -133, 22, -91, 197, -14, 73, 111, 188, 26, 94, 17, 149, -129, -25, 66, -46, -13, -11, 61, -110, -78, 258, -118, -100, -112, 66, -62, -75, 40, 88, 82, -13, 14, -20, -117, 80, -153, 44, -161, 64, 57, -27, 25, 124, 189, -7, 149, -25, -217, 2, 85, 30, 112, -116, 14, 23, 108, 112, 121, 80, -197, 135, 117, 115, 80, -100, 31, -12, -125, 62, 22, 257, -44, -58, 73, -21, -28, 76, 109, 71, -88, 70, -22, -29, -85, 233, 121, -257, -240, -6, -74, 67, 177, -167, 93, -115, -111, -133, -74, -117, -106, -167, -97, -6, -66, 114, -11, 29]
5698B9N1j76K95j92o5L4J8k04K21k03L23l2J9j37kN1m2j3q5N9J55p7m6QJ47j50
5724a4j25M20l81p7K18J48k10k8P6POj7K64j32r5M3J18m3k31o6K89j93kK69r9
5749A45k02o9N4K7K6J6J94o8k62L61j23j17J01j63l6M3J40q4j70L45m5j33J25
5772A05j93J0J03p2K34l35K34P9j23k1k3J0k87L53r6J67j65N2o6J8J51k91N4M9
5796e3J59k62K56j54j72M79j98j46J29j9P2j58M39j98r4O7K3k96K21j34K6j1R0
5819F6M9M1l60L56o1j77J9j3O4j9Q8Oj54N1J06qj47P4J11J6J8k50L19l12J98j11
5845c0M2J16k27J71N8j64P8j66K85k35J19j57J47J79k16j77L02j63J0M7j40L42
5867B21k21K17nj72J4Pj76K11k0J66k06q6J18j03J11q3k3J26k23lJ78N7l4qo8
$$ y = [29, 80, -96, 199, 7, -58, -24, -6, -210, 11, -192, 131, 99, 118, -19, -21, 30, -12, -25, -110, -51, 104, 27, -19, -11, 136, -14, -139, 281, -100, -177, 41, 189, -21, -49, 27, 34, 40, 23, 287, 155, 60, 103, 221, 178, -53, -119, 170, -23, -25, 244, 145, -57, -126, -72, -45, -19, -3, 191, 123, -139, 222, 99, -18, 83, -80, -116, -73, 67, -17, -187, 158, 113, -20, 105, -88, -78, 25, -47, 187, -148, 86, 165, 42, 21, -2, 8, -279, 74, -22, 145, -20, 32, -34, -16, 135, -156, -102, -53, 106, -156, 100, -54, -226, 253, 55, -91, 38, 19, 91, -67, 372, 174, 80, 147, 170, -126, 95, -39, -13, -24, 66, 115, 156, -204, 152, 91, -86, -67, -80, -16, -35, 53, 59, -95, -44, 62, 54, -93, -19, 92, 108, 126, -124, 195, -117, 81, -30, 12, 128, -99, 72, 130, -34, 44, -122, 163, -72, 47, -110, 37, 216, 0, -177, 125, -38, -28, 19, -121, 221, 0, 217, 212, 40, 54, 61, -115, 96, 76, 242, 36, -50, 68, -35, 76, -7, -30, 96, -127, -130, 48, 105, 71, 63, -5]
5892eJ3p4N3Qo7O3oJ24k50J43L0n3N4J18j21j6J32q5Nj75O4K90k75n3J89j97J05
5919A4j4L6L9l45J96J70j10J60k91P8J28K5o5R0k34j33O5K03J05r2o2k02M62j42
5943H1Nj31Q2r0L0R3j14N7j52J89k3N5j41J90k56J32J9j99K31o4L2Q3j95K98j46
5968F6r6M2j31J59lJ02k48N1L0K66k87R8j80K5L2k6J04k8K24j67j59K6J68j29
5992f1l6J07P9j41L6K8R0j55K11j64K7KQ2j40j40J09Q4R2j7r5p3Q3j26Q3P4K8
6018F7j19l1J0K50m27K68N8j6j30K08j16l4Q6o2k17K15j10L69k97k0K26k24j9
6041f5N2j80J59M8K4J32j67M1j62L24j87J2j47J24J56k11l2J97j32J5j2P2j73
6064a12K64p0M5k19M7J83k18qK41j7n3j36l6O6J64k04R1jk5n0K18j31p4O3K5J76
$$ y = [-5, 8, -66, -13, -5, -72, -9, -15, 109, -141, 2, 32, -21, 33, 151, 30, 14, 146, 61, 66, -109, -45, 245, -30, -83, 106, -91, 14, 0, 36, 75, -270, -74, 96, -14, 146, -145, -67, 61, 86, 21, 111, -123, -256, -191, 12, 117, 25, -37, -239, 223, 81, 86, -45, 37, -53, -23, 70, -44, 13, -139, 50, 27, 82, -59, 131, -125, 7, 26, -173, 58, -6, 26, 109, -86, 212, 66, -30, 12, -119, 40, 37, 139, -109, -58, -28, 238, -49, 49, -131, -106, -74, -100, 4, -24, 200, 33, -126, -100, 68, -61, -97, 10, 89, -52, -16, 12, 102, -53, 158, -6, 21, 23, 105, -35, -175, -66, 18, 110, 93, -2, -75, 8, -118, -35, 39, 67, -52, -83, -73, 177, -250, 18, 76, 60, -70, 138, 22, -12, 74, 12, -205, 10, -100, 269, -28, -48, 178, -46, -65, -13, -193, -34, 14, 38, 170, 3, 44, -118, 206, 19, 31, -116, 8, 164, -47, -79, 118, -14, 1, -11, 61, -112, 152, 82, 127, -92, -45, 138, -80, -88, 153, 136, 83, -53, -89, -23, 141, -63, 28, 27, 2, -48, 170, 39, -35, 28, 53, 229]
6090B29m73J23K82m3l2m7r0L9R9J13j30pj56j12J0J61K46l28J98Ml3Q1k71L82
6114B45l0j94j00K45l20K68j99R5Pj95K81j8j6M6l30J12J08m8J0J84k5pk71M9
6138a03J03q7J07R9j11nJ86j30m3J9n4j2J65j33j93J38K12J31j91k1j18p7K5R7
6162DK3k4l8j81J52J26k13K02j46k02L94j11M0J05m1m7J41p7r5j39L36m46M43
6185B06M2j87Q0k89J69K2j47n9P5R6L26l59R0qo1o0J76K6r7Nj10K2J23j16J09
6210G4j18J01O9m70L84k83L98K2j10m5L02k56n1j06N0Q9j53K25l15J78J9j03j6
6233a15o4Q7Q5n6K01j67k1J47j00O5q4Q3j02m0K16k53J85j15j0j39R5J95N1j87
6257d3L7p1nL3J2J47l51J30J50K3j18o6M0o3K15j30K36j19Jj05Q4J15l09K27q
$$ y = [229, -244, -121, 161, 118, 86, 39, -51, -12, 87, 200, 70, 63, -93, -205, -195, -34, 212, -116, 82, 86, 53, 134, -137, 245, 215, 21, -79, 166, -154, 114, -85, 10, 17, -178, 103, 85, 69, 115, -215, -103, 5, -43, -33, 151, 126, 119, -152, -103, 0, -87, 20, 119, 8, 3, 189, 59, 16, 35, -19, -31, 134, 1, -192, -54, 158, 289, 98, 77, -41, -118, -93, 4, 27, 3, -35, -216, -64, 62, -151, 51, -95, -297, 97, -14, 26, 131, 90, 43, 184, 107, 12, -127, 209, -237, 206, 248, 61, 141, -148, 21, 43, -104, -163, -88, 8, 334, -25, 65, 57, -4, -64, 112, 138, 41, 46, -64, -42, 81, -35, 74, -44, 57, 126, -344, 40, -243, 155, 177, 67, 22, 324, 68, 17, -89, -39, 50, -103, 122, -193, -15, 4, -99, -115, -179, -92, -7, -63, 138, -29, -50, 97, -3, 62, -22, 61, -41, -81, 135, -118, 67, -48, -58, -197, -102, 93, 144, -43, -6, -77, -82, -49, -37, 110, -241, -111, 39, 62, -56, -122, -82, -145, 70, -60, 176, 57, 58, -47, 37, 152, -157, 70, 62]
6282F2K53m43J62l5O7j95K25Lj49j58Q8P0k3P6J61L8o5j54M0j54k8K51o0m5L1
6307A8O7p7M5j41J27Nk89K12J5K9Pr2R5Oj82J71K00k02j6N3k3j42M0J77o6l4R8
6334A01m7j00J26k09j54K84N8o0N5j13k7J46o9Pl6R5k87RK50q3J11k80J23J47
6358D7k2m6N8j09J00K13j09o0L5K0j73L3j26K99k95R8mP9RL1j73k4K12j08L8p8
6384e5R7q1lJ61j45j04J04j24J36P6j81J04J94k14j21K85k76R7j26J85k19L78
6406A68j38j4K16k1q9n5Jl5O9o1j15l9J64N0r8Rj59Q9M6K51l7k10Qk23K03k3n0
6433i3N9J95k38m0J02qP3n1j39L78k81o0O4k4J79Rk20J08p3N1j43J6J71J6P2o7
6459E6M6j41R3K2j13j21J37Mj32L17m3l6j71J8J64J2o1p2J0L6l0m7J23m8l8R6
$$ y = [62, 315, -128, 34, -1, 66, -129, 96, 99, -50, -208, -120, -50, -73, 3, 164, 202, 137, -17, 23, -131, -159, 92, 32, -13, 18, 85, 8, 53, -88, 39, 44, -245, -33, -18, 11, 18, -74, 21, 27, -155, 16, 216, 14, -2, 51, 28, -114, -74, 103, 37, 3, 101, 54, -46, 80, -129, -283, 1, 59, -1, 54, -59, -86, 60, -9, -2, -38, 57, -230, -221, 29, -54, 57, -223, -100, 47, 25, -21, 37, -72, 28, 241, 132, 72, 107, 127, -46, -13, -139, 160, -135, -37, -41, 38, 47, 78, -95, -119, 93, -15, 23, -55, 42, -39, -42, 119, -26, -130, -26, -150, -14, 62, -119, -15, 179, -35, -156, 129, -147, -50, -176, 9, -210, 168, 30, 16, 232, 211, 122, 67, 68, 33, 102, 41, -74, -113, 51, 101, 3, 12, -147, -58, -12, 239, 202, -8, 0, -223, -20, -43, -93, -34, 161, -77, -117, -15, -23, 50, -1, -140, 238, -43, -103, -39, -63, 116, 125, -95, 13, -60, -9, -152, -136, 35, 51, 123, 56, 102, -39, 54, 76, -37, -158, -21, -17, -149, 168, 125, 89, -82, -64, 100, 112, 51, -21, -11, 25, -5, -52, 71, 23, -15, 81]
6485H1j99J27J60k71j07J39P6l7L9J08Q2n7l26J38k38K34J18R8k43J45j53J32
6507D6J60l07m3M1Q2l9m1n9K28L7k81J63mj2J00JJ24k90J01O1J0l12K40n9n9n5
6533a67J79n7k4J2N9j15k8L54k04K7J85j35l33L20j29J48L25k86k14M4J63k24
6555a00J08k34L03J28l39J42j9j81K14j4j18J99k68K72k5k81K19j6O9k41J79J84
6577A81l44O4J23q9J17p3o7J29m4r7L75k78K8m5M9l5P7K3j53P1J26l9p6l9P1n4
$$ y = [81, -118, 9, 169, -102, -209, -70, 6, -31, 8, 116, 198, 141, -185, -47, -285, -51, 67, 165, -78, 67, -86, 46, 206, -101, -144, -103, -21, -60, -101, -160, 68, 105, -176, -13, -17, -29, 71, 72, 196, -94, 7, 68, 78, -234, 6, -53, -112, -167, 12, -45, -69, -57, 2, -113, -141, 213, 9, 36, 221, 86, -247, 73, -56, 92, 417, 131, -83, -39, 124, -100, 8, -226, 77, 205, -134, 8, -11, -192, 22, 8, -110, 89, -179, 93, 68, -213, 6, -10, 59, -182, -3, 181, -163, -99, 24, -65, 52, -21, -88, 41, -3, -100, 275, -3, 25, -20, 29, -6, 71, 94, -59, 12, 138, 99, 23, -16, 55, 1]
$$ [...]
8191A33
##END NTUPLES=NMR FID
##END=
