##TITLE=1H_DE-135m_TFA
 200.13Hz,CCl4.
 8 sc
 
 8.4.2026
##JCAMPDX= 6.0         $$ Bruker NMR JCAMP-DX V2.0
##DATA TYPE= NMR FID
##DATA CLASS= NTUPLES
##ORIGIN= UXNMR, Bruker Analytische Messtechnik GmbH
##OWNER= pz
$$ XWIN-NMR		Version 3.5
$$ Wed Apr  8 15:22:54 2026 Russian Standard Time (UT+4h)  she@DPX200
##.OBSERVE FREQUENCY= 200.131
##.OBSERVE NUCLEUS= ^1H
##.DELAY= (6, 6)
##.ACQUISITION MODE= SIMULTANEOUS
##.ACQUISITION SCHEME= undefined
##.AVERAGES= 8
##.DIGITISER RES= 18
##SPECTROMETER/DATA SYSTEM= spect
##.PULSE SEQUENCE= zg30
##.SOLVENT NAME= DMSO
##.SHIFT REFERENCE= (INTERNAL, DMSO, 0, 14.3821)
##AUDIT TRAIL= $$ (NUMBER, WHEN, WHO, WHERE, WHAT)
$$ ##TITLE= Audit trail, XWIN-NMR		Version 3.5
$$ ##JCAMPDX= 5.01
$$ ##ORIGIN= Bruker BioSpin GmbH
$$ ##OWNER= she
$$ F:/spectra/data/she/nmr/H-C/1/audita.txt
$$ ##AUDIT TRAIL=  $$ (NUMBER, WHEN, WHO, WHERE, WHAT)
(   1,<2026-04-08 15:21:14.54 +0400>,<she>,<DPX200>,
      <created by zg, POWCHK disabled, PULCHK disabled
       configuration hash MD5:
       00 E9 B6 7A A2 85 ED C7 34 08 36 98 17 FE 4E 26
       data hash MD5: 16K
       BA 94 9C 8A 1F FE 67 9D 5C 8F 8B D0 B5 B8 0E 7F>)
$$ ##END=
$$ 
$$ hash MD5
$$ AB 74 01 A3 07 1A 8C 3D FD 42 6A 33 02 C2 39 45
##$RELAX= 
##$RELAX= 
##$RELAX= 
##$RELAX= 
##$RELAX= 
##$RELAX= 
$$ Bruker specific parameters
$$ --------------------------
##$DU= <F:/spectra>
##$EXPNO= 1
##$NAME= <H-C>
##$PROCNO= 1
##$TYPE= <nmr>
##$USER= <she>
##$AMP= (0..31)
100 100 100 100 100 100 100 100 100 100 100 100 100 100 100 100 100 100 
100 100 100 100 100 100 100 100 100 100 100 100 100 100 
##$AQSEQ= 0
##$AQ_mod= 1
##$AUNM= <au_zg>
##$AUTOPOS= <>
##$BF1= 200.13
##$BF2= 200.13
##$BF3= 200.13
##$BF4= 200.13
##$BF5= 200.13
##$BF6= 200.13
##$BF7= 200.13
##$BF8= 200.13
##$BYTORDA= 1
##$CFDGTYP= 0
##$CFRGTYP= 5
##$CHEMSTR= <none>
##$CNST= (0..31)
1 1 145 1 1 1 1 1 1 1 1 1 1 1 1 1 1 1 1 1 1 1 1 1 1 1 1 1 1 1 1 1 
##$CPDPRG= <>
##$CPDPRG1= <>
##$CPDPRG2= <>
##$CPDPRG3= <>
##$CPDPRG4= <mlev>
##$CPDPRG5= <mlev>
##$CPDPRG6= <mlev>
##$CPDPRG7= <mlev>
##$CPDPRG8= <mlev>
##$CPDPRGB= <>
##$CPDPRGT= <>
##$D= (0..31)
0 0.7 0 0 0 0 0 0 0 0 0 0.03 0 0 0 0 0 0 0 0 0 0 0 0 0 0 0 0 0 0 0 0 
##$DATE= 1775647273
##$DBL= (0..7)
120 120 120 120 120 120 120 120 
##$DBP= (0..7)
150 150 150 150 150 150 150 150 
##$DBP07= 0
##$DBPNAM0= <>
##$DBPNAM1= <>
##$DBPNAM2= <>
##$DBPNAM3= <>
##$DBPNAM4= <>
##$DBPNAM5= <>
##$DBPNAM6= <>
##$DBPNAM7= <>
##$DBPOAL= (0..7)
0.5 0.5 0.5 0.5 0.5 0.5 0.5 0.5 
##$DBPOFFS= (0..7)
0 0 0 0 0 0 0 0 
##$DE= 6
##$DECBNUC= <off>
##$DECIM= 32
##$DECNUC= <off>
##$DECSTAT= 4
##$DIGMOD= 1
##$DIGTYP= 9
##$DL= (0..7)
0 120 120 120 120 120 120 120 
##$DP= (0..7)
150 150 150 150 150 150 150 150 
##$DP07= 0
##$DPNAME0= <>
##$DPNAME1= <>
##$DPNAME2= <>
##$DPNAME3= <>
##$DPNAME4= <>
##$DPNAME5= <>
##$DPNAME6= <>
##$DPNAME7= <>
##$DPOAL= (0..7)
0.5 0.5 0.5 0.5 0.5 0.5 0.5 0.5 
##$DPOFFS= (0..7)
0 0 0 0 0 0 0 0 
##$DQDMODE= 0
##$DR= 18
##$DS= 0
##$DSLIST= <SSSSSSSSSSSSSSS>
$$ [...]
##$SUBNAM0= <"">
##$SUBNAM1= <"">
##$SUBNAM2= <"">
##$SUBNAM3= <"">
##$SUBNAM4= <"">
##$SUBNAM5= <"">
##$SUBNAM6= <"">
##$SUBNAM7= <"">
##$SUBNAM8= <"">
##$SUBNAM9= <"">
##$SW= 18.0517599122864
##$SWIBOX= (0..15)
0 0 2 0 0 0 0 0 0 0 0 0 0 0 0 0 
##$SW_h= 3612.71676300578
##$TD= 16384
##$TD0= 1
##$TE= 0
##$TE2= 300
##$TE3= 300
##$TEG= 300
##$TL= (0..7)
0 120 120 120 120 120 120 120 
##$TP= (0..7)
150 150 150 150 150 150 150 150 
##$TP07= 0
##$TPNAME0= <>
##$TPNAME1= <>
##$TPNAME2= <>
##$TPNAME3= <>
##$TPNAME4= <>
##$TPNAME5= <>
##$TPNAME6= <>
##$TPNAME7= <>
##$TPOAL= (0..7)
0.5 0.5 0.5 0.5 0.5 0.5 0.5 0.5 
##$TPOFFS= (0..7)
0 0 0 0 0 0 0 0 
##$TUNHIN= 0
##$TUNHOUT= 0
##$TUNXOUT= 0
##$USERA1= <user>
##$USERA2= <user>
##$USERA3= <user>
##$USERA4= <user>
##$USERA5= <user>
##$V9= 5
##$VALIST= <valist>
##$VCLIST= <CCCCCCCCCCCCCCC>
##$VD= 0
##$VDLIST= <DDDDDDDDDDDDDDD>
##$VPLIST= <PPPPPPPPPPPPPPP>
##$VTLIST= <TTTTTTTTTTTTTTT>
##$WBST= 1024
##$WBSW= 4
##$XGAIN= (0..3)
0 0 0 0 
##$XL= 0
##$YL= 0
##$YMAX_a= 138320
##$YMIN_a= -152548
##$ZGOPTNS= <>
##$ZL1= 120
##$ZL2= 120
##$ZL3= 120
##$ZL4= 120
##$ABSF1= 10
##$ABSF2= 0
##$ABSG= 5
##$ABSL= 3
##$ALPHA= 0
##$AQORDER= 0
##$ASSFAC= 0
##$ASSFACI= 0
##$ASSFACX= 0
##$ASSWID= 0
##$AUNMP= <proc_1d>
##$AZFE= 0.1
##$AZFW= 0.1
##$BCFW= 1
##$BC_mod= 2
##$BYTORDP= 1
##$COROFFS= 0
##$CY= -3
##$DATMOD= 1
##$DC= 2
##$DFILT= <>
##$DTYPP= 0
##$F1P= 0
##$F2P= 0
##$FCOR= 0.5
##$FTSIZE= 0
##$FT_mod= 4
##$GAMMA= 1
##$GB= 0.15
##$INTBC= 1
##$INTSCL= 1
##$ISEN= 128
##$LB= 0.25
##$LEV0= 0
##$LPBIN= 0
##$MAXI= 10000
##$MC2= 0
##$MEAN= 0
##$ME_mod= 0
##$MI= 1.114404
##$NCOEF= 0
##$NC_proc= 0
##$NLEV= 6
##$NOISF1= 3.799351
##$NOISF2= 2.8
##$NSP= 1
##$NTH_PI= 0
##$NZP= 0
##$OFFSET= 14.38212
##$PC= 1
##$PHC0= -3708.248
##$PHC1= 20.19231
##$PH_mod= 1
##$PKNL= yes
##$PPARMOD= 0
##$PSCAL= 0
##$PSIGN= 0
##$REVERSE= no
##$SF= 200.129724274929
##$SI= 16384
##$SIGF1= 3
##$SIGF2= 2
##$SINO= 400
##$SIOLD= 16384
##$SREGLST= <1H.CDCl3>
##$SSB= 0
##$STSI= 0
##$STSR= 0
##$SW_p= 3205.1282051282
##$SYMM= 0
##$S_DEV= 0
##$TDeff= 0
##$TDoff= 0
##$TI= <>
##$TILT= no
##$TM1= 0
##$TM2= 0
##$TOPLEV= 0
##$USERP1= <user>
##$USERP2= <user>
##$USERP3= <user>
##$USERP4= <user>
##$USERP5= <user>
##$WDW= 1
##$XDIM= 8192
##$YMAX_p= 0
##$YMIN_p= 0
$$ End of Bruker specific parameters
$$ ---------------------------------
##NTUPLES= NMR FID
##VAR_NAME=  TIME,          FID/REAL,        FID/IMAG
##SYMBOL=    X,             R,               I
##VAR_TYPE=  INDEPENDENT,   DEPENDENT,       DEPENDENT
##VAR_FORM=  AFFN,          ASDF,            ASDF
##VAR_DIM=   8192,          8192,            8192
##UNITS=     SECONDS,       ARBITRARY UNITS, ARBITRARY UNITS
##FACTOR=    0.0002768,     1,               1
##FIRST=     0,             0,               0
##LAST=      2.2672688,     0,               0
##MIN=       0,             -152548,         0
##MAX=       2.2672688,     138320,          0
$$ Real data points
##PAGE= N=1
##DATA TABLE= (X++(R..R)), XYDATA
0@%%%%%%%%%%%%%%%%%%Nj3J6j6J6j6J7k1K8l2L4l8M4n0N4o1O9p5Q3r3J04j15J25
41F5j37J53j69J85k03K22k43K67k93L23l56L93m36M84n39O05o85P81q98J046j239
62f74J497j858K385l211M631p440J4635n8661p7969K64985j60289j03895J32966
75G102q5627Q1258L3002j32445N6421m1736l3765J55747n8567m6469L7773j08386
87a35692O1760N7275l6327O3834p0220k9970N0453l3523N9135J8134n3696K9701
99a9136j2232q772N2867k8434k095L4116l6706M2011O621m4080M1212k4602J7665
112A8435L3813m5193N6372m174p4769M3289J4980j9395M1019j5820k6615K4094
124D6036l7441K0941L6837n4886K6416P650m4093K0884L920m893m21o937K435
$$ plain form
0 0 0 0 0 0 0 0 0 0 0 0 0 0 0 0 0 0 0 0 5 -8 8 -8 8 -8 9 -12 16 -16 18 -20 24 -26 28 -33 36 -39 44 -49 55 -60 65
41 65 -72 81 -88 97 -106 116 -127 140 -153 170 -186 207 -229 255 -284 321 -364 417 -481 565 -674
62 -674 823 -1035 1350 -1861 2770 -4670 9965 -48696 -126665 138320 -21969 -125864 7102
75 7102 -78525 2733 35735 -96710 -40289 -82025 -115790 39957 -18610 -65079 -27306 -135692
87 -135692 -73932 -16657 -52984 10850 -59370 -89340 -38887 -72410 -13275 4859 -48837 -19136
99 -19136 -31368 -40140 12727 -15707 -17802 16314 -20392 21619 28240 -15840 25372 770 18435
112 18435 52248 7055 63427 59253 -15516 27773 42753 23358 64377 48557 21942 46036
124 46036 8595 29536 66373 11487 37903 45553 1460 22344 26264 21371 20950 14013 16448
137A6448o64j2084n533N553j8651Q921J9138j6030o644m939L150p002j085Q308
151a1114n649R878j4937j756R341j6413K1884M354k1364M179R726m803n904J1351
165a1227P92O341n345j195J4052k3100R961J6244j9057P411J5488J486j9409N601
179a957J0856j0490P417qL043o540k063J5592j6326k740J2777J285j1178l284
193c616Q342p969N772n652K201R015j8006J4030n464j8725J5873L477l373k942
207g037L948n33k719m916j640J6607j3169P120R429k1030R057N969q93l291J209
222a889J4224p745o560K831P445k324J110J5306j3644j400O870j567l481k187
236F989J9060m482p907P90l677O399j0391R650N701j4793R024m63j2230l510J2523
$$ plain form
137 16448 15784 3700 -1833 3720 -14931 -6010 13128 -2902 -9546 -14485 -11335 -18337 -19422 -11114
151 -11114 -16763 -6885 -21822 -23578 -14237 -30650 -8766 -4412 -25776 -21597 -11871 -16674 -22578 -11227
165 -11227 -10435 -4094 -9439 -10634 3418 -19682 -9721 6523 -12534 -5123 10365 11851 -7558 -1957
179 -1957 8899 -1591 5826 5818 8861 2321 258 15850 -476 -3216 9561 10846 -332 -3616
193 -3616 4726 -3243 2529 -3123 -922 8093 -9913 4117 -1347 -20072 -4199 -722 -4095 -7037
207 -7037 -3089 -3622 -6341 -11257 -12897 3710 -9459 -2339 7090 -13940 -4883 1086 193 -3098 -1889
222 -1889 12335 4590 -1970 861 8306 5982 7092 22398 8754 7354 14224 12657 9176 6989
236 6989 26049 21567 13660 14450 10773 17172 6781 16431 22132 7339 16363 15900 3670 160 12683
251A2683j916n071N48j0316R546j3416m125J8308j6495M457O056j5025n825K898
265a7693P231n124p86J99M906q485j2344J6607p929o30J4941q092n536r68R721
280a3982l415l105J0042K564M027j4043O008P934j0232J6162L749o501P98N867
294E873j691o223R630L500R540p006p179J4962j2100K438J0993m829M02J977L744
309B4031j2732q8Q040J959L65j0652J0293o282j2035J0308l315j616K441M491
323A5208j1506q976P594l059K765o873L035P747j8216L894J447p651N319N669
337c603l118j0109O304k901o40k69k953J6663r094n962O731o273K429M464O871
352a460n559M79N697n636m07m932J4757M210j2299J0054j885n098J572O659j215
$$ plain form
251 12683 10767 5696 6244 -4072 5474 -7942 -12067 6241 -10254 -5797 259 -14766 -20591 -17693
265 -17693 -10462 -15586 -16372 -16173 -11267 -19752 -32096 -15489 -23418 -24048 -9107 -17199 -22735 -23703 -13982
280 -13982 -17397 -20502 -10460 -7896 -3869 -17912 -11904 -3970 -14202 1960 5709 -792 6 5873
294 5873 4182 -2041 7589 11089 20629 13623 6444 21406 9306 11744 22737 17908 18310 20287 24031
309 24031 11299 11211 19251 21210 21575 10923 21216 14934 2899 13207 9892 8276 10717 15208
323 15208 3702 -5274 2320 -739 2026 -4847 -1812 5935 -12281 -8387 -6940 -14591 -9272 -3603
337 -3603 -6721 -16830 -10526 -13427 -14067 -14336 -17289 -626 -9720 -15682 -8951 -15224 -12795 -8331 -1460
352 -1460 -7019 -6540 -843 -6479 -6886 -11818 2939 7149 -5150 4904 3019 -2079 -507 6152 4937
367D937l784J2187n530n189m215M298J1643j3548N728N502j0662r8J565o23m848
382b637J1075j1q738K1n813R160o412m387J2094n125k475k103l25l702L101Q565
398B288o765J653m722L704J899j2703J2656N679n380n47O53j686m476J1312q21
413B744j150K959M64N686j5098M433J3813p236J549L417j062p934O484K245p435
428C879Q741n30K736p779p378J2600m617j555K889J11l863l405K675q680M039
443a37K365j85R98j3424O123J454p674J337K819K663q010K379l776m698O404j127
459a2489N627r254m00J0549j0885k279P256N493n266K192M056r656N875K063K523
474d595o70j855J3608p233o037O807M013K82j77Q030p235J647N380n201M503k113
$$ plain form
367 4937 1153 13340 7810 2621 -1594 2704 14347 799 6527 12029 1367 1269 2834 2211 -2637
382 -2637 8438 8427 -311 -290 -6103 3057 -3355 -7742 4352 -773 -3248 -5351 -5676 -9378 -6277 2288
398 2288 -4477 -2824 -7546 -3842 -1943 -14646 -1990 3689 -1691 -2238 -1585 -3271 -7747 3565 2744
413 2744 1594 4553 5017 10703 -4395 38 13851 6615 8164 11581 10519 2585 9069 11314 3879
428 3879 12620 12090 14826 7047 -331 12269 7652 6097 8986 9097 5234 1829 4504 -4176 -137
443 -137 2228 2043 3041 -10383 -4260 -2806 -10480 -9143 -6324 -3661 -11671 -9292 -13068 -17766 -11362 -12489
459 -12489 -6862 -16116 -16516 -5967 -16852 -19131 -11875 -6382 -11648 -9456 -5400 -15056 -9181 -7118 -4595
474 -4595 -5265 -7120 6488 -745 -6782 25 4038 4320 4143 12173 4938 6585 11965 6764 11267 9154
490I154P130K239r490J853K215J827m403M685L40l919M779q357K666l236j549
505E934J0544r918l826L917k30o967k045O919n288J126k117k187k143n762J2279
520B36o987o833Q473r27n557m903P665j605j518N960m940N27k390N095k99o694
536a4697R640J910j114m905K422M064l843P702k861Q63L952m026N069m318Q50
551G08P105J769m701k396P755o069J338J236j083O432p687N550l086r307J0174
566G738J380m921k716O503k881p026K829j465K524l277K771L43j2270P567J465
581a436n276m44L939M135r977K173j98k447N342j593L339m522R82K763l327k49
597f796K005Q616n250j118L571m429O748l755K345N304m587N091j559l888l62
$$ plain form
490 9154 16284 18523 9033 10886 13101 14928 10525 15210 15550 11631 16410 8053 10719 7483 5934
505 5934 16478 6560 2734 6651 6421 -546 -2591 4328 -960 166 -1951 -4138 -6281 -12043 236
520 236 -6751 -13584 -5111 -6038 -11595 -16498 -8833 -10438 -11956 -5996 -10936 -10409 -12799 -7704 -8003 -14697
536 -14697 -5057 -3147 -4261 -9166 -6744 -2680 -6523 1179 -1682 -819 3133 -893 4176 -142 708
551 708 7813 9582 4881 2485 10240 4171 5509 6745 5662 12094 4407 9957 6871 -2436 7738
566 7738 9118 4197 1481 7984 5103 -1923 906 -559 1965 -1312 1459 1802 -10468 -2901 -1436
581 -1436 -6712 -7156 -3217 918 -9059 -6886 -7084 -9531 -4189 -5782 -2443 -6965 -5983 -3220 -6547 -6796
597 -6796 -4791 3825 -1425 -2543 1028 -3401 3347 -408 1937 7241 2654 7745 6186 2298 1936
612A936Q325J339o219N350k006O09l020j143Q431p700N276J537r104j077L258
627E792L221p979K752L306n207j213m445L327l754J986M550q186j559l82K581
642e210n654j963Q144m216J55l455k653L977l130N582l67k215j78K382j016o374
658a6191Q927J511N32M87l731P293n150J976N956k622L893K180J075p748M298
673B686O899k660K522j180M178k452m186P036k963J599M281L18n788k364P727
688A5653n420K73J103l33K419q191J304j798j426L061o44r80p427M490j913m951
704d780J630n56N264o671l691K636m346J897N01J388m388M50M668q308J458J450
720a1398M098O92n528M496j321j213J835J622m91j82R004o517k467N533o36N642
$$ plain form
612 1936 10261 11600 5381 10731 8725 9334 6314 5171 13602 5902 11178 12715 3611 2534 5792
627 5792 9013 1034 3786 7092 1885 672 -3773 -446 -4200 -2214 2336 -5850 -7409 -7791 -5210
642 -5210 -10864 -12827 -4683 -8899 -8744 -12199 -14852 -10875 -14005 -8423 -8790 -11005 -11183 -8801 -9817 -16191
658 -16191 -7264 -5753 -5221 -4734 -8465 -1172 -6322 -4346 1610 -1012 2881 5061 6136 -1612 2686
673 2686 9585 6925 9447 8267 12445 9993 5807 12843 9880 11479 15760 16078 10290 7926 15653
688 15653 10233 10506 11609 11276 13695 5504 6808 5010 3584 6645 6001 5021 -2406 2084 171 -4780
704 -4780 -3150 -3706 1558 -5113 -8804 -6168 -10514 -8617 -8116 -6728 -11116 -10666 -5998 -14306 -12848 -11398
720 -11398 -7300 -6608 -12136 -7640 -8961 -10174 -8339 -6717 -7208 -7390 1614 -4903 -7370 -1837 -2473 3169
736C169m183L252K999l277N96J209J25q84P269j075o829N693l177L461j356k897
752D095Q017m214j001j050j190q40J505K778o141J047R76j514p29o566P720q52
768B041l999K019k606j86k449N315m548k314N678k736j448l094K417L503k847
783e254K680j815J810k458J916J959n740Q089J33j449j505j213N453j216k11J343
799B522K565p93j506L397n588L573M805l636J162l815M203M63o194L090J741M73
815F462m173L173l536l659O652l406p65j891J365K125q517J763J434p63o90l33
831d759P69o030M955j394l610K618j35L772n075j573K266Q0K171k565L824j737
847f423L14K948m072L343L06L912R64m478L462J048J695l265L925M098m283N436
$$ plain form
736 3169 -1014 2238 5237 1960 2556 3765 3890 3006 10275 9200 2371 8064 4887 8348 6992 4095
752 4095 12112 7898 6897 5847 4657 3817 5322 8100 1959 3006 3982 2468 1739 -4827 2893 2041
768 2041 -1958 61 -2545 -2731 -5180 135 -4413 -6727 -1049 -3785 -5233 -8327 -5910 -2407 -5254
783 -5254 -2574 -4389 -2579 -5037 -3121 -1162 -6902 1187 1320 -129 -1634 -2847 2606 1390 1179 2522
799 2522 5087 4294 2788 6185 597 4170 8975 5339 6501 2686 6889 7352 1158 4248 5989 6462
815 6462 2289 5462 1926 -1733 4919 1513 748 -1143 222 2347 -6170 -4407 -2973 -3736 -4426 -4759
831 -4759 -3990 -10020 -5065 -6459 -10069 -7451 -7586 -3814 -8889 -10462 -8196 -8116 -5945 -8510 -4686 -6423
847 -6423 -6109 -3161 -7233 -3890 -3584 328 1292 -3186 276 1324 3019 -246 3679 7777 3494 8930
863H930l326j020K165K050L952o049L021K500k151k607K5N449m976L596l75o405
879D779K845j105J774l979p03M527m061j834l330K499j673p07K656o373J719j254
895d220j991l90k759M584j231j431l246J35K983m121K789K38p43J498k187K097
911g995m076L290M734k145q78r7N201m320L60M916j959M216p52P98k500R3P062
928E948k876O9R61L871j343l779M569j734K266J635j923k7k712M561j841k225
944E420K242n44K376o427J324k92j327L577m266K309l455n37J852m785L22J192
960a019K432m415k144K344k878J335j436J712N56k362M008n109j738L385K479
975b850l65l790N411l202m00J628m30K788l51L570j811l141L573N39J298k767
$$ plain form
863 8930 5604 4584 6749 8799 12751 6702 9723 12223 10072 7465 7490 12939 7963 11559 11184 4779
879 4779 7624 6519 8293 4314 3611 8138 4077 2243 -1087 1412 -261 -968 1688 -4685 -2966 -4220
895 -4220 -6211 -6601 -9360 -4776 -6007 -7438 -10684 -10549 -7566 -11687 -8898 -8660 -9403 -7905 -10092 -7995
911 -7995 -12071 -8781 -4047 -6192 -7070 -7167 -1966 -6286 -5926 -1010 -2969 1247 495 1293 -1207 -1114 5948
928 5948 3072 3141 4102 7973 6630 2851 7420 5686 7952 9587 7664 7637 4925 9486 7645 5420
944 5420 7662 7118 9494 3067 4391 4099 2772 6349 2083 4392 937 400 2252 -2533 -2211 -1019
960 -1019 1413 -3002 -5146 -2802 -5680 -4345 -5781 -4069 -3513 -5875 -1867 -6976 -8714 -5329 -2850
975 -2850 -3215 -7005 -1594 -4796 -5196 -3568 -3998 -1210 -1561 2009 198 -2943 630 1169 2467 -300
991c00L779J527l678K382l648L295J572n93J114l359J497j83R30k395j283O478
1007G135m139k39j999k90J842l032K567j568j793K064j593j728l913P164j175
1022f97l420J414l322K547k578J120J263k664L663q12j941k303L682K792m122
1037e378L380j012J102R00k282K721j472L834Q15j409p4n16M913l111P77K005
1053E193j95L137m390K059M2l41K669j338M23k835L626o40n022L999k64P44k960
1070C907r78J575l301K000j012j314j633J176J820q073K629J238j853N92k467
1085e694J803k347R3j37j903J445k18K631n038l59L722k801L109k728J536K437
1101d449j676J290j854K475K09K384M74l285M633n31Q83j074L72N496k904J198
$$ plain form
991 -300 3479 5006 1328 3710 62 3357 4929 4336 5450 2091 3588 3405 4335 1940 657 7135
1007 7135 2996 2757 758 468 2310 -722 1845 277 -1516 548 -1045 -2773 -6686 478 -697
1022 -697 -4117 -2703 -6025 -3478 -6056 -4936 -3673 -6337 -2674 -3486 -5427 -7730 -4048 -1256 -5378
1037 -5378 -1998 -3010 -1908 -1008 -3290 -569 -2041 1793 2608 1199 1125 609 5522 2411 3188 5193
1053 5193 4998 8135 3745 5804 5846 5505 8174 6836 7259 4424 8050 7410 2388 6387 6123 6867 3907
1070 3907 2929 4504 1203 3203 2191 877 -756 420 2240 -5833 -3204 -1966 -3819 -3227 -5694
1085 -5694 -3891 -6238 -6145 -6282 -8185 -6740 -6958 -4327 -9365 -9724 -6002 -8803 -5694 -8422 -6886 -4449
1101 -4449 -6125 -4835 -6689 -4214 -4005 -1621 -1147 -4432 201 -330 553 -521 -149 5347 2443 3641
1117C641j22k66J760M43K819m138K605K754l373m10q69M280k402m19J388l170
1133D521J882j554J124k119j000M578m101j692r08K93Q35k670J480k424J111j480
1149b124j501Q03l263M657j264k590M67j520K748k695j36J305Q21J77k371K469
1165d017k996K076L233l230K147q49K415p12k618M490J70P66n28Q49j016m17M696
1182D459l389R84J559O09O15m179L040L39N8J075j730J442k491K149j456k396
1198F88K933n37P94l161n31J242j599J546l020K249j035j575J800m315J632O47
1214b242N92j081k564K940j236k89j093J675J957l166L455l432o55L523p75J389
1230a002k246K893M48j812M60K42L041j448K662o28k541L981j405P38l58O59L255
$$ plain form
1117 3641 3519 3253 5013 5456 8275 4137 6742 9496 6123 5713 4844 9124 6722 6303 7691 4521
1133 4521 6403 4849 5973 3854 2854 7432 3331 1639 731 1024 1859 -811 669 -1755 -644 -2124
1149 -2124 -3625 -2822 -6085 -1428 -2692 -5282 -4815 -6335 -3587 -6282 -6418 -5113 -4292 -4115 -6486 -4017
1165 -4017 -7013 -4937 -1704 -4934 -2787 -3636 -1221 -1933 -4551 -61 109 875 347 1196 180 -237 4459
1182 4459 1070 2054 3613 4222 4837 658 3698 4037 4095 5170 3440 4882 2391 4540 3084 688
1198 688 3621 3084 3878 717 186 1428 -171 1375 -1645 604 -431 -2006 -206 -4521 -2889 -2242
1214 -2242 -1650 -2731 -5295 -2355 -3591 -3880 -4973 -3298 -1341 -4507 -1052 -4484 -5139 -1616 -2391 -1002
1230 -1002 -3248 -355 93 -1719 -1259 -1017 2024 576 3238 2610 69 4050 2645 3383 3025 3684 6939
1247F939k870k14r95J727P27j517K425k975J237j18j626J39j416L848k295k002
1263A014n69l92J680l584J939q87j371J676k915l85j584K652J19l061J163r71
1279e476J185k640L18K308k679L469j382j614Q23Q11K042k342J515O45Q89L3k348
1296d443L546q33K078J071k021J959p12K185l43r43K539N93J421l558J693J357
1312E589j135K420j750J128j073O01M47l291K269P89K69k586q69K405l354R55
1328B814m25j222Q10q94Q33m310Q46J749j612j42k306K147j469j221J094k473
1344e781K641r32M0j329j058K444j229R05j545J493K095k889J771j573J945J179
1360a823o57J748k134K293O04o54O6L20L707k418K16R80p18K005j061J904j928
$$ plain form
1247 6939 4069 3855 2860 4587 5314 3797 6222 3247 4484 4366 2740 2879 1463 5311 3016 1014
1263 1014 445 53 1733 -1851 88 -799 -2170 -494 -3409 -3794 -5378 -2726 -2607 -5668 -4505 -5476
1279 -5476 -4291 -6931 -6613 -4305 -6984 -3515 -4897 -6511 -5688 -4877 -2835 -5177 -3662 -3017 -2128 -2095 -4443
1296 -4443 -897 -1730 348 1419 -602 1357 645 2830 2487 1544 4083 4676 6097 2539 4232 5589
1312 5589 4454 6874 5124 6252 5179 5780 6227 2936 5205 5994 6263 3677 2808 5213 1859 2814
1328 2814 2389 1167 1977 1083 1916 -2394 -1548 201 -1411 -1553 -3859 -1712 -3181 -4402 -3308 -5781
1344 -5781 -3140 -4072 -4032 -5361 -6419 -3975 -5204 -4299 -5844 -4351 -2256 -5145 -3374 -4947 -3002 -1823
1360 -1823 -2480 -732 -2866 -573 31 -623 -557 -237 3470 1052 1268 2248 1530 3535 2474 4378 2450
1377B450P50K491k619l80l10K875j355j482K026k131J146o80j018K09r75K801
1393C798k770j097N0l95J529l534J579n17L0O8k656J839r19R87j04j752Q44q39
1411c859K344k795K07K364r07J230k199J102K80j31K606j869Q86K83J777r94j793
1428a468L862o47N12j8n24J137j173J780r79k36K043m5O5l098K063N58p66P15
1446C781j547J048j036k40m21j379J911r00O06k144j288K401k172J95j383R12
1462a656Q02k488O39j810Q50K03L00k21k241L050j396j484J182m1K213j602O95
1479c005q63L7J943n33J166j812K492J198k766J751k91K317L89m40Q37p78J860
1496C502q56M26N6K90K732k350j02K50J99J349j889J456n76J66n58j137Q63j969
$$ plain form
1377 2450 3200 5691 3072 2692 2382 5257 3902 2420 4446 2315 3461 2781 1763 1972 997 3798
1393 3798 1028 -69 -19 -414 1115 -2419 -840 -1357 -1327 -1259 -3915 -2076 -2995 -2008 -2112 -3864 -3020 -3859
1411 -3859 -1515 -4310 -4103 -1739 -2646 -1416 -3615 -2513 -2233 -2364 242 -1627 -741 -458 1319 325 -1468
1428 -1468 2394 1747 2259 2241 1717 2854 1681 3461 2482 2246 4289 4244 4309 1211 3274 3832 3066 3781
1446 3781 2234 3282 2246 2006 1585 206 2117 1217 1823 -321 -1609 792 -1380 -1185 -2568 -1656
1462 -1656 -854 -3342 -2703 -4513 -3663 -3460 -3160 -3381 -5622 -2572 -3968 -5452 -4270 -4311 -2098 -3700 -3005
1479 -3005 -3868 -3831 -1888 -2421 -1255 -3067 -575 623 -2143 -392 -683 1634 2023 1583 2420 1642 3502
1496 3502 2646 3072 3128 3418 6150 3800 3698 3948 4147 5496 3607 5063 4487 4653 4095 2958 3821 1852
1514A852K927j315k504J224r33N37k563Q52L92j012K88j927K11j316J025J151
1530a111l275J365q8o45p11q92J887r16J487j160q83Q15l48K141k025P57J420
1547b182k22N19j812J877O44O39L34r76K241j211J132J87r15K985k35K03j811
1564A397R05J819j755R64o35J317r9q66J144k921K312Q04j313m64p03J545j906
1581A545k95L1p78J621k090J222k789J12K343k306M76q70N53J6j635K8p97K164
1599a449l69q18M08j598K240j734O11R7K33K459k239j63P00P56N95j122K247j371
1617e17Q70O95r19P56j84K693j938l80J571n57J095j227J201r3n75J646k360r7
1635A680L67R94o65j681J905j618O06p82o59P26p89J127j820j129P53m61N41j766
$$ plain form
1514 1852 4779 3464 960 2184 1251 1788 -775 77 469 -543 -255 -2182 -1971 -3287 -2262 -1111
1530 -1111 -4386 -3021 -3109 -3754 -4465 -5357 -3470 -4386 -2899 -4059 -4942 -4127 -4475 -2334 -4359 -3602 -2182
1547 -2182 -2404 -1885 -3697 -1820 -1176 -537 -203 -1179 1062 -149 983 1170 255 3240 3005 3208 1397
1564 1397 2302 4121 2366 3330 2695 4012 3913 3047 4191 1270 3582 4386 3073 2609 1906 3451 1545
1581 1545 1250 1281 503 2124 34 1256 -1533 -1421 922 -1384 -908 -1778 -1225 -1209 -2844 -2816 -3613 -1449
1599 -1449 -1818 -2636 -2228 -3826 -1586 -3320 -2709 -2612 -2379 80 -2159 -2322 -1622 -866 -271 -1393 854 -517
1617 -517 353 1048 129 885 701 3394 1456 1076 2647 2090 3185 1958 3159 3066 2491 4137 1777 1680
1635 1680 2047 3041 2376 695 2600 982 1588 806 147 873 84 1211 -609 -1738 -985 -1446 -905 -2671
1653b671P31j65m4j4k384J967k84k32M99j429J510o45N11n52o80K280l49K32j609
1672c328J854Q58j247K216j438R45P29J40L67j517K972k65j71j68K32J568j299
1689B448R78k63k86J565p21j43j051Q79R72j852J056j259R36k81j247L19j520
1706E30J558n93p00l88j009J128j587o0q22Q36R39k907O16p95O8N42p34K82j069
1725d165J538m35j331L24N67J458j967P59N54q56J570l00R0P8J170J027j898J225
1743e92J31J188R8p62J795p04P84k5m30R78o0J100r49L24K12l24J307k000J312
1762C383J75m93J81j772J248q65P33n50j395J233j305Q53j856K28J448j494J71
1779g7j134k06K75k69K43j738J284J52r10l21q50J880q20K32J71r13J384j057
$$ plain form
1653 -2671 -1940 -2105 -2149 -2163 -4547 -2580 -2864 -3096 -2597 -4026 -2516 -3161 -2650 -3202 -3882 -1602 -1951 -1719 -3328
1672 -3328 -1474 -616 -1863 353 -1085 -140 589 729 1096 -421 2551 2286 2115 1947 2179 3747 2448
1689 2448 3426 3163 2877 4442 3721 3578 2527 3406 4378 2526 3582 2323 3259 2978 1731 2050 530
1706 530 2088 1495 795 407 -602 526 -1061 -1121 -1943 -1107 -168 -3075 -2459 -3254 -3186 -2644 -3378 -3096 -4165
1725 -4165 -2627 -3062 -4393 -4069 -3502 -2044 -4011 -3252 -2698 -3554 -1984 -2284 -2194 -2116 -946 81 -1817 -592
1743 -592 -461 727 825 63 1858 1154 1938 1913 1483 2461 2401 3501 2552 2876 3088 2764 4071 2071 3383
1762 3383 3558 3065 3246 1474 2722 1857 2590 2040 645 1878 573 1426 -430 -202 1246 -248 -77
1779 -77 -1211 -1417 -1142 -1411 -1168 -2906 -1622 -1470 -2380 -2701 -3551 -1671 -2491 -2259 -2088 -3001 -1617 -2674
1797b674P05n79N45J481p55L52j158J481Q96q91Q88l18J316j30n46O02p50K038
1815B503o71J72m86l45J893j555J49L42P14K43j115M77j459P81P05j224M84j365
1833B43J434j369j293J373j069R74j224k30m34r0Q76j705Q62n45Q15R9k137J362
1851b058n45P41l7r04R95o40J082p38M2P63j16J795j742K92P62J22R92j263J547
1870A090J33N2O50j224J047K07J495j034q61J684o43pl39L35O31p84Q56j647K97
1889A938N00OL9j944J373k29n86n58o18J141j195K17q53o42R54j473P37j077r0
1908b360J051j281j5j066J227R5q40O38q74J159q35J65L49q96K261p93j98k2L59
1927a876J318r32J175n72O41P58M9J93r44K138j32q25R63l31J138n13p1L22k58
$$ plain form
1797 -2674 -1969 -2548 -2003 -522 -1277 -925 -2083 -602 294 -597 291 -27 1289 1159 613 1215 465 2503
1815 2503 1832 2004 1518 1173 3066 1511 1660 2002 2716 2959 1844 2321 862 1643 2348 1124 1608 243
1833 243 1677 308 -985 388 -681 293 -931 -1161 -1595 -1685 -809 -2514 -1652 -2197 -1382 -1283 -3420 -2058
1851 -2058 -2603 -1862 -1899 -2803 -1808 -2448 -1366 -2104 -2062 -1299 -1415 380 -1362 -1070 -308 -186 806 -457 1090
1870 1090 1223 1275 1925 701 1748 1955 3450 2416 1555 3239 2596 2589 2250 2585 3216 2432 3288 1641 1938
1889 1938 2438 2444 2483 539 1912 1683 1097 539 -79 1062 -133 84 -769 -1411 -457 -1930 -1193 -2270 -2360
1908 -2360 -1309 -2590 -2605 -3671 -2444 -2349 -3189 -2551 -3425 -2266 -3101 -2936 -2587 -3483 -1222 -2015 -2213 -2235 -1876
1927 -1876 -558 -1490 -315 -887 -246 512 561 754 -190 1948 1816 991 1954 1623 2761 2248 2177 2499 2241
1946B241J215q31j28O4r6Q33j336N88m85N14P2j630O57n13O35n77p59K37j097
1965c96R93o29j353M15M24L73k189P76p4j68K76j159Q82o11N03M6j339R64L3M64
1985a769n46m63J586r46R09o68M65O48j2R40j343J006N61K6M28j030J431j7J6
2004A222L28j051J546k92K67k03l63J186j006O29j406J060J045j327K36j374J163
2021A660l73m24L48j176P64l39k00p92l41J601j731L77o32J42R3q17O63j530J149
2040a558O88j331K47l88J045l09l0M53o16J052m39k22N63j34J333j164N36K29
2058d5r3J429j279Q18J48R14j43j405J800n92P17O68r99R4l92R15j383J78L34
2077A684M84M75j025R8m9j356Q93r68O32l12L41j153j075J326r81J021j051n69
$$ plain form
1946 2241 3456 2625 2497 2561 2465 3298 1962 2550 2065 2579 2651 1021 1678 1165 1800 1223 464 701 -396
1965 -396 597 -32 -1385 -970 -546 -173 -2362 -1586 -1660 -1828 -1552 -2711 -1829 -2440 -1937 -1891 -3230 -2266 -2233 -1769
1985 -1769 -2315 -2778 -1192 -2138 -1229 -1897 -1432 -784 -796 144 -1199 -193 368 394 822 -208 1223 1206 1222
2004 1222 1550 499 2045 1753 2020 1817 1454 2640 1634 2263 857 1917 2962 1635 1871 497 1660
2021 1660 1287 863 1211 35 799 460 260 -532 -873 728 -1003 -626 -1258 -1116 -1023 -1840 -1177 -2707 -1558
2040 -1558 -870 -2201 -1954 -2342 -1297 -1606 -1636 -1183 -1799 -747 -1186 -1408 -845 -979 354 -810 -274 -45
2058 -45 -138 1291 12 830 978 1892 1749 344 2144 1552 2269 2937 1938 2032 1640 2555 1172 1350 1684
2077 1684 2168 2643 1618 1716 1667 311 1204 236 868 556 897 -256 -1331 -5 -986 35 -1016 -1585
2095a585M10p01O23j454L69O78k68J21j335J249n93K47L63j362J688k23j01q3
2113a957J0R57k57Q50p32J96J238l29O88j360J378Q41p76N84n95J020L0L36j61
2132A961o17J728o12m57j98J58J156r91O39j117LP14o04J08j146J254l40r54J30
2151H15j376J482o12k92k95r57J007r17p5l36K1R07j419K58r26O50P72j374N86
2170b081m09R26o94l5L74n99J453n85r9J49L74J084j174M31P31r5O72q63P22k95
2190a3J194J64j093J280l48R35q12j95J026o37R74p24n18N34k42Q00j442Q19k40
2209A462J42m0j222R47o30N59k84j121O30p78L92r94k47P55o24O25j285R2Q07
2228h14p12K48r38Q26j70p5L34j104J137m9L84l96l94J554r47O92L17p98J424
$$ plain form
2095 -1585 -1175 -1876 -1253 -2707 -2338 -1660 -1928 -1807 -3142 -1893 -2486 -2239 -1876 -3238 -1550 -1773 -1874 -1957
2113 -1957 -1947 -990 -1247 -397 -1129 -933 305 -24 664 -696 682 1523 747 1331 736 1756 1786 2122 1961
2132 1961 1344 3072 2460 2003 1805 1963 3119 2128 2767 1650 1653 2367 1763 1871 725 1979 1639 685 815
2151 815 -561 921 309 17 -278 -1235 -228 -1145 -1220 -1556 -1535 -628 -2047 -1789 -2715 -2065 -1293 -2667 -2081
2170 -2081 -2490 -1564 -2258 -2293 -1919 -2518 -1065 -1650 -1749 -1600 -1226 -142 -1316 -885 -154 -249 423 -440 282 -13
2190 -13 1181 1345 252 1532 1184 2119 1307 1112 2138 1501 2475 1751 1233 1767 1525 2325 883 1702 1462
2209 1462 1604 1564 342 1289 659 1218 934 -187 443 -335 57 -937 -1184 -429 -1053 -428 -1713 -1621 -814
2228 -814 -1526 -1278 -2216 -1390 -1560 -1635 -1301 -2405 -1268 -1317 -933 -1329 -1723 -169 -1116 -424 -107 -905 519
2247E19p88O93j024P80Q39l70M81o42J119k8j39k55l33J317m77j22j35j03J052
2266B384j156O03p61O7P58j165L66q28O99K4r99M89q30O32n44m97m6n09J341j428
2286a400l10K61j53Q92j297L20k13L9M94r90R22n80Q46j1p37P70PQ25p17k00P97
2307d35k65J159q25L55L90l09J021r15Q13L25M65k01l33P06m28N27O5m76O93m77
2327A855N83j016j82J020n60L5q62P62j61m25L61j564J106m81O4m80r80R65o88
2346f48Q7n61n12R87q31M18j118M7Q38k47R3j183P81J92l20K96p79J329n28o1
2366a720J75k88J089l22M28o4l93J513o33l1k32J021N25q57P43k15O60O8l04N98
2386A761q26J158n38P5k46J71N21r40N88j83p1N85j592O21l01K57J94j133K99
$$ plain form
2247 519 -269 424 -600 180 1019 649 1130 488 1607 1579 1440 1185 852 2169 1692 1570 1435 1332 2384
2266 2384 1228 1831 1070 1137 1895 730 1096 268 967 991 -8 481 -349 283 -261 -758 -804 -1313 28 -1400
2286 -1400 -1710 -1449 -1602 -710 -2007 -1687 -1900 -1861 -1367 -2357 -1435 -2015 -1169 -1180 -1917 -1147 -1140 -315 -1032 -1232 -435
2307 -435 -700 459 -366 -11 379 70 1091 176 989 1314 1779 1578 1245 1951 1523 2050 2115 1639 2332 1855
2327 1855 2438 1422 1240 2260 1700 1735 873 1635 1474 1049 1410 -154 952 471 535 55 -925 40 -648
2346 -648 -561 -1122 -1634 -647 -1478 -1060 -2178 -2131 -1293 -1540 -1447 -2630 -1849 -1657 -1977 -1681 -2460 -1131 -1659 -1720
2366 -1720 -1545 -1833 -744 -1066 -638 -702 -1095 418 -215 -246 -478 543 1068 211 954 739 1399 1467 1163 1761
2386 1761 935 2093 1555 1630 1384 1555 2076 1136 1724 1541 1470 2055 463 1084 783 1040 1234 101 400
2405D00m84O04l69q40L51j22M69j150k27N55l24O66j106J6J42Q5P0j115J286j23
2425a216q1k00l35Q76l38R88k46o82Q01N3M79r93O43N82m31R99r30O39R2J96K08
2446A104o74J049j11M9j05n84J008n46N01o87o3P92o83J65p25L81lm94N37j095
2466a84L93K89p05J18o75Q62o62j26lp66Q39p06L87o80O2Q09j185N56o11P70M70
2487g48r06P03r37Q38M33m14M2L0J024q52K76L84j80J136n23K14j29M72L56n17
2507G02O90p08Q00K68r39N10k00J141p40k77P65n06L88n47J58l02m1O26j449J50
2527D89O1m8j5q84Q55m94J77n49n13N56q18N69r41j87P16o07J24n79N94j86j98
2548a878N68r48Q55k59L96R6r50J286n73L53L47m94R87k78O39k88J54O96n22P30
$$ plain form
2405 400 -84 520 151 -689 -338 -460 9 -1141 -1368 -813 -1137 -471 -1577 -1561 -1419 -1334 -1264 -2379 -1093 -1216
2425 -1216 -1297 -1497 -1832 -956 -1294 -306 -552 -1234 -433 -380 99 -894 -251 331 -100 899 -31 608 700 896 1104
2446 1104 430 1479 1368 1417 1312 728 1736 1190 1691 1004 941 1733 1050 1215 490 871 868 374 911 -184
2466 -184 209 498 -207 -89 -764 98 -564 -690 -693 -1459 -620 -1326 -939 -1619 -1557 -748 -1933 -1377 -1988 -1218 -748
2487 -748 -1654 -951 -1888 -1050 -617 -1031 -989 -959 65 -787 -511 -127 -307 829 306 520 391 863 1219 702
2507 702 1392 684 1484 1752 813 1323 1123 2264 1524 1247 2012 1506 1894 1347 1505 1203 1162 1788 339 489
2527 489 550 502 487 -397 458 -36 141 -408 -921 -365 -1183 -614 -1555 -1742 -1026 -1633 -1509 -2088 -1494 -1680 -1878
2548 -1878 -1310 -2258 -1403 -1662 -1266 -1170 -2120 -834 -1407 -1054 -707 -1201 -214 -492 147 -141 13 709 187 917
2568I17o14N72K79j79L46r54J407r3n42M05l48Q86p76N06m12n70J119l73m03k12
2588I61J22M6p99K67l94L48j3l65L1q44J029m94p69Pk2L76p06J33k16Q5L39p61
2610a639L01n15M50K06m19O30p23N55N13n86M26k22J113j038P8O35k65R23p77
2629c54M86J59K64Q25j215Q80q5J78M0o53R26p05J115p14m81J27O5Q70p85m06
2649E37O09k34J16p14j36L64k96L86r99M39n20N09k87l88K59j83K00q19q2O64
2669e75o76O35q33L72j08l41Q32p60L73M09j60p9k30R09m26M37k46j26Q26k84
2689e1kj13L55P47m27L44k61O24r5j71L53p67J093k91j14J27o68P76o6m54L08
2710A247n95N08l10j61k62L29J74o42L86n68J26J79r96k4l03P85o23k08j37q6
$$ plain form
2568 917 303 875 1154 975 1321 367 1774 1681 1139 1544 1196 2082 1306 1812 1400 830 1949 1576 1173 961
2588 961 1083 1129 330 597 203 551 538 173 204 -640 389 -105 -874 -867 -889 -513 -1219 -1086 -1302 -1217 -878 -1639
2610 -1639 -1338 -1853 -1403 -1197 -1616 -986 -1709 -1154 -641 -1227 -801 -1023 90 -948 -870 -235 -500 423 -354
2629 -354 132 291 555 1380 165 1045 960 1138 1178 525 1451 746 1861 1147 666 793 858 1728 943 537
2649 537 1146 912 1028 314 178 542 246 632 -367 72 -448 61 -226 -614 -355 -538 -338 -1157 -1239 -575
2669 -575 -1251 -616 -1449 -1077 -1185 -1526 -694 -1454 -1081 -672 -832 -911 -1141 -232 -658 -221 -467 -593 233 -51
2689 -51 -53 -166 189 936 509 853 592 1216 1121 950 1303 536 1629 1338 1224 1351 683 1459 1393 939 1247
2710 1247 652 1160 850 689 427 756 930 288 674 106 232 411 -585 -609 -912 -127 -750 -958 -1095 -1181
2730a181L37o05j13L76j78P80q31j35J10L98L2n34P28k33K55K01m04L34j35P84
2750a4l77j02Q57l52N79k94O0K55n5M85l24M54m9jN06o81L82K4L30l74j80M50
2772A579j01J77o28k91K16j47L70q41P6L39k97m5o81M75l57M8n61j75L76j88J2
2793f44m32m26Q72n37J83m53p7N36l87K03n51M84J31m6P8j96P12l18L87J00m65
2814h46R47m45K38P9j5P47l79L26l19N53K19m44n8o1N05K96n18K10k51O03n78
2835H09m5J32j96O32p13l35Q3J20K63p46K54j37mM5m16j91j54P06l32n66J49j72
2857h14M79o29m17L93j02N24q45J32M58K0j7l35O58l10O34k89l71Q05k00L97k81
2878a10J78N17m66L56k90o6O36m9N48j136R51P4k77J90n34O46j98L54n78k16P69
$$ plain form
2730 -1181 -844 -1449 -1562 -1186 -1364 -584 -1415 -1550 -1440 -1042 -1010 -1544 -816 -1049 -794 -593 -997 -663 -798 -14
2750 -14 -391 -493 364 12 591 297 357 612 557 1042 718 1172 1123 1122 1628 947 1329 1353 1683 1309 1129 1579
2772 1579 1478 1655 1027 736 952 805 1175 334 410 749 452 407 -274 201 -156 -108 -669 -844 -468 -656 -644
2793 -644 -1076 -1502 -630 -1167 -984 -1437 -1514 -978 -1365 -1162 -1713 -1229 -1098 -1144 -1066 -1262 -550 -868 -481 -381 -846
2814 -846 101 -344 -106 -27 -42 705 326 652 333 886 1105 661 603 542 1047 1343 825 1035 784 1387 809
2835 809 764 896 700 1332 619 284 367 487 750 4 258 121 117 162 -254 -445 -599 107 -225 -791 -642 -814
2857 -814 -335 -964 -1381 -988 -1090 -566 -1411 -1279 -821 -801 -818 -1153 -495 -805 -171 -460 -831 -26 -226 171 -110
2878 -110 68 585 119 475 185 119 755 706 1254 118 1069 1143 866 1056 522 1168 970 1324 746 530 1299
2899A299n29J46l58p6L49k73J87n91m14L12j71K8m98N25j15k07p4q73Q80l08K05
2920e56n97k5L93o05K13k56K37M49n59K44m36N46N79l75Q2j19O26m9k09J91j88
2941d14P02k38J36K24%N73n81M46p7r8M20l71L21M1K40J99q30M51m82P09l57k89
2963G25J47N9J02n80K18l20L71J87q66M35p62Q4M30p47K57k71J6j96k61L48l76
2984a000L87k17l20M55l21M17n55n5L18Lnl76N02k03L50J89j64J45R9M76k83k12
3006c70N39L5P6R9j07L79j88K63l32L40O08l30Ml35K46J6K3j83l04N24j63p1l52
3029D17N3L09m09kk19O4K98n36K01o45Q72l84n77L19l31J55k40j74M0M3M99n85
3051h32j21P4j8P02j058L37K67J10Rr9L14O3J27L6l36M97k11N07j84k64M99j2
$$ plain form
2899 1299 770 916 558 482 831 558 745 154 -260 52 -119 -91 -589 -64 -179 -386 -460 -1333 -453 -761 -556
2920 -556 -1153 -1178 -785 -1390 -1177 -1433 -1196 -747 -1306 -1062 -1498 -952 -373 -748 -666 -785 -159 -208 -417 -226 -414
2941 -414 288 50 186 410 410 983 402 848 771 673 1093 722 1043 1084 1324 1523 693 1144 662 1371 1014 725
2963 725 872 931 1033 453 671 351 722 909 43 478 -284 -200 230 -517 -260 -531 -515 -711 -972 -624 -1000
2984 -1000 -613 -830 -1150 -695 -1016 -599 -1154 -1209 -891 -888 -893 -1269 -767 -970 -620 -431 -595 -450 -351 125 -158 -370
3006 -370 169 204 280 379 272 651 463 726 394 734 1342 1012 1016 681 927 943 966 783 479 1003 840 769 417
3029 417 470 779 370 368 149 213 511 -25 176 -469 403 19 -558 -239 -570 -415 -655 -829 -789 -746 -247 -832
3051 -832 -953 -879 -897 -195 -1253 -916 -649 -539 -530 -629 -315 -252 -125 -89 -425 72 -139 368 184 -80 419 407
3073D07L42l79K29j60J27K89j17J38k36J23K79n69M40n35O68m31J10M8l04J59
3093F28l38k9J90m02M16q48L39Qj97Mo83P11m14M20m48l39P15n31K76n69l66O85
3115g72j97L64o10N63l7l23M11k71O91l96M63p3m49P27j58K24j74j65J006l80
3135D44J19L4n6M92k38K73l80K38J92n43N07l04M04k45j27K82n74O40p71K59k5
3156F21j95L2j41K1m27J29K49q03K92n32O10n8n69L16l00N36k55o00K82l83Q85
3177b90r95J29N20k65J23j98K22j45K85K77k53J62j39M13n5l23M77r4L39k84R0
3198dL24j74O63m49K39J28J74j33m35N37J30l0o3k54L30k27J82k94r1K81k17K40
3220H57o17j49O25o10N47o38J09j71l09N30q97N47l06O0p5l06M35k22Rl41O6J55
$$ plain form
3073 407 749 370 599 439 566 855 738 876 640 763 1042 473 913 378 1046 615 725 773 469 628
3093 628 290 261 451 49 465 -383 -44 -36 -233 -229 -912 -201 -615 -195 -643 -982 -267 -798 -522 -1091 -1457 -772
3115 -772 -969 -605 -1215 -652 -689 -1012 -601 -872 -181 -577 -114 -187 -636 91 -67 157 -17 -182 824 444
3135 444 563 597 541 1033 795 1068 688 926 1118 575 1082 778 1182 937 810 1092 518 1158 387 646 621
3156 621 426 458 317 338 -89 40 289 -514 -222 -754 -144 -202 -771 -455 -755 -219 -474 -1074 -792 -1175 -290
3177 -290 -1285 -1156 -636 -901 -778 -976 -754 -899 -614 -337 -590 -428 -567 -154 -209 -532 -55 -149 190 -94 -4
3198 -4 320 146 809 360 599 727 901 768 333 870 1000 970 907 653 983 756 938 644 553 834 617 857
3220 857 240 91 716 106 653 15 124 -47 -356 174 -723 -176 -482 -422 -497 -803 -368 -590 -581 -922 -856 -701
3242g01j89L67k95R3J52k48L83l33M89J48k49K43k76M22j69J88J0q5M59m50M43
3263D02m3k72P39l97K58m65M56M27o39L30j92L88m57j81J26J79L07k78k90m1m13
3284e6N24k71k16J29k36K76m31J33k35J31j84k39K51l88L71j41j75J8Q3M86o15
3305g85j4K45k03N22n71K47mJ1J10l05M03K98n9j65J83M13m73N40r1j92O35r1
3327F54L2k47o9L94j72K81m27M39j41L5J3n24P40p7k63j70j11J63l56K76l91k01
3349a22M15m00L19m94Q2n8m9om26K72J61k27j46l36O08m02P3j46j35N13q3J8m65
3372a034K81M43l83K12k33L48L42k84j20k55Q09j04j38RL23M98l90k16K80J98
3392E86J00j67M61j55JO4k70j27J17Q3L40k51j20LK48l94O4j00j72L00o78K43
$$ plain form
3242 -701 -890 -523 -818 -725 -573 -821 -438 -771 -282 -134 -383 -140 -416 6 -163 25 35 -50 409 -41 402
3263 402 359 87 826 429 687 222 678 1105 466 796 604 992 535 354 480 659 966 688 398 357 -56
3284 -56 468 197 -19 110 -126 150 -281 -148 -383 -252 -436 -675 -424 -812 -441 -582 -757 -739 -656 -170 -785
3305 -785 -799 -554 -757 -235 -806 -559 -563 -552 -442 -747 -344 -46 -105 -270 -87 326 -147 393 302 110 745 654
3327 654 686 439 370 764 592 873 446 885 744 779 792 268 1008 931 668 498 387 550 194 470 79 -122
3349 -122 293 -107 212 -282 -200 -258 -307 -313 -739 -467 -306 -533 -679 -1015 -407 -809 -736 -882 -1017 -504 -587 -569 -1034
3372 -1034 -753 -310 -693 -481 -714 -366 -24 -308 -428 -683 126 22 -116 -107 216 714 324 108 388 586
3392 586 686 519 980 825 826 890 620 493 610 693 1033 782 662 665 913 519 583 483 311 611 -67 176
3414A76k50L07K26q91M07J4l40J51m37K82l26J55j23k20J53j82M73n1l56M11k56
3435f77M43o76N06k14J22L67n64O39l68K88J23l55M66j61N26p9j18K16J94k42
3455D36k39L30K91l39L54l11k9J80k29L7k80L33J90k06j88j44K52p2j04k11j30
3476g9N55n18o6k72K41k8l21M39k37O4j31L9l4l13K67o0k69J22l04P90n35j27
3498g77Q2J05L68k21L7q6K89J65k49J35R6K05m8n3K31k40N99k55j08m7K33M26
3520H87n48M50j56K9O4j33o2J72p1J93l86K79m82K93k42l03K51kK47p20L19j90
3542a11j18J55l44j30K53N8J49m19j9m0Q3q9l05L94k04K68o7l43K26k62L97j19
3564e87L30r1l18N35l31L31N2M2J8k32O02j32k2J1j28M40M4k9l74K92M82n40L24
$$ plain form
3414 176 -74 233 459 -432 -25 -11 -351 -200 -637 -355 -681 -526 -649 -869 -716 -898 -425 -476 -832 -421 -677
3435 -677 -234 -910 -404 -618 -496 -129 -693 -54 -422 -134 -11 -366 100 -61 465 386 268 484 678 436
3455 436 197 527 818 479 833 522 493 673 444 481 201 534 724 518 330 186 438 366 262 51 -79
3476 -79 476 -42 -108 -380 -139 -167 -488 -49 -286 -222 -353 -314 -348 -661 -394 -454 -723 -601 -905 -115 -650 -777
3498 -777 -695 -590 -222 -443 -406 -492 -203 -38 -287 -152 -56 149 101 48 279 39 638 383 275 228 461 887
3520 887 339 789 633 662 726 593 531 703 632 825 439 718 236 529 287 -16 235 233 480 -240 79 -111
3542 -111 -229 -74 -418 -548 -295 -237 -88 -507 -526 -566 -483 -572 -877 -483 -687 -419 -486 -829 -603 -865 -468 -587
3564 -587 -257 -348 -666 -131 -462 -131 -79 -37 -19 -251 351 219 197 208 80 520 564 535 161 453 935 395 719
3587G19j87J07kj21L21m31L52O9k65k36j91M99m23o7j17k7L90k21j41l11k7L72
3609F2o39nr9K75K30j47l24J01O0j59K45m15k97O20k04J06k01J73L64o73K62J91
3631d74M77l18J7J47L25m95N75l33P31p11N71K9l55K37j52L42l96L55j53K20j4
3652F25m13M08m5k75K54j03R5j50K52n80r9L04l27L06k42j79J96k3O9m68Q9L6
3674b70k59L79m42J19k34J48J88l44K53n6l73M78j38L37j99K45k93M6M55k30N1
3695a39N0K0p2K00m5q1L05j17K08o3K6M29j17l99K30k25L05j81j0p2M77k45l38
3718A46L03m01M18j4j27J15l76K46o0J73l65J22J1N6m50m9J03ml61J35j79J97
3740c61K01m24J78j25J95m7j36J70k55M32m05j63J27K97J12k83J14L34m7J14m82
$$ plain form
3587 719 532 639 637 516 837 406 758 827 562 326 135 634 211 144 27 0 390 169 28 -283 -310 62
3609 62 -577 -582 -681 -406 -176 -323 -647 -546 -486 -645 -400 -815 -1112 -492 -696 -590 -791 -618 -254 -927 -665 -474
3631 -474 3 -315 -298 -151 174 -321 254 -79 652 -59 512 541 186 423 271 613 217 572 419 639 625
3652 625 212 620 575 300 554 451 546 396 648 68 -31 273 -54 252 10 -169 27 4 73 -395 -306 -270
3674 -270 -529 -150 -592 -473 -707 -559 -371 -715 -462 -518 -891 -413 -551 -214 -413 -168 -461 -415 40 -190 -139
3695 -139 -89 -69 -141 59 14 -67 238 121 329 266 292 721 604 205 435 210 515 334 324 252 729 484 146
3718 146 449 48 466 452 325 440 64 310 250 423 58 180 191 247 -203 -252 -149 -153 -514 -379 -558 -361
3740 -361 -160 -584 -406 -531 -336 -383 -519 -349 -604 -172 -577 -740 -613 -316 -204 -487 -373 -39 -86 28 -454
3761d54M53r1K79R2k55K46J97Q7p4q6J40L2J87j88k7L0L26l0l27Q7J03k11J43
3784F59n75K94L1j04M5j86L28m99J01j93J4j2qJ3k17r4J67j45J16m37l3L61r6
3807d70M8k52M9J44Q5l82J09L96j62j08l3J53J94N1j66j13N40J7l20J52L15q1
3829A66O8k10Q0L03J94k46k24K09K3m0K11m4N3q1K57m8l00MMM0k94K26L7j06j32
3854A50J80k09j87J50k72J4n4Q1O6k76j01J59r9M19n92K26l1K68j63k72N49o47
3876f41K45p0%K27j12K96m33P2L76k74M13l63M75j26K31p9l8K07j51K18k91R4
3898B76J30p2K46k78J4L43M6J17n28J96r6JO8k28q6Q5j70r3J28k2k47J64j23j
3922a30L64l62J56k56k33K84k51O1k25J06j1L4J0n28N36kQ6l2l23O99p64M28m9
$$ plain form
3761 -454 -1 -92 187 279 24 270 467 554 480 394 534 566 753 565 538 568 894 864 537 624 727 516 659
3784 659 84 378 409 305 350 164 492 -7 94 -99 -85 -97 -105 -92 -309 -403 -236 -381 -265 -702 -735 -374 -470
3807 -470 -422 -674 -625 -481 -396 -778 -669 -273 -435 -543 -576 -423 -229 -178 -344 -457 83 100 -220 -68 247 166
3829 166 234 24 104 407 601 355 131 340 363 323 534 490 543 462 719 671 371 375 379 419 125 351 388 282 150
3854 150 330 121 -66 84 -188 -174 -228 -147 -81 -357 -458 -299 -398 21 -571 -345 -376 -108 -271 -543 6 -641
3876 -641 -396 -466 -466 -239 -351 -55 -488 -416 -40 -314 99 -264 211 85 316 237 199 406 255 473 182 276
3898 276 406 334 580 302 316 659 705 822 294 490 394 395 463 235 149 234 64 -29 99 77 -170 -6 -129 -130
3922 -130 234 -128 28 -228 -461 -177 -428 -367 -592 -486 -497 -463 -453 -981 -445 -447 -361 -393 -716 -17 -781 -353 -402
3945d02J8O16n48J04O5L0O1r7Q2P2M82r2n16K75M1N76l45l6K0L96j58l14J32K8
3969D90j31L27l73K64k48J56L5n70N80l91L41p31K40j62l10O11j92l69K83J14
3989c6k04j61L0K89m0k11k49J28o4K26j33j75J54k11N39k01j04J42j98L35j03
4010b47l06L64l46M73kJ50O5qJ24l57K61kK87k97N6L26k45L30J1l69J79M5J41
4033F33j39r5J40j23O6j46k28L86k42J76n49L79J71m03k3l93L91l11PK00k09N5
4055b57k40J47q8j19M55l85J46m02N97j46l38L52j66J51oK42K45l45J33l15L9
4076c00L2J77K46k56O5K75lJ30k93J61l4K05Q9m7o1K87j8l33O4J69j90J70l50
4099A85m3J64j54J26n08L53k2J12k31p0J58k23K50l76j54K86j56K90m23l8K40
$$ plain form
3945 -402 -384 232 -316 -212 -147 -117 -56 -153 -71 1 483 391 -125 150 191 767 422 386 406 802 644 330 462 490
3969 490 359 686 313 577 329 485 520 -50 530 139 480 -251 -11 -173 -483 128 -64 -433 -150 -36
3989 -36 -240 -401 -371 -82 -122 -333 -582 -454 -518 -292 -425 -600 -446 -657 -118 -319 -423 -281 -479 -144 -247
4010 -247 -553 -189 -535 -62 -64 86 151 143 267 -90 171 169 456 159 215 541 296 626 637 268 447 492 633
4033 633 494 399 539 416 482 336 108 494 252 428 -121 258 429 26 3 -390 1 -310 -303 -103 -312 -257
4055 -257 -497 -350 -438 -557 -102 -487 -341 -743 -146 -292 -630 -278 -444 -293 -299 -57 188 -157 -24 -339 -300
4076 -300 -268 -91 155 -101 -36 239 236 366 73 234 200 405 494 447 386 673 655 322 386 555 365 535 185
4099 185 142 306 152 278 -230 123 101 213 -18 -88 70 -153 97 -279 -433 -147 -303 -13 -436 -474 -234
4120b34j47J11k29J48J99k28j39J0J69J70j28j98o1L93l45K3K61KL20k80K87q8
4142A6J89NJ01j32l60M38M71l71l4n4J39k08J13k15M92L1q4k59j56L72j0k35K00
4165D49l81K75k52j31K86k75J05k25k72N2J37J41l82L62n7l21M30l58m6q3K00
4186c46r2m97O33j72L45j98k88J62J12K39k44J00O1OJ93m72N81m5j55J34j96L59
4208B20Q9j23J77l46K81j70L22j25k95P80k33j29j53r0N44m56J79k49K28n6q0
4229C15P7k94k9J40N8J81m76R0O4p6k34p3J43j83J38k54L46l49r8L62l97J27J32
4252b90j48Q1m26L38K76P8l65LO3L31K95n79n0N35k14P8j90L5L1K31Q3l43N12
4275C65k14m60R40l29p3M4K38m41n3L80j71m21Q28k24K31o5l55O23m02R1n93K6
$$ plain form
4120 -234 -381 -270 -499 -351 -152 -380 -519 -509 -340 -170 -298 -496 -557 -164 -509 -486 -225 -223 97 -183 104 16
4142 16 205 210 311 179 -181 257 728 357 323 269 408 200 313 98 590 621 537 278 122 494 484 249 449
4165 449 68 343 91 -40 246 -29 76 -149 -421 -369 -232 -91 -473 -111 -168 -489 -59 -417 -463 -546 -346
4186 -346 -438 -935 -302 -474 -129 -327 -615 -453 -341 -102 -346 -246 -185 -179 14 -458 123 78 -77 57 -139 220
4208 220 309 186 363 17 298 128 450 325 30 810 577 448 295 205 749 293 472 223 451 395 315
4229 315 392 98 69 209 267 448 -28 62 126 50 -184 -257 -114 -297 -159 -413 -67 -416 -514 -152 -549 -422 -290
4252 -290 -438 -357 -783 -445 -169 -91 -456 -453 -390 -59 236 -343 -393 142 -72 6 -184 -149 -118 113 196 -147 365
4275 365 151 -309 631 302 229 273 511 70 17 397 226 -195 633 409 640 575 220 843 441 532 -61 -35
4297c5k49M13J16j092L10J07j06J15M3J01n58M80j28M85j1j26l9j88j44L29L55
4318A78k28j52Qj32m0N32m24K97o18O52q3L47k02J72p89Q83k67J59k14J112r85
4339B06o95P00o53R46k26J68R7p17k07J459j491J280l96p40K50O03j117P64j79
4358E2J008j036J91Q56j925P27m99R19n31p62M54m7N13l2L51l23j016Q07o23J072
4378A56j104M80J04p4Q31j10j00n83K56l2k81L68j98J38J23k11j53Q18K16j89
4398D55n15j36o83R2J403l30j77k67R31p04N37k41j6j48L52j77k88L02j01l28
4418c9M14q3O36r33p43K05n68J525j215J548m39j392J610n68J2q77J346q99O12
4437A52l29j441J646j031J71L85Q3l20m34J422O5r27m5M92j93J38q0q22J700n28
$$ plain form
4297 -35 -284 129 245 -847 -537 -430 -536 -421 -378 -277 -835 -355 -483 2 -9 -135 -174 -362 -506 -177 178
4318 178 -50 -202 -194 -326 -366 166 -258 39 -579 73 -10 337 135 307 -482 401 134 293 79 1191 206
4339 206 -489 211 -442 504 278 446 543 -174 -381 1078 -413 867 471 -269 -19 584 -533 231 52
4358 52 1060 24 215 1071 -854 -127 -626 293 -238 -1000 -546 -593 -80 -112 239 -84 -1100 -293 -916 156
4378 156 -948 -468 -364 -438 393 283 183 -400 -144 -176 -457 -89 -287 -149 -26 -237 -390 428 644 455
4398 455 -60 -196 -879 -787 616 286 109 -158 773 69 606 365 349 201 553 376 88 390 289 -39
4418 -39 375 292 928 -5 -748 -543 -1111 414 -801 747 308 -1084 526 -42 -30 -907 439 -460 152
4437 152 -177 -1618 28 -1003 -832 -447 -364 -684 -1118 304 369 -558 -603 -111 -304 -166 -246 -1068 632 104
4457A04j52n38R54L7m53L93R61j696M44l66R77Q4p25K66J70n57j49J519N3j79
4477A147n89m46j71R52m28k66j97o06O74J93n18O60j060O13j28o99M88J16L70
4496A05o35N30n95N54k5l89Q6O33p74K37J55O8k75k22P08q23N30j94J016o69j00
4517g9L73q80R47p8l21n0L94K22n29K11J64N9j71J52l3k71N41k88k42N40m67k
4539A92j9J4J136j692J029k70l51M3j05N88o59K67k72L74l05k83K25J58j28j90
4559b48j3k35k4J96k61J02M7k5J51l55J00J69O4R7n63P05j8k68L45l88L41j51
4581b32L14j82PL22q9l09K09K57K4m18L11O5Q8J14j48j22J44m4K82m04Q3K38k34
4604B76Kj4k36L18J8m18J7p1K62l2k36N3j40N07l99Ol15J13L26j18l28L20l56
$$ plain form
4457 104 -48 -586 368 405 -48 345 1306 -390 54 -312 665 749 24 290 460 -97 -246 1273 1326 1147
4477 1147 558 112 -59 893 465 199 2 -604 70 263 -255 405 -655 -42 -170 -869 -381 -265 105
4496 105 -530 0 -595 -41 -66 -455 -369 264 -510 -273 -118 -50 -325 -547 161 -662 -132 -326 690 21 -79
4517 -79 294 -586 361 283 -38 -88 306 528 -1 210 374 433 262 414 381 110 651 363 121 661 194 192
4539 192 173 187 1323 -369 660 390 39 82 -23 565 -94 173 -99 275 -30 -313 -88 70 -58 -248
4559 -248 -261 -496 -520 -324 -585 -483 -436 -461 -310 -665 -565 -396 -332 -235 -798 -93 -111 -379 -34 -422 -81 -232
4581 -232 82 -100 -93 229 140 -169 40 297 321 -97 214 279 367 481 333 211 355 311 593 189 272 510 276
4604 276 278 264 28 346 364 -54 -37 -108 154 122 -114 -61 -201 306 -93 -87 -402 -289 37 -81 -409 -89 -445
4627d45J56j67J62o8J42J50l13J65k11L36j61Q7J9j92K87j3l42L98o3L95l86L04
4649B40l28L01K54m69J99L52jk81k16J17L22k21j33n2O0K56m3j24K29K9k96J57
4671C52l61L91q9m7kl44K64j21j03k38K2L48k67J66l09l1P0q5J45l37P7K44r7
4694c52O9l15M27j61J6r1j1J3K88R5n2k70K93R7k46R2L25k1j38K78k00j44L77
4717C69l82M37k2K76j79j86K12o49O92k47j21j9K42j00K7j23l6K59Q5m93r5M2
4739a1L41l30k81K55J00M0j44j96K83j55j71l2j46K32j86L8J2j08KP0L8j23N7
4762d15j24M34j03j46K5J00J80k07K08J24k08L12ml67P05m00K20l31K96L3J1O0
4784D03k96L14L0Jj45N7Mj6l0N0j70J87m3j5j74P7j07j18K93k75L1k23L25j54
$$ plain form
4627 -445 -289 -456 -294 -362 -220 -70 -383 -218 -429 -93 -254 -167 -148 -340 -53 -66 -408 -10 -73 322 -64 240
4649 240 -88 213 467 -2 197 549 548 267 51 168 490 269 136 84 144 400 357 233 462 491 195 352
4671 352 -9 382 293 246 244 -100 164 43 -60 -298 -276 72 -195 -29 -338 -369 -299 -384 -239 -576 -499 -255 -352
4694 -352 -283 -598 -171 -332 -316 -407 -418 -405 -117 -22 -74 -344 -51 46 -200 -108 217 196 58 336 136 -8 369
4717 369 -13 424 402 678 499 313 525 -124 568 321 200 181 423 323 350 227 191 450 535 42 -53 -11
4739 -11 330 0 -281 -26 74 114 -30 -226 57 -98 -269 -301 -447 -215 -401 -363 -351 -459 -457 -387 -349 -472 -415
4762 -415 -539 -105 -208 -354 -329 -229 -49 -256 -48 76 -132 180 176 -191 514 114 334 3 299 332 343 403
4784 403 107 421 451 452 307 364 368 352 322 372 202 389 346 331 157 234 127 9 302 27 58 -165 160 6
4808Fk98L29m19J11J56l22N35m46Q3J62o24M20J17j02k74J22R0P7k5k56O33k54
4830a79j98J81K29p3R9j9k11L63l9j75J37k7J02L09n18M1J14J78N7j79K95j82
4852C05j97P1k3J05K2K96m11k58N04j13K01m06j95n1R7L05j87K21l71N5l37q1
4874d48L08l1o8j37k7Q6j14K50k57r7J26k9K88l01J05J96r8L5j18K16M8j39L44
4897A38k49J30j53L57l63J81J81k1n3m04L86K55R2k54q1J90N4MJ4l11M63m15K76
4920D17J19l16K42j93l7k72j6L43j25q5o1j47l3O5m4k23K16j45N9P1k29J72l52
4943e74j6M69j98q4M8j13K63R1M7l17L10m25L35j53k9J96j16k7M10q5j07n2M37
4966C10k07p3J58l7Q9j47K86j6N2J8l73L79m6j80N5K10l34J68J28k21j09K82j11
$$ plain form
4808 6 -292 37 -382 -271 -115 -437 98 -348 -265 -103 -727 -307 -190 -292 -566 -444 -354 -277 -302 -558 75 -179
4830 -179 -377 -196 33 -40 59 40 -171 192 153 -22 115 88 190 499 -19 22 136 314 371 192 487 305
4852 305 108 179 156 261 283 579 168 -90 414 301 502 96 -99 -150 -53 252 65 286 -85 -30 -367 -448
4874 -448 -140 -171 -239 -376 -403 -317 -431 -181 -438 -535 -409 -438 -150 -451 -346 -150 -248 -213 -331 -115 -67 -206 138
4897 138 -111 19 -134 223 -140 41 222 201 148 -256 130 385 477 223 142 332 386 390 404 93 556 141 417
4920 417 536 220 462 269 232 -40 -56 287 162 77 16 -131 -164 -99 -143 -366 -150 -295 -236 -165 -394 -222 -574
4943 -574 -590 -121 -319 -403 -355 -468 -205 -114 -67 -384 -74 -499 -164 -317 -346 -150 -266 -293 117 32 -75 -127 310
4966 310 103 30 188 151 240 93 379 363 415 433 60 439 393 213 268 478 144 312 440 219 110 392 281
4989B81o2k02l6R5om2l26L79k17m1Q6l26J21P7j30L5O6J13k67L79k72j68L16n8
5013b05J76n07J91q2J9J28J59j46j57lN02j36K15j31K26j50o3M03k68m1j59L50
5035C21p2j37M51l41N4J52k35L06j72L0J42j77j21k72M52J59l06k5j9j62M0L9
5057A07l18J17J40j54L4l06L69j31j0p9L2K84k77j6q9k86K29n8n4r5K94k3j47
5080d37R1J87l42M94k92o5L07M69m09M0q3o9L96n99K21M36j55L70l45k0J41J49
5102D85j95o3K97k90J98j17J80j60l49M04k86M56j51j59n7o7K16l51q2J64m48
5123c75L66j2J10k94p7M76m57K43j8l54M24k80J87m68L34j0N5J18l92K80M1j07
5145b10M0r6K81r3J4j09N1K34k71L28k75K83j0j93J11J78%l0p8O6L22j58J62m83
$$ plain form
4989 281 219 17 -19 76 70 28 -298 81 -136 -177 -91 -417 -296 -219 -349 -314 -248 -135 -402 -23 -295 -463 -147 -205
5013 -205 -29 -536 -345 -427 -408 -280 -121 -267 -424 -427 75 -61 154 23 249 99 36 439 171 130 -29 321
5035 321 249 112 563 222 276 428 193 499 327 357 499 322 201 -71 381 540 234 209 190 28 68 107
5057 107 -211 -94 46 -108 -74 -380 -11 -142 -152 -231 -199 85 -192 -208 -297 -583 -354 -412 -466 -561 -267 -290 -437
5080 -437 -346 -159 -501 -7 -299 -364 -57 412 3 43 -40 -109 287 -312 -91 345 190 560 215 195 336 485
5102 485 290 227 524 234 432 315 495 335 -14 390 104 560 409 250 193 126 342 -9 -91 73 -375
5123 -375 -9 -21 89 -205 -282 194 -263 -20 -38 -392 32 -248 -61 -529 -195 -205 -150 -32 -424 -144 -103 -210
5145 -210 -170 -266 15 -78 -64 -173 -122 112 -159 169 -106 177 167 -26 85 263 263 233 155 221 543 385 547 64
5169F4M85J4qj10j16Nl89L29k02J40k61M8p3oM7j69k7N82n18l7k08K84l23J8L03
5194a28k07L29k48j20J30k17N10n69N6J75J74P1n76O32k51R3kO1J21n0j16M19
5216B87k14J2J6M0J55k39Q1R7r4r7L12NN6Kk38K31r4j9J0k0k8R5O7l68J41N9k01
5243E4K19k41P0l8k33n7J31J36k27J25j64N7l01M34k99L11k68K9R7j79j32K37
5265b39k02K0M95m48lK8K79j6j65J46Q1l09J24o3K55J22K8Q3L0Jk84K06k19L63
5289C13P9j71J64l03K29%J26r9j85L30J56o39L92l46O2L2J09j05k52J3J05k2j78
5312a90M2Q7r2J95l92J82K53n00M4q4L70j13n44L78j35L03m74M74j73k8N12l79
5334b64K67J02k03k52N23N6l32j13L78n10O28o2J87l18k53M96J89k03j27k74N10
$$ plain form
5169 64 549 563 555 445 329 334 -55 274 72 212 -49 -1 -74 -80 -33 -202 -229 353 -165 -202 -410 -126 -449 -431 -128
5194 -128 -335 -6 -254 -374 -244 -461 49 -520 -464 -289 -115 -44 -620 12 -239 -146 -148 -87 34 -16 -132 287
5216 287 73 85 101 141 296 57 138 235 141 44 356 361 417 419 181 412 318 299 309 289 261 356 423 55 196 255 54
5243 54 273 32 102 64 -169 -226 -95 41 -186 -61 -225 -168 -469 -35 -334 -23 -291 -262 -165 -344 -476 -239
5265 -239 -441 -421 74 -374 -377 -349 -70 -86 -251 -105 -24 -333 -209 -272 -17 105 133 216 246 247 -37 169 -50 313
5289 313 392 221 385 82 311 311 437 338 153 483 639 0 392 46 108 140 249 144 -108 -95 10 -12 -190
5312 -190 -148 -61 -153 42 -350 -168 85 -415 -371 -455 -85 -198 -742 -364 -499 -196 -670 -196 -369 -397 115 -264
5334 -264 3 105 -98 -350 173 229 -103 -216 162 -348 280 218 405 87 -166 330 519 316 189 -85 425
5355D25j90R20m33p29O54J01n15R4j46j73J68j47J68J06M0l96L3J9K9k17L34l84
5377b39J55J28l5m5k55N7rK01j59J73k3l99M40l38O2K49l94N04m71N0K45K39n00
5400c64N9Q3J36J42Q3n17L10J6j7K09k13J69p7K70j86K72J1j98K94l55J30L97
5422F54j22r1P8j34J12j60j11j16L67m53j6k95J76J76n2l93J279r75J71j49l79
5443d33N97l07k8J75R6j92N12j401M94n46O67J95m03k99J901j615L25q39N86K6
5463d89J62O00j088J192m03j5J96L54j71m00Q1K87j42J4J34k9Qkj05j43N4M20
5485E15j29K02o61R99q64O20k81n20L12mK87K37m54O5k64r0K42j30k36L00l61
5506b15N77p57N34n76K91O07l36j45L3r32Q72l10J66j32m31J128p33J47N00j65
$$ plain form
5355 425 235 1155 722 -7 647 748 233 327 181 8 176 29 197 303 343 -53 -20 -1 28 -189 145 -239
5377 -239 -84 44 9 -36 -291 -234 -243 -42 -201 -28 -51 -450 -10 -348 -286 -37 -431 73 -398 -348 -103 136 -364
5400 -364 -305 -222 -86 56 139 -378 -68 -52 -69 140 -73 96 19 289 103 375 386 188 482 127 257 654
5422 654 532 441 519 385 497 337 226 110 477 24 8 -287 -111 65 13 -380 899 -76 95 -54 -433
5443 -433 164 -143 -171 4 100 -92 420 -981 -487 -1033 -366 -171 -574 -873 1028 -587 -262 -1101 -515 -489
5463 -489 -327 273 -815 377 -26 -41 155 509 338 -62 19 306 164 178 312 283 291 289 184 41 95 515
5485 515 386 588 -73 926 62 682 401 -119 193 189 476 713 259 324 60 -30 212 82 -154 146 -215
5506 -215 362 -395 139 -437 -146 461 125 -20 13 -919 -47 -357 -191 -323 -754 374 -359 -212 288 123
5526A23l3l82O29j29J55l04j80M96m74O60m14n88M48K65M50m73J20M88n72P67
5546A052k96j42k11l00N92j29m87N00j30K46o06l56J027j73q3q66N65k78n06P66
5566A85j81m79O53k57m44O3k0L45Q59j190Q67n41o42J629p03K83j042O93N05q17
5586b34k59n82Q46J18k3R4o0J46k3J54M46m01J62m04N43q69P00j87j15Rr9Q4L46
5609C92k50k12M14o9q5J22n50P84l22p0j85K75k69J31J18l10J79Q7M23n71j63
5630a31j45j17J53j02K0L4N5J26l22J20L8P7k11j84L48P9p6j32j5M92k90O0j47
5653b70PK34R0l8j56lJ18N04n15rL18j83L66j00k72J34j04M50j82l1j06K02J62
5676F16n59K1K6K34J97m25J02J60k57J42n2j58P6j45j73J17K66m19P1Q8r0r3J20
$$ plain form
5526 123 90 -292 337 208 363 59 -121 375 -99 561 147 -441 7 272 722 249 369 857 285 1052
5546 1052 756 614 403 103 695 566 79 579 449 695 89 -267 760 587 504 -362 203 -75 -581 185
5566 185 4 -475 178 -79 -523 -460 -480 -135 724 -466 401 -140 -782 847 144 427 -615 78 583 -234
5586 -234 -493 -1075 -229 -111 -134 -40 -100 46 23 177 623 222 384 -20 523 -346 354 167 52 61 -38 46 392
5609 392 142 -70 344 275 190 312 -238 546 224 154 -31 244 -25 106 224 -86 93 180 603 32 -131
5630 -131 -276 -393 -240 -342 -322 -288 -233 -107 -429 -309 -271 -194 -405 -589 -241 -162 -238 -370 -385 107 -183 -123 -270
5653 -270 -263 -29 61 23 -133 -136 -18 486 -29 -38 280 97 463 363 91 225 121 571 389 358 252 454 616
5676 616 57 78 104 338 535 110 212 372 115 257 205 47 123 -22 -195 -78 188 -231 -160 -72 -162 -255 -135
5699a35k0r2L97o24Q9J43L6N3o2j10J2LL86k88J04m66M17K18j61L8p8j39J02N7
5723a20J94OK3P2J4M8q1K37l23L1K1j62O68l14j95J98K03n1m21M73j20j9k42o7
5747G3l0j5N5M9j0j9j23O5j2J8K69m52L36m39K56n92M32R8l60P2K8N1r0j02K46
5772a96o5L79k62j83j64J18L33k95J26P8K14P9n01J90k46L35L35j48L6K9o5j30
5794cJ14N71j98j44j27k5J73j53J84m93K71K72j06m03O5L22K3k46P6J87N6l95
5816B1j1p3%J59l80K99k01mJ30k18K00j60L4Q1j15k21J72Kj9m8L17m12K58L3j11
5841b67J76j35J60j12K47r0J51k54J79j38o6M45k99K3K32J41j36k88L47m36P1
5862d9K24r4J79k51J03L37j74K66n49J55L25m21J05j05Q1J7k66P0j35J97l07l
$$ plain form
5699 -135 -155 -247 150 -474 -385 -242 -206 -153 -215 -325 -313 -310 76 -212 -108 -574 -157 61 -100 -62 -140 -279 -177 -120
5723 -120 74 80 103 175 189 237 156 393 70 101 122 -40 628 314 119 317 520 469 48 521 401 382 140 73
5747 73 43 28 83 132 122 103 -20 45 33 51 320 -132 204 -235 21 -571 -139 -41 -401 -329 -301 -250 -340 -442 -196
5772 -196 -261 118 -144 -327 -491 -373 -40 -335 -209 -131 83 162 -339 -149 -395 -60 275 127 163 192 127 -3
5794 -3 111 682 484 340 213 188 361 208 392 -101 170 442 336 -67 -2 320 343 97 173 360 416 21
5816 21 10 -63 -63 96 -284 15 -186 -190 -60 -278 -78 -238 -204 -123 -238 -459 -287 -285 -304 -352 -35 -447 -189 -156 -267
5841 -267 -91 -226 -66 -178 69 -21 130 -124 55 -83 -149 296 -3 20 252 393 257 -31 316 -120 -49
5862 -49 175 81 260 9 112 449 275 541 -8 147 472 51 156 51 132 149 -117 -47 -182 15 -292 -295
5884b95K56J68l62J37J7j33J18l92J42k1j77L14j27K18Mn5n3j12K43Jj82K25k12
5907b78j03K90J57Pk08K93p6K23m86J07K26J47J14j86k62K38Q4j86j41L32J14
5928D06l10L07j13j46K12K6pn84K66K87k74k15K46N2k76N96n21n5N84j98j02n95
5950d14K05P87r07M88o43P65n33Q8k54l80O82K57m60l00N55K11L14o55P6m3K30
5971F9j55m4r4O9K74l14L13j78Q8L39k45K39l19K67m90K45K02j94L50k24p4K82
5993D06J72j44l30J10J98o3j01k16K32j86p0j4k7K9K08j29K2l59k1L41k68M1j9
6016a88m5J58m13K26q7K7K42l06j85K53J66o5j41l3M4J54M4O6k05L55j24K45k76
6039h8K1K4L26l03k2K68o2J19m7M8k0p2j02l0K22j04j61L66k3K9r1J14j47j90
$$ plain form
5884 -295 -39 129 -233 -96 -79 -212 -94 -486 -344 -365 -542 -228 -355 -137 -133 -188 -241 -353 -110 -109 -291 -66 -278
5907 -278 -381 -91 66 73 -135 158 82 305 -181 -74 152 299 413 227 -35 203 287 101 -40 292 406
5928 406 96 403 290 144 356 382 375 -209 57 344 70 -145 101 153 -123 473 -48 -103 481 283 181 -414
5950 -414 -209 578 -329 159 -484 281 -252 -164 -418 -798 -116 141 -319 -619 -64 147 461 -194 -118 -161 69
5971 69 -86 -130 -224 -155 119 -195 118 -60 28 367 122 361 42 309 -181 64 266 72 422 198 124 406
5993 406 578 434 104 214 412 349 248 32 264 78 8 -6 -33 -4 204 75 97 -262 -283 58 -210 -169 -188
6016 -188 -233 -75 -488 -262 -349 -322 -80 -386 -571 -318 -152 -217 -358 -391 -347 -193 -149 -83 -288 67 -57 188 -88
6039 -88 -67 -43 283 -20 -42 226 164 283 236 284 264 192 90 60 282 178 17 383 360 389 298 412 265 75
6063G5L2O9k52J11j08L36J68o43J12j65L70m77K93j01k43K32j1O7l87O20l53J34
6085a21m1k75K98l6l63L98l29L80j47k78K02P0L50j54q5j04J92L5k4L2J03r8Q
6108A3J50J53k64L92j99o4J19J47j13J16l30J25l01M68m27K96M1j42K44m09J27
6129A42N4j9l21N1J55j52m7J67k17J97j22J23j65k61J35M1J5J8r9K19j06K01k50
6152b41J53J1J9J31k91M49m78J75K71jl20M80j79l96L60k4N6k23M74l84K10k17
6174C5R7L18j81k08K64m23J88n7J73K67l06r7L91m21L29m45L60j06j82J26m7M
6196G9j66q3J31J44k31j51K05q8j45L51k95M32m35R6j14jK34n59L12l7J09L74
6218A62m07J69k10k4k87J75N01j24K01J4J14j73l20M92j36m28O09l29j0M55k54
$$ plain form
6063 75 107 176 -76 35 -73 263 431 -212 -100 -265 105 -372 -79 -180 -423 -191 -202 -135 -522 98 -255 -121
6085 -121 -162 -437 -139 -175 -538 -140 -469 -89 -236 -514 -312 -242 108 -46 -131 -235 -43 -8 -32 0 103 5 13
6108 13 163 316 52 444 245 181 300 447 334 450 120 245 -56 412 -15 281 322 180 424 15 142
6129 142 196 177 -144 -93 62 -90 -137 30 -187 10 -112 11 -154 -415 -280 -239 -224 -206 -305 -86 -192 9 -241
6152 -241 -88 -77 -58 73 -218 231 -247 -72 199 198 -122 358 179 -217 143 119 175 -48 426 42 252 35
6174 35 132 450 269 61 325 -98 90 33 206 473 167 70 461 40 369 -76 284 178 -4 122 75 79
6196 79 -87 -170 -39 105 -126 -277 -72 -160 -305 46 -249 183 -252 -156 -270 -271 -37 -596 -284 -321 -212 162
6218 162 -245 -76 -286 -310 -597 -422 79 -45 156 170 284 111 -209 283 147 -281 328 -1 -11 444 190
6239A90m73K44N49j85K9r3j8O1M1j06j3J31Pm19Q12p50k5L44o20L25M7P9j57j22
6263a22k74L37N32q42L57n14L39M5k08o3K73L82o01J40k11o30O83N98m05l8n17
6284g39N4M23o02J004p50J122l76K65j208N19N60O4L88n48N78K13q01J2p0M45
6304E53l02L22k69j75O92m49k14M92m69J89l32o94J123n93R1j36M05K38j78o05
6324c11O68j074N46K54m50Q5p5p5M51l63p6P8K24k64q8J43k84L71j75k80P58N8
6346A21o6N93j430J130o20O38m48K93L98l93l49n50N89k97J88N36l32L04L65m74
6366A96k02K00K40L00q42l7P85p98l35O26N36r47O18m6L74n21j41L73m90N66p50
6387b95L53k43mj37N27K39q22j24P25p71K02Q54n45N4k79J53j76M52o01N24m00
$$ plain form
6239 190 -283 -39 510 325 354 261 243 304 345 239 226 357 364 -55 757 7 -18 326 -294 31 78 157 0 -122
6263 -122 -396 -59 473 -369 -12 -526 -187 -142 -350 -413 -140 242 -359 -219 -430 -1060 -377 221 -184 -222 -739
6284 -739 -685 -262 -864 140 -610 512 136 401 -807 -288 272 336 724 176 754 967 166 178 108 553
6304 553 251 573 304 129 821 372 158 650 181 370 38 -656 467 -126 -35 -171 234 472 294 -311
6324 -311 357 -717 -171 83 -367 -282 -357 -432 19 -344 -420 -342 -118 -382 -470 -327 -611 -240 -415 -695 63 121
6346 121 55 648 -782 348 -272 366 -82 211 609 216 -133 -683 -94 -391 -203 333 1 305 670 196
6366 196 -6 194 434 734 -108 -145 640 -158 -493 133 669 -278 340 294 668 147 6 379 -111 455 -295
6387 -295 58 -185 -189 -326 201 440 -382 -506 219 -552 -350 504 -41 13 -266 -113 -289 163 -438 86 -314
6408c14j52L15N01r4Q9j011L85J74K29k91M92n6n26M18l29J142r84L02l24l70
6428d04N75j84J15L52p6k36Prq4l03l67O18Q49p63k75m22O34N46k79m33j81J030
6450G10o99l42k81L59L22m53L66j013R15L15o85L53j30k6L06L20n53O7L04j115
6470i60N16M87j246L69K59Q43l88k50M40N17j150R10n22M86q1J65j148O34J126
6489A007o40k98j10J60J46Jp3j6K51j23k27K52j90N6k07O11m85J07K44m02m0k97
6511b73q6j08M87k83R7L1J83J00k18L65q3n42P49r74K63j5L81m16L17J57j17K8
6533D3j126R37P9j3q66J044o02N95n61M1O77o2M95j016M45L02r8k89J59R6k6P5
6555C29j94q6M26k04n36M54m50K09j48K89L40m84J89J19K43P0l93M31o30Q7l84
$$ plain form
6408 -314 -466 -151 350 256 345 -666 -281 -107 122 -169 323 267 -259 159 -170 972 -12 290 -34 -404
6428 -404 171 -13 102 454 378 142 149 140 56 -247 -614 4 853 90 -185 -607 27 573 294 -139 -320 710
6450 710 11 -331 -612 -253 69 -384 -18 -1031 -116 199 -486 -133 -263 -289 17 337 -216 -149 155 -960
6470 -960 -444 43 -1203 -834 -575 268 -120 -370 70 587 -563 347 -175 311 230 395 -753 -119 1007
6489 1007 367 69 -41 119 265 266 193 177 428 305 78 330 140 196 -11 600 115 222 466 64 24 -273
6511 -273 -359 -467 20 -263 -166 -135 48 148 -70 295 212 -330 419 -555 -292 -307 74 -342 -25 132 15 43
6533 43 -1083 -146 -67 -80 -946 98 -504 91 -470 -429 248 186 681 -335 110 412 314 25 184 280 254 329
6555 329 135 49 475 271 -265 189 -261 -52 -200 89 429 -55 134 253 496 566 173 604 -26 61 -323
6576c23R81j41p52O05l91l38N85p93J72N98o39M57m78Q34p78O5l3P80q15m6O56
6597B06q84J87J35L33p1n39M71J19N79q74L36p2l55N6K71Q6M41l26J59r1m15N06
6619B58M32r21p8M99M50p77K58J83L85k65q10P42K15o12J55k87L06q2J29m27q15
6640a062J222J1j74q1k64L62J73k11J35k02K41m80J09l31K3K39K78k71L3l85M70
6661a65K0n19N22k01N83r34K27K51op1J47j47J54PO91r18M53N43q51N04Q4n19
6683a45K05l84J21L17K55J49k96l9L11k78M02J09L08q27K30K05M7o17K40R2l20
6704H5N43j396k78P16P49o32l6L59n28M70o05L41k62J67J17l53M78j65J07k61
6724c84L5J34J76p4n8l7J11J0L70m15J92q6j43M33k23jj58R7L02n17M92k59R6
$$ plain form
6576 -323 658 517 -235 370 -21 -359 226 -567 -395 203 -436 21 -457 377 -401 -336 -369 411 -404 -450 206
6597 206 -678 -491 -356 -23 -94 -633 -162 -43 536 -338 -2 -74 -429 -373 -102 -16 425 99 258 167 -248 258
6619 258 690 -231 -309 190 640 -137 121 304 689 424 -386 356 571 -41 114 -173 133 51 180 -247 -1062
6640 -1062 160 171 -3 -84 -348 14 187 -24 111 -91 150 -330 -221 -552 -529 -290 -12 -283 -250 -635 -165
6661 -165 -145 -664 -142 -343 240 -694 -467 -216 -222 -293 -146 -293 -139 -132 559 -359 94 637 -214 290 374 -145
6683 -145 60 -324 -203 114 369 518 222 183 494 216 618 727 1035 208 438 643 690 73 313 405 85
6704 85 628 -768 -1046 -330 419 -213 -249 110 -418 52 -553 -212 -474 -307 -190 -543 -65 -230 -123 -384
6724 -384 -349 -215 -39 -113 -171 -208 -97 -87 283 -132 60 -26 -169 264 41 40 -118 -21 281 -236 256 -3 93
6747I3k8J06K51k39p5Lj12P3p0K6L74k5j5m35N88m69J37M5l34K45K3j46L2j85
6771a37Q6K82j77j43j81m6K35L7k54P7r4N2K42l33J04J7J46j62J06Mr0M07m38
6794b60J96l9j42L90l59J01J32K41Jk7J32k12J26j01q7K34k40K11o1k43M81m44
6816C0J85r8p4L40k47j3j69K39M3k74K34m08J14P2j40J72j12K39j0k0m06j67L77
6839i3k5j86K04k01K45j90L65l59k4j00M72q10L25q0l90L3J091l41K33m62K20
6860g3k9l26P54n7j19Qj71L19k54J80j37J59N3j0Q3j24Q7q7J48m65N54l05j19
6883F9J11J62l41J66m3l7L89q67O84l98K15q3J05p7r6k28L20j72J0j10J56l37
6905d02k7M21k54J07J8m8L6k6R1o7K7k45J00M72k52J06k77K58k31O4J33k80K07
$$ plain form
6747 93 65 171 422 183 108 111 -1 72 2 28 402 377 362 -73 515 46 183 228 -106 139 162 16 48 -137
6771 -137 -51 231 54 -89 -270 -316 -81 -44 -298 -221 -315 -263 -21 -354 -250 -233 -87 -249 -143 -139 -229 178 -260
6794 -260 -64 -103 -245 145 -214 -113 19 260 261 234 366 154 280 179 92 326 86 297 236 -7 474 30
6816 30 215 117 43 383 136 123 -46 193 236 -38 196 -212 -98 -26 -166 6 -106 133 123 103 -303 -470 -93
6839 -93 -118 -304 -100 -301 -56 -246 119 -240 -264 -364 108 -702 -377 -457 -847 -814 277 -64 169 -293 -73
6860 -73 -102 -428 326 269 150 158 -13 306 52 232 95 254 307 297 380 256 343 256 404 -61 493 188 69
6883 69 180 342 1 167 124 87 476 -391 293 -105 110 27 132 55 -41 -269 51 -121 -111 -221 -65 -402
6905 -402 -429 -8 -262 -155 -137 -185 -149 -175 -84 -151 -124 -369 -269 203 -49 57 -220 38 -193 -129 4 -276 -69
6928f9Q0J33jR5oj67k64K79O6j30R2M5N0j82K2L55l05j38Q9K22k36k99K36K99
6952B66l55K37l6q1o9J05q8o8J29j90L33k56J7j29k4m8l3q5K84j82J75k5j56m1
6976c20M7L9J33ol5K42k67j30K32j94J88j26J87J77j0O8n06O04j59l11L81k04
6998C0q2O59n13J89q7J94p8J56L7k04j45K8j32J76j27J30Qp3j09J12J21l41J18
7021F7j2J1J53l41p9K12j42j18j31M07k07m2L0k38K34j63K58j64n1J10m4J17k
7044a35j74L59k55J59j24q6J27L89m36L53j67J22J26k25J91J21m2k15k27O19j57
7065C23k08o8J37K16j29J18j47n5m6J61P8l35k7J70j83R3k6l33L92k56L14k76
7087h7r5J52n1k1R6j15O4k34K58k82M1O6n1P8OL05j63o8M0K99n79K58N1q2kL42
$$ plain form
6928 -69 11 144 143 238 232 65 -199 80 146 16 108 153 203 21 43 398 93 -45 44 266 30 -269 -33 266
6952 266 -89 148 112 31 -38 67 -21 -89 40 -150 183 -73 -56 -185 -209 -257 -290 -375 -91 -273 -98 -123 -279 -320
6976 -320 -273 -234 -101 -107 -142 100 -167 -297 -65 -259 -71 -197 -10 167 157 225 -281 323 164 -147 234 30
6998 30 -52 607 94 283 196 390 312 468 505 301 156 184 52 228 101 231 239 166 57 169 290 -51 67
7021 67 55 66 219 -122 -201 11 -131 -249 -380 27 -180 -222 -192 -430 -196 -359 -101 -265 -316 -206 -250 -133 -135
7044 -135 -309 50 -205 -46 -170 -256 -129 260 -176 177 10 132 258 33 224 345 303 88 -139 480 323
7065 323 115 47 184 400 271 389 242 187 141 302 380 45 18 188 5 98 72 -261 131 -125 189 -87
7087 -87 -182 -30 -81 -102 -6 -121 -57 -291 -33 -315 -274 -208 -259 -181 -175 130 -33 -101 -61 238 -341 -83 -32 -114 -116 226
7113B26m25K48J24n6m31M35j26J14N2K02O6k59M29m78J22R2j63nO2j43K00l69
7135h3L65j1l22L38o0k69k11M45k28K91m34J48j10N1O8j93K4Q6J32l43K56j52
7157b12N6%J99j04j28k02k3K58j06K97m47L28l8k08K04J05k79J22J43K73j97j51
7179a10Q4j59M16l56L76k88N5L10m10L2P7Q7ll7K30k48K31k00K6L08j01J95l10
7202B05m4m36L43k7J8Nj65J26o4n0J28l18K74q7K0L42m64l7L2l04L16K68m29J55
7226a93J22q4L1j09K42J14l88L06j57o0k3J52J60p2j22k65L32J50j30j00J36r2
7248e0J79j97N5O8l7M16m16L92n0j07P2r8k49J87j12P2P4m2j12J57k6P6o6j07
7272G9M5n2j36K89l9l66lJ48j62R2N4j10Q0j51J06j86QK75Q5l00k53L63J9K45
$$ plain form
7113 226 -199 49 173 117 -314 121 -5 109 161 363 429 170 599 121 243 335 172 167 229 86 286 -83
7135 -83 282 271 -51 287 227 -42 -253 192 -36 255 -179 -31 -141 -90 -22 -215 -191 -105 27 -316 -60 -212
7157 -212 -156 -156 43 -61 -189 -391 -414 -156 -262 35 -412 -84 -122 -330 -126 -21 -300 -178 -35 238 41 -110
7179 -110 -26 -185 231 -125 251 -37 18 328 -82 -50 27 114 111 74 304 56 287 87 113 421 320 515 205
7202 205 161 -275 68 41 59 64 -101 25 -39 -89 39 -279 -5 -92 -72 270 -194 -231 -199 -503 -187 81 -348 -193
7226 -193 -71 -155 -124 -233 9 123 -265 41 -116 -176 -199 -47 113 41 -81 -346 -14 136 6 -94 42 -50
7248 -50 129 -68 -13 55 18 434 18 410 360 253 325 227 -22 165 53 125 199 157 45 202 176 252 186 79
7272 79 124 72 -64 225 186 -180 -183 -35 -197 -105 -51 -161 -81 -232 -126 -312 -304 -29 56 -244 -497 -134 -115 130
7296A30o22K00K37J39m67K32J83J18o7k25J58j27O98n12j27k73N11m3lK29m87
7317a18KK78K61j39J2J3m0k9j32K01J80j84j59k87PJ72Ok00Q9J09j9j54K0J08
7341cj72K19m04K33J8J62R7k15l8J16j85j89K39j31k32M86j77K68J1j67R4l40
7363c10K13L6J81m75K12K36q9j79J33j14J87Ol47M34qj10J46J05l17N03l82j84
7385a23J95J37J54k80p6K85j61rp0R5J24m1j56Q8j72j10K04O2j06K86p23L23m2
7408a16l54M30l24N17j90m6J05l35K75l13K0J8K15j30K98k8l0q8K3k04K72p1L4
7431b2J78rj77O7K79m66J32j66R2L17j13j17J20M2J84m38O22m54o2K57l54L41
7453B53q8o7j72P7J88j85K63m27K69k8M4P1k40j00L1K86k22j17k2J50P5l25M03
$$ plain form
7296 130 -492 -292 -55 84 -383 -151 32 150 83 -142 16 -111 587 75 -52 -325 186 143 140 369 -118
7317 -118 -116 162 423 284 296 309 269 240 108 309 489 305 146 -141 -134 38 44 -156 -67 42 23 -131 -111 -3
7341 -3 -175 44 -360 -127 -109 53 150 -65 -103 13 -172 -361 -122 -253 -485 1 -176 92 103 -64 30 -310
7363 -310 -97 -61 120 -355 -143 93 4 -175 -42 -156 31 37 -310 124 116 6 152 257 -60 443 61 -123
7385 -123 72 209 363 83 7 292 131 122 52 147 271 230 74 162 -10 -120 84 146 40 326 -397 -74 -116
7408 -116 -470 -40 -364 153 -37 -83 22 -313 -38 -351 -331 -313 -98 -228 70 42 12 -76 -53 -257 15 -56 -22
7431 -22 156 147 -30 37 316 -150 -18 -184 -92 225 112 -5 115 157 341 -97 525 71 9 266 -88 253
7453 253 165 98 -74 3 191 6 269 -158 111 83 127 198 -42 -142 -111 175 -47 -164 -186 -36 39 -286 117
7476A17k71PQ7k60J1J08k7K01K6j59k30J10L8P9j00L91k6l31P1K65J41L5j95j52
7500f4j65L11Q4k47L60m0k50P9m9J75p1j11K56j90r3N36n80L16k04K14k62J00
7522A05j96O3J50l05K64j65R1j42J39k74r1K22K29l37K1j15R5O5O4p5J86L2k16
7545a90o6J52j35J37l8J73n6j2j00Q5K23k48m7J49r7J54M9j30R4j94M26k80K35
7568B84R5l11P1Q6k16P0j0K48q5L27n95K23j67J64Kq3N7J85j33l34j33L40J28
7591B13l55M5qm1k2K04j92J60k24j87L20J40j01l01J48L12l67J48k22R8j64L73
7613b3j23K16o5P2j42k3j13J94j14J40r0M5ko2q6M68J74j71j34L06n33K31J22
7636B87j58L0j01j55K87k20J25Q8K17l71K63k1j77j46J55j25K03k60p5m7K60m15
$$ plain form
7476 117 -154 -147 -60 -320 -309 -201 -228 -27 -1 -160 -390 -280 -242 -163 -263 128 102 -229 -158 107 248 283 88 -64
7500 -64 -229 82 166 -81 279 239 -11 68 19 194 123 12 268 78 -15 521 -59 257 53 267 5 105
7522 105 -91 -28 122 -183 81 -84 7 -135 4 -270 -361 -139 90 -247 -226 -341 -246 -181 -117 -192 -6 26 -190
7545 -190 -256 -104 -239 -102 -140 33 -23 -35 -135 -50 173 -75 -122 27 -70 84 133 3 97 -97 329 49 284
7568 284 379 68 139 225 9 79 69 317 232 559 -36 187 20 184 186 103 160 345 212 -122 -255 85 213
7591 213 -142 -97 -105 -146 -168 36 -156 4 -220 -407 -87 53 -48 -349 -201 111 -256 -108 -330 -232 -396 -23
7613 -23 -146 70 5 77 -65 -88 -201 -7 -121 19 -71 -26 -28 -90 -176 292 466 295 161 467 -66 165 287
7636 287 129 159 58 -97 190 -30 95 183 400 29 292 271 94 -52 103 -22 181 -79 -154 -201 59 -356
7658c56K46q4K4J07j42J61n7j48k6L33j00m0k4k27k6K03p1K26l21N4n0K71N8k84
7682b73L54K10m09L39m53M39j38jK40k76K88m40N14l93K52L6k72K16M3K24l61
7703A39J09R8j38j78L6J05Jj48j7J59j65m2J3J87r8j07j99K16k73J37L32j95m8
7726g6J48j09J14q9J0m28N01k77k4j1N6n5K96j66j64J09M6L53l69N56r54O81l63
7749b15K47K4m24K66K58J71m25L06j79K38Pk07L93m59p2M23P8j53l07N14r7l69
7771A8K15j08M2M3j52J19m9Lk25k5j49L62N2l85K94k14J33L0N3j77O0k1K15m23
7795b89K24M7m2l8l9J5kQ3k70L53K7k40J25j12J80K20n77M73j70K53l36j03Q3
7818a35R9K39k96K63J31k56K22k59J39j16j00L51n2l0l0J64m11o7L81m60L20j11
$$ plain form
7658 -356 -110 -194 -170 -63 -205 -44 -101 -249 -275 58 -42 -82 -106 -333 -359 -156 -227 -1 -322 -268 -318 -47 11 -273
7682 -273 81 291 -118 221 -232 207 69 68 308 32 320 -120 394 1 253 289 17 233 276 500 139
7703 139 248 346 208 30 66 171 172 24 7 166 1 -41 -28 159 61 -46 -245 -29 -302 -165 167 -28 -76
7726 -76 72 -37 77 -12 -2 -430 71 -206 -230 -241 -185 -240 56 -110 -274 -165 -119 234 -135 421 -533 148 -215
7749 -215 32 56 -368 -102 156 327 -98 208 29 267 274 67 460 1 -71 352 430 277 -30 484 387 18
7771 18 233 125 167 210 58 177 128 131 -94 -119 -268 94 146 -239 55 -159 -26 4 57 -120 -60 -81 134 -289
7795 -289 -65 -18 -60 -98 -137 -122 -124 -41 -311 42 69 -171 -46 -158 22 242 -335 138 -32 221 -115 -218 -135
7818 -135 -36 203 -93 170 301 45 267 8 147 31 -69 282 230 200 170 334 -77 -144 237 -223 97 -14
7840a4M1K9N8J77m59R2J27j39k65K15Q7p5j81K61m11K98K11j01k86K10j1J02j58
7863a92j6O1J40j6j21K6J1q3J22K32K5j88p5J69j2J20L3j54j44K43k43L19j53
7886A04P3p2j38K51P7l3p7n0k57M42r8Pk07P2J13n6k39J73j10J16l0j76K06P4
7910A65m70K25Qj46L96l82k13L99l51K60l6J63k7R5j04p2J8j9m0M9j32L2m5K34
7934Gj3j97K17K28J67m66K28m1l4Q5M0L5lk50j12J70R7J08p3K6J96l91j79M65
7958C10l21j27J25M16j37k41j12J22J67j16j10j44K40MN6k90L21m25J30K66m42
7979c08Q7K66k42L05Nl15K21l58L49k01K28j80n3J07J92o5j78mj10J67J11R0k89
8002a75J08j73lK32K18k55K09K02l10P3J58p7m6J27K8o6k90M6O7K39M4k1j87J27
$$ plain form
7840 -14 27 56 114 291 -168 -76 51 -88 -353 -138 -51 -126 -307 -46 -457 -159 52 -49 -335 -125 -136 -34 -192
7863 -192 -208 -147 -7 -23 -144 -118 -107 -190 -68 164 189 1 -74 95 83 203 236 82 -62 181 -62 257 104
7886 104 177 105 -33 218 295 262 185 135 -122 320 222 229 22 94 207 151 -88 85 -25 91 61 -115 91 165
7910 165 -305 -80 -72 -218 178 -204 -417 -18 -369 -109 -145 18 -9 86 -18 -90 -72 -91 -131 -82 -214 -182 -227 7
7934 7 -6 -203 14 242 409 -57 171 130 96 181 221 256 253 3 -109 61 158 266 193 219 415 24 -155 310
7958 310 -11 -138 -13 403 266 25 -87 35 202 86 -24 -168 72 76 132 -158 163 -262 -132 134 -308
7979 -308 -221 45 -197 108 113 -202 19 -339 10 -191 37 -143 -196 -89 103 38 -140 -144 -254 -87 24 114 -175
8002 -175 -67 -240 -243 -11 207 -48 161 363 53 126 284 207 161 288 316 250 -40 6 73 312 356 335 148 275
8026B75k65M2J92m9n5k09P4j97M7K14j14K26j36m3j36J77o5R7p2m7r1k19K06m6
8050a94n2K01l12J68Q5l04K80k0j02J69R3l6k33M42q7k22Q5L3j19J49R6k75J87
8073C2K12q2N3K37m35K71j18j35pk1j61K43O1R4m2J99k25p9j74K50j95N4P4n6
8097E0j49J94j00j31J22J73p4k5l85J59K30k06J10J08k4n0m38O76l20K41j18M
8119D7o1m30L15J01r7j08J87J83j6j84M5K55j34k03J05K39q0J74l80O0M0j0J35
8142A83M1j02o0M86n93K26k02K5J76l53K76K65l78R1r9J41j63P2n1m6k1r6O7n0
8166a65J94n45P76m01P9l6j15L91j33r5j95K11j62K55m1O5k09J66j3K5j21QJ04
8189D3k74J57
$$ plain form
8026 275 10 52 244 195 140 -69 5 -192 -145 69 -45 181 45 2 -134 43 -22 75 3 -44 -135 -354 -148 -194
8050 -194 -246 -45 -357 -189 -104 -408 -128 -148 -250 -81 12 -24 -257 185 98 -124 -39 -6 -125 24 120 -155 32
8073 32 244 162 215 452 17 288 170 35 28 7 -154 89 150 244 202 401 176 97 -77 173 -22 32 106 50
8097 50 -99 95 -5 -136 -14 159 85 60 -325 -166 64 -142 -32 76 52 2 -436 240 -80 161 43 47
8119 47 -14 -444 -129 -28 -125 -233 -46 137 121 -63 -18 237 103 -100 5 244 164 338 -42 18 58 48 183
8142 183 224 122 62 548 -45 181 -21 4 180 -173 103 368 -10 81 -18 123 -40 32 -19 -65 -86 -182 -115 -165
8166 -165 29 -516 260 -141 -62 -98 -213 178 45 -50 -245 -34 -196 59 18 83 -126 40 27 52 -69 -61 43
8189 43 -231 -74
8191g4
$$ Imaginary data points
##PAGE= N=2
##DATA TABLE= (X++(I..I)), XYDATA
0@%%%%%%%%%%Qj6J6j6K4l2L2m0N6o4P2q8J10j34J54j78K08k42K82l26L73m25M83
33B57n47O18o98P86q81R86j103J230j367J517j681J859k055K270k504K759l039
50a593L349l689M062m481M948n470O063o739P520q434R516j0825J2450j4527J7287
65I437k1150K6996l6990N8661j89502P5465J35660j77032J91899j32981p1113
76a30650R2563m3036P5540N4856j40553P6739r208m9849J24521m0235l9718O3081
88C4051p6815O5429K5432n1482M7963m5213K835P1990l2914K3108n615o0916K8819
101B6672J2324k318N8111l8796k4571J7465m7825M7539K1377l2970K3066n7962
113B112J6540M4699o8328K4779L0428n2979J7575J0001l6334K2409j9019j8197
$$ plain form
0 0 0 0 0 0 0 0 0 0 0 0 8 -8 8 -8 16 -16 16 -24 32 -32 40 -48 62 -72 82 -96 112 -130 152 -174 199 -226 257
33 257 -290 328 -370 416 -465 521 -582 648 -719 798 -883 976 -1079 1191 -1313 1446 -1593
50 -1593 1756 -1933 2129 -2352 2596 -2874 3189 -3550 3970 -4464 5052 -5773 6677 -7850 9437
65 9437 -11713 15283 -21707 36954 -152548 -77083 58577 -118455 73444 -59537 -130650
76 -130650 -38087 -81123 -5583 49273 -91280 -14541 -23749 -73598 50923 10688 -29030 34051
88 34051 -42764 22665 48097 -3385 44578 -635 2200 74190 41276 64384 58769 -2147 26672
101 26672 38996 36678 94789 55993 31422 48887 1062 48601 69978 37008 60074 2112
113 2112 18652 63351 -4977 19802 50230 -2749 14826 24827 -11507 10902 -8117 -26314
125b6314M9556l8500N34L4460n8273K312J9797j0268J0318k899l812m757r012
138c6858o00J6122m249l736J7588j8227p079J2665P805J787q010R900l243N455
152a0680l98j0123J7381r808J1148J7779k2437K489J1305n470p077J2437P099
165A3645k242j89r749J3640j0890l362K5012k0947l124J6400k904j4563K20J8281
179A9228j3320p06M179n552q86p833J3323q521r076J7836q2j1978o942R847m136
194d619p67M997n681J2611j3496J797J0178k1522J5315Q565r482o47L124L020
208C393m004J049J66J3457n554p412J5319j8644K680J5634n124l23j740J1391
222B0288p501j2099O527N068O49n604J0948q359j0712J1755n010k875l373J0230
$$ plain form
125 -26314 23242 -15258 -14724 19736 -38537 -36225 -16428 -26696 -16378 -19277 -23089 -27846 -36858
138 -36858 -37458 -21336 -25585 -29321 -11733 -29960 -37039 -24374 -16569 -14782 -22792 -12892 -16135 -10680
152 -10680 -11078 -21201 -3820 -13628 -2480 15299 -7138 -4649 6656 1186 -5891 6546 13645
165 13645 11403 11214 1465 15105 4215 853 25865 4918 1794 18194 15290 727 947 19228
179 19228 5908 5202 9381 3829 2943 -4890 8433 -88 -9164 8672 8590 -3388 -10330 -483 -4619
194 -4619 -5386 -389 -6070 6541 -6955 -5158 5020 -16502 -1187 7378 -2104 -2751 373 3393
208 3393 -611 438 604 14061 8507 1095 16414 -2230 450 16084 10960 10637 8897 20288
222 20288 12787 688 7215 12283 12932 7328 18276 9917 -795 10960 5950 3075 -298 9932
236I932j157j7662N128k256M510m175j168R937j8152J682N415j2756l63J2314
250h771K198j2124K622o413L908O67j1377K1882p506p169J5052j3991l225R431
264a4816Q590l872l251M018J948P40j0152J6637N285r524J5691n875q533M831
278A717Q609K877n840J0873J214j463p777j239J5517j0126O603Q134j3245N2M222
293B0128O24p763O901M131k694m238j3501J2945m170q351J4214q584m793K06j134
308C921q329m008J1353j490k458q989J820L345j6414J0699K525o026K819Q78n778
323a6132j0067J2384J940k259L52l428J0616j3377j231J3198o806N739N939k952
337f084q477N376N383m599O894k611J1303j799j3505J1678j775N27N913K470l224
$$ plain form
236 9932 8775 -8887 -3759 -6015 -1505 -5680 -6848 3089 -15063 -13381 -7966 -20722 -21085 -8771
250 -8771 -6573 -18697 -16075 -22488 -18580 -17913 -29290 -7408 -14914 -22083 -7031 -21022 -24247 -14816
264 -14816 -6226 -10098 -13349 -9331 -7383 -6643 -16795 -158 5127 -4397 11294 5419 -3114 1717
278 1717 10326 13203 7363 18236 19450 17987 10210 8971 24488 14362 20965 29099 15854 15906 20128
293 20128 20752 12989 19890 24021 21327 17089 3588 16533 12363 4012 18226 9642 4849 5055 3921
308 3921 -4408 -8416 2937 1447 -1011 -10000 -8180 -4835 -21249 -10550 -8025 -14051 -11232 -10354 -16132
323 -16132 -26199 -13815 -11875 -14134 -13782 -17210 -6594 -19971 -21202 -8004 -14810 -9071 -3132 -6084
337 -6084 -14561 -9185 -3802 -8401 -1507 -4118 7185 5386 -8119 3559 1784 2311 8224 10694 7470
352G470n216Q625n124j146R44O481P869j7707L856M581q579L744L980R45p669
367C054O661k553j1185K522J596J0569j0385m350J0953j2298j526M686K22k991
381e025M729L727j3286K485j99M721K208r437J2366k287o979K019K67K159J261
396a271Q877o052l081K188j787P505r729P327J0928j0694j274J104J109k853P101
411I398L311q044M372k484K065p310k587J7726q983n268L637k924n502J920O806
426F133r136M442J935n702k281r699J2458J32q065M740j928k764m318L893l038
441a3198j72P983n465J516q302K275R594q365K708M512J855n355j178M715m808
456a1685R337J387J482k041n360J3208n405m785J0852M450l847k692P029p025
$$ plain form
352 7470 2254 10879 5755 4609 5553 12034 19903 2196 6052 10633 2054 5798 9778 10723 3054
367 3054 9715 7162 -4023 -1501 95 10664 279 -4071 6882 -5416 -6942 -2256 -2034 -5025
381 -5025 -296 3431 -9855 -7370 -7569 -2848 -640 -10077 2289 2 -6977 -4958 -4691 -2532 -1271
396 -1271 7606 1554 -1527 661 -1126 6379 -3350 3977 14905 4211 2937 4041 5150 2297 9398
411 9398 12709 4665 9037 6553 8618 1308 -1279 16447 7464 2196 5833 2909 -2593 -673 6133
426 6133 -3003 1439 3374 -2328 -4609 -14308 -1850 -1718 -9783 -5043 -6971 -9735 -14053 -10160 -13198
441 -13198 -13370 -5387 -10852 -9336 -17638 -15363 -5769 -14134 -11426 -6914 -5059 -10414 -11592 -6877 -11685
456 -11685 -2348 -961 521 -1520 -6880 6328 923 -3862 6990 11440 7593 4901 11930 4905
470D905K255P421k810K655m757Q276k066j1328R420L756j788l392L821m129n775
485F464Q033o556R30P32j166L601j2010J06M143q66l625q14L451q050K808m389
501g208k474M149n783Q970o502q630P688k64m115j770Q292k311l413K602l996
516a4765K892k941Q276J369j1062J0626K027n475j702P084M280n441P099k524
530b57j642K651J743M381o877O726M522n871j521K48O933m340L093J604n649O026
546A1770n409J552l72k581O720j258n413m400O462k936m980N822m320M263n130
561b10k479M060j0647Q485M159q333k019L938N71q584M482J859N1N40k636M191
577b572r486M529Q236p566J672L123M315p581o10O684l505N830P2j7r31k072N646
$$ plain form
470 4905 7160 14581 11771 14426 9669 17945 15879 4551 13971 17727 15939 12547 16368 12239 6464
485 6464 14497 7941 8871 9603 8437 12038 28 134 4277 3411 -214 -1028 2423 -5627 -2819 -7208
501 -7208 -9682 -5533 -11316 -2346 -8848 -17478 -9790 -10054 -14169 -15939 -7647 -9958 -13371 -10769 -14765
516 -14765 -11873 -14814 -6538 -5169 -16231 -5605 -3578 -9053 -10755 -3671 609 -4832 2267 -257
530 -257 -1899 752 2495 6876 -1 6725 11247 5376 3855 4103 11036 6696 9789 11393 5744 11770
546 11770 6361 7913 7541 4960 11680 10422 5009 609 7071 4135 -845 4977 657 4920 -210
561 -210 -2689 1371 -9276 -791 3368 -4965 -6984 -3046 -2475 -11059 -6577 -4718 -4667 -4127 -6763 -2572
577 -2572 -12058 -7529 707 -6859 -5187 -2064 2251 -5330 -5940 744 -2761 3069 3141 3124 2193 121 5767
594E767l031P26K953M760k611o873O451l917L540J150m058O848o309L84J053n685
610A148J712M580J864q952J214J317m014J96l822P672m771l348N329j0315p61
625a0951N058K681o134j579O834o941j167q88L040K144l152O554o541k560M414
640i188J180j79k649R425j124m687K987l042O844n25K415K729m000K777J649P00
656E312l593O946M935n043K082m546N315P74l372P555l578n46J238j604m825O34
672G684R653n411k473j34r39j28o872N437l65k989K966l577m734l841O711k334
688a346n288M262m466J881n914j794M532l566M265p35k559m042K360L486o269
703a5193M560P71K460k111n473N457j54J483L024k0r4j216O719n417k65O716J245
$$ plain form
594 5767 2736 3462 6415 11175 8564 1691 8142 4225 7765 8915 4857 11705 5396 5780 6833 1148
610 1148 2860 7440 9304 352 1566 2883 -1131 -935 -4757 2915 -1856 -5204 125 -10190 -10951
625 -10951 -5893 -3212 -9346 -10925 -4091 -11032 -12199 -13087 -10047 -7903 -11055 -4501 -11042 -13602 -9188
640 -9188 -8008 -8187 -10836 -1411 -2535 -7222 -4235 -7277 -433 -958 1457 4186 186 2963 4612 5312
656 5312 1719 8665 13600 8557 10639 6093 11408 12182 8810 16365 12787 12241 13479 11875 7050 7684
672 7684 17337 11926 9453 9319 8380 8252 1380 6817 6452 3463 6429 2852 -1882 -5723 988 -1346
688 -1346 -6634 -2372 -6838 -4957 -10871 -12665 -8133 -11699 -7434 -8169 -10728 -14770 -12410 -8924 -15193
703 -15193 -10633 -9862 -7402 -9513 -14986 -9529 -9683 -8200 -5176 -5196 -5290 -6506 213 -5204 -5469 1247 2492
720B492K118n588K818L094l679M321P34J777k082N421k847p244Q313O24R33k182
736I023k132M688n170j97O08M63r67J907O84r360L886N19j459J602o052O366l487
753I22n124K364j770O64LK683n899j091L580k708J446l895M666L415p249L002
769d991n94l7n8L028O37n167P056k77l632n4K420O221m015Q75O89j011N37j07
787A520L216m583N052K889n849J805j729M458k46m049K806r9p12l739L254l015
803I79j071O889o164k28k032j3L717p777K485L307j787l620J44J325n650O491
819c005j045m086J997j136L569o245L66N981j675K25j263K258l070K783L699n068
835e715M386J387J382k170k956O312n77K479r91P81K267k993M894l323J294L574
$$ plain form
720 2492 4610 -978 1840 4934 1255 5576 6310 8087 6005 11426 8579 1335 9648 10272 11205 9023
736 9023 6891 11579 6409 6212 6820 7283 6316 8223 8907 -453 3433 3952 2493 4095 -1957 4409 922
753 922 -4202 -1838 -3608 -2944 -2941 -258 -6157 -7248 -3668 -6376 -4930 -8825 -4159 -744 -7993 -4991
769 -4991 -5585 -5622 -5680 -2652 -2015 -7182 -126 -403 -4035 -4089 -1669 4552 537 1412 2101 1090 1627 1520
787 1520 4736 153 5205 8094 2245 4050 2321 6779 6533 2484 5290 5191 4479 740 3994 979
803 979 -92 6797 633 405 -1627 -1640 2077 -5700 -3215 92 -1695 -5315 -5171 -3846 -9496 -3005
819 -3005 -4050 -8136 -6139 -7275 -3706 -9951 -9585 -3604 -5279 -5054 -6317 -4059 -7129 -4346 -647 -5715
835 -5715 -1329 58 1440 -730 -3686 2626 2049 4528 3537 4318 6585 3592 8486 5163 6457 10031
851A0031q98K266n608K011K272p53j587j11N168o093J306Pn314M379m81J498n097
868B996j763M220m756k092j172M764l634k472K695p374K264J142q97p08l296N294
884d789l417l397J41J539J954k831L092l414j48L224k690K801j522M181J837l702
900g141P28n66N355j625Q02L554k611L536k104K039j35Q97O942m359k88J73L483
917H680p50l536O839k424N33P66l145J64j832O689k082l908J817j04j80n450L601
934E678L34k705L201n303k44k224J577J120n219K970o57M44n009q32L692l485
950f662M214k752j622J825l002L490l572J242K281O70q10m749N842j252L7K737
966b083j144K643k943L461j723k393N090K467n23m071L577J509l891M147j479
$$ plain form
851 10031 9133 11399 5791 7802 10074 9321 7734 7623 12791 6698 8004 8011 2697 7076 6595 8093 2996
868 2996 1233 5453 697 -1395 -2567 2197 -1437 -3909 -1214 -8588 -6324 -5182 -6079 -6787 -10083 -4789
884 -4789 -8206 -11603 -11462 -9923 -7969 -10800 -7708 -11122 -11270 -8046 -10736 -7935 -9457 -5276 -3439 -7141
900 -7141 -6413 -6979 -1624 -3249 -2447 1107 -1504 2032 -72 1967 1832 2729 9671 5312 5024 5197 8680
917 8680 7930 4394 11233 8809 9342 10108 6963 7127 5295 11984 9902 5994 7811 7707 7527 2077 5678
934 5678 6012 3307 6508 1205 961 -1263 314 1434 -3785 -815 -1472 -1028 -6037 -6869 -3177 -6662
950 -6662 -2448 -5200 -6822 -4997 -7999 -4509 -8081 -6839 -4558 -3888 -4698 -9447 -3605 -4857 -4820 -2083
966 -2083 -3227 -584 -3527 -66 -1789 -4182 908 3375 2852 -1219 2358 3867 -24 4123 2644
981B644K516m87K16M91m717M040J450j214j709L14K634n635J339l71l77L908l551
998A491R64l130o32J581j768L18j407M250l061m038J308r21L530k836Q65Q73l354
1015e967K839R3r88k112N167J515o438L473q49J161Q38o62L632k963K794J243
1031B776l238N63J952M765m212J063J751j975K614k621K115Q1M89K109m180J002
1047E054q18K998j016l556L636k084J030k909j442K656k359J753k379j256r77
1062a669L58J388o117K758J778k035j133k895L052k704O96J122k496J087p30K859
1078d681n518N82O028l625J381p83R44O62p94K739j749K082J103J250j572k333
1094d284O760j822Q12J263j332M471k154O85J48R49J813q35J897l789K582J591
$$ plain form
981 2644 5160 4673 4889 5380 663 4703 6153 4939 3230 3544 6178 543 1882 1511 1134 5042 1491
998 1491 2455 -675 -1307 274 -1494 -1176 -2583 1667 -1394 -5432 -4124 -5045 -1515 -4351 -3486 -2613 -5967
1015 -5967 -3128 -3035 -4023 -6135 -968 547 -5891 -2418 -3267 -2106 -1268 -1930 1702 -1261 1533 2776
1031 2776 -462 101 2053 6818 2606 3669 5420 3445 6059 3438 5553 5634 6123 8232 4052 5054
1047 5054 4236 7234 6218 2662 6298 4214 5244 2335 893 3549 1190 2943 564 -692 -1669
1062 -1669 -1311 77 -6040 -3282 -1504 -3539 -4672 -7567 -4515 -7219 -6523 -5401 -7897 -6810 -7540 -4681
1078 -4681 -10199 -9617 -3589 -7214 -5833 -6616 -5672 -5010 -5804 -3065 -4814 -2732 -1629 -379 -1951 -4284
1094 -4284 2476 654 1466 2729 1397 5868 3714 4399 4547 5496 7309 6474 8371 4582 7164 8755
1110H755k468R72j529M522k654k697J882j959J746j172Q80k694j628L806m548
1125A214j122P2J860l70m307K309l023L33L97j189K80k572M072k791l688K156
1141f369K25J525k384R92l44n03J567k238K773j242K458J701m249K452k32K157
1157a711M11j992L445K64L12j482J243O63l18N390m373R36J347k88J196l670M372
1174E745M96j526j46j168O54j514L627j624k698L341k092kl262J070K530k432
1190I99R79k648K11p36m30J139l032K551k5j283j330k104L705j642R53j230J67
1207c756J889l126K429j985J60L982j657M97k162K610R86j540J010P04L089l282
1223a52J313N31k839N453p60k91p26O21K177l181R65O07J973o73j669J922m510
$$ plain form
1110 8755 6287 7259 5730 10252 7598 4901 6783 4824 6570 5398 6278 3584 1956 5762 1214
1125 1214 92 164 2024 1654 -2653 -344 -3367 -3034 -2637 -3826 -3546 -6118 -2046 -4837 -8525 -6369
1141 -6369 -6144 -4619 -7003 -6011 -6355 -6858 -5291 -7529 -4756 -5998 -3540 -1839 -6088 -3636 -3868 -1711
1157 -1711 -1300 -3292 153 417 729 -753 490 1153 835 6225 1852 2788 4135 3847 5043 1373 5745
1174 5745 6241 4715 4569 3401 4055 2541 6168 4544 1846 5187 3095 3093 -169 901 3431 999
1190 999 1978 -670 -459 -1195 -1625 -486 -3518 -967 -992 -2275 -3605 -5709 -2004 -3646 -2693 -3923 -3756
1207 -3756 -1867 -4993 -2564 -4549 -4389 -407 -2064 -1567 -3729 -1119 -133 -1673 -663 41 3130 -152
1223 -152 1161 1692 -1147 4306 3546 3255 2529 3150 5327 2146 3111 3718 5691 5018 3349 5271 761
1240G61L229K53k293J224j788K575k832j796J013j98J542k966J061j680r76J380
1256a491k795J464j497K041j75m281J571k03J863j744l24K444l003K385j245p30
1272e720J388J178J700l366J267R92L37Q13j708M559j815J503Q71k975K860P52
1288B636J849j455K3K273r76J199k703K406J307j430K248l159J271p7J48P50k910
1305C400K539o03m83k163p65K769k725Q78r86j764O75j758J160k891P74J632k345
1322b656n51k384L204k147o93J329k044J521p20r0j490K6L782k194M14q78R52
1339d619J374k199K727j100J371J258j503R56j225L264R6m1O81m50L516k795L71
1356A682J028J71K087j902J363j036P1J934j802M92l12K381j714k605K556j741
$$ plain form
1240 761 3990 4243 1950 3174 1386 3961 1129 -667 346 148 1690 -1276 -215 -1895 -2871 -1491
1256 -1491 -4286 -2822 -4319 -2278 -2453 -6734 -5163 -5366 -3503 -5247 -5571 -3127 -6130 -3745 -4990 -5720
1272 -5720 -4332 -3154 -1454 -4820 -3553 -2561 -2224 -1411 -3119 1440 -375 1128 1999 -976 1884 2636
1288 2636 4485 3030 3053 5326 4350 5549 2846 5252 6559 5129 7377 4218 5489 5412 5560 6310 3400
1305 3400 5939 5336 4853 2690 1925 4694 1969 2847 1861 97 772 -986 174 -2717 -1943 -311 -2656
1322 -2656 -3207 -5591 -2387 -4534 -5227 -3898 -5942 -4421 -5141 -5231 -6721 -6695 -2913 -5107 -4693 -5571 -4619
1339 -4619 -3245 -5444 -2717 -3817 -2446 -1188 -2691 -1735 -2960 304 400 359 1040 590 4106 1311 1682
1356 1682 2710 2881 4968 3066 4429 3393 3464 5398 3596 4088 3776 6157 4443 1838 4394 2653
1372B653J142p39l28k4j799K373k998q23O68O81R9l437K112j373n88J078k285
1389c588J603r68J433j214k491K128n39J747k125K12J779j413J579k074J152J359
1405a420oJ161k137J517l43J400J69j958M353r09k50k89k61K368j544J782n97
1422C036o55J052q3L72l077L247M76k245J060j344J002r52K15L79k104J995j338
1439A036l32k358L88K093k686R51j087l49O39j672N84r69J238k02r70j59j956
1456e811L466j044r47J083k69J569k238M29Q08n7K011p98J244j850K101J224k531
1473a610K593j42J498j61q81J364j179K435k31MqJ29J990l054J119Q23K15J044
1491E948k294O08j023N75k9j168P53j091J539k050j962J497n82P26j781k99N40
$$ plain form
1372 2653 3795 3056 2728 2704 905 3278 280 -543 125 806 905 -2532 -420 -1793 -2381 -1303 -3588
1389 -3588 -1985 -2953 -1520 -2734 -5225 -3097 -3636 -1889 -4014 -3802 -2023 -3436 -1857 -3931 -2779 -1420
1405 -1420 -1426 -265 -2402 -885 -1228 172 341 -1617 2736 1827 1577 1288 1027 3395 1851 3633 3036
1422 3036 2381 3433 3350 3722 645 3892 4368 2123 3183 1839 2841 1889 2104 2483 379 2374 1036
1439 1036 704 -1654 -1266 827 -1859 -908 -1995 -2344 -1705 -3377 -2793 -3762 -2524 -2726 -3696 -3855 -5811
1456 -5811 -2345 -3389 -4336 -3253 -3522 -1953 -4191 -3762 -2954 -3011 -1000 -1798 -554 -2404 -303 921 -1610
1473 -1610 983 841 2339 2178 1297 2661 1482 3917 3686 3690 3682 3811 5801 2747 3866 4689 4904 5948
1491 5948 3654 4262 3239 3814 3785 2617 3370 2279 3818 1768 -194 1303 721 1447 -334 -633 -93
1508i3j741K42j846R75m83M73O82l643J333K78j30o86p09K381j657N76o93m89
1526e230J407k81K544k907Q22J870j276Q85o23K152N01k23O74j403J924J64J118
1543B118n84k60K725j448r3n80J039J770j172P82j330R76J51r79J235j825J720
1560D245J9j521q57o60K330j796m28L30p79M05j946R17j586J9K314k476q57m26
1578b753Q47j047J73P13j264J666j003j471M88n93L264j725q06J121O2P85j765
1595c308J689K78O75R64j750J581r87R72M30p19J955m36J198j231o73J791j89
1612B240J074j807J089K04r44J553j783Q00o5P02l78k471J850n00j86o36n12R71
1630A201j845J205j339r55J269k91J14k223J295l77j225R81r70J074o39K35j41
$$ plain form
1508 -93 -1834 -1592 -3438 -2463 -2946 -2473 -1791 -5434 -4101 -3823 -3953 -4639 -5348 -2967 -4624 -4048 -4741 -5230
1526 -5230 -3823 -4104 -1560 -4467 -3645 -1775 -3051 -2166 -2789 -637 -136 -359 315 -1088 836 1000 2118
1543 2118 1534 1274 3999 2551 2458 1878 2917 4687 3515 4297 2967 3943 4094 3115 4350 2525 4245
1560 4245 4264 2743 1886 1226 3556 1760 1332 1662 883 1288 -658 259 -1327 -1308 1006 -1470 -2327 -2753
1578 -2753 -1906 -2953 -2780 -2067 -3331 -1665 -2668 -4139 -3651 -4244 -980 -2705 -3511 -2390 -2328 -1543 -3308
1595 -3308 -1619 -1341 -666 298 -1452 129 -858 114 544 -175 1780 1344 2542 1311 638 2429 2240
1612 2240 3314 1507 2596 2800 1856 3409 1626 2426 2361 3063 2685 214 2064 1564 1378 742 230 1201
1630 1201 -644 561 -778 -1733 -464 -755 -641 -2864 -1569 -1946 -3171 -2190 -3160 -2086 -2725 -2490 -2631
1647b631j655K068k31Lj96JJ402r63R30j212J329J360j306J356j065J277N24m97
1665D94Q86q64K206L55p45l74M18J743j805J252k77p38J612j249L79j354J219
1682C158J155k262N88o02R12q60q87J024j768J267o72j482n61NJ525k355k0l00
1700b135j56J062k708J036j47L08L55j627N54n11Q39n29n73P40k47J574j815M12
1718c568J373o83J747q70P04j74M89J190j816J538Q14O53o03j085K862j316J209
1735B464j15L4J090l88J115j870M28J129l71O53j814J314k24j105N32j063J126
1752B935j40j94r56j539J520j100M44j212k01J437k176K72j059J99K98l25L82
1769a415j977J226q5p03P2q00K388j495l59L95j038J675m43O22n12M38J285j054
$$ plain form
1647 -2631 -4286 -2218 -2449 -2446 -2642 -2641 -1239 -2202 -1272 -2484 -1155 205 -1101 255 -810 467 991 494
1665 494 1380 516 2722 3077 2332 1958 2376 4119 2314 3566 3289 2551 4163 2914 3293 1939 3158
1682 3158 4313 2051 2639 2037 2949 2089 1202 2226 458 1725 1053 -429 -990 -985 540 -1815 -1835 -2135
1700 -2135 -2291 -1229 -3937 -2901 -3048 -2740 -2385 -4012 -3458 -3969 -3130 -3659 -4232 -3492 -3739 -2165 -3980 -3568
1718 -3568 -2195 -2878 -1131 -2001 -1297 -1471 -982 208 -1608 -70 744 1397 794 -291 2571 1255 2464
1735 2464 2349 2383 3473 3085 4200 2330 2758 3887 3516 4169 2355 3669 3445 2340 2872 1809 2935
1752 2935 2795 2601 1645 106 1626 526 970 -242 -443 994 -1182 -910 -1969 -1770 -1472 -1797 -1415
1769 -1415 -3392 -2166 -2251 -2954 -2882 -3682 -1294 -2789 -3148 -2753 -3791 -2116 -2559 -1937 -2449 -2011 -726 -1780
1787a780M90p08K138L21j191J359j019J217J16k82Q04n01J978j284j50J58k2J989
1805C633k036P84k99J20K46j265J220j136Q43K2j190N0j010J645j057p24P74n74
1823D6M52j683j85m6k32J280j433M6o15M53J2j608J788j29Qk8j069J080m56J395
1843i24j021K00R11m86J053j383P85Q19L1Q86r06R60J40j2M45q26J810n03O92
1862B671n54r69J657l03M81q42L07O81j452J160j349N73M26m41k1j937J425l46
1880A167q40l14l23J291j552%o83n43J360j353O19j203o2P64j292J18n23J003
1898b366l48n32O50j132J703o71P5N84q05J832m65l01p0O80J490j215N05J82K26
1917B2O81m38J360r87J559j02q25O90J29J129r51L05M84o51J231j242K70l06K73
$$ plain form
1787 -1780 -1290 -1998 140 461 -730 629 -390 827 943 661 1465 964 2942 1658 1508 1666 1644 3633
1805 3633 1597 2381 2082 2202 2448 1183 2403 1267 2110 2132 942 992 -18 1627 570 -154 620 46
1823 46 498 -1185 -1370 -1416 -1648 -368 -1801 -1755 -2370 -1917 -1905 -3513 -1725 -1854 -1846 -1874 -2943 -1863 -2319 -924
1843 -924 -1945 -1745 -834 -1320 -267 -1650 -865 -46 -15 871 -35 925 1065 1053 1498 672 2482 1979 2671
1862 2671 2117 1148 2805 2502 2983 2141 2448 3129 1677 2837 1488 2061 2487 2046 2025 88 1513 1167
1880 1167 327 13 -310 981 -571 -571 -1254 -1797 -437 -1790 -1171 -2374 -2436 -1672 -2964 -2846 -3369 -2366
1898 -2366 -2714 -3246 -2596 -3728 -2025 -2696 -2621 -2037 -2842 -1010 -1475 -1776 -1846 -1166 324 -891 -386 -204 22
1917 22 703 265 1625 638 2197 2095 1270 1960 2089 3218 2267 2572 3056 2405 3636 2394 2664 2358 2631
1936B631J172j990L28J42J59o80j001J158p15K00o26j355R23r71R11j282m57M39
1954a014k45L85j859P94J5j00K17j466J253p39L65L18j696J632m3N69j028k44
1972b886J555o91Q97p77N63R14o39J288j520J008J601p29j15l10J618n41oM77
1990A707m01J286n17J80n79p0J077p64O54j224P61M11r27K69j043J017k63n62
2008A012k0j258J178n69k71n54l18J414j724j8n14L84M36j202R75q83mP06r20
2027b150J51o13J813j026p27J114m14J124p77O24o5lJ485j295L86O13K56P43r83
2046B56Q27o21R39Q4p54J293m89J103p08o01P40m54R09j027j47J179p14P17k924
2065c92J985k33J30J68k447J223n12P09o49q59J093k80n44n74k91J73r38J716
$$ plain form
1936 2631 3803 1813 2141 2283 2442 1762 761 1919 1204 1404 778 -577 346 -625 286 -996 -1453 -1014
1954 -1014 -1259 -874 -2733 -1939 -1924 -2024 -1807 -3273 -2020 -2759 -2394 -2076 -3772 -2140 -2183 -1614 -2642 -2886
1972 -2886 -1331 -2022 -1125 -1902 -1339 -425 -1064 224 -1296 -288 1313 584 469 159 1777 1236 1230 1707
1990 1707 1306 2592 2075 2255 1676 1606 2683 1919 2573 1349 2110 2521 1594 1863 820 1837 1574 1012
2008 1012 992 -266 912 343 72 -482 -800 614 -1110 -1128 -1642 -1258 -822 -2024 -1049 -1932 -1936 -1230 -2150
2027 -2150 -1999 -2612 -799 -1825 -2552 -1438 -1852 -728 -1505 -881 -946 -949 536 -759 -373 240 496 1239 256
2046 256 1083 462 1401 1485 731 2024 1535 2638 1930 1329 2069 1615 2524 1497 1350 2529 1815 2532 -392
2065 -392 1593 1360 1490 1658 -789 434 -78 631 -18 -877 216 -64 -608 -1182 -1473 -1300 -2238 -522
2083e22k370M25P00lk54j415J739j96k10L65p89J488p98M62p7k90J630q09K76
2102f48m04N07J135p62J199j225J138O63q26Q31o20J515n05O8l7n73J185j92L9
2121B488m04J20J229j835M63k95Q2N12r94L93j302R56n5j362L84r32J361j174
2139c65n11L83j027J125r23k88l25K77P44j950Q56o22N84N17j293Q10p06P84j86
2158b116m12R63l63J145p03j91L94k4J517j312L12R86p9O10j065J138K65J90O26
2177A881j384J055r7J077o41p17J657p79L9p60J83K43j85J077j539N74K55m97
2195A442M4j213Q18k46k24l94q69P68m12L07j238K95P25j035M99j006L51N32p99
2214a655J81p31P93j8n35L87m60J419q28J60l19o6J765j171M94k58M97Q26q31
$$ plain form
2083 -522 -2892 -2467 -1767 -1770 -2024 -3439 -1700 -1896 -2106 -1741 -2530 -1042 -1840 -1378 -1455 -1745 -115 -924 -648
2102 -648 -1052 -545 590 -172 1027 -198 940 1603 777 1608 988 2503 1998 2066 2029 1456 2641 2449 2488
2121 2488 2084 2204 3433 1598 2061 1766 1848 2360 1366 1759 457 1413 1358 -4 380 -552 809 -365
2139 -365 -876 -493 -1520 -395 -1318 -1606 -1931 -1654 -910 -2860 -2004 -2626 -2042 -1525 -2818 -2008 -2714 -1930 -2116
2158 -2116 -2528 -1565 -1928 -783 -1486 -1677 -1283 -1307 210 -1102 -790 196 117 727 -338 800 1065 1255 1881
2177 1881 497 1552 1455 2532 1891 1174 2831 2052 2091 1331 1514 1757 1572 2649 1110 1684 1939 1442
2195 1442 1486 273 1091 845 621 227 -642 126 -286 21 -1217 -922 -197 -1232 -733 -1739 -1388 -856 -1655
2214 -1655 -1474 -2205 -1412 -1430 -1965 -1578 -2038 -619 -1447 -1287 -1606 -1672 93 -1078 -584 -842 -345 481 -350
2233c50N42m03L31R76p93M73m41J128J30n80P74o76J125q82J03j56k63J324j437
2252I25N18r5k1K30q83J76k53K22p5q02L76p43N69n67o21N69p72Q94j094m5J5
2273a477j72O65j274Q69l07K81J58q83O92j73N05k32p00R17k85Q81m98J71J220
2292C58q48J064p57K51M95J48M87q05P31M53j13K19r12J355k18lJ99o29Q80o78
2312A677N47m32l95Q31o68L66j437J014l72m90K46j075O43k68k26l03n96R66o94
2331f66k06n07n39J141j191M67n63J46N83j050O33r09Q39N19o43N21q50R79j44
2350a440k79L16k29J327o85M02n8L8J266o02P46o87O87M52q02Q02m54J075l30
2369A545n2M82p97J130m66k90l7K77R15j380K83J67n71Q75j282N19q01M85J28
$$ plain form
2233 -350 192 -211 120 1096 303 776 335 1463 1593 1013 1787 1111 2236 1354 1457 1301 1038 2362 925
2252 925 1443 1348 1327 1557 674 850 597 819 744 -58 318 -425 144 -423 -1044 -475 -1247 -353 -1447 -1492 -1477
2273 -1477 -1649 -984 -2258 -1389 -1696 -1415 -1257 -2140 -1448 -1621 -1116 -1348 -2048 -1131 -1416 -535 -1033 -862 358
2292 358 -490 574 -183 68 563 711 1198 393 1124 1577 1464 1683 771 2126 1908 1905 2104 1475 2355 1677
2312 1677 2224 1792 1397 2228 1560 1926 489 1503 1131 641 887 -188 455 187 -39 -342 -938 28 -666
2331 -666 -872 -1379 -1918 -777 -1968 -1501 -2064 -1918 -1335 -2385 -1752 -2661 -1822 -1303 -1946 -1425 -2275 -1296 -1440
2350 -1440 -1719 -1403 -1632 -305 -990 -588 -646 -608 658 56 802 115 802 1254 452 1254 800 1875 1545
2369 1545 1493 1975 1178 2308 1842 1552 1515 1792 2707 1327 1610 1777 1206 2081 799 1318 517 1002 1130
2388A130j638R17n93L34l90n17M19n81O64j054M5M63l26M75j567L45L04J69K50
2407a151r28O41j81J10K09n49J203m06M03m76n8O10JO53q07N42O65m41Q12r66
2427a14R38J85n8M70r59J064j51O6p10K16J110r82N40m75K2K64l10N02r67J28
$$ plain form
2388 1130 -508 409 -184 150 -240 -757 -338 -919 -255 -1309 -1264 -801 -1127 -652 -2219 -1874 -1570 -1401 -1151
2407 -1151 -2079 -1438 -1619 -1509 -1300 -1849 -646 -1052 -649 -1125 -1183 -573 -572 81 -726 -184 481 40 852 -114
2427 -114 824 1009 951 1421 462 1526 1375 1441 731 947 2057 1075 1615 1140 1162 1426 1116 1618 651 779
$$ [...]
8191C14
##END NTUPLES=NMR FID
##END=
