##TITLE=1H_DE-135K_TFA_TFA
 200.13Hz, CCl4.
 8 sc
 
 8.4.2026
##JCAMPDX= 6.0         $$ Bruker NMR JCAMP-DX V2.0
##DATA TYPE= NMR FID
##DATA CLASS= NTUPLES
##ORIGIN= UXNMR, Bruker Analytische Messtechnik GmbH
##OWNER= pz
$$ XWIN-NMR		Version 3.5
$$ Wed Apr  8 13:54:18 2026 Russian Standard Time (UT+4h)  she@DPX200
##.OBSERVE FREQUENCY= 200.1313
##.OBSERVE NUCLEUS= ^1H
##.DELAY= (6, 6)
##.ACQUISITION MODE= SIMULTANEOUS
##.ACQUISITION SCHEME= undefined
##.AVERAGES= 8
##.DIGITISER RES= 18
##SPECTROMETER/DATA SYSTEM= spect
##.PULSE SEQUENCE= zg30
##.SOLVENT NAME= CDCl3
##.SHIFT REFERENCE= (INTERNAL, CDCl3, 0, 14.3821)
##AUDIT TRAIL= $$ (NUMBER, WHEN, WHO, WHERE, WHAT)
$$ ##TITLE= Audit trail, XWIN-NMR		Version 3.5
$$ ##JCAMPDX= 5.01
$$ ##ORIGIN= Bruker BioSpin GmbH
$$ ##OWNER= she
$$ F:/spectra/data/she/nmr/H-C/1/audita.txt
$$ ##AUDIT TRAIL=  $$ (NUMBER, WHEN, WHO, WHERE, WHAT)
(   1,<2026-04-08 13:50:19.31 +0400>,<she>,<DPX200>,
      <created by zg, POWCHK disabled, PULCHK disabled
       configuration hash MD5:
       00 E9 B6 7A A2 85 ED C7 34 08 36 98 17 FE 4E 26
       data hash MD5: 16K
       BF B4 17 BB 0F C2 CF 1A B9 82 09 BF 14 06 00 C0>)
$$ ##END=
$$ 
$$ hash MD5
$$ 40 CD 8F 45 12 12 57 E8 CC E6 16 FD 50 72 B2 E4
##$RELAX= 
##$RELAX= 
##$RELAX= 
##$RELAX= 
##$RELAX= 
##$RELAX= 
$$ Bruker specific parameters
$$ --------------------------
##$DU= <F:/spectra>
##$EXPNO= 1
##$NAME= <H-C>
##$PROCNO= 1
##$TYPE= <nmr>
##$USER= <she>
##$AMP= (0..31)
100 100 100 100 100 100 100 100 100 100 100 100 100 100 100 100 100 100 
100 100 100 100 100 100 100 100 100 100 100 100 100 100 
##$AQSEQ= 0
##$AQ_mod= 1
##$AUNM= <au_zg>
##$AUTOPOS= <>
##$BF1= 200.13
##$BF2= 200.13
##$BF3= 200.13
##$BF4= 200.13
##$BF5= 200.13
##$BF6= 200.13
##$BF7= 200.13
##$BF8= 200.13
##$BYTORDA= 1
##$CFDGTYP= 0
##$CFRGTYP= 5
##$CHEMSTR= <none>
##$CNST= (0..31)
1 1 145 1 1 1 1 1 1 1 1 1 1 1 1 1 1 1 1 1 1 1 1 1 1 1 1 1 1 1 1 1 
##$CPDPRG= <>
##$CPDPRG1= <>
##$CPDPRG2= <>
##$CPDPRG3= <>
##$CPDPRG4= <mlev>
##$CPDPRG5= <mlev>
##$CPDPRG6= <mlev>
##$CPDPRG7= <mlev>
##$CPDPRG8= <mlev>
##$CPDPRGB= <>
##$CPDPRGT= <>
##$D= (0..31)
0 0.7 0 0 0 0 0 0 0 0 0 0.03 0 0 0 0 0 0 0 0 0 0 0 0 0 0 0 0 0 0 0 0 
##$DATE= 1775641818
##$DBL= (0..7)
120 120 120 120 120 120 120 120 
##$DBP= (0..7)
150 150 150 150 150 150 150 150 
##$DBP07= 0
##$DBPNAM0= <>
##$DBPNAM1= <>
##$DBPNAM2= <>
##$DBPNAM3= <>
##$DBPNAM4= <>
##$DBPNAM5= <>
##$DBPNAM6= <>
##$DBPNAM7= <>
##$DBPOAL= (0..7)
0.5 0.5 0.5 0.5 0.5 0.5 0.5 0.5 
##$DBPOFFS= (0..7)
0 0 0 0 0 0 0 0 
##$DE= 6
##$DECBNUC= <off>
##$DECIM= 32
##$DECNUC= <off>
##$DECSTAT= 4
##$DIGMOD= 1
##$DIGTYP= 9
##$DL= (0..7)
0 120 120 120 120 120 120 120 
##$DP= (0..7)
150 150 150 150 150 150 150 150 
##$DP07= 0
##$DPNAME0= <>
##$DPNAME1= <>
##$DPNAME2= <>
##$DPNAME3= <>
##$DPNAME4= <>
##$DPNAME5= <>
##$DPNAME6= <>
##$DPNAME7= <>
##$DPOAL= (0..7)
0.5 0.5 0.5 0.5 0.5 0.5 0.5 0.5 
##$DPOFFS= (0..7)
0 0 0 0 0 0 0 0 
##$DQDMODE= 0
##$DR= 18
##$DS= 0
##$DSLIST= <SSSSSSSSSSSSSSS>
$$ [...]
##$SUBNAM0= <"">
##$SUBNAM1= <"">
##$SUBNAM2= <"">
##$SUBNAM3= <"">
##$SUBNAM4= <"">
##$SUBNAM5= <"">
##$SUBNAM6= <"">
##$SUBNAM7= <"">
##$SUBNAM8= <"">
##$SUBNAM9= <"">
##$SW= 18.0517328524113
##$SWIBOX= (0..15)
0 0 2 0 0 0 0 0 0 0 0 0 0 0 0 0 
##$SW_h= 3612.71676300578
##$TD= 16384
##$TD0= 1
##$TE= 0
##$TE2= 300
##$TE3= 300
##$TEG= 300
##$TL= (0..7)
0 120 120 120 120 120 120 120 
##$TP= (0..7)
150 150 150 150 150 150 150 150 
##$TP07= 0
##$TPNAME0= <>
##$TPNAME1= <>
##$TPNAME2= <>
##$TPNAME3= <>
##$TPNAME4= <>
##$TPNAME5= <>
##$TPNAME6= <>
##$TPNAME7= <>
##$TPOAL= (0..7)
0.5 0.5 0.5 0.5 0.5 0.5 0.5 0.5 
##$TPOFFS= (0..7)
0 0 0 0 0 0 0 0 
##$TUNHIN= 0
##$TUNHOUT= 0
##$TUNXOUT= 0
##$USERA1= <user>
##$USERA2= <user>
##$USERA3= <user>
##$USERA4= <user>
##$USERA5= <user>
##$V9= 5
##$VALIST= <valist>
##$VCLIST= <CCCCCCCCCCCCCCC>
##$VD= 0
##$VDLIST= <DDDDDDDDDDDDDDD>
##$VPLIST= <PPPPPPPPPPPPPPP>
##$VTLIST= <TTTTTTTTTTTTTTT>
##$WBST= 1024
##$WBSW= 4
##$XGAIN= (0..3)
0 0 0 0 
##$XL= 0
##$YL= 0
##$YMAX_a= 212810
##$YMIN_a= -185554
##$ZGOPTNS= <>
##$ZL1= 120
##$ZL2= 120
##$ZL3= 120
##$ZL4= 120
##$ABSF1= 10
##$ABSF2= 0
##$ABSG= 5
##$ABSL= 3
##$ALPHA= 0
##$AQORDER= 0
##$ASSFAC= 0
##$ASSFACI= 0
##$ASSFACX= 0
##$ASSWID= 0
##$AUNMP= <proc_1d>
##$AZFE= 0.1
##$AZFW= 0.1
##$BCFW= 1
##$BC_mod= 2
##$BYTORDP= 1
##$COROFFS= 0
##$CY= -3
##$DATMOD= 1
##$DC= 2
##$DFILT= <>
##$DTYPP= 0
##$F1P= 0
##$F2P= 0
##$FCOR= 0.5
##$FTSIZE= 0
##$FT_mod= 4
##$GAMMA= 1
##$GB= 0.15
##$INTBC= 1
##$INTSCL= 1
##$ISEN= 128
##$LB= 0.25
##$LEV0= 0
##$LPBIN= 0
##$MAXI= 10000
##$MC2= 0
##$MEAN= 0
##$ME_mod= 0
##$MI= 1.114404
##$NCOEF= 0
##$NC_proc= 0
##$NLEV= 6
##$NOISF1= 3.799351
##$NOISF2= 2.8
##$NSP= 1
##$NTH_PI= 0
##$NZP= 0
##$OFFSET= 14.38212
##$PC= 1
##$PHC0= -3709.322
##$PHC1= 23.1923
##$PH_mod= 1
##$PKNL= yes
##$PPARMOD= 0
##$PSCAL= 0
##$PSIGN= 0
##$REVERSE= no
##$SF= 200.129724274929
##$SI= 16384
##$SIGF1= 3
##$SIGF2= 2
##$SINO= 400
##$SIOLD= 16384
##$SREGLST= <1H.CDCl3>
##$SSB= 0
##$STSI= 0
##$STSR= 0
##$SW_p= 3205.1282051282
##$SYMM= 0
##$S_DEV= 0
##$TDeff= 0
##$TDoff= 0
##$TI= <>
##$TILT= no
##$TM1= 0
##$TM2= 0
##$TOPLEV= 0
##$USERP1= <user>
##$USERP2= <user>
##$USERP3= <user>
##$USERP4= <user>
##$USERP5= <user>
##$WDW= 1
##$XDIM= 8192
##$YMAX_p= 0
##$YMIN_p= 0
$$ End of Bruker specific parameters
$$ ---------------------------------
##NTUPLES= NMR FID
##VAR_NAME=  TIME,          FID/REAL,        FID/IMAG
##SYMBOL=    X,             R,               I
##VAR_TYPE=  INDEPENDENT,   DEPENDENT,       DEPENDENT
##VAR_FORM=  AFFN,          ASDF,            ASDF
##VAR_DIM=   8192,          8192,            8192
##UNITS=     SECONDS,       ARBITRARY UNITS, ARBITRARY UNITS
##FACTOR=    0.0002768,     1,               1
##FIRST=     0,             0,               0
##LAST=      2.2672688,     0,               0
##MIN=       0,             -185554,         0
##MAX=       2.2672688,     212810,          0
$$ Real data points
##PAGE= N=1
##DATA TABLE= (X++(R..R)), XYDATA
$$ [...]
1853b25O5mj40L76j78L6J96j29L18l48K03m9O1J29m68J61K0k89K33k5J4j69R8
1876a14J12r0k83M77m5j62J58O0O5n35M64m5J15k35n6P0l45P12l25N1j78J42j99
1899a86J84j2m48M35M7k54J86j2N6n6L29l36o3L41j66O3k5K15k74J65k45Q6l00
1922b70R9l4J32J19P4k91P0l0M3L64k36k23l3j6K32O9Lj00p9P4n6l1j06N10k05
1947G9j68j6J75j48P5J26r8L24j11o8j90J86l93J76r1R0r5K47q3K65L5k89L06
1970C34l94L07m77L29O6j8j10j31J3N6l9K03O9k19n7j85K37K11j40j01K18k76
1992a04q5K88j79r2J98K87k85k43kJ48J2j07J30l05K34J53Kq7L3K81o1j19N9n
2016A51j09L5k39Q9K57k77K84j45n1J30j09J63j62k04K79j33O4J98j16j59j21
$$ y = [-225, -160, -164, -304, 72, -106, -70, 126, -3, 315, -33, 170, 121, 182, 311, -157, 4, 24, -265, -32, -57, -43, -212, -114, -2, -92, -375, 102, 57, -105, 53, 113, 178, -357, 107, 62, 177, -58, -114, -44, -389, 323, -2, 49, -129, 13, -186, -2, -14, -462, -27, 20, -234, -48, -60, -4, -60, 269, -67, -130, 211, 45, 108, 83, 298, 24, 189, -56, 30, -270, -171, -205, -73, 46, 120, -171, -101, -131, -88, 276, 40, -183, -216, -232, 0, 69, 72, -28, -107, -33, -89, -120, -226, 284, 79, -89, -105, 70, -78, -3, 123, 25, 349, 238, 170, -20, 166, -227, -51, -142, -52, -147, 100, 17, 282, 317, 28, 334, -60, 247, -230, 99, 165, 147, 37, -94, -81, -25, -64, 139, 208, -11, -68, -253, -16, 195, 55, -46, 172, -104, -189, 99, -80, -172, 26, 313, 28, -215, -217, -69, -57, -164, -34, -339, -105, 48, 50, -37, -4, 277, 216, 97, 156, 151, 42, 77, -162, -73, 184, -93, 191, 46, -5, 125, 16, 179, 17, -187, 92, -41, 23, 221, 105, -54, -175]
2037a75N7K53j85J75o7r2j58Q3L02N0k61l1l4J84l4j27j31J28J30m3J14l22L8
2060a46M6m0K01L6r5K3n9M3J55j51Pkrj14J29J99l39P0j00K90j15j06J99k12o7
2085a57q6L00p8N9j54K35k38q0K32k43K36k55J97k04L10j9n0k6l19M05k66J43
2107e8j76J05k5J41q8J34j17K16l26J00O3J09k64K35k16q6J91K60j90J0O0k47
2129a69n9J46K27p7j35j04J67P0r7r9k7KK77k37l5M58k60QJ66k1q2j33N4K05l88
2154a43K57O7l03J16j16R6j04J15O7P0j94K56j51k3k5l59N71m31K72j35j17L42
2176A28J53k44J3Q8k80L34m8k06r3K98l69K97m00K50J33k23k6K33Mp0j0J09J43
2199B14m53K15R8p5Q3j45J57J06l37L82r9l84K29K99j88K1l15mP1K04p7j51n8
$$ y = [-175, -118, 135, -50, 125, 58, -34, -192, -109, 193, 243, -18, -49, -83, 101, 67, -60, -191, -63, 67, 24, 138, -184, -146, -100, -140, 61, 97, 2, 25, -34, 9, 164, 13, 20, 18, 9, -105, 24, 223, -116, -46, -146, 144, 29, -77, 122, -90, -157, -243, 57, -21, 38, -116, 119, -119, -199, 33, -210, 26, -229, -32, -236, 74, 55, 5, -21, -340, 65, -201, -58, -234, -129, -154, -13, -101, 33, -84, 132, -194, -94, -31, 78, -186, 49, -167, -253, -62, 198, 8, 18, 78, -169, -228, -82, 145, 68, -67, -171, -4, 66, -31, -130, -157, -155, 122, -115, -150, 308, 48, 56, 222, 201, 119, -14, 40, 245, -143, 114, 181, -122, -6, -122, -26, -130, -15, 52, 122, -72, 184, 33, 10, -15, -374, 197, -234, 38, -97, -214, 128, 281, 37, 50, 138, -142, 192, 144, -62, -155, 143, -226, 71, -329, -79, 54, -169, -195, 38, 42, -28, -38, 71, 214, -239, -24, 74, -1, 82, -63, 94, 200, -137, 245, 146, -238, -9, 290, 102, 123, -192, -196, -125, 79, 2, -149, -207]
2222b07l9l4L15Q1J2On3m9J9lK06m85N31k39p0P6j44K12k92J86m0K23j65j48k09
2247c10M51k51J96k34N9L18o9k54J73l79L30J51k60J51l25L40l59J15j04K20n9
2268a00j06J83l07K11Q0l6K05%O6K02n51o7K48J78Jk56J97r1m7j19K53k56P9M5
2292A2Q4k7OJ18K2l31k27N80m28JJ51k13k21N30%p4J4k9m3J81j37k28K68m4J17
2317H2r5j76L1L3J23J06j16O4j81K78j57J94j13j41P9r9L61o50K84r6K72N7k47
2340a07n9J66l99N33p5k40K40j71K72p9l58M85j91J03J94j66M1r5n0m4O3l50K26
2363f1j05K33r8R1K3k61J01qj02p9M54l77J65J89j71l6m2M50m07O7j44J19M2j00
2387e7J51M0K19j12O8j78O4k04L52l41J26q1m5l13L59nj50J23J37J7j27l4L9Q9
$$ y = [-207, -246, -280, 35, 116, 128, 134, 81, 32, 51, 48, 254, -231, 300, 61, -9, 67, -77, 135, -157, 29, -11, 212, 47, -101, -310, 141, -110, 86, -148, -89, 229, 160, -94, 79, -300, 30, 181, -79, 72, -253, 87, -272, -157, -261, -41, -100, -206, -23, -330, -119, -39, -75, 130, 130, 196, 398, -153, -220, 28, 206, 207, -49, 148, 57, 10, -109, 144, -112, -33, 12, 96, 69, 75, 193, 215, -116, -343, 237, -191, -190, -39, -252, -473, 57, 57, -17, -3, -32, -75, 106, -31, -259, 9, -35, 82, -13, -189, -158, -125, -2, 104, -12, 52, -129, 149, -8, 186, 73, -68, 11, -88, 273, -377, -93, -189, 83, 140, -107, -166, 0, -399, 134, 59, -181, 59, -112, 160, 81, -277, 208, 17, 120, 314, 148, 189, 94, 44, 0, 63, -287, -61, -166, 67, -31, 60, 83, -178, -77, -85, -187, -266, 188, -189, -24, 165, -6, -42, -84, 366, -41, 26, -118, 1, 43, -57, 94, 134, 353, 241, 309, 131, 195, -9, 343, 2, 128, 47, 2, -311, 48, 43, -107, 16, 153, 170, 43, 9, 48, 137]
2411A37j98l7L6j18K88l0n6L35o2k04r3qJ61k7m16K65j47J75Q6j52N7L4j69J99
2435E6k12K85q7j41J32j12J30Oj64Q8q9P6j56K92K52m29J37j07K56k03j04J25
2457C1k58K98K49l61k30M88p7l42K21K5q3J84j80k1K49l71J52M8k67M07Jj44L9
2480E8J88j00p6J62m44L40J09k71l02L42r6j69M64k99P1J95k02m5K74j46P5l9
2502H9LLk9j29k4O6M3J82j73k38J84K15j72J19m06K11j57K09mQ2q4q6J42l3n7
2527d4l20N64l63L42q6r3N2K57o7k86J85j72M3k48J44J40j73K18m5O8j52J19j53
2550g0P6K2l3Qr6J92k91J20J19m48L23J46J33j79J25j30K31j67J04k54J06j09
2572g2K77l9j88J18l98L96R5l84J26m6P4N3p2K75j01m18L89l9j21J01j74K52j9
$$ y = [137, -61, -98, -62, -180, 108, 78, 22, 357, 295, 91, -2, -10, 151, 124, -292, -27, -174, 1, 87, -65, -8, 26, -143, 56, -156, 129, 42, -99, 33, -79, 51, 57, -107, -19, -108, -32, -188, 104, 356, -73, 64, -43, 213, 10, -94, 31, -227, 71, 320, -41, -271, 217, 140, -202, 19, 44, -39, 145, -35, -56, 193, -178, -26, 22, -245, 162, 163, 19, 58, 246, 146, 70, 232, -212, 128, 237, -34, -336, 6, -90, -259, 205, -94, -23, 172, -30, -75, 199, 53, 128, 89, 92, 95, 66, -63, -87, -21, 22, 204, 31, -207, -23, 192, 20, 139, -267, -56, -213, -4, -8, 74, -10, -96, 46, 13, -44, -364, 200, -163, 179, 93, 0, 52, 309, 242, -44, 141, -31, 12, -236, -92, 48, -125, 93, 48, 116, -36, 83, -70, 6, 28, -5, 3, -93, 99, -192, -72, 47, -401, -78, 68, 201, 22, 147, 17, 248, 81, 185, -69, 37, -72, 205, 166, -22, 96, -302, 94, 189, -195, -69, -115, -41, 12, -60, 215, 114, -304, 85, 46, -75, 26, -148, 104, 85]
2595H5l7k93M52j67o2j46M59k81j0J89k96R5J5J09j38p6J24j8K73n95P28m21j01
2618a12o1j00L41J37l6j77K7q9Q7j89J24npJ60j70R0K37k58M09n70K65j85r2r7
2642b71K30K2Q3n0n4M07l90P0J42k72K34k73J74N3l26J98L31l87M4K83k89j59
2664b00J12K55j71R5j89R4J30j17j00L63j78j29Kl12K08k8L34l37K62J47l35p3
2686a67J19J56l00K19J16l60m7M17j82n7j41L2j23K09%J33j50J84J67j85K09j79
2708G0M4m49J27M72l78J15nJ74l47L80J00p08K92J33L8J27rp4J70k55pK04k20
2731fJ05p0o8K82n07P1j51O53m66K40Rr3K08k20J12J17j50j20K21rk35J19P4k66
2755a50J39J37n0J0jL0l41N5M62l00K38p5o4k10J43P8R0K8k94O9j92J15Q0o4J93
$$ y = [85, 48, -245, 207, 40, -22, -168, 291, 10, 0, 189, -107, -12, 3, 112, -26, -102, 22, 4, 277, -318, 410, -11, -112, -173, -273, 68, 205, 169, -8, 19, -70, 17, -172, -48, -53, -60, 100, -70, 20, 257, -1, 408, -162, 103, -82, -174, -271, -41, -19, 64, 14, -40, 367, -23, 47, 189, -83, 151, -122, 52, 105, -221, -23, 308, -79, -35, 248, -41, -200, -88, 167, -4, 91, -98, -4, 126, 9, -91, 272, 94, -35, -33, -345, -137, -165, 169, -168, 94, 241, -94, -167, -48, 108, -192, 27, 143, -217, -264, 153, -29, -86, -227, -195, -318, -109, -109, 24, -126, 58, 225, 40, 249, 70, 114, -335, -208, 264, -114, 1, -4, 170, -177, 203, 303, -405, -113, 20, 58, 185, 176, 102, 272, 17, 10, 214, -6, 99, 29, -39, 243, -264, -193, -344, 309, -157, 83, 92, -1, 207, -13, 99, 216, 66, -54, 167, 158, -77, 42, 116, -150, -11, 126, 76, 86, 85, 115, -226, -171, 291, -9, 229, 154, 90, -120, 23, 101, 191, 219, -75, -6, -198, -83, -3, -67, 126]
2780A26k81K14j00m6l5J52j28J12m83M21j57r7O89q4l61L3J4j87p9K17L7K73l93
2803a43Q4J35j67j00J83M4l02M40l53R0k1K49L2k40P0j21k46K93n7J78J51n51
2825c52L52Mm5J3K25l09J67k09K68k69K54k69m0L83oj52p8J51P0j84k41M47l61
2848a81L22l25L96L8k87p6J73k50N6J03j16K13k73K8K60j08K9k84O9lJ2K92j18
2871c0j44j4K91Nj0J53m89K5J86l56K24L82l32r6K59J7Q7m99L81j32K00j21K09
2894A96l00j01J17J25p6J13k01K79k09m9J66J78m74L96j64J12p6K01m19L50o8
2915I6k6j40K82k08q5k09L57N3j25R9j46j10K03k6j6n3R0l95K89j08J52q3Q7q
2939c0k83J72L7n0J89l6nlO2q6L27m53j3K38qj43P5K94l33r9K82j89j17L59j91
$$ y = [126, -155, 59, -41, -87, -122, 30, -98, 14, -469, -48, -205, -302, 387, 303, -58, -25, -11, -198, -277, -60, -23, 250, -143, -59, 76, -91, -191, -8, 36, -266, 174, -179, -89, -110, 139, 171, -69, 1, -120, -366, -73, -130, 48, 199, -352, 0, 4, -41, -28, 197, -112, 55, -154, 114, -155, 99, -170, -210, 173, 167, 15, -63, 88, 158, -26, -267, 180, -181, 141, -184, 212, 250, -37, -113, 60, -190, -134, -31, -147, 66, -207, -179, 81, -27, 2, -282, -213, -216, -204, 88, -30, -174, -188, 103, 108, 98, 251, -238, -213, -27, -383, -159, 223, -109, -205, 54, 71, 158, -341, 40, -92, 108, -13, 196, -104, -205, -88, 37, -39, 74, -127, 152, -57, -106, 60, 238, -236, 160, -4, 108, 32, 233, -186, 164, 96, 70, -70, 212, 4, -81, -290, 67, 120, -5, 94, -52, -162, 41, 15, -1, -54, 36, -359, -70, -178, -26, -109, -22, -30, -313, -141, -104, -154, 35, -1, -6, -9, 53, -33, 294, -159, -172, 66, 58, -85, -10, 284, -49, -148, 134, -55, -172, 187, -4]
2964dn0K8L8n2J94k44K07O2j52L8J40r5j05M1j27j65K84l18L0J43M9P4j95mO8
2989a15Q1K06j42o9O5j51p5K50q3J55Jj85Lrp0J50j23N4J55j64q0M0J55R0l86
3014b47J02J60k18M58m27K70J0k06R7p5J87j96J24j91L39R8j97K01j70l0%K05
3036B94n27L63j78k93M14l11K94J10k56J62L1J22j86j50K95k11p7k44K87q5J33
3057a3j35j9J13K3J06J61k30N1j97J48J01q1k40J66n7P5J78Q7n02J76m6P3K62
3080B00j30K4k22J0R8Q4J48k51J01k2m5K28k47J1Q2k6K11o66M65M2r4j4q7j01
3104b01M31j96j48R8p1kJ76J99l22k7L2j54M4L5k38N06j39k74K18J39M3O4j90
3127B3j15j47K81J46l11J89J62j30j25P5j49Q9k99J71K22O2k25L34j95J7M7q2
$$ y = [-4, -54, -26, 12, -40, 154, -90, 117, 179, 27, 65, 205, 110, 5, 46, -81, -246, 38, -280, -250, -107, -58, 16, -179, -183, -115, -34, 172, 30, -39, 26, -125, -200, 50, -33, 122, 123, -62, -59, -68, -138, 12, -111, -57, 98, -66, -146, -106, 49, 139, -247, -145, 15, -203, 255, -172, 98, 108, -98, -1, -76, 111, -85, 39, -152, 187, 285, 88, 289, 119, 89, 89, 294, -233, 130, -48, -341, 73, -238, 56, 166, -90, 72, 103, 225, 39, -111, 184, -27, -104, -348, -61, -146, -13, -148, -167, -54, -31, 75, 236, 6, 57, -140, 8, 109, 28, -212, -46, -103, -28, 150, 237, -265, -89, -135, -62, 200, 70, 94, -128, -118, -20, 64, 212, -39, 62, 40, -5, 223, -24, -13, 69, 43, 254, -412, 53, 95, 1, -13, -100, -201, 230, 34, -114, -16, -87, -89, 87, 286, -36, -63, -31, -185, -141, -106, -344, 162, 23, -251, -33, 106, 149, 213, 23, -92, -239, 42, 188, -123, 66, 228, 98, -27, 48, -101, -12, -311, -140, 82, 144, -81, 253, 58, 75, 122, 40]
3149D0M3k84M13j85k22J4j04K19J34Mj96O5J19j09jL33n39j2M33J85k04m27K47
3172c4J01J78k36K06m22J28j18L47j84K5Q7J3K52k84j11o2R7j63J19L70m20K96
3194A85r7j0j70j1J67l3r0N4j08n6J72n6J99j82J11l64K04J79r9P8m8k67L27O
3218I1j68N7J69k06j0r5k0P7K01q9O9j66K81J29n70M58j59J34j91m0K65k15K1
3241B3O7l28L84J16j74k84J79j6J11J9k25J19L8K95k68o6o7p4J93K78j51l75L47
3264A41r4K62o14J89K08k51L11n2n5p8N9j55K47k43J94n42N04k42J30J67j40n2
3286a06L34k80r1J60N8m0p6j36O6L40m00J53q4J06O9J79k4m0l1j72ko7K0J56R8
3311A90l17J16L2o3n6J16N8Q2l84K44j12J39l46L26q4J25j57n3o2K75J7L7P6q1
$$ y = [40, 83, -201, 212, 27, -195, -181, -285, -66, 68, 72, -124, -59, 60, -49, -50, 283, -256, -268, 165, 350, 146, -281, -34, 67, 245, 9, 215, -207, -79, -197, 150, -34, -9, 78, 91, 343, 59, -52, -114, -17, -180, -61, 309, -111, 185, 88, 78, -92, -103, 64, 31, -59, -5, -113, -169, 3, -53, 146, -36, 75, -289, -85, 94, -5, 73, 25, -242, 85, 91, -77, -20, 149, -57, -67, -162, -182, -105, 96, 7, 76, -90, 191, 320, -250, 208, 49, 183, -8, -48, 217, 2, 23, 90, -238, 146, 262, 88, -196, -17, -33, 78, 97, -128, -9, 29, 324, 56, -10, -77, -151, 42, 320, 169, -206, 141, 47, 309, -305, -116, 92, -159, 152, 100, 45, -33, 26, -129, 118, -125, 69, -473, 31, -211, -81, 86, -54, -106, 228, -52, -143, 17, 75, 35, -41, -177, -111, 229, -171, -18, -102, 4, 73, 252, 228, 188, 157, -15, -17, -84, -64, 92, 190, -127, -11, 21, -42, -98, 18, 76, 158, -226, 18, -94, 45, -301, 25, -59, 66, -91, -144, -206, 69, 86, 123, 199, 118]
3335A18J41l58K41k41K21j97J38K8K5l14PK42P3j66J52j57r6J99k43K24Q4Rl84
3358b54L30M5q5k52K03K9K50j98q4k02K99j67K60j54J02L1k52Q3k40K51lJ93j94
3381iK96l27J27k63L89K4k09r5j57Q8n9K08k00M15o3j14l09n0K25K56j70K81l33
3404d9O1j43k7J92J68j63r2j07K91j7l2l7p5L17l01J24j03N6R2k56J29L15l57
3427a4P0K78R0k31P5j79o4j43j25M41k95J87j69j94M3R1K42J08l71Q9j04K47k98
3450b26k7M11L8p8j59R4M6j53K3K32l39L40k21M5qJ14q9L0J04k87J13L8J21l08
3474a46M49m29n4M3J30q1N4J10k56L14r7K6j35Q4j42L19j7j46K4j57K3K89k34
3497b9J06K31k83K0j30K9J25o8NM0Nj76P8J72p8j32K58r6k72J58k16J71m9L29
$$ y = [118, 259, -99, 142, -99, 122, -75, 63, 91, 116, -198, -191, 51, 124, -42, 110, -47, -143, 56, -187, 37, 121, 130, -254, 76, 121, 36, -216, -13, 16, 266, 68, -16, -218, 81, -86, 174, 20, 122, 153, -99, -16, -256, -5, -8, 185, -9, 287, -40, 87, -176, 213, 237, 28, -67, -224, -136, -195, 13, -187, 228, 165, 51, -258, -308, -83, 173, 3, 284, -49, 12, -131, -158, 34, 202, 39, -53, -160, 131, 114, 82, 45, -30, 287, -14, 110, 7, 63, 155, -101, 28, 343, -14, 56, 334, 424, 193, 268, 89, 25, -118, -243, 198, -97, 90, -79, -273, -230, -139, 103, 211, -160, -71, -175, 72, -226, -253, 158, 196, 118, -41, 53, 99, -54, -31, 201, -138, 202, -19, 26, 18, 132, 43, 73, 177, -110, 3, 41, 162, -146, 303, -126, -180, -137, -7, -88, -34, 76, -180, 134, 37, 63, -72, 12, -130, 189, 172, 26, 50, -107, -84, 205, -29, 77, 308, 25, 45, -85, -56, 69, 1, 6, 46, 51, -125, -47, 125, 47, -85, 173, 77, -195, -37, -253, -82, -131, 198]
3521A98l86J97j16Q5J81M8K0j41n1J49q6QJ00j47j9j37J60l88K32K68j80J3J90
3544A98j42j8j3j00O5O6l12L16pl25L95k83K32p3j96L04j63K05P1l55P5K10q9
3567F1Q3O3q1j39o3J46j37P9P4J41l47j8M11k62l0J21Oj06Q3j48J69J76m16J71
3591C7j15K73n83L85rR8K7K19l69o5PJ34j22n7k3O9L16mk57o7K21j17r3J52n4
3616Cj05N9N8J79j32j84K06p4j1j99J24Q2J12m24K17k48K77J64m17K24R0l0j54
3639a83M20k41K7l3L3kl4Q7q5j90K86J54j67j00P5q1L6q7J21k15N1Q3k01j35J86
3664a95J87l2Q1j73L3J74j57K43l03J08n7m8J40j6J3p9K36j69K8j65J0J89r7P7
3688B8J8l22L01K9P8o3o2j3k52L58O5l37K05K51l33j39K41j12J24k21J74J37k66
$$ y = [198, -188, 9, -107, -22, 159, 207, 227, 86, 35, 184, 98, 106, 206, 59, 40, -97, 63, -325, -93, 175, -5, 8, 198, 56, 38, 25, -75, -10, 56, -256, 60, 53, -272, 123, -160, 72, -1, -197, 107, -56, 149, 220, -135, -60, 150, 61, 144, 207, 126, -13, -76, 70, -67, 12, 86, 227, -120, -138, 273, 11, -19, 102, 108, 2, 85, -63, 106, 282, -134, 37, -78, 195, -388, -3, -12, 86, 113, 332, -37, -102, -95, 39, -83, -140, -163, -94, 222, 218, -39, -106, 115, -2, -95, 57, 3, -102, -43, 15, 194, 62, -122, 84, 10, -1, -200, -76, 6, 118, -306, -89, -337, -60, 104, -313, -89, 1, -29, -183, 237, -4, 23, -10, 23, 21, -13, 74, -11, -201, 85, 239, 72, -28, 47, -34, 2, -85, 36, -179, -128, -45, -246, -381, -195, -8, -40, 41, -132, -99, 75, -82, 161, -142, -34, -91, -139, 1, -15, -2, -81, 155, -14, 14, -151, -141, 48, -49, 28, 46, -276, 25, 54, 132, 69, 7, -6, -258, 100, 165, -172, 33, 284, -49, -188, 53, -59, 65, -156, 18, 155, -111]
3711a11oJ06O0O2l3j98k6K70j64l06J36L59k78J55J44N6J1j57j84m4O9Q1k65K40
3735b3K6lj2R9j73J07j57n5M13k26lj02L73l43p7j8J77q9Q1R9P5l62J01L8m5K42
3761A43l48K38J01j72n3m28O09j32j14L56k76LP0k64R0K41Qk64K54j37K67j20
3783G2k14J39k15P4J15J93k8q1O9k6j20k7l83N68J77j45j08j37K3k5L01j29j60
3806f7L75k65P3j72K07j78N7K82l11m4P5J42j98m3J56j52K03j42O0J47l69j0N4
3829a20M0P9k92M48k70J50R6k23K1J48m48M39j4r9N2j0P2J13k19l08M75j2j59
3852d1r4L14p6m50L59O7j76M4J2k73J31J99L3o2rJ51k85K35k8k31K01JM9P5j37
3877Il9n9J68P5m6j40J69k5k34L22k24J75k46L82m23K63j90j14j17L61K1j04k9
$$ y = [-111, -117, -11, 49, 111, 78, -120, -146, 124, -40, -346, -210, 149, -129, 26, 170, 226, 237, 80, -104, -148, -79, 2, -263, -23, 3, 0, -12, 87, -86, 21, -136, -191, 222, -4, -7, -109, 264, -79, -156, -174, 3, -86, -5, 94, 169, -193, -92, -54, -99, 143, -205, 33, 134, -38, -91, -519, 90, -42, -156, 200, -76, -73, -3, -267, -177, 64, 72, -192, 62, -75, 192, 72, -142, -3, -218, -144, -29, 164, 136, 55, 124, 98, -22, -49, -432, 136, 313, 168, 60, -77, -54, -79, 222, 93, -67, 308, 43, 116, -56, 151, -27, 30, 312, 1, -43, 32, 174, -24, -67, 89, -63, 140, -2, 58, 205, -164, -174, -120, -80, -1, -293, 155, -115, 35, 131, -92, -71, 77, -371, 68, 54, -45, 7, -3, 69, 182, -37, -345, 130, 118, -41, -135, 179, 103, -347, 12, 79, -97, -53, -41, -314, -183, 16, 49, -13, -22, 129, -156, 79, 51, -180, 21, 22, 71, 146, 9, -30, -89, 79, 154, 108, -32, 137, 112, -122, 200, -24, 151, -95, 287, -136, 127, -63, -177, -294, 67, 88, -16, -45]
3900d5q6L0k5L26o7k14p8N9m2J8K16O5j93Q2k63K02J17K6k29K72k38O6K51k39
3924A1M1l30J56K00L83k45k13O7k33r0M4J31k59K61j58L97j93k55L52J12k38J11
3946E2J92j98j33J70k55K19j35N7l1J57L5o5q2j9Q6j82OL22j62p0J59j35m1n2
3970a05N5k9P1J22j50j5L66j95j15j07L68l70J71j03R0J55k17k95L28l64L75K08
3992B44l73L99m6k74J16q3k46K15N0K2m1j22J54J60j92n2k94N02J39%m38j2J31
4015d1L9K12MR3k09j85jJ78m2q5J94K21k91j25K52k66n8J50j54J88p2j19r2K62
4039E3j44K64j46n2k55L54o0J24m4j05k00QK01R9J72k68N6k17J80N8K06l41p8
4062a35J54j7R1K8j52k27K86L8M6J94l98P3Q3l80L28K32l08L7R3J21l28M06L5
$$ y = [-45, -131, -101, -126, 200, 133, -81, -159, -100, -142, -124, 92, 157, -36, 46, -217, -15, 102, 128, -101, 171, -67, -1, 250, 11, 52, -278, -122, 78, 461, 216, 3, 70, -163, -253, -209, -78, -337, -76, -234, 163, -30, -285, 67, 179, -59, 52, 244, 46, -87, 83, -172, 47, -88, -31, -62, 95, 130, 65, -17, -36, 50, -132, -126, 196, 34, -36, 123, -12, -53, -105, -50, -79, -8, 114, -36, -51, 315, 120, 5, -102, 266, -104, 67, -36, 54, 209, -8, -303, 25, -339, 36, 244, -129, 270, 224, -50, 66, -17, -263, -48, 2, 24, -17, -139, 15, 175, -17, -69, -363, 139, 278, 278, -160, -172, -41, -2, 210, 214, 307, 98, -87, -88, 90, 48, -37, 157, 378, 87, -38, 214, -52, -110, 40, -114, 74, 2, -117, -209, 53, -91, 173, 27, -25, -280, 74, 14, 138, 94, -11, -211, -203, -2, 97, 269, 1, 57, -160, 20, 78, 284, -57, -135, 19, 2, 93, 121, -31, -258, 28, 66, 112, 306, -92, -19, 64, -316, 12, 244, -64, -27, 66, 187, -141, 265, 300]
4085C00m86L16k28K2L27k04J77m33L63J86j98L33l9n13M4J20j47k08J62K05q5
4106A4R2q1j41P0m6k3oJ51j10ql3l3K21l90K67J46o7q7k28M03J02L9qj13m94L53
4132a0J36j41K11n17K88K65k85J56J28k89k46K89k30J52K26j09O9k02J87k42L83
4153B19j33l3o1n0L16l12m4J01Rk37M42j70m3kJ84j89k38K86L1m8L34m91J1J89
4177G1r9n7L35o3k41j88J06N4J03j25o0K38n2K0J28j62o2m1J14j4P7k8l80L54
4201B8o5Q2j08K28q2Jj42J03L75P3l73l0ok21L83j13j61J89m06K67p5L15o2l1
4225A69k36q3M8n9J41j30K55m4q8N7K1k13l2K57k00J65r1PO2PQ5k91K18j11L31
4250B45r8j09p3R7R7n6J25m27K40r5k20K39L0J04k4O1k96j4J07L7j14K21M7Jj81
$$ y = [300, -186, 130, -98, -76, 251, 47, 224, -209, 154, 340, 142, 475, 436, -77, -33, 87, -60, -268, -106, 99, 14, 106, 25, -116, -46, -92, -115, -121, 30, -80, -88, -121, -154, 67, -323, -56, 90, 23, -64, -292, 111, 213, 252, 244, 131, -363, -10, 126, -15, 196, -321, -33, 232, -53, 103, 231, -58, -304, -15, -245, -93, 133, 24, 93, -109, 78, -164, 219, 86, 53, -8, -58, 258, -54, -98, 3, 12, -225, 217, 47, 4, 2, 186, -3, -241, 45, 76, 28, 362, -129, -118, 71, -28, -85, 250, 187, -54, -242, -136, -82, 21, -104, -164, 74, 22, 42, 170, 8, -54, -95, 19, 5, 82, 54, -326, 28, -37, 45, -63, 165, 83, 84, -58, 45, 420, 493, 120, 90, 84, -137, 246, 133, -28, 161, -245, 22, -53, 262, 200, 169, -67, -150, -102, -161, -20, -150, 105, 61, -27, 30, 51, -162, -194, 63, -137, 28, -63, -56, 6, 13, 98, -193, 25, -86, 245, 147, 38, -35, 62, 159, 103, 228, -199, 41, -54, -274, -35, -5, 99, 75, 136, -160, -174, -67, -30, -144, 77, 124, 125, -56]
4275e6j15K85J2k16j90N36k87k4J15R1j59j2J57k76K01k89j9J67K99j88r2L52
4297B92m90J34j19M0J10k78K09Q9PJ63k49k53M21J47j76j23K11k20K05PJ27j78
4319G6J62k91P3oj11K8J3J4J44m5j08J27k39J84n3L58k58K68k87Q7n5o6n0J54
4343A19j55L9P2O3Pj64P0n4J95J01j95L5j99o8L10j93J05Q1k66M8K93k05k66K53
4367B6o1m4K27k61l13J29K25j17L29lj25j75M54k89j66L5J52p6K7J41j43%P3l0
4391A5K8j02J33k24K87M3j9k52K24l24ML36n03K52O2R1k89K40R2j70n1R6j47J58
4415b0J09k98%J75J77k41O6j6pQP5l20K25J87p5j90L47J0m81J19Q2J31N5r5J17
4440A40n3j00J54j50L5Q3m9j70Q6N0q0R3M8L2n0j84J27l36R7L00j00l2O7r3l4
$$ y = [-56, -171, 114, 126, -90, -280, 256, -31, -55, 60, 151, -8, -20, 137, -139, 62, -227, -246, -79, 220, 32, -60, 292, -198, -64, -183, -143, -33, -311, -102, -13, -6, 157, -92, -345, 76, 223, 47, -76, 135, -85, 120, 127, 254, 76, 238, -53, 20, 14, -97, -69, -56, -42, 102, 57, -51, 76, -163, 21, -32, 326, 68, 336, 49, 136, 81, 15, -35, 119, -36, 3, 75, 138, 145, -19, 51, -3, 192, 293, 98, 133, -66, -134, 176, -17, 88, 169, -97, -49, 244, 39, -227, 26, -35, -79, 148, -113, -426, -297, -72, -189, 140, 137, 12, -163, 291, 2, -164, -129, 23, -53, -26, 115, -28, -28, 45, 15, 43, -59, 74, -150, 137, 180, 161, -91, 133, -191, -187, 149, -354, -102, -40, 51, -238, 2, 94, -76, -127, -31, -178, -20, 89, -209, -209, -34, 143, -98, -32, -48, -55, -47, 28, -292, -67, 120, 45, -145, 202, 212, -269, -150, -68, 63, 118, 23, 140, 87, -13, 141, -9, 26, 109, 60, -110, -24, 26, -54, 39, 87, 119, 69, -115, 12, -324, -227, 73, -27, -59, 8, -85, -119]
4465a19JL32m00M05m20Q3P3k56J43K42k28M6Q6J09k44m4K47o7j06J32j04K63o7
4488A07j67O6p2k14L38K18l91P4J9j51K21k1Q7k05J11j08M5K04k21L41l03L15
4510B93l25j28J79j34J97j44J57M7k60L09k82K17l35L05j25J2J36J59n49J4R9
4531a58J00p1R6k76L08k81L88M8j24l19J89J15O3j78j45J58J04n9J7q9P2R0l6
4554A2m0Q2jk21l8K70m2j27J47r6J82j07m4j77K40R3j18j91L89m07K48M8k26K7
4578i7n6L7J05J40m96N59j67J64Ok16k58K60r0K03J19k34J90j81lkJ02l5M2k44
4602a52L02l69K37o8J91m2Kq7J03k11o9L35j4r1l66L52p9J28R0m32K16j23j39
4625b86J79J36P6k21l2j33O6K83J22l38L82j49j08J69k61J92j9j49O3J2j06L31
$$ y = [-119, -118, 214, -186, 219, -201, -118, -45, -301, -158, 84, -144, -98, -12, 97, -147, -191, 56, -11, -117, 15, -89, 174, 107, -60, 6, -66, -280, 58, 276, -115, -41, -22, -173, 48, 27, 114, -91, 20, -88, -43, 161, -60, 281, -22, 293, -32, -160, 19, -115, 82, -62, 95, 142, -118, 191, -91, 126, -209, 96, -29, -17, 119, 278, -271, -257, -158, -58, -129, -33, -309, -1, -282, 106, 154, 30, -289, -100, 15, 78, -100, -245, -87, 17, -42, -25, -114, -42, 48, 12, -28, 54, 53, -168, -206, 64, 22, -105, 42, -54, 128, 21, -23, -200, 40, 133, 15, -176, 213, -194, 54, 102, -124, -97, -153, -116, -11, 129, -367, 192, 25, 189, 195, -21, -279, -19, -109, 94, 213, -21, 169, -12, -15, -17, 85, 50, 92, -152, 150, -219, 18, -50, 141, 99, 101, 14, 117, -94, -163, 172, 158, 67, -299, 53, -26, 102, 192, -240, -24, -147, -286, -107, 29, 105, -116, -148, -281, -215, 68, 190, -148, 234, 85, -23, 146, -115, 77, 58, -91, -28, -16, -122, 209]
4647B09Kl25L03j63P4O7k0l00K02K2p5j33J16n9K35r1j17K70k90j33Q6K9L90m76
4671a77O6O1j6nJ96k34L8K7J90J5m22%M04j86O1J43Rl97L47l32L55j80K14m04
4695b27L61n3k64J91j18K7k53L98J28k87J97o7J35J35j04m15J25J98k0j54R1k66
4717b42K68m8N3m4j02J58j26P5R2l8k39R0J6n8K45J2j27k56M51l06J85k03j44
4740b88J77K78m55J92J27Q4k00p6J45o7J15r9M4o0j2j6J66q4L35k96Q6j31O0k91
4764b66J94J56K0J12l57N3J58j47o5j80K10J93k28R3J41Q9k31J72Rj57RJ76o2
4787I2K16j32q2l37Q7M7L46j05r7k4k70N10k41j9l3L3k62L61R1PK3j99J44N1k78
4812g1L44n26K89o3j11L02p9j26jL19j57J63p8k22L2n0J54P9m32J08qRJ66j07
$$ y = [209, 211, -114, 189, 26, 100, 167, 147, -153, 49, 71, -4, -137, -21, -80, 155, 64, -53, 217, -73, -206, -120, -91, 299, -177, -111, -50, -66, -71, 125, -109, -71, -44, 146, 161, -261, -261, 143, -43, 18, 161, 170, -227, 120, -212, 143, -37, 177, -227, 134, 81, -183, 8, -110, -83, -336, 62, 190, -97, 100, 33, 168, 303, 199, -216, -91, 107, 87, -67, 24, -242, 26, -22, 31, -13, -115, 43, -83, -8, 84, 46, -193, -103, -87, -145, 100, 112, -15, -271, 180, -126, 59, -144, -288, -111, 167, -288, -96, 31, 115, -85, -161, -16, -83, 32, -67, -23, -83, -95, -111, 55, -29, 306, 10, 96, -35, 25, -266, -72, 84, 104, 216, -141, -88, 70, -77, -142, -322, -112, 81, -147, -54, 87, 176, -55, 117, 126, -31, -22, 154, 92, 308, 176, 94, -243, -156, -109, 237, 132, 35, 11, -259, 251, 10, -9, -42, -9, -271, 90, 181, 188, 211, 12, 156, 207, -71, 273, -253, 36, -27, -138, 164, 85, -41, -42, 277, 120, 283, 205, -17, 15, -35, 119, 198, -234, -126, -134, -125, 41, -66]
4836f6o5Q7L0J77r9k70L50o2L3p1j47J33J12n91M46K13l44J53j74J71J19K61n62
4859a66J49N60o13j81L26m6r0k64J11L78k95K05N8k9r5o9J59k11K5m4J0J30r6
4882h8K11j02R4ol2M7k00M8j87J69K70k77J08j97K44N3p5J02j51J9K47l13l8q2
4906a36P1mk50K07P0K7j20M99l70j89J52O7J03J58l19k3M3j33K07r2P4j28qJ71
4930G7k12K51p4K59j70k6J23k72N2l8j7P6j49k8M4J53N6p8P2K05l75K15j63p1
4954i0L3J2K11m4j48J55j41Kj33K63k98o4M94m41K15k07K77q8%Q4m08K68K05l14
4978a57L25l9l85K44o5J21l6N3j03J61J08j47k00J28j33l9R1J3P6Lj03KJ91J08
5002B17r4j54L76P6l91j39Q8oL14l12mj53L5L03q8K18j06r7L89m78R3O8j65j88
$$ y = [-66, -131, -44, -14, 163, 64, -206, 144, 82, 115, 44, -103, 30, 142, -449, -3, 210, -134, 19, -155, 16, 135, 396, -166, -17, 543, -70, -251, 75, 29, -61, -325, -214, 164, -131, 74, 132, 103, 8, -61, 98, -113, -88, -132, -122, 8, -88, 123, 21, 115, 109, 77, 124, -76, -28, -215, -46, 224, -53, 55, -142, 102, 155, 80, 182, 31, 50, 297, -16, -54, -136, -65, -69, -319, -112, -42, -15, -135, 364, -6, -195, -43, 24, 127, 285, -34, -57, -14, -147, 60, -32, 42, -86, -94, 77, -135, 116, 42, 301, 131, 105, 228, -44, 8, -30, -47, 29, -120, -148, -104, 49, 105, 27, 99, 304, -71, 144, -19, -90, -57, -45, 166, 122, -26, 129, -12, -10, -143, 120, -178, -242, 252, -189, 26, -181, 96, 8, 8, 92, -316, -48, 157, -157, 168, 129, -256, -12, -77, 44, 8, 61, -42, 119, 227, 80, -120, 8, -125, -164, -73, -60, 16, 19, -84, -82, 109, 217, 123, -31, 345, 421, 30, -109, -21, -27, 287, -25, -29, -182, -147, 156, 68, 286, 180, 83, 472, -6, 87, 155, -10, -198]
5026a98J73j06K05j57K77l10J82j2j2M5j88O5K52k13m5K4K7m5j6J35l3l48J86
5049a12J01K99m02L40k85l5N5K05ql82J51J4L9N6K15k01l31K76O5P5j86k1p4j19
5073b65M28R5k76J83o4j95R0K70k11q8J73K8m29J66M4J7Pq2n0K03R9l91L19J42
5097B13j23mo5p4K35k05Jo9J62l0J01j63p8J25n9J46j29L09l14l23K47L05j49
5120E9j78J65N5j47Q9J0r1P8o5J07K5n9J04j64j31L2j11K65PKK93m34j2J71N1
5145A21l66K74Qk13n4M02P1n3o8M3m36J52J91o4j90L4K39k52K5M83m30k93K74
5168a02l8N9j3M09M2m97J42O0j47J92p2j46J09Nq0k7j88L91j03j74M17l20J15
5191C4j51J43j09N24n16J99l07J43N0L9j80J89N8j35j08J3P1k3NQ6J2pN4P2j29
$$ y = [-198, -25, -131, 74, -83, 194, -116, 66, 54, 42, 87, -101, -36, 216, 3, -42, -18, 9, -36, -52, 83, 50, -298, -112, -11, 288, -114, 226, -59, -94, -39, 166, 158, -224, -73, -59, -20, 36, 251, 50, -281, -5, 60, 135, -51, -72, -146, -265, 163, 258, -18, 165, 101, -94, -4, 266, 55, -33, 140, 168, -261, -95, -51, -34, -27, -109, -159, 44, 143, -248, 71, 213, 90, 86, 21, -53, 182, -23, -22, -91, 71, 41, 142, -21, -99, 26, -33, 113, -16, 293, -21, -344, -97, 208, 59, -119, 46, 101, -46, 43, 53, -38, 40, -25, 82, 107, 48, 152, -12, -143, -111, -222, 43, 50, 52, 345, -89, -101, 70, 121, -245, 29, 37, -176, -230, 172, 243, 190, 122, 165, -271, -119, 72, 8, -182, -148, 91, -161, -136, 347, -83, -376, -102, -140, -81, -94, 315, 357, -140, 2, 62, -85, 107, 35, -111, -2, 3, -77, -104, -292, 99, -4, -178, 239, -81, 34, -117, 26, -83, 441, -75, 124, -183, -40, 10, 49, -131, 58, 116, -19, -127, -114, -43, -66, -61, 25, 37, 30, 84, 156, 27]
5216B7k30OJ70n0k2K42K1j63q4L27k30J28k62K12L7j16L88l99m6O4L44k79J67
5239B52j08j30j86J18K01l36L78m79J29M36j17r8n74L87J83J65j43j62Q5j36L01
5260A66l65K72j36j59J19q2Q1p9L08j9L6j77k1M7j11R3j53R3o0J30m9J62j66K6
5284d4L82l40j41o5N80k85L1j2j39o3J40j6m71L67K52k24L6J23p4j11K48n0K5
5307A49J07j29j48J38Q0r0o2q5O7L42n01L81m05J91p8J19o6j5j98M10j02j09k31
5330b35K2K17PJ3r8J11K3j13K6k66L45J19J7k45J47k18J91n6j0k61L34k39r8J8
5354b49K61O6l86J42J87j92L53l46J57p5j65N99o63J39q7K52K49m7k17QK15j87
5376A4l4k12K60K53l55K48l0k22K07q7mJ23p3K04k07j95Q3K20M0m41L18j11R1
$$ y = [27, -203, -197, -27, -77, -99, 143, 164, 1, -83, 244, 14, 142, -120, 92, 129, 13, 401, 2, -44, 20, 364, 85, 252, 144, 14, -172, -54, 147, -189, 189, -290, -161, 275, 158, 60, -514, -127, 56, 221, 78, -84, 1, -135, 166, -199, 73, -63, -222, -103, -185, -104, -183, 125, 106, 142, -35, -56, -9, -120, -27, -180, -87, -147, -17, -66, 96, -70, -44, 338, -2, -143, -208, 372, 87, 118, 106, -33, -96, 44, 28, -443, -76, 176, -48, -12, 111, 37, -74, 174, 124, 149, 256, 127, -21, 117, 197, 107, 45, -40, 27, 369, -132, 249, -156, 35, -43, 76, 10, -5, -203, 207, 105, -4, -235, -213, 4, 11, 24, -74, 37, 60, -53, -27, -293, 52, 171, 188, -57, 90, -128, 63, 7, -3, -264, 70, -169, -267, -249, 12, 78, -308, -166, 21, -171, 182, -164, -7, -82, -247, 352, -311, -172, -259, -7, 242, 195, -22, -14, 201, 14, -20, -232, 28, 281, -74, 174, 144, -78, 129, 42, 38, 161, 88, 292, 85, -110, -27, 193, 233, -208, 110, -1, 90]
5399I0J56l76J35k2l29m9L36O0j43J01N5j17K67l12K24L3p3J32k34R3j35M69k96
5422F5L8q8k6o2o4J15p7J58M7k14J43j06J63m6j06L9K21p4J61l27L4O9J98q4j74
5447CJ5r8J35L5L9k67K44k09K47l01j5K2j6J87p5jr3R6J04j35J88j62LJ60kl10
5473b06L27j0M4j85J79j52j68Q9J31k75Q0N13l09j24k25O87k24k87j9K59k03K19
5495A41l8o5o6k39K2J01L41m8j19J73r0J10k90L69k18k85J45L9k01K69p8O9q2
5518d0L89m57m8J38O4j02K35j78k40K41J64j50r4R0k41J64P1J25k95j40K52k5
5540g7Q0qk4N7%k9k97L23j39oj98M72k01r1J82o8k5k6Q6k2l31K07N7j59J29Q2
5566b6k33k1N01L9j01n55N70l35M42k81j74J80j8j32p0K39l9J93J7p6k53J33N4
$$ y = [90, 246, -130, 5, -17, -346, -395, -59, 1, -142, -41, 14, -103, 164, -148, 76, 109, 36, 168, -66, 27, -108, 361, 65, 103, 15, -11, -73, -137, -22, -99, 59, 106, -108, 35, -71, 92, 46, -60, -21, 200, 126, 287, -40, -6, 63, 261, 177, 3, 18, -80, 55, 90, 129, -138, 106, -103, 144, -157, -172, -150, -166, 21, -54, -55, -148, -52, 52, -83, 105, -57, -54, 106, 104, -206, 121, 111, 155, -30, 149, -3, -171, -82, 49, -226, -146, 367, 58, -66, -291, 396, 172, -115, -134, 125, -78, 141, 103, 38, -28, -267, -245, -144, 197, 149, 30, 203, 113, 223, -67, 302, 84, -201, -56, -17, -218, 51, -27, 42, -40, 349, -108, -156, -18, 46, -56, 179, 1, -239, 2, 166, 16, -78, 12, -229, -65, 6, 131, -164, -304, -52, -77, 3, -5, -29, 28, 28, -1, -298, 25, -114, -120, -318, 154, -47, -138, 44, -24, -49, -75, 11, -11, -342, -135, -78, -237, -108, -26, -259, -280, 221, 260, 159, -396, 174, -161, 281, 0, -174, 6, -12, -144, -214, 25, -14, 179, 196, 120, -133, 0, 54]
5589E4O9j27j62L34P5k91J37k37K2N9j89K68J85k85nJ85P4j73K28o4r7n1J7o3
5613c7k5J95j28L6N6K24K9p16M50Q3j43PJ87q5o8O6J10l82K41j20K69j34k50J92
5637E7o4j23J7J38j56L07k05j7K49j47j07L1j19J47R3k07K46l14j83O09k78r3
5659a19L5J25j73K34j19r4o7j08P4J36O3M6J6j84lM24k79j5l2k81L82q5j19K13
5683G0p5L1k85M37l34L01k30K86j32j47J37j13K01j29J0N8J56J06l26p7PO4k32
5706b16L26J1O3k67K48j65j2O8L9j19Pk9QJ30l78J43p5J01j6M9K41k66J66l2j02
5731g7K61j48j61J73J0k90K58J31J34l18Jj43J55R9N0j80K7j20J76j45K63k63
5753a07K76n33M40j75N45l70O9j23j72K16j48J30K30l17n6K4j75J48J97k06K3
$$ y = [54, 123, -4, -166, 168, 243, -48, 89, -148, -126, -67, -256, 12, 197, -88, -93, 92, 166, -7, 221, 157, 60, 9, 26, -37, -62, 133, 5, 41, 97, 321, 350, -366, 84, 167, 24, 31, 218, 133, 65, 131, 241, -141, 100, -20, 249, 115, -135, 57, -7, -130, -113, 25, -131, 176, -29, -46, 203, 56, -51, -20, -139, 8, 101, -106, 140, -174, -357, 252, -26, -119, -84, 41, -132, 102, -17, -111, -178, -286, -212, -76, -13, 33, 49, -135, -138, 286, 7, -8, -40, -321, 61, -24, -143, 70, -5, 26, -259, 178, -156, 145, -85, 201, 69, -78, 59, -54, 147, 18, 28, 86, 242, 348, 22, -55, -48, 16, -216, 110, 121, 184, -83, 165, 0, -12, 56, 95, -24, -17, -46, -38, 92, -286, -143, -218, -117, -133, -84, 157, -109, 57, 25, -77, 184, 36, -125, 48, 58, -232, 26, 157, 291, -27, -26, -169, -14, 85, 135, -45, -18, -138, 38, -107, 156, -107, 169, -364, 76, -99, 446, 76, 145, 22, -150, 66, -82, 48, 278, -39, -95, -71, -246, -98, 99, -107, -84]
5774h4N7J4j22l7j1j87L20L88j15k55J83k04L18l43Q6J43J03n0j21kl70J89J75
5797G5Mn1k48J12L08j43j36R8R7Rp1J10m0k15j22Q6J50j46M33k57n1M3J96q3l4
5822A24j2l06Q9J16L42k85J32j25K68l58j42R5J92n9r5j3j14L94j02j54M6Q6k48
5845a29L38m75J66J70K42l47J17r5j7Q7k39K54l18M24J41k38J76p5j05o3r9q4
5867a69J62K66m67K18m0R0L2l95K39j72L63l4l70L1j7J57M41k91J16m25L84L3
5889A52k10j03K26j45J18j09k04Q8l0L75p7j08o9J74L28l96j52J02J02j96R0n1
5911i5K66k51J48O8j45K24l37r8K58L35n16M4J01o3q3M44l35K09j35l22M12k42
5933a13l6L62j97o1L09l15Mq0j7L1J46mk72K22K42l24L73m75K54j91K95k19M0
$$ y = [-84, -27, -13, -135, -172, -183, -370, -50, 338, 223, -32, 151, -53, 265, -78, 8, 151, 254, 204, 83, 81, -289, -100, 75, 79, 28, -220, -108, 200, 57, -79, 19, 116, 125, 54, 164, 124, -91, -213, -127, 23, -123, 310, 53, 2, 45, 241, 158, 124, 112, -194, -105, 11, 353, 68, 200, 75, 343, -15, -157, -62, 130, 71, -24, -37, -151, 243, 141, -13, 33, 119, -129, 209, -266, -100, 70, 312, -35, 82, -13, -30, 57, -182, 72, -246, 178, 319, 81, 257, 182, 77, 14, -85, -169, -7, 259, -208, 10, -30, 60, 92, -303, -64, -236, 127, 93, -277, -246, -263, -106, 335, 44, 160, -265, 119, 152, -58, -161, 65, -80, 38, -71, -275, -187, -217, 158, 81, -27, -96, 78, 406, 10, -142, -40, 62, -134, -44, -95, 171, -80, 68, 136, -9, 215, -122, -220, 38, 373, -143, -99, 2, -61, -144, 300, -35, 174, 39, -283, 129, -113, -149, 213, 16, -45, 264, -51, -47, -127, -144, -113, 33, 29, -243, -21, 221, -103, 270, -205, 49, -142, 153, -66, -26]
5956b6J7q6J12m0J63k27n7j33Q6K06l3p9J09q3j10L75m6j32O6k65K59m50O37l19
5980e6K73l32J89R7l01J38k70L70M2M4l36J27j53K62Qj32J10%m3j59J60k20J65
6003a7j93M15k10R5j64J2j82K32n1P9p7J62k97j48N68l16P1r4j35J16Mp5J90L6
6027B1o4R0N3j5p7k14R6J28q7J21j67K53p7j82K80j03j93N1Jq4L46J3k69p8j13
6052b70J62K54l72M57l72J26p4K25k41K67q3mk2j38J96Jr9M3j17J88L36m81n2
6075g0K19j86J31P3j64p1j67m3L73j92M28j78m4k29J47J4j31q4J83j18J05J49
6097A45k98m8K62j25J29J71l26J77K12j67j55M2J20m26K94J5J4l4q4K01O2k73
6119i2L49m46O0O2q4K94J4l35M6J86L44k93o8k65J40J75p6nj79K31M3k16P5k2
$$ y = [-26, -9, -95, 17, -23, 140, -87, -144, -277, -191, 15, -18, -97, 12, -71, -181, 194, 148, 16, 82, -183, 76, -374, 263, -56, 217, -115, 74, 171, -130, 8, -262, 108, 150, 194, -142, -15, -168, 94, 102, -30, 80, 80, 37, -122, 38, -182, -17, -210, 205, -5, 90, -74, -62, -244, -12, -63, 16, -61, 101, -196, -344, 224, -92, -21, -115, -250, -134, -130, -205, -15, 21, -43, 47, 100, 85, 8, -206, -110, 18, -69, 52, -115, 138, 61, -121, 159, 56, -137, -86, -85, -169, 177, 190, -79, -157, -270, -108, 146, -226, 231, -141, -15, -89, 136, -105, 162, 79, 75, 53, -85, 111, 112, 13, 56, -61, 127, 463, -18, -70, 149, -37, 94, 167, 3, -68, -235, -278, 95, -97, 331, 153, 109, -120, 27, 41, -90, -174, 9, -109, -4, 145, -153, -201, 61, -64, 65, 236, -90, 87, 299, 132, -23, 19, 139, -287, 7, 22, 36, 2, -82, 119, 181, -92, 257, -189, -129, -67, -151, 143, 157, -178, -132, 54, 398, 105, 37, -228, -88, 87, 11, 6, -173, 58, 101, -115, -40, -62]
6143f2J85Q9p7n7j29K46m84L22K65l34j04L9r5M32k91K0pL24l4N6j30j91L28n11
6167b00J54K3k6j42R0L73k73l20N42j68j66k4K17l4J27j73j80J00K30j78N1k16
6189a93O3R6Q1j08J77k31J52j11J94m33N31P4k58l6j17J89j3j35M70l50k36K54
6211F0o4r7J00p8K20j94R1o1j32K21j84k06N07j16k15jL26J7k29kO3J30n44N28
6235A40k92J81j4j4k14J86J18J5K46k39r6J03P2m2m15Q3L20p7O8k85J48r2L2K32
6259A64j53J4J72Nk02j02J53j01J70j7j29Pl2OJ65j23R0j72L5L8k5k8J41j86j
6284a11J26K0p7K36n8o9j9j4JJ72m15J32j14L07j9r7J41m21L70l2k02P4J90M5
6308A66j59j8J12L5j82K3o5JN17l10Q7k04k5K32k85LK30m7N2k79J25j66K62k20
$$ y = [-62, 123, 212, 135, 78, -51, 195, -289, 33, 298, -36, -140, -101, -196, 236, -55, -35, -42, 282, 248, 304, 174, -17, 311, -200, -46, -23, -49, -191, -101, 272, -1, -321, 221, 53, -113, -137, 80, 46, 173, 0, -180, -80, 150, -28, 23, -193, -130, -34, 47, -61, 116, -115, 37, -74, 120, -313, 218, 292, 34, -2, -119, 70, 57, -78, 392, 42, -194, 60, -4, -101, -1, -79, 141, -53, 38, -23, -155, 66, -118, -324, 183, 67, -148, -149, 177, 194, -35, -37, 26, 156, -388, 140, -152, 29, 15, 1, -213, -27, 91, 106, 352, 113, 17, 120, 192, 150, -265, -182, 138, 61, 129, -156, -8, -100, -68, 164, 11, 25, 197, 202, 0, -102, 51, -50, 120, 103, -26, -19, -51, -45, 120, -3, 87, -85, -50, -12, -37, -65, 76, -110, -111, 15, 35, -42, 194, 136, 67, 48, 34, 35, 207, -208, -76, -190, 117, 98, 1, 142, -279, 91, 59, -143, -69, 121, 166, 7, -11, 101, 136, -46, -23, -88, -87, 430, 120, 207, 3, -22, 210, -75, -72, 158, 111, 163, -116, 9, -157, 105, -115]
6332a15m6K72p2k75J09J92k94J69J40j08L70m43L04k84QJ28n1k06p9M83j10Q6
6354A78k09k19L50J7j40l8R0M8M7j99j49L58l62Q0J62jO0k7N9l34N10k11r3N84
6378E61o11j09L0K8j47J91j6K7K00o3M9k43Q4k7q2L13k64Q2k76J35j16J29K21
6401I6j12J2j93L21j15J14jn3J03k78O7J17k9R0j95k03N33l29j45Q2lM08k14l23
6425b50K1K65j02K88l13j50K66j03R3R0k12l8K39k87M09k66J57m4p7K80O1l30
6447ckN9m20L83Rm2j14J81K41m72M73k28k0o4j11K09j39K00k32L20l11j1k4KL02
6472A86j18O5k49J31QO6j30k23K26J2q0m0J70K8k41M11mk09J38j13N0l7j02j9
6496g4L1J18k9o7J51M4k06OJ33K38j87j43j07J40k08J13j79J09j05M63k86j56
$$ y = [-115, -161, 111, 39, -236, -127, 65, -229, -60, 80, -28, 342, -101, 203, -81, -73, 55, 4, -202, -281, 202, 92, 178, -31, -250, 100, 117, -23, -61, 29, 77, 124, -75, -224, 134, -228, -148, 14, 13, 73, 46, 105, -229, 281, 70, -23, 561, -50, -159, -129, -101, -248, -57, -73, -46, 154, 91, 140, -103, -19, -46, -128, 185, -79, 3, -273, -138, -254, -125, 96, -16, -4, -197, 124, 9, 123, 122, 69, 172, -106, -39, 78, 49, 139, -56, -259, 274, -55, -200, -118, -121, 287, 73, -250, -229, 36, -66, 222, -91, -241, 25, -78, 15, 105, -107, -145, 94, -193, 216, -50, 107, 63, -14, 266, 327, -3, -5, 54, -366, 17, 26, -16, -130, 51, 292, -180, 293, 65, 45, -19, -130, 79, -60, 140, -92, 228, -83, -94, -118, -116, 186, 68, 133, -116, 15, 23, 89, -41, -264, -38, -26, -106, -146, 24, 52, -189, 222, 218, 9, 147, 34, 84, 47, -55, -74, -43, 75, 46, -21, 130, 174, -32, -26, 107, 345, 158, 15, -92, 48, -160, -47, -226, -117, -222, 241, -45, -201]
6518b01L77m09L57j61j66K30J91j21m13L38j05l8J00OJ89l22M22k50K80l01L8
6539D1P7J85l88r0K00l1k37L09j21O3k49K85j33R1L37m16J45Mk7J06rQ0l11L31
6563B42j97k3L9k22J22m5r1J78l2L76l3m97K30M5M0j55j70J08j85L88q0j40J27
6586B5Q1l5r6J02m7K31l83P5N7K15m76M01j28j68K11No9J7J37l36L76m6J15m78
6610b14K85k76L57k12j14J09K41j42l99J37K69j00o3K70n34L92J65l49K00j3l6
6631b7J71k36O1j42j69J67J75O3o6m2K00K52l77j35K32k64L86l02n9L34k88J80
6653A14j4p8n7k8M2j49J82J30k45J66lk31K56p1J60j69j99L23qQ2j97j31J26K27
6677B28o1j34J37j8j28j78J65J72j47K60m30j2J41J5J75j83J04q1j02r1K60J1
$$ y = [-201, 176, -233, 124, -37, -203, 27, 218, 97, -316, 22, -83, -121, -21, -15, 174, -148, 274, 24, 304, 3, 41, 118, 303, -85, -175, 25, -6, -243, 66, -55, 8, -241, 44, -89, 2, 339, -77, 68, 72, 45, 151, 142, 222, -89, 242, 45, 22, 61, -161, -39, -84, -175, 3, -29, 347, 314, -183, 47, 92, 132, -23, -193, -85, -270, 118, 38, -102, 25, 106, 71, -25, 77, 30, 261, -122, -47, 10, 225, -251, 150, 22, -146, 65, 70, 1, 18, 155, -181, 195, 149, 264, -214, 71, -205, 152, -60, -174, -65, 176, 34, -365, -228, 41, -59, -122, 148, -386, 6, 171, -178, 22, 9, -27, 144, -92, -31, -173, -342, -175, 0, 63, -3, -45, 155, 407, 30, -105, 127, -137, 249, -53, -112, 222, -66, 114, 100, 22, -35, -63, -21, -170, 12, 142, -103, 63, 60, -171, 85, 14, 174, 5, -194, 129, 121, 203, 6, -125, 1, 228, 167, 33, 170, 152, 24, -154, 11, 183, 36, 296, -134, -146, -5, 10, 185, 2, 106, 25, -77, -168, 92, 103]
6699A03l2k43K15M6r2J33M6k09j72K90k40K61q1m8K02k90j3M0J58k30J0j51J44
6722a53J25J27K3k7j18j76L23j67j14M55n07L09r2J51n3j19J59k22J1k22J20J79
6744A2k3R1j29Kq7rL00j71l5R3k41J98Rk9m5l58O44m6k15N6j74J4o2L30L2l6J29
6771B50m92K92p8K35n51N29j3k78j28J09J10n9J10k58J31R3M6L1r3q3L20l86K24
6794F1k00J67k05O21n17j21L95k69K22j44k09L42j45l3J73j64m4L8l15O17r0l06
6816a26r9J17J05k41M42o8n24L27m8jJ69m0J25j80Q3k37J53K29k48O4Q1q5j57
6839a59K25P4Jk81L07k25p1N12l37j86M10k57l1K07l56j82L51J54j51K8j8r0K79
6862B04k88K99j55P2j6o4K68K3j04o10L33j1JJ60k0j06K42l19N0J52J20k57k10
$$ y = [103, 71, -172, 43, 89, -3, 130, 176, -33, -205, 85, -155, 106, 25, -23, 179, -111, -124, -84, 74, -156, -146, -297, -153, -28, 99, 122, 95, -23, -199, 124, -43, -157, 298, -209, 100, 8, 159, 106, -13, 146, -76, -65, -287, -167, 12, -11, 80, -49, -47, -134, -143, 157, -14, -49, 44, -197, 1, 10, -19, -64, -422, 222, 176, -39, 17, -157, -143, -205, 125, 157, 121, 250, -242, 50, -28, 207, -344, 185, 172, -106, -234, -125, -15, -74, 36, -222, -91, 2, 48, 79, -14, -97, 223, -163, 61, -139, 28, -177, 444, -73, -194, 201, -68, 154, 10, -199, 143, -2, -35, 138, -26, -70, -32, -347, 270, 180, -126, -225, -108, -3, -244, 198, 130, -394, -67, -115, -116, 53, 13, 138, -42, 41, -196, -43, 186, -62, 2, 83, -2, -159, 66, 140, 141, -140, 167, -58, -129, 383, 46, -140, 270, 13, -18, 189, -167, -349, 2, 156, 5, 33, 15, -75, 204, -84, 215, 60, 132, 116, 52, 320, 343, 239, -371, -38, -49, -48, 112, 92, -14, 228, -91, -41, 111, 231, -26, -236]
6885b36p5J96j76M87J75l20O1K32n77J88K9J0j91K46m11L58j3rj75l09K95K29
6907A4M9j98K59q0K70k71p2k54K48k5p8l3J21m7L71j44q1j37j02K54k8o0k0k1
6931f5L40m33J45J7p3Q7k3J21l74K66J61j58Lk3q5K00J66j82J29k21K66N4l80
6954f2K08m45K17K76j02o1P1k84K34Q0k43N0n7j4J68n9J08J35j69j57K7K63J12
6977B96j87J16l29J36J08Ql03O9l0K7qO7j6N4o6J06J25l6j00m1K13k03J35K04
7001C45k83j93j20J87j45M15m84N4N92n25P8l37L52j68Q8KJ34R2J34j58Q8j51
7023cJ43k12O3m8k44K81o1m1j14P8L26k12j45J68L70k90k42K73J6q2l36L17j34
7046a29P4L57l29j08n0J11P1m6m2r8K19N7o7L5R0l4j36K15j24j51M3k71J87K35
$$ y = [-236, -311, -115, -291, 196, 371, 51, 112, 344, -233, -45, -16, -6, -197, 49, -362, -4, -17, -26, -201, -510, -215, 14, 63, -135, 124, 44, 314, 43, -29, -283, -35, -60, -138, -171, -50, -97, 274, 130, 49, -88, -190, 64, 36, -24, -44, -65, 275, -158, -13, 4, -69, 18, -5, 116, -258, 8, 169, 11, 14, -9, -94, 106, 272, 90, 219, -2, 264, 318, -62, 146, -299, -82, 194, 92, 31, 102, -182, 52, 132, -111, -61, -118, -132, 36, -23, 85, 220, 51, -106, -79, 184, 296, 109, 225, -104, 32, 140, 148, -155, -86, -116, -89, -97, -30, -46, 8, -58, 48, 173, 137, 37, -4, 209, 6, 141, 345, 62, -131, -251, -64, -209, 206, -278, -224, 368, -157, -79, -416, -64, -232, -144, -142, -8, 84, 218, 60, 148, -3, 140, -72, -9, -57, -301, -20, -81, -122, -236, -158, 168, -44, -189, -21, 349, 59, -183, 90, 106, 24, -312, 5, -129, -55, 302, -27, -135, -185, -74, -3, -49, -91, -189, 30, 87, 20, 55, 145, 111, -25, 190, 66, -85, -42, -313, -126, 109]
7070A09K0j92L01k18j41N0j27K55j00q7Pnk87K35L46j3k49J42j64K6L15O5l01
7093a3j58m2R3J70K26j18J3l8j0l16o5L31p7q8j12L35o3m42N63k23J65J9K03k23
7117A30q8l18K68J5j07J18l9J63o8j93K72l42K12LJ00p8j11K95l84J60L14m60
7139a38J15k19J76j54j9q6l4L83o0j20M90l22o3K9J50M62l80l48J63J58k72J01
7161A2L3K5J06j32j95K39k39O5J04l10J66K32Rn9L2j23O8J82o4j68MJ18j74k4
7185i3P8n1Om0k0j28L18j26L99m97J09PN9J16R3k02j80K27p8J72r1J23L0j82m56
7210d07N82j47j06L4K38r9l28J44O1j03j07L72N4n68O14o5k47M7j66M25m67M57
7232B18l77J73j93J39R5o8R6JN6j87J55J9j77K31j15k35K16k15N3J55j32k1qJ99
$$ y = [109, 129, -63, 238, 20, -121, -71, -198, 57, -43, -130, -123, -128, -415, -180, 166, 153, -96, 46, -118, -92, 223, 288, -13, -171, -213, -120, 50, 276, 158, 171, 133, 123, -193, -258, 73, -4, -92, -204, 131, 68, -374, 189, -34, 131, 150, 353, 130, 42, -276, -8, 7, -100, 18, -21, 142, 74, -119, 153, -189, 23, 26, 126, 48, -63, 232, -152, 8, 322, -138, -23, -242, -66, -220, -239, -325, -359, 24, -36, -156, 334, 12, -51, -22, 128, 590, 210, -138, 25, 183, -89, 12, 45, 70, 176, 44, -151, 88, -151, -86, 18, -292, -126, 106, 115, 56, 88, -35, 33, 215, 151, -17, -13, 105, -69, -93, -15, -66, -60, -100, -120, -248, 70, -56, 343, -154, -45, -38, 21, 137, 230, 28, -152, 75, -3, 169, 78, 201, 231, 49, -407, 175, 28, -78, -44, 194, 95, -233, -89, -28, -131, -238, 134, 188, -380, 234, 169, -78, -31, -197, 228, -239, 218, -159, 14, -179, -40, 55, -13, 83, 84, 140, -47, 108, 127, -50, 181, 66, -169, 47, -168, -115, 40, -92, -113, -121, 78]
7256G8q5K14k12l0O9n0J27l2J44l84L01J7m6N2j57j15P6J08k57NJ13J92M4l13
7280a41K72j55L6j82k71K55J80j66N5Q8J17K71m64K96l8k0k08j12O3K66p3j32
7302f3J12P9o4J67k18L92l90j87J23K3o1J91o7l6nK16J25k38j87K08p7j68j6J13
7326b8N2N7Ok58K64k8J05n8j33K49j67N2J01l17K50m29L20J40o2M7o8J96k41p6
7350b6K81k17M6R3k69q8J66n9j3m2O6P0L17n61L59J93n96K65j05k1K12j55j4j8
7374a16N16j56o1n5l8o4j86P3K31j91j33L87m50L72N1k08J6J78m75O93j08k27
7396D9M1j29j28K02k80O7L98j7o60K60M40l59L04r2l10J14k47J80L69j97k01M08
7418B12l02p5J91p9J16j34L10m1m38J97j62Q3N1J37n3j28L67l8k64q8LJ46j60
$$ y = [78, -7, 207, -5, -35, 34, -16, 111, 79, 223, -161, 140, 157, 111, 163, 6, -109, -33, 75, -182, -177, -64, 128, 172, -141, 131, -24, 12, -170, -441, -186, -6, -172, -117, -29, 88, 359, -105, 191, 153, 133, -75, -187, -124, 142, 69, -63, 49, 128, 64, 231, 13, 405, 15, -172, -49, -26, -87, 104, 37, 1, -4, 212, 337, 99, -88, 120, 43, -125, -141, -28, 24, 81, 87, -171, 93, 65, 170, 112, -21, 228, 61, 113, 214, -103, 147, -282, 38, 178, 116, 163, 95, 291, 50, -26, 255, 38, 84, 177, -92, -180, -14, -73, -86, -128, -62, 8, 325, -236, 123, 316, -280, -15, -120, -141, 71, -84, -98, -116, 400, 244, 183, 128, 90, 26, -160, -87, 144, -47, -180, 207, -243, 129, 180, -28, -12, 166, -309, 384, 276, 49, 90, -39, -167, 35, -245, -178, 220, 203, -457, -197, 243, -116, 188, 96, -214, -100, -347, -167, 202, 5, -196, 212, -90, -165, 26, -53, 63, -71, 239, 198, -240, -43, -205, -122, -71, 66, 13, -115, 252, 214, -50, -138, -135, 11, -149]
7441a49L78j70k49J27L2J6J9K5P2m20J09L77l51M22OM5l87j10J22q8J64Q5j28
7464e3q5oK60J11k97J56k3k24L43j97k51L71k50P7M6K14l16O0L11j13K37j93j46
7487C2L20K21o94K46P6j25pj15j28K01o3K39m58k7J44K23L5j7J72l47J33j99J62
7510B4k02K57Qj37K17k85K13j16K71m56O09m86j09J60J03J63l93J65K57k29J37
7531A71l35M3J05J14K9k26L12l11N9k1J93j22J35l27K3J95k5j33J98r5j94J64
7553d8J31j90L30m46N03j46k15L3P5j48J24L23k33j41R8K6j55J13j38K55J31j94
7575H8m0k69J89j89R3J63J3k08l3L86k71L10l79K3m7M4L36n8Q0P0k41L5k37N2
7599i0lP2L8k04L98j46j59J0J63k05J63k5l4K56l18j38J23K1K01j41P0k25K16
$$ y = [-149, 229, 59, -190, -63, -31, -15, 4, 29, 101, -319, -210, 167, -184, 238, 244, 289, -98, -208, -86, -174, -10, 75, -53, -138, -144, 116, 227, -70, 86, 63, -161, 182, -15, -266, 105, -145, -68, -22, 192, -124, -64, 247, 134, 371, 178, 32, 352, 573, -121, 125, 201, 76, 69, -46, -174, 27, -36, 203, -255, -282, -138, 85, 120, 103, 275, -72, 61, -138, 24, -178, 79, 87, -50, 167, -118, 95, -21, 250, -206, 403, -83, -192, -32, 71, 234, -159, 6, 263, 34, 171, -164, -121, -16, 98, 127, -99, 213, -98, -39, -60, 133, 11, 146, -181, -158, 37, 12, -121, 77, -18, -212, -48, 83, -107, 223, -223, 280, 134, -81, -48, 27, -121, 3, 326, 93, -48, 50, 76, -79, 34, -104, 151, 282, 88, 48, -221, -32, -221, -128, 35, 48, -160, -193, 193, -78, 232, -147, -124, -171, -127, 209, 151, 231, 301, 60, 95, -142, -90, -93, -21, 17, -187, 211, 65, -94, -84, 79, -126, 37, 12, -22, 234, -84, -222, -99, -78, 123, -18, 52, -173, 43]
7622D3l36K74r6J98J7l88K27K11om18R4L40PL5j6l49J20N1j36N00k55k45L06k91
7646a13K88k11K49L6l64K23p3p2O6P4q2jJ46o6q9J20k33M9K06j15n1J58n3r6K8
7671B4j86Q9K96k45r5l2J66O3j34J46o5l01L44j27m4L9%J98n3O7q6j16n2j78L99
7696A17L7J32k41j61J77k33J36O2L1q7r7j90L68k01J25j67J98K59o7j37l53K09
7718h3P9j8j6j01K42J32l02J38L2n62M39K32M0j18p6j91J71L6J58j08nk14J59
7741F4qj37J48j67J82MN2j11K22j56Q8k1j52R3pm6j87L51l49J80J69r6q3m43M57
7766D7r6j98P4K08J37l85J17L9j3J50M8k52rJ84j2J17k96QR0K5K12k04Nk82L77
7791I1j92L8J61k54N1k6O9J00j1q4R7l52K64L50k83l1j64Q7K6R7m5K40k76K29
$$ y = [43, -293, -19, -115, 83, 100, -288, -61, 150, 144, -274, -180, 160, 167, 202, 186, -163, -43, 8, -128, 372, 117, -128, 178, -113, 175, -36, 213, 249, -115, 108, 35, -37, 29, 103, 21, 20, 166, 100, 11, 131, -102, -53, 153, 38, -13, 145, 92, -4, 24, -162, -73, 223, -22, -117, -149, 17, 80, -54, 92, 27, -274, 70, -57, -101, -62, -62, 136, 83, 150, 64, -52, -104, -282, 117, 154, 286, 45, -116, 61, -172, -36, 26, 57, -30, -127, -317, 51, -150, -25, -192, 6, 265, 198, 61, -292, -83, -4, -22, -38, -139, 103, 235, -67, 71, 103, -459, -20, 212, 252, 134, 58, -133, 38, 74, 232, 124, 119, -95, 64, 56, -81, 67, -100, 82, 86, 138, 27, 249, 93, 181, 160, 8, 101, 94, 48, -139, 212, -137, 43, 212, 116, 33, -410, 47, -49, -247, -173, 35, 172, -213, -96, -57, -70, 80, 128, -124, -133, 51, 39, 156, -140, -132, -42, -17, 195, -9, -4, -286, 91, -101, -63, 98, -156, -105, -131, -62, 38, 27, -57, 40, -312, -48, 302, 19, -12, -176, -89, -63, 34, -11, 229, -47, 182]
7815A82l65K17L9r7k32K10M6k6j06K22j77K82m06j0J59L43k68K60m49J56j3J6
7837a7L7o8N4j53O5MN3J50J65j35j24J89J00k62K3J15j39j7m6l83L75Q1K04l47
7861g6K38j22j38q8M46k97lK48k33K01k24R1j37M3J90l21L56O1j95N8O4J6Qj06
7885H0rj40k6K82l20pp4L02l35N46l26Q2j6J7K40k67k99L12k55K11J21o7q5k25
7909b58M76K9k38l8R0k98J00K15R4k09j30J70L03m47O4l4k8KJ07J59j50k32K67
7932A4j87L30l45K76lj65N06k95l64J77j80J49l0M9j55J46J7J82k39J49j13n2
7954a33K04r6j8K35K0L5k58J28j87q2J59j32L07m53L01j59J78j6J53r7j8l50L51
7977G2k32R3m2M0l5MJ11J40j96j26K41m1J54j32j55j01L69k30j9K11Pm25J53J22
$$ y = [182, -183, 34, 73, -24, -256, -46, 0, -26, -132, 90, -87, 195, -211, -221, -62, 281, 13, 273, -176, -20, -33, -17, 20, -48, 6, -147, -82, -78, -25, 125, 290, 155, 31, 220, 320, 58, 81, 196, 57, 40, -6, -389, -14, 67, 271, -76, 162, 40, -98, -186, 260, -37, -40, 208, -25, 176, -48, 43, -94, -51, 139, -182, 174, 235, 40, 98, 162, 178, 186, 80, 71, -69, -95, 187, -133, -140, -214, 88, -247, 299, -27, 55, 39, 56, 296, 29, -270, 42, -213, -2, 119, 52, -33, -258, 218, 247, 9, -29, 61, -237, -137, 78, 172, -37, -167, 3, 306, -141, -77, -111, -139, -137, -30, 129, -21, -253, 14, -173, 157, -188, 88, 85, -80, 426, 131, -233, -56, -236, -87, -117, -68, -223, -77, -60, 122, -117, 32, -81, -133, 71, -25, -43, 192, 212, 247, -11, 117, -70, -152, 7, -125, 182, -271, 30, -129, 49, 33, 186, 89, 71, -279, 72, -160, -67, -109, -69, -104, -100, 11, 151, -45, -171, 70, 29, 183, 51, -104, -205, 164, -66, -85, 126, 133, -292, -139, -17]
8001a7l7K42j92L7O2J94j11l10k0K9j46L27j93K30Q9m49K38q3L35j97J55k11L71
8024C43j31j41kK23p8Q5l80j38L29j88J89k72L40j63R3n7J89J83l61l01L30N0
8046A42n0k93K57r9M1j74J74Lj13L28k25m0J86m26L96k37J07jM0j11L0lj44K43
8070C1j15K77j50r4l20J70M87k92L40l22oJ66m2k02j3j0j63L86j77j76M24l12
8092a13P9j69J27N2p0J76j52J4P0k75K35L4L5k49J91K15l0k68o2L24P6m71K6R2
8116a13K02K12k37p1O0J1J28k29K88k86k8j06Q6K2j04J44k96K30L8k09N3N1N6
8139i8J33m8p9j08N4J7j75K24K40L68m44LJ8l56K68J38p5p9O3k10K06m0j0k08
8163a98K08K20k71J03o2l1J88p8k15L14n12N93n60J49L08j24q9J98j18k23K7n5
$$ y = [-17, -54, 188, -4, 33, 95, 289, 178, -132, -152, -123, -269, 58, -135, 95, 184, -265, -27, -110, 225, 28, 183, -28, 343, 212, 71, 69, 292, 214, 299, -81, -219, 110, -78, 111, -161, 179, 16, 109, 52, 241, 424, 63, -238, 92, 142, 92, -201, 56, -43, -2, -176, -2, 1, -112, 216, -9, -49, 137, -289, 107, -130, -23, -24, 16, -95, -65, -68, -212, 31, -84, 193, 43, -51, -371, -201, 286, -6, 334, 12, 6, 172, 130, -72, -85, -95, -258, 128, -49, -225, 199, -113, -34, -203, -76, -24, -94, 82, -70, -56, 14, -261, -26, 8, 43, -206, -15, 200, 170, -98, -160, 164, 240, -231, -205, -113, 89, 301, 64, -7, 53, 64, 192, -37, 251, -35, -63, -169, -83, -61, -165, -21, -317, -87, -49, -258, -205, -154, -98, 35, -13, -92, -200, -146, -129, -304, -80, 160, 528, 84, 87, 105, -251, 17, 155, 80, 1, 64, -146, 60, 20, 10, -198, 10, 230, -41, 62, 0, -31, 157, 79, -136, 178, -334, 259, -301, -152, 156, 32, -57, 141, 23, -200, -173, -228]
8185b28R2p6J21k14K24K32
$$ y = [-228, -136, -212, -91, -305, -81, 151]
8191A51
$$ Imaginary data points
##PAGE= N=2
##DATA TABLE= (X++(I..I)), XYDATA
0@%%%%%%%%%qJ6j6J6k4L2m0N4o2P2q9J13j37J61j93K27k67L14l66M23m87N61o42
32c42P32q32R43j067J200j347J511j690J886k099K335k594K872l177L512l879
48b036M280m718N198n724O308o955P672q476R383j0413J1593j2959J4567j6492
62h772J8845k1804K5659l0933L8681n1472P8130k33888P9596K6099K9448J92221
74A41810r3756J64756j10269N4751k02468l438q4670k8540R6147p0903J43947
85G367K9053R3907J6472l6058m4002n9361p958j12475K2270n2278R2539N3736
97C212M5193L0837M713J1862l3246j3295j10674j2145j7329P223N7489k1606P2157
110B4391K9899M8929o1826L0610p7805m2743M2233r1578M3133m442M0797N4497
$$ y = [0, 0, 0, 0, 0, 0, 0, 0, 0, 0, -8, 8, -8, 8, -16, 16, -24, 30, -32, 40, -49, 64, -73, 88, -105, 122, -145, 169, -197, 226, -261, 300, -342, 390, -442, 501, -566, 634, -713, 798, -892, 994, -1105, 1230, -1364, 1508, -1669, 1843, -2036, 2244, -2474, 2724, -3000, 3308, -3647, 4025, -4451, 4932, -5481, 6112, -6847, 7720, -8772, 10073, -11731, 13928, -17005, 21676, -29796, 48334, -185554, -105958, -79859, -50411, 141810, 48054, 212810, 102541, 157292, -45176, -48614, -133284, -161824, -65677, -136580, 7367, 36420, 130327, 146799, 110741, 66739, 7378, -580, -113055, -90785, -143063, -50524, 3212, 48405, 79242, 83955, 95817, 62571, 49276, -61398, -73543, -90872, -83649, -26160, -47766, 24391, 54290, 103219, 41393, 72003, -5802, -48545, -6312, -97890, -54757, -59199, -18402, 36095]
122C6095O204J6446l3797M0035o4611K727l8536m3542N7982j7022L2864J7800
134A2645J2272J7555J0032j6858l2386r237k5158L857Q779k7070L9508J7359O744
147A8042K1121j6768q021L495k4806r32k3460K39L781L2666r951J0394K0379j9698
161F481K2255j3928k7307N860j4522Q980k682N416l792K5582L489p385J9956l2839
175d436P408P335k4956M565m117J80J6666J805j776P011O196j3169J9860k6663
189d091r080J3618j4598O661K621p920J8116K774N890p178L824j6490J3255p805
203d03k1624J5723q219O773J6762j0060P898L371L066l961n240j7219J427R990
217a716j6011J4623q11N99K1775k944p297L35r132R02m305j0555n441J7844l439
$$ y = [36095, 42299, 58745, 24948, 64983, 372, 3099, -35437, -78979, -20997, -38019, -5155, 12645, 24917, 42472, 52504, 35646, 3260, -5977, -31135, -27278, -18499, -45569, -6061, 11298, 18042, 39163, 22395, 14374, 17869, -6937, -7869, -31329, -31090, -27309, 5357, -4594, 5800, 26179, 6481, 28736, 14808, -12499, -6639, -21161, -12181, -14863, -9447, -13239, 12343, 15832, 8447, 28403, -4436, 2972, 10307, -14649, -10084, -14201, -14021, 2645, 4450, 2674, 9685, 15881, 2712, 22572, -4091, -13171, 447, -14151, -7490, -4869, -12789, 5327, 8101, 13991, 6813, 10637, -5853, 7402, -403, -22027, -6304, -14523, -7750, 9012, -1048, 6850, 10221, 13287, 9326, 4086, -13133, -11706, -1716, -17727, -3104, -3915, -3316, 18459, 15515, 8218, 8553, -579, 323, -3982, -14537, -19978, -2134, -5573]
232e573J3893N529j1774J2054K365j6132m12j7052L575M565L429l034J2374L342
246G149M859J2384k3249l326L614j4716P227j0647K509J1001J0956L491M28l19
260A1361j0174J3292j9308j0140M083n761J2332O414j950O887O037K653n173o397
274D156j8072R102l724n572Q372R1O192J7791p564j005n322l465k033m389j0871
289a6313K211J1311j172J2098J284q356J5006q181o039o774q643M872K734K254
303c708k712J3220k890R229J239j7028L285k886m957K486p161N484O033Q587l120
318E101M627p074M68M578j3354l334L613m415J0907r59m1L528L788r83q17o200
334e67p705Q093l773l969Q192o026Q278O241n827Q89l637M31n34n82q732O418
$$ y = [-5573, 8320, 13849, 2075, 14129, 16494, 362, -50, -17102, -13527, -8962, -5533, -8567, 3807, 7149, 12008, 24392, 1143, -2183, 1431, -13285, -6058, -16705, -14196, -3195, 7761, 11252, 11680, 11361, 1187, 14479, -4829, -14969, -10886, -16647, -4315, 2099, 149, 7036, 13073, 15726, 10553, 4156, -13916, -4814, -8538, -14110, -5738, -5647, 545, 18336, 10772, 9767, 4445, 980, -1053, -5442, -16313, -14102, -2791, -3963, 8135, 9419, 1063, 16069, 7888, 1849, -4925, -13568, -8696, -5962, -3708, -6420, 6800, 3910, 13139, 14378, -2650, 635, -2251, -7208, -4722, -11883, -6399, -366, 8221, 5101, 9728, 2654, 3122, 7700, -5654, -8988, -5375, -9790, 1117, 158, 117, 3645, 7433, 6450, 5633, -567, -8272, -179, -3952, -7921, 271, -5755, 2523, 8764, 2937, 3826, 189, 620, 86, -496, -9228, -2810]
350b810K003k019Q357m659k697R514o665J515m960j206J589L096m024P18L310
365A062l022O843j67r215P562l692J651k92m172R87J873J477j826K544m360L863
381A116N450q624L324r56l198N606m798l62o89L114m9L987m097l86O154m484j524
398d16J613q165O417m99m69O08J285J437M073k055m776K217k218l144M997p943
414g038L384M783J00L575k155j45M76J61n774j007q59k483Q115j181j512O438
430D878j759L341l066l629k671J77j833Q21J053r21O358M812n326L602m731r69
446A37o68l512j945Q53J844M248L139j710J151L994o147K78m326m963M171m20
462c876J589J769J848L351K943l626l987J049m563m84J904n647N904K228L671
$$ y = [-2810, -807, -2826, 5531, 872, -1825, 7689, 1024, 2539, -2421, -3627, -2038, 1058, -2966, -2248, 1062, -1960, 4883, 4716, -4499, 3063, -629, 1022, 730, -3442, -2455, -582, 895, -931, 1613, -2747, 1116, 6566, -2058, 1266, 310, -2888, 2718, -2080, -2442, -3131, -17, -66, 3921, -176, -562, 5592, 1108, -416, 1197, -6968, -551, -1050, -1519, -911, 374, 1811, 5884, 3829, -947, 1270, -948, -4092, 905, -7038, -3654, 1129, 1229, 4804, 2649, 2504, 2980, 3141, -2633, -3640, -4499, -6982, 1133, -48, -1560, 4878, 3119, 6460, 3394, -235, -2906, -2729, -4562, -3741, -2688, -3609, 2749, 7561, 2235, 5837, 1106, 137, -531, -4043, -5988, -5135, -3291, 957, 4096, 2386, 3537, 7531, 1384, 1662, -2664, -7627, -3456, -3876, -2287, -518, 1330, 4681, 7624, 3998, 11, 1060, -3503, -3987, -2083, -7730, -1826, 402, 4073]
477D073J099j071j495Q20l094l952m17j700L43P155k191K321K521J99K27k815
493B023m735j24j088mJ221J479m07O652M55k729J310m693O1q58k766L9R78K280
511i06K830J901k558K196P93m907J582n196M90J619N83R37J494N23K324O69l736
528F38j337L21l615L235j462o65K235K589N03N57j958k65K79j992j627R40j669
545c293K288L156k004J145M04l76N39k309j295L41K04M2J216l61r18M860l222
562D17O88j017j039P05K09j168NR17L18J432j23k921L324k273M99L68j627O56
580f30J415m54k40j33r94J435Q85k639R29N19p08K577j737r36Q96n07N21n71j177
599a549J249Q48J88o33J305k630K715j134j443K69m86P16J317p15M21Q03M30j252
$$ y = [4073, 5172, 4101, 2606, 3426, 332, -3620, -4037, -5737, -5394, 1761, -430, 1891, 4412, 4611, 4838, 2023, -2712, -2836, -3924, -3928, -2707, -1228, -1635, 5017, 5472, 2743, 4053, -640, -579, -1437, -4203, -4164, -3186, -906, 1924, 3825, 1267, 3463, 4256, -651, 931, -4265, -3775, -2156, -1573, -636, 858, 1381, 3705, 4374, 638, -699, -378, -3993, -758, -2220, -2885, -650, 1939, 2442, 2999, 1041, 776, 1055, -937, -2564, -1624, -3293, -1005, 2151, 147, 1292, 1696, 1320, 1859, -450, -1745, -1404, -1200, -1158, 58, -303, -1221, 3639, 417, 1105, 88, -951, -246, -37, -1205, -1200, -283, 35, 1467, 1344, -1577, 1747, -526, -27, 341, -1286, -630, 785, 331, 91, -42, -1036, 399, 1284, -1355, -426, 93, -615, 1962, 225, -711, 185, -322, 199, -372, -1549, -300, 548, 736, 103, 1408, -1222, 1493, 359, -1084, -815, -1301, -585, 732, 17, 438, 1241, 1671, 419]
617D19J185l935R03J256j441J213K6N02J878N1j306l77o43p13J012j998n33K943
635D42p13J436R03j221L06k09r36o96j776P69J007Q32p98K344m89L81P17k413
653a14q62l5p54P55o99R88P21K268r87R38q03k187J677k177j068M16M74J520P94
672H65L10K33M98j128n9q50k812J340L69P3J189M65P24J036q39l04j490o90m0
691a110L47j447J045J787R5P73M11j643P13j300k7j183m46K59J808R3K1J503q77
710H22L33k63j700j53o86O55J21K08O41J200N29q89O08j678l87M26j028k94P31
729h04K20J454M5J45l77M05j505M76n96j185J349K92k04P59l01Q82k87j17p85
748a34k26p17P39J91o44Q80N78j76P29r60l91K42m81J15k40k97K10J439q62M97
$$ y = [419, 1604, -2331, -1428, -172, -1613, -400, -374, 128, 2006, 2057, 751, 374, -269, -982, 30, -1968, -2501, 442, -271, 1165, 2068, 847, 1153, 944, 8, -688, -2464, -1695, -688, 144, -654, 1690, 1201, 1582, 2299, -114, -976, -1011, -1765, -1010, -1709, -721, 0, 2268, 1281, 2219, 1416, -771, 906, -1271, -2339, -1923, -1449, 71, 865, 1175, 1408, 1906, 778, 719, -131, -2943, -1603, -1234, -1161, 28, 493, 1217, 2253, 1414, 1110, -380, -1070, -1110, -763, -2210, -1165, 622, 717, 1490, 1901, 258, 971, -329, -356, -1539, -1985, -1726, 82, 175, 196, 1699, 822, 1155, 892, -808, -961, -1647, -992, -871, -663, -22, 1178, 1707, 818, 1426, -252, -639, -213, -1241, -1535, -804, -584, 870, 915, 1060, 683, 1088, -417, 59, -537, -1722, -373, -81, -285, 474, 173, 1055, 768, 651, -134, -360, -1077, -338, -147, -791, 89, 667, 491, 1220, 260, -131, 111, -370, -255, -495, -792, -582, 857, -5, 492]
768D92M2o21N37l62p90L46j42O83k67J77n03P27k32J27Pp24Q3J018p20L04k01
789a9l8L38l84l69J96J45l17J093q59j2J198q78J84k57q31L52L15K74j70P4j63
810a28J114l53r11L50l82j87L97q93P80Q9Q00p1j04j65P9l05p77K80q8n36J602
831E91k70J41K3j46K01j77r42k04O69n42k6O24M2P73M80q43P3q04J75l15kl70
853h49L96J62R63L97n62k44N31j123L01p01j71K93M63K64L29k0O3M53q38n22N
874d10k14j83L44J46P46J97K8L06n17n08K0l86o74L65j2K20J017J16P5j54L5k94
896B63m91p89L02O4P5N75N13n82J041o19J45j71j125K24M1r9N69M7K69K03M29
917H84p29j12Ol42J06q00L03M39L51l41P57p2k33K50n12o28L08l56N85j49M65
$$ y = [492, 534, -87, 450, 88, -702, -356, -498, 185, -82, 95, -408, 319, 87, 214, 221, -503, -420, 598, -122, 182, -19, -57, 281, -103, -472, -276, -131, -448, 645, -214, -226, 972, 94, 278, 21, -810, -458, -143, 131, -39, 35, -128, 986, 633, -278, 72, -310, -497, -100, -993, -213, -124, 676, 605, 501, 336, 415, 110, -667, -387, -475, -1011, 591, 321, 462, 485, 339, 540, 363, -579, -783, -114, -656, -682, -58, -16, 757, 1237, 394, 467, -337, -162, -477, -479, -849, -453, -291, 672, 1069, 507, 263, 794, -329, -28, -729, -900, -607, -144, 120, 449, 429, 492, 945, 107, -415, -410, -624, -807, -463, -317, 429, 626, 654, 960, 443, -65, -45, -431, -1105, -740, -752, -532, 485, 601, 676, 522, 557, 263, -228, -1017, -715, -651, -576, -1, 512, -70, 971, 352, 497, 326, -799, -575, -534, -633, -64, -17, 252, 455, 884, 155, 43, 49, -293, -187, -987, -684, -245, 106, -235, 522, 450, 217, 467, -45, -673, -365, -721, -136, -285, 180]
938A80K8K71J40j53m68k85q0K88n39O33k47L70N40l38n9j28j61J62n14j44K74
959b30J38l8O78l85K17J75l31k07m53K68K52j99q6K60j33PL38k15j85L59m68L68
981A30j82k62J82M14j51j22L2N1k78M80m57L6J66k85N24m64K60m5j72K05j3n15
1003d66N00q8L88k61L04m97k6N09l78j5j94K59j44L04j52K63m43q1M17n65k13
1024e79M82N6q9K54j90M38l2m00M6k89j01J18j71K21K58K39l8J80m63L09k60p8
1046h9k49J01j49K15M40l08K83n0J95l72j74j40p7J4K11K88K47l95N67m97M7K32
1068C40q26o5L49O9J01J33J1L53l54o5K60k17k70j05R2k10K21O0P32m10K68j6
1090D51k07k09l87R0q1L42k49K32L13J85j98J74o49J79oj50O6j65m0O50j00m2
$$ y = [180, 208, 479, 619, 466, -2, -287, -367, -79, -618, 15, -232, 138, 678, 340, 281, 153, -8, 154, -360, -504, -230, -92, -130, 548, 163, 380, 555, 224, 17, -436, -168, 84, -115, -201, 59, -74, -67, 271, 56, -129, 230, -238, 130, -52, -314, -132, 282, 131, 9, 41, 92, -186, 294, -163, -127, 39, -246, 278, -186, 74, 29, -143, 62, 49, -466, 34, -54, 334, 73, 377, -120, -146, 363, -15, -30, -224, 35, -109, 195, 43, 306, -137, -218, 199, -366, -579, -97, -41, -130, 124, -66, 372, 340, -60, -14, -303, -404, -286, -457, -236, 22, 261, 223, 403, -60, 249, -11, -89, -338, -237, -386, -171, 269, -39, 244, 194, 389, 17, -157, -297, -374, -360, -149, 139, 386, -9, 558, 61, 108, 340, -486, -551, -202, -133, -32, 101, 112, 465, 111, 46, 306, 89, -181, -286, -194, -404, -183, -123, 609, 199, 467, 451, 244, 35, -352, -262, -343, -1, -250, -18, 295, 480, 282, 456, -193, -14, -20, -170, -104, -269, -309, 341, 241, 199]
1112A99n7Q3j67j1l66m40M02J43M35K43k69m6j45K80j09m62j79K35K22r7j43K87
1134C8J34K92P0m67K54n33J3k07L49m00P36M0J13m44J51J66j82m73L53m72M38
1155c1R1L3K42r5j49Oj11j45J21l65K24J85O5j54K42k18K78k97K53j99n7J7j11
1178a75K12N6p0K43n91K24J28J21l76j40J22J07L33J28k80r1K8j67N04k75k00
1199a59K39q9R3j94M5j0j18K09p1q3J00p1j17J03K25J33J89o60K55k49K70j00
1221f0O1l19M08r3mR0P6j4K1k43rq9m5M85k08mj06nj38L06n23L95j16J64k56M44
1247B18l46n2L85k25R4J15k77n1L24k53m4J28O2J83j96J14j6j67j61J48q7K0L42
1270B58m89K64J6J52k2j10j68l7J39k12L24J6Q9l73K41p9O4k35L33k24j86J11
$$ y = [199, 142, 225, 58, 47, -319, -759, -357, -214, 221, 464, 195, 149, 4, 284, 175, -287, -466, -231, -9, -106, -249, 38, 172, 464, 534, 67, 321, -212, -199, -406, -57, -457, 279, 319, 432, -12, 139, 305, 123, -350, 3, -469, -31, 60, 93, 335, 240, 91, 97, -14, -159, -38, -403, -179, 6, 71, -83, 159, -59, 219, -78, 175, -24, -81, -64, -175, 37, 93, 23, 266, -325, -101, 27, 148, -228, -368, -246, -139, 194, 322, 42, -49, -21, -188, 316, 41, -159, 80, -9, 84, -110, -65, -75, -193, 16, -55, -138, -38, -109, -226, -123, 102, 235, 424, -236, 19, -230, 40, -60, 1, -318, 90, -3, -7, 83, 159, 145, 166, -77, -86, -175, -220, 265, 57, 53, -53, -58, -196, 110, -413, -18, -134, 30, -226, 218, -128, -180, 205, -20, 74, 189, -88, -139, 185, -68, -112, 16, 78, 261, 65, 179, 163, -4, -165, -17, -104, -84, 258, -231, 33, 49, 201, 179, 69, -99, -136, 3, -209, 115, 131, 220, -153, 88, 9, 73, -162, 171, -53, -239, -128]
1292a28R1M5q5J38K29l63K82k27l09j14K67K34L1P0n1j5J42l49K57k21L1j99K72
1315B8m0N3M57l70j44L68l97r9j75K87k24J89P7n6K06j69J69M3k47L06m5m89K61
1338a1k3jK23N7j11k3j13K77k93k55O4L8K46j13K83k36R7o4q5J4L66k16j21n8
1362e8j33L05r3N1M6j47Q2o3k29J34J17K60l67j95L46RP8r3J2N4k27J92N6j47
1386a0j78J75m3J58k4r7j07j31K25J89k49K99J5j57K3j98nK10k80J44Q8j95J99
1409E1J71l78M2J75k02K87j93J35l51K03J42O4P3J6k78M7k70J64O9K17j68o1L75
1432C30l54j00L71m33J89j52k47K15J16j83K78m5O0j2k35R1q4K39j90L62j52L42
1454D06m03L04l83J09n13M52J2l91N83l49J00J49j68j94L65r8J4j39m5Q9l1J5
$$ y = [-128, -37, 8, -77, 61, 290, -73, 209, -18, -327, -441, -174, 60, 91, 161, 110, 95, 237, -112, 145, -76, -45, -244, 28, -12, 41, 498, 128, -16, 352, -45, -144, -319, -32, -256, -67, 10, -46, 160, -9, 160, 203, -44, 262, 217, -272, -11, -34, -35, 188, 245, 134, 111, -2, 275, -18, -273, -209, -171, 75, -38, 245, 9, 106, 42, -43, -29, 337, 121, 0, -58, -191, 114, 21, 72, 118, -29, 53, -10, -239, -105, 12, 272, -95, -290, 56, 65, 143, 50, 62, 116, -111, 81, 137, -10, -188, -13, -56, 102, 78, -19, -126, -257, -32, 157, -92, 207, 222, 65, 88, -110, -115, 95, -185, -41, 47, -148, 51, 222, -156, -114, 61, -141, 146, -47, 88, -263, -60, 82, 146, 219, 235, -43, 4, -266, -102, -33, 184, 16, -45, 330, -24, -124, 247, -186, 3, -149, -396, -181, -65, -248, 30, -15, 45, 33, -202, -111, -195, 44, -146, 216, 64, 406, 3, 307, -76, 33, -480, -28, -16, -407, 176, -173, -73, 76, -92, -286, 79, -19, -5, -144, -189, -100, -131, -116]
1476a16j25K06O0Ok27J41J87j70J10k94M8J33k6k14L68M9j05l4pr7R5j5J36l66
1500b57L52m6j0j49K72o5j51n7J46j42J73l8n3J38p8q5J01j20j4K68k99p1J70
1523a5L1r0L56l01j4P3J75Rk20j22k1J80j84L08k1k09K82j27k52K79M3j65j34
1546a39J1J11K8J03j14k92K44J35n1o4K04l05L27l14J67k48L42j76M2O8l28O0
1568a89K42j49O6J35k2k04K16N4K1k17l5J49k6J09j25r2k8J95j70K20j98k21L08
1591C9k21L40o3k43Q7j37J25J33l5k3j91n6K42q1N4J26j29R8k39j71M54r4m2L18
1615B91k14l22K34M6k11J14J53l18L44j48j8L6o5M2J41k19R4N1k43Q2P5J87j9
1638A13K0j53K51m06N24n65L40j16o8j1N4k43N5K07K64k89j76L98l94J15K51j24
$$ y = [-116, -241, -35, 25, 31, -196, -55, 132, -38, 72, -222, -174, -41, -67, -281, 87, 136, 31, -3, -10, -107, -12, -27, 109, -257, 95, 49, 39, -110, 162, 97, -54, -111, 35, -107, 66, 28, -25, 113, 35, -50, 51, -69, -83, 185, -114, -185, -15, 16, -74, 282, -19, -33, 40, 215, 224, 4, -118, -139, 41, -143, 165, 144, -65, 217, 90, -162, 117, 160, -5, -139, -128, -17, 11, 114, 0, -292, -48, 87, 36, -28, 176, -129, 198, -116, 51, -197, 145, -31, 11, 79, -249, -189, 53, -96, -30, 105, 83, -121, 95, 149, 170, -47, -82, 67, 41, 150, 25, -67, -95, 100, -70, 150, -48, -269, 39, -182, 158, 95, -148, -61, -198, -73, 60, 25, 2, -189, -245, -3, -84, -30, 96, -33, 65, -174, -345, 109, 15, -27, 291, 77, -245, -11, 35, -176, -62, 91, -227, 117, -31, -49, -13, -78, -36, 105, -114, -20, 31, -212, -130, -55, 132, 113, 133, -20, 231, -175, 349, -216, 124, 8, -60, -71, -17, -260, -205, 2, 266, -23, -199, 199, -195, -80, 171, 47]
1660D7N8k77J64j00k07K97j55QN2K28k45N8R0J64k56L49k02J23l51P7J88n10L44
1683e6j82K34k63K04k16L40k73L22k36J05J15k47L84k63N4K02m98J12J79P5k23
1704a31K38j23J00j31J23J69k55P2m7N0k22j18K58Q6J73l04j10P6J79j82J29j48
1726a18j0M7M4J52j0J18j23K9o3j83R7P6J34J1j88l8J88j92J53j61L19m44J54
1749hO7k25M1P6m9J18J9k7o9J77r7k40K23J18l09K42p3J6L34k10j26l70M93j01
1773B0j56o5K66o7J33k30K07L26m30K44n18L55k06P8J29J3j43j26K56j44j80M38
1795B00j76J10q7O3J21J47m48J45k02N5M4J63l22K52P8k33J68r2J92l72N1mL97
1818B50q6j3j84K00o0j80R9l86M54J10j49p8K32k96J03L10m31K86J6j81j27j08
$$ y = [47, 105, -172, -8, -108, -315, -18, -173, -165, -113, 115, -130, -72, 18, 182, -74, 275, 73, 196, -155, -78, 110, -400, -56, -238, -4, -267, -63, -279, 61, -212, 110, -126, -21, 94, -153, 231, -32, 22, 224, -274, -162, 17, 92, -131, 107, -16, 84, -47, 76, 245, -10, 62, 15, 65, -157, -275, -17, 69, 242, -62, -172, -96, 83, -99, 30, -118, -128, -81, -37, 115, 105, 223, 100, 129, 66, -117, -20, 56, 190, 201, 13, -25, 163, -29, 124, -37, 282, -162, -8, 59, -166, -125, -49, -98, 20, 39, 12, -57, 120, 23, -217, 6, 124, -185, 57, -16, 0, 334, 124, -2, -372, 121, 20, -136, -201, 65, -2, 131, -99, 108, 434, 4, 248, -270, 85, -121, -43, 86, 99, -44, -170, 86, -58, -238, 200, 24, 134, 47, 110, 231, 378, -70, 75, -127, -72, -28, 135, -187, 65, 143, -90, 78, -14, 178, -194, -143, -147, 250, 164, 151, -33, 167, 107, -73, 26, -360, 94, 204, 55, -23, 209, -87, 16, 326, -105, 181, 197, 16, -111, -219]
1840b19J1j04Q5K32J8pj18J57j62N64m10on9k0M5J40k26JK28M5j91k40K67j10
1864g9J39o1l7oJ77k36r5M9J60R9k52j4lK71j64J46j31j68M54j52rm0j61K70p5
1889H2l30J90J42J20k11J93j80r0K07K7n8r1j45J63K44l77p7L91j64P5o7o7n1
1912g4K04j08Q1%j12K02n8l0k05O3L7j78RK96j95k1J25l15L9K69j21j60M93l49
1936a08p9K37J50k39M63l44j14M5k30J54r5J01J13K41j58l38K07J9m7K5K6j2K0
1959C7n3j71P1L36j48J00q1J51m42M18l62L7j44L54r1J17j31L7m6k12K72Q6j11
1982B4p1J77N3j21j24q9K36Q1m57J05L44j93J86L6j94Q9j28Rj43J30J2oJ18j25
2006e1q6kK0L26k36k89K15J90j35J64k55jK93p3o9J5K0j73j2K46j15J88k32Q5
$$ y = [-219, -208, -312, -227, 5, 23, 16, -102, 55, -107, 457, 47, 41, -18, -38, 7, 147, -79, -78, 150, 195, 4, -236, 31, -79, 60, -1, -38, -44, 133, -103, -198, -149, 11, 110, -142, -156, -159, 112, -52, 94, -37, -205, 249, 97, 88, 48, -113, 157, 82, -248, -58, 84, 204, -7, 186, 6, -84, 123, 150, 92, 1, -144, 19, 263, -114, -191, 200, 36, 111, 44, -23, -74, 130, 22, 103, 103, -9, 193, 135, 105, -100, -37, 0, -178, -169, 127, -68, -89, 36, -279, -240, 29, -92, -252, 241, -108, -187, 50, 200, -39, 424, 80, -34, 11, -219, -65, -160, -59, 54, 295, 137, -201, 6, 25, -22, 3, 29, 17, 37, -16, -187, -116, 220, 72, 172, 91, 242, -200, 218, -144, -107, -251, 103, 12, 129, -2, 35, -11, -223, 49, 135, 24, -47, 130, 183, 62, -62, -151, 85, 166, -291, -186, 158, -35, 151, 187, -7, 82, -46, -37, -180, -50, -38, -44, 74, -51, -137, -139, -119, 207, -29, -318, -103, 87, -48, 116, -139, -140, 153, 80, 11, 26, 46, -127, -139, 107, -8, 180, -52, 33]
2030C3j11K56j98J53rj10J53l34J16j5k30K36n8J93np0l9J41p8k44J67k24L48
2053G1j08J06kR0q6l37J27j5J28J11j39J32K14j22j40j63J26Rrj90L88j83l76
2076c68O35j97J7k70K52K11j2p8k61Lp2J66r4M44k53j52J99m02K67j52J2J80n0
2099B5k3K25o8rl8j93J0M0L4L3j25J23j32k5K87j65J5j23Q6l9n1J97l32K51J1
2124A4j11j31J25j38K35J82R4m55L17r7K08J27m44m9J41j86K9K44J11Q0k45n0
2146AL08n63L59R4l93J59J31J27l86J3L14j80NP8j45k46M00m7j0N6p1J66k55K3
2170f2j36L13p3p4L50l04K01m06K59J38k00l43K08%N6k05K83J37J27p9m86N29
2192B33l22K21j82k68J89J10J12j88m1j3O08l48j62K38j62J65o43M71L64k85j36
$$ y = [33, -78, 178, -20, 133, 124, 14, 167, -167, -51, -66, -296, -60, -118, 75, 70, 0, -39, 102, 24, -220, -53, -277, 71, -37, 69, 67, 157, 71, -266, -139, -154, -26, 85, -54, 78, 292, 170, 30, -133, -7, 2, -7, -197, 191, 8, -368, 267, 70, 87, -183, 69, 280, 268, 190, -71, -68, -140, 26, -68, 376, 123, -29, 170, -232, 35, -117, -105, 75, 25, 2, 227, 159, 150, 112, -81, -71, -31, 3, 36, -89, 34, -98, -123, 164, -1, 14, -109, -23, -62, -113, 84, -248, 3, 14, -97, -228, -103, -241, -6, 176, 270, -185, 132, 35, 243, 370, -74, -123, 18, -168, -139, 105, 216, 296, 51, 1, 309, -254, 105, 199, -194, -35, 96, 223, -163, -150, 164, -16, -11, 67, -78, -324, 76, 29, 19, 75, 4, 170, -85, -62, -198, 115, 42, -32, 318, 14, 215, -191, 68, 206, 6, -337, -129, -129, -73, -278, 5, 142, 269, 190, -296, 233, -89, 132, -50, -318, -129, -19, 93, -95, -136, -149, 459, 111, -51, 187, 25, 190, -453, 18, 382, 97, -39]
2213c9p7J61p9N7N1l75K92j77R8L1K09k76L3j70L15P3k36L18l13J39l6m8J07j50
2237i2M00j98j3Q5j20j67p5J28k01Q8n2L21K07j61k49L14r8j05N6J65m69M95j02
2260A57Rk96J87J58m61K1O7j6J03n3J54l4K92j86j35K91l58J76R2l38K12j36K33
2283A39j18L2n4k28L48r0k90Q0Q6p0jR4L43l52K83k4J08l67K84k51J67Q0n1j05
2307D3J53k59J59O9j91MJ28p7J45l53K61k14K12j96K35k5k53L92k42K7p1K12o4
2330I5k48k21L63L6j49J83j13j76K91k14J04rL20k23L8j26K43j45j37J05J14n2
2352G9K26l56K47M2q1p6j07j07J41O4n3j04K02L1N5l62J18N6J40Qk0k41mJ05j31
2377a28K06j90L69l16J3J66q0j4J86j62j51pJ89j02j81K80ll36J00K27k15J38
$$ y = [-39, -116, 45, -34, 23, 74, -301, -9, -186, -88, -57, 152, -124, -91, -261, 54, 127, -109, 209, -104, 35, -1, -49, 58, -92, 308, 110, 97, 182, 62, -105, -180, -52, -253, -165, -217, 104, 311, 150, -99, 215, 117, 12, 68, 233, -236, 259, 157, 166, -130, 57, 215, -246, -225, -158, -174, -71, -124, 30, -4, 288, 102, -33, 258, -100, 76, 168, -170, 42, -94, 139, 21, 53, -1, -229, 119, 29, -261, -181, -95, -165, -166, -72, 271, -81, 202, 178, 286, -81, 203, -48, 119, 199, 148, 43, 196, -63, 96, 165, -26, -22, 106, 29, 174, -179, 82, -132, 80, -116, 119, 94, -159, 233, -9, 18, -53, 159, 95, -153, -374, -11, 25, -124, 59, -54, -230, 61, -153, -49, -58, 262, 39, 77, -49, 194, 49, -88, 17, 131, 79, 305, -51, 196, 238, 157, 81, -26, -133, 8, 72, 19, -85, 117, 148, 203, -159, -41, 15, 155, 163, 143, -98, -102, 3, -128, 78, -112, 257, -59, -46, 120, 40, 26, 212, 50, -101, -108, 81, -21, -202, 78, 75, -261, -161, 66, -149, -11]
2399a1L54l89Q7j35J25k74R4J73j59J57J15O2k23j01J20lJ68l8M6k00p4LJ29j11
2423h5J86k57R4R7o3n6J08j5O6p5mj88K86J5k09q0M4K21r8k20M12k82L58k30K31
2448B56l55Q3L9j07j05Q0J61j78K3J18J57l41N57n22K51J53n37L75L1j27Q6J67
2470B65k34j31J64j71N2L69l37J94k15r4k1J21J79J49j46j57J98p8l26K42R8k32
2492a11L52l09J97j94M7Q5k68J11LQ3LJ88l03j63K61M1k5J81l93l3m1K80j99R9
2516a08J20o4J71q7n9J66o8k45J48pn9P1P1j22n2nJ29K3mL79m28M8j36K54j05
2541C1j40r7L67l59K47k47J63P4J10jl70L59Kj74l8K31j05J37j97q1J69j07q1
2564a07k0NN0n2P9k23K62k00J53L28j8j97j46K32l25K69k16Q4K33j88J59k63J85
$$ y = [-11, 343, -46, 41, -94, 31, -243, -149, 24, -135, 22, 137, 199, -24, -125, -5, -8, 160, 122, 168, -32, -106, -103, 26, -85, 101, -156, -62, 35, -28, -84, 24, 9, 75, 0, -4, -192, 94, 109, -100, -180, -136, 85, -13, -233, 179, -103, 255, 25, 256, -99, -16, 23, -84, -189, -109, 52, -126, -103, 15, 172, -169, 388, -134, 117, 270, -267, 108, 139, 12, 98, 265, 31, -100, 64, -107, -55, 314, -23, 171, -44, -138, -159, -38, 141, 290, 144, -13, 185, 107, -219, 23, 121, -111, 241, -68, 129, -65, -18, 67, -201, -90, -87, -4, -1, 187, -116, -279, -18, 23, -2, 179, -214, -247, -288, -8, -207, -108, 12, -52, 119, 32, -27, 139, 71, -174, -26, -33, -92, -21, 50, -72, -124, -129, 0, 23, 19, 398, -30, 18, -118, 136, 31, -109, -206, 161, -198, 49, -198, -35, 39, 149, 148, -222, 137, 139, -35, -73, 158, 53, 190, -7, -88, 81, -26, -107, -127, -122, -72, -124, -45, -268, -6, -206, -53, 275, 257, 60, -86, 146, -179, 90, -126, -42, 191, 3, 162, -101, 84]
2587H4j25L11j31k22M3k54K90Rj15M8j40j12M58P5j94K87o01L36m6j89L5J01O1
2610Im5K5j43L09J19k92L2J25m23M57k04J52j95J34j31J52l7k42L77k69Q8k53
2632b55K54J09j29l4pK27k52K84k60q7r2K21L14k78k10J62P9j5o3P5r5P7l27L82
2656H0j83J66M8m55L01k49K82L7K11k75L48j14l75L18j92J11j6q8P5m4k6j69J85
2679b4J0M4P3k3O0m05K10k35K63J43k63M1J19l21M34j75j34K99n0PM2j9j50J9
2703c5M6Q9r4m2J43k01j75M92j77Q3L7j24o7J96j91j85n5K11j26L56k40j08L64
2726A97k40K9M35k07l24K84k2k97P0j7R1k8R5K91n64K81J27k66N9R4k65J58k2
2749d1K76j49K48l70k14N11j90JPj44J10J29k0k06o8K02K65m23j7N7J25j64J59
$$ y = [84, -41, 270, 139, -83, -40, -294, -4, 5, -110, -62, -202, -314, 144, 219, 25, 312, -289, 47, 1, -188, -153, -52, 9, -36, -11, -154, 155, 274, -18, 14, 139, -284, 173, -31, 121, -74, 60, -71, 81, 44, -198, 179, -90, -2, -255, -1, 108, -21, -55, -62, 165, -87, 197, -63, -150, -242, -21, 293, 15, -195, -33, 46, 31, -32, 43, -52, 25, -302, 80, -103, 63, 111, -344, -43, -292, -10, 27, 238, -37, 311, 197, -178, 140, -52, 59, 43, -45, 30, -14, -40, -209, -24, -14, 30, 103, 80, 140, -265, -55, -290, -27, 116, -147, -106, 13, -308, 126, -49, -183, 116, 66, 73, 115, 96, -54, -35, 11, 100, 6, -36, 107, -94, -269, 223, 46, 129, 166, 42, -25, 171, -20, -205, -260, -49, -175, 181, -59, -167, 197, -43, -14, 421, 214, -110, 174, 152, -145, -75, -92, -1, -29, 66, 357, -207, 74, 201, -65, -6, 88, -177, -19, -41, 235, 86, 334, -36, -250, 261, 71, 72, 79, -65, 45, 174, 154, -52, -120, 82, 347, -76, -93, -36, 89, -75, 84]
2772H4k5k0r9j15J03J52J4j36q2L15j05k4k4K14j58k51J82j0j56j39N00r0O9J04
2796C03k51j55J55j49N4K25J01k92Q2k11J31q8j15J67r7n1M78l89K91j81k9M2
2818B1j56J46k05J49Q3r1PK7J00j21M5L14k63M8k84J96J84k06l2O8J09l10KJ43
2842b6J74k45N3n7K7nk06L89k46K45O5l99J5L62j75l9K88j76J07k05K8K38m12
2865b00L20l41J11l9J86k01l1J11J47j96L70l79K10o5L9K18l77j16L8R9J44j0
2887C8J19j23j55J26n3J37j01K76k92K09k34J07j78m5J63m8O5j69K37r5K06m1
2909A49R5l83J33L8m8m4j75L65k06P0J08N0q0O4m42N8N4L38r6j6k9J41j12k87
2933b55L23n8j62K00R7k34o7M25n45M64k4k44j14o2M68l38K70k64k16L48m66M52
$$ y = [84, 59, 39, -60, -175, -72, 80, 94, -42, -124, 191, 86, 62, 38, 252, 94, -157, 25, 15, -141, -280, 220, 130, 199, 303, 52, -103, 52, -97, -43, 182, 283, -9, 73, -138, -7, -95, -210, -43, -140, -191, 287, -102, 189, 8, -21, 21, -135, 11, -194, -45, 38, -53, -46, -19, 81, -40, 5, 319, 56, 104, -180, 16, 200, -6, -38, 30, 139, -171, -169, -26, 148, -97, -44, -101, -74, -79, -285, 104, -142, 103, 168, -231, -216, 146, -29, -68, 220, 44, 151, -54, -26, 212, -200, 120, -221, -110, -149, 37, -164, -195, -84, 63, -133, 237, -142, 68, 3, 42, 260, -117, -233, -195, -96, 48, 38, 157, 34, -121, 5, -48, 89, -12, 264, -28, 181, -53, 54, -124, -169, -6, -54, 11, -158, 79, -16, 190, 149, 244, -139, -6, 32, -16, -60, -235, 130, -76, -6, 102, 152, 72, 136, -306, -248, -194, 144, 48, 32, 3, 144, 32, -255, 68, 10, -152, 48, 145, -89, -156, 269, -276, 188, 164, -80, -194, -256, 212, -126, 144, -120, -336, 12, -454, -2]
2955bPm2j94K09j17J34J56j48O1p8j17K71k49J15k14L33pk12P4m6l9N1K75l98
2979a77K71k52J12r0m3M35l54m7J71k82L58j3k2j89K77l09J91j69O3J95Jj81k9
3002h3K95l76J55j03J01R5k24K14oo0k36J51K36j05L6l97L1K49j02l95O36k69
3024a57J00J35jJ57m2m04L53L4k01l56M11r4n1K33l4k04j77K19L12n4j7p8Mp8
3048A0j95L45k10M2L89k30k75O5J80n3o1K60j92M6K1K11l29M7J7j43K82q5m06
3071b64L21M8N6k46R6R4l55R7K09P6p9j55K2k8l7Q5J10j88J45l39K79J99r2K50
3095C04m07J6K55j15M3Jl03J09J66J16k98L45j71q4J47j40J92k05j44Q7J50k82
3117b18L49p3J33k80qJ73ml14K78Q9k34J4Q2P4%j96R9J51k46K00j82N2k8J5K29
$$ y = [-2, 5, -37, -231, -22, -139, -5, 151, 3, 64, -14, -131, 140, -109, 6, -208, 125, 118, -94, -20, -66, -105, -54, 221, -177, 94, -158, -46, -136, -179, 256, -98, -145, 26, -256, 102, 89, 67, -122, 155, -154, 37, -132, -69, 126, 127, -54, -83, 212, -164, -9, -112, -11, 84, -140, 74, 68, 8, -228, -77, 159, 54, 90, -307, -276, -27, -129, -524, 112, -157, -57, 78, 77, 234, 192, -212, 141, 175, -26, -382, 29, -65, -116, 117, 83, -121, -298, -79, 233, 179, 162, 84, 88, 10, -185, 160, -50, -8, 381, 151, -124, -59, 121, 68, 7, 267, 75, 121, 142, 353, 24, 71, 88, -55, 227, 142, -264, 57, 105, 161, -85, 11, 105, -250, -153, 56, 132, 53, -102, -80, -108, -145, -60, 50, -138, 7, -332, -53, 146, 54, 304, -103, -87, 168, 53, 96, 97, -206, -97, 69, 185, -113, 232, 61, -23, 124, -16, 176, -29, -173, -86, 64, -218, 131, 58, 191, -89, -97, 76, 72, -242, 36, 125, -109, -95, -13, 61, 61, -135, -36, 115, -131, 69, -113, -61, -89, -74, 155]
3142A55k86O0L1J22j32kJ39j29K74k31j03J2j59L58l5k66R1j18Q6j20L86j42j10
3165a19O9J82j72O5k78K04j14j9N26l14Q5k62Q3m4K42N3j26l20J69K61k69M75
3187C77k12R3l88K50j85M4j31KK60k41P3J45J37m78n9J18J06n0J96j8J41m00M49
3210B29l23n1J67K6J15k95J48L7P4k59M9K3p0Q5J20k69J0K38j12m47M58r8J69
3233B4J08l59J36l3J71j02L36m12J72l68L08J52N1k61j69M37n0l13K54l12J05
3254a25J13o9j30J48J94j84J89k98N2J03J20q6Qj09l5j32j6L19j36J73Mk01L20
3277B22k81k56K29J60J1j57K01kj48nl63M85K4k21K22R8j63k42J92R4l1m9n7J05
3301F8k7l1J09J3l07M7K05p4L7J03k70j3K03j61j13J12K15l92K46m0K07o6r2O6
$$ y = [155, -131, -71, -40, 82, -50, -52, 87, -42, 232, 1, -102, -90, -249, 109, 74, -192, -101, -219, -133, -253, 133, -9, -119, -50, 132, -40, 25, -253, -49, -163, -182, 344, 30, 115, -147, -64, -108, 134, 187, 61, -259, -90, 171, -98, 377, 165, 258, -130, 120, -65, -21, -152, -150, 110, -131, -58, 87, 224, -254, -313, -195, -89, -139, 57, 39, 180, -220, 229, -94, -145, 22, 48, 163, -132, 16, 53, 127, -132, -83, -60, -130, -45, 75, -194, -184, 54, -58, -505, -47, -145, 24, 132, -227, -91, -124, 47, -55, 281, -131, 41, -327, -19, 133, 184, -77, -246, 191, 141, -172, 82, -230, -125, -12, -81, -211, -63, 131, -53, 136, -162, -110, -7, 113, 27, 35, -74, -109, -241, -257, 62, -74, 99, 103, -98, 222, -59, -315, -86, 74, 85, -72, 129, 127, -21, -26, -389, 96, 120, -101, 121, 219, 56, -186, 6, 100, 69, 20, -37, 68, 41, 10, 119, 132, -175, -128, 77, 3, 40, 143, -127, -140, 63, -98, -211, -99, 116, -276, -30, -70, 137, 71, -21, 45]
3325D5k66J30J17J10j14J93m4j86K12j66J26l88J76K6m0k86N90k08J47j64J11
3346A21K5j53R2J0M9k9k3k73K67j73R3l8K27j9l47J09K28o5oN9nL5n09J03N12
3371B90l94J46Mm5r3NP3k69L99q8R5mO5l34J31q9L51m8m30N86l60j24J41P8mm5
3397C7ll9j34K38j99J79J34k76K41j19j6Np3N0k3J08q2J55j12j71K56k63N6K06
3421A55j00q7K14rq5j79K52o5N5m32N46mk60j00J54o0J0pRJ56j11n1K05k78m9
3446a21o9L84Q9l00l5n6L89j31%l5k61K1L0J17k89K84K7J67j10l93L50p3O6J2
3470F3p2M5j66J66j84J37o6P5k93J51L01K00m58J3O3J3K14l09L6J18k21K58m2
3493D2O7N1l81K20N8j22L17n7l24K72l08K67nJ74j91j4L5M7j72n2r8J61j1j28
$$ y = [45, -221, -91, 26, 136, 22, 215, 171, -15, 197, 31, 157, -231, -55, -29, -69, -355, 235, 27, 174, 10, 121, 146, -7, 85, 95, 144, 115, 92, -181, 86, -87, 6, -32, 195, 176, -171, -62, 166, 101, 95, 154, 149, 184, -325, -222, 290, -104, 42, 46, 1, -92, -87, -14, -283, 116, 28, 123, 119, 184, -150, -19, -108, 243, 195, -235, 351, -9, -133, 8, 86, 82, 37, 34, -5, -139, 99, -100, 79, 213, -63, 178, 59, 43, 48, -25, 25, 2, 110, 28, 183, 71, -100, 156, -107, -51, 155, 55, -32, 182, 173, 88, -91, 161, 96, 151, -281, 265, 261, 1, -99, 55, -5, 5, -2, 7, 163, 52, 1, 206, -72, -121, -190, 194, 283, -17, -52, -108, 281, 150, 150, 115, -146, -125, -95, 22, -267, 17, 44, 211, 101, -292, 58, -15, 51, 63, -9, 36, -130, 36, -148, -11, -77, -2, -295, -144, 157, 357, -101, -88, -25, -12, 202, -107, -71, 47, -174, 84, 42, 109, 160, -221, -1, 57, -65, 252, 195, -129, 143, -165, 102, 97, 271, 80, 66, 101, 148, -24, -76, -174, -13, -24, -152]
3517a52K72j62J44k82L55j69l7J75j2k04l7k93K42K21j35R5l0k04O6K25j54L25
3539B49k86q5Q9L22l77J6M6J03o0j82J98r5J70k19J61K1j09L00j15k06n6K33j78
3562f0L4N2j66J62O0j29J81O2j11j67K0N2k70L17O9k92J95P8k27O8J70K5j56o8
3586a01l23K96J55J81k01j35K55k92Q0j61L09J00j90Q5K3k10j11o0J80l6K48k8
3608F4R3j25m1Qkp1J38L13n00j64K22K49j98l35K85R7n0l8L1k3p2J37j17Q0j45
3633a64K92j8j83J77N5j3j85J67l03K04nM6o5n3K15k56J78J39k44J7P1r1k1J3
3657b7k88M04o2N9r7j79K28o9M4r6K80k44j1K25nj23m1j71N3L19l22J07jN3K39
3682B75m14J31K49k99m5q7K32j65M7Q9J67l72J62K16M3N0l46n6L27k83J46J96
$$ y = [-152, 120, -42, 102, -180, 175, 6, -31, 144, 132, -72, -109, -402, -160, 61, -74, 21, -9, -213, -147, 78, -76, 249, -37, -122, -33, 289, -88, -72, -26, 77, 17, -165, 33, -62, 108, -111, 50, 71, -38, 262, 147, -59, -115, 118, -60, -26, 26, -140, 22, 82, -47, 134, 196, 85, -82, -62, -10, -280, 37, 106, -186, 9, 87, -140, -72, 98, 123, -33, -101, -424, -128, 27, 208, 7, -128, 127, -165, -85, -246, 63, 163, -27, 58, 81, -129, -240, -300, -120, -156, 92, 64, 157, 32, -9, -1, -3, -74, 64, 377, -123, -287, -65, 184, -14, -349, -64, 33, -17, -55, -24, -47, -119, 18, -99, -19, -164, 128, 110, -73, 104, 159, 146, -39, 128, -175, 29, 24, 70, 5, -48, 167, -89, 89, 228, -16, 1, 72, -19, -40, -27, -315, 89, 27, 86, -11, -190, 38, -31, 13, -83, 197, -47, -58, 167, 162, 39, -2, -173, -120, 199, -123, -16, -17, 36, 275, -139, -8, 241, -58, -103, -190, 42, -123, -76, 13, 180, -192, -30, 186, 229, 279, -67, -123, 204, -79, 67, 263]
3704B63l15Q8QN9k14J45J76m26K64k82K81j45j81K95l51K50Q6L3l90M13j7k97
3726b57O4K94j63J53j51k3L80k78j19R9M8Q9K77l99Q4k07J36j8q1k7J7K79R8j30
3750A65L9p4j21p9N8j54J50KL3l0j50K25k93L8J3O3l7K42%j47J16K43l66K40l57
3775a81J07l05L81q2J73q6J7PK8J75k76K57j38r3N4J46m5q3r5l7J78j62K92j18
3799A14o7j8K50m17J80m0l8Q3j07J46j40K30l52J54K26l71P3K03k42J41R4l45
3821b43J22n6J01q2j46K30K93k02k13J23K39k83K81q0j07j08K06l14J19K75J22
3842B77j68p4j81J40M2k27J78J5l8J59p8m9R9lj05J08J06k68M2K07r2j80J30K6
3866F6N2o7k5O0j2k55P6J32Q4m12J35L96j60o9J51qj38Jk72J79m7K56n5J40j14
$$ y = [263, -52, 36, 44, 103, -111, 34, 210, -216, 48, -234, 47, -98, -279, 16, -335, -85, 1, 34, -356, 57, 40, -257, -193, 101, -62, 91, -60, -83, 297, 19, -100, -1, 47, 136, 413, 14, 98, -109, 27, 9, -72, -99, -82, 197, 295, 165, 204, 130, 9, -70, -12, -166, -16, -14, 19, -11, -161, 64, -229, -191, -178, -115, -152, 90, 90, -57, 59, 302, -64, 176, -181, -74, -379, 2, -80, 93, 7, 24, 31, 59, 234, -42, 215, 77, -16, 38, 184, 139, 56, -39, -76, 102, -60, 232, 114, 47, 29, 279, -138, 42, 2, -36, 47, -60, 86, -54, 176, -176, -22, 204, -167, -94, 109, -133, 8, 102, -243, -121, -177, -76, -158, -304, -74, 219, 17, -196, -73, 166, -117, 164, 84, -23, -131, 75, -239, -120, 155, 277, 109, 35, -146, -6, 36, -191, -13, 2, -36, 123, 45, -4, 95, 92, -13, 95, 201, -67, -25, 182, 90, -90, 40, 66, 118, 51, 26, 86, 74, -181, -105, 27, 111, -301, -166, 230, 70, 1, 152, 144, 6, 7, -265, -86, -133, 123, 68, 208, 94]
3891I4m7Q0K8j64Q6p9J62k05m2j66q3J61J61q2M9J53k19j05l7M24j06o7l0qJ31
3916H9J22j93j66L38l88M73l32k2K88r6r7j16L3k1M0m0j44J88N6l2j71L73j3k15
3940d6l60N11J86l77O7j6q6K90l51K92q0j07j29J3J31J61J93l26K75j20j51Lk5
3963e2nO3j32L74l42J31l3O4J52l38J41j64O2J81k6k67J63k28L36j77K35j91j73
3986b26Q5K22J63r9J91l64j73J15J68j92J61k5K7r9K9K98k74n8R8o3R1Q2p0j47
4010f0K18l39J77J73Pn2l4j43q5J0r1K04P1J30J2j82j59J39L6o9Q9j37J61j70
4034i4J24J98k4k52q6N1J60j04k74L39l14K65j56K03p0n8L33k46l1o8J06O8k13
4057a43K36k65K15r7J70j92P3o9pk43M4J43K70j24l7K33q1j14K17m44K9K39k0
$$ y = [94, 47, 127, 155, -9, 77, -2, 160, -45, -87, -253, -336, -175, -14, -96, -47, 106, -113, -218, -255, 169, 63, -4, -34, -42, 89, 211, 18, -148, 190, -198, 275, -57, -79, 209, 113, 16, -100, -67, -88, -48, -88, -232, -44, 12, -20, -191, 182, 169, -46, -406, 105, 291, -86, -19, -35, -121, 169, -182, 110, 30, -77, -206, -193, -62, 99, 292, -34, 241, 121, -30, -27, -52, -57, 6, -126, 248, -94, 37, 4, 68, 220, -118, 23, -141, -79, 102, 76, -191, -28, -256, 80, -97, 138, -53, -226, -141, 81, 244, 145, 336, -28, -201, -86, 82, -110, 51, 26, 53, -46, -17, 281, 7, -51, 47, -16, 75, 157, 87, -60, 158, -181, -4, 169, 176, 124, 90, -53, -138, -128, -219, -15, 56, 186, 198, 16, -143, -4, 32, -37, 52, -85, 76, -94, 30, 228, 204, -48, -134, -83, 77, -27, -301, 38, -276, -11, -167, 36, -34, -92, 241, -5, -36, -104, 2, 70, -143, 93, -172, 43, -54, 116, -76, -3, -72, -79, -322, -278, -135, 135, 11, -26, 207, 126, 12, 229, -215, -186, 53, 33]
4080C3J44k39R2j09O7j17L44j63O6j12J4nJ72m11K26l71K72J21P3j10M0n9j50
4103a82qJ75J86o7k61L49j4k28K85n08L81j96o6N4j32K44j84L95k32K5k74N6K20
4126A8N8J6r5j10K7O0k9L00k15J59k40K49l52K8j65J94J05r7K32r6j5j86Q9J6
4150d9j34K79j66Q6J07j54K2NL4k5J61m85K62j00M6Pj38K03l8K79l84j76N19k42
4174h1j46K27j92M23k23K24nj46j49K66k95j84M16j96j67J47J7R0m25L62j20J26
4196c1j24J70Q1k21J68j9K36j38j52J16Jj2J16j07l5J90L6m51p5J47j29L30r9
4219bJ6O3jl1Q9j15k91L54j23L5O9k27L19j76j23Q8k41Q5J13Oj8j5K14L5j20j42
4245a39J63J69l43L1M63n86P4N03k86J20l59K02n1J66j28j16K86j51j03K13j70
$$ y = [33, 177, -62, 30, -79, -12, -129, 215, 52, 118, 6, 20, 15, 187, -224, 2, -369, -97, 24, 97, -13, 27, -32, -182, -190, -15, 171, 104, -157, 192, 178, -50, 235, -273, 108, -88, -154, -100, -232, 12, -172, 223, -9, 16, -258, -202, 18, 76, 92, -3, -113, -86, -26, -55, 245, 30, 189, -51, 198, -154, -126, -291, -97, 8, -89, 143, 47, 32, -154, -65, -49, -183, 96, -70, 16, 123, -31, -9, -4, 30, 5, 166, -319, -57, -157, -111, -104, -242, -39, -77, 202, -182, -358, 161, -81, -227, 0, -192, 231, 8, 232, 227, 81, -68, 198, -97, -281, 135, -61, -228, -81, -64, 26, -399, -37, -157, -31, -155, 15, 96, -125, 43, 24, 260, 122, -30, 86, 87, 75, 191, 84, 49, 239, 275, -176, -251, -104, -233, 97, -2, 14, 77, 76, 45, 134, 19, -272, 82, -41, -6, 63, -164, 155, -21, -144, -56, -297, -212, -99, -93, -111, -126, 88, 123, 3, -139, 24, 193, -150, -119, 344, -242, -168, 335, 49, 169, -190, 12, -39, 127, -1, -117, 169, 18, -85, 128, -42]
4266d2K35j75l8j35K60m1O2j97K71l62J35J10r9N4k43Q7MJ48j59L41kj76J61m64
4290b65O02m37O6o3J93p6j5n7j26J76j33K37j89j84O6N2PM7j02J37R1J09l0n53
4314d47L49K14p2k93L38k45J95M4j95Q3L12l20k96L47LK97o7m94J81L3P6K16p5
4337A84k21K81j47o2l0j50qL18k71p9n2j75J68M92L8l66J41k47K06j44N1PJ0J61
4361A05j0k48K56o1n7R4j86K54j87p0L48j90j27J42Q8o3r4p4k28M38R5p4K6l18
4385a41L49m28J00J11M3k1qr0j02L45l87o5J84J39j09J68j99R2P4k65k9L92j42
4408A1m8R1k43J34J87k37J87k98N3M78k88j39P9J08N7j84M21k02l45M13k09R4
4430A20j53j22j28L67K85l74P8qo3N8k08J62qL4L3K31l03K4J93n63L30J21o0l5
$$ y = [-42, 193, 18, -20, -155, 105, 64, 126, -71, 200, -162, -27, 83, -16, 38, -205, -118, -114, 34, -125, 216, 214, 38, 199, -265, 337, -100, -34, -97, 96, 20, 5, -52, -178, -2, -135, 102, -87, -271, -205, -153, -146, -99, -201, -64, 27, 136, 106, -447, -98, 116, 44, -249, 89, -156, 39, 83, -112, -29, 283, -37, -333, 14, 17, 314, 247, -247, -66, -33, 43, 259, 184, -37, 244, 97, 35, 5, -145, -153, 165, -106, -185, -237, -412, -244, 248, 286, -80, 61, -186, 20, -124, -73, -66, -56, 105, 95, -153, 103, 42, -15, 79, -107, 147, -40, -110, 238, 48, -79, 63, 151, 88, -6, -80, -308, 130, 225, 151, 177, -141, 208, -220, -120, -9, 34, 13, 5, -85, -187, 158, -229, -294, -110, 29, -80, 88, -111, -19, 55, -210, -239, 153, 11, -37, 54, -189, -55, 132, -105, 82, -216, -163, 315, 27, -112, -33, 75, 132, -52, 369, 167, -178, 235, 26, 120, -33, -155, -283, 84, 369, -5, 73, 65, 2, 60, -148, 14, 6, 40, 73, 304, 1, 25, 218, -345, -15, 106, 46, 11]
4454A1j37J99j87R2q1L55k82PR6J15ro8r5Oj29J6R6L6J37R8j12Q2l20k11K34J29
4480G8k14K43j34J33j89L7O8k63L54j4j23j37P5M0j5l9K01k25L87k36J51p6j20
4503a8p0J73K0l4j3l74L62R8j13m2Q4k06J98k2j21Q2M22m99j8K27l03L41k43k0
4527h9o5N33m01L07m27l9L15j4j16J35k95JR2O9J19k73N4M2j08M19j62j32J05
4550G0M9K2l72r9K61RK9j44R1K14j85o8l0j07M40k43j3R2O7O5r8m1k23L76j93
4575c1R3j20p7%M03R4m44j2Q6Q5O2o9l53K88j04J91j56K57j02J07j89r4q9K44
4599G0j47N9j26O2J21r1R3j62J62K0N3k89J2Q0l6j03K66p9J92j70M7q2P6j8j2
4624bn2l1j05M49J6j36j79J25j78j75K44k29K39K22l30M06l60k32M07l22L47k71
$$ y = [11, -126, 73, -114, -22, -103, 252, -30, -23, 73, 188, 179, 111, 16, 22, -107, -91, 5, 41, 178, 276, 164, 246, -74, -285, -51, 78, -136, 107, -27, 106, -83, -46, 22, -241, 113, 99, -24, -161, -86, -46, -61, -100, 101, -124, 263, 27, 178, 102, -18, -88, 85, 105, 71, 58, -316, 46, 144, 31, -11, 73, -133, 65, 43, -78, 4, 426, -73, -91, 136, -167, 174, -69, -89, -154, 379, -22, 285, -142, -181, 134, 120, 4, 139, -156, -155, -63, 6, 125, -148, -94, -52, -160, 259, 97, -35, 70, 119, 141, -231, -330, -69, -60, -31, -175, -84, 130, -55, -123, -153, -260, 180, -63, -76, 16, 83, 148, 50, 9, -214, 162, -31, 62, -58, -135, -135, 268, 362, -82, -94, -8, 77, 139, 70, -283, 5, -99, 92, -64, 193, 91, 198, 9, -85, -174, 70, -77, -18, -144, -82, 39, -52, 41, -121, 41, 61, 114, -175, -163, -83, -119, -222, 44, -35, 157, -13, 34, -48, 28, 10, -2, -54, -85, -190, 259, 275, 139, -40, 85, -93, -268, -24, -253, -14, 208, -122, 284, -76, -308, 99, -223, 124, -147]
4646a47L27l77K14k94M68l08L31k39P1j68L26k25n1%n7O7p5J37j59L55J9n2k83
4669a20L57l01L0k04Q3m2J48j14K56mm76O11l06J63k63K87r7jp8m8J7o7J45K27
4693B03m44LL32p1l4q6M02m26J35M8O4j17P7j14k0j31P2K03k15j47L76J74j46
4716A38p7l55L60J87o5O8m03J18k16K19J37p3r3P4J28k36P8J40k57K05k08K55
4738A24j5k4N6l72J41j54M5J35r4J24J06Q9k03J2J27j2l4J27l35K58j70L08j41
4761I8J06j14J38l24o8J56j3l2R3l5k02K56K8J3m5J78r0k76m9J89R7l9J38k61
4785e8M69m35J09j18j27K68k9k12J12j99J13n0K99j8j64J17k01L88j21k14j34
4806b05J62K73Q7k88J96k91k41M73m4l2l8R4k50L3J7K14q5j70L03j68k41Q4K47
$$ y = [-147, 180, -197, 17, -277, 191, -117, 214, -25, 46, -122, 204, -21, -72, -72, -129, -62, -137, 0, -159, 196, 215, 163, -120, 237, -64, -34, -238, -155, -197, -49, -163, 93, 89, -387, 224, -82, 81, -182, 105, 8, 7, -71, -119, -102, -169, -24, 203, -241, -238, 94, 23, -11, -97, 305, -121, 14, 62, 126, 9, 86, -28, -48, -179, -107, 96, -119, -266, 110, 284, 138, 61, -294, 66, 253, 188, 256, -147, -29, -245, -26, 111, 38, -55, 19, 147, -89, -11, 129, -128, 77, -131, 124, 109, 85, 141, -231, -90, -244, -199, -64, -158, -34, 72, 161, -42, -30, 97, 85, 51, 178, -157, 101, -69, 239, 98, 204, 90, 228, -96, -164, -8, -21, -53, 40, 5, -197, 59, 87, 100, 55, 233, 143, -133, -182, 7, 104, 65, 203, -58, 411, -24, 85, -33, -160, 108, 79, -133, -21, -220, -107, -157, 142, 124, -40, 77, -124, 264, 143, -71, -205, -43, 230, 317, 29, 225, -66, -307, 166, 122, 90, 52, 146, -104, -71, -54, 160, 75, -95, 208, 40, -201, -117, 130]
4829A30J34j51K5j53M0j00K3k38M09Pj94K15j23p8J23j93k8L05q0n4J02j83n4
4852a16L5J72k78N1K94j77J02k76M41k42k49M49k27k8K10j82K94M1k96k51L35
4873A02l52J71L38n04O8J85n9l6L41l82K8o0J03p3J39J75j80m0jJ47p1J45R9l00
4897a7J1j04K45k18K54j92j27J53Q0j52J59q2j80P4K48j47M6J77j31o1M7J17j62
4920C8n5m0J38j10M47m04L3l31L39o5j34J26J35o0L4j12J95l06N6M39m48P7jP3
4944F4m1j44K23J90p77O46r5l50L13k08J7K48J43k75j6J87p9j88q5J45J24j85
4966a43K41p6k88K21qM0J00q9J41j53q7L25l88K62k12Q1oJ73k88J58J57K4o48
4989d63L36K28J02k64p4O0p5L33n40M82p4N0L5J3l06K05K26m37r9J90k18L80J06
$$ y = [130, 264, 113, 138, -15, 25, -75, -52, -290, 119, 126, -68, 147, 24, -54, 69, -124, -152, 153, 73, 19, 121, -62, -116, -81, 91, -187, -136, 158, -19, 83, -193, 248, 6, -243, 206, -21, -49, 161, -21, 273, 314, 18, -233, 102, -250, -79, 259, -245, -177, 8, -51, -87, 254, -128, -100, -160, -57, -130, 9, 184, 4, -36, -37, 110, 39, 184, 283, -17, -6, -110, 135, -83, 171, -21, -148, 5, 85, -67, 92, 10, -170, -96, 152, 5, 51, 228, 97, 36, 83, 200, 38, -17, -57, 81, -29, 418, 14, 47, -284, 55, -10, -144, -18, 117, 57, 91, -21, 174, -132, -76, 363, -85, -8, -9, 64, 23, -121, 102, 292, -485, 161, 66, -284, 29, -179, -162, 86, 229, -46, -62, 125, 46, -142, -227, -82, 42, -143, 98, 22, -266, -45, -53, -13, 87, -2, 139, -14, -101, 224, -164, 98, -114, -33, -39, 134, -154, 4, 161, 185, -463, -127, 101, 203, -61, -135, -75, -150, 183, -357, 125, 51, 101, 136, 149, -157, 48, 274, -163, -262, -72, -290, 90, 196]
5012A96m07M56l94J48n9L25k88J2m5j41J25JJ04m7K6J32k47J15R3J6k3o3p6J15
5036G4j6l8m5K48l82L25j35K54j39j85l5K4J94K4j32j29r2R4J48R9m51O41j88
5059A58r1K3j60N5P0k89J04K61l61K45j02M76n38O0J08n2N3k78J60J18M07o06
5081a79J92q9j9k8K56l15K68n7K75m04k98M12Q3N1j63k1L7j64j69R5K18n7J77
5104A01q2Q9K8l11J38j18K17k30Q5L07l42J51J37r0K27k35k61Q0K06l1r3J73n7
5127H9j86Q4J59k31J56l9L9J32k32J91o4M1q2J31m55k1R8J56J61k37j54O39n06
5150a31J33q4m2j59M11j56K54j66p1J43j05K0R3k7j98L4R4J35j58K7J4j27J20
5173E4k52K81J76k22K08k62K12l69J03k90M28o2J01K3j84L44k16K4O9j24n8r7
$$ y = [196, -211, 245, -149, -1, -60, 265, -23, -11, -56, -197, -72, -71, 33, -14, 12, 144, -103, 12, 105, 121, 98, 35, -41, 74, 58, 20, -25, 223, -159, 166, 31, 285, 146, -39, -74, -50, 144, 168, 36, -93, -185, -91, 57, 156, -295, 346, 158, 67, 90, -70, -15, 55, -234, -130, 131, -230, 15, -87, 389, -149, -89, 19, -33, 20, -258, -98, 20, 427, -179, 13, -76, -95, -123, 133, -182, 86, 29, 304, -100, -398, 14, 97, 148, -15, -36, 1, -163, -332, -237, -19, -76, 101, 19, 108, 136, -175, -37, -155, 62, -168, -83, 224, -118, 33, 170, 80, 307, 72, -189, -109, 97, 66, -27, 146, 89, -97, -13, 146, -85, 71, 32, 71, 203, -29, 162, 98, 139, 57, 188, -267, -288, -190, -34, 127, -110, -264, 375, -131, 2, -82, -124, -283, 128, -28, 226, 60, -11, 132, 27, 47, 140, 113, -85, -51, 43, 178, 20, 47, 61, -66, 54, -198, 83, 259, 37, 245, -17, 195, -174, -71, -361, 67, 5, 106, 129, -55, 289, 73, 97, 166, 42, -16, -113]
5195a13r7J82J65k45P1k24K09J21Pk45O3L19l28R9PR0o6j10l2K24j38N5j07kq5
5220a80L49j18j41K79m49M73l02J70K1j98M0J91j64K24n2j61o7O9j14Q3k4j3k2
5243a06j48L43j92jRO9N5j08J30J00l21K64j23J92j55j42N1o5L44k76P5j51L6
5266a20J10lm8m7O1j31K69o3m9J42k02k6K9k2O0K7p3K92m47j4N00Q6m25J01K57
5291B64k61o6k8n3K56k27N8O8j83L36k91K28j1K28k91j64M91n29L45k00J90l5
5313A25l39J53j83K60j18L48j95P7j54j07l5K04p4j62K68k75J40J18j64J78M0
5334A05j89%k1J36M3k47K44K3o8j33J96J5J8n8j50J28J7o9l71L51J24m3n5j27
5358a31J07J61N3k83K11j75J88k30M4oM06m71L08N4l33Q5j92J98K4pL04r4m69
$$ y = [-113, -210, -28, 137, -108, -37, -261, -52, 69, 76, -169, -106, 213, -115, -16, -9, 81, 15, -95, -127, 97, -41, 14, -93, -95, -180, 169, 51, -90, 189, -260, 213, -89, 81, 102, -96, -56, 135, -29, 195, 143, -18, -85, -16, -130, -47, -71, -84, -106, -254, 89, -103, -104, -95, -26, 29, -79, 51, 151, -170, 94, -29, 163, 8, -134, -83, -148, 196, -80, -5, -156, -120, -10, -13, -61, -108, -47, -178, 91, 28, -21, 121, -81, -107, -78, -100, -40, -13, -86, 206, -241, -255, 245, 331, -94, 7, 264, 3, -63, -91, -144, 112, -115, -57, 11, -172, 164, -127, 101, 90, 318, 27, -137, 354, -175, 170, -30, 160, 125, -214, -61, -244, 16, -102, 246, 51, 128, -26, -133, -168, 36, -38, -200, 68, -207, -67, 51, -113, 65, 105, -84, -84, -105, 31, 74, -173, 71, 94, 26, -107, 89, 104, 122, 64, -86, 42, 59, -10, -381, -30, 94, 51, -4, -131, -24, 137, 190, -93, 118, -57, 131, -99, -55, -61, 345, -126, 182, 236, -97, -12, -204, -6, 18, 11, 315, 221, -248]
5381b48L13J45k34q0K27k56J28J39n8j5J36j43J84n31Q8M51j40j15J09k54J82
5402B8Oj71M70l77J12K51k85J06m3j33K22j23M0q6Rn9J17Mj99Q2j07J06J48m0
5426G8j73O2rR9J37K00m20p3j20O6K40j66K98l54K03K4Kk25P4k2J42Rq3J57l67
5451b21O4M4j97J89N1J18J0j28l0qR0J6K13j41qK8P1jj09L8M2MP4n60J42K91j06
5478b4J94k66M0L2o7L4K33jQm9O8j50j90J74k9q2Q4p1L9nK6k38N04l75K54k12
5504f9K18j84K18k09L64k72kP0k70K27R8l74J58M20m10l65N54k13J94l21N44m61
5526h5J9j40N38l30k03J22K07J93k69K7lP1n6j51O0o6J63L2n26K02K74k2j70L93
5550B80k03k76J03O4j05L17m47L32m15P07l76J31k18j10R1O9Q5R6j55j32L31k66
$$ y = [-248, 65, 210, -24, -104, 123, -133, -5, 134, 76, 61, 197, 54, 238, -293, -205, 246, 106, -9, 100, -154, 28, 34, -137, 333, -44, 68, 319, 34, 140, 97, -36, 186, 63, 103, 17, 26, -33, 84, 88, -111, -29, -136, -30, 118, 78, -95, -33, -42, 57, 194, 394, -26, -99, -219, -153, 87, -79, 219, -135, 68, 92, 94, -131, -57, -79, 63, 72, -11, 146, -221, -157, -113, -310, -121, -70, 48, 58, -70, -100, -108, -18, -2, 211, 70, 62, 90, 161, 160, 51, 89, 131, 135, 209, -351, -209, 82, -24, 170, -96, -56, -24, -91, -57, 176, 175, 183, 134, 202, 52, -138, 36, 7, -75, 9, -62, -23, -28, -2, -240, 264, -111, 143, -69, 149, -35, 183, -26, 338, 66, 64, 134, -136, 91, 189, -185, -27, 393, -17, -382, 172, -41, 153, -168, 376, -85, -66, -206, 332, 2, -201, -79, 128, 321, 52, 79, 76, 147, 91, -60, 0, -66, 97, 129, -397, -195, 79, 57, -113, 280, 77, -199, -96, -32, -137, 180, -267, 65, -350, 357, -19, 112, -106, -216, -125, -56, 29, 125, -30, -162, 169, -97]
5572i7J86k25Q6K47j05p9j99J59M8J5R4q5K72j25j61r2Q7j37J73k14J21j92O0
5595a63L79k65j09L66j01j34J27l7o9J3kJ30j09J56k4j40J90l68N5n1o9k94L11
5618b08L01K49l38O7j14J00J36j47J8k34j32M15k33J19k7K67j58j24m2o1m7P7
5640a16l5QL39Q5j81j68K16j52J85j45j82J43lO3Oj75J95k71Q4J98J24L8l41k2
5664a07l0K77k9m2k51J83K0n2J02k12PJ54KJ51j38j81o9K79l0Jl72K51k5j0r5
5689b16K36l8p9J12l6N8J46k60N1K05l17K10J20l07J48K48m26r1J75J12q1P7l1
5712A6J06k34l5M6J42QJ10m67J40J35J44l26O1o0J64J91j44k1l6J24J62j51j11
5735c6J15k52O9J85j12o8J21L37k81j49K8J72L8j36j31j63K52J64l11J19q1R1
$$ y = [-97, 89, -136, -50, 197, 92, 13, -186, -27, 21, 36, 130, 45, 317, 192, 31, -61, 26, -111, 62, -152, -31, -223, -163, 216, -49, -158, 208, 107, -27, 100, 63, -6, 7, 5, 135, 26, 182, 158, 18, 208, -160, -105, -156, -225, -519, -208, 93, 342, 4, 71, -43, 57, 193, 46, 64, -170, -302, 113, -120, -1, -28, 239, 81, -43, -85, -146, -193, -116, -151, -143, 196, 281, 100, -68, 148, -4, 181, 36, -146, -3, -6, 57, 63, -112, 83, -188, -104, 94, 218, 256, -85, -107, -137, 140, 111, 69, -182, 1, 21, -31, 71, -141, -134, 20, 22, 173, 35, -146, -215, 64, 34, 35, -337, -86, -111, -121, -216, 20, -18, -97, 15, -21, 37, 183, -77, -26, 179, -138, 72, 192, -115, 33, 281, -145, -236, -61, 51, -30, 47, 16, 122, -112, -147, -101, 41, 49, 159, -308, -168, -33, 111, -215, -154, -214, -50, 141, -3, -24, -60, 64, 226, 75, -36, 79, -173, -104, 81, -31, -99, 22, 359, 78, -71, -43, 129, 167, 31, -100, -263, -11, 153, -158, -39, -120, -29]
5757b9j64K32k34K48Q5j73N7J13R9m06Q7o0J40N2J47l38K34n7J21j83o2J62k75
5780b04J83p8M8j76L27J9ln0j17L11k58k83K53o8MJ05J03k99K22k6j67J7j07O9
5804a75K83j90QJ44o3R1j36j00m1J27M52j51l38Q3r8J43pJ3kk51K80j23Q0j80
5828a51J67J84j3j7l33J2J12J88o6P4j92L0q7K93l0k31P5l82N04n0m57K27K68
5851A25J71m63J37l3Q1J07r4j7l1R5j33L7M0J97l01K23o7M9o3m02L92K6p9p9j73
5876b55J59nM7k0J05n5J9L82n36L37l56K92j47j23K8M85k51n7m3J19p7J04k4j55
5900b7K01j07K8k62L45l01Q5j11N6J41J64p2R3Rl71J60j85J57N8k32J26j8j63
5923b26J23j64K34j10J66L7J4n7p7Q0J66j39j18J53L1k80LM9L48o0j25j51J08
$$ y = [-29, -193, 39, -195, 53, 138, -35, 22, 135, 234, -172, -85, -145, -5, 47, 194, -144, 90, 33, 154, -29, -91, 71, -204, -21, -99, -51, -227, 100, 119, 116, 66, -51, 260, 2, -281, -28, -96, -92, 13, 116, -183, 39, 13, -154, -137, -244, -175, 108, -82, -74, 70, 7, 98, -38, -138, -179, -52, 400, 249, -89, -6, -104, 39, 32, 45, 43, -208, 72, -51, 29, -151, 16, 200, 187, 170, -163, -151, -39, 149, 83, 157, -35, -5, -92, 201, 171, -60, 15, -367, 137, 87, -370, -143, 125, 296, -167, -30, -63, 18, 125, 31, 14, -17, 78, -55, -18, 22, 219, -82, 141, 74, 123, 60, -342, 50, 76, -3, -82, -255, -96, -101, -54, -74, 31, -24, -5, 377, -159, 178, -178, 114, -33, -156, -128, 357, 106, 49, 6, 125, 48, 152, 128, -27, 174, 67, 95, -167, 178, -123, -38, -149, -93, 48, 212, 140, 233, 242, -129, 31, -154, 3, 61, -171, -45, -63, -226, -103, -267, -33, -143, 23, 60, 74, 17, -60, 20, 186, 47, -71, 82, 113, -167, -164, -115, 233, 173, 48, -103, 5]
5946EJ56k08J81j60K76J07m30J55n1kN0j46j8m2M41l31P2j03P1k18j4L04k60K52
5970H7k0L22o00j03J91n7J79Q0R4j9j77l32J44J74k65J92k45M89P3k61Q3k09J67
5993a3j56J43M2q9j92N02r1K7l94J67n2J2J5J31k82J30J86P9l88J43P7j37J09
6016c1Q4K1j46P2N3l45K15R5o0q2K51k9k59k35J87Q7J50k78K35L16l7k60j80k17
6040c93M05J66k88K10J70k83J00J70r0k94L19j70n5q7j38K28RJ3k70M05k67M19
6062B79m70K02l3J31j12O4l8l68J38L10J24O2m45J49J65j42j56J28o0j05K67l06
6084b16L4L55l33K33k99m4M07l14K28J20k94j45N03k61J7p6J06M6L6k54J21K56
6106B26l87L3N0M0j6J39l27j4O3K79k34K45k6j81J97j5l0o0j9K22k30K96j58k15
$$ y = [5, 161, -47, 134, -26, 250, 357, -73, 82, 31, 29, 79, -67, -85, -127, 314, -17, 55, -48, 23, -195, -209, 95, -165, 87, 67, 389, -211, -314, -123, -180, -1, 79, 173, 154, -23, -355, -211, -37, -302, -110, -355, 134, 207, -54, 29, -180, -13, -169, -26, 16, -73, -265, 237, 146, 173, -221, -54, -106, -94, -79, 52, -230, -100, 86, 165, -223, -80, -3, -140, -31, 53, 74, -72, 0, 53, -292, -77, 18, -42, -124, 127, 98, -161, -396, -209, -122, 28, -250, -15, 301, 264, 4, -176, -393, 12, 178, -110, 100, 270, -13, 87, 257, 167, -127, 192, 22, -33, -120, -258, -30, -21, -8, -278, 127, -140, 279, -191, 11, -22, 109, -3, 61, 23, -345, -207, 103, 227, 289, -156, -7, 158, 16, -140, -12, -72, -177, 90, -216, -182, 173, -160, 73, -226, -270, 137, -177, 51, 171, -123, -268, 235, -26, -9, -85, 21, 67, 103, -151, -30, 226, -161, -128, -78, -38, -54, 85, -242, -256, -193, 86, -148, 97, 71, -110, 87, 72, 42, -18, -37, 185, -45, 251, 93, -122]
6130a22J53j33J71j98%k5O7R9J18m5nl9P9k07J7J60J16m44j42M45Jl2j21K53j96
6155c0j3L16j26l36pL49j42k2n4q3K59l31L66k85K37p2j82J03k2K04O2k66n1j35
6179b61K11j19L20k81K09j79l2K25j7j32R3M2k25J99k22K68r5J09j74L7p2J9P6
6202aJ8r8j24r6M44n77M63O8l64Q2J29n5m8K63l55L52j26J8M6j11r3J55J47l27
6226a90K70j24M7j15K33k08j16L8L3J13j63K19j62K92j95M8P3j88Q0K10l68L20
6248A47j34l5p3Q5M11m03M5Q9k72R0O0J47q9n8R9J98n29J94j76j1L89j23k58L24
6272A17j84K24k14J60P0k57j4l6M47l39O4J91j70k97K31N2q1J60o5l33L60j46
$$ y = [-122, 31, -102, 69, -129, -129, -154, -87, 12, 130, 85, 80, 41, 120, -87, -70, 90, 206, -238, -380, 65, 66, 34, -87, 166, -30, -43, 273, 147, -189, -196, 153, 11, -11, -65, -148, 111, -220, 146, -139, 98, 26, -156, -53, -75, 129, 191, -75, -126, -261, -50, -169, 151, -130, 79, -100, -132, 93, 76, -56, 37, 79, -146, 53, -169, 99, 4, 113, -61, -24, -96, -77, -1, 17, -81, -205, -301, 143, -434, 29, 97, -267, -185, -56, -111, -159, 104, -251, 101, -25, -7, 39, -72, -165, -10, 137, -190, 80, -44, 3, -112, 121, -87, -203, -165, -132, -19, -182, 37, -125, 167, -28, 20, 93, -95, -15, 195, -173, 147, 13, -22, -95, -10, 401, -2, 43, 132, -140, -50, 10, 157, 68, 10, 109, 307, -222, -28, -204, -215, 174, 51, -207, 117, -67, 157, -57, 103, 173, -84, -98, -134, 313, -26, 38, 229, 59, -238, -7, 45, -36, 124, 59, -274, 86, -60]
$$ [...]
8191d1
##END NTUPLES=NMR FID
##END=
