##TITLE=1H_DE-130_DEP_TFA
 200.13Hz, DMSO-d6.
 8 sc
 29.6.2026
##JCAMPDX= 6.0         $$ Bruker NMR JCAMP-DX V2.0
##DATA TYPE= NMR FID
##DATA CLASS= NTUPLES
##ORIGIN= UXNMR, Bruker Analytische Messtechnik GmbH
##OWNER= pz
$$ XWIN-NMR		Version 3.5
$$ Mon Jun 29 13:57:27 2026 Russian Standard Time (UT+4h)  she@DPX200
##.OBSERVE FREQUENCY= 200.1313
##.OBSERVE NUCLEUS= ^1H
##.DELAY= (6, 6)
##.ACQUISITION MODE= SIMULTANEOUS
##.ACQUISITION SCHEME= undefined
##.AVERAGES= 8
##.DIGITISER RES= 18
##SPECTROMETER/DATA SYSTEM= spect
##.PULSE SEQUENCE= zg30
##.SOLVENT NAME= D2O
##.SHIFT REFERENCE= (INTERNAL, D2O, 0, 14.3821)
##AUDIT TRAIL= $$ (NUMBER, WHEN, WHO, WHERE, WHAT)
$$ ##TITLE= Audit trail, XWIN-NMR		Version 3.5
$$ ##JCAMPDX= 5.01
$$ ##ORIGIN= Bruker BioSpin GmbH
$$ ##OWNER= she
$$ F:/spectra/data/she/nmr/H-C/1/audita.txt
$$ ##AUDIT TRAIL=  $$ (NUMBER, WHEN, WHO, WHERE, WHAT)
(   1,<2026-06-29 13:55:56.75 +0400>,<she>,<DPX200>,
      <created by zg, POWCHK disabled, PULCHK disabled
       configuration hash MD5:
       00 E9 B6 7A A2 85 ED C7 34 08 36 98 17 FE 4E 26
       data hash MD5: 16K
       97 68 F4 BF AC F5 6F 48 85 42 C3 AC 41 AE 33 EA>)
$$ ##END=
$$ 
$$ hash MD5
$$ 86 31 53 8B EB 8E CE CC AF DD BB 45 0A 26 4C 97
##$RELAX= 
##$RELAX= 
##$RELAX= 
##$RELAX= 
##$RELAX= 
##$RELAX= 
$$ Bruker specific parameters
$$ --------------------------
##$DU= <F:/spectra>
##$EXPNO= 1
##$NAME= <H-C>
##$PROCNO= 1
##$TYPE= <nmr>
##$USER= <she>
##$AMP= (0..31)
100 100 100 100 100 100 100 100 100 100 100 100 100 100 100 100 100 100 
100 100 100 100 100 100 100 100 100 100 100 100 100 100 
##$AQSEQ= 0
##$AQ_mod= 1
##$AUNM= <au_zg>
##$AUTOPOS= <>
##$BF1= 200.13
##$BF2= 200.13
##$BF3= 200.13
##$BF4= 200.13
##$BF5= 200.13
##$BF6= 200.13
##$BF7= 200.13
##$BF8= 200.13
##$BYTORDA= 1
##$CFDGTYP= 0
##$CFRGTYP= 5
##$CHEMSTR= <none>
##$CNST= (0..31)
1 1 145 1 1 1 1 1 1 1 1 1 1 1 1 1 1 1 1 1 1 1 1 1 1 1 1 1 1 1 1 1 
##$CPDPRG= <>
##$CPDPRG1= <>
##$CPDPRG2= <>
##$CPDPRG3= <>
##$CPDPRG4= <mlev>
##$CPDPRG5= <mlev>
##$CPDPRG6= <mlev>
##$CPDPRG7= <mlev>
##$CPDPRG8= <mlev>
##$CPDPRGB= <>
##$CPDPRGT= <>
##$D= (0..31)
0 0.7 0 0 0 0 0 0 0 0 0 0.03 0 0 0 0 0 0 0 0 0 0 0 0 0 0 0 0 0 0 0 0 
##$DATE= 1782726956
##$DBL= (0..7)
120 120 120 120 120 120 120 120 
##$DBP= (0..7)
150 150 150 150 150 150 150 150 
##$DBP07= 0
##$DBPNAM0= <>
##$DBPNAM1= <>
##$DBPNAM2= <>
##$DBPNAM3= <>
##$DBPNAM4= <>
##$DBPNAM5= <>
##$DBPNAM6= <>
##$DBPNAM7= <>
##$DBPOAL= (0..7)
0.5 0.5 0.5 0.5 0.5 0.5 0.5 0.5 
##$DBPOFFS= (0..7)
0 0 0 0 0 0 0 0 
##$DE= 6
##$DECBNUC= <off>
##$DECIM= 32
##$DECNUC= <off>
##$DECSTAT= 4
##$DIGMOD= 1
##$DIGTYP= 9
##$DL= (0..7)
0 120 120 120 120 120 120 120 
##$DP= (0..7)
150 150 150 150 150 150 150 150 
##$DP07= 0
##$DPNAME0= <>
##$DPNAME1= <>
##$DPNAME2= <>
##$DPNAME3= <>
##$DPNAME4= <>
##$DPNAME5= <>
##$DPNAME6= <>
##$DPNAME7= <>
##$DPOAL= (0..7)
0.5 0.5 0.5 0.5 0.5 0.5 0.5 0.5 
##$DPOFFS= (0..7)
0 0 0 0 0 0 0 0 
##$DQDMODE= 0
##$DR= 18
##$DS= 0
##$DSLIST= <SSSSSSSSSSSSSSS>
$$ [...]
##$SUBNAM0= <"">
##$SUBNAM1= <"">
##$SUBNAM2= <"">
##$SUBNAM3= <"">
##$SUBNAM4= <"">
##$SUBNAM5= <"">
##$SUBNAM6= <"">
##$SUBNAM7= <"">
##$SUBNAM8= <"">
##$SUBNAM9= <"">
##$SW= 18.0517328524113
##$SWIBOX= (0..15)
0 0 2 0 0 0 0 0 0 0 0 0 0 0 0 0 
##$SW_h= 3612.71676300578
##$TD= 16384
##$TD0= 1
##$TE= 0
##$TE2= 300
##$TE3= 300
##$TEG= 300
##$TL= (0..7)
0 120 120 120 120 120 120 120 
##$TP= (0..7)
150 150 150 150 150 150 150 150 
##$TP07= 0
##$TPNAME0= <>
##$TPNAME1= <>
##$TPNAME2= <>
##$TPNAME3= <>
##$TPNAME4= <>
##$TPNAME5= <>
##$TPNAME6= <>
##$TPNAME7= <>
##$TPOAL= (0..7)
0.5 0.5 0.5 0.5 0.5 0.5 0.5 0.5 
##$TPOFFS= (0..7)
0 0 0 0 0 0 0 0 
##$TUNHIN= 0
##$TUNHOUT= 0
##$TUNXOUT= 0
##$USERA1= <user>
##$USERA2= <user>
##$USERA3= <user>
##$USERA4= <user>
##$USERA5= <user>
##$V9= 5
##$VALIST= <valist>
##$VCLIST= <CCCCCCCCCCCCCCC>
##$VD= 0
##$VDLIST= <DDDDDDDDDDDDDDD>
##$VPLIST= <PPPPPPPPPPPPPPP>
##$VTLIST= <TTTTTTTTTTTTTTT>
##$WBST= 1024
##$WBSW= 4
##$XGAIN= (0..3)
0 0 0 0 
##$XL= 0
##$YL= 0
##$YMAX_a= 132593
##$YMIN_a= -150740
##$ZGOPTNS= <>
##$ZL1= 120
##$ZL2= 120
##$ZL3= 120
##$ZL4= 120
##$ABSF1= 10
##$ABSF2= 0
##$ABSG= 5
##$ABSL= 3
##$ALPHA= 0
##$AQORDER= 0
##$ASSFAC= 0
##$ASSFACI= 0
##$ASSFACX= 0
##$ASSWID= 0
##$AUNMP= <proc_1d>
##$AZFE= 0.1
##$AZFW= 0.1
##$BCFW= 1
##$BC_mod= 2
##$BYTORDP= 1
##$COROFFS= 0
##$CY= -3
##$DATMOD= 1
##$DC= 2
##$DFILT= <>
##$DTYPP= 0
##$F1P= 0
##$F2P= 0
##$FCOR= 0.5
##$FTSIZE= 0
##$FT_mod= 4
##$GAMMA= 1
##$GB= 0.15
##$INTBC= 1
##$INTSCL= 1
##$ISEN= 128
##$LB= 0.25
##$LEV0= 0
##$LPBIN= 0
##$MAXI= 10000
##$MC2= 0
##$MEAN= 0
##$ME_mod= 0
##$MI= 1.114404
##$NCOEF= 0
##$NC_proc= 0
##$NLEV= 6
##$NOISF1= 3.799351
##$NOISF2= 2.8
##$NSP= 1
##$NTH_PI= 0
##$NZP= 0
##$OFFSET= 14.38212
##$PC= 1
##$PHC0= -4218.33
##$PHC1= 9.5923
##$PH_mod= 1
##$PKNL= yes
##$PPARMOD= 0
##$PSCAL= 0
##$PSIGN= 0
##$REVERSE= no
##$SF= 200.129724274929
##$SI= 16384
##$SIGF1= 3
##$SIGF2= 2
##$SINO= 400
##$SIOLD= 16384
##$SREGLST= <1H.CDCl3>
##$SSB= 0
##$STSI= 0
##$STSR= 0
##$SW_p= 3205.1282051282
##$SYMM= 0
##$S_DEV= 0
##$TDeff= 0
##$TDoff= 0
##$TI= <>
##$TILT= no
##$TM1= 0
##$TM2= 0
##$TOPLEV= 0
##$USERP1= <user>
##$USERP2= <user>
##$USERP3= <user>
##$USERP4= <user>
##$USERP5= <user>
##$WDW= 1
##$XDIM= 8192
##$YMAX_p= 0
##$YMIN_p= 0
$$ End of Bruker specific parameters
$$ ---------------------------------
##NTUPLES= NMR FID
##VAR_NAME=  TIME,          FID/REAL,        FID/IMAG
##SYMBOL=    X,             R,               I
##VAR_TYPE=  INDEPENDENT,   DEPENDENT,       DEPENDENT
##VAR_FORM=  AFFN,          ASDF,            ASDF
##VAR_DIM=   8192,          8192,            8192
##UNITS=     SECONDS,       ARBITRARY UNITS, ARBITRARY UNITS
##FACTOR=    0.0002768,     1,               1
##FIRST=     0,             0,               0
##LAST=      2.2672688,     0,               0
##MIN=       0,             -150740,         0
##MAX=       2.2672688,     132593,          0
$$ Real data points
##PAGE= N=1
##DATA TABLE= (X++(R..R)), XYDATA
$$ [...]
1943a53K92n29L40J34k83M72n23p5O99m15Q3J88p17L34J17J41M12q46N8P31p12
1964b52k03Q36k63j28o8n56Q36M0o90O91m63Q7J95J77Q3n15n73J116O0q25O09
1985A94q8m22M51l99M95L49r86M54m9n62L01N47m10L37r57Q16L98m84J61K45p53
2006c62L97k06M7Q37l81q74P31k86J55O26r57K06j82n8P46j22l94M91n16m49N24
2027b7q4N68J56j180O63M4l53Q03l15n68M22l97N93L39j211N03O0n23M88j71M45
2048B55P11q70m48O09n97M79N06r77N5K6k87J702r17n65N09m85O8M63n34R31k57
2069C77j146J025j98j95Q34m21o08O90o18M42J76j120N79L40k47M68m74K57L65
2088E26j147q9N83Q8N50k16o48M09l29j07P78o10m21R53m37o6N89o62Q39r73l15
$$ plain form
1943 -153 139 -390 -50 84 -199 273 -250 -325 374 -41 42 230 -487 -153 -36 105 517 -329 -271 460 -252
1964 -252 -455 381 118 -10 -78 -634 202 242 -448 243 -220 -133 62 239 322 -193 -766 350 410 -415 194
1985 194 106 -316 135 -264 231 580 -406 48 -1 -563 -262 285 -125 212 -745 71 469 -15 146 391 -362
2006 -362 35 -171 -124 713 332 -542 189 -97 58 684 -273 -67 -249 -307 439 317 -77 414 -102 -551 -27
2027 -27 -111 457 613 -567 96 140 -213 590 275 -293 129 -268 325 664 -547 -44 16 -507 -19 -190 255
2048 255 966 96 -352 257 -340 139 645 -332 -277 -251 -538 1164 247 -318 191 -294 -226 237 -297 634 377
2069 377 -769 256 58 -137 697 276 -332 358 -260 182 358 -762 -183 157 -90 378 -96 161 526
2088 526 -621 -710 -127 -39 511 295 -353 56 -273 -380 398 -212 -633 320 -117 -183 406 -256 583 -390 -705
2109g05J307m99m32P71p51o0N88l72O11m31o15O02n1m68P94k64J02M1r37O93M65
2130C89k81N1k62o27R17k17J08Q02j196m8J004r06R9M10l16O53r03k15J065Q5
2150F12n37J72n81M77J3k16M87n92m31R61j01n26M71l40M44Qq73L11J99j65K96
2171H9J32m44M69k54J28K14p25K86N35n67l8M78m31M57n85m5Q94r58k8O77l69
2192h5L34k99k05J59K7N8N81n91j58L69R3j3l66k20P91n62l76P03j93l34O48n53
2214a92k79L88n52J200l20m31J34J9J52j80m27O62J77q76M56N23o55L82j99l83
2234d01P05k58L27J14o55j13M06Mk6K4j31K85k70m55P50j08o9j52m12L87r4P38
2256E96j33n46r64O79N27L14O1m89J31j91l59N59L48o32O6m08m1P82k33N08l3
$$ plain form
2109 -705 602 103 -329 442 -309 -369 219 -153 458 27 -588 14 -37 -505 289 25 127 168 -769 -76 389
2130 389 108 159 -103 -730 187 -30 78 880 -316 -364 640 -266 -167 243 -73 580 -323 -538 527 612
2150 612 75 247 -334 143 156 -60 427 -165 -596 365 264 -262 209 -131 313 321 -552 -241 -42 -207 89
2171 89 221 -223 246 -8 120 334 -391 -105 430 -137 -175 303 -128 329 -256 -301 593 -365 -393 284 -85
2192 -85 249 -50 -255 -96 -69 -11 570 -21 -179 190 283 270 -96 -316 475 -87 -463 240 47 -287 361 -192
2214 -192 -471 -83 -635 565 245 -186 -52 -33 119 -61 -488 174 351 -525 -69 454 -201 181 -18 -401
2234 -401 304 46 373 487 -168 -281 125 129 103 127 -4 281 11 -444 306 198 129 -23 -435 -48 -142 596
2256 596 463 -83 -1047 -368 159 473 534 45 176 -15 -374 185 533 -99 -33 -441 -482 300 67 575 542
2277E42j120K10L32J78rp3r3J39m50K06O52m05M6j99k26M55M5l11N06n53n39R18
2299B51j59k5K12m87M98n37P5O45mm69O4k60K57M12p65O16l25o30O42N59n47O0
2321H3o4N6q5p26J061l2m97N4K26o03N87m4q8L61n77K52L71p06L92K8n26R02o70
2344b45N6P22k70p57N29l76L18N45q25P48n25m16R32m59k82M45n05M97J11p55
2364e12P85k1n37L47P7J22J22n86L52j24l93O62N3l44o2K59k71O88p15m3N60n59
2386a40j05N78l51M90o91l8L70rP9L6k83r0K96j53K10l01l04O64q9k44L60j06
2408A79k72M57m24L6K92m77L98qn74L47J19J12Q9o31J63M54m83N52j38k88l9j65
2430c01j56Q51l47k95L82n85JM36J79jk90k07P68o48J88O17m56k73L08m53K05
$$ plain form
2277 542 -578 -368 -36 142 133 60 -33 106 -344 -138 514 109 155 -44 -270 185 230 -81 425 -128 -667 251
2299 251 92 67 279 -208 290 -247 -172 473 469 0 64 -196 61 473 -292 324 -1 -631 11 570 23 83
2321 83 19 75 -10 -736 325 293 -204 -150 76 -527 60 16 -72 289 -288 -36 335 -371 21 49 -477 425 -245
2344 -245 -189 533 263 -494 35 -341 -23 522 -303 445 -80 -496 436 -23 -305 140 -365 132 243 -512
2364 -512 273 252 -285 62 139 261 383 -203 149 25 -368 294 347 3 -59 200 -71 617 -98 -141 419 -140
2386 -140 -245 333 -18 472 -219 -257 113 104 183 219 -64 -154 142 -11 199 -102 -406 258 169 -75 285 179
2408 179 -93 364 -60 -24 268 -209 189 181 -393 -46 73 185 274 -357 -194 260 -223 329 191 -97 -136 -301
2430 -301 -457 394 47 -248 134 -451 -450 -14 165 164 -126 -333 435 -213 -25 592 136 -137 171 -282 -77
2451g7L51m07K68m44J45R4K12L16m17o01O27K99o62N25j26l44Q6r0L83L48m21
2472F5l35O2l13M69L28kp5l88q3N59l06j82L02n52K51k3O5M97j19m10N48o70K92
2495b0L49l46k19L08p66P87%m29L01N6Ok6k10M19J49o98K31M19l55NN30m66O7
2518I2l81L16K1j09J89K60o16M53q9q6M81o53j67N88l99J72L25l65Q1j78LN08
2540D46m76N9J66k32q6J47o6M4J76l12o2K94m27O43l60r1N6l6J39L36q16M86K47
2563B75k31k7r4J37m8m66O68l07N13l40J14Rj049L18J059l91M69o80K92j25j38
2584d2R8j93L17k85k5J67Q7k45L70m57K15K50n55O44n10n45Q44J99j92n4j28J52
2606A12k71j24K34J81j39j59N4nK42j75M2J74m85J87M80o05K50l4j65J52j13J56
$$ plain form
2451 -77 274 -133 135 -309 -164 -70 142 458 41 -560 67 366 -296 229 103 -241 -155 -245 138 486 65
2472 65 -270 -208 -521 -52 276 274 199 -189 -272 287 -19 -201 101 -451 -200 -223 -158 339 220 -190 358 -312 -20
2495 -20 329 -17 -236 72 -694 93 93 -336 -35 21 27 1 -209 210 359 -339 -108 311 -44 -39 491 25 92
2518 92 -289 27 48 -61 128 388 -228 225 136 50 531 -122 -289 299 -100 72 397 32 113 -65 -62 446
2540 446 -30 29 195 -37 -123 24 -42 2 178 -134 -196 98 -329 314 -46 -137 -81 -117 22 358 -458 28 275
2563 275 44 17 -77 60 12 -454 214 -93 420 80 194 203 -846 -528 531 140 609 -71 221 96 -42
2584 -42 56 -137 180 -105 -130 37 124 -121 249 -208 7 257 -298 346 -164 -709 135 334 142 88 -40 112
2606 112 -159 -283 -49 132 -7 -166 -112 -117 125 -50 -8 166 -319 -132 348 -257 -7 -41 -206 -54 -167 -11
2628a1J45k83l58R24o76K64J93j73j56k7rP74o54m3k01J77O6J61j71N6M45p40
2650b97J18J29J01K45j23r6o6p3M65k17Q4l45J24l4L9k67J13M69l87l91L43J63
2672I7j9J13l3m8m90M6Q93m45j29j54K42J38l56n7M16l61k72N48m75j32R56j026
2694e48K77o3Q5P79l03m54L32m52K80K18k87J62o0l57J83L60m24N31j27k39o0
2715a67Q0J33M27p73J25L35n07rL20K47L0j94m70O80k73m5J69k97j4J14L64J51
2737D26n73J40Q9J21m06K82m23J72L74n56M75Q0k99M39m99r1K56J36L28k98n12
2758c39L67J27k14j31R2O9J95k83L5K76m97M80J06k93J27N0k65J02L6p0L80l72
2780b2J47k9l31M09j95j82L48l11P1R5k32J81J78m87M19k42o8L34K06j48O1l40
$$ plain form
2628 -11 134 -149 -507 417 -259 5 198 25 -131 -158 -167 607 -47 -90 -291 -114 -48 113 -58 -2 443 -297
2650 -297 -179 -50 51 296 173 77 11 -62 403 186 270 -75 49 15 54 -213 -100 369 -18 -409 -66 97
2672 97 78 191 158 110 -380 -334 559 114 -15 -169 73 211 -145 -202 214 -147 -419 129 -346 -478 478 -548
2694 -548 -271 -334 -249 530 227 -227 105 -347 -67 151 -136 26 -34 -391 -208 152 -272 259 132 -107 -167
2715 -167 -87 46 473 -300 -175 160 -347 -356 -36 211 241 47 -423 257 -16 -61 108 -189 -203 -89 275 426
2737 426 -147 -7 82 203 -203 79 -344 -172 202 -354 121 201 -98 341 -158 -249 7 143 471 173 -339
2758 -339 28 155 -59 -190 -98 -29 166 -117 -82 194 -303 177 283 -10 117 167 -98 4 40 -30 350 -22
2780 -22 125 96 -235 174 -21 -203 145 -166 -95 0 -232 -51 127 -360 59 -183 -251 83 289 141 202 -138
2802a38k47N19l36K52K54m77L26K5l54M39k79K07l28KJ67K57l30m1K46j28Q2k41
2824a23L03j64j20n5K35k46J17K83p96P00k1j77M04j48l13j08n4J78M56n46K60
2845F5jn37N37j10q3L27l45K61j23j37R7K39k81l6o2K88j70J67k05J31j98P6J14
2868A4j98K42L29n80M7l8j5N21k80k21O8M7K89j23k19L97j12m09Q2R7J07P0l69
2891b54J98M38j95O2K01p28K13K49r2R8j86M3j07l45L31K85m30N80n15j45J72
2912a27k2J63j6j03J42k10L58k61L45j73K51l08k6J24l60N9K57m67O51j28j26
2933B3K62l31o1K56j08J05J20l40l5m5k60L99K77n01K37J05j96K91j02nQ6n12
2955c35J06J32L16l48k4R8L15k92K9k8p6J81r2j6L29k57J3J49n62J43K29j43K86
$$ plain form
2802 -138 -385 134 -202 50 304 -173 153 178 -176 263 -16 191 -137 -135 32 289 -41 -82 164 36 118 -123
2824 -123 180 16 -104 -159 76 -170 -53 230 -566 134 113 -64 340 192 -121 -229 -283 -105 351 -195 65
2845 65 64 -473 64 -46 -129 198 -147 114 -9 -146 -49 190 -91 -127 -189 99 -71 96 -109 22 -176 -100 14
2868 14 -184 58 387 -193 -146 -184 -199 322 42 -179 -111 -64 225 102 -117 280 168 -241 -159 -62 45 115 -254
2891 -254 -56 382 187 249 450 -278 -65 184 92 190 4 47 -60 -405 -74 211 -219 361 -154 -299 -127
2912 -127 -149 14 -2 -105 37 -173 185 -76 269 96 347 39 13 137 -223 -164 93 -374 277 149 23
2933 23 285 -46 -107 149 41 146 266 -74 -109 -154 -414 -15 262 -239 -2 103 -93 198 96 91 177 -335
2955 -335 -229 -97 219 -129 -153 -55 260 -32 -3 -31 -107 74 -18 -34 295 38 51 200 -362 -219 10 -133 153
2978A53p2j3n6j17J57K2l03K29K8l42O45l43k22J63J30m41O16n6q6J74k66N32
3000E32l60m38M63r1m02M41j02m13L05o6j24L22k81L58q9j15j07RJ6K18j18J32
3022I0P8l39K24n7J56r2k21N4k3J79j50M4K35l36J30o6j43L0K78j00Mq5L77k73
3046fk89M05o46P47l3k96J34K14k24j87K27l84R85m19o56j01M06L95N57j446K39
3067c78N62k94K72n2l64K29r19L61N33r3L9J09l96P77n02o64J366p45K45o48M84
3088g8k55j39R35n33n36O67k05M6m18J266p37L58m69K60r5j41m00K67J84N4j50
3109a19j81j36K97L92m79N56J05o98k2m4L64K14k48j17n58M37M23l24L61j69j82
3130a28L27n29J64K93j16J0j48o7L97o0k62K85k92J65K86k86j80L94l13L4J45
$$ plain form
2978 153 81 68 12 -105 52 74 -229 0 28 -314 331 -12 -234 -71 59 -382 234 178 92 266 0 532
3000 532 172 -266 197 106 -296 145 43 -370 -65 -131 -255 67 -214 144 55 -60 -167 -158 -142 76 -42 90
3022 90 168 -171 53 -4 152 60 -161 -107 -130 49 -101 -57 178 -158 -28 -94 -237 -207 71 -29 -25 -110 267 -6
3046 -6 -295 110 -536 211 178 -118 16 230 6 -181 46 -338 647 228 -428 -529 -123 272 829 -617 -378
3067 -378 184 -110 162 110 -254 -25 -944 -583 -50 -143 -104 5 -391 386 -116 -780 586 -159 86 -562 -78
3088 -78 -333 -472 463 -70 -606 61 -144 -98 -516 750 13 371 -98 162 67 -74 -474 -207 -23 31 -119
3109 -119 -300 -436 -139 253 -226 330 435 -263 -285 -329 35 249 1 -116 -674 -237 186 -138 223 54 -128
3130 -128 199 -330 -166 127 11 21 -127 -194 203 143 -119 166 -126 39 325 39 -141 253 -60 -26 119
3151A19m48M88K27m14p7p1P5M78l96r2M43l19j03P0k75L93j31j47N29j99j170
3172a020J801p32J37O9n48R57l18m84O68K41j083L35l02M58j20k68J74J60j5k10
3192a00j03J05J58j28p9L44l06N2p0J60J44j49n75N24m3k71L98j76K03J83k40
3213C1j14J24j01J1R6j4J65m3j30P2M8j21k42J90M7J03j19J09k11j31J19j42L5
3236b18L56j42L4N2P8j82l9rK89m07L00J1l24N56n15j46K43J76k9J38k21j96L22
3259A27j51j18K70l40K43K16k44L82j40n51K25J03j01M37m48J49%j92K51J5l18
3280a85K07k65L21J1l56J59J23j89K62l13L94J53k16n5j07K7j32K22J67l50R4
3301b8Q3N7k57Q1J38m20K24P4n6K46N8k44J42J7k67K19J23m03K48k83K23M50m96
$$ plain form
3151 119 -329 159 386 -28 -105 -176 -101 377 -19 -111 332 13 -90 -20 -295 98 -33 -180 349 150 -1020
3172 -1020 781 49 186 255 -293 664 346 -138 530 771 -312 23 -279 179 59 -209 -35 125 110 -100
3192 -100 -203 -98 60 -68 -147 197 -109 -57 -127 33 177 28 -547 -23 -66 -337 61 -115 88 271 31
3213 31 -83 41 -60 -49 47 33 198 155 25 97 145 24 -218 -28 19 122 3 112 -99 -230 -111 -253 -218
3236 -218 138 -4 30 82 160 -22 -61 -70 219 -188 112 123 -201 355 -160 -306 -63 113 84 222 1 -195 127
3259 127 -24 -142 128 -212 31 247 3 385 245 -306 -81 22 -79 358 -90 59 59 -133 118 133 -185
3280 -185 22 -243 78 89 -267 -108 15 -174 88 -225 169 322 106 51 -56 -29 -161 61 228 -122 -28
3301 -28 55 112 -145 -64 74 -346 -122 -48 -104 142 200 -44 98 115 -152 67 190 -213 35 -248 -25 425 -71
3324g1K87l60k4P5M0k3R2J71k52o9r0K46J25j45J20n14M50p3o9J97K05m55j42
3347b79L05k20M59k71j7mL54k30K28l51j66K66m97M09Q3k27L79N3l19Q9M0k15
3369a31L29m27M11k05PL3j7o9M5J3j10L19k86J83O4j25o1K43k71J2j32J12L96
3392C33l29rJ00j47J03k7J64pj11r4N7N9j80K09l14K45L03n87L33p7j29M72n33
3415a66J82J52j82o6K31j27k1J81m59M99l69L22k22p3J42k3l5J58j51k43L34R1
3437A55l25L50k64l1L64r8r8N8j96L22k74K15k05k35K32O8J22m55N20o7l62K63
3459E9l05J24K15k54J51J12j70J97l20J31N64n83o3Q2J34J7j37j16o4J66L30p0
3481B00l60Q4L6k39L76J41j48J81l28k23N42m11J64J06k12M9Mn4K58R1j90j43
$$ plain form
3324 -71 216 -144 -168 -93 -53 -76 16 187 -65 -134 -224 22 147 2 122 -392 58 -15 -84 113 318 -137 -279
3347 -279 26 -194 265 -6 -23 -27 327 97 325 -26 -192 74 -423 -14 69 -158 221 274 -45 44 84 -131
3369 -131 198 -229 182 -23 -16 17 0 -69 -24 -11 -121 198 -88 95 159 34 -27 216 -55 -43 -175 -63 333
3392 333 4 -5 95 -52 51 24 188 181 70 -24 33 92 -88 121 -193 52 355 -232 101 24 -105 367 -166
3415 -166 16 168 -14 -80 151 24 3 184 -275 224 -145 177 -45 -118 24 1 -34 124 -27 -270 64 155
3437 155 -170 180 -84 -115 249 151 53 111 -85 237 -37 178 -27 -262 -30 38 160 -295 225 158 -204 59
3459 59 -246 -122 93 -161 -10 102 -68 129 -191 -60 504 -79 -142 -60 74 91 -46 -162 -226 -60 270 200
3481 200 -160 -76 -40 -279 97 238 90 271 -57 -280 262 -149 15 121 -91 -42 -38 -92 166 257 67 -76
3503g6M0j54K56j74J07Kl97K99P8J68L01n88o5N5J79O7n8lJ44j24J41Pk01J29
3527A33k7k62J84Q5k94L37p4k23L00n5n6P6M7j27J44%l78L42j99R3k0k4p3J80
3551A09k23M49p2l46j82N51o8l46J36j00p5k40L75P0Nj04K3q2K91j58j2j9J62
3574A44k12K96j2l60K9P6J82r7j98K86r7J67j60j93p2L44j07N4j24J85j00k32
3596b01L40k21j76M94j98k93N71l08k42J66k27K04N3k31M73j51k45L10k39J89
3616F8N8j12mo8j2J2j12K06n4J39n7L34l02J16J43m28K9K11k01o6L64m07K31J00
3640A88j48M94m91j24L35j6j0m52J28J53l4M6J72r7n16N29k00J08J32j60ol57
3662c26N31J0P0o2j07k71J95J83j82j41R0k43M87l25L14j09k5j21Q3O2J55j41
$$ plain form
3503 -76 -36 -190 66 -108 -1 1 -396 -97 -19 149 450 -138 -203 -148 31 98 40 37 181 57 198 205 4 133
3527 133 106 -156 28 113 -181 156 82 -141 159 104 48 124 171 44 188 188 -190 152 -47 46 26 2 -71 109
3551 109 -114 335 263 -83 -265 286 218 -128 8 -92 -167 -407 -32 38 43 -61 -38 -120 171 13 1 -18 144
3574 144 -68 228 216 -144 -115 -39 143 46 -152 134 37 204 44 -149 -221 123 16 70 -54 131 31 -201
3596 -201 139 -82 -258 236 38 -255 316 8 -234 -68 -295 -91 -38 -269 204 53 -192 118 -121 68
3616 68 126 14 10 -58 -70 -58 -170 36 -18 121 64 398 96 212 355 -73 -44 167 -34 -100 264 -143 88 188
3640 188 40 534 43 -81 254 238 228 -224 -96 57 23 69 241 144 -372 157 -43 65 197 37 31 -326
3662 -326 205 215 285 223 116 -155 40 223 41 -100 -10 -253 234 -91 223 114 89 -32 51 113 268 127
3684A27l13J86k37J29J73k06K72k75Nj62M37j63K91j70l84M27j91J44k2p7k07
3705b16L64j94K70m89K93j89M47n08K69j42J43J24k20q5l4J08L03o08M01J51k23
3726c5LJ54j68j06J65r8N1M9n9K01k14k66M55k84J81K03l73J91n4j19L55q5l00
3749a53K58j5j11J13j98K04N8n94N34k21N4Q7J9l03N67l54m0M64n68K70J16j45
3771D2J5R1ml89P1j33L04j90K20P0j95M75m04m6J6nk1K45k05R8m9r9J03L19k83
3796D6M02m63r4P5j52J4M38n41K97Q1k18L63l22K7M04k83rM2JoJ53l80j39J35
3820a29m2L58l23m00R26m44O5j95n3K7K92k98N32n17k99L16ON79j25n6J22m29
3842h7r2L26j42N3p3J74j77R7j08O1n1L87j41k78j74K40L3m5L7N6j32N1m3J39
$$ plain form
3684 127 -186 0 -237 -108 65 -141 131 -144 -139 -301 136 -27 264 94 -290 137 -54 90 68 -9 -216
3705 -216 148 -46 224 -265 28 -161 286 -222 47 -95 48 172 -48 -133 -167 -59 244 -364 37 188 -35
3726 -35 -32 122 -46 -152 13 -85 -34 15 -44 157 -57 -323 132 -152 29 232 -141 50 -4 -123 232 147 -153
3749 -153 105 90 -21 92 -106 98 156 -438 96 -125 -71 16 35 -268 299 -55 -95 369 -199 71 187 42
3771 42 57 148 144 -245 -174 -307 -3 -193 27 97 -98 377 -27 -73 -57 -62 -83 162 -43 55 6 -93 10 329 46
3796 46 448 -15 -109 -34 -186 -172 266 -275 22 103 -115 248 -74 -47 357 74 65 107 108 102 255 -125 -264 -129
3820 -129 -171 187 -136 -536 390 -54 11 -184 -237 -210 82 -216 316 -201 -500 -184 -178 401 276 220 342 -87
3842 -87 -179 147 5 58 -15 159 -18 79 -29 32 -19 368 227 -51 -225 15 48 3 40 96 -36 15 -28 111
3866A11R2L5l58K89n80M02j29J74q2k64J90K60j74J36N6k37L7KJ2J69l47mJ76
3889c4n4J05j09J8K45j50l6k41K72N6K65n67O0m5QK67q1m10K77j50L22L7M9m6
3913E8lj60J04p8k02L00j62K89j8j65J9k4n4J84n6m10M42n2l1jk63J55M75j21
3937B26k44j32M5M6J07k02N11n29K80Q3N6n35J95%K44j68k74K64O1r7J12P9k57
3960a29J86j99K53%K46n63K77q8j4j60J52K51j66j7K58k58O1j65j41L46j08O2
3982H4j23M2k04L16j56R3J01m3o9J62o2j52J18o0j0j79P2K61l74J18K79j64Q5
4005A35l08J2K72l9P0n2j18J77o2l35M17r0P7J78m51Q5n5J61Pj55P1l9j24J79
4029A3j06j24J66l0j1K93j20k13L54m09k08N46nl1J0J55m09J7K5R1J21k33Q7O8
$$ plain form
3866 111 203 238 -120 169 -411 -9 -138 36 -46 -310 -120 140 -34 102 158 -79 -42 -40 -28 141 -206 -210 -34
3889 -34 -88 17 -92 -74 171 21 -15 -256 16 72 337 -230 -170 -215 -207 60 -21 -431 -154 -304 18 55 104 58
3913 58 55 -105 -1 -79 -281 19 -143 146 128 -37 -18 -42 -96 88 32 -378 64 12 -19 -20 -283 -128 347 226
3937 226 -18 -150 -105 -59 48 -154 357 -172 108 191 247 -288 -93 -93 151 -17 -291 -27 34 -63 49 128 -129
3960 -129 57 -142 111 111 357 -206 71 -17 -31 -191 -39 212 46 29 287 29 90 -75 -216 130 22 84
3982 84 -39 3 -201 115 -41 52 153 110 41 203 141 -11 107 47 37 -142 -70 191 -183 -65 214 50 135
4005 135 -173 -161 111 72 142 90 -28 149 87 -248 169 79 156 334 -117 -32 -87 74 81 -74 -3 -42 -166 13
4029 13 -93 -217 -51 -81 -92 201 81 -132 222 -187 -395 151 146 115 125 280 -129 -112 -87 4 125 -108 -21 47
4053D7j19L47k46m4j10J62M6M2o9k4j0m23L33J06R5J15l56lN0J69r4L14n2j86
4077I0l97J25M86l04j45M6k36J49J40K4L56n30Q0L71l93J24k0M16o82M58l62n7
4099b61J40N6J24j5J46l57R0K25k30K66l65J8K11j09J19j71N0K25k65K18o2q3
4121c0J58j63L2j63Q2M48m79l6J27N3k14L01k0l63K85j53k05M76l65J03O1n3K35
4144A17j84J8K41q9o3R1k58J41r7k22M35k05j81N75m97KM21m38N22j31j67Q7l59
4167b41K80k67M17o4N6j36k80J02K61m1P3j63j32o8K69R0q1P7m2J80n36J22j92
4190c16J19K82l56N18l92J29J84l58J36r3k29P04k94j53K82k88R3k87L34M7k31
4211a69rM6p9P8K73n93M61k3oR4j14l25J76L82n21M4L69k36L47l11J32j09K54
$$ plain form
4053 47 -72 275 29 -15 -125 37 83 125 56 32 22 -401 -68 38 133 248 -108 -111 -61 108 14 328 276 90
4077 90 -307 -182 304 0 -145 -99 -335 -186 -46 -22 334 -196 -116 255 -138 -14 -34 382 -300 158 -204 -261
4099 -261 -121 -65 59 44 190 -167 -77 148 -82 184 -181 -163 48 -61 58 -113 -63 162 -103 115 53 -30
4121 -30 128 -35 -3 -166 -84 364 -115 -151 -24 29 -185 116 96 -267 18 -135 -340 136 -229 -126 -65 -118 117
4144 117 -67 -49 192 103 40 131 -127 14 -83 -305 130 -75 -256 319 -178 -176 245 -193 329 198 31 118 -241
4167 -241 39 -228 189 125 181 45 -235 -133 128 87 160 -3 -135 -203 66 156 75 152 110 290 -246 -124 -316
4190 -316 -197 85 -271 247 -145 -16 168 -190 -54 -147 -376 328 34 -119 163 -125 -32 -319 15 62 -169
4211 -169 -178 -132 -211 -133 140 -453 8 -15 -21 73 -41 -366 -190 192 -329 -285 84 -152 195 -116 16 -93 161
4234A61k82J08Ok90K59M7J42m18K36N8j83L43j37J35m06K17pJ96k81r3L89n37
4256c37K39K12j27j40L31n34M25J47j80M4Nq0r3K06j58M58m77n5OP2L81l35o3
4279e3m0O6QL02p89R00l15M6k41J13No5N8k01M72k58j34J79j65R2J5m0K28j82
4303AK31m52J40q4J14j23M25k14o0O5k8j94K73o3n0Q0j98O27k76j80n1J67n20
4326c70N19l24j2N39m23j47K58q7M9J78k01l8K07k2m3j66L7J51k8q0K18l61J93
4349D7j18Q0M9j27l8K33N3r3M8l91K80J57j05k24J91J69O5n37K41k3P3Lo6qK70
4374B29k93n5L14j70J31j91n6L09j48j52L36k50n7k54L75j64K16j68J56J66m49
4395a75L31L6k66k37K5M14J34j90j04K1k68J70K63k18k9K04j06J90M9l2n0m43
$$ plain form
4234 161 -121 -13 -7 -297 -38 9 151 -267 -31 27 -156 187 50 185 -221 -4 -11 185 -96 -189 200 -337
4256 -337 -98 114 -13 -153 178 -356 69 216 36 80 85 5 -88 118 -40 418 -59 -114 -108 -36 345 10 -53
4279 -53 -93 -27 -19 283 -506 394 79 125 -116 -3 2 -63 -5 -206 266 8 -126 53 -112 -20 -5 -45 183 1
4303 1 232 -220 -80 -164 -50 -173 252 38 -22 43 15 -179 94 31 -19 61 -137 490 214 34 -17 150 -370
4326 -370 149 -175 -187 352 -71 -218 40 -47 2 180 -21 -59 148 126 83 -83 -46 105 77 -3 215 -146 47
4349 47 -71 9 58 -69 -107 126 179 86 134 -257 23 180 75 -149 42 211 276 -261 -20 -43 30 33 -33 -41 229
4374 229 -64 -119 195 25 156 -35 -91 218 70 -82 254 4 -53 -307 68 -96 120 -48 108 274 -175
4395 -175 156 192 -74 -311 -286 128 262 72 -32 -11 -279 -109 154 -64 -93 111 5 195 244 212 162 -281
4417b81J40K21j49KM28n45J87Q0k13K38q8j5l7L6n2k53P8L68n3j79O6M9o5k8o
4442g1PN2m17M58P5j59J89p5p2K4L2j9K4j38k28K08J49m8r6L0O0J28k20L46k75
4467c6q9J09r6j46M47j76j23K65m61M21j58L06L2l06J21j49q2L70j84O2j2k55
4489a40L53k7J39l01l0j40J73M0k4J13k79M8J44j23R5j1k17J82Q3k74K87J49l96
4512a56J48j13o4L75k03K92ll77lj06J95L0K21j31n5Jl6J4k86L77M0P3m87J06
4536a48K14k16K73j77J34j76j42L71k78k11N03j75M4J45k24l7r3rK08M1k0j75
4558a48L68N7j87k43M33k34j77Po4J94Q3j93L75k42j21K3k33M65j30k04O9J64
4580F2K01k05K25j44j52Q9m37K8K34l4K60k8l8j10J64J73n3k52NK5J29J54k75
$$ plain form
4417 -281 -141 80 -69 -67 361 -184 3 83 -130 108 20 5 -32 4 -48 -301 -223 145 92 -87 -21 28 -37 -65 -71
4442 -71 -64 -12 -429 29 104 -55 134 59 -13 11 43 24 48 -90 -318 -110 39 -9 -105 -75 -15 113 -107 239 -36
4467 -36 -125 -16 -112 -258 189 13 -110 155 -306 115 -43 263 295 -11 110 -39 -121 249 65 127 115 -140
4489 -140 213 186 325 24 -6 -146 27 67 43 156 -123 -75 69 -54 41 30 -187 -5 78 -196 91 240 -156
4512 -156 -8 -121 -185 190 -13 279 276 -101 -104 -210 -15 15 236 105 50 51 15 29 -257 120 160 233 -254 -148
4536 -148 66 -150 123 -54 80 -96 -238 133 -145 -356 147 -28 16 161 -63 -100 -193 -202 6 47 27 -148
4558 -148 220 277 90 -153 280 46 -131 -124 -188 6 89 -104 271 29 -92 -69 -302 163 33 -171 -102 62
4580 62 263 58 283 139 -13 76 -361 -333 -99 -133 127 99 61 -49 115 288 235 -17 -12 13 142 296 21
4603B1j82J00k50N90l9j81J56k42n5L2qoJ39R0j97o3J8J85k25j97O00n09j29O72
4627C20n31K95k41k7P1L21l61J87K17l44K15k76q3L82k19M9NJ7K4j18K15k85J11
4650e6O2O8j11K8K44j69j3q7RR2J91k28J52r5j02k65J83RK93j18k2j53pl5K30
4675A00J55m12K45j21j47R1o3MO4K01j94J88j30j17J85N6k6j12K18j56J84q4m39
4698c10L23L37k27n9j22m1R2k0K23k79l1J98k35K9L11k05j32J74n9m3L32k32j82
4721a58M5J84J20j69kl2J41k10L81l45J47j45K50k7l04P1L89l96K7M5o4J98k04
4744e8O0J98L7k37j50K10N6J60k83O1j60n8J28k0M97m37q3J67Q3j49k8j09l05
4767d20L54J22k47K54J3Kj7j81J32K17m35K23J35m8K99m83m1lr6K73j35jp4L30
$$ plain form
4603 21 -161 -61 -311 279 240 59 215 -27 -82 -50 -58 -64 75 165 -32 -95 -77 108 -117 -314 286 -223 -352 320
4627 320 -211 84 -157 -184 -113 208 -153 34 251 -93 122 -154 -237 145 -74 -25 -20 -3 21 -97 118 -167 -56
4650 -56 6 74 -37 -9 235 66 53 -34 -25 67 258 30 182 87 -15 -280 -97 -88 205 87 65 -88 -95 -130 100
4675 100 255 -157 88 -33 -180 -89 -152 -148 -84 117 -77 111 -19 -136 49 105 79 -33 185 29 213 129 -310
4698 -310 13 350 123 64 -58 -99 -7 -27 196 -83 -114 84 -151 -122 189 -16 -148 26 -33 -76 256 24 -158
4721 -158 -113 71 191 22 20 -12 129 -81 300 -45 102 -43 207 180 -124 -53 336 -60 -33 12 -52 146 -58
4744 -58 2 200 237 0 -150 60 116 276 -7 54 -106 -164 -36 -56 441 4 -79 88 171 22 -6 -115 -420
4767 -420 -66 56 -191 63 76 78 61 -120 12 229 -206 17 152 104 403 -80 -121 -124 -220 53 -82 -83 -157 173
4791A73k75j13R0L6rJ41k05L13k09J86j58r2L38l17J70p5M8m5J82k45n5J67n3
4814gk1J20p4K02k27k17K08j24K80p9K1k1J60o52L27K75k12r4L2N6J74j57o7J22
4838B5k1J9q7L1J28l3m8J3L0m02L14j12J71k2J49K1R8o55M86l17r2N42l92L49
4862A95n4N7j83m5k38N32k2j88L2Q3k42j8L3R6k5J60o0p7L5j37J59J08r1m68M25
4887F7j41K40j55r6J78k05j80J77J19j06mj41M55k02N1j78L19Q6l85J93K4Q1R5
4910B92m71O1K74l85M37k06J6l9m4K0m6j19M83j43j5m7o1K13l70K73k27K07k01
4933i8O8j53J17J22l9p6J3k6j7L34j57r7j42J16r8J97j72J20j58K5K56k41Q3l32
4957c55M37r7N9k47P0R7pK81l98L1J91j79pK0K86k70J79K12l09K1r2J96j49J74
$$ plain form
4791 173 -102 -215 -125 -89 -98 43 -162 151 -58 128 -30 -122 216 -101 69 -6 42 -3 179 -66 -121 46 -7
4814 -7 -28 92 18 220 -7 -224 -16 -140 140 61 82 61 221 -431 -104 171 -41 -135 -103 -47 127 -30 -97 25
4838 25 4 23 -64 -33 95 62 14 27 57 -345 -31 -143 28 6 155 176 274 -381 105 -212 -304 238 -154 195
4862 195 141 198 15 -30 -268 264 242 54 86 169 -73 -91 -58 38 13 173 113 36 71 -66 93 201 110 -358 67
4887 67 -74 166 11 -85 93 -112 -292 -115 4 -102 -106 -247 208 6 57 -121 198 284 -101 92 116 197 292
4910 292 -179 -118 156 -229 208 2 18 -21 -65 -45 -91 -210 273 130 115 68 7 220 -150 123 -104 103 -98
4933 -98 -30 -183 -66 56 17 -59 -46 -72 -89 245 88 -9 -151 -35 -133 64 -108 12 -146 -121 135 -106 -23 -355
4957 -355 82 -15 44 -203 -133 -36 -43 238 -160 -129 62 -117 -124 -104 182 -88 91 303 -6 15 -77 119 -30 144
4981A44k65J09k08L59j35K6J3J40r7q1k04M3J40O3q1K15j68l6J6J92j71q6n6l
5005a31K4J09j83L75o0l51J75o9j86J68L0K28j92J19j74J36j3p5N7P5n1n7k9o9
5029a44J95q0K19k37l3j1K86l41K43p5j57K77k61M3k20J00K51p6J42J8j16k2k52
5052b51J56J93j17q7K17%k48J10j66L2L4K4J85P8j21P5k3j98K37j28L81k67j77
5075f1j2K3Q8M1k63L2L91j34k61K99k78J24LJ93l11K08l06K03J57k11M3r3K28
5098A03M0m40M15l90J48J15K08m77J07N2j2M11l18Q7J31j81q7n6J08M51l98j06
5120h9M5j17J31Qn7J15N0K6J12j24k99J58J19l78L56m8j09J44M2k8j40m7L79m91
5144b42M20k05QP3m1k0K2J11k67j15L79r2PK5q8j23l8PK00R0n3J1O3Q1n82N65
$$ plain form
4981 144 -121 -12 -220 139 4 30 43 183 86 5 -199 -156 -16 47 -34 181 13 -23 -7 185 14 -72 -128 -131
5005 -131 -107 2 -181 194 134 -217 -42 -111 -297 -129 -99 129 -63 56 -118 18 5 -70 -13 62 11 -46 -75 -144
5029 -144 51 -29 190 -47 -80 -91 195 -146 97 22 -135 142 -119 -76 -296 -196 55 -21 121 139 23 1 -251
5052 -251 -95 98 -19 -106 111 111 -137 -27 -193 -161 -127 -103 82 160 39 114 91 -107 130 2 383 116 -61
5075 -61 -73 -50 38 79 -184 -152 239 105 -156 143 -135 -11 -8 185 -126 82 -224 -21 136 -75 -32 -125 103
5098 103 143 -297 118 -272 -124 -9 199 -278 -171 -119 -131 280 -38 49 180 -1 -88 -144 -36 415 17 -89
5120 -89 -44 -161 -30 -22 -79 36 86 112 224 100 -199 -41 78 -300 56 8 -101 43 85 57 -83 -130 249 -242
5144 -242 178 -27 -19 54 13 -7 15 126 -141 -256 123 31 38 63 -25 -148 -186 -179 21 111 58 69 132 213 -369 196
5170A96j33j7r0O1k3O2p5P2l10L22l94L75j33J75J4j44K45l39J1K97j4j18J60
5193B00jk84J71k98N2L93j92j49K91m30K60J68r5j23R4N8n3k23M09j23k71K23
5215G7l23K93k20J24j4J81m71K76L4j5L62j6k71j4R5k98L53j63k59M08P1l28K62
5238A44k49P0J38j75K03k85n5J45QN9n7J65K3q4j83J10K3j05J54jL6j38m6Q5n6
5263g1j02J68j86K79R0l43m4R9mL10m35L12K46k77J10q6j91J22K78l29O2j14L0
5286g6O9k42P7nJ22k12L14J8k19O1M07m24L38l12L90k98J15j25j84L06k78N09
5308C51l48O7l39M65o3Jj1qm4Q6k75J47ok29O0L10k60M56k93m3q5j97Q3M03j28
5333A00j59O2K30j92N4J19k11q7n2K5L14k89jJ44p9p0J4j06K37l06l8O76n32J03
$$ plain form
5170 196 63 46 -44 17 -6 56 -19 53 -257 65 -329 46 -87 88 102 -42 203 -136 -125 172 158 40 200
5193 200 199 -85 86 -212 -160 233 41 -108 183 -247 13 181 86 -37 57 115 62 -161 248 125 -146 77
5215 77 -246 47 -173 -49 -63 118 -353 -77 -43 -58 304 288 17 3 98 -200 153 -10 -269 139 210 -118 144
5238 144 -105 -35 103 -72 131 -154 -209 -64 -56 3 -54 111 134 50 -133 -23 0 -105 49 48 84 -54 -100 -15 -71
5263 -71 -173 -5 -191 88 178 -165 -209 -110 -114 196 -239 73 319 42 152 66 -125 -3 275 -54 8 -106 -76
5286 -76 -7 -249 -172 -177 -55 -267 47 65 -154 -93 314 -110 228 -84 306 8 123 -2 -186 120 -158 351
5308 351 3 70 -269 196 133 134 123 115 71 157 -118 29 23 -206 -146 164 -96 360 67 24 -61 -258 -175 228 100
5333 100 -59 3 233 41 95 214 3 -84 -136 -111 203 -86 -87 57 -22 -92 -78 -184 53 -253 -291 385 -147 -44
5357d4p0L50l78K35j99J49M8MKj69o5Q1K97k38J58j33j12JL52m64K80Pp4O0J50
5382B28m98M77m12Mn27J17N22j03L06k89L58k06k4J84k32m6Q7n5K91l02R5J97
5404A72m57M78k3l4M0o3j27p1J9N6K51m64K70J08k79P6p0J77j9j52L05k93j8J16
5428bJ80l39K44q0P3l1pj20P2o2K84j66pj32J4M7j93kK63l56K65J33J6Q1k59K07
5454A23l10J28j9Q1K92l22K51j16k4j5q2N5j79J63o6J76N8l52K78r1p6L5L32j68
5478A52k0j96J01j73J30K1O3J10j88P5j02K77m15L09j0j70jK3j76J11J20k2J23
5501A42j40R8o5j22K67k6qk64K05J75k28k4k46N12m12L7P7J86k12J19j44J39K26
5524B92j50j00k7J55l14O1l00K32j62J89K34k18K34J50l05J46m18P3L51j04j10
$$ plain form
5357 -44 -114 236 -142 93 -106 43 91 95 97 -72 -137 -56 241 3 161 28 -84 -83 269 -195 85 92 18 78 228
5382 228 -270 207 -205 -201 -728 -611 -89 -192 114 -175 183 -23 -47 137 -95 -141 -54 -109 182 -120 -25 172
5404 172 -285 193 170 136 176 113 -14 -85 -66 -10 241 -223 47 155 -124 -48 -118 59 40 -112 193 -100 -118 -2
5428 -2 178 -161 83 3 76 45 38 -82 -10 -72 212 46 39 -93 -79 -32 -225 -227 36 -320 -55 78 94 175 -84 123
5454 123 -187 -59 -78 3 295 -27 224 108 84 69 -13 42 -137 26 -40 136 194 -158 120 29 -47 -12 320 152
5478 152 132 -64 37 -136 -6 15 78 188 0 75 -27 250 -165 144 134 -36 -37 -14 -190 -79 41 19 142
5501 142 2 100 35 -87 180 154 146 -118 87 262 34 10 -236 276 -136 -99 -22 164 -48 71 -73 66 292
5524 292 142 42 15 170 -144 -83 -383 -151 -313 -124 110 -108 126 276 -29 117 -301 -228 123 19 -91
5545i1L70j09j78J16k71K55l52L85L%M7q7j76l6K7K4K36k7J9l4m24L12J32k00
5569e9L5j38o9J60J48l10L75j36J56k11m9J13l3j13M55l77m6O4Q0n1Qk66K41J7
5593fJ82j23j6m63L69P7k16K30j09j00k3K96J40K7k36n6q6M46l85k1K25l34K66
5616H4k14J31N9N9l06J74j34P6K87L5k84M8J9j92K59K02m18K80j19j51K33j68
5638d0J22J41m68R8K34Nk43p8L80l93M06k62L34Om68L85p6j40K73k29L19k78k75
5661b47J67Q0j22j62K50j15O5J5J0l23N78l53LJ57J2M4q6o0J00j11j0j29K54J34
5685A51J6k84K03k9J8l15L81j53K0j18J06J26j58J18q0l9Q7j99j7M61l15j84L25
5708A21k5Q2j51j07K62J7m7k24J81j64j8l3P8k4K11j05J0M8j31k5M7M0R6p4n9
$$ plain form
5545 -91 279 170 -8 108 -163 92 -260 125 128 128 175 88 -88 -124 -97 -73 163 136 155 121 -303 9 141 -59
5569 -59 -24 -162 -231 -71 77 -233 142 6 162 -49 -98 15 -18 -131 324 -53 -99 -35 45 -6 2 -264 -23 -6
5593 -6 176 53 37 -426 -57 20 -196 34 -75 -175 -198 98 238 265 29 -27 -113 333 -52 -73 152 -182 84
5616 84 -130 1 60 119 -187 -13 -147 -71 216 251 -33 15 34 -158 101 303 -115 165 46 -105 128 -40
5638 -40 82 223 -245 -147 87 92 -151 -229 151 -242 164 -98 236 242 -226 159 83 -57 216 -13 306 28 -247
5661 -247 -80 0 -122 -284 -34 -149 -84 -69 -59 -382 196 -157 -154 3 15 59 -27 -87 13 -98 -108 -237 17 151
5685 151 167 -117 86 57 75 -240 141 -12 8 -110 -4 122 -36 82 2 -37 50 -149 -166 295 -20 -204 121
5708 121 96 178 27 -80 182 199 152 -72 109 -55 -73 -106 -28 -52 159 54 64 112 -19 -44 3 43 139 65 6
5733FJ65j50K29j31Lk52o2K18K31j31k40j01J73j61M0L8J33J40j31NL28l86J62
5756A26j96R1j11Q5k64K96p4K29O3m6j10k19J01J79Nk30J67j1j89M8K3j44J63
5779a8M8J46q7N7k3k66K29j03J24k80K59k10K50J15m34L33qN8j78j87J63N8p4
5802b8o7K01l19K2L25l8Q0m56Q7K45m4r7J23k86K26J62j31k25mJ48K23m6P1l43
5826a71J10J25k42P9J37r5l9J89j71K7j08J69o3j3r8K92R3k62K7j91J93J86j93
5849a9N7J72j67J34l18j76J08L12j06o0r4O9J28kj07K44k59J83j47q4oK9p5j44
5873c28L89K63l43m4k1L0K74q0K10k22R5m08J46J19L2J24l52j16L21j35j12J91
5895C3J6J39k34J41j75P5P3k1k94J27J87k9j21K27m5j38jr1K56m0k31J60K1k08
$$ plain form
5733 6 171 21 250 119 122 -130 -192 26 257 126 -114 -215 -42 -203 -163 -125 8 148 17 22 350 -36 126
5756 126 -70 21 -90 -5 -269 27 -47 182 245 199 89 -130 -29 150 155 -75 92 81 -108 -60 -37 -181 -18
5779 -18 30 176 89 146 123 -143 86 -17 107 -173 86 -124 126 241 -193 140 132 190 12 -175 -12 46 -28
5802 -28 -95 106 -213 -191 134 96 176 -280 -193 52 8 -89 34 -252 -26 136 5 -220 -224 -76 147 101 172 -171
5826 -171 -61 64 -178 -99 38 -57 -96 93 -78 -51 -159 10 -53 -66 -164 128 221 -41 -14 -205 -12 174 -19
5849 -19 38 210 43 177 -141 -317 -209 103 -3 -63 -157 -88 40 38 -69 175 -84 99 -48 -132 -138 -109 -184 -328
5873 -328 61 324 -19 -63 -84 -54 220 140 350 128 223 -185 -39 80 112 236 -116 -232 89 -46 -158 33
5895 33 49 188 -46 95 -80 -5 68 47 -247 -120 67 38 -83 144 99 -39 -40 -131 125 85 -146 14 35 -173
5919a73j52K29J75k88M08m12K55l8j66K7m1K45j80K94m6k47M2nJ40j75K16k70
5941a62N12k19q4j81l3L1J49j78J17m8J92K4q6p1P4k25K09j32J28K51n10J81N9
5964bK3o0k50J01J85q2J05l75L91N4j04R6m04M89l26J88K75j99Km61L46J03n2
5987D3K9l90K04M07m34L18l28p0L97J51l35o1j2p5K72l5m17J43J44QK59m24K41
6010C5l28Q82o22k06L81j3j9k29J4K16j53p6Q5o5j60J01K29m3j75L2L07k83Q2
6033hK13K41n13j5q0K87p2k40L46j92n9O6J41k0r9j54K4L43j56O5j9k69L2kL97
6058B57m19J39k7n3N4K22n2l53J75J43l57M95n89K85K51K14n73j33K89L00k94
6079b6M2L3R6j77J90j32m7k59N9J8J03L36l58K50n9p2o8K05j36J76j37j41J6N0
$$ plain form
5919 -173 -325 -96 79 -209 199 -213 42 4 -162 -135 -176 69 -111 183 137 -110 -68 -73 67 -108 108 -162
5941 -162 350 131 47 -134 -167 -136 13 -165 -48 -96 96 120 34 -37 37 -188 21 -111 17 268 -242 -61 -2
5964 -2 21 -39 -289 -188 -3 -85 20 -355 36 90 -14 82 -322 167 -159 29 304 105 107 -354 -8 95 43
5987 43 72 -318 -114 293 -141 177 -151 -221 176 327 -8 -69 -81 -156 116 81 -336 -193 -49 -41 218 -206 35
6010 35 -293 589 -33 -239 142 129 110 -119 -105 111 -42 -118 -33 -98 -258 -157 72 29 -146 -114 193 -90 -8
6033 -8 205 446 -67 -82 -162 125 53 -187 159 -33 -92 -26 115 95 -4 -158 -134 209 53 118 99 -170 -138 -140 257
6058 257 -162 -23 -50 -103 -49 173 121 -232 -57 86 -271 224 -365 -80 171 385 -188 -321 -32 268 -26
6079 -26 16 49 145 -32 158 26 -21 -280 -221 -203 -100 236 -122 128 69 -3 -71 134 -2 174 37 -104 -88 -38
6103c8K56k86R6m7k31M00k57r6N6K63P9m9o0m49L13jj5K7j85K56K62k42j07J93
6127A38j38P1l89K2K64j63K61j9k01J65l2k33J91K37k12J54j11O6j85j07J07J45
6149C1j62L34m23L66m0k92J10L0J09N4j36M0J46l09K27J00j90K47j95J17l87k
6171b25L06k75J29j18K55k23L96n62J61K24j63K54j48l51M13k1k98M31p9l26R0
6192a30J02lK25m28J81N6R6k23p0J91M0j30K0N6l1MN4p6j38L14j97P1M5k40L32
6217A21j79l0j0K47j56J66k85P4L05m5j93J36m38K33J80J59l81j2r7J88j89J69
6239c7j55k3K19M0k21J06j1k7M6k12L67k73J88O3n1l4O2O4k49Q7k35L12J60k77
6263i1j85K04j1J7K22l33M11N6l49Q5j60J42J60l56L39j39J04j50O3m3n2j41J72
$$ plain form
6103 -38 218 -68 28 -19 -250 150 -107 -203 -147 116 195 146 86 -363 -50 -51 -66 -39 -224 32 294 52 -55 138
6127 138 0 71 -318 -296 -32 -195 66 47 -154 11 -21 -254 -63 174 -38 116 5 71 -114 -221 -114 31
6149 31 -131 203 -220 146 106 -186 -76 -46 63 117 -19 21 167 -142 85 185 -5 242 47 164 -223 -225
6171 -225 81 -194 -65 -183 72 -151 245 -317 -156 68 -95 159 11 -340 73 52 -246 185 106 -220 -130
6192 -130 -28 -31 194 -234 -53 3 99 -124 -194 -3 37 -93 -73 -17 -48 -44 10 -66 -204 110 -87 -16 29 -211 121
6217 121 -58 -88 -98 149 -7 159 -126 -52 253 208 15 151 -287 -54 126 285 -96 -108 -205 -17 -206 -37
6239 -37 -192 -215 4 44 -177 -71 -82 -109 -63 -275 92 -181 7 70 19 -15 47 111 -138 -51 -286 26 186 -91
6263 -91 -276 -72 -83 -66 156 -177 234 290 -59 26 -134 8 168 -188 151 12 116 -34 29 -14 -66 -207 -35
6286c5M9k13K52o9K15k43k23J79J48j85J12k7K64j13n3J25k31k4Q0k1J50j67J08
6309G8k39K14k47N5q9L25J7l7J24n36L39p5N0J79j26J7o6J17m10N13L3k52Q9j29
6333e6R7k3J10k91O2p9m4L61j77o6P7N2J37m13J94L47n5k72N7J28n1J18o0j6k27
6358i0L3j00J49M3r5n0M7o2n7K2J56N8k35M6K22k48K63p9l31M29j41j39M5Q0L11
6383B77k81j23j99M59J89l3l52k39L13n5J2r3L35k00J10R3l21K07q5j74J76J41
6405A57J23j54j05k88k0K21J25M7j43J68k28J30j2m1o7J75j31r3J8J28M42l18
6427A34k00NL5j61K44j75k05%Q09o15P61k66M32n61q1j06K53l72J20r8K56l49
6449a40M2K95k07Oj98K46mj20K16r4j29NL01m28L62j69n0Q6J53q1j83K49j12L0
$$ plain form
6286 -35 14 -199 53 -16 199 -44 -267 -88 60 -125 -13 -40 224 111 58 183 -48 -72 8 -13 137 -30 78
6309 78 -161 53 -194 -139 -228 97 114 77 201 -335 4 -71 -21 158 32 49 -17 100 -310 203 236 -16 73 -56
6333 -56 41 18 128 -163 -101 -180 -224 137 -40 -106 -29 23 160 -253 -59 288 233 -39 18 146 95 213 153 137 -90
6358 -90 -57 -157 -8 35 -60 -110 -63 -125 -182 -160 -4 54 -181 -135 87 -161 102 23 -308 121 -20 -159 -114 -34 277
6383 277 -4 -127 -326 133 322 289 -63 -302 11 -44 -32 -125 210 10 120 213 -108 99 14 -160 16 157
6405 157 280 126 21 -267 -287 -66 59 106 -37 131 -97 33 21 -20 -87 88 -43 -136 -118 10 452 134
6427 134 -66 -61 -26 -187 57 -118 -323 -323 486 -129 632 366 798 237 156 50 303 -69 51 -47 209 -140
6449 -140 -98 197 -10 -4 -202 44 40 -80 136 42 -87 -82 219 -209 153 -16 -66 20 173 92 -91 158 46 76
6473G6M5M5j12J11Mj27o4J05o0m2R4J04N5l53L32j29R6m50M38k06J51j25J67J
6497A56k6j03j98L26n6K00j07j71j23J90n5Jk86N07j59q5j50N1J41K10L9k39j08
6520d5K28k70J71k0o4l5pj65J87O0j51J49r4O6Q2j33K76k82o4K08j49n4O0J28
6544H2j20K27k38J34j36L6L4q5n1K94l44K04Kr7Jj88J84J13j29r8J98n0j8K6j77
6569a96P5J21j3J64k17N9N9l8j00J73j20j11Q6K4R7O9j09O6j06m0K58j13K85m43
6593g0mj10J91j07K09l01MK05n7j17J67N6j05k06M09m99N09k60n0K28l84J92K68
6616A68N4k20m5P5L12l07J48m5k51K38L4n0K2J62k82Q4k36L00k58Jl9L87n5l51
6640a54K56K14l21J36n5k29q5L28j66p8O9j75L34j33Oj09M34l79J45J94m24N2
$$ plain form
6473 76 121 166 54 165 169 42 -22 83 23 -19 75 179 234 -119 213 84 180 -270 168 -38 113 -12 155 156
6497 156 130 27 -171 155 99 299 192 21 -102 88 33 34 -252 255 96 11 -139 -88 53 263 302 63 -45
6520 -45 183 -87 84 64 0 -35 -42 -207 -20 40 -111 38 -56 10 92 -41 235 -47 -111 97 -52 -106 -46 82
6544 82 -38 189 -49 85 -51 -15 19 -66 -117 177 -167 37 39 -58 -57 -245 -61 52 -77 -175 23 -27 -45 -19 -196
6569 -196 -121 0 -13 151 -66 -7 52 14 -86 87 -33 -144 -58 -34 63 132 23 89 -17 -57 201 88 373 -70
6593 -70 -74 -184 7 -100 109 -192 -188 17 -40 -157 10 66 -39 -245 164 -335 174 -86 -136 92 -292 -100 168
6616 168 222 2 -43 32 344 37 185 140 -111 127 161 111 133 295 13 97 -139 161 -97 -96 -135 252 197 -154
6640 -154 102 316 -5 131 76 -153 -238 90 -76 -154 -85 -260 74 -59 -53 -162 272 -107 38 232 -192 -140
6662a40M61l10K7Lj36Q7j09K84l85J81J95k32j68K35j45M1qM2jJ61k71p0L01N
6686D8j46K80n1k1k48J91j32q6L02N4k64j77L59r1k11K9K37p1P3j09K49k92P6
6709aQ0P2k81J54j35p6J32M2L6J93q4m34J77J10L94m96J6k95M74k98M60j56N9
6732A43j10k0N7N3K75k80j88L9o6O0k03K78K9J79k73k4J47J5J47k82l07L93L9
6755A01L3k25l8k02K14J56j22J02J03j48L35j25k40j32L15N0k52K61O2l68K51
6776A31j93Q8J29j44o1J63J11r5j96M95o21J70Nj45L05l46K35kJ61k15Q3N2Km40
6800c28K77J13J5j35q3k20O57k45L9P4l08M1K14j27ol52K65j43J37K72k1m2p3
6823B1j99K2K65j40K76m27K9Q8j40K32K68m91M56Jm43J69J08k56J23l9m6L1M9
$$ plain form
6662 -140 321 11 38 41 -95 -8 -117 167 -218 -37 158 -74 -242 -7 -152 -111 -119 -77 -78 83 -188 -258 43 48
6686 48 -98 182 131 110 -138 53 -79 -165 137 191 -73 -250 109 18 -193 -164 73 2 75 -34 215 -77 -1
6709 -1 79 151 -130 24 -111 -187 -55 -13 23 216 132 -302 -125 -15 379 -117 -101 -396 78 -220 240 84 143
6732 143 33 13 70 123 398 118 -70 -31 -97 -37 -240 38 67 246 -27 -51 96 111 258 -24 -331 62 101
6755 101 134 -91 -129 -331 -117 39 -83 19 122 -26 309 184 -56 -188 127 177 -75 186 248 -120 131
6776 131 -62 26 155 11 -50 113 224 129 -67 428 -193 -23 -18 -163 142 -204 31 29 190 -25 58 110 112 -328
6800 -328 -51 62 77 -58 -141 -361 296 51 90 164 -144 -103 111 -16 -22 -374 -109 -252 -115 157 136 94 21
6823 21 -178 -156 109 -31 245 -182 -153 -65 -205 27 295 -196 260 261 -182 -13 95 -161 -38 -77 -123 -92 -43
6846d3o5Q9q1j16j61L84k11m6N12m06j7Q7K90k11j70M23j73j10P5R8pk01k24K72
6870a2p6J94m2j01K31n28L99l6J1k9k60M22m05L5L12J11m20M7Q6m1J11p6N9O0
6894E2k1k83K01kj66P4J7L96k35J18k61K62j22q7J04P4j89K02l70J48P4j06M0
6917h0N5P1J57m54K58j56J11O0J29K1l5l78MJ67j0o8J47Mk08M65l31J84k3k13
6941a23L23n3k47j62J06J62L14l91L07l6j3m00K87lO6J78k48l12J29M7M3j36J43
6964a9R2l41J90O9Q8o9K6o6J71r3j7r3M1J03p1r0n9L01j66R3j4j80O6QJ03k6j40
6991i3J31L0k20j2J40R3K6m6m3j41L92j38l12K11l74M59J13m30K18R1N1j52m5
7014e1o4J13j53J7r5N19l49P9m9J2O7l25L21P0q3p0L50j45j16k6j19N7j67J42
$$ plain form
6846 -43 -108 -19 -100 -216 -377 7 -204 -250 262 -144 -161 -74 216 5 -165 258 85 -25 50 148 141 -60 -284 -12
6870 -12 -88 106 64 -37 194 -334 65 29 40 11 -249 173 -232 -197 115 226 -194 -147 -61 -102 9 -67 -8 52
6894 52 31 -252 -51 -53 -219 -145 -128 268 33 151 -110 152 30 -57 47 121 -68 134 -236 -88 -14 -120 -80
6917 -80 -25 46 203 -251 7 -149 -38 22 151 172 137 -241 -237 -70 -80 -148 -1 3 -205 260 -71 113 90 -123
6941 -123 200 147 -100 -262 -156 6 320 -71 236 200 187 -213 74 71 137 315 67 -245 -116 -69 -26 -162 -19
6964 -19 73 -268 -78 -9 79 10 36 -30 141 48 31 -62 -21 82 11 -79 -138 163 -3 90 76 -104 -38 -30 73 47 -93
6991 -93 38 68 -152 -164 -24 69 95 49 6 -135 257 119 -193 18 -356 103 216 -214 4 95 146 -6 -51
7014 -51 -115 -2 -155 -138 -233 286 -63 16 -33 -21 46 -279 42 112 29 -41 309 164 48 22 -97 -40 -207 -65
7038f5m8p1K0j6M6K86o5J24l28J47l5j17N9J57j3k7j31n1M36m11Pj56K84j06N0
7063b4L5J72k48j23K36M6J14j62o8Oq3L23n99J81P56o73M30k18l23J58j49M74
7085B61m21R3J54p5l09M23M4j77j06O1M6P7J89j35L4l87L46P6k80j17J81J23k20
7108a19K09p1j57%K23j7J2J70l10P4L4l20K75m0p0j8M7l8M00k20J51j38j16N15
7132D76l66K17ml17k79M66l13L06P2j72m77O70o4l01Q0K25n08M93l27J39k53J71
7154f6j45L15k93P0O3k39K93K67N3N1n22J66M65m69k85R9J80o50Q2M95j63l59
7176e92N90j96l08L67J33m46L69o9N99l49j22M24o04J28L70l89L71Km30P28j022
7197d46N91R8m71K93Q6n33M95l26L35o1P7j26j91K77r1j33K19K23l32K54r4OJ2
$$ plain form
7038 -65 -113 -184 -164 -180 -134 152 87 211 -117 30 -5 -122 -63 94 81 54 -77 -128 308 -103 -96 -252 32 -74 -24
7063 -24 11 183 -65 -188 48 94 208 46 -22 -16 -99 224 -375 -194 562 -111 319 101 -222 -64 -213 261
7085 261 -160 -67 87 12 -297 126 170 -7 -113 -52 -6 71 260 125 159 -228 118 194 -86 -203 -22 101 -119
7108 -119 90 19 -138 -138 85 68 80 250 -60 14 48 -272 3 -37 -107 -125 -78 -116 284 64 215 77 -39 476
7132 476 110 327 323 6 -273 193 -120 186 258 86 -391 279 215 -86 -6 219 -289 204 -123 16 -237 -66
7154 -66 -211 104 -189 -119 -56 -295 -2 265 318 369 -153 13 478 9 -276 -177 3 -647 -565 -70 -233 -592
7176 -592 -2 -198 -506 -139 -6 -452 -83 -152 447 98 -24 400 -204 -76 294 -95 276 278 -152 576 -446
7197 -446 145 243 -228 65 151 -382 113 -213 122 61 138 12 -179 98 7 -126 93 316 -16 238 144 150 162
7220A62J2j76q3J40j54J02J16l7K01m67MO4K03k68K83j60m7q1J93K1j55J68r8
7243e7K60k69L82l43J93k27j45K37R3K04k00l02J84j02M2J45J28k69j33L49k90
7264a20j79O01j10q5j60J38k81k4K40J84l79N4M08k24J97m80J00M27l00p4nL36
7286B64k04KkK7J4O7J2k02J60j21K2j48R7J3p7n0M80k54K15m26J66o8L9k38J68
7311d4J31m4K97o04M36M2l83K30q9K17l99o9K40P6P6j55P7q2L32m01J74K0J8j52
7335e6l4M01l08N6k44Q5Q2o7k28O67o99j27O81p0l18K37O8k12j31J48J7K52P2
7358B72l19L62Pk52r7R2j14R2j87Q3N5J76k28J21j92J02O1j69K82j8j60J00j42
7381g3N1J15ll47L02j30MM44n83K09K9K18j84K11l56N9j94K63Ml13j32L67L5j62
$$ plain form
7220 162 174 -2 -85 55 -99 3 119 82 283 -184 -180 -116 87 -181 102 -58 -105 -186 7 28 -127 41 -57
7243 -57 203 -66 316 -27 166 -61 -206 31 124 328 128 -174 10 -92 -50 95 223 -46 -179 170 -120
7264 -120 -299 302 192 107 -53 85 -196 -220 20 204 -175 -121 287 63 260 -220 -120 307 7 -67 -72 264
7286 264 60 62 60 87 101 168 180 -22 138 17 39 -109 -12 1 -76 -126 354 100 315 -111 55 -13 26 -212 -44
7311 -44 87 43 340 -264 172 214 -169 61 -28 189 -210 -279 -39 37 113 -42 35 -47 285 -116 58 78 96 -56
7335 -56 -90 311 3 59 -185 -100 -18 -85 -313 354 -345 -472 209 139 -179 58 126 -86 -217 -69 -52 200 272
7358 272 -47 315 322 70 -27 65 -49 43 -144 -61 -6 170 -58 63 -129 -27 34 -135 147 129 -31 69 -73
7381 -73 -22 93 90 -257 45 -85 -81 363 -220 -11 18 236 52 263 -93 -34 -228 35 39 -274 -406 -39 -4 -166
7405a66J63O1Q4j4k92K15l48R9K61j29%j74J31N2M2j88R8K1kk69k6N14r5k7M0
7430E1k48K95j32o2J84o1J2m8J45l04q7J56J4j41L30j77N58o78K38R9k8o0J04
7453A60o0J0mp9K7j6O8k38K13N6l17o9L94k20J95k98K50l2j4N8J56k70P2l8k7
7478b3l1L54l00K15l04j80J37M0k0J51N7l9P3k85O3R9r1J10K43k35n6K13N3m08
7502a64q0M03l60L13J62k56k34K68n7k23j88j3P14j31l89J7K10k38M23l9q5K32
7524B85l81P8%j1j38N1P2J93k06j54J84k44K94j33J10j6k01L86Q3m63J72j32K08
7547C7r5j58L31j37J18j17q8L8j92K48m1L00l96K83j40p4P8Qj33NJ19p5j6J93
7571I6K2o6K62k70J2J54j62k26K33M1k16o5PM56k90j93Q7L03j52r2PK45k27k5
$$ plain form
7405 -166 -3 58 142 128 -164 51 -297 -198 63 -66 -66 -240 -109 -57 -15 -203 -105 -84 -86 -355 -381 133 38 11 51
7430 51 -197 98 -34 -96 88 27 39 -9 136 -168 -255 -99 -85 -226 104 -73 485 -193 45 144 116 56 160
7453 160 100 110 106 27 54 38 106 -132 81 137 -180 -249 145 -75 120 -178 72 40 26 84 240 -30 42 4 -23
7478 -23 -54 300 0 215 -89 -269 -132 -92 -112 39 96 57 130 -155 -92 7 -84 26 269 34 -22 191 244 -164
7502 -164 -244 159 -201 112 274 18 -216 52 -5 -228 -416 -429 285 154 -235 -218 -8 -246 177 138 53 285
7524 285 -96 -18 -18 -29 -167 -116 -44 149 -57 -211 -27 -271 23 -110 0 -16 -217 169 252 -211 -39 -171 37
7547 37 -58 -216 115 -22 96 -21 -109 -71 -263 -15 -56 244 -152 131 -9 -83 -5 3 -130 -125 -6 -81 -97 96
7571 96 118 52 314 44 56 210 48 -178 55 96 -120 -185 -178 278 -12 -205 -118 185 33 -59 -52 193 -34 -59
7595e9j82K03j08L06k87J63j0M4r9kj59M62k81j90L43l30K29l04J69Q0pk73P6
7618b16M03j93K94l00J74k36j81L77k94J69j9J24L5l47J10r3N2K93q6Q6n1j85
7640h4j4P1P1J8k40L32l80K91k22j08L90O5l26J04r4J83p4o0K45k69J84j58J72
7663I7j36J36k57K52J59l89K54j40n2O6M3m1K0j68K85K0j44j23K30j40M2m4N7
7686B7j76L28k44K1j66Q6Q2O2Q0j22j09R7O6J87l23O8j43L79l68k2J14J51q8J61
7710A48J70m67R6J76J85m02K62J28m46L89M9l01L08l29J03k18L15m10L85j74K57
7731B24m54K17N2l45K61j19K70NJ02j55N2j70K54m21M85j80l6J71k92J01R0P4
7753A86j36N1j16J77l98L37j83j92J25L38j89J46j17j93O2J99q2J56j80K9r1l2
$$ plain form
7595 -59 -241 -38 -146 160 -127 36 26 70 -29 -31 -190 272 -9 -199 144 -186 43 -261 -92 -12 -19 -292 -216
7618 -216 187 -6 288 -12 162 -74 -255 122 -172 -3 -22 102 137 -210 -100 -193 -141 152 66 152 101 -84
7640 -84 -98 -27 44 62 -178 154 -226 65 -157 -265 125 190 -136 -32 -126 57 -17 -77 168 -101 83 -75 97
7663 97 -39 97 -160 92 251 -138 116 -24 -76 -10 33 -8 12 -156 129 149 5 -118 112 -28 14 -30 27
7686 27 -149 179 -65 -44 -210 -124 -42 20 100 -22 -131 -34 32 219 -104 -36 -179 200 -168 -190 -76 75 -13 148
7710 148 318 -149 -53 123 308 -94 168 296 -150 239 288 -13 295 -34 69 -149 166 -244 141 -33 224
7731 224 -230 -13 39 -306 -45 -164 106 111 213 58 110 -60 194 -227 258 78 42 213 -79 22 112 186
7753 186 50 101 -15 162 -236 101 -82 -274 -149 189 0 146 29 -164 -102 97 15 171 -9 20 -71 -103
7775a03N2k7L29k26N6l8O0n2j71J99q1l9J91k72J67o6J29Nq5n2k23L32Q5j33O7
7800A04k9l05L20j40J37pn1r9q4K11J09j28p4P3%K0j82K40M4j31j5K1O7l73R8
7825a74M2n9L42o9M2l01J58J08K00o6n05K26m5K05L7J2k75L5J18o8j67m4J71L2
7849d5p2J71q0R4P8l27K00j84M00J2n90J77J66j01M6l5J79o0k7j02L49j70l44
7872b65L79j8q1j0j40J85l3l2k22K40J31o7o4J26m00N15l11P4R8q1o9N4M85l64
7896A30o7j62J18K16m97L79j98K63k15j85L04rM3q0o0q1R3L8k07J07J61j1l82
7919c02L93J21l65J2N8K2J21J06Pk90K50k4l14L53k04J24j79J81J02L8k25K05
7941A90M2n92K67J20q4J56k36Q8o5L40k31k9j21Q1O5k04K14j01k2M0K65j7k89
$$ plain form
7775 -103 -51 -78 251 25 81 43 103 51 -120 79 -2 -41 150 -122 45 -21 108 113 28 -24 -247 85 170 37 104
7800 104 75 -230 90 -50 87 80 29 -70 -154 57 166 38 -36 37 37 57 -125 115 159 28 13 34 101 -272 -174
7825 -174 -132 -191 151 82 124 -177 -19 89 289 223 -282 -56 -101 104 141 153 -122 -87 31 -37 -204 -248 -77 -45
7849 -45 -117 54 -26 68 146 -181 19 -165 235 247 -343 -166 0 -101 -55 -90 89 29 2 -100 249 79 -265
7872 -265 114 96 15 5 -135 50 17 -15 -237 3 134 67 3 129 -271 244 -67 7 105 24 -45 9 494 130
7896 130 63 -99 19 235 -262 117 -81 182 -33 -218 86 77 120 40 -20 -101 -8 30 -177 -70 91 80 -302
7919 -302 91 212 -153 -141 -83 -61 60 166 173 -117 133 109 -205 148 -56 68 -111 70 172 210 -15 190
7941 190 232 -360 -93 27 -57 99 -137 -49 -114 226 -5 -34 -155 -74 -9 -213 1 -100 -122 -82 183 166 -123
7964a23L11N9j72j74r7J60p6K02o6K68l30M5r6R5K0j53Q3N5J50r4P5k57o2Q2K56
7989A61l42J13o4N6QJ18J39l01k7R9R2k8o1NJ16P1k34o6J27r7K26m2K6j07L81
8014C69m10J18r9N9q0j76J31J77J21m76K74j73L01k77nP2J78M7j42Oq3N0K14j54
8038D2j56J84j70K1R8k25J46M09l38K53l79p2L85r0j95K40k37J82K4k7j60m4q9
8061a98J22K76l15O8O2k72K67j52K72q2N4q0l4K3o3l8J34l81K58J51j81J82j26
8084e3j31L84l82K25n5L8o6j04L38l2l20L34k77J11k67J25J63j8q3L17k79k17
8106b49K91k46K01J7k56K67K50m1m1L11o78J01r7J25K71k94q5J21q7J58j21L36
8128B54l3k83J7Q7o4L51n19L01j55J53j48l3K19l72K34m3J29P4J22r1j41j35J27
$$ plain form
7964 -123 188 247 75 -99 -196 -36 -112 90 24 292 -38 7 -89 6 26 -127 -44 11 161 67 142 -115 -177 -95 161
7989 161 -181 -68 -132 -76 -68 50 189 -112 -139 -40 52 24 -37 -32 84 155 -79 -145 -18 -115 111 69 95 -12 369
8014 369 -41 77 -22 37 -43 -219 -88 89 210 -266 8 -165 136 -141 -146 -74 104 151 9 15 -68 -18 196 42
8038 42 -114 70 -100 -79 19 -206 -60 349 11 264 -115 -187 198 108 -87 153 -84 98 122 95 -65 -109 -198
8061 -198 -76 200 -115 -47 15 -257 10 -142 130 48 102 22 -12 11 -52 -90 44 -337 -79 72 -109 73 -53
8084 -53 -184 200 -182 43 -12 26 -40 -144 194 162 -158 176 -101 10 -257 -132 31 13 -70 247 -32 -249
8106 -249 42 -204 -3 14 -242 25 275 234 193 504 -174 -73 -170 -45 226 -68 -153 -32 -119 39 -82 254
8128 254 221 -62 -45 42 -22 329 -190 111 -44 109 -39 -72 147 -225 9 -34 95 169 291 200 59 -76 51
8151E1k90L91n3J38m06J53J08Qm2j62J68J25l58J79l0K21j30m8k14J41P9N9j36
8174d8J1K03l06r0L41r0j64J15R1J31j07p9o0J29m3Pk5
$$ plain form
8151 51 -239 152 99 237 -169 -16 92 100 58 -104 64 189 -169 10 -20 201 71 23 -191 -50 29 88 -48
8174 -48 -37 166 -140 -230 111 21 -143 -28 63 194 87 8 -52 77 34 41 16
8191A6
$$ Imaginary data points
##PAGE= N=2
##DATA TABLE= (X++(I..I)), XYDATA
0@%%%%%%%%%%%Oj4J6j6J6k4L2m0M8n6O6p4Q8j04J24j48J70j94K24k57K94l36L81
34B02m30M86n46O11o85P64q49R46j052J164j288J422j568J731j910K104k316K551
52A337k813L104l427L791m204M678n225N866o632P562q724J0222j2235J5100j9526
67a1126K7323m5054J59603j64k81322J09904Q0598r730k20k3271j15030M385J22205
80A8101N8570r3018m6130o333Q013R3311M4187j07041k0940N0199J9516M1811
92F0246Q416o9644l3302K8430P6332K0613r1426o0592J8516K4843M2593J0867
104C5892n2727n9753K014R8104N5517q1474n3313L954N850Q1244N4751p2349n9359
117d1649K835L6347O3752R178o7694o4371J9323Q3552J2302m9410j6658l6404
$$ plain form
0 0 0 0 0 0 0 0 0 0 0 0 0 6 -8 8 -8 8 -16 16 -24 24 -32 34 -40 48 -56 68 -80 90 -104 120 -137 157 -179 202
34 202 -228 258 -288 323 -362 402 -447 499 -553 611 -677 745 -823 908 -1002 1102 -1214 1337
52 1337 -1476 1628 -1799 1992 -2212 2466 -2759 3107 -3525 4037 -4687 5535 -6700 8400 -11126
67 -11126 16197 -28857 130746 130582 -150740 -40836 39762 30032 29812 6541 -108489 -104104 18101
80 18101 76671 -16347 -62477 -68810 -60797 32514 76701 -30340 -51280 -1081 18435 60246
92 60246 68662 -982 -34284 -5854 70478 91091 -335 -60927 -42411 -17568 25025 35892
104 35892 -16835 -76588 -74574 23530 79047 -2427 -55740 -51786 -45936 35308 90059 17710 -41649
117 -41649 -38814 -2467 61285 70463 2769 -61602 -42279 41273 53575 4165 -12493 -48897
129d8897p779Q9822L0045o8103m4288O442M7842L0846k5494k7833k5145O384O9457
142C3299K3300m8953l8467m953M2813L9973k2674l4843k2461J0824N3028R204
154D0090k8887j9311l6677J5750P6030k1o0106k9314N495K9279K8253J1999l1036
167A544o4120K0578Q5620Q224l8571k9848k5563L2006N2268j594l0528l4054n248
180b9286L6915K7146p99l9403m3669L1850M2402j2328q863j6389k7928K0476M0858
193B0982J1987l2731l8032K6928L7436o694l914j8710k6966K6246L3434J58k1777
206H347l7573J915M1022J7753j2189l8950k0624L4134K1777J083k89m1066k3205
219d7865M3831L9489k360l5199k8639J4831J8609J6280J7692l6242m0188K0897
$$ plain form
129 -48897 -56676 33146 63191 -4912 -49200 -42758 5084 35930 10436 -17397 -42542 -36158 33299
142 33299 56599 7646 -30821 -35774 7039 47012 24338 -10505 -32966 -22142 30886 40090
154 40090 11203 -8108 -44785 -29035 46995 46974 -13132 -42446 -36951 -7672 20581 32580 1544
167 1544 -62576 -41998 43622 51846 13275 -16573 -42136 -10130 42138 40544 10016 -24038 -29286
180 -29286 7629 34775 33976 -5427 -49096 -17246 25156 12828 3965 -12424 -40352 -19876 20982
193 20982 32969 238 -37794 -10866 26570 19876 15962 -2748 -29714 -3468 29966 30124 8347
206 8347 -29226 -27311 13711 31464 19275 -19675 -40299 -6165 15612 16695 16406 -24660 -47865
219 -47865 -4034 35455 33095 -2104 -30743 -15912 2697 18977 36669 427 -39761 -18864
231a8864L4221J8089j5540m1385n428K0486K0602J5312k5398k7727J1018J2993
243a621J8218J640l8589m394L1434P087o737j1696o823K840J426K4617R928m4522
257a7192j0915L3527J1642J071j3896k7964r25J9248K8584Q378l8679k4762J2299
270a9584K2173K9486j2412m3594O35J6977R727J9858p128l0824j4388J7350L8709
283B6985k051l2878K908o4p552K4624P111k3677j2328N716K2763O317k2457o682
297a1265K842N712J9165q668j7344M155k448J4878K0203k5982k7095R108K6979
310A0240J8219k0375j9534N977p948J2033L1536j6674l1298j526J3912K0721m80
323A4803j4743n933j4099Q216L3009K78j6713j5468j1646K5706K0656k0536j2824
$$ plain form
231 -18864 15357 33446 17906 -23479 -28907 -8421 12181 27493 2095 -25632 -14614 -1621
243 -1621 16597 18237 -20352 -24746 6688 13775 7038 -4658 -11481 -8641 -7215 17402 27330 -17192
257 -17192 -28107 5420 17062 18133 4237 -23727 -24652 -5404 23180 31558 -7121 -31883 -19584
270 -19584 2589 32075 19663 -23931 -23296 -6319 3408 23266 16138 -14686 -29074 -11724 26985
283 26985 24934 -7944 -5036 -5100 -12652 11972 19083 -4594 -16922 -11206 11557 17874 -4583 -11265
297 -11265 -8423 -2711 16454 7786 -9558 -5403 -7851 7027 27230 1248 -25847 -16739 10240
310 10240 28459 8084 -11450 -5473 -13421 -1388 30148 13474 -17824 -19350 -5438 15283 14803
323 14803 60 -5873 -19972 -11756 21253 21531 4818 -10650 -22296 3410 24066 3530 -9294
336i294j142M938J3866J870j963j2132j7991K4757K0428k5053q361Q756j193M141
350A627M51L14m065j5108J5949K1738j5064j0655n857k325K2014K779j4045j027
364c274p992L792K1160J590j1385k1786m102L3618O741j9737K280r276r620K0723
378B732J2773o631j8854j1654K2714J0851r839L591j1989j1555J6915Q448L215
391A0717k989k2265L781J8886q36m516j1116j26J4635n297J243Q561k2081j846
405a3249K4246j504j3239p785O324J6830p772o905O676j3681P61K0258j342m457
419E161q003j3156J3062J1595k663J070j2789o412J0717Q231J4411j1001l4598
432b4375J0390K4346k507n44n688j0586N10L892J6494O77k4336M822J3296o906
$$ plain form
336 -9294 -10436 -5498 8368 10238 8275 -3857 -21848 2909 23337 -1716 -10077 -1321 -2514 1627
350 1627 2078 2392 -1673 -16781 -832 20906 5842 -4813 -10670 -12995 9019 11798 -2247 -3274
364 -3274 -11266 -7474 13686 15276 3891 -17895 -21997 11621 18362 -1375 905 -8371 -17991 2732
378 2732 15505 8874 -9980 -21634 1080 11931 2092 5683 -6306 -17861 -946 7502 10717
391 10717 7728 -14537 -10756 8130 7294 2778 -8338 -8464 6171 874 2117 10678 -11403 -13249
405 -13249 10997 9493 -3746 -11531 -5207 11623 3851 -3054 3622 -10059 -9298 10960 9618 5161
419 5161 -2842 -15998 -2936 8659 5996 7066 -5723 -12135 -1418 6813 21224 10223 -24375
432 -24375 -13985 10361 7854 7310 1622 -8964 -8454 -4562 11932 12609 -11727 -6905 6391 -515
446e15M062q58o937O103m116L34J0591o982k375M669J61L515j3166p844K0888
461G530k11j0768Q136q411j1384R618J3647N911j6813j4657J6569P315k208P765
475A2039j2648j3098P343O544J3359K053k0337l594M357K336Q611l533m589k670
489c827j0677J3200J7010j6472j0346N079M228N199l473N46N710j0969K428J1886
503I522j3251n741J2131N365n16j1591n814J0969l23j045M759q852j090M813o25
518a289J1398l182j8948K871O457J4P169K599m964j1912m329K3320O155k0168
532d809N1N120k682P287K157l976o111q015J1030R775q166l58q01k207M303p163
548d565j613R292p338l390J0602P30l607n242L812J0394r818l899J3261o573m427
$$ plain form
446 -515 3547 2689 -4248 1855 -2261 -1927 8664 1682 -693 3976 4137 7652 -5514 -13358 7530
461 7530 7319 -3449 4687 -3724 -15108 -5490 8157 14068 -2745 -17402 -833 6482 4274 12039
475 12039 -609 -13707 -6364 180 13539 15592 -4745 -8339 -3982 -1646 6965 3432 -1157 -3827
489 -3827 -14504 -1304 15706 -766 -11112 -6033 -1805 3394 -79 467 6177 -4792 -2364 9522
503 9522 -3729 -9470 2661 8026 7510 -4081 -9895 1074 751 -294 4465 -4387 -5477 -664 -1289
518 -1289 10109 6927 -12021 -9150 -2693 -2679 4490 7089 2125 -9787 -14116 9204 15359 -4809
532 -4809 -4758 362 -2320 4967 7124 3148 -2963 -10978 52 9827 1661 1303 502 -1705 2598 -4565
548 -4565 -6178 3114 -4224 -7614 2988 3718 111 -5131 -1319 9075 -743 -4642 8619 2046 -2381
563b381J2196k405j0294m492M265J3044l375r903J951l274K281O425n917N02k800
578d177p760J4459R870j2062l772R48J001L648R00P542l010j5773O313J0667l903
593D891l299n757r85O545m207L295N357j2619j166P689k084J396j43R08N722p626
609b083l316R390j240j103J78k016O545n187o292J1681k362r455L582j573k686
624e937N230K585M220j1292j2030J5267Q755k501k311q202n75R211j13M257j075
639E489j2533L327P350R68J834q466r51N778j0538K193J3388o560n987J8M91M528
655C29k992J606O351r491O66Q702n972K130L308o134M390k314o774J0606M024
670H435n772m016m608N269J585l585J0010m173j5872Q142O509j323L812n710j864
$$ plain form
563 -2381 9815 7410 -2884 -7376 -3111 9933 6558 -3345 -1394 -4668 -2387 4038 -1879 -1377 -4177
578 -4177 -11937 2522 12392 330 -3442 -2494 -1493 2155 3055 10597 7587 -8186 -1873 8794 4891
593 4891 1592 -4165 -5150 1395 -2812 483 5840 -6779 -7945 -256 -2340 -944 -1087 -179 5543 -2083
609 -2083 -5399 3991 2751 1648 1826 -190 6355 1168 -5124 6557 4195 -5260 -1678 -3251 -5937
624 -5937 -707 1878 6098 -5194 -17224 -1957 6798 4297 1986 -6216 -6791 2420 2307 6564 5489
639 5489 -7044 -3717 3633 4601 6435 -2031 -2982 2796 -7742 -5549 7839 1279 -4708 -4690 -4199 329
655 329 -2663 -1057 5294 -4197 -3531 5171 -801 1329 4637 -1497 2893 579 -6195 4411 8435
670 8435 2663 -1353 -5961 -692 893 -2692 7318 3145 -12727 -4585 1924 601 4413 -1297 -3161
685c161K238l471J0523O092j2697l803J76L786R486o121m042M896p675J349O880
700D456m459J577k097k954O722o228k807J2429n050p664L831N59M741ml507N852
716E397n166o693R867k53k317M128o435j96J290m973R282K507j1339L55J284N019
732A757N754r780k286N530q519M805R256n619j792j920K143N873p239J515Q298
747G776j1953m70R077l824j7j447m627N766o46k455N124l369L59J138n113N993
763A312m62p093J1122L23j2056N750M601j400j320m861N163J547o450P944P95
778D915r925L093q8o89N412m380J023L319q417K503P442j621o93n969l14J1287
794F898l855l864M460o847r58O265O93J792n237l211Q336n304m388Q261k070l043
$$ plain form
685 -3161 -923 -4394 6129 12221 -476 -4279 -4103 -317 9169 3048 -994 3902 -3773 -2424 4456
700 4456 -3 1574 -523 -3477 3245 -2983 -5790 6639 1589 -6075 -2244 -1685 3056 3052 -455 5397
716 5397 231 -6462 3405 3152 835 4963 -1472 -1668 -378 -5351 3931 6438 -4901 -4546 -3262 1757
732 1757 7511 -2269 -4555 975 -7544 -2739 6517 898 -894 -2814 -671 5202 -2037 -522 7776
747 7776 -4177 -4647 4430 606 589 -858 -5485 281 -365 -2820 2304 -1065 -706 432 -4681 1312
763 1312 850 -6243 4879 5202 -6854 -1104 3497 2097 777 -4084 1079 2626 -3824 4120 4915
778 4915 -5010 -1917 -2005 -2694 2718 -1662 -639 2680 -5737 -3234 4208 2587 1894 -4075 -4389 6898
794 6898 3043 -821 3639 -3208 -4166 2099 2792 4584 -653 -3864 4472 -832 -5220 3041 971 -2072
810b072R07j971N216Q84n381N195j864n166N977Q69Q06R16p420K622K352o268
826d398N768M262n355j651k729L939O258p840o85M584o867K290O359q42j83n073
842b163j689M867k428K813O329p538l614J439O47O762l085p706M482K00r73M302
858B645j464r48k232k753O715j189n083Q832M33q916j38J461N163K377o481Q68
874g10Q17l473N411J084l813L56m502J959O105m269J785L741o941k177J536M473
890A382M805o438l707M475l271J549N881m083k676o30Q64N973k541k993L605l097
906i02l259L255J052L628j839o422M037J273l975M716O87k379k42k353M398J733
922C408n904L594J380o216J931L322K065Q5o675O58M598l286J937J916l684J41
$$ plain form
810 -2072 -1165 -3136 2080 2964 -2417 2778 914 -4252 1725 2594 3400 4316 -3104 -482 1870 -4398
826 -4398 1370 5632 277 -1374 -4103 -164 6094 -1746 -2431 2153 -4714 -2424 3935 3093 2910 -2163
842 -2163 -3852 1015 -1413 1400 7729 191 -3423 -1984 -1337 5425 2340 -5366 -884 -684 -1657 2645
858 2645 1181 233 -1999 -4752 1963 774 -4309 4523 4956 -3960 -4098 -2637 2526 4903 -1578 -710
874 -710 107 -3366 2045 3129 -684 -328 -4830 -2871 3234 -1035 750 4491 -2450 -4627 -3091 1382
890 1382 6187 -251 -3958 517 -2754 -1205 4676 593 -2083 -2713 -1849 4124 1583 -1410 2195 -902
906 -902 -4161 -906 146 3774 1935 -4487 -450 823 -3152 1564 2251 -128 -370 -2723 1675 3408
922 3408 -2496 1098 2478 -3738 -1807 1515 3580 3665 -3010 -2352 2246 -1040 897 2813 -871 -730
938g30j437Q63M563l702j527M060l051l37L807l01J209n391k561Q013j247l838
954a607L569j790j497J193n66K991k507l066N750j351m363L938M50m09o41m465
970d371M936M023m991J309N57k165J706j592J751J821o344J939M217n234O77K914
986A153j664l2l911L108N989l973k615K364k895J886K811j425J463l937j021O127
1002C428k160k481K372j633K36o23j977O364j545p796L450J828r62K549n21P37
1018A266j392m193N461J615n037L428M02k929J723j099K481K307o325n52L027
1033A83j051K822n54k103J277m523P15O914l666j506L571l524Q1J280R68M225
1049E109n697l736N638K37k32K228m224p07N48j296N091k91m072K416j340j824
$$ plain form
938 -730 -2167 -1304 3259 -443 -1970 2090 -961 -1298 2509 2208 3417 -1974 -4535 3478 2231 -1607
954 -1607 1962 172 -1325 -132 -698 2293 -214 -3280 2470 1119 -3244 694 1144 735 94 -4371
970 -4371 565 4588 -403 906 1463 -702 1004 -588 1163 2984 -3360 -1421 2796 -2438 -1761 1153
986 1153 -511 -543 -4454 -1346 4643 670 -1945 419 -2476 -590 2221 796 2259 -1678 -2699 3428
1002 3428 1268 -1213 1159 -474 -238 -861 -2838 3526 1981 -5815 -2365 -537 -1499 1050 529 1266
1018 1266 -126 -4319 1142 2757 -2280 1148 1550 -1379 344 -755 1726 4033 -2292 -2844 183
1033 183 -868 1954 1400 -703 574 -3949 -3234 3680 14 -1492 2079 -1445 -1364 -84 884 5109
1049 5109 -588 -4324 1314 1551 1319 3547 -677 -1384 -836 -2132 2959 2668 -1404 1012 -328 -2152
1065b152K015q11L218K9p310L509L348j406K002j569k442J325j347L455L251n803
1081f88J19K054l579J705J530L80J483n199j415N474j455L2O83m112J128R66K90
1098f04M466l002l522K872n45J74K123j175J923k362m575N306J600l374J019p83
1114d59j221K333q07J507O1m830K573L56j887L417n59q45J735m591N93N616j441
1131A551j265L02j303J613n22j00K292m660o90M520k597J16J987j882O39j948
1147a947j099M573k61k447R37j568J568J526k650K189K32l546L514J591k328P38
1163A022j127J70M25k413K665J574l847Q61J52j131K499j522m41K107k153R46
1179b13K503k469j42L16n50J859j665O17L555l162k530K458l41J351l45k929K309
$$ plain form
1065 -2152 -137 -948 2270 2299 -5011 -1502 1846 440 2442 873 -1569 -244 -1591 1864 5115 -688
1081 -688 -569 1485 -2094 -389 1141 1521 3004 -2195 -3610 1864 409 441 1124 -2988 -1860 -894 -604
1098 -604 3862 860 -2662 210 -335 -161 1962 787 2710 348 -4227 1079 2679 -695 324 -459
1114 -459 -1680 653 -154 1353 1414 -3416 -843 -487 -2374 1043 484 -361 1374 -3217 -2624 2992 1551
1131 1551 286 588 -715 898 376 276 2568 -2092 -2782 1738 -859 -743 1244 -638 1 -1947
1147 -1947 -3046 1527 1266 -1181 -244 -1812 -244 1282 -1368 821 1053 -2493 1021 2612 284 1022
1163 1022 -105 65 490 -1923 742 2316 -1531 -670 -518 -1649 850 -672 -1113 994 -1159 -213
1179 -213 2290 -179 -321 -5 -555 1304 -361 256 3811 649 -1881 577 236 1587 1242 -1687 622
1196F22j053j068K883p99k247O96J71J973k69j605K829m20m498K043J871j79Q28
1213A778k624k78J977j542J925O69k984L80p9P78J797k866N70K104m093O2L746
1230A320l5j40j731m84J133j163J346K482l273j319J722l51J629l15j564J558
1246H15j605j834L301J147j39k004k339K397O82j883L400o97l169O53J461K98
1262D84j29r73J174j39k878K606J638q10p61k356L79K968j168M27J785l487n16
1279a756J928m49J021j378L1J702k732K17L815j076j424j167q82L373L14j385
1295A52J560j970j909K126L04Q02o06j222J781j046j844K987P15k399q9j181J859
1312B0K408k274M68j79k640K156J016k64N90j805O19R59k691J143K869k563o84
$$ plain form
1196 622 -431 -1499 1384 585 -1662 -966 -795 1178 909 -696 2133 1713 -2785 -742 1129 950 1778
1213 1778 -846 -1124 853 -689 1236 1905 -1079 -699 -778 0 1797 -1069 -499 1605 -2488 -2426 1320
1230 1320 1285 1145 -586 -1070 63 -1100 246 2728 -545 -1864 -142 -493 1136 821 -743 815
1246 815 -790 -2624 677 1824 1685 -319 -2658 -261 421 -1462 1938 1241 -1928 -1275 186 484
1262 484 355 -618 556 417 -2461 145 1783 973 212 -2144 -1765 1203 35 462 2247 -1240 -1756
1279 -1756 172 -277 744 -634 -603 1099 -1633 -1416 2399 1323 -101 -1268 -2150 1223 1537 152
1295 152 1712 -258 -2167 -41 263 1065 459 -763 1018 -28 -1872 1115 1830 -569 -658 -1839 20
1312 20 2428 154 622 443 -2197 -41 975 711 1301 -504 115 1074 -1617 -474 2395 -168 -852
1329h52R2M66K174j318q79J078j960L23K193r64J24l69j413K156q27j638L323
1346A709o92j942Q22m93J761k59k306J403k84j458K984l71j475J067j288R84O89
1363H51j844J371R83k327L61j20M69J770k621j44K380k228R28J952k248j79K90
1380c56k0J541j709l65K208k162m93J877m79Q19q02j689K526Jj556J790j415q69
1398a153J388j048J363L82k356J871m2j896J699P01l62R7k413J106K153j558K26
1415A58J54j971J349P99l2J058k156L0J938k243L00J713q62N72j422j225K814
1432I74p1j103J067j682m2J485l77J430j474k148K656r2j814K364m6j349J03j424
1450a543K002J145j549M87n48j612K005Q4j05M94k330N24K246j455M62P52j225
$$ plain form
1329 -852 -760 -294 1880 562 -317 761 -1199 -876 1317 353 477 108 -1305 851 24 -1614 1709
1346 1709 1017 -925 -103 -596 1165 906 -1400 3 -281 -1739 1245 874 -601 466 -822 162 851
1363 851 -993 378 1361 -966 -605 -725 -256 1514 -1107 -1251 1129 -1099 -171 1781 -467 -646 -356
1380 -356 -376 1165 -544 -909 1299 -863 -1356 521 42 861 59 -1630 896 897 -659 1131 -284 -1153
1398 -1153 235 -813 550 932 -1424 447 405 -1491 208 909 547 644 -1769 -663 1490 -68 158
1415 158 312 -1659 -310 489 457 1515 -641 -611 1327 -916 -616 1097 235 807 -615 -1840 974
1432 974 903 -200 867 -815 -857 628 251 1681 207 -1941 715 623 -1191 1173 1127 -222 -119 -1543
1450 -1543 459 1604 55 542 -6 -1618 387 471 366 860 -1470 -946 1300 -155 307 1059 -166
1467a66l89n45Q39K308j812r79J206j547K79J915o42L82j467n72K020r69m44J620
1485A037j024j099L24k04K360K53k416N81J28p51J659l74l88J65j585J122J131
1502I19j832R91O68j683L37l03J244J163j970n21P73p28J311P36r34K07p23k25
1520e70J786j197p04J463j187k95L63k3J553j118j553J220j02j45J393k67p50
1537a33L50r27J571k90j316J446o6r40N78l5M93N0j978Q98P46r08J095j31j165
1556f62P32n48M03J124j556N98R66j257L09L73m51J010j504j28J609n98m64O49
1574F05j092M19J03k80R10p92q32J549m73o00P05j97J2j96p90J336O14j012M31
1593D20o93o0N94k94N32P5j517Q94P44j248N84J00q1K6o54M18J141r42m88j26
$$ plain form
1467 -166 -555 -1100 -261 2047 235 -744 462 -1085 -806 1109 467 849 -618 -1190 830 -139 -583 1037
1485 1037 13 -1086 -762 -966 1394 1647 -769 -188 -60 -811 848 474 86 251 -1334 -212 919
1502 919 -913 78 746 -937 -600 -903 341 1504 -466 -987 -214 -942 369 1105 171 378 -345 -570
1520 -570 1216 19 -685 778 -409 -704 -341 -364 1189 71 -1482 -262 -364 -509 884 617 -133
1537 -133 217 -710 861 571 -745 701 635 -305 273 238 731 781 -1197 -299 447 -461 634 503 -662
1556 -662 70 -478 -75 1049 -507 91 1057 -200 109 482 31 1041 -463 -591 1018 420 -44 605
1574 605 -487 -68 35 -245 665 -127 -959 590 117 -483 222 25 37 -159 -949 387 1001 -11 420
1593 420 -273 -333 261 -33 499 574 -943 -49 695 -553 31 131 50 76 -578 -160 981 39 -449 -575
1613e75m15J218Q4Q2L27j176l33J417l37k72j15k66M57k99m37J472l58j136J76
1632d86j52O08J094j104Jrj049R76O72p75M00m76J92J90r51J085Q80j636K49k
1652b93M9J358p05q97L31o56L50J321r14M2J87o83P76p59L87J474j226j197P67
1671b88L24L64K77r45K51l81j90J690J17j106K65p49O6L97l70J175J6j730L89
1690d28M21J05N57n64l63N32r03J082P31j293O1j20o6O61m61K2J311j793l16P20
1710a04J74M12q6r95Q52m79r8J381q23j125J135m11K92K37k65O45o42j237J139
1729BL53j06K31p59Q4K74q92J001K56j292O52M70o40N89n00L71K76j579O41J089
1749E21n41L29j58n63O85m41k0M88o85k39R29k05J11n19J02M25o01l77J508n09
$$ plain form
1613 -575 -990 228 312 394 721 -455 -788 629 292 20 -95 -361 96 -203 -640 832 474 -662 -486
1632 -486 -638 -30 1064 -40 -39 -48 -1097 -121 551 -224 176 -300 -108 82 -869 216 1096 -540 -291 -293
1652 -293 -244 1114 409 -488 -157 -813 -463 858 -56 -14 173 -510 266 -493 -106 1368 142 -1055 -288
1671 -288 36 400 677 -268 -17 -398 -588 1102 1219 113 378 -371 -305 92 -278 897 913 -817 -428
1690 -428 -7 98 655 91 -272 260 -643 439 1170 -123 -62 -182 -248 413 -48 -26 1285 -508 -824 -104
1710 -104 70 482 396 -599 253 -226 -324 1057 234 -891 244 -167 125 362 97 742 100 -1137 2
1729 2 355 249 480 -279 -195 79 -813 188 444 -848 -196 274 -366 223 -277 94 370 -1209 -568 521
1749 521 -20 309 151 -412 273 -168 -188 300 -385 -624 305 100 211 -308 -206 219 -382 -759 749 240
1769B40m92L52l66M10k04J34M63l58n93Q96L4m27M8p13P78M94j440J075L68q75
1789a76K50k95m19R57n13K72K57q25O01Q58j007K4j71q7P10m77k79J216q16n35
1809d55L25L80L59l38l67L47m34q21J889q04m26J284j148N62K37r62J081l62j027
1828f80N12K07K96L91j325N91L72o38P10K19p72N5j42P6N46o79J43N71j202K36
1848e13N29J22M88m00r99P67j49k93J312o27m08j13Q2Q07m38o62J127q05p63R71
1868C5kK77j81r13K88N13n72J294o9q90p6L08L23P3o69L72R7r30M09K22k82N93
1890B20l88k16L84j65M49L66r95o9N7M94K03l15l61O83l18n37P26K52l8m33l53
1911c54N04NN4K22m81l71J92J52N87M1r73Q22j65q07M98M13l47M11p87M48N88
$$ plain form
1769 240 -252 100 -266 144 -60 74 537 179 -414 482 516 89 137 -576 202 696 -744 331 699 -176
1789 -176 74 -221 -640 317 -196 76 333 -492 109 967 -40 -16 -187 -274 436 -41 -320 896 80 -455
1809 -455 -130 250 609 271 -96 251 -183 -1004 885 81 -345 939 -209 353 590 -372 709 347 -680
1828 -680 -168 39 335 726 -599 -8 364 -274 436 655 -117 -62 -204 -128 418 -261 -118 453 -749 -513
1848 -513 16 138 626 226 -773 -6 -155 -448 864 237 -171 -284 -202 605 167 -495 632 -173 -936 35
1868 35 33 310 129 -784 -496 17 -555 739 670 -220 -296 12 335 408 -261 111 208 -722 -313 -91 -373 220
1890 220 -168 -384 0 -165 284 650 -345 -414 -357 137 340 25 -336 347 29 -508 218 470 432 -1 -354
1911 -354 150 155 209 431 -50 -421 -229 -77 510 551 -422 400 235 -572 -74 339 -8 403 -384 64 652
1932F52r61P70l13n97L60N31l77K89n74J13N55p48L02L28l3k00l41l08J063k48
1952B63l35M96m13k41N01r5J45l57n23Q67m50l6P58n84J28p0k76L59M03j081L12
1973b29K56n44P17Q7k58k03n16Q35J28o12M01J33m19o9J24J59M56o86q1O44m97
1994a74J96N21o71j93l8q7J072o92n24O81l77J28J27k44P01l77n79O35M0m18O92
2015D19o36k2L85j41M48k2p79L71O2n44L97J38L24k33n50N2N79l60O52j81p85
2036d26M41J80m18P85n62m57P13m85Q9L64k65N37n36p26J072k22kL43m71k44M68
2057A78k54O66j47j065P74k24j5L57m65L04L21j068L93Q83m74L10l62n80M28k1
2077f1L82K70j160K66O74p52O20K07m52l2l15l90J053m5j63K5n14J16L24oO51
$$ plain form
1932 652 -309 461 148 -449 -89 442 65 354 -220 -107 448 -300 2 330 297 97 -244 -552 511 263
1952 263 -72 424 11 -230 271 176 321 -36 -559 308 -142 -178 580 -4 124 54 -222 137 540 -541 -229
1973 -229 27 -517 200 287 29 -174 -690 145 273 -339 62 195 -224 -293 -169 -10 446 -240 -321 323 -174
1994 -174 22 543 -128 -321 -359 -446 626 -66 -590 91 -286 -158 -31 -275 426 49 -530 105 145 -273 419
2015 419 -217 -239 146 5 453 431 -348 23 85 -459 -62 76 400 167 -383 -331 248 -112 540 359 -426
2036 -426 15 195 -223 562 0 -457 256 -229 -140 224 -41 496 -40 -766 306 84 82 425 -46 -290 178
2057 178 -76 590 443 -622 152 -72 -87 270 -195 109 430 -638 -245 638 164 474 112 -468 -40 -61
2077 -61 321 591 -569 -303 371 -381 239 446 -6 -38 -353 -743 310 265 102 127 -387 -271 53 47 698
2098F98n57m98N09j77k09N44n97J95J89r20J195K13o34O6K1o18Q87k82L0J95j078
2119h28P27M36k73j28K07n14L96m46J26R15q23l30O01k94J37L70k47K67p23j87
2139f11R91m51k97P85n65j4L17p76P87n5m67N22l99K48L47n26M14k53k90O14j5
2160C06o79O02j57j65L12q50P70L92q76J86O27o02N61l77L1J04m47k04J274r23
2180a15m5M44p6R2l07k34O40o43l24J025n05K5K78n09O0M17p85R93r3p70O28O3
2202B59l96J72l91P69k97m96O33J13p50M58k58j22M71l13L44K21j120L90P98p61
2222b76N34l98J6M79m98o3R00o51m52M68m74L23K61q7M21j157o7Q41l3P5k15n15
2244e68P89j39q90Q75J49k73J29n10O50K42m85k5N70o26M49M78R4p67m86K87Q2
$$ plain form
2098 698 141 -357 152 -25 -234 310 -287 -92 97 -823 372 585 -49 17 38 -580 307 25 55 250 -828
2119 -828 -101 335 62 -66 141 -373 23 -423 -297 618 -205 -535 66 -228 -91 279 32 299 -424 -611
2139 -611 380 -71 -368 417 -148 -162 155 -621 166 111 -356 166 -233 15 362 -164 250 -3 -293 321 306
2160 306 -373 229 72 -93 219 -631 139 531 -345 -159 468 -134 427 50 81 185 -262 -466 808 -115
2180 -115 -160 284 208 300 -7 -241 399 -244 -568 457 -48 -23 255 -254 -194 223 -562 431 338 -432 196 259
2202 259 -137 35 -356 413 116 -380 253 366 -384 74 -184 -306 165 -148 196 417 -703 -313 485 -276
2222 -276 258 -140 -124 355 -143 -206 694 43 -409 59 -415 -92 169 82 503 -654 -721 120 87 162 -53 -568
2244 -568 221 82 -808 67 216 -57 72 -438 212 454 -31 -56 514 -112 337 815 909 142 -344 -57 25
2265B5k09P1O88p03l8K4o7K42J92j08K11j034L87R02m75J3j58j77L07l06LQ73
2287F63l39o57L26j33K99L60p91O12k84m94O71J24m97J22l98L20K40l86R04k71
2307C91n49J79J29l70O57k83j39L64q90N77P74j167J60J05k11P09n76K14M29o20
2327a17J15J60l57N03N1l27L2m69J07O15k91k96M56k60K08M2l73O10o5q59M96
2348a9L08j89M96o28M6j13m70R73K64j077M43j05m9J89n33K34M24m57J62M68r6
2369B71l71J64k78N81m53n8O55p70j49M90l83L68K9n08P55l80j80M76l60o9J08
2390f2j84M03J56o10P69n58l39O63P3k73K12n97M85P9q17P59n2l6j19j90K73O72
2412G07o60q6N04r07K66N04j20K44o28l1Q24q55J66L76l52j64L64n90P00j16k41
$$ plain form
2265 25 -184 -113 575 -128 -166 -142 -209 33 225 117 328 -706 -319 583 108 121 -37 -214 93 -213 -210 663
2287 663 324 -333 -7 -140 159 519 -272 340 56 -438 233 357 -140 -18 -416 -96 144 -242 662 391
2307 391 -158 21 150 -220 437 154 15 379 -511 66 840 -327 -167 -62 -273 436 -140 74 503 -117
2327 -117 -2 158 -199 304 355 28 60 -409 -302 313 22 -274 182 -78 130 172 -201 409 344 -515 -19
2348 -19 289 100 596 -32 14 -99 -569 404 668 -409 34 -71 -120 69 -464 -230 194 -263 -101 367 271
2369 271 -100 64 -214 367 -86 -144 511 -259 -408 82 -301 67 96 -412 343 -37 -217 259 -101 -170 -62
2390 -62 -246 157 313 -297 472 -86 -425 238 311 38 250 -347 138 217 -600 159 107 71 -48 -238 35 707
2412 707 47 -39 465 -442 -176 328 208 452 -176 -207 617 -238 -72 304 -48 -212 152 -438 262 146 -95
2433i5L18m03n1M62j40Q9m8m53N37L8k61K13p8n73N83k60L94L01p75M60k62m91
2455d95Q33M00p10K6p38N60O24p62J78K64q57N44rJ90L10n56l50N95k28M61J01
2476C81k76l27J39j12N71M8o45M39j46q9R9j11J92O0p14M92q5l32P75r1l58J08
2498A8m00K76O15m15j71J60m56M48j87O8L56m83J23L43n04K58L21q73J47K83K5
2519d8L99k21m63P33n44j01O1J99K80k15m58N29r4q3L48m89O7J50k9J83j53n79
2541e28N15Pl06L20K04j86j6l34L06R5m0J40K17o93J79K15j27j6R1j21M08m20
2563i0P9L39l26K06m67K15L33m2p39R58l35k91p57Q91L93k01j25R7K56o53L42
2584H3n3K44l16l01J68N42n35R4J16l05K26M10m20J88o82O60L16n57j24K34L9
$$ plain form
2433 -95 223 -180 -231 231 91 180 132 -321 216 254 -7 206 128 -445 138 -122 272 573 -202 258 -4 -495
2455 -495 338 738 28 54 -684 -124 500 -262 -84 180 -677 -133 -142 48 358 -198 -548 47 -181 280 381
2476 381 105 -222 -83 -195 376 424 -221 218 72 -17 82 -29 163 223 -491 1 -84 -416 359 268 -90 18
2498 18 -382 -106 509 94 -77 83 -373 75 -112 -44 312 -171 -48 295 -209 49 370 -503 -356 -73 -48
2519 -48 351 130 -333 400 -144 -245 -184 15 295 80 -378 151 57 -26 322 -167 -100 50 21 204 51 -528
2541 -528 -13 -6 -312 8 212 26 10 -324 -18 77 37 177 394 -299 -120 95 -32 -48 43 -78 330 -90
2563 -90 -11 328 2 208 -259 -44 289 247 -492 466 131 -160 -917 -26 367 166 41 138 394 -259 83
2584 83 30 274 -42 -343 -175 367 -168 -74 42 -263 -37 373 -47 141 -541 119 435 -122 -246 -12 27
2605B7R9l28j8O32m92jK30k03O1n1l5J90l37K45L89q5l87k7k54M74k57K23J56
2628B51l61j91M09Lj5J4p6k57k7K69M12k82n40L75pj4K09j79n4K43m34K23O7l4
2652DQ2j36j23J58l73L64L93n64J50J88k07k7N0n1L35m16M2K49j03j56O45m44
2674F0j92q6K38K57l5p32L56P4M8P1m7K87l04l99O54Rm2j005M62N00n45j40J111
2697F00l26j94k59K78j60R3k60R3M30n00p8O46m11L01j67L5j90j8JN61o63k9L72
2720A55k16m08M07l9L6J5r6L32j70M1J62m42j19K76J51j9mm47N58k05j93J03J44
2743B2j06J12l36L55R7k54N72m46k80L58k15P7J65l05J14K28l58R0K84ko6j36
2765c0q1L26m00L2K55l54J69L44l45Nlj66L76mp9P1j84K45m7l03J71J96k59M20
$$ plain form
2605 27 126 -202 -220 412 -80 -81 149 -54 7 -44 -79 111 -226 19 408 323 -64 -91 -345 129 -128 95 251
2628 251 -110 -301 108 111 96 110 34 -223 -250 19 431 149 -391 -16 -23 -37 172 -7 -61 182 -252 -29 38 4
2652 4 86 -50 -173 -15 -388 -24 369 -195 -45 143 -64 -91 -41 -92 243 -173 -131 118 15 -141 504 60
2674 60 -132 -218 20 277 242 -490 -134 -60 -12 59 12 299 -5 -404 250 259 217 -788 -326 174 -371 -511 600
2697 600 274 80 -179 99 -61 32 -228 -135 295 -205 -283 363 -48 253 86 121 -69 -87 -86 475 -188 -217 155
2720 155 -61 -469 -62 -101 -65 -50 -146 186 16 57 219 -223 -342 -66 85 66 62 -385 173 -32 -225 -122 22
2743 22 -84 28 -308 47 144 -110 462 16 -264 94 -121 -44 121 -184 -70 158 -200 -110 174 172 106 -30
2765 -30 -111 215 -185 -153 102 -252 -83 261 -84 -79 -82 -248 128 124 45 116 -68 177 130 -173 -2 194 -65 355
2789C55j15k82K09l41p9L90l88L77M8j68J22r1j81J43J35o3K53l25M6L07j72j14
2811F6k9Q0J07n27J47M24l43k07K42O6J46r8j09q3K03r9K21j4j32o7Q6j09L5j28
2835a22K48J48l55o9J64Q8J52l64j01L51l87L83j83j16J15J98j54K95n52L09L77
2856D25o42K96k78K75Q8l07J85L8l5m0K1l2J16j72j40J54K28j34K29k72L5k00
2878a62K37P3N1k74J14j19J80L57k01m45l9Q9O1J47k71L31J28m19j0L93j84q4
2900d7p3k3N63l68k85L41j7q9J68j94L23m13J98N2k04j12K26n3L31n86p3L16k4
2923d3j11L81p5l97L70k85K28J55k09K9J23j69L54n53O9J04R4m54N39l52R7L40
2945B35m68K85k36N8M82m30O9K57l72J19L11k02o1P2j0K45m03j45n2K56o8M1j4
$$ plain form
2789 355 240 -42 167 -174 -253 137 -251 126 174 6 128 37 -144 -1 134 71 324 -1 45 352 180 66
2811 66 37 117 224 -303 -156 268 -75 -282 -40 26 172 74 -35 -118 85 -14 207 193 61 -6 80 -29 6 -122
2835 -122 126 274 -81 -150 14 102 254 -110 -211 140 -247 136 -47 -163 -48 150 -4 291 -261 48 425
2856 425 -217 79 -199 76 164 -143 42 80 45 5 26 -6 110 -62 -202 -48 180 46 275 3 38 -162
2878 -162 75 148 199 -75 39 -80 100 457 256 -189 -228 -139 -78 69 -202 129 257 -162 -172 221 37 -47
2900 -47 -120 -143 420 52 -233 108 91 2 170 -24 299 -114 84 136 -68 -180 46 -7 324 -262 -335 -19 -43
2923 -43 -154 227 152 -245 125 -160 68 223 14 43 166 -3 351 -202 -133 -29 65 -389 150 -202 -105 235
2945 235 -233 52 -184 -126 356 -74 -5 252 -120 -1 310 108 47 119 109 354 -49 -194 -246 10 -58 -17 -31
2968c1rNl28N78l53j31N19m0m33K84K01j26o0k14J97j83q7L41j91J07J1j57l3
2991a33K93l22K42J8k57L23Jk51K41k43k23O25k80K0j79J99j21OM6K85j31k28
3013f9j57J55l7K28j04K41j42l58M70n9l85M76k37l40M24K0N6k25P3o8k13K63
3035A2J04o3k70O05m95Q5N7j50j61L58R9K8l16k45Q62o11M22m9m50k54L25M17
3057C10q97N53M87k46k39j55j8N26l3o53L55N02K4n25l03K26J77m16Q15l15l65
3078a90L08no07L53l10OM23k82M45l23M16K2j36m97J433m88n02L13m54L02j225
3099i98J150N72j516P35p73O93J1K91M52m91J44j73Q7m06M52O40p19l22j08J06
3119a73pN06l49J36k96k40N45m13O31p02P26o27k0P6K76j28mk02L06m6r9j75M09
$$ plain form
2968 -31 -40 -35 -363 215 -138 -269 250 210 -223 61 262 136 76 -138 59 -124 -211 130 -61 46 57 -100 -133
2991 -133 160 -162 80 98 -159 164 165 -86 155 -88 -311 314 34 54 -125 74 -47 -41 5 290 159 -69
3013 -69 -226 -71 -108 120 16 257 115 -243 227 168 -217 259 22 -318 106 126 182 -43 30 -38 -251 12
3035 12 116 53 -217 388 -107 -22 35 -115 -276 82 181 209 -107 -352 510 -101 321 272 -178 -432 -107 310
3057 310 -587 -34 453 207 -32 -187 -205 321 288 -365 -10 492 516 -9 -312 -86 91 -325 490 175 -190
3078 -190 118 113 -494 -141 -451 -445 -22 -304 141 -182 234 256 120 -377 1056 568 66 379 -75 227 -998
3099 -998 152 724 -792 -57 -830 -137 -126 165 617 126 270 97 184 -222 230 870 151 -171 -279 -173
3119 -173 -180 326 -23 113 -183 -423 122 -291 340 -362 364 -263 -283 -207 69 -59 -63 -265 41 -5 -104 -279 130
3142A30k07j15L8K03j5J12l76K27m2j88K23r7j3N36o80J71K41k28L62n1k52M33
3164D12l65k07P7j1L81m38o10Q78J38q79P15k57l98R28k82j13K03p45O89p1k07
3185a62J63l12L33J97j40K00k67k07J52K72j70O7qr2m5L12k83J76k54j94L80l98
3207b80K21K36m32M21Ln04M44m06L44pp2K20p1j47J11k11J69J71k95J03K43k42
3229A9j28J62Kk21l2J70j30l3L24j55m09K03J6nK62n8Q9k92l7J49J63Q1O1l16
3253a15K55O6k57J02L7j55o7J74q5J52J51Oq7k98m5M27m06J77J70k02J02m6k87
3276b31L39N97o78n1l0j02J92p8j20J40j74j31P11l66J032q03l46J81j16J27o
3297H7j97k01J06m4N24l89J63j17j81L27k45M2K40r5j8J82k18j46K89J67k70j54
$$ plain form
3142 130 -77 -192 -154 49 34 146 -230 -3 -45 -233 -10 -107 -120 416 -264 -93 148 -80 282 231 -21 412
3164 412 47 -160 -83 -94 287 -151 -761 117 255 -624 91 -166 -564 364 82 -31 172 -573 116 45 -162
3185 -162 1 -311 22 219 79 279 12 -195 -43 229 59 126 118 26 -19 293 10 186 -68 -262 118 -280
3207 -280 -59 177 -255 166 169 -335 109 -297 47 40 -32 188 117 -30 81 -130 39 210 -85 18 261 19
3229 19 -109 53 55 -166 -198 -28 -158 -191 133 -22 -431 -228 -212 -217 45 -13 76 -216 -253 -104 59 140 201 -115
3253 -115 140 206 -51 51 88 -67 -134 40 -45 107 258 264 177 -121 -166 261 -145 32 202 0 102 56 -231
3276 -231 108 705 27 -24 -54 -156 36 -42 -162 -22 -196 -327 384 18 1050 247 -99 82 -34 93 87
3297 87 -110 -311 -205 -249 275 -114 49 -68 -249 78 -167 -125 115 20 2 184 -34 -180 109 276 6 -148
3319a48M97n60J80Q5k3K05m81L87L0j34K12l50J83j63j95N39k10k51K68p7k81
3340b87O69l64j13L4l0j34M56m70R3J99j03M6K4j27J64q0j82K19j14K63j04j14
3362e5N8n7j01j81O29k51K95o2l22K85k22n3P4k80L47n2J38k07l9k76N90j88L1
3385A01N0l71L59K55m46J30Q9l38N23n88J81K73J11l00j86j45J12L18m65L56r
3406A0mM7r1O6j33J4J53k00J00J78Q6l63K66p1j60N20l60k23K63j80J02J00j76
3429e6M01l20j06J81j35q0K83j08l35J00J37J58L9k06J02k56K22l05K30J42J10
3450A98n57M86O3l31M11k49k67K64k43N41K5l94J17M0p1k2N3j4J99K7n40O70n44
3473a38J11J75j13j74J28j1M01n97L23P1j30J14p8k09j10K22q6K13k51k3j4M00
$$ plain form
3319 -148 349 -211 -31 54 31 236 -245 142 172 38 250 -100 83 -80 -275 264 54 -197 71 -6 -287
3340 -287 382 18 -95 -61 -91 -225 231 -239 -146 53 -50 -4 20 -107 57 -23 -205 14 -100 163 59 -55
3362 -55 3 -54 -155 -336 293 42 337 275 -47 238 16 -37 37 -243 104 52 190 -17 -56 -332 258 70 101
3385 101 151 -220 139 394 -52 78 167 -171 352 -236 -55 218 329 29 -157 -302 -190 128 -337 19 10
3406 10 6 53 -38 28 -105 -91 62 -138 -38 140 226 -137 129 58 -102 418 58 -165 98 -82 20 120 -56
3429 -56 345 25 -81 100 -35 -115 168 60 -275 -175 -38 120 159 -47 55 -201 21 -284 -54 88 198
3450 198 -359 127 190 -141 270 21 -246 18 -225 316 341 -53 64 104 33 11 64 50 249 276 -264 406 -138
3473 -138 -27 148 35 -139 -11 -22 379 -218 105 176 46 160 82 -127 -237 -15 -101 112 -139 -162 -176 224
3495B24m30K74r2M1M0J21l41L25j74L7k42pK93j75P9J16j09J02j61j5p9J65O0
3518E2N2k87L93P1m35l0pK82O7k0l32J8J03r6O12r01J69O05m65K68l5j06Q8J68
3542B34n58K97j34L5L84k23l26M08j91J0R0r9J76rj17j53P5J41L70n04J06J74
3564A86l8r4K17p5j46L2k52K71j73n6K63K55n82p6J31K93j13k15O1J70j41J09
3586B7j26M5q3j5KJ5J13j8k11L39k04k3N1J35j38q4K69l01J08K18q8k53L55j16
3610A7m2k2J51j91j9N0J50r0m3j48O1J93q7j8J20k37J38j69K85J70k20J6J06k32
3634f1N1O7J83k65j0k5J17q0J90J26k98r8J36k0J15O4m10J70K19l82K49m3k3J74
3658A46l08L23J37l61oP8p4mN2mP4j25K88k80qK2L49m4k3l20m7K80J20r8k16k55
$$ plain form
3495 224 -206 68 -24 17 57 178 -163 162 -12 25 -217 -224 69 -106 -27 89 -20 82 -79 -94 -173 -8 52
3518 52 104 -183 210 281 -154 -184 -191 91 158 138 -194 -176 -73 -169 443 -458 -289 316 -149 119 84 -22 66 234
3542 234 -324 -27 -161 -126 258 35 -291 117 -74 -64 26 -73 103 94 -23 -176 -101 40 410 -94 12 186
3564 186 148 54 271 196 50 82 -170 101 -72 -128 135 390 -192 -268 -137 156 43 -172 -111 59 -82 27
3586 27 -99 -54 -137 -152 -150 -135 -22 -40 -251 88 -116 -139 -88 47 -91 -175 94 -207 -99 119 31 -222 133 17
3610 17 -25 -47 104 -87 -106 -56 94 4 -39 -187 -126 67 -20 -38 82 -155 -17 -186 99 269 49 65 171 -61
3634 -61 -10 57 240 -25 -35 -60 57 -23 167 293 -5 -103 33 13 128 192 -218 -48 171 -211 38 -5 -28 146
3658 146 -162 161 298 -63 -69 9 -65 -69 -17 -21 53 -72 216 -64 -72 -50 299 255 232 -88 -135 145 265 167 -49 -304
3684c04L34K5l86L35K79k29l81K61k15L75n5J22l65j8K76j5L13k60j96J85P9k90
3706a30K21n7K5R7l89O6K68j28m2J22m35P2M66j08j14J13q0K38n5l18L70j46k40
3729a84K32j50k5L09m9j75K5k74L24o6L4K1k57K6K94m0j3q5l14M54k64J15R0j33
3753a05q3K07M9j77M13m91K32j12K4J14p0Q5q4k67K38N2k55L09k28K26Ql20j3
3776b48M27q3j19J92m14M24q0j70P8J19j77J36j7j63K30k99M83n79K51K40l1k49
3798d9j18M58l01q4m9Nkj1J64j14j8J41k07j74N42k90J25j57K01k20K02l80K58
3821g8N75l60l99J74n4N04j57J57l57K46L13j79k27mo9j71n05Q46j51J20m30J32
3843g4K24k01P0nj50L1K66l1n2K62j32j23k57J99J91m68L65l51J43n6K63j67K0
$$ plain form
3684 -304 30 55 -331 4 283 54 -327 -66 -281 94 39 161 -204 -222 54 39 352 92 -104 81 160 -130
3706 -130 91 34 59 156 -233 -167 101 -27 -69 53 -382 -310 156 48 -66 47 -33 205 150 -168 202 56 -184
3729 -184 48 -102 -127 182 133 -42 -17 -291 33 -33 1 22 -235 -209 85 45 32 -53 -367 87 -177 -62 28 -105
3753 -105 -188 19 68 -109 304 -187 45 -67 -43 71 1 86 2 -265 -27 25 -230 79 -149 77 85 -235 -248
3776 -248 179 96 -23 169 -245 179 99 -71 7 126 -51 85 68 -95 135 -164 319 -260 -9 231 200 -49
3798 -49 -167 291 -10 -94 -143 -138 -140 -151 13 -101 -119 22 -185 -359 183 -107 18 -139 62 -158 44 -336 -78
3821 -78 497 137 -262 -88 -142 362 205 362 5 251 564 385 158 154 85 -86 -591 255 104 224 -206 -74
3843 -74 150 -51 19 14 -136 -105 161 130 78 340 208 85 -172 27 218 -250 115 -236 -93 -149 114 -53 -33
3866c3l6L4j1q1RM5J71N1j63N3Q5q2J30p0k62J07J38M5Lj37k43M39k18Q3j33N2
3892b4o6R4j01j7L39k88J65j88K16k89q2K48q6j71L11j07Q1k50M06k61J56m49
3914c63K45L88j67j91k4K04P9q6l26N23m27K54J56p9q8k8k06P3J61J52j84r3j86
3937b13N40j84j83K42l90L69NP5k28O1j04J26k45R8p0j27J62J74o5P2j18j83J56
3960c0J4kJ46k52O9K02Jj14m41M88o5k33K31K89k08j23k43J71J88j54k37M37K7
3983A61k94Lk5J14q9J65k4K1J1k39L91n18L2K48qM4m18M94J37m24L80l5k8j12
4007a3o2K59j99k02K38j84K72J11j78k6K96m74J97N6k45J72J96k64P7O7k14p1
4029a91M28l94K01J27l26M37k52K44l27r0O6K79K2k53J73j34J06k19J09J76k31
$$ plain form
3866 -33 -69 -35 -46 -127 -118 -73 98 149 -14 39 124 42 172 102 -160 -53 85 130 133 -4 -247 192 -26 57 -76 -24
3892 -24 -90 4 -97 -114 225 -63 102 -86 130 -159 -241 7 -79 -250 61 -46 35 -215 191 -70 86 -363
3914 -363 -118 270 103 -88 -112 92 171 85 -241 282 -145 109 265 186 98 70 -136 -63 98 250 66 -27 -213
3937 -213 327 143 -40 202 -188 181 186 261 33 94 -10 116 -129 -31 -101 -228 -66 108 43 115 -3 -186 -30
3960 -30 -16 -18 128 -124 -55 147 148 34 -407 81 16 -217 14 303 95 -28 -271 -100 88 -66 -303 134 161
3983 161 -133 -130 -155 -41 -130 35 11 32 43 -196 195 -323 -291 -43 -51 -7 -425 69 206 -218 162 127 99 -13
4007 -13 -75 184 -15 -217 21 -163 109 220 42 16 312 -162 35 91 -154 18 214 -50 27 94 -120 -191
4029 -191 237 -157 44 171 -155 282 30 274 -53 -143 -77 202 224 -29 144 10 116 -103 6 182 -49
4050d9J21r5O2L27l37j29O7j46N1K70r8J70k91L4q0J48J34M2p1%K1o8j55R7r8
4075g3Q1J7j62J31K34l72l1N7M9j13Q7kr5J41j11J34q1J93O7k93P9J09m5J78j17
4100F2j02N1p7J35j82j33L41R8l12K65l41L36J4j36K05j83j98J71q3j82RJ39J
4123a02L1pL39l87K58m1j64J10r1l1n8K31J9k61K48k35K65J67l60J90j1m71N32
4146A71j28m20J94J3J18J80j16L6m2L0K25j80r2o8l6K87q5m65K25L53j05j47K10
4169A58j35j5q1n0J54l1J3O6q7k9J84j19K09k38r8K99m09m3K31J45j36L18l38
4192c2O4m6q2K36p5j28J68n6N7j57Q7L9qk30K02l7J46l09JK14o2l28L26K75j56
4217A09j52J94l2p2o5n8L22k86R1k54K85J95k59k76K19O4K18m23K94m4K80o12
$$ plain form
4050 -49 72 -23 39 366 29 -100 -33 -179 -128 142 44 214 -77 -43 -123 25 159 201 130 130 151 83 -72 25 -73
4075 -73 8 25 -137 -6 228 -144 -175 -118 -69 -182 -95 -97 -192 -51 -162 -28 -109 84 151 -142 -63 46 1 179 62
4100 62 -40 11 -66 69 -113 -246 95 193 -119 146 -195 141 155 19 224 41 -157 14 -69 -251 -242 -103 -102
4123 -102 -71 -78 261 -126 132 91 -73 37 -54 -85 -143 88 107 -154 94 -141 124 291 -69 121 110 -361 171
4146 171 43 -377 -183 -170 -52 128 12 48 6 36 261 81 -11 -79 -115 172 87 -378 -153 200 95 -52 158
4169 158 23 8 -73 -123 31 0 13 79 -8 -37 147 28 237 -1 -99 200 -209 -252 -21 124 -12 306 -32
4192 -32 32 -14 -96 140 65 -63 105 49 106 -51 36 75 67 -163 39 2 148 -161 -160 54 -8 -336 -10 265 109
4217 109 -43 151 119 47 -18 -76 246 -40 51 -203 82 277 18 -258 -39 25 243 -180 114 70 350 -262
4239b62J60J30r8Q4J0J60P4j15o7J89l38P6J03n2n7j68J00J69j49J28r1P1K33
4262B90j18m48J46jJ85j04J39k06J43k7j2K05m05L68k79l4K80j23j14M70k62n15
4284d22M67l17K74J8N3J36l8J17k01k1l5K8k05J20J20Q8r7J9k42M10m29L54p7
4307A20m29O35n21J52K04j58L7J40j38NJ31j13p2J36j91M9o1r1K35L44j53j59
4329A02k13J97k70j3M22j06l83K98k20M12k15J84l23Q6o0OL86j63j45M36m35N1
4351C4J9p8L25m84L04r5o4K91k22j85L02j4r2K06l56J88j71J27j01J40p4J22p0
4374E2l27K17K35j97Q8J96n14N06l19j80J48m58L74M32l31j9LM1K5O9n8K65k73
4397b5rM5L1L08k12j23K4J0J91k10M6j4k78K14L1J31j13J38k50l5J91p1j13K26
$$ plain form
4239 -262 -102 28 -70 14 24 184 258 143 76 265 -73 3 106 54 -3 -171 -71 98 -51 77 -14 57 290
4262 290 172 -276 -130 -131 54 -50 89 -117 26 -1 -13 192 -213 155 -124 -158 122 -1 -115 355 93 -422
4284 -422 45 -272 2 20 73 209 171 288 87 66 31 59 -146 -26 94 182 85 104 -138 272 -157 197 120
4307 120 -309 326 -195 -43 161 3 40 180 42 47 178 65 -7 129 -62 -13 -74 -165 70 414 261 102
4329 102 -111 86 -184 -197 225 119 -264 34 -186 226 11 195 -128 -42 -102 -96 290 127 -18 418 -17 34
4351 34 53 -25 300 -184 120 25 -39 252 30 -155 147 133 41 247 -109 79 -92 35 -66 74 0 122 52
4374 52 -275 -58 177 -20 68 264 -250 256 -63 -243 -95 -553 -179 253 -78 -97 -94 -53 -28 41 -17 248 -25
4397 -25 -34 11 42 350 138 15 39 49 240 30 76 62 -216 -2 29 160 47 185 -65 -100 91 20 -93 133
4421A33j09L5Q2j98L30l72j02L65j7j97L47l53J12J58k42N0j93J01N1j01K5l5
4443a30J65o6K79j11P7P0k66j13K35j72J01R4M1l56R3k7K67j36J86k17l03L91
4465A02r1j6J63l5P6Nm16R0N9j41J93J7kr3n8O0K52m40L02J30k80%J10p1J35K21
4491B72j21k10J08k7L60l2j03l93J90q1l38M97k28k6J49m7R1j18J1Q2J71k32L2
4514GK39l70J41K32j92k00p0j28M81n9l18j01M67k02L31L7k38j18l8K97J33k41
4536I0p2j14J13M6l72L73J46l64K40j49k48L82L2k45K49j85k20M39L27m37r5M2
4558b2k75N34m83L58j61K96j13j37J12J34k69P9k45O4P6O5j29j36J92J37j34o6
4580a23K10j82j19O9K68mj53k8j0k0J02n1K73j60j16K05l16k18N41l52P3N5o6
$$ plain form
4421 133 24 59 141 -57 273 -99 -201 164 147 -50 297 -56 56 214 -28 22 -171 -70 -19 -120 -95 -130
4443 -130 35 -31 248 137 214 284 18 -95 140 -32 69 163 204 -152 -59 -86 181 45 231 14 -289 102
4465 102 11 -5 158 123 199 204 -212 -122 -63 -204 -11 6 4 -89 -147 -87 165 -275 27 157 -123 -123 -13 -84 51 272
4491 272 151 -59 49 22 382 350 247 -146 44 -37 -375 122 -106 -132 17 -30 61 -57 -46 36 207 -25 7
4514 7 246 -124 17 249 57 -143 -213 -341 140 81 -237 -338 129 -73 258 295 57 -61 -99 198 331 90
4536 90 18 -96 17 63 -309 64 210 -154 86 -63 -311 71 103 -142 107 -78 -298 141 468 31 -64 -22
4558 -22 -297 237 -246 112 -49 247 134 -3 109 243 -26 53 -192 -128 -52 13 -116 -252 -60 77 -57 -123
4580 -123 87 -95 -214 -145 123 119 -34 -62 -72 -92 10 -41 232 72 -44 161 -155 -373 168 -184 -111 -56 -122
4603a22J06q0k1L01K22m55M7J8L08j82j49j63M56l36m9r7M85j23j55P6j34K13
4625A66l10J0L02j64J31k14J77n7j3o1j1M5K8K63j71p5J5J24r3m7j15L33k90J88
4649A61k34K12R4j66n1kK3K12k15j29kJ16k68K44P3j45R7M3p4k42O1L35k46J52
4673D9P3k56n3n6L96n66M58J64m29QL26j19j35L01k23j75K60K12j21j44kJ6J80
4696A64l25N8K14Jj87J30o0O5M2n8j3p7j28K40j82J77r5MO0q4P7J05l79N7M9j59
4722c04O19k41l6m8J3l7l3j74M06R8k18M3j86p3L18Q7k53R5p8r4Q8K2k18L42o36
4747d98L50K66M0q2k28N6J86k53J14k0J6M17m48j07K32Q1k05q2K15k4P6r7l5Q1
4771E1K0N4j38n3N9o0j59M35j56J8j76J14RK30k72K99n54K95M3r2J37k2r%q3K67
$$ plain form
4603 -122 -16 -96 -117 184 406 -49 -2 16 324 142 -7 -170 286 -50 -99 -196 289 166 11 87 -47 166
4625 166 -144 -134 168 4 135 -79 98 41 28 -33 -44 1 29 292 121 46 61 185 92 45 -70 263 -27 161
4649 161 -73 139 233 67 16 14 37 249 34 -95 -97 19 -249 -5 68 -77 20 63 -11 -253 -192 143 -103 49
4673 49 122 -134 -187 -243 153 -413 45 209 -220 -212 114 -5 -140 161 -62 -237 23 235 114 -30 -32 -16 164
4696 164 -161 -103 111 112 -75 55 -5 60 102 44 31 -46 -174 66 -116 61 -34 -30 30 -54 23 128 -251 -194 -145 -304
4722 -304 315 74 38 -10 3 -34 -67 -241 165 263 45 88 -98 -171 147 234 -19 76 -2 -96 -8 14 -204 138 -498
4747 -498 -148 118 158 76 -152 -96 90 -163 -49 -69 -53 364 -84 -191 41 122 -83 -165 50 26 102 5 -30 51
4771 51 71 125 -13 -66 -7 -67 -226 209 53 71 -105 9 18 248 -24 275 -279 16 59 -33 104 82 73 73 -10 257
4797B57l34K23K0j24j26l1K07l86L10j74L8J40o6j1K31K6Nk42P0k4J24j88M15
4820C60k54q3J88k10K0o9K28k31n1j43J64k83J82J08k2k17K67K46k35j08J22p4
4842i5J11j17J22j86J01K56k09k92L40k4k67k09M8J17m46J324j74k78j97L41q3
4863A83j27K6k04J33Q9n1K6m4j07kj5N2N7njr2J12M9k06L56J4r4o4r3j67K53K17
4890B95m43P0J95j71k30J28%J87q4J46l4q3J07m25L66j80K34j60R9r7Q7k42J67
4913f8l2L30k89L45l25J16J63O6m29L05k03L7l6J99J1mq9Np4J17Qk31J47P9N7
4938B05m9j29m2O1n7k78L87j89j24j23K3J79N9k8K6K48k77K15o0J2k5R5j75J45
4962I9j51o2J05j8O2k2k74K42J69j60O7oj05k72N47j75j30qL5j29n9L41j09QL2
$$ plain form
4797 257 -77 146 166 42 -84 -115 92 -294 16 -158 -120 20 -46 -57 174 200 205 -37 33 9 133 -55 360
4820 360 106 23 211 1 21 -48 180 -51 -102 -245 -81 -364 -182 -74 -96 -313 -46 200 -35 -143 -21 -95
4842 -95 16 -101 21 -165 -64 192 -17 -309 31 7 -260 -469 -421 -304 -750 574 400 122 -75 266 183
4863 183 56 82 -122 11 100 49 75 31 -76 -78 -93 -41 16 11 10 -82 30 79 -127 229 243 149 85 -8 -175 78 295
4890 295 -148 -78 117 -54 -284 -156 -156 31 -53 93 59 -24 83 -342 24 -156 78 -82 17 -80 7 -235 -68
4913 -68 -100 230 -59 286 -39 77 240 306 -123 182 -21 16 -20 179 190 186 97 102 28 145 153 -78 69 148 205
4938 205 156 27 -15 46 -11 -289 98 -91 -215 -338 -315 -136 -77 -105 -79 169 -108 107 47 59 34 129 -46 99
4962 99 -52 -114 -9 -27 35 13 -261 -19 150 -10 57 51 -54 -326 221 46 -84 -92 -57 -186 -245 96 -13 -5 27
4987B7L14l50J1n7K73j85l43L40j48l9J79J06k12L06k46K09k11J62J23k32l02
5008b75K72K6r6L36m03M36j74k32j60M23l23L75l67k4K47M3j06r3M61m23n4L9
5030g2n1L49m32J08J47q9J06j00P0m2O4p9Pl37N73l26r1M28l29K47j26j45Q7p8
5054a11P6k06J96Q5J16N8j82n8n0J0K93l46R8K12l26J29j59K98m3j67J04n1l22
5077c46L22J18k96J89k22K40J81k96l4J29K66k96K9qK61k43k06L28p3l35Q3K90
5099H1J0j50j53L56k11Q0P5j08o4J39o2L2l58M6K41j14K43m5k59K3L28j87J25
5122F8J90l25MJ01j19L18l56K29R2k17k29M44k14j20J90j15k33L49r4j28K14J97
5144B46l78J37q6K72k7M0k35J26l1j05J20r5K15l24qk29L95j74J07j29J55J40
$$ plain form
4987 27 341 -9 2 -55 218 33 -310 30 -118 -157 22 128 -84 222 -24 185 -26 136 259 27 -275
5008 -275 -3 23 -73 263 -140 296 122 -110 -270 153 -170 205 -162 -186 61 104 -2 -95 366 -57 -111 -72
5030 -72 -123 226 -206 -98 49 -40 66 -34 36 -6 58 -21 -14 -351 222 -104 -195 233 -96 151 25 -120 -33 -111
5054 -111 -35 -241 -45 40 156 214 32 -26 -76 -66 227 -119 -21 191 -135 -6 -165 133 90 -77 27 -24 -346
5077 -346 -24 94 -202 -13 -235 5 186 -110 -144 -15 251 -45 -16 -24 237 -6 -212 116 43 -292 -209 81
5099 81 91 -59 -212 144 -67 13 88 -20 -84 55 -7 25 -333 -287 -46 -160 83 38 -221 -198 130 -57 68
5122 68 258 -67 -63 38 -81 237 -119 110 202 -15 -244 200 -14 -134 56 -59 -292 57 -37 -165 49 246
5144 246 -132 5 -81 191 164 204 -31 95 64 -41 79 -16 199 -125 -133 -362 33 -141 -34 -163 -8 132
5166A32r2n9K9J21k75L53k38j37K65n9k70L71k59o7K69j82lK22j51NK12k66K2
5189e7J85l32K12J3n4j28L1J58L00l27j74J12P7o6J06k74L87j85Q3K19q1j20J22
5212B07l09J96j3j03m2m4O8L6J01K4Q7j44JK8j18m5k9j70J65K51j03Okk59L40
5237A29j49o6J89q6k06J47J68ok09P0K31k15j65J89M9j18K63L6l43m2Q2j5K39
5260A72j53j97K10Q3k49J46j41oQ4J39k92k36K18J28j55J59m1K84k87p8K13J40
5282A41n1J09j63j64J92o7M0j48J60k18L83o4mj36o6k09L00n2M8K50k01j28kK6
5306b4O7j1q6pK02J4l4l19K86k21L29k09Q4p8k15O8p3L21L7j48j2j31N0K75j35
5331C0k1m0K17l08J91n1J17j25l2Q2j32L41j64o7pJ11m20o1K22L05p7j48o2K31
$$ plain form
5166 132 40 -19 10 131 -144 209 -29 -166 99 40 -230 141 -118 -185 84 -98 -101 121 -30 -25 187 -79 -57
5189 -57 128 -204 8 21 -33 -161 -130 28 328 1 -173 -61 16 -50 56 -218 169 -16 67 286 205 85 207
5212 207 -102 94 81 -22 -64 -108 -40 -4 97 121 208 64 65 93 -25 -70 -99 -269 -104 147 44 50 48 -211 129
5237 129 -20 -86 103 17 -189 -42 126 120 -89 -19 212 -3 -168 21 70 -48 215 251 -92 -134 -52 -67 172
5260 172 19 -178 32 115 -134 12 -129 -135 -51 88 -204 -440 -222 -94 -249 -90 -131 153 -134 -212 1 141
5282 141 90 199 36 -128 64 -3 37 -111 49 -169 214 150 146 10 -56 -265 35 -17 31 281 80 -48 -50 -24
5306 -24 43 32 -54 -61 141 155 121 -198 88 -133 196 -13 71 -7 -222 -154 -227 94 131 -17 -29 -160 -110 165 30
5331 30 9 -31 186 -122 69 18 135 10 -22 60 -72 269 105 38 31 142 -278 -339 -117 188 111 -37 -99 132
5355A32j52j08JJ06J39p9J71K5k17j04J94k30J8J81j80R1L34J0l67p8J86K4j99
5378a02j4p4J58l1K14k8m23j44k85J85M63J14q8J57j42J14j35j06K96k77M8K80
5400A80n2j9j21m5O1k11J73J70j82K64m41K07O8J99o9j67L10l24N5r8rj47K69
5423G1J89k51NK02O6j41j25o8Q8r5J11K20m24L35J3k6k03j66K03J17j65J73k12
5446h3L0M04n45L81m46K95j83j31K81j8J55n03O26n27L08j54M4P4Q2j05J93k1
5468A57k67K0J6k5k17L47l3k2mj4J59P%M1j72J43Lj39j66L36P1j48l7J8M2j60
5494d4Jk3J80k58M5k42O67j46j24j32q9L59j26o2k54J71Q2j17l2j4M00j91p4L21
5518B98l50K28p8j87q4K79j8k17N09k68n9j25K3n2K1N1N7P9j25J07j52J68jLk33
$$ plain form
5355 132 -20 -128 -127 -21 118 39 210 235 18 -86 108 -122 -104 77 -103 -12 322 332 -35 -113 73 97 -102
5378 -102 -116 -190 -32 -63 151 123 -300 -444 -729 -544 -81 33 -55 102 -40 74 -61 -167 129 -148 -100 180
5400 180 128 109 -12 -57 4 -207 -34 136 -46 218 -223 -16 52 251 182 15 325 1 56 -42 -51 -198 71
5423 71 260 9 14 216 282 141 16 -52 36 -59 52 272 -152 183 196 170 -33 -199 4 121 -44 129 -83
5446 -83 -53 351 -194 187 -259 36 -147 -278 3 -15 140 -363 263 -264 44 -110 -66 8 90 -15 178 157
5468 157 -110 -90 -74 -99 -316 31 -2 -24 -28 -42 117 124 124 165 -7 136 139 0 -166 170 241 93 56 74 116 -44
5494 -44 -43 -66 114 -144 -99 -341 326 180 56 -76 -165 194 68 6 -248 -77 5 -112 -144 -158 242 51 -23 298
5518 298 -52 176 98 -89 -173 106 88 -129 380 112 53 -72 -49 -101 -80 -29 28 107 -18 89 -63 105 104 107 -126
5543a26L83j11k76J27K09k21Q4M0l48L94R5J6k91j17K81k2j04P7j88J08j27K38
5565A21l26J19j1L35m25R0J13J77l8j49l8nNM3Q1j00j55L37j29q0j34J43j51K4
5589a53K85j67K27k41r5l4L77r3l78L84J69l04N6O4j05K66l70k14K82L25l10j09
5611a38K14k57J24q0L31j50j80lJ92k16J28Q8q2q8K50L7l23R5j76L6K82M2j91
5634f5k9m9R7k77L65J54N5k00O9k35l2n3L30j08j07j7J26nj0m71L71K49m1j5j45
5659d3n0K51j2j72K06l24o1J56j03K78J7K1j83j95L32k65l8K90j27J18M2j63Q5
5682F0J59k32QJ28k99J45J33Q8k68m2p2K09j05j70N96k79N8k64pj21J09L28m38
5705b76L92O1k46Oj07L56L7j86K26k87J86j86m7m6J57k09J39J83j41J57m02K26
$$ plain form
5543 -126 257 146 -130 -3 206 -15 69 109 -239 155 250 266 -25 -142 139 117 13 90 -98 10 -117 121
5565 121 -205 -86 -97 238 -187 -97 16 193 155 6 -32 -37 -32 11 92 -8 -163 174 45 -35 -169 -26 -177 -153
5589 -153 132 -35 192 -49 -144 -178 199 106 -272 112 281 -23 33 97 -8 258 -112 -326 -44 281 -29 -138
5611 -138 76 -181 -57 -137 194 44 -136 -139 53 -163 -35 53 -29 -117 133 170 -153 -58 -234 -198 84 126 -65
5634 -65 -94 -143 -46 -323 42 196 251 51 120 -115 -147 -200 130 22 -85 -102 24 19 9 -462 -91 158 117 102 -43
5659 -43 -93 158 146 -26 180 -144 -205 -49 -152 126 143 164 -19 -214 118 -147 -185 105 -22 96 138 -25 60
5682 60 219 -13 -5 123 -176 -31 102 190 -78 -120 -192 17 -88 -258 338 59 117 -147 -154 -275 -166 162 -276
5705 -276 116 177 -69 -63 -170 186 223 37 263 -24 162 -24 -71 -117 40 -169 -30 153 12 169 -233 -7
5727gn3J7j20K55j03L15n09J19J30j26r4K70J19j00k92J22N1%lo0o0K38j5o8k61
5752b35K27k65K98q5J84k87j63M28k66o7J58K02k92KJ25j33k0J65j50L72K82o02
$$ plain form
5727 -7 -60 -43 -163 92 -11 304 -205 -86 44 -82 -176 94 213 113 -179 -57 -6 -6 -9 -69 -129 109 94 26 -235
5752 -235 -8 -273 25 -60 124 -163 -326 102 -164 -231 -73 129 -163 -161 -36 -169 -189 -24 -174 198 480 -122
$$ [...]
8191B4
##END NTUPLES=NMR FID
##END=
