##TITLE=1H_DE-12Filt_TFA
 DMSO-d6
 8 sc, 
 1.9.2023
##JCAMPDX= 6.0         $$ Bruker NMR JCAMP-DX V2.0
##DATA TYPE= NMR FID
##DATA CLASS= NTUPLES
##ORIGIN= UXNMR, Bruker Analytische Messtechnik GmbH
##OWNER= root
$$ XWIN-NMR		Version 3.5
$$ Fri Sep  1 15:39:06 2023 Russian Standard Time (UT+4h)  she@DPX200
##.OBSERVE FREQUENCY= 200.13135
##.OBSERVE NUCLEUS= ^1H
##.DELAY= (6, 6)
##.ACQUISITION MODE= SIMULTANEOUS
##.ACQUISITION SCHEME= undefined
##.AVERAGES= 8
##.DIGITISER RES= 18
##SPECTROMETER/DATA SYSTEM= spect
##.PULSE SEQUENCE= zg30
##.SOLVENT NAME= CDCl3
##.SHIFT REFERENCE= (INTERNAL, CDCl3, 0, 15.7039)
##AUDIT TRAIL= $$ (NUMBER, WHEN, WHO, WHERE, WHAT)
$$ ##TITLE= Audit trail, XWIN-NMR		Version 3.5
$$ ##JCAMPDX= 5.01
$$ ##ORIGIN= Bruker BioSpin GmbH
$$ ##OWNER= she
$$ F:/spectra/data/she/nmr/H-F/1/audita.txt
$$ ##AUDIT TRAIL=  $$ (NUMBER, WHEN, WHO, WHERE, WHAT)
(   1,<2023-09-01 15:38:01.50 +0400>,<she>,<DPX200>,
      <created by zg, POWCHK disabled, PULCHK disabled
       configuration hash MD5:
       00 E9 B6 7A A2 85 ED C7 34 08 36 98 17 FE 4E 26
       data hash MD5: 16K
       5B A5 3B 06 7B 89 19 C7 AE 3E 46 F8 69 66 D1 16>)
$$ ##END=
$$ 
$$ hash MD5
$$ 63 9F 66 11 26 29 9E 51 E6 08 22 63 20 D1 2B 44
##$RELAX= 
##$RELAX= 
##$RELAX= 
##$RELAX= 
##$RELAX= 
##$RELAX= 
$$ Bruker specific parameters
$$ --------------------------
##$DU= <F:/spectra>
##$EXPNO= 1
##$NAME= <H-F>
##$PROCNO= 1
##$TYPE= <nmr>
##$USER= <she>
##$AMP= (0..31)
100 100 100 100 100 100 100 100 100 100 100 100 100 100 100 100 100 100 
100 100 100 100 100 100 100 100 100 100 100 100 100 100 
##$AQSEQ= 0
##$AQ_mod= 1
##$AUNM= <au_zg>
##$AUTOPOS= <>
##$BF1= 200.13
##$BF2= 200.13
##$BF3= 200.13
##$BF4= 200.13
##$BF5= 200.13
##$BF6= 200.13
##$BF7= 200.13
##$BF8= 200.13
##$BYTORDA= 1
##$CFDGTYP= 0
##$CFRGTYP= 5
##$CHEMSTR= <none>
##$CNST= (0..31)
1 1 145 1 1 1 1 1 1 1 1 1 1 1 1 1 1 1 1 1 1 1 1 1 1 1 1 1 1 1 1 1 
##$CPDPRG= <>
##$CPDPRG1= <>
##$CPDPRG2= <>
##$CPDPRG3= <>
##$CPDPRG4= <mlev>
##$CPDPRG5= <mlev>
##$CPDPRG6= <mlev>
##$CPDPRG7= <mlev>
##$CPDPRG8= <mlev>
##$CPDPRGB= <>
##$CPDPRGT= <>
##$D= (0..31)
0 1.2 0 0 0 0 0 0 0 0.06 0 0.03 0 0 0 0 0.0002 0 0 0 0 0 0 0 0 0 0 0 0 
0 0 0 
##$DATE= 1693568280
##$DBL= (0..7)
120 120 120 120 120 120 120 120 
##$DBP= (0..7)
150 150 150 150 150 150 150 150 
##$DBP07= 0
##$DBPNAM0= <>
##$DBPNAM1= <>
##$DBPNAM2= <>
##$DBPNAM3= <>
##$DBPNAM4= <>
##$DBPNAM5= <>
##$DBPNAM6= <>
##$DBPNAM7= <>
##$DBPOAL= (0..7)
0.5 0.5 0.5 0.5 0.5 0.5 0.5 0.5 
##$DBPOFFS= (0..7)
0 0 0 0 0 0 0 0 
##$DE= 6
##$DECBNUC= <off>
##$DECIM= 32
##$DECNUC= <off>
##$DECSTAT= 4
##$DIGMOD= 1
##$DIGTYP= 9
##$DL= (0..7)
0 120 120 120 120 120 120 120 
##$DP= (0..7)
150 150 150 150 150 150 150 150 
##$DP07= 0
##$DPNAME0= <>
##$DPNAME1= <>
##$DPNAME2= <>
##$DPNAME3= <>
##$DPNAME4= <>
##$DPNAME5= <>
##$DPNAME6= <>
##$DPNAME7= <>
##$DPOAL= (0..7)
0.5 0.5 0.5 0.5 0.5 0.5 0.5 0.5 
##$DPOFFS= (0..7)
0 0 0 0 0 0 0 0 
##$DQDMODE= 0
##$DR= 18
##$DS= 0
##$DSLIST= <SSSSSSSSSSSSSSS>
$$ [...]
##$SUBNAM2= <"">
##$SUBNAM3= <"">
##$SUBNAM4= <"">
##$SUBNAM5= <"">
##$SUBNAM6= <"">
##$SUBNAM7= <"">
##$SUBNAM8= <"">
##$SUBNAM9= <"">
##$SW= 18.05172834244
##$SWIBOX= (0..15)
0 0 2 0 0 0 0 0 0 0 0 0 0 0 0 0 
##$SW_h= 3612.71676300578
##$TD= 16384
##$TD0= 1
##$TE= 0
##$TE2= 300
##$TE3= 300
##$TEG= 300
##$TL= (0..7)
0 120 120 120 120 120 120 120 
##$TP= (0..7)
150 150 150 150 150 150 150 150 
##$TP07= 0
##$TPNAME0= <>
##$TPNAME1= <>
##$TPNAME2= <>
##$TPNAME3= <>
##$TPNAME4= <>
##$TPNAME5= <>
##$TPNAME6= <>
##$TPNAME7= <>
##$TPOAL= (0..7)
0.5 0.5 0.5 0.5 0.5 0.5 0.5 0.5 
##$TPOFFS= (0..7)
0 0 0 0 0 0 0 0 
##$TUNHIN= 0
##$TUNHOUT= 0
##$TUNXOUT= 0
##$USERA1= <user>
##$USERA2= <user>
##$USERA3= <user>
##$USERA4= <user>
##$USERA5= <user>
##$V9= 5
##$VALIST= <valist>
##$VCLIST= <CCCCCCCCCCCCCCC>
##$VD= 0
##$VDLIST= <DDDDDDDDDDDDDDD>
##$VPLIST= <PPPPPPPPPPPPPPP>
##$VTLIST= <TTTTTTTTTTTTTTT>
##$WBST= 1024
##$WBSW= 4
##$XGAIN= (0..3)
0 0 0 0 
##$XL= 0
##$YL= 0
##$YMAX_a= 85352
##$YMIN_a= -129073
##$ZGOPTNS= <>
##$ZL1= 120
##$ZL2= 120
##$ZL3= 120
##$ZL4= 120
##$ABSF1= 10
##$ABSF2= 0
##$ABSG= 5
##$ABSL= 3
##$ALPHA= 0
##$AQORDER= 0
##$ASSFAC= 0
##$ASSFACI= 0
##$ASSFACX= 0
##$ASSWID= 0
##$AUNMP= <proc_1d>
##$AZFE= 0.1
##$AZFW= 0.1
##$BCFW= 1
##$BC_mod= 2
##$BYTORDP= 1
##$COROFFS= 0
##$CY= 11.3945322036743
##$DATMOD= 1
##$DC= 2
##$DFILT= <>
##$DTYPP= 0
##$F1P= 15.7292609196834
##$F2P= 12.9074282941183
##$FCOR= 0.5
##$FTSIZE= 0
##$FT_mod= 4
##$GAMMA= 1
##$GB= 0.15
##$INTBC= 1
##$INTSCL= 1
##$ISEN= 128
##$LB= 0.24
##$LEV0= 0
##$LPBIN= 0
##$MAXI= 10000
##$MC2= 0
##$MEAN= 0
##$ME_mod= 0
##$MI= 1.114404
##$NCOEF= 0
##$NC_proc= 0
##$NLEV= 6
##$NOISF1= 3.799351
##$NOISF2= 2.8
##$NSP= 1
##$NTH_PI= 0
##$NZP= 0
##$OFFSET= 15.70392
##$PC= 1
##$PHC0= -21053.08
##$PHC1= 14.85272
##$PH_mod= 1
##$PKNL= yes
##$PPARMOD= 0
##$PSCAL= 0
##$PSIGN= 0
##$REVERSE= no
##$SF= 200.130013532006
##$SI= 16384
##$SIGF1= 3
##$SIGF2= 2
##$SINO= 400
##$SIOLD= 16384
##$SREGLST= <1H.CDCl3>
##$SSB= 0
##$STSI= 0
##$STSR= 0
##$SW_p= 3612.71676300578
##$SYMM= 0
##$S_DEV= 0
##$TDeff= 0
##$TDoff= 0
##$TI= <>
##$TILT= no
##$TM1= 0
##$TM2= 0
##$TOPLEV= 0
##$USERP1= <user>
##$USERP2= <user>
##$USERP3= <user>
##$USERP4= <user>
##$USERP5= <user>
##$WDW= 1
##$XDIM= 8192
##$YMAX_p= 0
##$YMIN_p= 0
$$ End of Bruker specific parameters
$$ ---------------------------------
##NTUPLES= NMR FID
##VAR_NAME=  TIME,          FID/REAL,        FID/IMAG
##SYMBOL=    X,             R,               I
##VAR_TYPE=  INDEPENDENT,   DEPENDENT,       DEPENDENT
##VAR_FORM=  AFFN,          ASDF,            ASDF
##VAR_DIM=   8192,          8192,            8192
##UNITS=     SECONDS,       ARBITRARY UNITS, ARBITRARY UNITS
##FACTOR=    0.0002768,     1,               1
##FIRST=     0,             0,               0
##LAST=      2.2672688,     0,               0
##MIN=       0,             -129073,         0
##MAX=       2.2672688,     85352,           0
$$ Real data points
##PAGE= N=1
##DATA TABLE= (X++(R..R)), XYDATA
$$ [...]
$$ plain form
1660 -350 -396 -572 -676 -198 -252 -314 -568 -427 -554 -816 -823 -522 -232 -18 -37 413 671 780 640 655 495 517 326
1683 326 242 460 588 247 123 194 -130 -428 -465 -717 -522 -646 -551 -700 -436 -411 -592 -405 -98 -131 128 71
1705 71 311 871 561 420 537 752 696 456 649 529 381 236 -207 81 -104 -670 -874 -515 -415 -555 -495
1726 -495 -472 -249 -464 -743 -504 111 109 69 401 817 1111 719 303 524 584 463 -128 412 739 309 172 -69
1748 -69 -142 -220 -625 -941 -519 -428 -654 -800 -431 -59 -26 -232 -487 118 277 -159 -21 700 827 665 606 571
1770 571 691 436 -239 23 423 175 -281 -46 51 79 -620 -929 -594 -369 -870 -941 -387 167 3 -173 -49
1791 -49 209 703 17 45 601 849 456 485 525 904 428 -232 -33 511 -45 -662 -470 49 -255 -711 -1004
1812 -1004 -445 -150 -562 -834 -221 367 -224 -395 98 480 395 -53 224 967 951 510 149 661 834 85
$$ packed form
1660c50m6j76j04M78n4o2k54J41j27k62pL01K90K14j9M50K58J09j40J5j60K2j91
1683C26q4K18J28l41j24P1l24k98l7k52J95j24R5j49K64K5j81J87L07l3K59n7
1705G1K40N60l10j41J17K15n6k40J93j20j48j45m43K88j85n66k04L59J00j40O0
1726d95K3K23k15k79K39O15km0L32M16K94l92m16K21O0j21n91N40L27m30j37k41
1748f9p3p8m05l16M22R1k26j46L69L72L3k06k55O05J59m36J38P21J27j62n9l5
1770E71J20k55o75K62M00k48m56K35R7K8o99l09L35K25n01p1N54N54j64j76J24
1791d9K58M94o86K8N56K48l93K9M0L79m76o60J99N44n56o17J92N19l04m56k93
1812a004N59K95m12k72O13N88n91j71M93L82q5m48K77P43j6m41l61N12J73p49
$$ plain form
1832 85 -270 -217 192 95 -390 -466 180 -138 -1062 -947 -448 -218 -590 -866 -412 474 238 -276 70 705 506
1853 506 -188 50 655 657 594 308 800 997 421 -322 -185 98 -200 -705 -841 -36 254 -575 -609 -155 -37
1874 -37 -587 -713 -306 144 245 -148 267 930 712 -97 -6 585 515 207 -39 438 871 434 -533 -279 193
1895 193 -176 -1006 -778 -182 -158 -384 -594 -13 207 -435 -790 -308 310 -56 -137 237 921 1028 215 -3 857
1916 857 697 87 -94 350 681 205 -361 -46 277 -46 -756 -743 -163 -192 -640 -720 -91 163 -131 -813 -135
1937 -135 487 36 -231 106 871 795 146 179 611 651 27 -376 434 582 13 -511 -214 216 -84 -821 -792
1958 -792 -416 -40 -607 -774 242 284 -216 -432 -52 401 183 -170 262 763 763 397 252 789 729 -151 -585
1979 -585 -34 377 -21 -628 -116 62 -52 -770 -788 -250 -332 -712 -653 -74 170 44 -392 266 472 115 -8
$$ packed form
1832H5l55N3M09r7m85p6O46l18r24J15M99K30l72k76M54Q86k36n14L46O35j99
1853E06o94K38O05Ko3k86M92J97n76p43J37K83k98n05j36Q05K90q29l4M54J18
1874c7n50j26M07M50J01l93M15O63k18q09R1N91p0l08k46M77M33m37r67K54M72
1895A93l69q30K28N96K4k26k10N81K20o42l55M82O18l66q1L74O84J07q13k18Q60
1916H57j60o10j81M44L31m76n66L15L23l23p10J3N80k9m48q0O29K54k94o82O78
1937a35O22m51k67L37P65p6o49L3M32M0o24m03Q10J48n69n24K97M30l00p37K9
1958g92L76L76n67j67J016M2n00k16L80M53k18l53M32N01%l66j45N37o0q80m34
1979e85N51M11l98o07N12J78j14p18j8N38q2l80N9N79K44j26m36O58K06l57j23
$$ plain form
2000 -8 -164 417 640 327 337 699 592 -18 -372 28 -6 -466 -620 -415 213 -207 -585 -589 -154 18 -754 -763 -130
2023 -130 356 34 63 429 660 429 -64 -17 545 265 138 182 799 491 -233 -382 -79 27 -520 -603 -550 -157
2045 -157 -313 -515 -420 2 -46 -523 -565 23 333 153 -176 447 685 544 67 355 603 314 -86 -237 262
2066 262 366 -44 -240 -58 -86 -386 -744 -370 27 -356 -494 -425 -92 -164 -399 -322 -137 443 -116 160 371
2087 371 637 656 176 247 442 235 -173 -71 222 333 -71 -359 -96 -358 -448 -967 -516 -221 -157 -452 -122
2108 -122 187 98 -140 -213 154 226 44 213 431 725 456 421 269 304 232 -169 -300 53 -10 -283 -166 73
2130 73 -29 -418 -567 -327 -165 -292 -545 -164 116 154 -59 -98 350 246 73 160 443 389 281 246 335 440
2152 440 153 28 90 -217 -118 -384 -333 -275 -4 -518 -281 -292 -122 -310 -332 -65 88 138 89 -28 418 528 123
$$ packed form
2000hj56N81K23l13J0L62j07o10l54M00l4m60j54K05O28m20l78mM35J72p72rO33
2023a30M86l22K9L66K31k31m93M7N62k80j27M4O17l08p24j49L03J06n47q3N3L93
2045a57j56k02R5M22m8m77m2N88L10j80l29O23K38j41m77K88K48k89m00j51M99
2066B62J04m10j96J82k8l00l58L74L97l83j38O9L33p2k35P7J85N80n59K76K11
2087C71K66J9m80P1J95k07m08J02K93J11m04k88K63k62r0n19M51K95O4k95L30
2108a22L09q9k38p3L67P2j82J69K18K94k69l5j52L5p2m01j31L53o3k73J17K39
2130G3j02l89j49K40J62j27k53L81K80L8k13l9M48j04j73Q7K83n4j08l5Q9J05
2152D40k87j25O2l07R9k66N1N8K71n14K37j1J70j88k2K67J53N0m9j17M46J10m05
$$ plain form
2175 123 188 449 371 92 303 223 272 148 -148 -40 108 -263 -416 -322 -204 -111 -515 -422 -143 -60 -321 -346 -35
2198 -35 151 76 175 194 222 275 15 183 528 483 -104 244 336 384 235 -282 -90 -145 -187 -549 -195 -73 -68 -191
2222 -191 -369 19 -54 -13 -336 -146 261 232 62 277 402 235 -2 103 477 304 31 -61 270 217 71 -61
2244 -61 -273 35 -431 -540 -366 10 -103 -332 -241 168 26 26 -93 -36 183 19 -24 358 391 317 209 258 259 52
2268 52 -79 -185 152 313 -299 -330 -202 101 -164 -586 -259 -78 -5 -373 -205 130 180 -78 -105 325 407 99
2290 99 -31 138 372 256 112 185 319 73 42 -151 197 79 -163 -277 -207 -79 -253 -701 -419 -81 -39 -199
2312 -199 -298 139 219 179 -14 296 154 267 -56 10 434 276 36 179 338 17 -132 -185 -145 25 -191 -196 -34
2335 -34 -37 -8 -251 -305 -181 -192 -299 4 143 209 115 82 88 26 -91 -185 114 241 373 214 103 340 293 -245 -340
$$ packed form
2175A23O5K61p8k79K11q0M9j24k96J08J48l71j53R4J18R3m04R3K79Q3k61k5L11
2198c5J86p5R9J9K8N3k60J68L45m5n87L48R2M8j49n17J92n5m2l62L54J22Nj23
2222a91j78L88p3M1l23J90M07k9j70K15J25j67k37J05L74j73k73r2L31n3j46j32
2244f1k12L08m66j09J74L76j13k29R1M09j42%j19N7K19j64m3L82L3p4j08M9Jk07
2268E2j31j06L37J61o12l1J28L03k65m22L27J81P3l68J68L35N0k58k7M30Q2l08
2290I9j30J69K34j16j44P3J34k46l1j93L48j18k42j14P0J28j74m48K82L38M2j60
2312a99r9M37Q0m0j93L10j42J13l23O6M24j58k40J43J59l21j49n3M0J70k16nJ62
2335c4lK9k43n4J24j1j07L03J39O6r4l3Oo2j17r4K99J27J32j59j11K37m7n38r5
$$ plain form
2360 -340 -6 -128 -278 -282 -309 199 -129 -143 -154 -195 -177 -344 -247 27 174 160 202 354 304 188 46 82 168 127 -33
2385 -33 1 190 133 -112 -124 69 -154 -213 -394 -268 -192 -93 -113 81 -127 -118 65 -191 168 395 265 297 349 154
2409 154 140 180 293 364 176 78 -115 188 -17 110 -245 -115 9 -271 -304 -148 -60 83 -76 -170 73 40 -207
2432 -207 72 409 162 230 87 374 412 236 84 74 109 22 -126 89 308 57 28 -227 -73 -114 -101 -370 -278
2455 -278 -267 -54 -136 74 195 144 44 29 193 -56 130 96 157 293 368 115 184 153 81 -222 -244 -65 -9 -104
2479 -104 14 -9 -64 -87 -315 -332 -98 -231 -377 -163 188 58 -40 142 51 121 146 -189 241 282 225 31 207
2502 207 140 70 -4 -353 -100 -88 -144 -343 -147 -59 90 -58 -217 -271 -116 -76 -69 -17 58 41 160 161 175 170 -44 64
2528 64 122 104 -55 53 6 141 19 -129 17 -217 -17 -196 -145 -118 -174 -176 -140 -49 121 56 -157 146 6 41
$$ packed form
2360c40L34j22j50mk7N08l28j4j1m1J8j67R7K74J47j4M2J52n0j16j42L6Q6m1j60
2385c3L4J89n7k45j2J93k23n9j81J26P6R9k0J94k08RJ83k56L59K27j30L2N2j95
2409A54j4M0J13P1j88r8j93L03k05J27l55J30J24k80l3J56Q8J43j59r4K43l3k47
2432b07K79L37k47O8j43K87L8j76j52j0L5q7j48K15K19k51k9k55J54m1J3k69R2
2455b78J1K13q2K10J21n1j00j5J64k49J86l4O1J36P5k53O9l1p2l03k2J79N6r5
2479a04J18k3n5k3k28j7K34j33j46K14L51j30r8J82r1P0K5l35M30M1n7j94J76
2502B07o7p0p4l49K53J2n6j99J96Q8J49j48j59n4J55M0PN2P5j7J19JJ4nk14J08
2528F4N8j8j59J08m7J35j22j48J46k34K00j79N1K7n6kL6R1J70o5k13L03j40L5
$$ plain form
2552 41 138 73 13 26 -8 -60 -10 -109 129 -107 179 -70 -202 -130 92 36 -21 -156 -92 64 62 -22 -199 -74 -73 -185
2578 -185 -96 80 182 319 113 76 147 81 254 -132 -132 -15 323 34 -191 84 -49 -84 -235 -207 -413 -259 -254
2601 -254 -124 -170 123 51 3 1 0 -12 -203 -45 200 269 133 154 -37 333 112 -186 -148 -150 -72 -66 -42 -6 -22 -86 -176
2628 -176 -61 -83 -40 -142 -28 169 165 134 248 134 139 112 174 76 55 85 158 27 -19 146 -94 12 -90 -288 -316
2653 -316 6 86 55 -14 -251 -166 97 -110 -112 -36 -96 -21 -87 137 313 15 -113 24 114 128 140 49 -20 143 -178
2678 -178 -287 15 141 34 -342 -36 -95 -37 -12 -7 -24 -320 -124 43 -242 177 -23 146 117 225 140 -213 -69
2701 -69 -16 327 -71 162 176 146 66 79 -88 -195 -103 -90 -50 -82 46 57 -103 205 -314 186 -63 -150 126 33
2725 33 -50 35 138 262 27 177 -98 183 -92 -33 40 -65 294 41 -107 -112 -137 18 -199 -279 -32 -34 -10 40
$$ packed form
2552D1R7o5o0J3l4n2N0r9K38k36K86k49j32P2K22n6n7j35O4J56kq4j77J25Jj12
2578a85Q9J76J02J37k06l7P1o6J73l86%J17L38k89k25K75j33l5j51K8k06J54N
2601b54J30m6K93p2m8kjj2j91J58K45O9j36K1j91L70k21k98L8kP8OK4L6j6o4r0
2628a76J15k2M3j02J14J97ml1J14j14Nk7O2r8k1L0P3j31m6J65k40J06j02j98k8
2653c16L22Q0l1o9k37Q5K63k07kP6o0P5o6K24J76k98j28J37R0J4J2r1o9J63l21
2678a78j09L02J26j07l76L06n9N8K5Nj7k96J96J67k85M19k00J69k9J08q5l53J44
2701f9N3L43l98K33J4l0q0J3j67j07R2J3M0l2J28J1j60L08n19N00k49q7K76r3
2725C3q3Q5J03J24k35J50k75K81k75N9P3j05L59k53j48nk5J55k17q0K47kK4N0
$$ plain form
2749 40 25 -148 -86 -132 21 135 19 29 93 124 95 -15 91 -73 -37 -204 -16 44 81 -56 -79 177 -75 -99
2773 -99 -225 -10 49 -209 -18 99 -5 -96 112 52 -110 133 82 19 10 -3 -9 -6 40 52 -107 26 260 -6 118
2798 118 -55 -200 -190 -142 -97 -132 -176 96 100 23 138 55 171 170 60 -107 140 218 -136 114 84 44 -58 21 39
2823 39 -116 -141 -257 -188 -116 -68 16 15 194 -137 -72 1 -134 48 32 64 -7 -1 308 37 76 98 -102 25 -35 0
2849 0 82 132 -105 -51 21 169 -303 -256 46 -107 -274 -64 73 -39 70 -183 -22 -96 -276 -40 166 30 -8
2872 -8 -78 -56 199 38 -147 -41 14 12 56 16 -143 39 54 -23 -275 -115 -76 186 -164 5 73 -119 -119 -1 141
2897 141 118 -184 26 210 37 13 -152 140 55 5 -16 258 139 -80 106 -19 52 -97 -267 -151 2 11 -22
2920 -22 -19 130 -70 107 -37 69 -137 -134 1 36 386 51 165 129 46 -62 -163 -3 29 171 28 -80 -121
$$ packed form
2749D0j5j73O2m6J53J14j16J0O4L1k9j10J06j64L6j67J88O0L7j37k3K56k52k4
2773i9j26K15N9k58J91J17j04r1K08o0j62K43n1o3rj3oLM6J2j59J33K34k66J24
2798A18j73j45J0M8M5l5m4K72Mp7J15q3J16jj10j67K47P8l54K50l0m0j02P9J8
2823C9j55k5j16O9P2M8Q4jJ79l31O5P3j35J82j6L2p1OL09k71L9K2k00J27o0L5
2849@Q2N0k37N4P2J48m72M7L02j53j67K10J37j12J09k53J61p4j80K36K06j36l8
2872hp0K2K55j61j85J06N5kM4m0j59J82J5p7k52J60L9K62l50J69O8j92%J18J42
2897A41k3l02K10J84j73k4j65K92q5n0k1K74j19k19J86j25P1j49j70J16J53Rl3
2920b2LJ49k00J77j44J06k06LJ35L5L50l35J14l6q3j08j01J60L2J42j43j08m1
$$ plain form
2943 -121 126 127 -151 -123 -133 82 -251 211 -141 167 194 75 76 36 17 119 3 165 80 47 55 168 101 18 -90
2968 -90 -180 -151 -223 -47 -70 -82 -96 -59 -19 5 79 140 20 76 147 263 256 34 109 -112 76 -1 -1 189 163 266 36
2995 36 -55 83 17 -41 60 -80 -145 -188 -98 -81 54 81 90 -2 54 10 98 115 41 225 -2 65 -10 146 184 -132 172
3022 172 -4 -46 -69 -98 122 -26 115 -108 22 69 -293 -104 -115 91 -58 -93 -35 -112 -9 -149 33 -24 82
3045 82 77 115 137 -31 -47 13 71 -35 -121 104 151 59 -94 -7 3 140 -173 -25 -127 -270 56 -93 -39 83 -51
3070 -51 27 -53 84 -59 -55 -15 113 209 156 264 50 1 182 -75 -274 -133 -24 48 115 -111 -104 -326 118 31 -82
3095 -82 -9 -142 103 146 -122 153 46 -2 132 221 74 -42 74 78 79 112 139 223 -63 10 4 -126 -116 -74 -156 259
3121 259 -58 14 -149 104 -86 -133 -15 -212 392 18 163 -69 71 48 124 -23 23 202 -4 -133 -46 -17
$$ packed form
2943a21K47Jk78K8j0K15l33M62l52L08K7j19Jm0j9J02j16J62q5l3QJ13o7q3j08
2968i0r0K9p2J76k3j2j4L7M0K4P4O1j20N6P1J16pk22P5k21J88p7%J90k6J03k30
2995C6r1J38o6n8J01j40o5m3R0J7J35K7Rr2N6m4Q8J7p4J84k27O7p5J56L8l16L04
3022A72j76m2k3k9K20j48J41k23J30M7l62J89j1K06j49l5N8p7J03j40J82n7J06
3045H2nL8K2j68j6O0N8j06q6K25M7r2j53Q7J0J37l13J48j02j43L26j49N4J22j34
3070e1P8q0J37j43MM0J28R6n3J08k14m9J81k57j99J41J09P2O7k26Pk22M44q7j13
3095h2P3j33K45M3k68K75j07m8J34Q9j47j16J16MJL3K7Q4k86P3oj30J0M2q2M15
3121B59l17P2j63K53j90m7J18j97O04l74J45k32J40k3P6j47M6J79k06j29Q7K9
$$ plain form
3143 -17 -56 -137 47 -51 -55 -123 -163 -138 -64 -165 -80 16 43 -3 -217 4 225 67 -180 -82 -76 1 -172 -84 -15 -12 54 -96
3171 -96 21 -63 82 -108 -167 -269 158 -20 -173 10 -33 -175 76 55 -56 -124 31 -94 -44 149 35 -9 49
3194 49 -39 -23 -127 -36 142 -59 66 -20 173 -88 -100 -50 104 -62 -157 -26 -77 -56 -35 218 125 10 64 -89
3218 -89 42 -39 -167 88 70 94 3 103 -15 -73 32 140 -235 -97 -84 48 102 -30 -214 -25 163 -153 -197
3241 -197 -58 -171 149 -28 -31 13 93 180 4 183 122 129 51 89 -88 121 40 -38 69 43 -51 200 -151 -77 -4
3266 -4 -137 -50 154 11 60 102 8 -104 1 -118 -33 -146 -34 79 189 192 -38 -45 215 33 4 -72 27 -19 -112
3291 -112 -142 33 11 -269 40 -104 3 -133 -13 -152 -62 252 120 83 95 154 68 164 -19 186 -6 -3 90 44
3315 44 -42 11 -195 18 -82 -76 62 -115 1 38 149 60 -32 -6 -151 75 64 39 142 -16 87 -76 22 68
$$ packed form
3143a7l9q1J84r8mo8m0K5P4j01Q5R6K7m6k14K21K21j58k47R8OP7j73Q8O9LO6j50
3171i6J17q4J45j90n9j02M27j78j53J83m3j42K51k1j11o8J55j25N0J93j14m4N8
3194D9q8J6j04R1J78k01J25q6J93k61j2N0J54j66r5J31n1K1K1K53r3j15N4j53
3218h9J31q1j28K55j8K4r1J00j18n8J05J08l75J38J3J32N4j32j84J89J88l16m4
3241a97J39j13L20j77lM4Q0Q7j76J79o1Pp8L8j77K09q1p8J07k6r4K51l51P4P3
3266dj33Q7K04j43M9M2r4j12J05j19Q5j13J12J13J10Lk30pK60j82k9p6R9m6r3
3291a12l0J75k2k80L09j44J07j36J20j39R0L14j32l7J2N9q6R6j83K05j92LR3m6
3315D4q6N3k06K13j00OJ38j77J16L7J11q9r2K6j45K26j1k5J03j58J03j63R8M6
$$ plain form
3339 68 181 -1 174 -54 -71 -97 -123 -179 -155 60 -78 85 -120 -3 40 -126 87 -192 -119 -31 -19 -37 43 90
3363 90 -19 -230 95 58 109 34 -113 178 16 -62 82 -25 -239 -62 -379 -154 -119 -9 -4 86 48 -66 31 -129
3387 -129 95 -60 72 -30 -136 29 144 -29 97 102 -62 64 78 73 52 116 194 -23 1 30 10 -34 -47 26 159
3412 159 -30 -51 -102 -157 56 69 108 -39 79 34 83 61 44 -59 178 56 174 96 -32 37 -86 -91 34 -141
3436 -141 -63 -322 12 126 -184 59 90 -141 -326 57 -211 79 237 210 155 -8 -188 18 132 -38 23 249
3458 249 150 -80 54 23 -3 -156 -219 -172 11 -69 -174 104 130 182 93 0 1 -24 -104 -135 -96 184 262 331 -40 71
3484 71 82 -72 -161 150 -75 -27 66 -190 64 -38 59 -21 9 16 -44 51 -153 -146 -163 -78 72 50 12 238 2 190
3510 190 61 -24 77 -83 62 43 -113 -10 61 -23 -42 -46 5 -101 -57 -127 -150 -127 -77 15 -77 -149 -133 123 110 -36
$$ packed form
3339F8J13j82J75k28j7k6k6n6K4K15j38J63k05J17M3j66K13k79P3Q8J2j8Q0M7
3363I0j09k11L25l7N1p5j47K91j62p8J44j07k14J77l17K25L5J10NR0l8j14R7j60
3387a29K24j55J32j02j06J65J15j73J26Nj64J26J4nk1O4P8k17K4K9k0m4j3P3J33
3412A59j89k1n1n5K13J3L9j47J18m5M9k2j7j03K37j22J18p8j28O9j23nJ25j75
3436a41P8k59L34J14l10K43L1k31j85L83k68K90J58k7n5j63j80K06J14j70O1K26
3458B49r9k30J34l1k6j53o3M7J83q0j05K78K6N2q9r3Jk5q0l1L9K80P8O9l71J11
3484G1J1j54q9L11k25M8R3k56K54j02R7q0L0Po0R5k04Pj7Q5J50k2l8K26k36J88
3510A90j29q5J01j60J45j9j56J03P1q4j9mN1j06M4p0k3K3N0R2r2p2J6K56j3j46
$$ plain form
3536 -36 77 77 -210 -25 3 -52 262 36 41 37 -18 -97 -216 -168 -83 -74 68 -29 44 -144 -86 -147 -69 12 98 47 224 66
3564 66 151 -36 25 171 -59 -60 113 -8 1 -44 146 -18 93 77 -53 -38 -87 27 72 -43 -130 -11 78 10 -16
3589 -16 -133 16 -41 176 -110 -130 175 86 26 -44 -26 69 69 163 116 70 16 22 -121 133 -98 -113 -174 -2 88 138 -93
3616 -93 167 -119 -58 -142 -65 4 -89 -150 -187 -2 -90 -13 -87 -122 148 23 -146 49 -120 -119 28 -21 -80 -42 -147 111
3642 111 -141 36 -45 -96 4 62 -56 -155 2 103 142 21 -273 -65 -29 232 -82 -185 3 9 17 -38 68 50
3666 50 92 99 -349 28 -276 -59 129 5 -55 10 -4 110 70 13 89 -112 -77 92 -113 20 -59 20 111 -251 32
3691 32 82 -144 -115 -71 -134 167 118 86 48 73 -41 -50 9 161 16 -200 19 113 94 -71 -40 134 -24 -53 -88 76
3717 76 -3 113 84 124 43 218 -47 11 146 76 -116 -348 -109 -33 101 -104 -120 67 -10 104 109 -126 -63 55
$$ packed form
3536c6J13%k87J85K8n5L14k26Nmn5p9j19M8Q5RJ42r7P3j88N8o1P8Q1Q6n1J77j58
3564F6Q5j87O1J46k30jJ73j21Rm5J90j64J11j6j30J5m9J14M5j15q7J19Q9o8k6
3589a6j17J49n7K17k86k0L05q9o0p0J8R5%R4m7m6n4Oj43K54k31j5o1J72R0N0k31
3616i3K60k86O1q4P7O9r3o1l7J85q8P7p4l5K70j25j69J95j69JJ47m9n9L8j05K58
3642A11k52J77q1n1J00N8j18r9J57J01L9j21k94K08L6K61l14j03J88OQn5J06j8
3666E0M2Pm48L77l04K17J88j24o0O5j4J14m0n7P6k01L5J69k05J33p9P9R1l62K83
3691C2N0k26K9M4o3L01m9l2l8K5j14rN9J52j45k16K19R4j9j65L1J74j58k9l5J64
3717G6p9J16k9M0q1J75k65N8J35p0j92k32K39P6J34k05j6J87p7J14Nk35O3J18
$$ plain form
3741 55 83 -7 99 5 43 127 98 187 -85 195 63 -223 -12 -94 -147 -76 161 253 -75 -93 138 -281 -83 156
3765 156 -92 -89 -6 94 80 14 -67 124 225 113 34 32 348 57 148 98 91 -276 -291 -24 -157 -25 61 18 51 -2
3791 -2 -53 39 34 -68 -19 24 4 -15 80 64 22 238 22 44 -13 -2 -61 -25 -154 -66 48 -53 37 -101 60 62 -136
3818 -136 -268 -38 248 80 124 -23 192 -13 32 96 20 16 43 179 41 73 7 97 -63 -37 29 67 87 47 57
3843 57 -74 18 85 -241 0 69 -210 -145 -59 -5 -140 11 -117 51 75 102 141 -17 -62 70 30 72 109 -25 80
3868 80 1 -114 -30 -19 -120 34 21 47 -77 71 -197 147 162 60 75 3 84 1 -100 5 199 212 -195 -62
3892 -62 47 -96 -109 -38 -73 63 9 12 -127 58 105 99 78 62 113 -26 103 -123 56 92 160 32 179 92 126 -2
3918 -2 176 90 -234 108 -85 179 78 -168 -43 -132 -104 -196 -99 35 -42 -90 18 0 216 82 -138 24 -117
$$ packed form
3741E5K8r0J06r4L8Q4k9Q9k72K80j32k86K11q2n3P1K37R2l28j8K31m19J98K39
3765A56k48LQ3J00j4o6q1J91J01j12p9kL16k91R1n0pl67j5K67j33J32Q6m3L3n3
3791bn1R2nj02M9M3k0j9R5j6m2K16k16K2n7J1n9L6j29Q8J14j01R0j38J61Kj98
3818a36j32K30K86j68M4j47K15k05M5O4p6mK7J36j38L2o6R0j60K6O6L8K0m0J0
3843E7j31R2O7l26K41O9k79O5Q6N4j35J51j28J68K4K7L9j58m5J32m0M2L7j34J05
3868H0p9j15Q4J1j01J54j3K6j24J48k68L44J5j02J5p2Q1q3j01J05J94J3m07J33
3892f2J09j43j3P1l5J36n4Lj39J85M7ok1j6N1j39J29k26J79L6O8j28J47q7L4j28
3918bJ78q6l24L42j93K64j01k46J25q9K8r2R7J34p7m8J08j8K16j34k20J62j41
$$ plain form
3941 -117 -148 92 70 2 273 60 -28 80 -59 140 -41 -109 -81 -20 48 -41 10 153 -17 -159 88 -202 -36
3964 -36 -34 -45 44 -281 -152 5 62 130 34 -43 72 -168 -29 37 72 -15 236 -91 39 83 18 -92 71 -68 -26
3989 -26 -81 165 82 -185 -19 -64 -123 44 -83 -42 37 25 24 4 309 168 269 -102 -96 -101 -60 -189 -52 -50 -198 -60
4015 -60 128 92 63 -62 -55 -99 -95 -153 19 37 -176 -20 -136 -194 -20 -42 -101 243 90 40 -88 -141 72 -113 -121 61
4041 61 119 -128 5 -110 -69 123 146 192 3 -19 -9 -141 -52 92 -81 -90 162 49 54 -63 -144 -75 -68 -193 167
4066 167 59 -8 76 -119 108 105 -71 -213 -222 113 125 22 -200 -133 148 -92 32 -153 122 -122 -95 -24 -199
4089 -199 -178 -58 -109 -17 44 83 -38 -64 135 -27 32 -26 -100 123 -230 -81 29 -160 -137 -49 6 0 6 10 26 140
4115 140 -181 -13 78 -25 96 93 293 -25 -23 50 120 18 -18 29 15 -229 31 -124 -72 -14 -13 118 -28 62 124
$$ packed form
3941a17l1K40k2o8K71k13q8J08j39J99j81o8K8O1O8q9N1J43j70j42K47k90J66
3964c6Kj1Q9l25J29J57N7O8r6p7J15k40J39O6L5q7K51l27J30M4o5j10J63j39M2
3989b6n5K46q3k67J66m5n9J67j27M1P9j2jk0L05j41J01l71OnM1j29J37Kj48J38
4015f0J88l6k9j25Pm4Mn8J72J8k13J56j16n8J74k2n9L44j53n0j28n3K13j85qJ82
4041F1N8k47J33j15M1J92K3M6j89k2J0j32Q9J44j73rK52j13Nj17q1O9Pj25L60
4066A67j08o7Q4j95K27lj76j42rL35J2j03k22O7K81k40J24j85K75k44K7P1j75
4089a99K1J20n1R2O1L9j21k6J99j62N9n8p4K23l53J49J10j89K3Q8N5oOMJ6J14
4115A40l21J68R1j03J21lK00l18KP3P0j02l6M7j4k44K60j55N2N8JJ31j46R0O2
$$ plain form
4140 124 -156 129 -40 0 94 -87 -62 136 141 68 -93 54 168 212 -178 -96 81 -123 247 -14 12 -38 86
4163 86 80 101 -138 81 71 -10 -154 -152 -20 -8 -47 78 -237 151 -252 15 33 -55 -35 25 70 -41 55 -109 -103 77
4189 77 -50 -6 -94 10 -25 -11 147 103 -80 94 -20 61 -10 -90 -86 155 -121 89 147 -36 -11 -21 4 63 189
4214 189 -58 -42 -82 38 -243 -41 133 132 110 -81 -145 -172 29 135 -5 69 3 -114 215 -160 73 -185 88
4237 88 -176 -18 -84 -2 -176 30 68 60 -94 111 82 -61 51 -85 -20 -196 207 -1 149 131 57 -34 -10 -71
4261 -71 -66 -80 -49 -45 72 11 -80 162 13 -141 -40 35 92 -16 62 60 -62 11 -91 -68 -106 -92 143 18 -100 21
4287 21 187 74 -12 -115 -29 73 -56 -10 230 48 -62 -20 -32 -18 25 65 -85 -231 -64 -116 95 137 231 -191
4311 -191 36 -208 -25 101 -133 22 120 64 -51 29 90 -32 -45 196 73 -63 -95 -92 -74 49 -47 -69 83 -132
$$ packed form
4140A24k80K85j69M0R4j81K5J98Np3j61J47J14M4l90Q2J77k04L70k61K6n0J24
4163H6oK1k39K19j0q1j44KJ32J2l9J25l15L88m03K67J8q8K0O0M5j11R6j64OJ80
4189G7j27M4q8J04l5J4J58m4j83J74j14Q1p1q0MK41k76K10N8j83K5j0K5N9J26
4214A89k47J6m0J20k81K02J74jk2j91o4k7K01J06j40P4o6j17L29l75K33k58K73
4237H8k64J58o6Q2j74K06L8qj54K05k9j43J12j36O5j76M03k08J50j8p4r1K4o1
4261g1Nj4L1MJ17o1r1K42j49j54J01P5N7j08P8kj22P3j02K3l8J4K35j25j18J21
4287B1J66j13q6j03Q6J02j29M6K40j82j10M2j2J4M3M0j50j46J67n2K11M2R4m22
4311a91K27k44J83J26k34J55R8n6j15Q0O1j22j3K41j23j36l2LJ8J23r6k2J52k15
$$ plain form
4335 -132 -46 30 21 110 -9 -65 -70 25 -82 56 -67 235 19 -67 -130 -65 204 -8 134 -44 27 -136 154 63 114
4360 114 7 -66 -142 158 -105 -55 71 104 -170 63 23 18 -162 -144 36 -191 -149 91 184 64 -52 186 62
4383 62 -61 -177 11 43 12 148 93 67 -36 43 -75 41 -109 20 -84 -24 43 -33 -196 152 -99 -45 37 50
4407 50 84 30 98 69 125 -114 65 111 -141 29 22 -100 -14 177 75 195 53 -104 -128 -17 72 147 156 71 137 124
4433 124 -151 -106 136 -71 -217 -4 35 309 -27 47 -23 147 187 -190 59 164 -41 80 -57 -75 -22 -3 89
4456 89 -119 5 -87 143 46 -59 -72 -103 -91 -72 -112 -77 -229 -12 223 -238 124 -130 -82 -21 97 52 205 -18
4480 -18 49 -8 168 65 123 -169 58 82 28 95 227 -1 88 50 37 25 43 -66 -73 -53 11 50 84 -4 -125 -95 -36
4507 -36 -6 -81 -15 21 -152 29 -15 -59 66 -123 -139 91 -126 -193 133 153 -130 0 63 -72 33 -57 122 -163
$$ packed form
4335a32Q6P6rQ9j19n6nR5j07J38j23L02k16q6o3O5K69k12J42j78P1j63K90r1N1
4360A14j07p3p6L00k63N0J26L3k74K33m0nj80J8J80k27M2K40R3j20j16K38j24
4383F2j23j16J88L2l1J36n5k6j03P9j18J16j50J29j04O0O7p6j63L48k51N4Q2J3
4407E0L4n4O8k9N6k39J79M6k52J70pj22Q6J91j02J20j42j57k4J11Q9P5Rq5O6j3
4433A24k75M5K42k07j46K13L9K74l36P4p0J70M0l77K49J05k05J21j37j8N3J9R2
4456H9k08J24r2K30r7j05j3l1J2J9m0L5j52K17K35m61L62k54M8O1J18m5J53k23
4480a8O7n7J76j03N8k92K27K4n4O7J32k28Q9l8j3j2J8j09pK0O4L9L4q8j21L0N9
4507c6L0p5O6L6j73J81m4m4J25j89j6K30k17o7L26K0k83J30O3j35J05r0J79k85
$$ plain form
4531 -163 -106 35 65 -16 -18 -158 -16 97 75 111 -11 15 100 -111 34 77 -22 9 -138 -11 49 30 -112 -80 -18
4556 -18 178 -25 87 24 -138 176 -165 34 72 57 -63 -98 -54 -198 -5 2 6 203 62 -78 64 53 -73 49
4580 49 -67 119 158 140 156 118 -119 -79 76 28 -56 3 166 -188 139 23 -74 -138 -92 89 75 7 46 144 73 -31
4606 -31 191 -5 171 -20 13 -68 -112 -231 -40 120 61 40 -56 52 23 -118 2 -108 -262 147 -9 -27 -217
4629 -217 -79 -76 -101 -68 64 36 7 110 -15 18 -8 38 -243 156 246 29 206 149 8 -34 82 -78 -7 36 -18
4654 -18 167 42 -32 -152 -13 -59 -72 61 -33 -149 -274 100 -32 -51 91 -129 -44 162 91 -58 55 -34 5
4677 5 -213 -27 118 35 78 65 -8 102 -158 32 35 165 -102 -199 131 -17 60 104 -3 -48 -12 -61 -51 -18 171
4702 171 -179 13 102 49 -71 22 50 -116 35 195 262 92 104 30 73 -100 -195 223 -170 -35 -134 81 53 -30
$$ packed form
4531a63N7J41L0q1kj40J42J13k2L6j22K6Q5k11J45M3r9L1j47J27O0j9j42L2O2
4556a8J96k03J12o3j62L14l41J99L8j5j20l5M4j44J93PMJ97j41j40J42j1j26J22
4580D9j16J86L9j8J6l8k37M0J55m8q4N9J63l54L27j16r7o4M6J81j4o8L9R8p1j04
4606c1K22j96J76j91L3q1m4j19J91J60n9k1r6J08k9j41J20j10j54M09j56j8j90
4629b17J38Lk5L3J32k8k9J03j25L3k6M6k81L99R0k17J77n7j41m2J16j60P1M3n4
4654a8J85j25p4j20J39m6j3J33r4j16j25L74j32j9J42k20Q5K06p1j49J13q9L9
4677Ek18J86J45q3M3j3p3J10k60J90LJ30k67r7L30j48P7M4j07m5L6m9J0L3J89
4702A71l50J92Q9n3j20R3K8j66J51J60O7j70J2p4M3j73r5M18l93J35r9K15k8q3
$$ plain form
4726 -30 48 -124 -92 55 43 -65 163 70 -103 -34 81 -88 -91 -101 -92 145 -9 -45 -60 75 45 -57 -64 -116 -45 -81
4752 -81 48 -14 -4 -164 48 46 -9 -52 64 72 81 152 172 134 -208 -49 -72 132 -58 85 -116 26 158 -90 94
4777 94 -136 67 -150 -149 3 -13 19 -123 107 123 46 107 100 -56 15 -110 57 -184 270 61 -27 242 93 179
4801 179 66 40 150 -153 -40 -52 102 100 -158 137 7 47 87 160 -88 -38 -91 -128 51 -91 87 -57 185
4824 185 -97 -196 13 -38 153 203 104 135 -31 187 -76 -72 218 -84 74 -4 -22 -48 60 162 37 -90 39
4847 39 -53 123 274 34 62 63 51 -31 -38 -60 22 -47 -13 39 -116 25 89 -274 -67 89 27 -161 -204 -80 -44 9
4873 9 133 -189 -182 -72 132 150 11 -39 -40 -172 -68 181 -66 -75 167 33 -54 67 84 -6 68 -33 -154 24 -104
4898 -104 107 -7 -14 -164 -157 95 44 -130 -111 -73 171 -134 -136 70 -77 -28 -244 -116 -191 -54 -10 -91 190 -213
$$ packed form
4726c0P8j72L2J47j2j08K28r3j73O9J15j69lj0RK37j54l6j5J35l0j02pn2P1l6
4752h1J29o2J0j60K12kn5m3J16QRP1K0l8l42J59k3K04j90J43k01J42J32k48J84
4777I4k30K03k17JJ52j6L2j42K30J6p7O1pj56P1j25J67k41M54k09q8K69j49Q6
4801A79j13k6J10l03J13j2J54kk58K95j30M0M0P3k48N0n3l7J79j42J78j44K42
4824A85k82r9K09n1J91N0r9L1j66K18k63MK90l02J58p8j8k6J08J02j25j27J29
4847C9r2J76J51k40K8Jj2q2pk2Q2o9L4N2j55J41O4l63K07J56o2j88m3J24L6N3
4873IJ24l22PJ10K04J8j39n0jj32J04K49k47rK42j34q7J21J7r0P4j01j21J78j28
4898a04K11j14pj50PK52n1j74J9L8K44l05kK06j47M9k16J28p5J37M4q1K81m03
$$ plain form
4922 -213 21 7 -78 1 40 26 99 -46 82 90 4 -62 -55 -21 139 -17 -111 -96 -60 4 -16 -152 51 53 -41 -8 -53 109
4950 109 -6 -110 -34 -117 -33 -137 135 2 94 53 -133 -164 76 227 -69 143 -95 32 29 -45 2 -68 -106 -237
4974 -237 200 -133 147 -95 -19 30 93 2 -67 42 170 -40 -25 -10 -158 -38 17 0 -35 183 -50 82 -126
4997 -126 -156 -86 -5 113 62 -25 37 56 -176 -179 87 -60 50 -80 -91 40 -40 13 13 289 -60 8 -120 -191 184
5022 184 -41 39 84 40 -193 -18 -84 -131 145 -149 -201 105 -9 -146 -237 110 -13 138 74 49 -74 13 10 -4
5046 -4 21 -64 -157 149 32 10 122 -76 24 -106 136 64 126 2 169 -17 -189 -36 -173 47 -182 28 5
5069 5 125 15 -124 165 162 -113 -158 -59 79 80 -31 14 -238 101 -206 148 -12 -13 72 133 34 -78 -5 25 152
5094 152 -325 7 107 -40 -162 -146 67 114 -37 -77 -14 -23 118 -63 -52 -159 -190 133 118 -255 -138 19 115
$$ packed form
4922b13K34j4q5P9L9j4P3j45J28Qq6o6PL4J60j56r4J5L6O4k0j36K03Kr4L3m5J62
4950A09j15j04P6q3Q4j04K72j33R2m1j86l1K40J51k96K12k38J27lp4M7p0l8j31
4974b37M37l33K80k42P6M9O3r1o9J09J28k10J5J5j48J20N5j7l5K18k33J32k08
4997a26l0P0Q1J18n1q7O2J9k32lK66j47J10j30j1J31q0N3%K76l49O8j28p1L75
5022A84k25Q0M5m4k33J75o6m7K76k94n2L06j14j37r1L47j23J51o4k5j23Q7lj4
5046dK5q5r3L06j17k2J12j98J00j30K42p2O2j24J67j86j72J53j37K20k29K10k3
5069EJ20j10j39K89lk75m5R9J38Jj11M5k52L39l07L54j60jQ5O1r9j12P3L0J27
5094A52m77L32J00j47j22J6K13M7j51m0O3rJ41j81J1j07l1L23j5l73J17J57R6
$$ plain form
5117 115 30 71 -28 -121 -24 -186 23 120 221 29 26 -41 -116 213 47 -94 -1 83 99 52 -10 -28 -100 63 -180 -92
5143 -92 -85 -148 -75 -23 7 74 -110 91 -53 102 23 -141 86 -107 34 -35 -18 -232 -190 -96 -13 -218 13 7 -215
5168 -215 71 144 -35 -167 176 -74 17 6 166 47 20 94 -42 252 191 141 -98 -51 -26 54 127 -35 105 -44
5192 -44 -152 72 -112 147 -126 -117 132 86 22 79 49 -127 -33 -207 27 -123 -48 -43 31 -23 165 9 101 237 -198
5217 -198 -87 -39 -132 187 34 265 9 49 181 -23 -104 146 99 219 0 106 -29 57 54 14 -178 -64 -64 68
5241 68 -27 114 1 0 -45 38 -13 -35 41 -199 -197 49 26 36 -94 27 -127 -13 129 37 -85 -27 -35 -9 4 -95 62
5268 62 -250 -205 -175 -38 -48 -35 -183 -166 13 43 117 52 119 -44 -176 116 100 -73 46 -116 114 -40 -187 199
5292 199 150 -51 126 -25 14 -96 -54 -8 -164 40 -115 53 109 -126 -151 -45 -121 -10 -169 -85 46 0 51
$$ packed form
5117A15q5M1r9r3R7j62K09R7J01j92lo7p5L29j66j41R3Q4J6m7o2j8p2J63k43Q8
5143i2Po3P3N2L0O7j84K01j44J55p9j64K27j93J41o9J7k14M2R4Q3k05K31ok22
5168b15K86P3j79j32L43k50R1j1J60j19k7P4j36K94o1n0k39M7K5Q0P3j62J40j49
5192d4j08K24j84K59k73RK49m6o4N7l0j76R4j74K34j50P5NP4n4J88j56R2J36m35
5217a98J11M8r3L19j53K31k56M0J32k04q1K50m7J20k19J06j35Q6lm0j92J14%J32
5241F8r5J41j13jm5Q3n1k2P6k40KK46k3J0j30J21j54J14J42r2j22N8qK6J3r9J57
5268F2l12M5L0J37j0J3j48J7J79L0P4o5O7j63j32K92j6j73J19j62K30j54j47L86
5292A99m9k01J77j51L9j10M2M6j56K04j55J68N6k35k5J06p6J11j59Q4J31m6N1
$$ plain form
5315 51 2 69 -26 77 -126 -15 -10 209 -81 188 76 57 -48 -161 2 -36 -76 -5 -64 97 -54 -147 22 -111
5339 -111 116 -171 74 -140 51 166 9 84 -33 -15 112 82 -14 -134 -89 -37 -35 -12 16 117 99 66 -111 -73
5363 -73 78 49 149 134 -50 41 11 58 131 -172 93 53 95 84 95 113 -8 -37 104 12 166 89 109 -81 -212
5388 -212 -162 87 -51 29 60 6 -5 49 94 113 65 -85 -92 3 59 -12 -25 -39 -44 -294 -25 -43 -93 45 -9 -16 92 -104
5416 -104 56 108 -61 114 238 108 1 80 34 238 221 163 -126 124 -180 -169 -10 -221 166 94 -126 -275
5438 -275 -83 139 -124 -60 -30 -220 -66 112 -49 56 41 -86 48 -42 144 -121 -81 -15 34 -44 88 -18 -33
5461 -33 124 -92 73 -191 275 -154 44 137 122 120 16 -75 141 155 -55 -59 -174 153 71 17 74 277 179 -51
5485 -51 159 122 -62 13 -10 -91 47 -122 100 78 -164 -92 63 238 98 52 7 81 23 103 130 24 -145 -216 32
$$ packed form
5315E1m9O7r5J03k03J11NK19k90K69j12j9j05j13J63l8m0P1n9J61j51r3J69j33
5339a11K27k87K45k14J91J15j57P5j17J8J27l0r6j20M5N2KK3K8J01j8l3j77L8
5363g3J51k9J00j5j84R1l0M7P3l03K65m0M2j1J1J8j21k9J41r2J54p7K0j90j31
5388b12N0K49j38Q0L1n4j1N4M5J9m8j50pR5N6p1j3j4nk50K69j8n0J38n4pJ08j96
5416a04J60N2j69J75J24j30j07P9m6K04j7n8k89K50l04J1J59k11L87p2k20j49
5438b75J92K22k63O4L0j90J54J78j61J05j5j27J34r0J86k65M0O6M9p8J32j06j5
5461c3J57k16J65k64M66m29J98R3j5kj04r1K16J4k10mj15L27q2n4N7K03r8k30
5485e1K10l7j84P5k3q1J38j69K22k2k42P2J55J75j40m6m5P4n8Q0K7j06j69p1K48
$$ plain form
5510 32 68 -22 -31 -143 -31 79 -55 -11 34 -17 -9 -51 -321 -114 -105 42 -34 44 6 -89 -75 -100 -43 -143 -53 -16 -101 154
5538 154 8 -51 -18 -116 -86 81 -30 -112 -47 -148 -4 4 104 66 16 91 -70 114 52 114 -50 -84 188 -168 -83
5563 -83 158 161 220 202 -30 133 49 -194 -79 92 78 136 209 -2 63 139 -10 -76 10 96 77 -21 -14 -139 -181 35
5589 35 -23 -92 96 -51 29 -107 -19 -15 -25 5 55 -69 -16 -37 93 168 -117 76 83 55 42 26 73 190 168 -12 -33
5616 -33 53 -280 -129 -39 134 -3 40 25 -68 -119 -90 224 79 -4 27 -71 43 -69 -76 120 -177 -122 188 9 -190
5641 -190 -103 -122 -174 74 29 1 -23 -157 -89 8 110 63 73 4 -22 60 -88 -67 -199 86 51 -53 62 76 163 108
5667 108 14 34 -25 -130 17 88 -14 148 46 168 61 309 -122 -68 173 129 56 144 8 36 -70 1 117
5690 117 -253 110 -139 -29 -61 -28 42 4 7 105 64 41 51 -17 -80 179 -59 -9 -34 -23 163 135 -177 34 4 106
$$ packed form
5510C2L6r0rj12J12J10j34M4M5n1Qm2k70K07RJ47p6P8l8r5J4k5N7j00R0L7q5K55
5538A54j46n9L3r8L0J67j11q2O5j01J44QJ00l8n0P5j61J84o2O2j64l4K72l56Q5
5563h3K41LN9j8k32J63q4k43J15J71j4N8P3k11O5P6j49o6Q6Q6j9r8Pj25m2K16
5589C5n8o9J88j47Q0j36Q8Mj0L0N0j24N3k1J30P5k85J93Pk8j3j6M7J17k2j80k1
5616c3Q6l33J51R0J73j37M3j5r3n1K9L14j45q3L1r8J14j12pJ96k97N5L10j79j99
5641a90Q7j9n2K48m5k8k4j34O8R7J02m7J0o9k6Q2j48K1j32K85l5j04J15J4Q7n5
5667A08r4K0n9j05J47P1j02J62j02J22j07K48m31N4K41m4p3Q8j36K8j06P1J16
5690A17l70L63k49J10l2L3P0l8LR8m1k3J0o8o3K59k38N0k5J1J86k8l12K11l0J02
$$ plain form
5716 106 -304 19 -229 150 -97 30 -162 9 130 -13 65 166 -103 -7 252 -133 -4 -8 84 8 51 -97
5738 -97 12 -1 106 -109 -50 111 -30 -22 -28 62 17 -233 -171 -17 -177 173 209 -126 175 21 -171 -27 23 -123
5762 -123 -78 -57 126 25 120 197 143 41 -101 89 6 63 38 -247 -213 -1 192 138 135 115 -32 26 -163 124 -134
5787 -134 -65 53 159 153 178 -168 120 77 -139 33 -34 -32 77 -47 192 -99 -2 7 -144 -49 -45 56 -133 89 257
5812 257 83 48 -37 -61 133 194 27 -110 -4 -15 32 70 -47 45 128 -43 14 51 61 110 -62 127 5 -150
5836 -150 30 1 -134 73 -57 59 14 66 73 59 84 110 141 94 -13 -142 48 -22 5 -109 -75 198 -8 -158
5860 -158 8 -59 90 -25 181 -139 -121 57 -94 235 125 -100 -2 -98 -33 86 -67 -138 90 122 33 -100 -113
5883 -113 46 -13 94 88 -72 -79 8 94 -103 38 26 208 15 84 -23 -47 81 22 -83 -232 92 -108 66 53
$$ packed form
5716A06m10L23k48L79k47J27j92J71J21j43P8J01k69R6K59l85J29mR2p6M3j48
5738i7J09j3J07k15N9J61j41QoR0m5k50O2J54j60L50L6l35L01j54j92J44N0j46
5762a23M5K1J83j01R5P7n4j02j42J90q3N7k5k85L4K12J93n4lk0j47N8j89K87k58
5787a34O9J18J06oK5l46K88m3k16J72o7KJ09j24K39k91R7Rj51R5MJ01j89K22J68
5812B57j74l5q5k4J94O1j67j37J06j1M7L8j17R2Q3j71N7L7J0M9j72J89j22j55
5836a50J80k9j35K07j30J16m5N2Pj4K5K6L1m7j07j29J90p0K7j14L4K73k06j50
5860a58J66o7J49j15K06l20J8J78j51L29j10k25R8r6O5J19j53p1K28L2q9j33j3
5883a13J59n9J07oj60pQ7Q6j97J41j2J82j93O9j07k4J28n9j05j49L24k00J74j3
$$ plain form
5907 53 246 -112 -293 13 107 -80 114 29 -5 56 -119 42 146 -35 -87 -166 -60 -38 117 -10 -35 -140 34
5930 34 -19 -9 119 -46 -175 64 -159 10 -122 -175 -162 -10 -13 -47 -66 35 23 -15 -116 -60 -39 -252 -25 -31 -2
5955 -2 -126 -38 24 1 47 114 28 -105 -4 -3 -35 175 41 34 208 51 -49 -54 68 33 49 -47 -152 118 -90 12
5981 12 29 158 21 -93 -19 -78 -21 -118 176 -46 40 122 11 -122 -49 -181 -49 -83 -70 0 -23 147 132 40 66
6006 66 -35 46 -28 -142 49 -81 -9 -81 85 67 7 -83 -17 99 -60 -81 62 13 -79 48 -83 138 -104 -141
6030 -141 136 43 37 132 38 205 -36 -245 -52 217 128 -264 -131 64 -41 62 96 94 22 86 53 -72 -161 -81 -124
6055 -124 -125 68 28 44 -60 -115 107 5 -104 106 -111 -44 -41 55 -32 -166 81 59 111 -181 -7 10 -91 -117 3
6080 3 91 -44 18 -80 153 107 59 199 83 -10 8 12 66 19 -1 -79 -61 274 -160 110 19 120 -18 124 -216 -156
$$ packed form
5907E3J93l58j81L06R4j87J94q5l4O1j75J61J04j81n2p9J06K2J55j27k5j05J74
5930C4n3J0J28j65j29K39k23J69j32n3J3J52ll4j9J01j2l8j01N6K1k13K27oK9
5955bj24Q8O2k3M6O7q6j33J01Jl2K10j34pJ74j57j00nJ22l5J6r6j05K70k08J02
5981A2J7J29j37j14P4n9N7r7K94k22Q6Q2j11j33P3j32J32l4J3P0k3J70j5r2K6
6006F6j01Q1p4j14J91j30P2p2J66j8o0r0O6J16j59k1J43m9r2J27j31K21k42l7
6030a41K77r3oR5r4J67k41k09J93K69q9l92J33J95j05J03L4kp2O4l3j25q9Q0m3
6055a24jJ93m0J6j04n5K22j02j09K10k17O7LR6q7j34K47k2N2k92J74J7j01k6J20
6080CQ8j35O2r8K33m6m8J40j16r3J8MN4m7k0p8J8L35m34K70r1J01j38J42l40O0
$$ plain form
6106 -156 15 -46 -116 -18 20 -30 117 29 -164 -71 92 31 -1 106 -133 151 7 -5 195 17 38 215 58 158
6130 158 35 -58 -31 -219 -231 100 55 -85 -38 130 -52 -151 54 23 -107 -98 -169 32 -155 122 43 -165 16 103
6154 103 9 -26 -144 210 20 161 72 -70 -63 146 155 -12 65 -144 35 -55 -43 -89 63 -52 10 -73 159 28
6178 28 -178 -118 -54 -22 5 -19 54 82 -43 -5 119 46 -9 150 -63 -55 11 -42 -71 209 -125 37 97 63 -123 83
6204 83 -46 -86 92 3 22 40 -116 22 67 -82 -56 -113 -105 2 -64 34 -199 52 43 13 40 88 -63 36 -62 -27 124
6231 124 58 6 -7 17 116 51 -8 214 21 183 -89 106 -12 -47 5 -345 6 -42 -32 114 -24 -137 86 4
6255 4 89 18 -37 147 67 -301 -229 69 -23 -46 73 26 44 80 -179 17 70 -78 93 195 -8 -50 150 -103 69
6280 69 -79 46 -98 14 9 -23 -118 -154 -134 177 16 -127 91 160 -117 54 27 -83 -37 -25 -12 -147 55 -120
$$ packed form
6106a56J71o1p0R8L8n0J47q8j93R3J63o1l2J07k39K84j44j2K00j78K1J77j57J00
6130A58j23r3K7j88j2L31m5j40M7J68j82r9K05l1j30Rp1K01j87K77p9k08J81Q7
6154A03r4l5j18L54j90J41q9j42PK09Rj67P7k09J79r0J2m6J52j15O2q3K32j31
6178B8k06O0O4L2K7k4P3K8j25L8J24p3n5J59k13QO6n3k9K80l34J62O0l4j86K06
6204H3j29m0J78q9J9J8j56J38M5j49K6n7QJ07o6R8k33K51rl0K7M8j51R9r8L5J51
6231A24o6n2j3K4R9o5n9K22j93J62k72J95j18l5N2l50L51m8J0J46j38j13K23q2
6255DQ5p1n5J84q0l68P2K98r2k3J19m7J8L6k59J96N3j48J71J02k03m2K00k53J72
6280F9j48J25j44J12nl2r5l6K0L11j61j43K18O9k77J71k7j10M6J2J3j35K02j75
$$ plain form
6304 -120 2 55 -184 100 -28 -60 -162 3 10 77 61 64 -29 -195 16 -13 173 -62 -93 -96 -32 -24 -1 -62 141 -47
6330 -47 185 31 -146 -232 -103 -19 -133 22 -30 -118 65 -44 -170 92 -31 15 124 -139 24 68 67 -58 66
6353 66 -303 29 -68 228 -48 -163 -197 -97 89 -50 -39 -133 35 -63 17 -69 104 -46 -36 -16 1 -106 102 -114
6377 -114 -142 68 27 50 0 86 -39 -112 3 -36 -17 149 48 -3 -13 -97 26 139 -63 3 138 42 85 -34 58
6402 58 88 -15 -22 -91 5 -69 70 167 100 -35 -158 -124 -76 -67 -105 -95 157 -93 -76 -4 -20 43 62 -7 71 121 -32 99
6430 99 -55 21 -124 -89 53 31 -36 152 -93 66 -65 27 -227 -45 47 -6 -148 44 -24 -56 -217 -92 -88 -130
6454 -130 7 -25 -100 -33 123 -42 55 41 -60 2 29 7 -50 -45 -100 -14 61 -59 172 181 -56 -14 -62 30 206 28
6480 28 -187 -220 -27 -142 -63 -103 10 2 -29 145 -25 124 2 -43 -101 139 51 47 -24 57 59 63 95 13 60 -153 115
$$ packed form
6304a20J22N3k39K84j28l2j02J65PO7j6Lr3j66K11k9J86k35l1lO4QK3o1K03j88
6330d7K32j54j77q6J29Q4j14J55n2q8J83j09j26K62j23M6J09k63J63M4jj25J24
6353F6l69L32r7K96k76j15l4J00J86j39J1r4J68r8Q0q6J73j50J0K0J7j07K08k16
6377a14k8K10m1K3n0Q6j25p3J15l9J9J66j01n1j0q4J23J13k02O6J35r6M3j19R2
6402E8L0j03po9R6p4J39R7o7j35j23L4M8Rl8J0K52k50J7P2j6O3J9o9P8N0j53J31
6430I9j54P6j45L5J42k2o7J88k45J59j31R2k54J82R2n3j42J92o8l2j61J25Mm2
6454a30J37l2p5O7J56j65R7j4j01O2K7k2n7Nn5Q6P5j20K31Rk37M2m8R2J76j78
6480B8k15l3J93j15P9m0J13ql1J74j70J49j22m5n8K40q8mp1Q1KML2q2M7k13K68
$$ plain form
6507 115 -32 65 157 -48 47 -38 -124 -216 25 -17 -12 -13 64 -98 -8 45 -7 54 68 -64 -41 -33 33 142 -250 -134 186
6534 186 -121 -85 -25 109 -18 -36 229 -91 -219 -77 62 54 -94 45 -2 29 121 -123 86 -226 75 -47 45
6557 45 -61 -66 223 -38 -102 -23 95 197 -102 -131 103 -32 -63 130 13 85 -23 -19 115 32 169 56 -43 191
6581 191 80 -32 21 -131 120 -34 -32 215 53 -84 44 151 149 97 -90 -33 -40 -3 286 116 10 80 -46 -55
6605 -55 -43 112 29 -77 6 64 -6 -48 -147 45 256 -42 52 76 -31 24 37 135 74 -20 -61 161 232 -85 -79 -4 -179
6632 -179 -43 123 -26 -134 -81 50 -45 16 -8 65 -16 15 85 132 0 -330 19 -42 33 5 -24 -98 -25 -155 -25
6657 -25 -15 16 75 161 -17 29 35 61 -183 182 35 105 214 217 -136 54 -57 -286 -36 -73 93 17 -55 27 9 -21
6683 -21 -17 35 129 -8 39 -7 71 105 24 54 -7 -124 -133 52 -125 -52 108 21 50 -82 -101 -18 75 -203 25 -26 36
$$ packed form
6507A15j47R7R2k05R5q5q6r2K41m2NjP7j62R0N3n2O1J4j32K3QO6J09l92J16L20
6534A86l07L6O0J34j27j8K65l20j28J42J39qj48J39m7L1R2k44K09l12L01j22R2
6557D5j06nK89k61o4P9J18J02k99k9K34j35l1J93j17P2j08MJ34q3J37j13r9K34
6581A91j11j12N3j52K51j54KK47j62j37J28J07kn2j87N7pL7K89j70j06P0j26r
6605e5J2J55q3j06Q3N8p0m2r9J92K11k98R4K4j07N5J3R8o1r4m1K22P1l17OP5j75
6632a79J36J66j49j08N3J31r5O1k4P3q1L1P0M7j32l30L49o1P5k8k9p4P3j30J30
6657b5J0L1N9Q6j78M6OK6k44L65j47P0J09Ll53J90j11k29K50l7J66p6p2Q2j8l0
6683b1MN2R4j37M7m6P8L4q1L0o1j17rJ85j77P3J60q7K9j32j9Q3R3k78K28n1O2
$$ plain form
6710 36 68 -15 -25 -41 105 93 -113 -13 -45 -91 71 -86 -74 75 5 43 -59 -51 -63 -161 34 43 -14 -83 149 -159
6736 -159 51 24 102 136 -49 54 -71 -143 -47 -90 5 10 -59 68 15 -50 79 80 -255 -10 81 54 16 68 -246 118
6762 118 -83 -52 86 37 -13 88 -55 21 14 -82 -74 -38 151 -142 -72 -22 -83 11 36 70 99 -86 -89 -101 -16 -79 133
6789 133 191 29 -25 -54 -94 193 -117 -162 108 -30 -11 -87 9 129 192 -284 77 197 -89 4 -10 -102 -94 69 167
6814 167 -292 -37 108 67 116 -68 2 -287 70 225 -91 106 67 53 -130 264 -38 6 -110 -163 61 53 93
6837 93 -35 -48 -15 26 93 -52 120 -64 228 194 -111 196 142 45 -8 273 -136 123 -63 47 4 -254 85
6860 85 -182 -35 53 155 -285 18 15 -128 -103 134 140 58 18 89 99 39 -50 -111 -62 -51 21 72 -48 30 -252 38
6886 38 30 36 6 163 -22 206 10 -65 135 64 16 26 -145 -94 -78 -22 -5 119 -203 -223 223 -78 42 -244 -262
$$ packed form
6710C6L2q3j0j6J46j2k06J00l2m6J62j57J2J49p0L8j02Qj2r8J95Rn7o9K32l08
6736a59K10k7P8L4j85J03j25p2R6m3R5No9J27n3o5J29Jl35K45R1k7l8N2l14L64
6762A18k01L1J38m9n0J01j43P6pr6QL6J89k93P0N0o1R4K5L4K9j85lj2Q5o3K12
6789A33N8j62n4k9m0K87l10m5K70j38J9p6R6J20O3m76L61J20k86R3j4r2QJ63R8
6814A67m59K55J45m1M9j84P0k89L57J55l16J97l9j4j83L94l02M4j16n3K24qM0
6837I3j28j3L3M1O7j45J72j84K92l4l05L07n4r7n3K81m09K59j86J10m3k58L39
6860H5k67J47Q8J02m40L03lj43K5K37Oq2m0P1J0o0q9o1M9J1P2N1j20P8k82K90
6886C8qOl0J57j85K28j96p5K00p1m8J0j71N1J6N6J7J24l22k0M46l01J20k86j8
$$ plain form
6911 -262 -21 -43 -84 -63 -14 19 82 31 39 101 -96 112 200 -104 -21 96 -53 35 198 -184 65 -70 -95 -101 -43 149
6937 149 -259 167 25 108 -9 -108 155 -133 -65 -51 -38 -33 95 -35 -129 -147 74 -27 -92 51 278 -90 90
6960 90 13 -93 -83 -208 -66 -97 -28 99 127 -15 -73 -41 104 31 98 65 37 79 -202 44 -62 69 144 4 -272
6985 -272 31 49 -150 -74 71 163 67 144 16 17 -23 40 -54 4 85 48 6 50 -41 23 -46 30 32 -90 32 37 119 65
7013 65 -67 -44 -13 106 72 -248 110 81 -199 8 -66 58 -71 -175 -54 89 -234 131 -152 -21 47 97 -11
7036 -11 -200 69 52 120 105 79 -53 -33 144 -26 78 57 6 -33 32 -29 75 205 93 31 -9 93 178 144 -102
7061 -102 119 -30 -2 45 225 -72 -51 20 62 109 84 -36 190 -73 141 -72 59 -6 148 184 14 109 -133
7084 -133 -139 -147 -30 -177 111 -75 -71 42 80 -202 -19 5 15 -83 -10 -101 -78 -158 26 -64 102 105 132 41 78 -150 42
$$ packed form
6911b62K41k2m1K1M9L3O3n1QO2j97K08Q8l04Q3J17j49Q8J63l82K49j35k5oN8J92
6937A49m08M26j42Q3j17r9K63k88O8J4J3NJ28j30r4j8K21j01o5J43K27l68J80
6960I0p7j06J0j25J42l1O9J27K8j42n8L2J45p3O7l3k8M2k81K46j06J31P5j40k76
6985b72L03J8j99P6J45R2r6P7j28Jm0O3r4N8Q1l7m2M4r1O4o9P6Kj22J22NQ2n4
7013F5j32K3L1J19l4l20L58k9k80K07p4J24j29j04J21J43l23L65k83J31O8N0j08
7036a1j89K69j7O8j5k6j32K0J77j70J04k1n1l9O5o1J04J30j12o2m0J02Q5l4k46
7061a02K21j49K8M7J80k97K1P1M2M7k5j20K26k63K14k13J31o5J54L6j70R5k42
7084a33oqJ17j47K88j86MJ13L8k82J83K4J0r8P3r1K3q0J84r0J66LK7r1L7k28J92
$$ plain form
7111 42 16 -10 32 82 63 32 24 -11 169 -96 -23 -37 80 -212 -15 -28 13 9 80 122 -99 -13 -38 19 14 49 29 4 -68
7140 -68 -182 157 -47 58 -107 -118 22 -117 34 15 36 -62 120 -224 19 55 16 10 -83 57 -114 42 -149
7163 -149 -76 213 64 -56 6 -69 -15 -206 -57 -80 109 -119 -204 -95 -58 151 -110 150 88 9 -31 -12 -80 -16
7187 -16 -38 -31 21 -187 238 -199 16 -173 -14 31 -3 132 49 58 -75 -255 228 40 -113 60 62 -83 -171 -139 69
7212 69 -52 -141 -132 -89 132 -130 15 168 -94 118 -163 -42 -63 -106 -257 -159 -35 -176 -242 -77 42 -82 -18
7235 -18 49 51 -31 -32 60 100 -7 -138 295 92 55 -45 83 190 -38 -57 -113 -24 220 -49 37 51 -205 -17 -59
7260 -59 108 -36 77 156 100 -140 60 -103 -215 -17 91 -26 6 130 211 -7 -21 174 -149 -4 -80 -18 3
7283 3 -115 -6 -127 32 86 13 78 -100 71 17 53 -16 -92 30 4 47 51 -122 -212 -45 31 47 -94 24 52 -158
$$ packed form
7111D2k6k6M2N0j9l1ql5J80k65P3j4J17k92J97j3M1mP1M2k21Q6k5N7nL5k0k5p2
7140f8j14L39k04J05j65j1J40j39J51j9K1r8J82l44K43L6l9or3J40j71J56j91
7163a49P3K89j49j20O2p5N4j91J49k3J89k28q5J09L7K09k61K60o2p9m0J9o8O4
7187a6k2PN2k08M25m37K15j89J59M5l4J35q3Rj33j80M83j88j53J73Kj45q8L2K08
7212F9j21q9RM3K21k62J45J53k62K12k81J21k1m3j51R8J24j41o6J65J19j24O4
7235a8O7Kq2jR2M0j07j31M33k03l7j00J28J07k28j9n6Q9K44k69Q6J4k56J88m2
7260e9J67j44J13P9n6k40K00j63j12J98J08j17L2J24Q1k18j4J95l23J45p6O2K1
7283Cj18J09j21J59N4p3O5j78J71n4L6o9p6J22k6M3Mj73r0J67P6J6j41J18K8k10
$$ plain form
7309 -158 150 49 -108 38 -121 21 -142 -3 43 -7 141 36 77 96 -157 98 144 -145 -51 -45 39 -119 -39
7332 -39 37 -169 -75 -111 -35 99 94 -76 -32 101 -78 -41 20 -50 -113 -98 114 20 -91 -24 -181 27 -98 -43 10 20
7358 20 -27 -95 -74 -153 139 -193 -21 50 173 -113 -26 -48 -161 260 -35 -68 106 152 61 11 38 -42 172 -61 245
7383 245 -61 4 -114 85 -125 212 -116 17 -112 24 111 -80 -285 -150 -45 42 80 101 205 121 -68 -33
7405 -33 114 19 122 -66 39 64 -49 -119 92 -5 44 -100 63 28 39 35 53 -233 68 121 -6 107 46 -150
7429 -150 -46 26 143 8 -121 78 -93 -60 125 -13 -61 -26 -65 -144 -40 -13 -189 -2 -149 -45 11 -184 -128
7452 -128 148 -96 -40 -168 -238 102 -130 76 -23 -1 16 -37 1 173 -25 -202 -100 -140 -148 -147 -167 102 -167 -9
7476 -9 142 48 30 -19 20 66 -57 -43 205 -89 100 -50 115 -28 9 -50 36 8 -151 -18 -47 73 36 -74 41
$$ packed form
7309a58L08j01j57J46j59J42j63J39M6n0J48j05M1J9k53K55M6k89R4OQ4j58Q0
7332c9P6k06R4l6P6J34nj70M4J33j79L7O1p0o3J5K12r4j11O7j57K08j25N5N3J0
7358B0m7o8K1p9K92l32J72P1J23k86Q7k2j13M21k95l3J74M6r1n0K7q0K14k33L06
7383B45l06O5j18J99k10L37l28J33j29J36Q7j91k05J35J05Q7L8K1J04q4j89L5
7405c3J47r5J03j88J05K5j13p0K11r7M9j44J63l5J1mJ8k86L01N3j27J13o1j96
7429a50J04P2J17j35j29J99j71L3J85j38m8L5l9p9J04K7j76J87j47J04N6j95N6
7452a28K76k44N6j28p0L40k32K06r9K2J7n3L8J72j98j77J02m0qJk0K69k69J58
7476iJ51r4j8m9L9M6j23J4K48k94J89j50J65j43L7n9Q6k8j59J33k9J20l7j10J15
$$ plain form
7501 41 75 -140 -199 -88 21 241 226 38 77 60 -123 102 -1 61 51 -64 -104 59 24 -53 142 -13 -27 -163
7525 -163 25 12 -205 -46 -87 6 45 -73 -2 -277 -105 -92 -129 148 2 -66 52 34 -129 142 165 108 -136 191
7549 191 45 -228 120 -290 -62 114 -39 43 -14 16 -226 -269 116 -145 22 -66 97 -221 10 -26 -210 -102
7571 -102 -80 -93 -11 13 -54 51 -149 -105 -119 153 -97 179 23 15 50 29 77 -112 65 11 53 -30 -30 -137 -164 88
7597 88 -68 -30 134 172 -90 63 83 1 -30 -124 91 93 40 -56 113 -42 24 72 65 38 -48 -118 -126 150 -22 30 84
7624 84 63 -70 76 -146 -117 -10 -53 -111 -28 -142 37 24 -4 64 248 24 -212 -183 -14 170 -165 70 -136
7647 -136 -31 -143 -204 104 -141 36 -123 -103 57 -92 -25 95 36 -1 -82 -172 -48 17 -167 -65 110 111 78 -122
7671 -122 329 137 -98 -156 -119 107 -48 -84 -124 47 -154 71 -13 134 -27 -31 27 29 -67 -5 -228 21 184 40
$$ packed form
7501D1L4k15n9J11J09K20j5j88L9j7j83K25j03O2j0j15m0J63l5p7J95j55j4j36
7525a63J88j3k17J59m1R3L9j18P1k75J72J3l7K77j46o8J18j8j63K71K3n7k44L27
7549A91j46k73L48m10K28J76j53Q2n7L0k42m3L85k61J67q8J63l18K31l6j84J08
7571a02K2j3Q2K4o7J05k00M4j4K72k50K76j56qL5k1M8j89J77n4M2q3%j07k7K52
7597H8j56L8J64L8k62J53K0q2l1r4K15Kn3r6J69j55O6M8pk7q6p0qK76j72N2N4
7624H4k1j33J46k22K9J07m3n8Q3j14J79j3k8O8J84k24k36K9J69J84l35K35k06
7647a36J05j12o1L08k45J77j59K0J60j49O7J20n9l7q1r0J24O5j84J02J75Jl3k00
7671a22M51j92k35n8L7K26j55l6m0J71k01K25q4J47j61mN8Kr6O2k23K49J63j44
$$ plain form
7695 40 125 101 -159 11 232 14 -5 203 -72 -36 -95 174 -69 61 158 -218 -39 117 -111 -54 34 -80 -66
7718 -66 -24 84 -19 -80 -85 85 -161 123 121 124 41 -31 -85 -64 54 -40 -31 -69 38 63 -68 3 59 29 172 -71 94
7745 94 -171 -168 -52 124 -18 147 -63 70 -70 101 -167 -82 -99 -118 198 89 -80 -166 14 -129 -108 -42 -71
7768 -71 -110 69 13 -123 -12 34 -205 162 -23 0 -15 -183 1 49 -20 -82 -125 182 -210 -69 -27 -8 24 41 75
7793 75 92 -57 -51 -91 44 -32 46 -75 -21 19 -1 190 17 -24 22 -73 95 -76 -57 -29 -59 -113 25 226 -48 32
7819 32 -27 -52 -51 -39 71 -204 -47 169 -229 46 -193 -112 -1 38 93 -28 -40 152 144 123 -230 61 -15 -114 42
7844 42 -24 66 -10 105 109 -82 -240 -147 -213 24 -26 145 62 350 -39 31 -57 -83 77 58 -113 35 71 205 7
7869 7 -19 114 46 -25 -200 37 51 0 -72 102 133 124 95 -117 95 -81 1 65 115 -6 123 25 23 -115 35 70
$$ packed form
7695D0Q5k4k60J70K21k18j9K08k75L6n9K69k43J30R7l76J79J56k28N7Q8j14J4
7718f6M2J08j03o1nJ70k46K84kLq3p2n4K1J18r4Rl8J07K5j31P1N6l0J43k43J65
7745I4k65LJ16J76j42J65k10J33j40J71k68Q5j7j9L16j09j69q6J80j43K1O6k9
7768g1l9J79n6j36J11M6k39L67j85K3j5j68J84M8o9o2m3L07l92J41M2J9L2J7L4
7793G5J7j49Om0J35p6P8j21N4M0k0J91j73m1M6r5J68j71J9K8l0n4J38K01k74Q0
7819C2n9k5JJ2J10k75J57K16l98K75k39Q1J11L9N5j21j2J92qk1l53K91p6r9J56
7844D2o6R0p6J15Mj91j58R3o6K37n0J71q3K88l89P0q8k6J60j9j71J48L6J34j98
7869Gk6J33o8p1j75K37J4n1p2J74L1rk9k12K12j76Q2O4N0j21J29r8kj38J50L5
$$ plain form
7895 70 73 67 -75 46 99 83 -25 186 59 58 60 -252 59 -24 -138 -203 15 -150 -33 -84 -230 162 -88 135 -134
7920 -134 -21 -4 145 60 246 -14 29 -131 7 -11 27 75 28 -214 -156 31 2 -103 43 -21 -76 235 -139 26
7944 26 31 0 -13 151 157 -11 64 16 73 -86 -7 -173 66 -75 78 22 2 36 36 -19 -186 14 16 125 -14 14 -150
7971 -150 59 53 -66 121 21 85 -174 177 -1 22 35 -20 -188 -133 248 125 68 68 -172 12 -30 -25 4 24 -180
7996 -180 89 -23 51 122 -87 57 171 12 3 190 -75 29 -45 -12 30 29 123 -26 -100 34 201 16 141 -56
8020 -56 82 -10 -79 -117 -35 -165 -5 -34 -68 117 -116 56 66 59 -164 -22 237 85 -65 -13 109 -201 -26 -118
8044 -118 -92 -26 29 48 51 137 -85 -83 -36 -9 -43 -1 8 -51 29 105 84 36 184 55 -172 -125 74 -26 74 38 -71
8071 -71 -98 97 -125 239 -167 -72 -51 -143 6 -59 37 199 -77 -65 97 129 162 -25 39 -186 -96 -72 -35 -175 -101
$$ packed form
7895G0Loj42J21N3j6j08K11j27jKl12L11q3j14o5K18j65J17n1j46L92k50K23k69
7920a34J13J7J49q5J86k60M3j60J38j8L8M8m7k42N8J87k9j05J46o4n5L11l74J65
7944B6Nl1j3J64Oj68P5m8N7j59P9j66K39j41J53n6k0L4%n5j67K00KJ09j39K8j64
7971a50K09oj19J87j00O4k59L51j78K3J3n5j68N5L81j23n7%k40J84m2NK9K0k04
7996a80K69j12P4P1k09J44J14j59rJ87k65J04p4L3M2jR4j49p4J34J67j85J25j97
8020e6J38r2o9l8Q2j30J60k9l4J85k33J72J0pk23J42K59j52j50N2J22l10J75r2
8044a18K6O6N5J9LQ6k22KM7K7l4M2Rn9Q0P6k1m8J48j29k27M7J99j00J00l6j09
8071g1k7J95k22L64m06R5K1r2J49o5R6J62k76J2J62L2L3j87O4k25R0K4L7j40P4
$$ plain form
8096 -101 -213 -53 -35 -13 112 88 -3 -179 4 -29 -42 216 42 -27 113 -25 47 -115 3 151 -73 70 44
8119 44 46 -180 55 -4 -65 105 -52 -88 -15 2 -48 96 65 84 -64 56 60 86 -69 86 -209 179 163 -115 -139
8144 -139 -40 -225 34 183 -30 -20 -48 208 74 -85 116 35 4 2 160 -68 31 115 44 -122 -4 190 14
8167 14 113 -74 -90 -3 -5 -280 -44 20 -40 131 -109 122 24 -36 -100 46 -17 -53 29 -63 -7 -144 51 -81
$$ packed form
8096a01j12J60J8K2J25k4r1j76J83l3j3K58j74o9J40j38P2j62J18J48k24J43k6
8119D4Kk26K35n9o1J70j57l6P3J7n0J44l1J9j48J20MK6j55J55k95L88j6k78k4
8144a39R9j85K59J49k13J0k8K56j34j59K01q1l1kJ58k28R9Q4p1j66J18J94j76
8167A4R9j87j6Q7kk75K36O4o0J71k40K31r8o0o4J46o3l6Q2r2N6j37J95j32
8191h1
$$ Imaginary data points
##PAGE= N=2
##DATA TABLE= (X++(I..I)), XYDATA
$$ plain form
0 0 0 0 0 0 0 0 0 0 0 0 0 0 0 0 0 0 0 0 0 -8 8 -8 8 -8 8 -16 16 -16 19 -24 27 -32 35 -40 45 -51 59 -65 73 -81
40 -81 91 -99 111 -122 136 -151 167 -183 201 -223 246 -270 298 -329 362 -400 443 -493 548 -616
60 -616 694 -791 906 -1056 1256 -1534 1953 -2675 4302 -18345 -2077 -57900 -86665 -2066
74 -2066 -21799 -54824 -39825 -84104 -105608 -37578 -32802 -30807 46932 72281 46226 48972 21018
87 21018 12557 48449 21595 9371 85352 79121 18704 42348 34839 -22908 -7095 -16794 -68736
100 -68736 -26621 -1647 -64919 -48126 5368 -29029 -45014 -21684 -37020 -28994 -9949 -32397
112 -32397 -5668 48003 31404 26699 55949 39503 31046 38058 4150 14550 60790 25230 828
125 828 45652 26861 -23890 -15360 -28782 -53228 -27892 -37342 -61552 -17335 -2587 -41608 -28982
$$ packed form
0@%%%%%%%%%%%%%%%%%%%qJ6j6J6j6J6k4L2l2L5m3N1n9O7p5Q5r6J10j24J38j54
40h1J72j90K10k33K58k87L18l50L84m24M69n16N68o27O91p62Q43r36J041j164
60f16J310j485J697j962K312k790L487m628O977k2647J6268n5823k8765Q4599
74b066j9733l3025J4999m4279k1504O8030M776J995P7739K5349k6055K746k7954
87B1018q461L5892k6854j2224P5981o231o0417K3644p509n7747J5813r699n1942
100f8736M2115K4974o3272J6793N3494l4397j5985K3330j5336Q026J9045k2448
112c2397K6729N3671j6599m705K9250j6446q457P012l3908J0400M6240l5560k4402
125H28M4824j8791n0751Q530j3422k4446K5336r450k4210M4217J4748l9021J2626
$$ plain form
138 -28982 -5910 -20334 -13784 -5451 -5854 31205 45561 20556 41594 63774 33179 22557 26190
151 26190 6935 15135 19632 -13054 -1001 25918 -13548 -36998 -15819 -31853 -49551 -36401
163 -36401 -41977 -32600 1239 -9806 -21123 12972 14238 -9681 647 9187 11417 28479 23386
176 23386 19614 48139 41885 9006 15700 17887 -5118 -4189 -6496 -17535 3091 4052 -27316 -17583
190 -17583 -1771 -30969 -40297 -23492 -26504 -18899 -4946 -11653 2325 24572 7360 -1567 17907
203 17907 15897 9418 17477 16787 25076 38321 18537 6996 23619 9415 -16452 -10812 -10930 -18182
217 -18182 -10108 -16590 -24326 -5244 -8877 -33100 -22608 -8541 -18203 -14549 -2035 2261 17079
230 17079 20381 7325 17864 28273 10988 6733 17519 14620 15572 15794 4181 8899 13744 -9749
$$ packed form
138b8982K3072j4424O550Q333m03L7059J4356k5005K1038K2180l0595j0622L633
151B6190j9255Q200M497l2686J2053K6919l9466k3450K1179j6034j7698J3150
163c6401n576R377L3839j1045j1317L4095J266k3919J0328Q540K230J7062n093
176B3386l772K8525o254l2879O694K187k3005R29k307j1039K0626R61l1368R733
190a7583J5812k9198r328J6805l012P605J3953o707J3978K2247j7212q927J9474
203A7907k010o479Q059o90Q289J3245j9784j1541J6623j4204k5867N640j18p252
217a8182Q074o482p736J9082l633k4223J0492J4067r662L654J2514M296J4818
230A7079L302j3056J0539J0409j7285m255J0786k899R52K22j1613M718M845k3493
$$ plain form
244 -9749 -19726 -6941 -14308 -24786 -17215 -16066 -13237 -4912 -14091 -17658 -1597 -3502 -14618 -3324
258 -3324 7817 8382 14076 14320 15136 25547 19049 4085 10786 15826 4268 2318 5837 2822 4248
273 4248 -1308 -14662 -10706 -6953 -21587 -24775 -12944 -11719 -11828 -8150 -7658 -1017 4747 -4431 -3851
288 -3851 9117 9577 5650 12395 16807 18686 19328 10863 7755 13644 5521 -6274 -1922 1345 -4277
303 -4277 -6339 -8110 -9427 -6629 -12882 -21241 -14639 -8536 -13276 -11556 -2793 2305 5069 4162 2946
318 2946 9618 11994 4601 5642 13879 14533 11603 11448 10604 10602 6767 -3663 -6682 -3070 -7161 -13474
334 -13474 -11092 -6753 -7175 -9614 -12433 -10640 -6606 -9529 -11941 -4438 2807 3845 5169 9100 13274
349 13274 13970 9277 5619 9393 10636 5531 3979 8150 8612 3748 -1380 -3793 -4473 -8081 -14282 -14801
$$ packed form
244i749r977J2785p367j0478P571J149K829Q325r179l567J6061j905j1116J1294
258c324J1141N65N694K44Q16J0411o498j4964O701N040j1558j950L519l015J426
273D248n556j3354L956L753j4634l188J1831J225j09L678M92O641N764r178N80
288c851J2968M60l927O745M412J879O42q465l108N889q123j1795M352L267n622
303d277k062j771j317K798o253q359O602O103m740J720Q763N098K764r07j216
318B946O672K376p393J041Q237O54k930j55q44kl835j0430l019L612m091o313
334a3474K382M339m22k439k819J793M034k923k412P503P245J038J324L931M174
349A3274O96m693l658L774J243n105j552M171M62m864n128k413o80l608o201n19
$$ plain form
365 -14801 -9308 -7590 -9510 -7981 -3454 -1447 -4234 -6306 -3084 1883 2680 2247 7436 13575 13793 10160
381 10160 9090 9639 7413 2608 -245 1612 4349 1595 -2624 -1589 -903 -6562 -12367 -12642 -10675 -9879
397 -9879 -10255 -8522 -2687 1561 -946 -2122 1372 2888 1738 2058 4894 10258 13069 10188 9766 12782
413 12782 8672 1278 -582 -879 -2151 -2623 -4505 -4617 -777 -3538 -10555 -10430 -8007 -10932 -11576 -7851
429 -7851 -3095 1934 3484 1915 5666 8137 3283 1602 4763 6318 7618 8748 7357 10102 10634
444 10634 2105 -2832 -686 -4031 -9091 -7021 -5217 -4253 -1698 -4774 -7338 -3978 -6329 -11644 -8169
459 -8169 -3237 -1540 2183 4862 6390 10465 7917 2134 4440 6101 1793 3400 6950 6337 8242
474 8242 6763 -507 -1061 -880 -9777 -12124 -6417 -6503 -6763 -2955 -3786 -3125 -1046 -6149 -8271 -2702 -1843
$$ packed form
365a4801N493J718j920J529M527K007k787k072L222M967P97m33N189O139K18l633
381A0160j070N49k226m805k853J857K737k754m219J035O86n659n805k75J967P96
397i879l76J733N835M248k507j176L494J516j150L20K836N364K811k881m22L016
413A2782m110p394j860k97j272m72j882j12L840k761p017J25K423k925o44L725
429g851M756N029J550j569L751K471m854j681L161J555J300J130j391K745N32
444A0634q529m937K146l345n060K070J804R64K555l076k564L360k351n315L475
459h169M932J697L723K679J528M075k548n783K306J661m308J607L550o13J905
474H242j479p270n54J81q897k347N707q6k60L808q31O61K079n103k122N569Q59
$$ plain form
491 -1843 -1971 4179 7735 9584 11858 7847 4604 7516 3444 -2395 2188 4593 1628 4377 3213
506 3213 -1630 -794 -4265 -13154 -10374 -6243 -9922 -7197 -704 -649 475 1442 -2849 -1663 1297 -2700
522 -2700 -871 6631 7327 8383 11008 7729 6467 6723 -1372 -3760 1735 -1052 -3975 1915 1595 -2538
538 -2538 -1035 -5394 -10642 -6689 -7175 -11065 -4431 937 -716 1924 3715 1080 2803 1773 -1718
553 -1718 2644 6594 4215 7718 10302 6128 5776 4539 -3207 -3128 -215 -6264 -5737 1047 -2078 -4413
569 -4413 -1510 -5151 -8138 -5293 -7258 -7894 -990 1013 985 5217 5929 3800 5237 2455 394 5081
585 5081 4366 1867 7392 7839 2836 3827 1331 -5219 -3541 -3912 -9279 -5223 -387 -4496 -3479 -101
601 -101 -4052 -5026 -3398 -6205 -3502 1611 712 3263 8562 6329 5080 6478 2011 1090 4041 635
$$ packed form
491a843j28O150L556J849K274m011l243K912m072n839M583K405k965K749j164
506C213m843Q36l471q889K780M131l679K725O493N5J124R67m291J186K960l997
522b700J829P502O96J056K625l279j262K56q095k388N495k787k923N890l20m133
538b538J503m359n248L953m86l890O634N368j653K640J791k635J723j030l491
553a718M362L950k379L503K584m174l52j237p746P9K913o049N27O784l125k335
569d413K903l641k987K845j965o36O904K003k8M232P12k129J437k782k061M687
585E081p15k499N525M47n003R91k496o550J678l71n367M056M836m109J017L378
601a01l951r74J628k807K703N113q99K551N299k233j249J398m467r21K951l406
$$ plain form
617 635 404 6181 3761 662 3135 -639 -5971 -4199 -6375 -9498 -4350 -2901 -5015 -384 926 -3146
633 -3146 -956 -951 -4089 -468 2153 310 5178 8970 5504 6680 7227 1961 1348 2173 -2090 -741 3141
650 3141 -641 -969 1896 -2887 -5476 -3710 -7743 -8457 -3312 -4607 -4605 1729 1222 -887 2744 1329 -1012
667 -1012 2523 2453 784 6065 7136 3891 6184 5862 1010 1415 443 -3937 -1754 -498 -4440 -2022
683 -2022 126 -4683 -4543 -2820 -6534 -5601 -2038 -4412 -2251 3075 1091 1311 4714 2711 1452 4386
699 4386 2625 1963 5737 4475 2418 4991 2950 -543 909 -1685 -4511 -1773 -2773 -5762 -2245
714 -2245 -1913 -5281 -3047 -2136 -5184 -2891 -1034 -2751 547 3855 1458 2870 5494 3309 3227 4643
730 4643 2294 2884 4601 1710 1586 3461 287 -1662 -486 -3253 -4728 -2690 -4578 -5338 -1918 -2954
$$ packed form
617F35k31N777k420l099K473l774n332J772k176l123N148J449k114M631J310m072
633c146K190Nl138L621K621j843M868L792l466J176N47n266o13Q25m263J349L882
650C141l782l28K865m783k589J766m033p14N145j295KO334n07k109L631j415k341
667a012L535p0j669N281J071l245K293l22m852M05r72m380K183J256l942K418
683b022K148m809J40J723l714R33L563k374K161N326j984K20L403k003j259K934
699D386j761o62L774j262k057K573k041l493J452k594k826K738j000k989L517
714b245L32l368K234R11l048K293J857j717L298L308k397J412K624k185q2J416
730D643k349N90J717k891j24J875l174j949J176k767j475K038j888p60L420j036
$$ plain form
746 -2954 -4407 -1406 -1423 -3145 -506 311 -600 2775 3607 2179 4762 5325 2708 3529 3907 1510 2295
763 2295 2329 -304 724 1391 -2141 -2525 -1552 -4356 -4430 -3363 -4993 -4129 -1854 -3275 -2778 353 -395 -717
781 -717 1705 1265 1586 3565 3045 2655 5100 4238 2680 3748 2942 811 1114 -15 -1916 -917 -1577 -3724
799 -3724 -2591 -2202 -3975 -3307 -2751 -3978 -2811 -1843 -2766 -1040 1177 527 1683 3398 2707 3082 4039
816 4039 2461 2672 3732 2107 1817 3013 1579 308 459 -1142 -2716 -2333 -3773 -4621 -2887 -3010 -3586
833 -3586 -2107 -1746 -2096 -1113 -1087 -1301 501 1409 1066 3006 4127 3572 4068 3843 2418 2491 1993 207 292
852 292 1062 -74 -687 -704 -1997 -2693 -3099 -4417 -4168 -2981 -3255 -2501 -935 -280 -93 738 325 645 1655
871 1655 1618 1779 3677 3935 3469 3802 3011 1811 1138 -47 -1031 -704 -826 -1869 -1632 -1549 -2283 -2898 -3326
$$ packed form
746b954j453L001j7j722K639Q17r11L375Q32j428K583N63k617Q21L78k397P85
763B295L4k633J028O67l532l84R73k804p4J067j630Q64K275j421M97L131p48l22
781g17K422m40L21J979n20l90K445q62j558J068q06k131L03j129j901R99o60k147
799c724J133L89j773O68N56j227J167R68r23J726K217o50J156J715o91L75R57
816D039j578K11J060j625k90J196j434j271J51j601j574L83j440q48J734j23n76
833c586J479L61l50R83K6k14J802R08l43J940J121n55M96k25j425P3m98j786Q5
852B92P70j136o13j7j293o96m06j318K49J187k74P54J566O55J87Q31m13L20J010
871A655l7J61J898K58m66L33p91j200o73j185r84L27j22j043K37Q3p34o15m28
$$ plain form
890 -3326 -3914 -3390 -2515 -2462 -968 483 1124 1099 1843 1783 2073 2041 1763 2329 3563 3185 2976 2955 2106 819
910 819 -429 -1529 -1928 -1729 -2461 -2445 -1725 -1495 -2123 -2707 -3143 -2824 -2532 -2192 -1219 658 1886 2408 2620
929 2620 2982 2595 2268 1709 1536 1977 2473 2026 2097 2148 1149 -539 -1832 -2520 -2906 -3251 -3196 -2399 -1271 -1387
949 -1387 -1344 -1754 -1710 -1476 -1703 -1211 -74 1558 2412 3238 3976 3907 2980 1771 794 900 923 577 738 1196
969 1196 945 199 -1236 -2242 -2848 -3791 -4285 -3553 -2336 -1342 -767 -190 414 461 -484 -521 123 1245 1696
988 1696 2420 3299 4021 3720 2636 1581 1014 181 -877 -913 -296 -174 -199 -911 -1515 -2072 -2889 -4039 -3665
1007 -3665 -2746 -2003 -1290 -158 805 1325 1320 551 900 1334 1525 1818 2667 3260 3502 2990 1956 1148 521 -953
1027 -953 -1837 -1455 -1400 -1464 -1381 -1609 -1687 -1808 -2717 -3312 -2290 -1936 -1481 -114 925 1705 1951 1898 1399 1918 1766
$$ packed form
890c326n88N24Q75N3J494J451O41k5P44o0K90l2k78N66J234l78k09k1q49j287
910H19j248j100l99J99p32J6P20K30o28n84m36L19K92L40R73J877J228N22K12
929B620L62l87l27n59j73M41M96m47P1N1r99j688j293o88l86l45N5P97J128j16
949a387M3m10M4K34k27M92J137J632Q54Q26P38o9r27j209r77J06K3l46J61M58
969A196k51p46j435j006o06r43m94P32J217R94N75N77O04M7r45l7O44J122M51
988A696P24Q79P22l01j084j055n67q33j058l6O17J22k5p12o04n57q17j150L74
1007c665R19P43P13J132R63N20np69L49M34J91K93Q49N93K42n12j034q08o27j474
1027i53q84L82N5o4Q3k28p8j21r09n95J022L54M55J367J039P80K46n3m99N19j52
$$ plain form
1048 1766 1226 1855 2613 2485 2351 2122 881 399 -557 -2258 -2452 -1930 -2253 -2406 -1442 -1525 -1484 -1679 -2496 -2201
1068 -2201 -1532 -1352 -808 1190 2176 2261 2649 2596 2185 2068 1448 780 1616 1793 1222 1651 1186 335 -527 -1553
1088 -1553 -2858 -2611 -2603 -2984 -2172 -753 -1130 -1069 -766 -1288 -1086 -562 -814 75 1888 2469 2370 3317 2831 2328
1108 2328 2030 605 152 873 365 83 801 595 -461 -793 -1949 -2965 -2557 -3024 -2989 -1811 -793 -946
1126 -946 -107 375 119 267 305 -44 1100 1925 1490 2546 3092 2479 1799 1697 258 109 105 -969 -991 -218
1146 -218 -982 -1403 -1137 -2034 -2386 -2169 -2672 -2356 -874 -795 -512 701 1013 594 1071 1022 974 2079 1948 1662
1166 1662 2272 2045 1582 1386 954 -361 -415 -626 -1504 -1156 -856 -1780 -1894 -1494 -2016 -2012 -1775 -1979 -1104 36
1186 36 -226 151 1381 1258 1127 1570 1282 1388 2092 1750 1282 2182 1510 424 508 -297 -1181 -1114 -1487 -1811
$$ packed form
1048A766n40O29P58j28j34k29j241m82r56j701j94N22l23j53R64q3M1j95q17K95
1068b201O69J80N44J998R86Q5L88n3m11j17o20o68Q36J77n71M29m65q51q62j026
1088a553j305K47Ql81Q12J419l77O1L03n22K02N24k52Q89J813N81r9R47m86n03
1108B328k98j425m53P21n08k82P18k06j056l32j156j016M08m67L5J178J018j53
1126i46Q39M82k56J48L8l49J144Q25m35J056N46o13o80j02j439j49mj074k2P73
1146b18p64m21K66q97l52K17n03L16J482P9K83J213L12m19M77m9m8J105j31k86
1166A662O10k27m63j96m32j315n4k11q78L48L00r24j14M00n22MK37k04Q75J140
1186C6k62L77J230j23j31M43k88J06P04l42m68R00o72j086Q4q05q84O7l73l24
$$ plain form
1206 -1811 -1097 -1257 -1986 -1448 -1347 -1688 -1306 -1060 -1309 -272 544 356 1435 1830 1622 1466 1776 1078 1335
1225 1335 1515 585 1190 1637 519 46 139 -798 -1632 -1342 -2170 -2044 -1088 -1521 -1669 -881 -640 -1077 -387 -337
1245 -337 -151 472 824 645 1794 2165 1554 1766 1906 1110 1069 964 161 532 322 -809 -798 -456 -1461 -1477
1265 -1477 -1550 -1971 -1733 -1185 -1670 -1288 -204 -563 -504 495 624 650 1281 1193 1169 2103 1315 837 1726 1500 863
1286 863 959 483 -151 36 -596 -1430 -880 -1206 -2154 -1708 -1229 -1492 -1005 -846 -976 -589 -25 -721 -73 854
1306 854 934 1090 1868 1515 1845 1738 897 558 973 262 -58 216 2 -8 -402 -881 -1373 -1183 -1839 -2164 -1357
1327 -1357 -1075 -971 -326 201 56 730 466 114 740 1195 783 1292 1644 1775 1842 1459 705 456 274 -765
1347 -765 -668 -295 -656 -869 -845 -1241 -1164 -1244 -1778 -1822 -1010 -884 -674 -83 354 647 866 791 751 1323 973 812
$$ packed form
1206a811P14j60p29N38J01l41L82K46k49J037Q16j88J079L95k08j56L10o98K57
1225A335J80r30O05M47j118m73R3r37q34K90q28J26R56m33j48P88K41m37O90N0
1245c37J86O23L52j79J149L71o11K12J40p96m1j05q03L71k10j131J1L42j005j6
1265a477p3m21K38N48m85L82J084l59N9R99J29K6O31q8k4R34p88m78Q89k26o37
1286H63R6m76o34J87o32q34N50l26r48M46M79k63M87J59j30L87N64o96O48R27
1306H54Q0J56P78l53L30j07q41l39M15p11l20K74k14j0l94m79m92J90o56l25Q07
1327a357K82J04O45N27j45O74k64l52O26M55m12N09L52J31O7l83p54k49j82j039
1347g65R7L73l61k13K4l96P7q0n34m4Q12J26K10N91M37K93K19p5m0N72l50j61
$$ plain form
1369 812 1226 1366 1176 1120 762 419 261 -278 -1064 -734 -727 -967 -1080 -972 -1184 -1035 -1227 -1294 -861 -352 -281 -161
1391 -161 601 900 758 890 1071 912 1283 788 832 1271 1201 831 564 72 -111 -586 -881 -1355 -910 -771 -1092
1412 -1092 -790 -539 -768 -927 -1196 -1135 -382 -171 -19 837 1216 1357 1332 1254 977 767 489 248 800 835 544
1433 544 554 391 0 -556 -970 -1690 -1713 -1214 -1406 -979 -431 -153 -376 -398 -431 -500 -257 -336 204 1147 1458 1482
1455 1482 1495 1461 981 613 48 -58 60 42 -87 80 254 46 -848 -1106 -1313 -1324 -1585 -1387 -799 -300 -38
1476 -38 24 366 277 116 147 149 526 1002 1152 1057 1656 1464 1062 308 -130 46 -289 -500 -722 -228 -291 -778 -879
1499 -879 -852 -1046 -1092 -1283 -858 -178 23 232 431 506 591 363 538 602 932 645 750 1232 1237 693 375 190
1521 190 -263 -394 -699 -796 -423 -373 -674 -659 -703 -953 -1021 -1206 -743 -300 -30 36 711 765 883 569 403 460 680
$$ packed form
1369H12M14J40j90n6l58l43j58n39p86L30Pk40j13J08k12J49j92o7M33N09P1J20
1391a61P62K99j42J32J81j59L71m95M4M39p0l70k67m92j83m75k95m74M45J39l21
1412a092L02K51k29j59k69O1P53K11J52Q56L79J41k5p8k77k10k78k41N52L5k91
1433E44J0j63l91n56m14p20k3M99j92M27N48K78k23k2l3o9K43p9N40R43L11K4
1455A482J3l4m80l68n65j06J18j8j29J67J74k08q94k58k07j1k61J98N88M99K62
1476c8O2L42q9j61L1KL77M76J50r5N99j92m02p54m38J76l35k11k22M94o3m87j01
1499h79K7j94m6j91M25O80K01K09J99P5Q5k28J75O4L30k87J05M82Nn44l18j85
1521A90m53j31l05r7L73N0l01J5m4k50o8j85M63M43K70O6O75N4J18l14j66N7K20
$$ plain form
1544 680 479 544 833 1091 953 304 -132 -200 -612 -1147 -1193 -766 -284 -519 -449 -309 -497 -717 -964 -589 -235
1565 -235 24 239 410 1260 1222 833 766 495 404 223 245 298 734 702 166 -59 -100 -522 -1261 -1294 -1125 -920 -660
1588 -660 -466 -242 178 -173 -391 -428 -311 -7 -142 198 911 1245 991 927 1040 707 329 -27 -97 59 -61
1609 -61 8 38 -44 -444 -814 -909 -697 -852 -872 -815 -335 271 101 175 183 423 475 180 391 594 637 638 745 764 731
1634 731 381 164 5 -225 -261 -557 -453 -399 -468 -692 -679 -509 -663 -846 -702 -362 -87 40 -32 357 540 282
1656 282 54 373 651 912 734 703 845 651 130 -27 38 -213 -407 -612 -274 -112 -636 -734 -837 -442 -860
1677 -860 -712 -313 -62 -92 328 375 413 732 320 141 476 313 416 402 581 836 680 119 -189 -3 -539
1698 -539 -784 -810 -515 -483 -341 -406 -447 -144 -663 -706 -588 -129 -180 -99 411 801 979 715 604 689 625 119 92
$$ packed form
1544F80k01O5K89K58j38o49m36o8m12n35m6M27M82k35P0J40j88k20k47L75L54
1565b35K59K15J71Q50l8l89o7k71r1j81K2N3M36l2n36k25m1m22p39l3J69K05K60
1588f60J94K24M20l51k18l7J17L04j35L40P13L34k54o4J13l33l78l56p0J56j20
1609f1O9L0q2m00l70r5K12j55k0N7M80O06j70P4QK40N2k95K11K03M3JJ07J9l3
1634G31l50k17j59k30l6k96J04N4o9k24J3J70j54j83J44L40K75J27p2L89J83k58
1656B82k28L19K78K61j78l1J42j94n21j57O5k51j94k05L38J62n24r8j03L95m18
1677h60J48L99K51l0M20M7L8L19m12j79L35j63J03j4J79K55j56n61l08J86n36
1698e39k45k6K95L2J42o5m1L03n19m3J18M59n1Q1N10L90J78k64j11Q5o4n06k7
$$ plain form
1721 92 441 378 213 76 7 -82 -302 -756 -971 -658 -537 -743 -629 -434 -332 -231 -431 -212 316 135 -16
1742 -16 272 660 623 362 576 689 816 320 58 423 702 -56 -485 -152 78 -219 -791 -653 -423 -195 -735
1763 -735 -621 -80 -155 -160 -450 55 238 64 143 259 970 751 389 345 416 616 282 -134 141 573 121 -304
1785 -304 -111 -11 -735 -984 -926 -445 -573 -654 -438 -142 133 -146 -284 91 175 -31 -132 389 839 721 384
1806 384 513 1027 482 -210 -364 116 143 -102 -490 -173 228 -284 -975 -689 -177 -553 -800 -890 -94 378 16
1827 16 -177 502 543 4 -154 256 585 713 323 478 911 962 74 -365 117 104 -614 -700 -348 57 -249 -832
1849 -832 -777 -38 -465 -903 -601 -7 129 -196 -212 434 883 388 -210 493 953 602 108 252 716 569 -28
1870 -28 -365 90 239 -563 -571 -507 -113 -424 -870 -718 -127 88 -786 -652 217 331 -27 -147 446 753 308
$$ packed form
1721I2L49o3j65j37o9q9k20m54k15L13J21k06J14J95J02J01k00K19N28j81j51
1742a6K88L88l7k61K14J13J27m96k62L65K79p58m29L33K30k97n72J38K30K28n40
1763g35J14N41p5nk90N05J83j74P9J16P11k19l62m4P1K00l34m16K75M32m52m25
1785c04J93J00p24k49N8M81j28q1K16K96K75k79j38L75Q4k06j01N21M50j18l37
1806C84J29N14n45o92j54M80K7k45l88L17M01n12o91K86N12l76k47r0P96M72l62
1827A6j93O79M1n39j58M10L29J28l90J55M33N1q88m39M82j3p18q6L52M05l06n83
1849h32N5P39m27m38L02N94J36l25j6O46M49m95n98P03M60l51m94J44M64j47n97
1870b8l37M55J49q02qO4L94l11m46J52N91K15q74J34Q69J14l58j20N93L07m45
$$ plain form
1891 308 -199 213 784 535 170 367 850 528 248 -473 135 77 -557 -801 -343 203 -280 -572 -236 157
1911 157 -131 -840 -776 159 305 39 -117 830 818 618 230 119 745 209 -127 -10 834 733 -26 -216 48
1932 48 104 -467 -1005 -697 31 -403 -969 -344 394 216 -454 -795 -4 182 -227 -209 685 998 639 418 492
1953 492 794 253 -375 -356 354 230 -243 -219 103 250 -387 -791 -464 -65 -450 -856 -536 373 256 -241 -147
1974 -147 442 457 176 -177 366 831 279 89 594 829 316 -253 -170 168 -133 -505 -463 38 -182 -452 -673
1995 -673 -342 21 -467 -573 -387 404 117 -272 8 320 550 135 -14 614 990 507 -64 415 742 343
2015 343 -311 -180 10 -58 -444 -628 -23 58 -420 -742 -396 -230 -545 -786 -292 271 584 31 28 587 713
2036 713 157 -141 372 608 344 -54 463 617 377 -424 -163 -134 -403 -852 -631 -228 10 -372 -590 -114
$$ packed form
1891C08n07M12N71k49l65J97M83l22k80p21O08n8o34k44M58N46m83k92L36L93
1911A57k88p09O4R35J46k66j56R47j2k00l88j11O26n36l36J17Q44j01p59j90K64
1932D8N6n71n38L08P28m34n66O25P38j78o70l41P91J86m09J8Q94L13l59k21P4
1953D92L02n41o28J9P10j24m73K4L22J47o37m04L27L99l85m06L20R09j17m97R4
1974a47N89J5k81l53N43M65n52j90N05K35n13n69Q3L38l01l72M2N01k20k70k21
1995f73L31L63m88j06J86P91k87l89K80L12K30m15j49O28L76m83n71M79L27l99
2015C43o54J31J90o8l86j84O05Q1m78l22L46J66l15k41M94N63L13n53lN59J26
2036G13n56k98N13K36k64l98N17J54k40q01K61K9k69m49K21M03K38l82k18M76
$$ plain form
2056 -114 -2 -401 -853 -274 105 41 -11 190 741 849 296 -54 322 422 5 -222 26 320 181 -165 -75
2077 -75 289 -297 -656 -921 -332 -212 -549 -322 2 252 -174 -273 -47 233 62 -202 82 654 700 430 296
2098 296 480 584 77 9 141 306 -70 -356 -336 -103 -299 -453 -514 -154 -390 -423 -519 -105 -36 -232 -204 23
2120 23 381 292 40 252 648 500 72 66 309 382 51 -38 30 67 -193 -127 -256 -105 -244 -510 -395 -194 -74
2143 -74 -371 -125 195 210 -9 -184 286 243 96 -47 282 411 348 243 47 457 356 -215 -216 85 -197 -245
2165 -245 -178 -255 152 -259 -613 -445 -246 -175 -361 -111 174 198 27 218 450 474 221 39 158 516 388 124
2187 124 92 530 355 28 -318 -165 -200 -470 -449 -175 43 -304 -331 -268 89 -102 -416 -352 208 245 -22 56 463
2210 463 581 366 107 89 326 283 -10 87 254 56 -101 195 -24 -38 -348 -434 -245 -86 -413 -445 -242 -19
$$ packed form
2056a14J12l99m52N79L79o4n2K01N51J08n53l50L76J00m17k27K48K94j39l46R0
2077g5L64n86l59k65N89J20l37K27L24K50m26r9K26K80j71k64K84N72M6k70j34
2098B96J84J04n07o8J32J65l76k86K0K33j96j54o1L60k36l3r6M14O9j96K8K27
2120B3L58q9k52K12L96j48m28oK43P3l31q9O8L7k60O6j29J51j39k66J15K01J20
2143g4k97K46L20J5k19j75M70m3j47j43L29J29o3j05j96M10j01n71jL01k82m8
2165b45O7p7M07m11l54J68J99P1j86K50K85K4j71J91K32K4k53j82J19L58j28k64
2187A24l2M38j75l27l46J53l5k70K1K74K18l47k7O3L57j91l14O4N60L7k67P8M07
2210D63J18k15k59j8K37m3k93R7J67j98j57K96k19j4l10q6J89J59l27l2K03K23
$$ plain form
2232 -19 -72 -237 -148 175 125 11 140 405 400 140 160 103 288 152 196 35 332 47 -268 -264 -100 -276 -302 -274
2256 -274 -186 -107 -158 -490 -183 47 -169 -150 -89 163 237 49 232 549 353 2 -27 203 209 -145 -135 -36 74 138
2280 138 -125 -168 -4 -205 -472 -569 -299 -58 -161 -321 52 210 41 -281 -111 122 102 -18 232 409 480
2301 480 234 98 418 121 47 -178 -96 -110 -142 -112 -172 56 137 -421 -204 -384 -239 -257 -185 -52 197 285 -140
2324 -140 241 419 235 15 -97 277 278 17 110 178 353 145 -99 -181 162 -352 -319 -236 -50 -37 -298 -165 -61
2347 -61 -41 -189 -250 297 105 85 -120 237 406 339 94 318 435 172 89 -239 190 187 -104 -237 -113 30 -8
2370 -8 -250 -231 -213 -188 -263 -134 -84 -218 -218 -86 120 80 216 -3 165 271 37 61 62 241 141 -34 37 148 63
2395 63 -107 52 -273 -124 -316 -280 -107 -97 -5 -118 83 -128 -153 -121 -180 134 198 234 74 304 354 255 69 -62
$$ packed form
2232a9n3j65Q9L23n0j14J29K65nk60K0n7J85j36M4j61K97k85l15MJ64j76k6K8
2256b74Q8P9n1l32L07K30k16J9O1K52P4j88J83L17j96l51k9K30Ol54J0R9J10O4
2280A38k63m3J64k01k67r7K70K41j03j60L73J58j69l22J70K33k0j20K50J77P1
2301D80k46j36L20k97p4k25Q2j4l2L0o0K28Q1n58K17j80J45j8P2J33K49Q8m25
2324a40L81J78j84k20j12L74Jk61R3O8J75k08k44q2L43n14L3Q3J86J3k61J33J04
2347f1K0j48o1N47j92k0k05L57J69o7k45K24J17k63q3l28M29lk91j33J24J43l8
2370hk42J9J8K5p5J29N0j34%J32K06m0J36k19J68J06k34K4JJ79j00j75P1J11q5
2395F3j70J59l25J49j92L6J73J0R2j13K01k11k5L2n9L14O4L6j60K30N0r9j86j31
$$ plain form
2419 -62 74 183 -183 -103 -61 175 -57 -94 23 44 11 -356 -472 -253 82 -183 3 -162 62 7 -263 -21
2441 -21 134 327 -108 219 145 148 210 38 184 130 -106 -70 -33 -165 53 -72 73 -103 -131 -296 -182 -149 19
2464 19 -30 -278 57 -39 108 118 160 -102 247 147 -3 489 284 124 77 56 -89 21 -80 -254 -56 3 -70
2487 -70 -161 -252 -197 -197 -71 -92 3 -194 42 126 225 71 -106 178 24 250 170 -32 42 257 378 -7 75 105 141
2512 141 -170 -10 -194 70 -18 -47 46 -138 -51 -201 -406 -224 -142 -73 15 169 165 80 294 115 163 -60 54 -30
2536 -30 -24 173 123 23 135 126 -250 -141 -332 -451 -185 -14 14 -156 94 110 15 -156 -77 -88 -93 -29 78 256 185
2561 185 257 165 -162 72 -114 -19 75 -129 -50 200 4 -213 -7 -172 -146 -277 -277 -293 -118 80 77 -218 194 57
2585 57 96 77 -28 113 186 104 105 115 181 -111 -96 129 -69 -21 -163 -153 4 -116 -37 -148 -51 25 -83 15 -41 66
$$ packed form
2419f2J36J09l66Q0M2K36k32l7J17K1l3l67j16K19L35k65J86j65K24n5k70K42
2441b1J55J93m35L27p4LO2j72J46n4k36L6L7j32K18j25J45j76k8j65J14L3J68
2464A9m9k48L35r6J47J0M2k62L49j00j50M92k05j60m7k1j45J10j01j74J98N9p3
2487g0r1r1N5%J26k1R5j97K36Q4R9j54j77K84j54K26q0k02P4K15J21l85Q2L0L6
2512A41l11J60j84K64q8k9R3j84Q7j50k05J82Q2O9Q8J54mq5K14j79M8k23J14q4
2536c0OJ97n0j00J12rl76J09j91j19K66J71K8j70K50J6r5j71P9j1nO4J07J78p1
2561A85P2r2l27K34j86R5R4k04P9K50j96k17K06j65K6j31%j6J75J98lk95M12j37
2585E7L9j9j05J41P3q2JJ0O6k92J5K25j98M8j42J0J57j20P9j11R7P6j08R8n6J07
$$ plain form
2611 66 -113 -83 -14 -37 40 -41 142 32 406 244 -141 156 322 147 -248 -89 55 -12 -96 86 28 -25 -73 -138
2635 -138 52 -210 -218 -77 -43 65 118 62 238 33 -121 -57 177 17 129 -52 250 45 330 26 -69 -49 -116
2658 -116 -228 -202 -134 -45 124 289 -52 -191 -193 -48 -86 -84 -10 -36 22 -48 162 -108 -17 -2 52 85 -12 59 -135 53
2684 53 162 93 74 -22 185 -203 -57 -252 -136 -70 -151 120 -62 -30 -2 -102 -69 -220 60 -113 189 70 58
2707 58 234 -54 159 50 -203 -96 143 128 -48 -63 -82 -128 -29 -31 -155 26 -78 14 -10 107 42 52 -107 -91
2731 -91 162 116 170 177 -52 120 103 48 -13 -30 -66 -55 184 77 57 -150 -215 -82 -258 -160 -170 62 159 76 -132 -18
2757 -18 129 -2 44 80 -134 82 103 152 173 257 56 -69 34 -162 -218 101 -175 24 119 -132 -136 75 -156 -232
2781 -232 -318 -30 -66 11 -274 66 -18 94 -115 -48 261 -42 78 143 143 108 258 -76 46 38 -53 -71 -220 -25
$$ packed form
2611F6j79L0O9k3P7q1J83j10L74j62l85K97J66j75l95J59J44o7q4J82n8n3m8o5
2635a38J90k62qJ41L4J08N3n6J76k05j54O4K34j60J12j81L02k05K85l04r5K0o7
2658a16j12K6O8Q9J69J65l41j39kJ45l8KP4k6N8p0K10k70R1J5N4L3r7P1j94J88
2684E3J09o9j9r6K07l88J46j95J16O6q1K71j82L2K8j00L3j51K80j73L02j19j2
2707E8J76k88K13j09k53J07K39j5j76j5j9m6R9kj24J81j04R2k4J17o5J0j59J6
2731i1K53m6N4Pk29J72j7n5o1j7l6J1K39j07k0k07o5J33j76R8j0K32R7q3k08J14
2757a8J47j31M6L6k14K16K1M9K1Q4k01j25J03j96n6L19k76J99R5k51mK11k31p6
2781b32q6K88l6P7k85L40q4J12k09O7L09l03J20O5%l5J50l34J22qr1j8j49J95
$$ plain form
2805 -25 -180 37 31 -50 -170 -48 -41 167 -66 -102 -388 25 66 99 98 84 169 44 -128 125 58 11 33 -35 152 74
2831 74 24 -41 -161 -123 -125 -99 123 117 9 -125 -169 10 -39 42 90 30 42 79 -73 -61 -115 285 268 14 50 6 72
2858 72 -156 46 -264 -195 1 -204 -135 -74 39 -66 81 0 -12 -126 -83 -41 -12 133 -158 112 72 120 38 26
2882 26 -30 95 -15 -112 -57 88 182 -83 -87 81 27 -238 -132 -32 -171 -202 -85 25 68 66 -50 57 -96 -10
2906 -10 -64 -104 288 103 178 30 131 -85 -76 -86 -42 -105 -199 -118 -66 -82 133 -110 -27 -149 -80 -140 -145 -32 -111 -51 -93
2933 -93 209 66 0 74 -5 -117 18 88 236 85 171 117 -44 -63 -122 -160 -85 -242 31 0 -148 -43 -26 57 -65
2958 -65 -111 160 105 40 -86 136 122 108 137 24 -66 111 -67 51 75 -135 -87 16 132 -90 29 -227 -36
2981 -36 -11 18 -64 -100 -68 -56 30 178 49 146 90 -13 -29 116 237 146 -1 -21 -16 -63 -30 187 151 73 -68 14 -180
$$ packed form
2805b5j55K17oq1j20J22PK08k33l6k86M13M1L3jj4Q5j25j72K53o7m7K2o8J87p8
2831G4n0o5j20L8kK6K22oj08j34m4J79m9Q1M8o0J2L7j52J2n4M00j7k54L6m4O6
2858G2k28K02l10O9J96k05O9O1J13j05J47q1j2j14M3M2K9J45k91K70m0M8q2j2
2882B6n6J25j10r7N5J45R4k65mJ68n4k65J06J00j39l1J17J10M3kj16J07j53Q6
2906a0n4m0L92j85P5j48J01k16Rj0M4o3r4Q1N2j6K15k43Q3j22O9o0nJ13p9O0m2
2933i3L02j43o6P4p9j12J35P0J48j51Q6n4j61j9n9l8P5j57K73l1j48J05J7Q3j22
2958f5m6K71n5o5j26K22j4j4K9j13r0J77j78J18K4k10M8J03J16k22J19k56J91
2981c6K5K9q2l6L2J2Q6J48j29R7n6j03j6J45J21r1j47k0Nm7L3K17l6p8j41Q2j94
$$ plain form
3008 -180 -79 -127 -28 66 115 -29 95 -9 158 -211 9 -13 -30 77 39 157 179 258 136 -20 -142 -74 -112 -134
3032 -134 68 -51 -9 -56 -206 104 9 -245 -219 -20 -117 -195 -191 72 83 180 106 2 -107 210 85 -36 9 1 95
3057 95 40 -41 189 76 -65 29 -34 99 -246 -17 -291 108 -24 84 -212 40 149 232 -24 146 -59 121
3079 121 166 102 -33 -48 -67 -34 19 -119 72 56 -27 -199 -191 -229 -129 -113 -87 1 59 103 -240 -61 170 117 7 94
3105 94 -1 161 66 -44 -39 217 51 -10 21 37 141 10 -45 119 25 99 -116 -55 -229 -87 62 -1 -118 30
3129 30 4 -85 -48 95 -109 38 44 244 50 259 82 99 -209 -135 53 -304 57 248 -18 102 -9 67 29
3152 29 -307 23 -68 -265 -99 69 24 -217 -65 -169 -37 206 -183 62 37 136 -81 113 174 213 76 -39
3174 -39 -96 67 -100 -89 -149 -125 -74 38 -83 -27 -46 -233 25 -42 19 75 -84 -119 -72 228 42 16 150 79 45
$$ packed form
3008a80J01m8R9R4M9j44J24j04J67l69K20k2j7J07l8J18K2P9j22j56j22O8l8k2
3032a34K02j19M2m7j50L10r5k54K6J99r7p8MK63J1R7p4j04j09L17j25j21M5qR4
3057I5n5q1K30j13j41R4o3J33l45K29k74L99j32J08k96K52J09Q3k56J70k05J80
3079A21M5o4j35j5j9L3N3j38J91j6q3j72Ql8J00J6K6Q8N8M4l43J79K31n3j10Q7
3105I4r5J62r5j10NK56j66o1L1J6J04j31n5J64r4P4k15O1j74J42J49o3j17J48
3129C0k6q9L7J43k04J47OK00j94K09j77J7l08P4J88l57L61J91k66J20j11P6l8
3152B9l36L30r1j97J66J68m5k41J52j04J32K43l89K45k5R9k17J94O1L9j37j15
3174c9n7J63j67J1o0K4N1J12j21N6j9j87K58o7O1N6j59l5M7L00j86k6J34p1l4
$$ plain form
3199 45 43 194 -158 258 195 -47 -15 -150 68 2 -36 107 -136 -44 -76 -130 74 -275 -128 31 -42 161 106 -91
3223 -91 10 98 57 -116 202 137 131 -14 -14 -65 87 -72 -151 -47 15 13 -31 159 -98 -168 -28 -6 80 103 -12 -12 59
3250 59 -82 39 88 -85 -135 119 15 35 -21 2 -250 91 -68 -218 -21 28 -134 179 12 -100 20 127
3272 127 50 169 -199 31 128 -211 24 60 -126 260 115 201 -36 83 24 -124 -13 -3 158 103 57 -129 -146
3295 -146 -24 28 -196 58 -44 -169 -110 70 -204 -77 112 -77 67 47 -132 118 190 20 175 56 -5 -29
3317 -29 136 54 264 -44 44 103 -29 -193 -152 69 116 -91 11 38 -20 21 0 -197 -34 111 -107 75 -5 -85
3341 -85 -6 -117 170 -85 123 -66 -90 -27 99 133 23 53 -57 53 91 -79 -164 -197 -6 -50 -20 5 138 -25
3365 -25 14 29 56 -173 48 -19 51 -26 156 185 78 139 -107 93 53 4 -241 211 -41 -8 54 102 179 -54 15
$$ packed form
3199D5kJ51l52M16o3k42L2j35K18o6l8J43k43R2l2n4K04l49J47J59p3K03n5j97
3223i1J01Q8m1j73L18o5oj45%n1J52j59p9J04O2km4J90k57p0J40K2Q6K3j15%P1
3250E9j41J21M9j73n0K54j04K0n6K3k52L41j59j50J97M9j62L13j67j12J20J07
3272A27p7J19l68K30R7l39K35L6j86L86j45Q6k37J19n9j48J11J0J61n5m6j86j7
3295a46J22N2k24K54j02j25N9J80k74J27J89j89J44k0j79K50P2j70J55j19o1k4
3317b9J65q2K10l08Q8N9j32j64M1K21M7k07J02K7n8M1k1j97J63J45k18J82q0q0
3341h5P9j11K87k55K08j89k4O3J26L4j10L0j10J10L8j70q5l3J91m4L0K5J33j63
3365b5L9J5K7k29K21o7P0p7J82K9j07O1k46K00m0m9k45M52k52L3O2M8P7k33O9
$$ plain form
3390 15 -16 -126 50 -89 124 -2 161 -110 75 18 -14 -19 -129 72 -125 67 93 345 -87 7 21 -139 -13
3413 -13 -60 79 11 126 -18 43 -188 -152 89 8 -35 55 -10 89 154 -14 -118 85 199 -38 55 236 -35 -64
3437 -64 -7 -41 23 -63 8 -1 -160 -173 -29 -97 -59 16 106 -31 -247 211 -145 -10 -74 84 -26 -9 -3 -29 209 -160
3463 -160 32 62 153 -23 -99 244 -85 -109 -148 -4 146 11 3 -3 -83 -14 76 -127 86 -235 -66 18 98 104 86 -3
3489 -3 230 -56 -106 -193 -241 142 249 -165 -65 -97 161 -2 -126 -264 121 385 -42 -93 6 37 -154 -32 -86
3512 -86 221 27 -133 -47 86 140 65 -3 18 88 79 -91 -25 -58 -144 -148 -75 -63 -69 189 96 36 33 72 85 79 53 190 81
3541 81 149 34 -30 -11 -1 1 -49 52 -29 65 86 -26 139 114 7 162 -99 -183 95 55 41 -92 -72 74 -68
3566 -68 170 88 212 149 115 5 -67 -12 -140 176 135 85 145 67 95 147 136 38 -102 16 23 -75 -48 57 4 136
$$ packed form
3390A5l1j10J76j39K13j26J63k71J85n7l2nj10K01j97J92K6K52m32R4J4j60J26
3413a3m7J39o8J15j44O1k31L6K41q1m3R0o5R9O5j68j04K03J14k37R3J81k71k9
3437f4N7l4O4q6P1rj59j3J44o8L8P5R0j37k16M58l56J35o4J58j10J7Ok6K38l69
3463a60J92L0R1j76p6L43l29k4l9J44J50j35qoq0O9R0k03K13l21J69Q4Q0Oj8q9
3489cK33k86n0q7m8L83J07m14J00l2K58j63j24j38L85K64m27n1R9L1j91J22n4
3512h6L07j94j60Q6J33N4p5o8K1P0rj70O6l3q6mP3J2oK58r3o0lL9J3ok6J37j09
3541H1O8j15o4J9J0Kn0J01q1R4K1j12J65k5j07J55k61q4K78m0j4j33K0J46j42
3566f8K38q2J24o3l4j10p2N5j28L16m1n0O0p8K8N2j1r8j40J18Pr8K7J05n3J32
$$ plain form
3592 136 -135 -47 26 22 -42 143 -164 82 127 -122 58 101 54 -108 189 -2 149 41 219 -47 210 124 -51
3615 -51 39 -308 -56 -25 1 73 -13 70 15 -120 129 29 -23 -200 125 185 -75 -216 55 -134 66 -148 80
3638 80 23 -2 133 115 36 80 -159 126 -12 -61 -19 -92 33 -100 -40 -168 -38 41 347 51 -122 88 -28 -9
3662 -9 -145 27 -177 41 25 -101 121 -30 64 -24 -22 -48 -160 -16 68 -77 -11 12 119 -57 45 -58 -15 94
3686 94 117 -138 24 5 122 164 -166 20 -12 61 -186 -191 -19 -84 73 92 -52 81 -4 -88 -41 77 54 -109 -148
3711 -148 -20 -63 36 -176 52 -169 145 -251 -40 167 165 -37 -102 387 134 -23 -110 116 47 -33 -275 4 -86
3734 -86 -97 60 -28 110 -34 -89 -83 -118 70 -29 41 111 50 126 24 14 13 -48 -75 -94 -73 72 46 -78 77 43 -70
3761 -70 24 -52 35 -53 -209 -172 120 -13 -122 -13 70 83 8 -71 26 2 88 51 297 -13 -56 8 -78 -52 45 17 -219
$$ packed form
3592A36k71Q8P3mo4J85l07K46M5k49J80M3m7j62K97j91J51j08J78k66K57q6j75
3615e1R0l47K52L1K6P2q6Q3n5j35K49j00n2j77L25O0k60j41K71j89K00k14K28
3638H0n7k5J35j8p9M4k39K85j38m9M2p3J25j33O0j28J30P9L06k96j73K10j16J9
3662ij36J72k04K18j6j26K22j51R4q8Kk6j12J44Q4j45O6K3J07j76J02j03M3J09
3686I4K3k55J62j9J17M2l30J86l2P3k47nJ72o5J57J9j44J33q5q4M7J18k3j63l9
3711a48J28m3R9k12K28k21L14l96K11K07kk02o5M89k53j57q7K26o9q0k42K79r0
3734h6j1J57q8J38j44n5Ol5J88r9P0P0o1P6j02j0jo1k7j9K1J45k6j24J55l4j13
3761g0R4p6Q7q8j56L7K92j33j09J09Q3J3p5p9R7k4Q6l7K46l10m3O4q6K6R7k8k36
$$ plain form
3788 -219 -23 227 -80 -96 47 99 -181 -56 65 -259 171 66 -21 -117 225 18 -180 -172 116 -155 -4 90
3810 90 24 78 260 22 -84 -11 -134 -103 61 -140 -96 -126 -65 -55 60 -53 -94 100 -22 -33 52 42 100 -2 -2
3835 -2 129 132 -28 79 -46 46 -68 -20 -61 58 52 27 56 -164 40 -75 13 -83 239 22 -113 -22 58 -140 -167
3860 -167 -1 27 146 -57 76 -74 -146 -23 82 -53 87 37 -154 -141 3 2 0 31 12 78 88 -106 -118 -25 13
3885 13 38 76 161 116 -184 -96 97 214 -7 46 114 140 9 -40 -43 70 -22 88 -68 7 -2 -66 -113 -214 -12 -24
3911 -24 47 -172 -164 -46 -91 -152 -101 -109 203 139 -82 52 -157 -125 25 44 81 -149 -75 241 61 29 54 55 -55 124
3937 124 -166 -36 -113 -116 -67 217 47 238 -117 -62 77 -165 -52 -12 97 67 55 -25 52 -12 206 -18 -2 -12
3961 -12 113 9 -141 141 46 -80 15 30 -167 94 54 96 5 -8 92 16 72 78 -76 119 -87 -147 14 -123
$$ packed form
3788b19J96K50l07j6J43N2k80J25J21l24M30j05q7r6L42k07j98QK88k71J51R4
3810I0o6N4J82k38j06P3j23L1J64k01M4l0O1J0J15j13m1J94j22j1Q5j0N8j02%
3835bJ31Lj60J07j25R2j14M8m1J19ok5K9k20K04j15Q8r6L22k17j35R1Q0j98k7
3860a67J66K8J19k03J33j50p2J23J05j35J40n0j91J3J44jkL1j9O6J0j94j2R3L8
3885A3K5L8Q5m5l00Q8J93J17k21N3O8K6j31m9lJ13r2J10j56P5ro4m7j01K02j2
3911b4P1k19QJ18m5o1N1qL12o4k21J34k09L2J50J9L7k30P4L16j80l2K5Jj10J79
3937A24k90J30p7lM9K84j70J91l55N5J39k42J13M0J09l0j2q0P7o4K18k24J6j0
3961a2J25j04j50K82r5j26R5J5j97K61m0M2r1j3J00p6N6Oj54J95k06o0J61j37
$$ plain form
3985 -123 -102 201 -37 -79 64 90 -43 41 1 -32 -194 248 -160 -138 -59 -120 -207 -74 -59 34 60 -3 28 31 72 -130
4011 -130 197 -97 -30 92 123 111 130 -13 131 11 -37 -65 -77 -38 -33 -72 202 157 15 -17 102 -151 101 -106
4035 -106 148 -26 80 -53 -50 103 66 83 0 -90 -244 -95 -9 141 57 -120 141 36 -27 -29 -45 140 8 51
4059 51 -51 9 16 176 214 -24 187 -109 165 4 -68 -143 48 -69 48 165 -21 116 65 15 -7 -150 -260
4082 -260 -8 26 63 45 72 195 52 -8 -88 -69 -11 -93 65 -26 -30 148 -42 46 145 -70 20 -195 -96 -58 -57 -57 -2
4109 -2 23 15 -57 -41 -198 34 -48 -72 153 -154 -118 53 167 -35 -87 232 25 94 20 -100 -115 -10 -52 68 40
4134 40 -151 104 -22 -168 132 35 164 -22 -103 145 147 27 -112 149 35 201 -24 5 -120 19 24 -156 149
4157 149 175 -25 -18 -352 -76 21 -46 87 27 32 224 -46 -272 19 -9 -64 -37 48 -23 45 -106 -162 143 -37 -90
$$ packed form
3985a23K1L03k38m2J43K6j33Q4m0l3j62M42m08K2P9o1q7J33J5R3K6o3L1LM1k02
4011a30L27k94O7J22L1j2J9j43J44j20m8k8j2L9Nl9K74m5j42l2J19k53K52k07
4035a06K54j74J06j33LJ53l7J7q3r0j54J49Q6J50q4j77K61j05o3kj6J85j32M3
4059E1j02O0PJ60L8k38K11k96K74j61p2p5J91j17J17J17j86J37n1n0k2j43j10
4082b60K52L4L7j8K7J23j43o0q0J9N8q2J58r1mJ78j90Q8R9k15R0k15R9L8J%N5
4109bK5qp2J6j57K32q2k4K25l07L6J71J14k02n2L19k07O9p4j20j5J05m2J20k8
4134D0j91K55j26j46L00r7J29j86q1K48Kj20j39K61j14J66k25K9j25J39Nj80L05
4157A49K6k00Pl34K76R7o7J33o0NJ92k70k26K91k8n5K7Q5p1O8j51n6L05j80n3
$$ plain form
4182 -90 -1 222 -7 14 32 -54 19 -55 -52 -113 72 -183 -35 -132 48 -130 -154 -72 -6 -36 -230 -223 78 -73 60 -160
4208 -160 -2 -261 -14 -40 0 69 -85 -125 91 75 -16 -50 -142 177 71 -99 6 -69 -126 52 -7 86 -96 3
4232 3 -51 -41 11 185 -112 -35 24 -89 -193 -127 -8 90 -99 -68 -41 56 -165 -57 -46 -118 -85 -84 26 10 150 -5
4258 -5 -42 1 -11 15 -105 22 96 72 18 -51 -142 -204 -4 -18 31 148 92 57 -17 -8 -41 -25 179 -123 -80 -51 -58 -95 -241
4287 -241 -48 -11 32 36 -101 -79 26 3 -135 -189 -116 41 239 109 -31 130 -112 28 59 -129 -88 -50 3 -95
4311 -95 -45 37 179 10 -47 -99 -67 -72 -19 185 -14 -217 -38 -60 -136 177 -58 68 65 -226 -76 3 -43 -168 34
4336 34 -212 -50 29 -27 -264 90 -47 -262 -14 -5 -19 -40 46 -13 89 79 85 -132 -173 67 187 54 15 -212 -104
4361 -104 -3 -42 -76 -52 150 -98 78 -13 -156 36 48 74 -77 31 -98 20 120 67 67 -35 -111 82 175 156
$$ packed form
4182i0Q9K23k29K1J8q6P3p4Lo1J85k55J48r7J80j78k4Q2O6l0j94PL01j51J33k20
4208a60J58k59K47k6M0O9j54m0K16j6r1l4r2L19j06j70J05p5n7J78n9R3j82R9
4232Cn4J0N2J74k97P7N9j13j04O6J19R8j89L1K7R7k21J08J1p2L3JJ10j6J40j55
4258el7M3j2K6j20J27P4k4n4o9r1o2K00j4M9J17n6l5p4Rl3J6K04l02M3K9pl7j46
4287b41J93L7M3Mj37K2J05k3j38n4P3J57J98j30j40J61k42J40L1j88M1L8N3r8
4311i5N0Q2J42j69n7n2L2nN3K04j99k03J79k2p6L13k35J26lk91J50P9m6j25K02
4336C4k46J62P9n6k37L54j37k15K48Rj4k1Q6n9J02j0Ok17m1K40J20j33l9k27J08
4361a04J01l9l4K4K02k48J76r1j43J92J2K6j51J08j29J18J00n3%j02p6J93R3j9
$$ plain form
4385 156 15 254 98 -51 194 -152 -48 77 199 -78 27 141 -12 -298 52 -202 86 -6 -65 -102 68
4406 68 75 68 -13 -5 131 76 -72 40 99 27 191 -4 5 79 -1 -57 107 -48 -114 92 12 105 -183 6 -110 -83 78
4433 78 34 21 -110 38 56 279 70 -48 -3 -28 -126 -56 -56 78 36 -27 88 -54 -71 108 118 55 13 -6 33 97
4459 97 130 -45 57 124 146 -179 103 109 93 -182 -8 3 82 -58 1 -39 -37 46 124 -26 84 105 -62 64 21 117
4485 117 68 -118 -82 -43 158 13 -75 158 48 -158 -127 -92 49 -106 -100 117 37 27 -30 43 -111 104 -201 80
4509 80 -70 -137 -7 66 -34 -35 26 -158 115 -38 -74 -146 -138 -71 101 9 130 -85 163 -97 -75 180 -55 33 -42
4534 -42 139 61 5 -22 -66 -94 28 119 84 -1 -30 -116 -159 80 38 -5 54 161 -79 144 -28 36 46 -146 -27 2
4560 2 0 139 -104 -79 38 -153 129 142 -97 54 -11 -146 16 104 -8 -121 -154 51 -2 22 83 -79 -48 18 -98
$$ packed form
4385A56j41K39j56j49K45l46J04J25J22k77J05J14j53k86L50k54K88r2n9l7J70
4406F8Ppq1QJ36n5j48J12N9p2J64j95RP4q0n6J64j55o6K06q0R3k88J89j16K7J61
4433G8m4j3j31J48J8K23k09j18M5k5r8P0%J34m2o3J15j42j7J79J0o3m2j9L9O4
4459I7L3j75J02O7K2l25K82Oj6k75J74J1P9j40N9m0KQ3P8j50J10K1j67J26m3R6
4485A17m9j86L6L9K01j45q8K33j10k06L1L5J41j55OK17q0j0n7P3j54K15l05K81
4509H0j50o7J30P3j00jO1j84K73j53l6p2QO7J72r2J21k15K48k60K2K55k35Q8p5
4534d2J81p8n6k7m4k8J22R1l5q5k9q6m3K39m2m3N9J07k40K23j72O4J0j92J19K9
4560BkJ39k43K5J17j91K82J3k39J51o5j35J62Q8j12j13l3K05n3K4O1j62L1O6j16
$$ plain form
4585 -98 76 -53 13 -95 -41 14 -100 -130 183 49 40 -64 -40 -59 56 -96 91 -151 113 173 12 57 -143 -30
4609 -30 42 35 75 -180 54 -44 108 60 68 186 -66 23 67 -23 -34 -8 -328 -16 168 73 -127 -14 11 -21 -71 -143
4635 -143 -59 135 138 54 0 68 47 -39 18 -55 189 -209 -65 -43 -38 -9 -73 -115 40 4 -15 5 91 -17 -14 -112 -108 161
4663 161 53 -131 -153 163 80 41 -9 -10 1 -210 177 -125 -77 32 -83 44 -92 -39 138 171 -21 -204 -49
4686 -49 101 -54 -137 36 104 167 66 33 39 47 183 50 191 -6 -111 39 -210 -126 -3 -43 -54 -251 -40 -9
4710 -9 68 -111 41 47 -10 59 -50 146 -21 167 -34 -133 25 -88 113 44 131 -70 37 -39 36 115 -167 -124 63
4735 63 75 -16 97 -58 3 101 -121 64 -58 -52 -17 9 26 -4 31 93 167 6 -151 -91 -229 55 63 -47 -158 -63
4761 -63 184 69 130 -85 88 -98 -3 -86 106 79 40 -29 -253 78 79 -19 -104 159 -68 -63 -160 181 -41 110 -145
$$ packed form
4585i8J74j29O6j08N4N5j14l0L13j34rj04K4j9J15j52J87k42K64O0j61M5k00J13
4609c0P2pM0k55K34r8J52m8QJ18k52Q9M4r0j1K6l20L12J84r5k00J13K5l2n0p2
4635a43Q4J94Lq4n4O8k1q6N7p3K44l98J44K2NK9o4m2J55l6j9K0Q6j08Lr8MK69
4663A61j08j84k2L16q3l9n0jJ1k11L87l02M8J09j15J27j36N3J77L3j92j83J55
4686d9J50j55q3J73O8O3j01l3OQJ36j33J41j97j05J50k49Q4J23m0j1j97K11L1
4710iP7j79J52On7O9j09J96j67J88k01r9J58j13K01o9Q7k01J07p6P5P9k82M3J87
4735F3J2r1J13j55O1R8k22J85j22OL5K6J7l0L5O2P4j61j57O0j38K84Qj10j11R5
4761f3K47j15O1k15J73j86R5q3J92k7l9o9k24L31Jr8q5K63k27Nr7L41k22J51k55
$$ plain form
4786 -145 -64 -1 -27 -95 -45 -8 -57 6 -153 175 -10 68 143 -173 -47 -26 -137 162 239 79 65 -51 -197 -271 225
4811 225 39 -169 -235 15 201 -33 -6 -6 -51 -124 -77 -38 0 24 115 -142 -29 -43 61 250 20 53 -66 144
4835 144 100 -154 -144 -169 137 142 -77 -86 13 48 177 -126 2 -219 -38 198 -29 -42 -159 5 -64 96 -154 54
4859 54 -112 -105 -173 24 103 -45 26 12 -128 -140 -80 -37 59 29 211 -6 100 -122 56 100 -128 -24 -173 92
4883 92 -6 -97 107 -92 122 -56 115 1 -131 5 -86 76 -118 -71 -210 198 -121 107 -27 -145 21 -52
4905 -52 59 151 -52 127 -111 65 48 -224 -57 49 47 -11 -149 6 -77 -44 -111 102 -144 -28 82 50 -95
4928 -95 -90 -42 -96 49 -3 69 83 78 72 208 -96 -110 -77 -66 -72 -143 -75 -50 233 33 -37 -33 -7 8 152 -117 -14 0 119
4957 119 -30 28 15 -15 -185 -151 1 101 -22 -64 19 -109 -81 129 109 54 77 -155 21 57 68 -38 70 65 186
$$ packed form
4786a45Q1O3k6o8N0L7m9O3j59L28j85P8P5l16J26K1j11K99P7j60j4j16j46p4M96
4811B25j86k08o6K50J86k34K7%m5p3M7L9L8K4R1k57J13j4J04J89k30L3j19K10
4835A44m4k54J0k5L06Nk19rR9L5J29l03J28k21J81K36k27j3j17J64o9J60k50K08
4859E4j66Po8J97P9j48P1j4j40j2O0M3R6l0J82k17J06k22J78M4k28J04j49K65
4883I2r8r1K04j99K14j78J71j14j32J36r1J62j94M7j39M08l19K28j34j18J66p3
4905e2J11R2k03J79k38J76j7k72J67J06kn8j38J55q3L3o7K13k46J16J10l2j45
4928i5NM8n4J45n2P2J4noJ36l04j4L3J1op1O8K5K83k00p0MK6J5J44k69J03J4J19
4957A19j49N8j3l0j70L4J52J00j23m2Q3j28K8K10k0n5K3k32J76L6J1j06J08nJ21
$$ plain form
4982 186 196 181 56 -4 -31 -20 -119 231 64 -105 -65 -207 205 41 135 -34 27 93 235 -104 255 190 -66 -16
5006 -16 6 -146 11 72 158 14 150 94 -32 72 -66 150 -31 221 41 14 -110 5 -89 -62 122 -239 -57
5029 -57 -129 -22 154 74 38 33 38 52 91 -27 39 29 -8 33 -1 114 14 100 -40 64 -19 74 -41 -99 48 -94
5055 -94 -53 -81 -84 84 69 -31 -42 -13 44 -53 -101 95 110 -81 -59 -79 74 70 -257 100 -85 -4 -23 -22 -27 -64 280 -170
5083 -170 -36 -168 52 -57 7 301 165 157 -223 -57 163 70 69 -69 255 218 -202 -11 -72 -66 95 -2 -26 -239
5107 -239 -103 -43 -92 32 -99 126 166 17 148 143 57 71 -27 221 12 31 49 7 -76 26 -23 31 -28 -142 -110
5132 -110 -270 176 124 64 -154 111 -49 -2 61 -136 31 -273 207 68 -10 128 107 -65 -57 139 23 -37 -32 131
5156 131 167 119 65 203 17 -132 -133 -34 -167 -121 123 -113 -147 -196 -117 225 -211 131 73 79 -73 19 -139 -123 -12
$$ packed form
4982A86J0j5j25o0k7J1r9L50j67j69M0j42M12j64R4j69O1O6J42l39L59o5k56N0
5006a6K2j52J57O1Q6j44J36n6j26J04j38K16j81K52j80k7j24J15r4K7J84l61J82
5029e7p2J07J76q0l6nNJ4L9j18O6j0l7M1l4J15j00Q6j40J04q3R3j15n8J47j42
5055i4M1k8lJ68j5j00j1K9N7r7m8J96J5j91K2k0J53ml27L57j85Q1j9Jnl7L44m50
5083a70J34j32K20j09O4K94j36ql80J66K20r3jj38L24l7m20J91o1OJ61r7k4k13
5107b39J36O0m9J24j31K25M0j49J31nq6J4r8K48k09J9J8m2q3J02m9N4n9j14L2
5132a10j60M46n2o0k18K65j60M7O3j97J67l04M80j39p8J38k1j72QJ96j16o0NJ63
5156A31L6m8n4J38j86j49jR9j33M6K44k36l4m9P9L42m36L42n8Oj52R2j58J6J11
$$ plain form
5181 -12 -126 29 100 77 17 -87 -52 -194 77 41 -42 209 -40 44 -3 -81 -29 -143 -156 26 30 102 98 -48 -2 120
5207 120 224 -116 -143 -58 -14 10 73 16 15 -39 22 13 -12 -7 -57 42 13 105 -142 65 -133 132 -23 -71 3 142 18
5234 18 -181 -17 -55 -91 -217 105 133 60 74 71 32 114 1 28 25 -81 -36 -117 117 221 -105 -27 118 -25 -32 -81
5260 -81 68 -89 -72 189 -123 215 -158 -86 -15 -38 -66 -64 -307 101 -19 -68 43 17 175 290 -33 42 -64 -88
5284 -88 23 41 98 52 74 79 158 141 94 -123 49 95 8 -118 -62 -106 92 22 -37 -126 -19 128 70 28 -22 52 -10
5311 -10 -53 24 -78 -97 90 129 88 -22 -47 -239 -93 10 -115 -29 65 101 -112 92 49 -78 -81 110 -114 -41 51
5336 51 -44 94 -282 -68 96 73 -264 -222 50 10 128 -106 -19 69 -74 -275 1 -46 -3 -23 -39 -43 -74 45 7
5361 7 -9 -36 183 23 7 127 2 -83 51 -26 25 -29 -27 196 -22 95 -138 28 -103 52 -138 1 8 120
$$ packed form
5181a2j14J55P1k3o0j04L5j42K71l6q3K51k49Q4m7p8N2j14j3J82MP2mj46M6J22
5207A20J04l40k7Q5M4K4O3n7jn4O1rk5Nn0R9k9R2k47K07j98K65j55m8P4J39j24
5234A8j99J64l8l6j26L22K8p3J4ll9Q2j13K7lj06M5q1K34J04l26P8J45j43pm9
5260h1J49j57J7K61l12L38l73P2P1k3k8Kk43M08j20m9J11k6J58J15l23P5j06k4
5284h8J11J8N7m6K2NP9j7m7k17J72M6q7j26N6m4J98p0n9q9J07J47n8m2n0P4o2
5311a0m3P7j02j9J87L9m1j10k5j92J46J03j25Q6R4L6k13K04m3j27lJ91k24P3R2
5336E1r5J38l76K14J64k3l37M2K72m0J18k34Q7Q8j43k01K76m7M3k0j6ml1J19l8
5361Gj6k7K19j60j6J20j25q5J34p7N1n4KK23k18J17k33J66j31J55j90J39PJ12
$$ plain form
5385 120 127 -181 -44 -71 -66 -69 -144 227 -26 117 -50 11 14 44 24 -54 19 -24 83 33 108 48 -99 50 132 -62 125
5412 125 -45 81 43 97 30 -105 11 18 -54 -152 -23 180 176 -56 -189 111 -3 34 -49 58 -100 -39 113 -63
5436 -63 114 65 56 -188 -49 -89 -1 111 17 -40 2 48 82 -60 -56 42 -38 -77 -96 -141 -82 118 -196 -149 -16 -34 158
5463 158 -133 122 46 -113 67 -45 -53 56 12 91 185 18 51 -20 -44 17 -43 68 -86 -140 23 -138 12 -98
5487 -98 150 -72 6 -114 -81 -126 34 -3 -65 174 16 83 -10 28 -64 -81 -11 219 119 -126 -22 151 -93 -101 54
5512 54 218 -65 232 26 106 78 90 101 -33 -146 -77 42 -68 -67 22 -14 -107 -46 77 -94 -15 71 -126 -201 83
5537 83 227 9 209 -77 86 -221 -92 -219 17 71 41 27 117 -113 -31 115 -17 -87 28 97 -83 242 -27
5560 -27 1 -18 -123 42 -143 -145 -39 -38 71 91 -68 -68 -74 117 146 -13 71 160 116 91 -53 79 80 30 -29 -120 41
$$ packed form
5385A20Pl08J37k7Nlp5L71k53J43j67O1LL0k0p8P3m3J07n0P5o0j47J49Q2j94J87
5412A25j70J26l8N4o7j35J16Pp2r8J29K03mk32j33L00j14L7q3J07j58O1J52j76
5436f3J77m9rk44J39m0Q8J12r4n7M2M6L4j42MR8q0l9j9m5N9K00l14M7J33j8J92
5463A58k91K55p6j59J80j12qJ09m4P9R4j67L3p1k4O1o0J11j54n4J63j61J50j10
5487i8K48k22P8j20L3m5J60l7o2K39j58O7r3L8r2j7P0K30j00k45J04J73k44qJ55
5512E4J64k83K97k06Q0k8J2J1j34j13O9J19j10JQ9l6r3O1J23j71P9Q6j97p5K84
5537H3J44k18K00k86J63l07J29j27K36N4l0j4R0k30Q2J46j32p0J15O9j80L25k69
5560b7K8j9j05J65j85kJ06JJ09K0j59%oJ91K9j59Q4Q9m4k5j44J32Jn0n9r1J61
$$ plain form
5587 41 -123 -202 -48 -12 -171 2 -263 -80 -13 -99 149 -128 -42 -109 -2 -78 -14 -175 50 -16 15 91 -38 71
5611 71 -17 -237 -135 -14 108 -114 82 45 -10 87 -68 -213 -25 -31 25 -127 206 -63 -57 79 -91 18 -87
5634 -87 85 156 103 18 -4 106 42 -100 150 220 20 -49 -88 87 155 83 58 142 -35 -7 29 -23 67 59 161 -84
5660 -84 -90 -23 5 41 -113 257 -71 119 103 -7 261 -88 -79 125 90 121 -124 95 -195 49 12 101 -19 27 -31
5685 -31 222 159 145 -128 47 17 -76 253 155 350 -154 -107 -97 17 -53 -68 116 17 -123 -77 -76 -26 -25 -19 218 -104
5711 -104 -66 171 -82 252 -85 77 -75 -3 -87 2 61 -129 -232 -19 -104 -66 107 -163 96 20 58 -41 -14 105
5735 105 96 59 -56 -3 -33 196 -116 142 -45 -40 57 45 202 29 -119 151 105 -6 -209 -68 -41 47 39 70 80
5760 80 76 43 19 35 -42 -117 13 75 16 14 -107 -179 -5 -75 -87 134 -5 131 -112 28 -76 76 -95 -1 24 56
$$ packed form
5587D1j64p9J54L6j59J73k65J83O7q6K48k77Q6o7J07p6O4j61K25o6L1P6j29J09
5611G1q8k20J02J21J22k22J96l7n5R7j55j45J88oN6j52L33k69OJ36j70J09j05
5634h7J72P1n3q5k2J10o4j42K50P0k00o9l9J75O8p2k5Q4j77K8L6n2R0qJ02k45
5660h4oO7K8L6j54L70l28J90j6j10K68l49RK04l5L1k45K19k90K44l7Q9j20M6n8
5685c1K53o3j4k73J75l0r3L29r8J95n04M7J0J14p0j5J84r9j40M6JN0JOK37l22
5711a04L8K37k53L34l37J62j52P2q4Q9N9j90j03K13q5L8J73k70K59p6L8r9K7J19
5735A05rl7j15N3l0K29l12K58j87NR7j2J57j73j48K70m6j11k03J41K7Q8qL1J0
5760H0ml3k4J6p7p5J30O2n9kj21p2J74p0j2K21j39J36k43J40j04J52j71R4K5L2
$$ plain form
5786 56 65 -6 19 -178 -158 30 -110 -26 -43 -64 -88 100 -8 86 -162 69 -29 16 54 30 -238 -56 -231 70 74 32
5812 32 60 202 7 -25 -23 -34 37 -112 52 -76 -17 27 105 104 145 19 162 -150 48 -71 72 -88 -166 -113 120
5837 120 -10 32 -47 -24 118 -45 -29 87 173 -10 -144 33 100 -105 -17 93 160 -153 16 -23 45 -25 36 106
5861 106 64 -60 0 -142 -19 92 -105 57 54 -182 191 -7 173 -34 38 -39 -37 115 -131 100 -77 64 -209
5884 -209 22 162 -42 -176 -100 -25 -4 75 -190 -62 76 205 -65 -13 76 124 -5 -81 -66 35 137 2 -55
5907 -55 24 -13 -163 -121 -49 25 -22 3 -90 -110 -67 -29 -49 -185 -53 -15 -89 91 67 53 137 -7 30 -81 -12 152 -107
5934 -107 -72 -98 39 -46 117 156 33 -61 12 -16 29 -7 -36 7 19 13 -33 -74 4 131 -133 101 10 -107 -165 -89 -31
5961 -31 -27 98 -137 63 93 -117 58 54 -110 -178 68 -134 85 104 13 -142 117 -9 -12 -5 61 -16 -15 -101 299 40
$$ packed form
5786E6Rp1K5j97K0J88j40Q4j7k1k4J88j08R4k48K31r8M5L8k4k68J82j75L01Mm2
5812C2K8J42j95l2Kj1P1j49J64j28N9M4P8jM1j26J43l12J98j19J43j60p8N3K33
5837A20j30M2p9K3J42j63J6J16Q6j83j34J77O7k05Q8J10O7l13J69l9O8p0O1P0
5861A06m2j24O0j42J23J11j97J62lk36L73j98J80k07P2p7KJ52k46K31j77J41k73
5884b09K31J40k04j34P6P5K1P9k65J28J38J29k70N2Q9M8j29p6J5J01J02j35n7
5907e5P9l7j50M2P2P4m7K5r3k0M3L8k0j36J32L8p4J80k4j4Q4j44L7j11O9J64k59
5934a07L5k6J37q5J63L9j23r4P3k8M5l6k9M3J2om6m1P8J27k64K34r1j17n8P6N8
5961c1MJ25k35K00L0k10J75mj64o8K46k02K19J9r1j55K59j26lPO6p7Jq6M00k59
$$ plain form
5987 40 36 101 180 137 -135 -3 -146 29 -107 183 -147 -63 -96 -24 112 39 -58 -48 -59 205 -151 25 -9 5 121
6012 121 -83 130 52 -196 70 32 -205 20 110 23 -8 -17 -173 44 115 -139 177 -46 -3 -160 -156 51 -96 49
6036 49 -166 108 -59 -1 -226 -120 -139 31 -6 -94 24 -201 -60 198 -51 -25 -38 -125 7 37 -102 -60 -63 -113
6060 -113 15 -60 157 -12 -56 -54 33 93 -68 15 -10 57 82 166 17 -156 -74 106 89 -49 -66 -35 37 -51 -197 -54
6086 -54 21 41 18 6 45 106 29 99 -59 131 -83 -124 181 -48 -6 75 62 42 -20 -68 59 -69 103 -178 -98 7
6112 7 52 -51 145 -52 131 -52 101 -39 4 -155 261 -208 -202 131 -132 71 28 117 257 139 -197 49 35
6135 35 -28 96 95 131 -103 -65 -92 46 48 57 -141 46 62 -11 4 54 53 -26 -20 -5 43 -42 -62 17 -81 -5 96 -195 7
6164 7 -193 16 -77 -154 -111 -106 102 58 -128 -74 -19 -110 37 -96 -120 -37 1 27 24 0 187 -148 3 69 19 33 -38
$$ packed form
5987D0mO5P9m3k72J32j43J75j36K90l30Q4l3P2J36p3r7J0j1K64l56J76l4J4J16
6012A21k04K13p8k48K66l8k37K25R0q7l1rj56K17P1k54L16k23M3j57MK07j47J45
6036D9k15K74j67N8k25J06j9J70l7q8J18k25J41K58k49K6j3q7J32L0j39M2ln0
6060a13J28p5K17j69m4KQ7O0j61Q3k5O7K5Q4j49j73Q2J80j7j38j7L1P2q8j46J43
6086e4P5K0k3j2L9O1p7P0j58J90k14m1L05k29M2Q1j3k0o2m8J27j28J72k81Q0J05
6112GM5j03J96j97J83j83J53j40M3j59M16m69OL33k63K03m3Q9J40j18l36K46j4
6135C5o3J24jL6k34L8k7J38KRj98J87J6p3J5N0jp9OJ5M8q5k0P9r8P6J01k91K02
6164Gk00K09r3p7M3NK08m4j86N4N5r1J47j33k4Q3L8K6lk4J87l35J51O6n0J4p1
$$ plain form
6191 -38 -122 -24 51 215 -3 -63 152 -74 -186 16 120 -36 140 -141 123 -79 24 -123 -289 163 -39 109
6213 109 -25 -192 -4 27 7 26 -5 -110 -71 39 10 23 9 -61 -7 28 -106 78 -19 -19 -44 55 262 117 -53
6238 -53 47 -156 22 -55 -140 183 -25 -130 207 78 -40 139 -104 -260 17 120 172 -1 -88 48 -91 105
$$ packed form
6191c8q4R8P5J64k18o0K15k26j12K02J04j56J76k81K64k02J03j47j66M52k02J48
6213A09j34j67J88L1k0J9l1j05L9J10k9J3j4p0N4L5j34J84r7%k5R9K07j45j70
6238e3J00k03J78p7q5L23k08j05L37j29j18J79k43j56K77J03N2j73q7J36j39J96
$$ [...]
8191E4
##END NTUPLES=NMR FID
##END=
