##TITLE=1H_DE-129_TFA
 200.13MHz,DMSO-d6.
 8 sc
 
 25.2.2026
##JCAMPDX= 6.0         $$ Bruker NMR JCAMP-DX V2.0
##DATA TYPE= NMR FID
##DATA CLASS= NTUPLES
##ORIGIN= UXNMR, Bruker Analytische Messtechnik GmbH
##OWNER= pz
$$ XWIN-NMR		Version 3.5
$$ Wed Feb 25 14:08:30 2026 Russian Standard Time (UT+4h)  she@DPX200
##.OBSERVE FREQUENCY= 200.1313
##.OBSERVE NUCLEUS= ^1H
##.DELAY= (6, 6)
##.ACQUISITION MODE= SIMULTANEOUS
##.ACQUISITION SCHEME= undefined
##.AVERAGES= 8
##.DIGITISER RES= 18
##SPECTROMETER/DATA SYSTEM= spect
##.PULSE SEQUENCE= zg30
##.SOLVENT NAME= D2O
##.SHIFT REFERENCE= (INTERNAL, D2O, 0, 14.3821)
##AUDIT TRAIL= $$ (NUMBER, WHEN, WHO, WHERE, WHAT)
$$ ##TITLE= Audit trail, XWIN-NMR		Version 3.5
$$ ##JCAMPDX= 5.01
$$ ##ORIGIN= Bruker BioSpin GmbH
$$ ##OWNER= she
$$ F:/spectra/data/she/nmr/H-C/1/audita.txt
$$ ##AUDIT TRAIL=  $$ (NUMBER, WHEN, WHO, WHERE, WHAT)
(   1,<2026-02-25 14:06:42.92 +0400>,<she>,<DPX200>,
      <created by zg, POWCHK disabled, PULCHK disabled
       configuration hash MD5:
       00 E9 B6 7A A2 85 ED C7 34 08 36 98 17 FE 4E 26
       data hash MD5: 16K
       04 5E 5E 37 57 43 AA 4A 1C 40 36 65 42 E3 3B 1E>)
$$ ##END=
$$ 
$$ hash MD5
$$ F4 5A B9 1A 76 03 C0 57 51 E8 0F FA EF 54 DF 91
##$RELAX= 
##$RELAX= 
##$RELAX= 
##$RELAX= 
##$RELAX= 
##$RELAX= 
$$ Bruker specific parameters
$$ --------------------------
##$DU= <F:/spectra>
##$EXPNO= 1
##$NAME= <H-C>
##$PROCNO= 1
##$TYPE= <nmr>
##$USER= <she>
##$AMP= (0..31)
100 100 100 100 100 100 100 100 100 100 100 100 100 100 100 100 100 100 
100 100 100 100 100 100 100 100 100 100 100 100 100 100 
##$AQSEQ= 0
##$AQ_mod= 1
##$AUNM= <au_zg>
##$AUTOPOS= <>
##$BF1= 200.13
##$BF2= 200.13
##$BF3= 200.13
##$BF4= 200.13
##$BF5= 200.13
##$BF6= 200.13
##$BF7= 200.13
##$BF8= 200.13
##$BYTORDA= 1
##$CFDGTYP= 0
##$CFRGTYP= 5
##$CHEMSTR= <none>
##$CNST= (0..31)
1 1 145 1 1 1 1 1 1 1 1 1 1 1 1 1 1 1 1 1 1 1 1 1 1 1 1 1 1 1 1 1 
##$CPDPRG= <>
##$CPDPRG1= <>
##$CPDPRG2= <>
##$CPDPRG3= <>
##$CPDPRG4= <mlev>
##$CPDPRG5= <mlev>
##$CPDPRG6= <mlev>
##$CPDPRG7= <mlev>
##$CPDPRG8= <mlev>
##$CPDPRGB= <>
##$CPDPRGT= <>
##$D= (0..31)
0 0.7 0 0 0 0 0 0 0 0 0 0.03 0 0 0 0 0 0 0 0 0 0 0 0 0 0 0 0 0 0 0 0 
##$DATE= 1772014002
##$DBL= (0..7)
120 120 120 120 120 120 120 120 
##$DBP= (0..7)
150 150 150 150 150 150 150 150 
##$DBP07= 0
##$DBPNAM0= <>
##$DBPNAM1= <>
##$DBPNAM2= <>
##$DBPNAM3= <>
##$DBPNAM4= <>
##$DBPNAM5= <>
##$DBPNAM6= <>
##$DBPNAM7= <>
##$DBPOAL= (0..7)
0.5 0.5 0.5 0.5 0.5 0.5 0.5 0.5 
##$DBPOFFS= (0..7)
0 0 0 0 0 0 0 0 
##$DE= 6
##$DECBNUC= <off>
##$DECIM= 32
##$DECNUC= <off>
##$DECSTAT= 4
##$DIGMOD= 1
##$DIGTYP= 9
##$DL= (0..7)
0 120 120 120 120 120 120 120 
##$DP= (0..7)
150 150 150 150 150 150 150 150 
##$DP07= 0
##$DPNAME0= <>
##$DPNAME1= <>
##$DPNAME2= <>
##$DPNAME3= <>
##$DPNAME4= <>
##$DPNAME5= <>
##$DPNAME6= <>
##$DPNAME7= <>
##$DPOAL= (0..7)
0.5 0.5 0.5 0.5 0.5 0.5 0.5 0.5 
##$DPOFFS= (0..7)
0 0 0 0 0 0 0 0 
##$DQDMODE= 0
##$DR= 18
##$DS= 0
##$DSLIST= <SSSSSSSSSSSSSSS>
$$ [...]
##$SUBNAM0= <"">
##$SUBNAM1= <"">
##$SUBNAM2= <"">
##$SUBNAM3= <"">
##$SUBNAM4= <"">
##$SUBNAM5= <"">
##$SUBNAM6= <"">
##$SUBNAM7= <"">
##$SUBNAM8= <"">
##$SUBNAM9= <"">
##$SW= 18.0517328524113
##$SWIBOX= (0..15)
0 0 2 0 0 0 0 0 0 0 0 0 0 0 0 0 
##$SW_h= 3612.71676300578
##$TD= 16384
##$TD0= 1
##$TE= 0
##$TE2= 300
##$TE3= 300
##$TEG= 300
##$TL= (0..7)
0 120 120 120 120 120 120 120 
##$TP= (0..7)
150 150 150 150 150 150 150 150 
##$TP07= 0
##$TPNAME0= <>
##$TPNAME1= <>
##$TPNAME2= <>
##$TPNAME3= <>
##$TPNAME4= <>
##$TPNAME5= <>
##$TPNAME6= <>
##$TPNAME7= <>
##$TPOAL= (0..7)
0.5 0.5 0.5 0.5 0.5 0.5 0.5 0.5 
##$TPOFFS= (0..7)
0 0 0 0 0 0 0 0 
##$TUNHIN= 0
##$TUNHOUT= 0
##$TUNXOUT= 0
##$USERA1= <user>
##$USERA2= <user>
##$USERA3= <user>
##$USERA4= <user>
##$USERA5= <user>
##$V9= 5
##$VALIST= <valist>
##$VCLIST= <CCCCCCCCCCCCCCC>
##$VD= 0
##$VDLIST= <DDDDDDDDDDDDDDD>
##$VPLIST= <PPPPPPPPPPPPPPP>
##$VTLIST= <TTTTTTTTTTTTTTT>
##$WBST= 1024
##$WBSW= 4
##$XGAIN= (0..3)
0 0 0 0 
##$XL= 0
##$YL= 0
##$YMAX_a= 155475
##$YMIN_a= -200761
##$ZGOPTNS= <>
##$ZL1= 120
##$ZL2= 120
##$ZL3= 120
##$ZL4= 120
##$ABSF1= 10
##$ABSF2= 0
##$ABSG= 5
##$ABSL= 3
##$ALPHA= 0
##$AQORDER= 0
##$ASSFAC= 0
##$ASSFACI= 0
##$ASSFACX= 0
##$ASSWID= 0
##$AUNMP= <proc_1d>
##$AZFE= 0.1
##$AZFW= 0.1
##$BCFW= 1
##$BC_mod= 2
##$BYTORDP= 1
##$COROFFS= 0
##$CY= -3
##$DATMOD= 1
##$DC= 2
##$DFILT= <>
##$DTYPP= 0
##$F1P= 0
##$F2P= 0
##$FCOR= 0.5
##$FTSIZE= 0
##$FT_mod= 4
##$GAMMA= 1
##$GB= 0.15
##$INTBC= 1
##$INTSCL= 1
##$ISEN= 128
##$LB= 0.25
##$LEV0= 0
##$LPBIN= 0
##$MAXI= 10000
##$MC2= 0
##$MEAN= 0
##$ME_mod= 0
##$MI= 1.114404
##$NCOEF= 0
##$NC_proc= 0
##$NLEV= 6
##$NOISF1= 3.799351
##$NOISF2= 2.8
##$NSP= 1
##$NTH_PI= 0
##$NZP= 0
##$OFFSET= 14.38212
##$PC= 1
##$PHC0= -3706.846
##$PHC1= 12.59232
##$PH_mod= 1
##$PKNL= yes
##$PPARMOD= 0
##$PSCAL= 0
##$PSIGN= 0
##$REVERSE= no
##$SF= 200.129724274929
##$SI= 16384
##$SIGF1= 3
##$SIGF2= 2
##$SINO= 400
##$SIOLD= 16384
##$SREGLST= <1H.CDCl3>
##$SSB= 0
##$STSI= 0
##$STSR= 0
##$SW_p= 3205.1282051282
##$SYMM= 0
##$S_DEV= 0
##$TDeff= 0
##$TDoff= 0
##$TI= <>
##$TILT= no
##$TM1= 0
##$TM2= 0
##$TOPLEV= 0
##$USERP1= <user>
##$USERP2= <user>
##$USERP3= <user>
##$USERP4= <user>
##$USERP5= <user>
##$WDW= 1
##$XDIM= 8192
##$YMAX_p= 0
##$YMIN_p= 0
$$ End of Bruker specific parameters
$$ ---------------------------------
##NTUPLES= NMR FID
##VAR_NAME=  TIME,          FID/REAL,        FID/IMAG
##SYMBOL=    X,             R,               I
##VAR_TYPE=  INDEPENDENT,   DEPENDENT,       DEPENDENT
##VAR_FORM=  AFFN,          ASDF,            ASDF
##VAR_DIM=   8192,          8192,            8192
##UNITS=     SECONDS,       ARBITRARY UNITS, ARBITRARY UNITS
##FACTOR=    0.0002768,     1,               1
##FIRST=     0,             0,               0
##LAST=      2.2672688,     0,               0
##MIN=       0,             -200761,         0
##MAX=       2.2672688,     155475,          0
$$ Real data points
##PAGE= N=1
##DATA TABLE= (X++(R..R)), XYDATA
0@%%%%%%%%%%%%%%%%%%%%%jQj5J6j6J6j6J7k2K8l1L3l8M4m8N4o1O9p7Q4r3J03
43E4j15J28j40J54j70J88k08K28k51K76l05L38l73M15m63N20n87O68p69Q98j072
64e86J313j674K261l384O242k5825l6707J15760Q6879k0712j3760K4342J3871
77A48020P455k2275m9661k0067M504l8732n6893k4786j0894j0076p393l3336j3516
90a27650N0212K8014l3063L220N2050L1746O610N55L980L2660L4242j4213k5552
103D2811J4981J7122j9766k3695q957o435k822j7663l3970K366K4192j6710l0561
116e9107O975K4257R465q505j1812J2823L0963M671j9203O265K8980P652r978
129B3446j051N525P158R32j9675j3757J2992M679k2128j7220L995J3470o03k2802
$$ y = [0, 0, 0, 0, 0, 0, 0, 0, 0, 0, 0, 0, 0, 0, 0, 0, 0, 0, 0, 0, 0, 0, -1, 7, -8, 8, -8, 8, -8, 9, -13, 15, -16, 17, -21, 23, -25, 29, -32, 37, -40, 44, -49, 54, -61, 67, -73, 81, -89, 99, -109, 119, -132, 144, -161, 177, -196, 219, -244, 276, -311, 357, -412, 486, -586, 727, -947, 1314, -2070, 4172, -21653, -58360, 57400, 144279, 123567, 109807, 134149, 148020, 155475, 133200, 83539, 63472, 67976, 29244, -27649, -52435, -63329, -73405, -80798, -114134, -127650, -77438, -49424, -82487, -79267, -27217, 4529, 11139, 11694, 15674, 48334, 82576, 68363, 42811, 57792, 74914, 55148, 31453, 22496, 16061, 13239, -4424, -38394, -36028, -11836, -28546, -59107, -52132, -27875, -18410, -26915, -38727, -25904, 5059, 9730, -9473, -3208, 25772, 33424, 23446, 22395, 27920, 35078, 36010, 16335, 2578, 15570, 20249, -1879, -19099, -15104, -1634, -2237, -25039]
143b5039j5239J7976K0846j3353k0300J2466K5800L750r905k321J4279J8581m408
156B3133j8030M195J8395j191j8006j1319M910J1620n750k3300r129K0248J1248
169G024k0642j6486J3738J7449j927j2478k636J6365J4894p915j1060P519J3547
182A7392p84j3431o760P823R766o228j6583j605J7590L489j8113q692J2127J1131
196G122o359j3294K140J4601L097j0846o073Q687R170l977r852Q47Q923M288p423
211A051r781N420J3241k067j3489q96J3139O949j1778j0685O580J0786m214j2711
225h455k094J1811N040r728o220O193P289j069p150m474Q872Q425m200r884K464
240c180J2883J963j2232n278Q503P273n960j1810N50J1528K66j0720l707P128
$$ y = [-25039, -40278, -22302, -1456, -14809, -35109, -22643, 3157, 6907, -2998, -5319, 8960, 27541, 23133, 5103, 9298, 27693, 26502, 8496, -2823, 2087, 13707, 7957, -15343, -24472, -4224, 7024, -13618, -30104, -16366, 1083, -844, -13322, -15958, 407, 15301, 7386, -3674, 3845, 17392, 16608, 3177, -3583, 4240, 14006, 7778, -8805, -10410, 7180, 10669, -7444, -16136, -4009, 7122, 763, -12531, -10391, 4210, 7307, -3539, -9612, -925, 8245, 4268, -5584, -4737, 4186, 8474, 1051, -8730, -3310, 9931, 7864, -5625, -6521, 6618, 13567, 1789, -8896, -2316, 8470, 4256, -8455, -10549, 1262, 6302, -3426, -9646, -3453, 3836, 2767, -4383, -8857, 15, 8440, 4240, -5644, -3180, 9703, 11666, -566, -5844, 2659, 9932, 3972, -7838, -7288, 4240, 4506, -6214, -9921, -2793]
254b793O856k810p035j01Q449M765o823p702N125J0223k134r082j297Q525O209
269A0375q499j0120N419R110m564r110M63P837L840m831n046K843O606Q19p069
284a927l637O310N207l525o661o63P879M021q743n854P688O989m881p918K020
299c695P810L89o495k762M540N815j952o401K65N276J391m841n545J910P513q79
315B339p593J86P082L934n554n203M230N774j844n870k05N681K237m433l625J785
331a079L028L44m172l202L132M521k171n377L02O488K291n578k795O040M944l179
347C537n565Q57N299n90n477j810L265K871j220m171k94L486J589k539l903K034
363b631N364K07m882n30N031K806m170m252L135L995j657m807j68L303J168l186
$$ y = [-2793, 4063, 1253, -5782, -5883, 2566, 7331, 508, -7194, -2069, 8154, 6020, -3062, -4359, 4166, 10375, 1876, -8244, -2825, 6285, 1721, -7389, -6926, 911, 4751, -80, -5126, -2283, 4323, 5142, -1927, -5564, 746, 5953, 2428, -4233, -4896, 2983, 7004, -1739, -7593, 95, 7084, 2203, -5715, -3695, 4115, 4504, -1991, -4753, -213, 5602, 3650, -2751, -2486, 2790, 4181, -660, -6205, -4295, 3218, 2339, -5254, -5068, 2014, 5948, 394, -4809, -579, 5195, 3351, -2519, -2724, 2957, 5194, 761, -2864, -1079, 1949, 2293, -1879, -5081, -1949, 2572, 401, -4976, -4674, 1814, 4105, -1473, -4268, 1772, 6716, 3537, -2028, -1171, 4128, 3538, -1939, -3749, -484, 2387, 1167, -3004, -3298, 188, 1777, -762, -4665, -2631, 2733, 2940, -1942, -2472, 2559, 5365, 1195, -3057, 78, 4073, 2416, -2391, -2559, 744, 1912, -1274]
379a274j994J204K382R54k408j779K695L726j535l717m12M179J756m093l143L961
395E02L513k658l813K69L727l20l827k68J942K046k7k471K30K295R99j391k022
412a274Q41K968l13l298p20K428J419k514k578J825L130j391k203P08J574R86
428A588j898j403J211J463M30r87j297R61K012j274k711j95K730Q10l045j054
444b659L216K268k308j905P14K981l04k838j97J628R34p77j530m83J246P42j148
461d20j699L98K981N2k721r6K190J304j641j632J742K185j184j765m07J117O07
478A011j706p16l2R35P80k42j657N12J966k03j805k47K032J519j702r94K044R20
496B415j384j788J1J524m60j456R5O02l78M27l40k54L66L65Q13l16m60J167K25
$$ y = [-1274, -3268, -2064, 318, 1272, -1136, -2915, -220, 3506, 1971, -1746, -2158, 2021, 3777, -316, -3459, 502, 4015, 1357, -2456, -2187, 1540, 1220, -2607, -2875, -933, 1113, 1086, -1385, -1155, 1140, 2139, 748, -1274, -433, 2535, 2222, -1076, -1796, 632, 2051, -463, -3041, -1216, 1914, 523, -1680, -972, 602, 1588, -310, -1713, -502, 961, 1391, 404, -893, 68, 2080, 806, -1905, -2100, 630, 1440, -1605, -2659, 557, 2825, 517, -1388, -674, 2307, 2003, -835, -1032, 596, 1530, 753, -777, -1260, -14, 728, -420, -2119, -1721, 1260, 1312, -1409, -1505, 685, 1989, 348, -1284, 458, 2643, 1459, -306, -713, 404, 1011, -695, -1411, -1443, -508, 272, 30, -1627, -1115, 851, 648, -1157, -1404, 628, 2147, 445, -549, 1495, 2415, 1031, -757, -746, 778, 318, -1138, -1043, -441, -819, -392, -732, -986, -620, -255, 558, 242, -218, 949, 1174]
515A174r84J03M22N75o12j096O87J264j655j073K32L23l77k9j70O19L75N80Q9
534D47l32J46O05k48o50J02N46P60j708o26K025M03j708j202R50R12l69q39l84
553a170J114L01k41n84O22M35j80L58n99l76R61L54j698r4J439J19j153l14P89
572H3O24P5j041m89O59J18p10J11L83o6L98P87j136o77J156J01p75L70K68K95
592E34k98m70L28P71m65r13L11P71m03o41O32n13n09O39K27n11k54O28N96J58
612F18k69j62Q9j24K86l6L36n69o25O29K03p99j56N85q32K15J78k12K11K05j66
633c95M61M59p80K52N02l69J98N19J61j053l06P07k08r51nO98J83Kn64M49m1j29
655b10l94Q48j94r8O00J81j79m19K48O57j412J45M04n0j03n68J86N34j02r18Q25
$$ y = [1174, 190, 293, 715, 1290, 678, -418, 269, 1533, -122, -1195, -963, -640, -1017, -1046, -1216, -597, -222, 358, 447, 115, 261, 866, 618, -32, 70, 616, 1376, -332, -958, 1067, 1470, -238, -1440, -490, 422, 53, -786, -1170, -56, 245, 4, -580, 42, 477, 297, 655, 56, -320, 641, 995, -703, -797, 642, 761, -392, -706, 83, 707, 782, -259, -748, -89, 29, -681, -570, -187, -253, 145, 932, -204, -881, 275, 376, -399, -29, 239, 534, 236, -234, 94, 865, 400, -513, -202, 569, 166, -475, 157, -356, -865, -226, 1, -510, -764, -136, 460, 618, 349, 187, 276, 152, 438, 402, 738, 169, -456, 173, 376, -423, -579, 6, -826, -611, -433, -645, -434, -229, -395, 66, 525, -255, -3, 499, 130, 328, 847, 1008, -45, -351, 356, 148, -803, -808, -110, 73, 75, -489, -40, -81, -210, -604, 244, 50, -48, 552, 733, 554, 135, 383, 1040, -372, -227, 177, 127, 24, -544, -358, 176, 74, -844, -19]
676a9P4m91O36J73k71o8L8L64l37n21N72R2k59n3J24M10n31n72L96O06p94J30
698c01K55N13m72P6K95L3q19K80J29K25k70j11K41l2m34J0M34k85j14M93j37O3
720G2m02N36L32m61l12K89L33l67J64k54mm79K11L15k66O4J32K24jj58K34J5j69
743D8m56L49M52l52r5O46m63N9l35K11k36o24N51K3J92k41N03J3r5k90J54L58
765C72k98l83O09J30k29l24J71J95n92J04k8K85m34K47J05J22L7j19K28R2k64
786B6L97K87n48M4Q4j31k46j01K01R8l69o1O37k93l1j18k00N30k93K31P4j12l3
809G3J37N5k51k45K53j4j80j28K8M42l81m0J43J10j16M6J79q7l29L91J92j12l35
832a69L56p2k93J55K41l2k54R7Pl23K50K5k7r5N6J7K19k0j87j3k19M96k49Q1J57
$$ y = [-19, 55, -436, 200, 373, 102, 34, 72, 436, 99, -422, 150, 242, -17, -70, 54, 464, -67, -639, -243, 363, -431, -301, -46, 467, -5, 71, 366, 399, -420, -140, -11, 214, -56, -167, 74, 42, -392, -382, 52, -233, -347, 146, 9, 72, -330, 206, 538, 77, -235, 54, 387, 20, 184, -70, -74, -553, -342, -27, -293, -229, -97, 127, 126, -32, 202, 217, 48, -408, -59, 393, 41, -54, 592, 129, 188, -147, 64, -172, -796, -245, -222, -30, -271, 232, 245, 150, -140, 14, 372, 74, -309, 300, 430, 201, -123, 48, 243, -349, -245, -273, 12, -422, -175, -70, 52, 89, -30, 198, 290, 26, 423, 710, 162, 206, 290, 159, -87, -188, 13, 111, -258, -319, 318, 25, -6, -124, -324, 206, -87, 144, 218, 106, 73, 210, 265, 14, -231, 22, 8, -172, -300, -272, 170, -211, -251, -108, 2, -114, -68, 111, 24, -305, 86, 278, 166, -169, 187, 115, -178, -23, 218, 186, -68, 29, 36, -287, -37, -12, -39, -134, -78, -61, 158, 138, -49, -62, -281, 215, -34, 47, 204]
857B04l16j15K65j58J63k85J41M19l93j35N06m67M4J38n7J87l12k87M48R3j4k11
879a42K57j04j83j21J51J77J72n0J65l40j97M23k81J70mk4J13j33k5J69k12l51
901c70K50J51l7J38J7j13J62k91M43k1l29k11L19M72m35p41P35J39m70k44K74
922a62K69l77J37J31l1J37M9m7L7r3K26j27m91K03L03K4k89n3JQ4L2l4R4L6k17
947a58j27N49l07J30p9r9k02L94k34M26j77k66k1J44K8j62L81R2m79J70K46jk22
970B6m58N75l3O1j24J09O1m15K90j66K52m85L72Rl27L09n9N2j56k9O3J64L4m8
994G7k39K74J76m56K34j53K60j08k39M04m20R6J89q5K5J2P3o0j24L53l44N2j11
1017a14K97Q4k58o6j2L35k55k06M44j85l50L1K45J55j77k6Q4R8l17K09K29n56
$$ y = [204, -112, -227, 38, -120, 43, -242, -101, 318, -75, -210, 296, -171, -127, 11, -46, 141, -171, -458, -10, 83, 69, -142, 115, 11, -172, -293, -142, 35, 207, 157, 322, -18, -215, 208, -73, 97, 93, 69, 182, 49, 24, 193, -19, -370, -120, 31, -6, 132, 149, 36, 198, -93, 350, 329, 0, -211, 108, 580, 145, -596, 139, 278, -192, -436, -162, 107, -270, -133, -2, -33, 104, 153, 106, 143, 50, 276, 149, -342, -139, 164, 188, -101, -154, -153, -69, -37, -71, 23, 59, -158, -285, 264, -43, 87, 8, -91, -293, 101, -133, 293, 116, -150, -171, -27, 1, -161, 220, 312, -167, 3, 249, 248, 26, -432, 143, 110, 171, 47, 156, 217, -198, 92, -74, 178, -307, 65, 74, -253, 56, -3, 49, -107, -136, -73, 91, 125, 77, -162, 112, 288, -168, 66, -87, 173, 65, -174, 230, -190, -94, 95, 10, 35, 47, 120, 60, -64, 289, -55, -3, -114, 183, 267, 9, -57, -69, 266, 11, -195, 249, 64, -286, -255, -10, 145, -32, -58, 26, 124, -193, 16, 245, -311]
1039c11M26k33J78k61L60j71K64m28L57k1q7J62l44N15k25O5j42P1j70J11j01
1060A5l7o0j22J75O6j90j36K07R5R3J33n34nL41m5LJ73k16k5o0K29J42q6r8K1
1085G9O5l88L12j80j6O6J46R6k99L36j7l83j3L33j39KK59k77o9k30K62R7p4J49
1109A17P8k24J32k73J61J12NQ0k82J89j41p0L0L84K5k63J72q2l55J13K47L8k7
1132A66k88j82N3K51K40j33k26r8L83L9K1l65K04qJ0k39J93J87j32k73L99j74
1154B8O6k35L37k36j79L44j79j3K02j24K15m78L83j50L0L31l83K32k64l34L9J64
1176b04r9n8L19K94k36j79L22J42l05p7J42j7j13l3K15k46O7m8J0P5k67J64P5
1199e7J25N5O2j00j16j03K14j16j43J91N3j56M42m59J36k27L51j87j24R6ML9j37
$$ y = [-311, 115, -118, 60, -201, 159, -12, 252, -176, 181, 160, 73, 235, -109, 406, 181, 246, 104, 175, 5, 116, 15, -22, -82, -204, -29, 37, -153, -289, -82, 13, 106, 239, -295, -300, 41, -4, -1, 172, -44, -69, -129, 100, 242, 156, 58, 79, 144, -244, 68, -112, -128, -62, 84, 180, -119, 217, 200, -183, -196, 137, -2, 0, 259, -18, -87, -317, -55, 42, -32, 117, 195, -29, 103, -170, -9, 103, 108, 188, -94, 95, -46, -116, -86, 298, 323, 60, 232, 150, -205, -92, 155, 193, 166, -122, -304, -251, 0, 240, 107, -119, -217, 166, 205, 226, -139, 65, 57, 67, -172, 21, 208, 76, -197, 202, 28, 94, -141, 196, -40, -219, 125, -54, -67, 135, 11, 226, -252, 131, -19, 11, 342, -41, 191, -73, -407, -368, -204, -303, -361, -42, 252, 16, -163, 159, 301, -4, -81, 61, 44, -69, -102, 113, -133, -66, -114, -104, -29, -296, -132, -57, 68, 123, 185, 85, -31, -134, 80, -36, -179, 12, 65, -91, 351, -108, 28, -199, 152, -35, -159, -63, -59, -20, -157]
1222a57K50J75m03K84O2k92L9K38k11n3L1Q3J61j03J0j99K42k09kj04K40k66J63
1245b1r4j08M17p6M3k20j06Q7j69K54J22k55p8J37L36l29K35l57L67K8K0k08K37
1268B62k49J30k75P9l6J33k03J19K73l38Q8j25J40j15K94l3k81K82J31k47j20
1289i1J92q1j50J42k2J79k23J64Q3k50k78K55K1J45n1o1m6J15K62o3j13l44J96
1312a9J5J15l59J65P2J5PJ13L9l45M8J24J09j28Rm0K50M1J73o27K91J45j7k88
1336i2K05M1k16j54K04J84j19j36k72M86J6j53P9j69Q4J98j78J4rK63l05J3j6
1359c2N0j36J74J04k4j27mJ03k76J58j68P7L34l34K16j33m6o3n7P8O5J66Q3n03
1383b95K40r2K10O2r7j03J55n6j34J01j78K24m13L36K47q8p3k19K05j22P0O8%
$$ y = [-157, 93, 268, -135, 149, 211, -81, -42, 196, -15, -68, -37, 46, 207, 104, 114, -85, 157, -52, -54, -158, 82, -184, -21, -115, -223, 194, 118, 161, -59, -165, -78, -247, 7, 129, -126, -204, -67, 269, -60, 175, -182, 185, 213, 233, 25, 262, 13, 143, -132, -53, -89, 44, -159, -40, 233, -105, -17, -142, -2, -117, 177, 144, -137, 145, 276, 29, -91, 101, 20, -130, 12, -10, 169, -54, 110, 193, -57, -335, -80, -59, 86, 35, -26, -72, 43, 305, 242, 129, -215, -19, -4, 111, -248, -83, -11, 4, 11, 124, 163, -182, -134, -10, 99, -29, -20, -60, 190, 231, 404, -223, 68, 213, 196, -92, 113, 154, -62, -216, -12, 172, 53, -83, -355, 131, 147, -6, 73, -96, -12, 186, 8, 22, 13, 276, -29, -16, -32, 18, -118, 56, 160, 136, 9, 5, 108, -168, -10, -178, -101, 233, -101, 115, -18, -64, -127, -184, -106, -41, 125, 208, -295, -55, -147, 63, 125, 28, -75, 80, 24, -110, -9, -187, 37, -376, -40, 207, 119, 46, -173, 32, -90, -20, 48, 48]
1406D8R6m17N34n27J21J71k40J48O9J41J96l63n3J65R3j02j15k31N54j09P4m35
1428a82K61kj72K40j96J16k43J71j91L37j93K29jj30j93KJ32N3j7l2N4j76j8R0
1452f1M8j48K40m9P0n6mRQ9j17J1k8K75m84K85p2j44J73L0p1O2o5j89K27o1K67
1478B37k73O6P8r1K47k27J32j05j8k30J47P0k51L03j73J23k25K9K11j75J62R3
1500A30P5J1j55L2mp3J10j29K61l77L38k67J5P5J61O5m18N9J25j27k40M78k16
1523g1L11j97n1O5O7l49L64k10j59L67r1K4k1k92J95J30k31n9J58J15p2k3K06
1546A76K7k10J94l16K23o5N9J59l50J99O0k17J73N7l93NJ70J35j96k05K33J53
1568G1r3qJ8J34k7j17K05L8l35J83o5j72J4M65l77J8R3l8j16Q5J53k01J95k15
$$ y = [48, 144, -273, 261, -266, -145, 26, -214, -66, 3, 144, 340, -23, -76, 89, 182, 80, -35, -266, 288, 179, 253, -182, 79, 77, -95, 145, -51, 65, -178, -7, -198, 139, -54, 175, 174, 44, -149, -147, -15, 38, 21, -11, 43, -133, -151, -61, -13, -161, 79, 30, 100, 44, 40, 49, 138, 21, 32, 4, 279, -205, 80, 8, -136, 37, 67, -4, 58, -7, -196, 31, -30, 237, -36, 30, 108, 17, 264, 37, 169, 64, 46, -184, -37, 33, -218, 85, -88, 35, -190, -161, 50, -125, 37, 130, 205, 216, 61, 93, 89, 16, 126, -3, 258, -119, 219, -48, -33, 42, 203, 268, -150, -91, 34, -93, -333, 145, -71, 240, 43, -8, 57, 124, -225, 139, -71, -230, 137, 46, 70, 49, -243, -48, 82, -149, -208, -50, 65, -7, -30, 176, 203, -7, 187, -129, 94, 29, 88, 247, -103, 96, 156, -61, 112, 169, -224, -219, -49, 86, -110, -315, -82, 71, -22, -30, -12, 122, 95, -22, 183, 221, -114, 69, 4, -168, -154, 311, -66, -48, 45, 7, -109, -24, 129, -72, 123, -92]
1592i2P5O1K43k02P7l48K86j54Q8k34J09J75j81j57J21K75k20L9L5j42LP1M0p
1616c9j9J62q5o8k05J64m9L35k35j42j82M20LJ72k69Q9K09j00m07K98j22j1J07
1639B6n9J54n6k05K15j72j6J14l4J90j23M3K76n06J08nJ26k03M7L4J03P8k04k0
1663h9J1k42K44R0K8j78L38k30J52j66j41N4ML32l59q1L96m24K72j4k07J97r3
1686a06J89m4j6n4J49j93L14k94K05k14R3r5Q8J04J32p9j1K8q1l06K76jk24L30
1710A90k20l9J12j96K19j87J0K17j50j46K33k9N5j32M3%M5M3O5L3l36K19Mk40
1734a87J45K8j33K75j2k63J09MK1K31k30k05K09r7O4p2K09Q9r3j81J77k87M11
1757B12j13J73l05P2J83J31j75p2p6j02J14N8k15K39j91J94P0l09L61k01m52L58
$$ y = [-92, -17, 44, 287, 85, 162, -186, 100, -54, 34, -200, -91, 84, -97, -254, -133, 142, -78, -39, -4, -146, -143, -72, -32, -39, -58, 104, 19, -49, -254, -90, -139, 196, -39, -181, -363, 57, 60, 232, -37, 52, 261, 161, -246, 52, -70, -81, 26, -33, 121, 65, -140, 75, -97, -113, 1, -33, 157, 34, 77, 353, -153, -45, -50, 76, -127, -80, -46, 57, 135, -69, -89, -78, -320, -76, 14, 42, -136, 202, -28, 124, -42, -183, -129, -125, 207, -152, -233, 163, -261, 11, -3, -210, -13, -106, 83, 39, 23, -31, 118, -75, 239, -55, 150, -64, 29, -66, 22, 126, 258, 179, 168, 196, 115, -191, 85, 84, -140, 190, -30, -69, 43, -153, 66, -121, -111, 106, -44, -190, 43, 14, 69, -63, -20, -20, 25, 68, 133, 166, -170, 49, 53, -187, -42, -14, -147, 128, 116, -147, -38, -34, -13, 218, -12, -217, -8, -105, -41, -113, 96, 185, 92, -89, 88, -199, 212, 99, 272, -33, 39, 222, 353, 178, 106, 30, -72, 42, 100, -115, 124, -67, 127, 197, -112, 249, 48, -404, -46]
1779d6n8M8j50R3J28J65j09o5K26n49N71k12j9Q3J96m80Nj20L31m39K93K29m7
1802G4k96K47k54N7M76l28J31j41J80N9j59k6J73j18j26P0l67M08K35k13k00o8
1824a86J71j31K39J56j84j6M6M4p9j08j3LJ65j57n7p8Q9o8J96p2Q8j84Q1J84k54
1849a25P8K35m04K5J82L6p6J59mq1K23n01M37k21j34K11j91P4J58k00o8M4M08
1872B65k81n0J11Nj60m7J72k9j15K0J43J61m76m4N51j78l46K52qj15M49p8k63
1895f1N0K2J43q1p7K15k20L7k68L84j1j31j48J09Q2Q9K3qj61J1K00p2k15L04j12
1920A04j7k62L52j42P2o7j08K33l7j26J75m72K65N1j78K19R8j81P8r9q3m9N86
1943D12n43O1L0K8J8k7Q5k56R2K19j43q1M27l31K44m08L30j77N7j08L3J07L4j89
$$ y = [-46, -104, -56, -206, -113, 15, 180, 71, 6, 232, -317, 254, 42, 23, 106, 302, -178, -173, -293, 38, -401, -108, 121, 74, -222, 25, -229, -172, 304, -24, 107, -34, 146, 205, 46, 20, 193, 75, -51, 19, -348, 60, 295, 82, -118, -186, -15, -146, 93, 249, 65, 49, 95, 139, 60, -48, -61, -58, 107, -50, -107, -185, -96, -164, 32, -40, 48, -136, -55, 129, -125, -47, 188, -216, -191, -9, 27, -49, 110, 106, 25, 248, -253, 184, -37, -171, 40, -151, -77, 81, -119, -187, -143, 265, -16, -66, 45, 50, -110, -157, 15, -14, -129, -109, 34, 195, -281, -325, 226, 48, -298, -46, -54, -169, 280, 202, -61, -11, 11, 154, 73, -4, 211, -9, 28, -240, 144, 133, 2, -146, -37, 45, 134, 157, 149, -12, -1, 199, 127, -88, 216, 104, 87, -175, 177, 35, 107, 40, -68, 165, 128, 2, 177, -295, -30, 21, -157, 62, 160, -21, 57, -42, -125, -174, 412, -131, -70, -40, -12, 6, -21, 64, -192, -100, 119, -24, -105, 322, -9, 235, -173, 157, -20, 37, -71, -38, 69, 103, -86]
1967h6J39O9j12k13Q4j43M04Q9n1k96m0K28K6m1O8q8K08q0J5k67N8L23m45r3J10
1992a34K44j31M7J1p1j9J41k37N1L46m3k10L2k18O6K66l94L29J67m00J12j07m3
2015a95J63j09M74k43j08k9K47j35J92k97k4K02P6k90O6J07l04MK74m07N55l78
2037a59K10j71L25k88O0K27j76j73K62r0k13k3K43k75J56K34k69N3k6J83n16L57
2059f9K7k73R3K13K23j02l3j00j05J91K37j92l25p0N44k23J49q5J9j20j50K78
2081A27k68K09J16m7j65j67R7K97l9j72O2l9N3J1j38l4p8OK2J19k09j23N24M1
2105B05l92Q8j36K8L59q2k20M4L6j49L15j36m8N3rJ74k12Mq2J17MK06k46J02o7
2130d4K91k51j86K76k78K58Km9j39l8j2M25j57k33q3K06k29J77J64j89O9L46k73
$$ y = [-86, 53, 122, 10, -203, -119, -262, 142, 231, 180, -116, -156, 72, 98, 57, 125, 37, 245, 165, 180, -87, -29, 294, -151, -244, -134, 110, -21, 26, 37, -34, -53, 88, -149, -98, 248, 205, -5, 27, -191, -125, 141, -253, 76, 243, -157, -45, -152, -195, -32, -141, 333, 90, -18, -47, 200, 65, 257, -40, -64, 138, 214, -76, -10, 97, -207, -203, 71, -336, 219, -159, 51, -120, 205, -83, -23, 204, 28, -145, 117, 27, -186, -209, 34, -241, -85, 149, -120, -67, -93, 90, -426, -69, -42, -315, -222, -9, 214, 112, 79, -21, -126, 65, 302, 110, -215, -285, 259, 36, 185, 100, 119, -1, -151, 127, -141, 68, 184, 137, -28, -195, -98, 199, 160, -12, 50, 11, 64, 75, -63, -97, -175, -169, -147, -28, -237, -360, 164, 205, -187, -99, -235, -207, 152, 70, -150, -106, -70, -219, 96, -40, -88, -35, -44, 130, -82, -78, -160, -43, -39, 167, -79, 23, -44, 247, -4, -190, 86, -192, 66, 68, 19, -120, -158, -170, 255, 98, -135, -218, -12, -241, -64, 100, -89, -20, 326, 53]
2153E3Jm2k89M95k93o9K56K7M6l26o9K83l46K05R9l8j07J35M2k51J72J04m9L8
2177G7j35J10K49k05L2J40l36j60L70o9o8J25l2k75P6j8K12j34K44j99K44j86
2199F2R1l53M64l94K22j22k57Q3M40l53J89n0N1j25k4j3J65K00k16j19rK37k54
2222h5K1j49M06k75N28n25M6J85j44M4j46K96p7l86M58l1l26K69r6J18k36J11
2244Fj79J27j95M78m7l00J70j02J3R3j53J7k04K18r6p5N13l48O2j31K20k13R7
2267b9r8L72q1n0k79K53j66L6J37l67K56j24K30K27o31R1L9r7J04J08po5K08l66
2291b99K69LK62k41n5K39k56K37j28L30k17m3j11j30K04j36O9k2j74J57J60L0
2313A48l75K8j8K40q7J34p3K8q1M66o45J79Q7m0p6R3N0k93K97Q3J09k64Lnk72
$$ y = [53, 54, 12, -277, 218, -75, -144, 112, 139, 185, -141, -210, 73, -273, -68, 31, -7, -114, 21, 63, -188, -16, 88, 39, 77, -58, 52, 301, 96, 128, 268, -68, -228, 142, 73, 5, 130, 98, -177, -101, -119, 93, -41, 203, 4, 248, 62, 153, -200, 264, -130, 92, -30, -287, -204, 236, -117, 72, 22, 73, -52, -76, -89, 76, 276, 60, -59, -68, 169, -85, -64, -213, 193, -82, 446, -79, -33, 152, 8, 52, -94, 202, 125, -261, 197, 166, -160, 109, 13, 131, -105, 6, -173, -46, -241, 237, 190, -110, 60, -42, -29, 64, -89, -72, -276, -58, -154, -229, 284, -64, -2, -133, 87, -126, -29, -127, 245, 164, 114, -165, 88, -78, -42, 95, -272, -16, -140, 90, 317, -314, -223, -184, -281, -177, -69, -76, -141, 67, -299, -30, -27, 235, -6, -61, 178, -78, 159, 31, 361, 144, 101, -10, -140, 64, -72, -3, -25, -199, -42, 118, 148, -227, -199, -217, 23, -64, 70, -3, 25, -56, 410, -235, -56, 31, -9, -85, 8, 58, -235, 62, 145, 254, -10, -7, -12, -284]
2338b84L03j51K55o4r0j51L01p4p4J78l39J22J41l4l8L4j01l7K85k33K77k49j26
2361a49L78j83j62m6J04L7N7j12J23p1n0k28L87k78K34O9K0k00L11m11L38k57
2383h9J20n3O8J85m82K80j93K05L3j07J55k88M7j18m6L02k61L67j08rm12M99J0
2406A05r2K33m19R3K71l9Rj26N2o2K9O4j76J64l33n7J73P9Q4J16j88N4N5m4l6
2431IJ31m36J56J03O1J88l6p5j39Jj14J77j31L47j58k30P5Q3j2M1q9J14m1k11
2455a86L26q6r4J60j82r1J69J5K5J14k68o1K33O6j94j75K13j08J49J13o7j53K66
2478A84P4k86o2J18j8N4k18K62J3j54NK12m51M31r3l5L1o6J38r6r4J8n4L74m44
2503a57J01K20M5k05k21M20m9n23L64j74J18R6K55k40J0L9J01k19k45L21M8j65
$$ y = [-284, 19, -132, 123, 59, -31, -182, 119, 45, -29, 149, -190, -68, 73, 39, 1, 35, -66, -103, 182, -51, 226, -23, -149, 229, 46, -116, -162, -58, -21, 36, -76, 47, -24, -74, -302, 85, -193, 41, 110, 130, -70, 241, -170, 168, -89, 31, -22, 46, 231, -251, 29, -164, 41, 74, -33, 122, -166, -119, -237, -283, 19, -242, 125, 17, 8, -404, 95, 105, 13, 246, -173, -80, 191, 152, 161, 35, 87, 25, 54, 118, -58, 106, -227, -284, -111, -32, 52, 168, -20, 34, 89, 45, 9, 140, -296, -140, -37, 24, 212, 176, 101, -38, -37, -151, 26, -105, 242, 84, -146, -71, 12, 0, 41, -48, 66, 25, -186, 140, 54, -40, 120, -62, -153, 16, 31, 56, 170, -98, -159, 74, 140, -54, -229, -16, -124, 25, 138, 71, -82, 184, 258, -28, -90, 28, 10, 64, -154, 108, 121, -33, -28, 184, -267, 164, 71, 36, 67, 1, 139, 43, -51, -33, -87, 287, -157, -56, 164, 209, 4, -217, 203, 154, -369, -5, -179, -61, 35, 290, 50, 60, 99, 200, -19, -264, 57, 105, -60]
2525f0N9L6j90J90j62l3l5J05k6l0K36k47K66k11L02j38k63K11n8J79j51j6K66
2548B30n82K86L07j90J90kl30P1o4m7K16P7m06K77o3mL93m21J10m8j02J0J89j96
2572i9J28Qj47J40r8L43K8k32J43j40K5q2k15K0K65l73O28o8k50K09k48O5nj17
2596g2lJ03J20j35K94k81j85J37J34j22J83j87M5j44K06O5n30N05j55j52J02J1
2618f1J01Mj45J04l1J0j59J64o7J45J71k09n1J34O4l37L11m7l0p9j3R2p1J26n9
2643F7j1o7J66l44J40j5j05Q2J32j33J68m1J76j71L9k23K91l17L43l00J6J17R
2666A9Qr7J73j87K38k81P8J69Nl32M1L47Ol2n4m76N05k88K33R0l97n4L21k38J26
2691g7k41J88O5J71k81J85j19O9R2K55k41l16L32Qjj58L46j76k91K41J16j88O1
$$ y = [-60, -1, 35, -155, 35, -127, -160, -195, -90, -116, -146, 90, -157, 109, -102, 200, 62, -201, 10, -48, 131, -20, -36, 230, -352, -66, 241, 51, 241, 239, -91, -20, -84, -131, 85, 162, -244, 33, -30, -34, 359, -62, 48, 0, -102, -92, 97, -99, 29, 37, -110, 30, -68, 275, 303, 71, 214, 74, 99, 17, -198, -178, 87, -286, 342, 274, 24, 233, -15, 50, 45, -72, -75, 28, 148, 13, 307, 26, -159, -22, 112, -10, 173, -14, 31, -113, 93, 158, -372, 133, -22, -174, -72, -61, 40, 44, -101, 3, -28, -18, -177, -13, -80, 65, 236, 27, -24, 110, 174, -163, 148, 101, 71, -8, -21, 71, 0, 126, 67, 56, -11, 155, -189, -49, -64, -169, -87, 45, -88, 80, 39, 215, 44, 83, -140, 151, -166, 177, -123, -107, 10, 19, 27, -70, 103, -84, 154, -127, -49, 120, 125, -207, -166, 181, 187, 155, 101, -375, 130, -158, 75, 165, -232, -286, 35, -203, -77, -318, -130, -65, 106, -175, 10, -109, -40, 52, 307, 66, -250, 82, 90, 89, -69, 277, 101, -190, 51, 167, -21, 40]
2714D0L6j15R0j5J07k44J77k89J66j15j34N48k20j85J16J3Q8R5l7K59l13L90l44
2737A14Q6k41M8k06K59M9k65L70j13k69J05j18J17J22o6O7%l80L03n7k05M07j58
2760c1J70l17K46l6J84l70L27p9P1n89K95k57O26k88J84k1k46K21j37K11j24j13
2782g3P7J14l54J66M3L09j35j87o4J86K31l39j92M92j77P7l98K51J6N2j5P3o3
2805I0R9l83L67r7r3L4p9P6K3r9J97l94L96J39k47j24J39j75J3J68r9L57l17K4
2829A5q7K6j11M76j82M2k2j42k06O12l69m2J29J51m9l11LJ47k91M10L3j08Q4l69
2853a61P9n7J98qN6jj61j89J01N9N5J05l11L03k79M74p0l25L32j67k01k13K75
2876a06J45M0k23L69k97O0O3n2J98j32l5M4k49R8J62L1l2j25L33l23K06n59M68
$$ y = [40, 76, -39, 51, 36, 143, -101, 76, -213, -47, -162, -296, 252, 32, -153, -37, -24, 64, 159, 122, 381, 68, 458, 114, 200, -41, 7, -199, 60, 109, -156, 214, 101, -168, -63, -181, -64, 58, -8, 59, 59, -321, -18, -75, -280, 127, -31, 139, -178, 68, 32, 216, -154, 173, 94, 165, -424, -129, -386, 240, -48, 136, 115, -131, 90, -47, 164, 40, -73, 4, 118, -236, -70, -27, 282, 147, -40, -104, 82, 313, -26, -218, 274, 97, 174, -224, 27, 43, 95, 80, 153, 90, 189, -194, 173, 76, -17, 17, -62, 14, 37, -62, 135, -259, 137, 276, 29, -95, 44, -131, -118, 50, -49, 308, -9, 15, -72, -46, -157, 319, 137, 179, 157, 15, -191, 421, 52, 10, 139, 290, 241, -70, -67, 80, -211, 199, 232, 124, 208, -161, -82, -139, 59, 51, 107, 106, -55, -244, -143, -84, -29, 76, -235, 68, -211, 263, 193, -132, 200, 33, -168, -381, -106, 39, 79, -144, 225, -72, -12, 51, -1, 197, 65, 30, 74, -175, -77, 85, 116, 84, -41, 292, -31, 175, -384, 84]
2899H4j16Q4R6j62r7K27o7l01P9P0L6KP9J3Q2J98l58KQ0j39J26Rp3K16j55Q1j21
2926b5K02l5j10k40M18j10k89J17m3o5M0j5J66R4k49r2L30j34R9j09J28k49P2
2949i9Q1RJ74k10J59p2N1l4o5j28l0K96or5j53K57o2J43J58m06P9J92j80o2K2
2974A9k02K8RK05J66n7m93K70K75j75J98m21K58j16P3j25O7Q0j66M8R2L1j27J8
2998d5j1m4O5J07O6J09q1k89M16k47j70O9J16p8K04J55m07m6K14q6J51J87m21
3021f6J57R1j11%j61J50j58J26j93K01j09K0l5K52j93K19J4j79j25n3N11l55O5
3044F8j10P3Jp1O2K7K4J11q3J50k40N1p7j23J36j8j41L20j94J56p6O6K1j83J24
3069G4J13l10R8j14J61m7M3j50J09j31J61L0q5K15m06l0K10p2K86q3k05K65m6
$$ y = [84, -32, 52, 148, -14, -111, 116, 49, -252, -173, -103, -67, -65, 14, 27, 109, 307, -51, -49, 31, -108, 18, 27, -46, 170, 15, 96, -25, 177, 142, 32, -208, 210, 100, -189, -72, -115, -180, -140, -155, 11, 105, -144, -236, 94, -40, 59, -50, 78, -171, -99, -18, -9, 165, -45, 114, 42, 93, 59, -6, -134, -164, 132, 126, 31, -122, 135, 73, 216, 374, -32, 47, 239, 59, -3, 19, -183, -155, -146, 59, 225, 168, -325, -55, 220, 45, 243, -178, 80, -36, 37, -88, -21, 59, -107, -59, 33, 64, -63, -45, -56, -100, -35, 72, 138, 247, 166, -123, 293, 46, -124, -55, 61, -17, 187, 342, -65, -111, 103, 17, 168, 355, -66, 91, 182, 71, 71, -90, 60, -98, 28, -165, 36, -73, -53, -88, 164, -29, 190, 204, 25, -100, -153, 358, 3, 68, -42, 31, 32, -39, 23, 50, 74, 185, 102, 252, 12, 63, -14, -137, -1, -19, -160, 160, -34, 122, 46, 112, 133, -50, 74, 187, -123, -25, -139, 22, -25, 18, -132, -23, -154, 7, 37, -48, 167, -239, -269, -59, -131, 155, 72, -133, 132, 86]
3092H6j86J49r8j29L58k34k6J28kQ5J21m11K00k3L3j25N3K43l34K82l20Q3M35
3115C68l47o0q6J90j62J33J88m04L67k97K20k72J33k41J51P7J11k20pl9J57j5
3137e5O0j61N10l61J23p3j04J25J39M6n11K98o2j3J22n1N4j45j20J75j24nP6J41
3161H4k32l7K12l9L6J39j03N0j28Q0k5kj07jQ9K31l68j49M68j91o5lKJ75J5j52
3187b1R7J90j19j92K67m13J05J67L4k09J43J66l61M6R2j18J12j71M48k87%j28
3209a52K34L0j42O2j64J6m0L79l27M9k2J47j51j1J18j04J96l78L18k23K09J73
3231B17j40J58k01j37r4K35RL06l91K39p4j78J22%l84N98j25l2k30J94N0k33P7
3254a4j7M8l6k18K53R6P1q6j57J49j31K23l02Q3j03J36j49j2K44j49N69p53M87
$$ y = [86, -100, 49, -49, -178, 180, -54, -80, 48, 46, 131, 252, -159, 41, 18, 51, -74, -21, 222, -112, 170, -150, -67, 368, 21, -39, -125, 65, -97, 36, 224, -180, 187, -110, 110, -162, -29, -270, -119, -42, 69, -151, -158, -197, -40, -55, 5, -156, 354, -7, 116, 43, -61, 64, 203, 249, -262, 36, -26, -39, 83, 32, 86, -59, -179, -4, -128, -133, -57, 84, -148, -185, 27, -12, 24, 163, 60, 110, -18, 62, 37, 35, -72, -73, 16, 247, -121, -270, 198, 7, -58, -61, -59, 116, 131, -21, 76, 266, 147, -45, 222, -191, -86, 81, 115, -94, 49, 215, -146, -100, -8, -126, -14, -185, 263, -24, -24, -152, 82, 112, -30, 32, -132, -116, -156, 223, -104, -55, -77, 70, -81, -92, 26, -78, 118, -260, 58, -165, 44, 217, 77, 235, 34, -103, -197, 38, 47, 353, -38, 201, 127, -51, 71, 71, -313, 285, 160, 128, -102, 92, 142, -91, -14, -31, 17, -19, -237, 16, 112, 183, 97, -60, 89, -42, 181, -121, -38, -141, -5, -154, -166, 78, -71, 498, -255, 232]
3277B32l29ML88j25J30m40K47j54O4q0j19K06M1l45J29J49k3J96r3J2Jj93Q3j04
3301a23j04J80J8K40l91o8M62k5k48L22k10m27O59l08L4j11l9J23J06k11J44q8
3323f5NM9O6O2l8j26r5L80k76M02k72j90r0L34k51K09j6j06L39k02k5j66K03l51
3347b20L44l30J34J05j2j0l62M12j21J43l4K73m91J82K39m19K51j12J36k16K84
3368A76n6r3R6k21J60J81j04n9k69J45O6l02M09j51K10l44R2r4K41q4j3N4P2k60
3392a48NM16l76R4j37K65R8j11j24K81k4m56J95q1K61l2k37K10l38L28p8o6R5
3415D0k30l2J23m5NR9m3M2o7j48kL15p3k44K04j84J48L93l53J68J03l57K72j22
3439A2n5K84j34j67J49k90K44k08L61l09N7K35k18qj86J78j47M04j09p7J11m4
$$ y = [232, -97, -93, 295, 170, 300, -140, 107, -47, 17, -63, -182, 24, 65, -280, -151, -2, -25, 171, 78, 90, 91, -102, -19, -123, -227, -47, -29, 211, -180, -248, 214, 189, -59, 263, 53, -374, 285, -23, 11, -100, -139, -16, 90, -121, 23, -65, -60, -11, 55, 117, 79, -47, -142, 238, -38, 364, 92, -98, -188, 146, -105, 104, 88, -18, 321, 119, 94, -72, 131, -220, 124, -206, -72, 33, 21, 11, -351, 61, -60, 83, 49, 322, -169, 13, 252, -167, 84, -28, 108, -108, 176, 120, 27, 123, -98, 62, 243, 139, 80, -189, -44, 22, -280, 129, -22, 188, -156, -64, -158, 83, -1, -14, 40, 112, -148, -143, 273, -103, -9, -146, 119, 217, 106, -18, 263, 239, -217, -22, -103, 158, 126, -111, 99, -239, 89, 11, -55, 40, -190, -222, -99, -144, -139, -40, -83, -41, -108, -256, -258, 57, -16, -260, -56, -240, -92, 301, -52, 116, 219, -138, 134, 12, -43, 241, 107, -60, 89, -201, 43, -165, 196, -113, -56, 179, -39, -47, -233, -55, -202, 202, 93, 16, 127, 83]
3461H3j43L7lK71l52j34O2J38m7o2j72K92M5k33q9l2J58J47J53O6L9k24J9k7q
3486a6P2J10Mj49j40K50o7M1R0j40O0k65K93K2J8m6J23k12j68J56Q4m7k53J52
3510b8J50j20pJ22J76j48j89L3J4k8k33K48qo5J03k79J54O5L2P7j83J02j90L87
3534A85k25N8j08mO3j23K85ml25J78j2N1k72K19m6L12N5l33L2k97J15J14J24J5
3558E7k60K46q5j82L29M9j91J56j35j04L34j95k29L77l99J59K9J54r5J4j81J77
3580B5j35l0r2l9M38K5n0j42k4J47l45L61J96l17j01j9o8K15q3k82N19j64J87
3603B22j30k19L5N4k7l94L90j11K61K8l6k04K6K11j45J1K87ll03K72l11K46k13
3626e3mQ1j15K17k63K76j24p3k0j4J58j87r2L24J47m34L41k73J49o6j50M47k1
$$ y = [83, -60, -23, -26, 245, -107, -241, -179, -41, -88, -150, -322, -30, 15, -218, -307, -339, -181, -34, 119, 185, 224, 0, 19, -8, -16, 56, 166, 170, 21, -119, 131, 64, 105, 195, 55, 115, -150, 143, 165, 183, 137, 260, 48, -120, 36, 120, 73, -180, -28, 122, 2, -5, 117, 293, 145, -44, -11, 3, -25, -258, -10, -18, -83, 20, -259, -105, -40, -8, 69, -114, -12, -202, 185, -40, 18, -90, -94, -31, -154, 131, 127, -198, -20, -32, 19, -253, -34, -80, 232, 287, -46, -14, -311, -196, -82, 42, 57, -203, 43, -42, -224, 105, 154, -37, 119, -16, -120, 214, 19, -210, 167, -232, -73, -44, 110, 15, 29, -152, 25, -110, -140, -232, -271, 167, 192, 142, 0, -24, 123, -222, 139, 335, 18, -83, -102, -170, 45, -38, -320, 199, 35, 222, 92, -127, -92, -38, -65, -459, -69, -180, 81, 109, 73, -131, -105, 106, -39, -28, 259, 256, -47, 225, -86, 160, -53, -57, 24, -91, 126, -137, 139, 15, -58, -78, -92, 66, -121, -213, 111, 258, -176, 165, -108, 41, -25, -175, 272, 251]
3649B51j85M1j62Q0J22l9k5P1o8k11J66J2p3L45m56J88Qk42J06j23J47j06P6R6
3673A9Q7Lnl03K20L1K01j03p9m5j76L24j08J5j31j20J66k56K41K2j42L10J03j28
3697A46j6J3j39j46J30O8O5l7j24M87m47K66j83q4k69M56l36J79k51J25n1%M28
3720B80k90M7J41J49m20J36k58j49N45j3j53NP0j67k7O0M0RR3J06l27Q9k43K20
3744e7J94m8M8j18j06L45l44QJ78R5l26K85j0k21J68O3L8m7L30l27k22K53k44
3767f5K5l2k4J97k39L24l07J29l2j03j70M04j62J73q1J31%J38k78r0R9o5n4Q1
3791aK04j11J53l07J21r2qJ9o5K97r7j32p2j5K44P1l01J4j45K63M8j80K77k35
3815e0Lr4J71r3K28k01l92P47j49k54L3k83L91j8J4R8k78L28k61k8J91L1j79o7
$$ y = [251, 66, 107, -55, 25, 147, 108, 83, 154, 86, -125, 41, 53, -20, 325, -131, 57, 65, -177, -71, -194, -47, -153, -77, 19, 106, 109, 104, -199, 21, 52, 253, 150, 71, 26, -150, 174, 66, 81, -50, -170, -4, -260, -19, 3, -139, 171, 274, 146, 130, 143, 4, -142, -12, 56, 121, 84, -40, 447, 0, 266, 83, -1, -270, 186, -150, 29, -222, -97, -148, -148, 280, -10, 37, 178, 327, -93, 43, -215, -364, 181, 168, 15, 20, 90, -77, -104, -44, -4, 5, 98, 204, -123, -34, -277, -57, 137, 89, 137, 19, -87, 258, -86, -78, 100, 195, -131, 154, 144, -77, 91, 154, 192, 145, 475, 148, -74, 179, -65, -40, -72, -96, 101, -138, 186, -121, 8, -24, -127, -297, 107, -55, 118, 37, 168, 168, 306, 28, -62, 37, -28, -82, -1, 203, 92, 245, -62, 59, -33, -41, -22, -87, 210, 113, -19, -91, -106, 138, 209, -92, -78, -223, 40, 88, -92, 185, -50, -47, -141, 30, -63, 165, -36, -428, 319, 170, -84, -51, -334, 57, 39, 53, 151, -127, 201, -60, -88, 103, 134, -45, -112]
3839a12L31j08j21r9O2Q1k21L76R1n18N10k07j39J28R3m11L06J74l48J53l46J88
3861a37j81J50J12R2K37l93J52q3k8Lj25J54o8J73j06j22J09J39p4OJ77j49Q4
3884A22k87K46l50M26kl15J73Lq5J8m6O1j13N4m2K48j0k70L8J3J9J00R7j43k02
3909b47P2J82O2n7M4P4k18J70L3l70J84K01K3j52j7K22k20k65K90oJ12m30N31
3932B18j10M7j48M8j3j05nJ83k15OJ66m7OK35l19j22K77j19p7K21K14m73Rn2Q4
3957i1L16j35l1JQ3n51K73K89k90j35K89P2r0k29L44j54m6P9M1o6J36K0J35k04
3981E6j19J15l3N8PK0J05o0l71J10K0K03k87J70j28J46J9k28J83k21J82N00m82
4004c5J49l29K22n1R0K82l85K07Kj61L83k80Rj19J35m58L95L38n20J67J79j68
$$ y = [-112, 219, 111, -10, -109, -47, 34, -187, 189, 280, -238, 272, 65, -74, 54, 147, -264, 42, 216, -132, 21, -325, -137, -318, -168, -56, 36, 273, -120, 32, -51, -79, -76, -201, -47, -115, 58, -48, -170, -61, 78, 4, 10, 187, 38, 122, -165, 81, -269, 157, 155, -160, 13, 16, -69, -51, -97, -36, -149, -95, -137, 111, 101, -169, -131, -118, -99, 1, 98, -45, -247, -175, 7, 69, 12, 56, 130, -88, 82, 115, -255, -71, 130, 153, 1, -16, 206, -14, -279, 11, 5, 117, -313, 218, 108, 155, 7, 55, 42, -63, -68, 115, -100, -94, 72, 25, 31, 266, -53, -175, 102, -17, -94, 127, 341, -132, -123, -175, -91, 225, 90, 59, 60, 143, -408, -135, 154, -136, -271, 18, 90, 0, -229, 115, -39, -85, -6, 35, -31, 105, 125, 260, 56, -63, 52, 19, 77, 84, 104, 209, 149, -222, -112, -92, 111, -176, -6, -134, 12, 31, -197, -14, -235, -53, 447, -35, 114, -215, 7, -44, 46, 328, -57, 150, 152, -9, 374, 94, 103, -16, 119, -339, 56, 394, -126, 41, 220, 52]
4026E2r8M8n9J12l26J91M0L7K22j06j6l9l32M58m4L1j88j19j94M36Q7k37k96K04
4050a36J92o3K36j58j16o3J22p1mJ04K3K2J56k96K06j44L8j89k8J21K38o4Ro9
4074F6j09k17J39M68J5k97O0j74%L11m18L30j5k36J75k84Q9O7Ok16p2K70L1m2
4098e3L7k17L77q1L6j1N1k4J4j73P8k03p8J22K99k93r2M85j71l2j03K34n6m07
4122b61L26L8k46N9j87K80k7MQ6J11Q3l51J05k45K35L4j70K21k28L7K92k87l1
4145a22K79l9j83r1jr3L56L8j59R9J4k36J66M8m9l30M32n1j50L43k97L35l13K8
4169B4n3r9LL91l34p3M2J09J32l41L30j01j7m1j0l1j69J17J41J45r4o7K5oO9j96
4195a04K94l75K15q8K3K20p7k45N0R6Lo0O3l20R0K22K80o1l04K70j61N3j24O8
$$ y = [52, -46, 2, -57, 55, -271, -80, -40, -3, 219, 113, 97, 58, -274, 184, 140, 171, -17, -136, -330, 106, 193, -44, -340, -136, 56, -7, 229, 71, -45, -108, 14, -57, -61, 43, 66, 88, 244, -52, 154, 10, 48, -141, -169, -48, 190, 126, 135, 66, -43, -260, -121, 347, 362, 65, 125, -49, -49, 262, -156, 174, 159, -77, 98, -186, -97, -30, -24, -240, -312, -42, -11, -53, -16, -233, 144, 63, 99, 88, 139, 115, 129, -44, 34, -169, -247, -125, 174, -119, -211, 274, 103, 71, -32, 202, 146, -261, 65, 103, -143, -84, -271, 9, -18, -14, 72, 183, 266, -85, 20, -225, 10, 44, -126, 95, -133, -96, 196, -91, -122, 157, 118, -65, -156, -157, -250, 106, 144, -15, 84, 98, -138, 28, 76, 27, -303, 129, 78, -72, 271, -26, 309, -4, 24, -29, -128, -125, 266, -68, -141, -99, 10, 142, -199, 131, 30, 13, -28, -38, -69, -238, -121, 20, 165, 71, 4, 29, 23, 92, -104, 190, -185, 30, -58, -35, 185, 108, -137, -87, 9, 12, -48, 15, -305, -215, 7, 287, 226, -78, 192, 31, 84, -40, 28]
4219B8l22N39j97pJ34j10m13J09M02m51J45k48M85J09j52p8O4O8M0k33j19K32
4241B5J12j0j07K07j13P4k79J65k53J50j83K96M7j5j60K06m18J29L20M8n51M90
4263A80m6j03n1P2M3jj06MO3k80J96p3j4K42P0j89J78l22LK74q8l07K22K3j36
4288a46O9L71k59j40L1l2K39n6k49K53j30p4M50k80j76J75K22k26M8J41k49Q7
4310F9k1J35k46Kj44K98l09m2K01j89L63Jkk10N37l22j69j22j9J40jj41L1J34
4334b6k14L83j2j00l8J44j29M5K8j25K56k42J5K78l73K1J95K1p4k8J33l75J95
4357b2j77J35J78oL62p40M31j49J30j42M2l19J19j5q1L46Q9k20n7N6R9j05rJ48
4381I3k43N85l90qK84l10o7K14j70m8R0m2P3o4N1mj70J99J27k25O9k11K37n5j27
$$ y = [28, -294, 245, 48, 41, 175, 65, -348, -239, 163, -288, -143, -391, 94, 203, 51, -27, 37, 105, 145, -88, -207, 25, 137, 127, 20, 227, 114, 188, -91, 74, -179, -29, -212, 84, 131, 116, -44, 162, -256, -127, 193, 241, -310, 180, 134, 31, -20, 52, 95, 94, -12, -8, 55, -225, -29, -102, -116, 126, 196, 7, 185, -137, -134, 140, 52, -255, -33, -10, -146, -77, 294, 35, -105, -74, -106, 133, 77, -172, 81, -49, -123, 327, 47, -129, 46, 268, 42, 90, 231, -18, 69, 48, 183, -63, -61, -205, 93, -216, -258, -57, -246, 117, 118, 116, -94, 443, 121, -48, -170, -189, -49, -50, -191, -160, -26, -240, 143, 131, 31, -7, 137, 8, 53, 81, -44, 212, -30, -15, 263, -110, -89, 106, 127, 53, 25, 158, -217, -22, -199, -64, 114, 108, 470, -270, 161, 12, 142, 0, 42, -277, -158, -173, -254, 92, 181, -39, -96, -40, 59, -46, -55, 93, -150, 435, 45, 37, 321, 11, -56, 158, -12, -60, 30, -12, 61, -3, 48, 44, -126, 73, 200, -25, 44, -167, 70, 15, -112]
4406a12L7m9J78oJ33n8j54o9J47K2j98P6o9L0j03j47K65K3R2M3j92J92p8k3J82
4431A62p6l00L45k52j6K25o8K83k27L4k2l68K57J36j68K5M2j43m6K57ok74L34
4454A34j82K10l93J52L85k30r5J13J23j65l90K02M11m39j2j8K63J7L6l82J40K55
4476A35j28J09O9l76l02N25o5J46k23J29k70K00j8J67l6r1l8K12l80J8M5o7M86
4499B47l22j42K89m7Q0k60J45pK50m47K51k61P6M2P7O5j34LL32k17r9J22J16j80
4523b1J16k35K85k37K22O7j95J54r0k02j07N0l6J28K4K29l23o4N1L59J54n44O4
4546a51k71N57qn1k10K85j07r4r6J58j23O0j29p5J67N6j26K67Q7k49J76l54O4
4569a67k5k3M61O5l30j95J08K0K56j73j12qK42M6k75j73M18o7j31Q5L4j50K42
$$ y = [-112, -75, -124, 54, 48, 181, 123, -31, -100, 47, 69, -129, -53, -122, -92, -195, -342, -77, -54, 38, 81, -111, 81, 3, -20, 162, 86, -214, 131, -121, -137, 88, 20, 303, 76, 110, 88, -280, -23, 113, -55, -30, 12, -131, -177, 80, 74, -200, 134, -48, 162, -231, -79, 306, 76, -19, 94, 217, 52, -338, -136, 275, -164, -176, -194, 69, 86, 122, -260, -120, 135, 7, 116, 185, -191, -493, 32, -33, 113, -110, 19, -251, -51, -69, 98, 62, -29, -67, 145, -235, -217, -172, -239, 247, -75, -217, 72, 25, 105, -155, -10, -17, 233, -214, 37, -224, -148, -106, -29, 36, -98, -95, 237, 20, -79, 43, 159, -21, 95, -140, 145, -92, 130, 197, 2, 156, 66, -136, -243, -193, -229, -101, -77, 152, -171, -235, -184, 175, 329, -215, -151, -422, 135, 127, 76, -134, 151, 44, -50, -146, 12, -111, -51, -180, -255, -88, -32, -158, 109, 196, -53, 123, -231, -167, -192, -215, 246, 311, -19, -214, -106, -86, 170, -3, -115, -123, 119, 165, -110, -283, 135, 68, -63, 22, 56, -94, 148]
4592A48nl31M0J86nJ35k61K5K38k46M2K2P7j57j4j26K29k40L81k49J43o5K96j72
4616I1Oj09Q3n1k01K20o3o9J13r7J48j03J10K15m43k2L03j14K7j98K08M2j74R7
4640A9O5kj71J2J58k37L33j80Kj36K59l05L10j94K00j43J82j85n0J59k64K27j8
4663D1M3n4J9K57l19j8n6K32k24K11Jj4k13J35O1j82Q9J02j65L6j38p1K13m8L2
4688c0J01K48k18p6j1k4l04L41M7jj1j72L09l28J74mk83K86j78n7J40KO9j72J54
4713Bpj17J11m0J26k73M4J42J78j98k3J5J65Lj35J41m1n1j41P1O4j14J50j37o
4738g1J49j7k26K29J09r1k00K52m2l60K57j00K09n3k35J56J10P0q2k5J87k55J0
4761a9o3J57q7J95K4m39L47k32L9n4N02k61m7K23j84L09l55J95j79j13l00L49
$$ y = [148, 143, -188, -148, 38, 33, 168, -93, -68, 170, -76, -34, -12, 65, -92, -106, -232, -3, -243, 138, -111, 32, -33, 263, 91, 97, -12, 71, 20, -181, 39, -24, -93, 20, -77, 71, -32, 78, 293, -150, -172, 131, 17, 44, -154, 54, 96, -78, 19, 84, 82, -89, -77, 81, -156, 177, -3, -1, -137, 122, -183, 127, -67, 133, -10, 172, -13, -63, 96, -168, 59, 41, 84, 30, 49, 306, -13, -31, -87, 145, -79, 132, 133, 119, -94, 41, 102, -80, 9, 111, -54, -18, -156, -227, -14, -62, -30, 71, 319, 101, 25, 14, -10, -314, 27, 74, 73, 62, -110, 199, -129, 45, 41, -242, 44, -134, -191, -51, -49, 20, -152, 2, -5, -122, -11, -51, 75, -198, -154, -12, 166, -32, -55, -40, 125, 128, -7, 134, 93, 42, -99, -28, 36, -78, 72, -65, -71, 78, 61, -165, 64, 173, 82, -118, 134, 92, -268, -11, -111, 98, 45, -190, -34, 76, 146, 64, 39, 226, -29, -19, -82, 75, -12, 183, 207, -232, 115, -117, -78, -132, 370, 109, 62, 285, 101, 410, 55, 250, 71, -42, -342, 7]
4783Gk9j36J02Q8k09J69J65j38J4N8Kj34R8p0k35J92K99k40l2QmJ25j98M9n2J8
4809h3K14k4p9L4J55L5k67m3j23P0k9O5j16O0J74L6J24k39j85J24J03r1L83j59
4833A39l60K67p0J59j83J08k57k39M27k54K15J11k12K81l22J14O5J44k57J34l4
4854b4K39m54K55p1K1O2N2n2%J32K3k9j14J08j89P4J75j85p2j02m7O9P8M9n7M4
4880a5J33O7k11J31k17P3J85R0j62k90J45l5K47k10L07l48p1R2q0J15j67K43P9
4903A01j48L90l76M0k2kKj97K14J9j40K48n3m9K7j29P2J02j52K22k86j0M30n56
4927b53M0M94k63J74k55k79M47j88L0q3J21J2Q1J73m79N21m17J44O8m72J54M78
4949B48k10P1p3o1m6k6k45K36oJ90J20j14j76k26K39K65k70K53l53O5r1K20j66
$$ y = [7, -22, -158, -56, 32, -177, -8, 157, 19, 33, 91, 93, -41, 57, -13, -248, -56, 243, 3, -29, -21, -25, 100, -98, -49, -101, -83, 131, 107, 28, 62, 217, 252, -15, -58, -181, -111, -140, -75, -191, -131, 43, 79, 203, -36, -221, -97, 6, -85, 298, 139, -221, 46, -24, 135, -48, 60, -197, -436, -9, -263, -48, 63, -149, 132, -190, -76, -11, 133, -124, 10, -24, 215, -239, 16, -55, -34, 28, 80, 28, 28, 160, 183, 154, 40, 148, -41, 33, 208, 23, -49, -151, -198, -129, -51, -2, -59, -15, 118, 185, -26, 105, -112, -39, 146, 236, 74, -216, -71, -106, 141, -69, 238, -110, -181, -89, -169, -54, -221, 22, 101, -47, 343, -33, 7, -15, -17, -15, -212, 2, 21, -119, 129, 76, 27, 54, -75, -3, 99, -53, 169, -117, -127, 303, -253, -213, 281, 18, 192, -63, -342, 105, -83, -53, -136, -15, -3, 78, 251, -228, 293, -124, 20, 88, -384, -230, 248, 38, 109, 36, -25, -71, -97, -342, -106, -112, 78, 198, 84, -92, -318, -79, 186, -84, 169, -184, -119, -210, 10, -156]
4972a56j4J14O4p3J02jk50J00P8J33j01P9n0j09J70J03k26K39m40K47j38R4J10
4995G5j51P4k34N37m51J06J78k30R7Rk31K13r3K71J29l78K0J26J67l11K19k28
5017h6K05JKk57L4K85j06j01L63j76l68L32j08J68k03k73P5L24J97m18L65J1m80
5040b14M46k81P6o7J69J30k48n4R0P8l17K12k7n3J76lq5j41L5K01n2o7M5J1k72
5065b12K26j82K38q4J27m1j32qk02L96m00J19N88m30k9l0J25l6J41j18K23l72
5087i3j89K64%p4J21k79K89j8m3J66k86J74k75J67K38r3Rj17L5k69J82k02L83
5110I0j27K94l21j71R8J07q0M16m00%K94k93L47k73Q7L1n8m80K88K21k47M63M7
5133C33k97K95j86j35J58l18j01N12J8k19k2j0L7K34m32K39M8j0k3j29L6R5j30
$$ y = [-156, -170, -56, 8, -65, 37, 36, -214, -114, -36, 97, -4, 75, 25, -84, 86, 189, -37, 202, -238, 9, -129, -35, 75, -76, -2, -236, 301, -150, -44, 134, -96, 1, 10, -221, -8, -101, 170, 299, -79, -59, 67, 234, -77, 142, -86, 119, 120, 122, -135, -101, 184, 78, -23, 340, 164, -204, 128, 20, 188, -15, -288, -213, 111, 308, -110, 255, 266, -214, 232, -49, 27, -40, 129, 259, 11, -43, 47, 125, -192, 20, -7, -60, 116, 113, 28, -113, -78, 123, 71, 4, 49, 60, -212, 14, -168, 70, -14, 113, 72, -60, -68, -270, 126, -274, -155, 433, 3, -26, -56, 69, 33, 174, 56, 279, -93, -282, -18, -18, -92, 29, -250, 39, 21, -22, 144, -142, 32, -243, -76, 162, 69, 78, -39, -4, -273, -91, -293, 90, -37, 257, -64, -235, -137, -30, -110, 306, -94, -94, 200, -93, 254, -19, 68, 99, 41, -439, -151, 70, -177, 286, 333, 36, 331, 145, 10, 168, -150, -251, 261, 279, 60, 38, 28, 65, 299, -133, 106, 154, 144, 121, -8, 28, 123, -7]
5156gl4K2j06J50k5q8J89j2O3m76K61k2J95j3pk72J57J50j75K03o9j95P1J18j02
5181b4p8M56n28k1K1L5K3qQ4m1MJ48K1l3J43k55o7K05k29J60J54k34J19q2M1K03
5207B17k08r7J96k46O3P4J7J96j6l21Q0L06n92K27J01O4pJ06k12Q2J50j11J45
5230B14k68J25k49k4K11m0Q0o1q0J35k21J89L2M0k57J23J85l34L98j3k78R5J52
5253A54j4n8L4p3qn1J11N6j23k00L33j75Q5R6j58J34k72J27L5J99m82J90K10k25
5277g5J75j10j55O5K05j01J95k62K39l86J40M5J99L1j54m0m9K14r5j31P8j01J23
5300E0q7K1K04j0j61J62p3j08k15o3j3N29j51k03J55K4n0M03p0m55J50K38l05
5323b8J01N1k54L62j94n2q8o0O5j6O8Q3J19j6k11K32j54J71k85J59R5k17L81n21
$$ y = [-7, -41, -19, -125, 25, 0, -88, 101, 89, 152, -324, -63, -85, 110, 97, 90, -182, -25, 125, -50, 153, 84, -111, -40, 78, -24, -102, 354, -174, -195, -174, -139, -116, -124, -40, -81, -77, 71, 92, 59, 202, -53, -120, 85, -144, 16, 170, -64, 55, -27, 14, 217, 9, -88, 108, -138, -75, -1, 16, 212, 196, -125, -45, 261, -331, -104, -3, 61, 54, 160, -52, 30, 180, 69, 214, -54, 71, -178, -202, 9, -31, 49, -12, -92, 43, -178, 11, 43, 83, -174, -51, 134, -200, 198, 185, -93, 2, 154, 140, 82, 116, 43, 35, -16, 95, 151, 28, -172, 161, -14, 71, 167, 9, 143, -129, -2, 33, 232, -250, -60, 150, -75, 100, -10, -165, -100, 105, 4, 199, -63, 176, -210, -70, -25, 174, 205, 51, 11, -38, 176, 81, -50, 28, -73, 50, -37, -16, 188, 178, 17, 179, 106, -2, -217, -280, -293, 236, 85, -118, 37, 61, 11, 414, 344, -111, 39, 277, -28, 73, 124, -130, 232, 38, -14, -102, -162, -97, -113, -45, 38, 157, 141, -70, 162, 8, 179, -106, 53, 148, -69, 312, -209]
5347b09j3K78R4k13K09j07J15j09j58K23K9l0J29j72Jl5J83j22k76N27j80j97
5369c3j45M8L10k88L68l86K22k12j29M55k03j99J97K20m01J83j05R7J06N9n14
5390c50L78j56M8qJ82J5o4m5J60k83L5K13m4J32l5n9j58n6J57m7j26L0koJ52j68
5416a05K18j37k84L33Mk89K14J33j19r6J24J02n5r3J23k23J34J71o5j92LJ3K14
5439A28o4j3j28k87L64J63q1l13N25m85J22L62m18L01q1q2j7J83l69R0L4K75j32
5462G7m8R7J33j46P1k72j15P2K66j07K77n48j1K70R0j0J32j22j51k7N5j37J86
5485C2Mn3j73J24q7J53q9J23J34k92lJ90l2KM1Kj41k7m6p9p6J00K24k47L95k8
5511A51j01j1j04R2l37L49o3n7L3J91M6l9J09j20m02J81Q2K90l04j27rN3L09j48
$$ y = [-209, -222, 56, 150, -63, 146, 39, 154, 45, -113, 110, 139, 109, 238, 66, 67, 32, 215, 93, -183, 344, 164, -33, -178, -130, 180, -108, 260, -126, 96, -116, -245, 210, 7, -192, 5, 225, -176, 7, -98, -1, 105, 164, -350, 28, -128, -80, -88, 94, 109, 45, 0, 160, -123, -88, 125, 81, 213, 178, 119, -39, -95, 62, 15, -111, -81, -83, -89, 63, -105, 113, -24, -308, 25, 29, -260, -46, 87, -32, -128, -4, 98, 43, -50, 73, -150, -16, 155, 90, -102, -99, -86, 128, 64, 51, -77, -364, 0, 163, 82, -231, 294, -191, -69, 293, -125, 176, 95, 13, -4, 179, -190, -100, -66, 209, 77, 29, 126, 259, 113, 184, -88, -203, -131, 135, 28, 305, -243, -254, 16, 106, 96, 228, 106, -45, -72, -17, -154, 32, 36, -17, -190, -66, -153, 0, -89, 34, 168, -124, -127, 63, 31, 33, 74, 76, -65, -92, -138, -217, -293, -193, 31, -216, 179, 151, 50, 39, -65, 27, -310, 39, -24, -81, -48, 143, 189, 150, 259, 139, -263, -82, 0, 290, -14, -141, -150, -97, 212, 64]
5535F4K19k45j48K19l23K83l0k35J72k5k2j08J0J33L6q7pp9P0j38M29j03r3j25
5559a33n7J83J30m4P3l03K03P1k63J15J35k52Q6M25l04k94L09l41K08j38L65j94
5581b0R8j47m8Q0j13R5j8n9J9K8J21Nj2L6l08M80k10j17o2o1J27J20j81J60J62
5606A75k80L90l12N3j37J18j06j69J18L11J97m19N5R6j62r7k8J65J27j94j05M09
5628B05j67k2K17j95n9j4j32q3M71l90K50l59J22L76m18k3K45l46K53J34j05j40
5650a80J47l7J81j90K65j50N4N9r8k07J09J66j1J21l71J07K2K59%k30R8j73k8
5673h7O7Q0k08L69k24J25Kp5K09j69n4l5P6j63m4%J04O7r5J16K15j72k59L64l20
5698a11J08k59J58j18K76q0MN9o8K6J19l54K04L2J25j88n2J34j69J64J13l74R4
$$ y = [64, 283, 38, -110, 109, -214, 69, 39, -196, -24, -49, -71, -179, -169, -36, 0, -87, -94, -173, -103, -241, 188, 85, -8, -133, -190, -7, 123, 79, 152, -151, 52, 123, -140, -25, 110, -142, -56, 369, 65, -229, 80, -261, -53, -191, 174, -20, 78, -69, -117, -37, -150, -55, -73, -132, -113, -85, 36, 41, 29, 65, -243, 237, 27, -90, -152, -213, -86, 34, -147, 13, 175, -105, 285, -27, 26, -111, 7, -99, -268, -150, 161, 358, -61, -6, 90, -72, -169, -197, -32, 95, -99, -204, 205, 38, 16, 233, 38, -21, -35, -167, -250, 221, -169, 81, -278, -156, 220, -198, -221, 24, -322, -69, 65, -40, -180, -33, -70, 111, -79, 186, 36, 90, 149, 51, -156, -47, 119, 108, 229, -142, -35, -13, 246, 246, 16, 114, -59, -87, -20, 60, -148, 221, -3, 122, 124, 49, 258, 89, 35, 0, 76, -87, -131, -131, -27, 40, -55, 61, 276, 104, -155, 209, -111, -3, -262, -104, -222, 54, -26, -22, 37, -31, -5, 114, -240, -36, -4, 121, -67, -119, 15, -154, 10, 123, -251, -157]
5721a57L94k42m2K18j46j35L60j27J06k17P3r4J02K8L7k07L47j44J20k98K12k22
5743c4K8j15K84J3n7q2J00j77J93p9l2l8j33K75k13j45L94k80j49L07k71L90k33
5766e4N5J36j12K02r2j16J05j22l07M05k76J38m1J65K4m16K77J14jj12q9L40j76
5789D7j00j16L21j33j13J10K48k27L5R6k51J57K2j55R6J42m1J99k51q3j63p7P6
5812a61JL58k22j3M4J56Np6j9K8n4j48O5o6K25o0Q9k44L63j91j69R9J83m48L48
5837I3o6J63j90R1J97k86Q6M7j96Pm7n6J33J36Qp4m85L90J47J12k95J18L2m1J14
5862A38j49J04k86K80Mj84J23J57j74R0k43J10j60L28k21P3j02L03q8l56J62J01
5884A0j74JM00j75J21j51j05J74m3K25m57j7k27M04l9r7K35l10J80J20k80J72
$$ y = [-157, 237, -5, -47, 171, 25, -110, 250, 123, 229, 12, 85, -9, 93, 121, 158, -49, 298, 154, 274, -24, 188, -34, -6, -121, 163, 176, 119, 37, 137, -40, 153, 74, 42, 4, -129, 146, -67, -212, 182, -98, -247, 60, -211, 179, -54, 1, 137, 25, 227, 135, 19, 124, 2, -305, 100, -176, -38, -79, 86, 110, -306, -29, 85, 84, -28, -117, 223, 47, -53, -169, 152, 19, -94, 16, 264, 37, 72, 168, -83, 74, 96, -59, 37, 179, 138, 337, 86, 3, -160, -237, -161, -160, 198, -24, -37, 7, 163, 168, 92, 73, 101, 47, -101, -36, -102, 123, 63, 152, -92, 271, 80, -89, 10, 193, -255, 93, 27, 190, 0, 91, 288, 2, 88, 135, -61, -54, -101, -157, -24, 112, 120, 46, -439, -49, 98, 210, -85, 33, 65, 24, 138, -11, 93, -193, 87, 91, -93, 30, 187, 13, 103, -140, -30, -190, 138, -83, -10, -112, 191, 103, -253, -91, 10, -164, -163, 237, 62, 183, 32, -73, 101, 58, 283, -174, -191, -418, -14, -53, -150, 85, -225, -45, 75, -205, -33]
5906c3j10J86L1j40K31k94J51K95k50J06j3l22L89j30j13J8j33K07J44m08J33
5927e5J31j09K04j23k46J20J69J9j49R8P3p8j34J81j87J0J17m6r2J94k31K22L8
5950A26k24J88K49m86M0J21K77j35j96l35M18M8m5R3J11j91j20N8Q3J57k63m2
5972f8j70M23o6J69j15l60L83k03o9j62K69NR0j03O2n7l67L13r6O0N2Lk16m7K21
5997d9k56J93K44k36J8Q5M1o9M4P5j25N16q26L30j4L09n25J26K11Jk06M29k95
6020B1q8L03j28J03k70J91m1l01M65l76K67J18l64O9N8J11l2k90K01o3P0j69J64
6043A9K60o3Pk54l1M24m65L25l87L26n25L33K92k53kP7j01K11l02l9j83N75j17
6066A27j11J07P0k14j0j18Q1o1K52K69l09j76P4rj22K52l51J93r9j2l4K53k42
$$ y = [-33, -143, 43, 74, -66, 165, -129, 22, 317, 67, 173, 160, -162, 227, 97, -16, 2, -131, 76, 220, -188, -55, 76, -33, 171, 48, -198, -78, 91, 110, -39, 59, 132, 54, -80, 101, -86, -76, 41, -5, -97, 97, -134, 88, 126, -98, 90, 339, -147, -107, 14, 291, 156, -40, -375, 43, 91, 46, 139, 250, 59, -61, -3, 80, 237, -26, -68, -238, 185, 119, 288, 173, -187, 196, -7, -76, -238, 31, 36, 126, 23, 85, 28, -339, -26, -122, -62, -10, -7, -223, -270, -49, -305, -112, 132, -104, -86, -1, 40, -29, 15, 90, -35, 481, -345, -15, -29, 280, -245, -119, 92, 93, -113, 316, 21, -67, 236, 108, 211, -59, 132, 91, -210, 255, -121, 146, 264, -100, -31, 27, 138, 106, -184, 17, -46, 24, -145, 19, 279, 216, 223, -31, -62, 362, -103, 222, -165, 161, -364, -31, 261, 8, 6, 83, -18, 193, -109, -148, -331, 244, 127, 16, 123, 193, -21, -31, -149, -68, -129, 123, 392, 83, -93, -19, -28, -150, 102, -249, -56, -155, -167, -201, 52, -190]
6089a90J02L97k00m09J2M41j36J6k0K09l96J48J20k48K18j96L32n3j47q5K58k56
6111h3K5j18M54m33J93K90l59L6J58k57M0J01Q5r7l4p5K09l53K20j80L1K50k24
6134a21J34Q5k06J76j4k22K34o5j04J73J20o7k75N7L01k60m7N1K46K29l88j46
6156a09K00j13j09R7j37K57k47Q8l7K13O9r4j41Q7k36J5L50l34J06K12j29m7O
6179c3l6j64L69j22J35j29J68j49Q4j51K00J97k83j5p7K30l9k45K1q3O9J07k1
6202C3l30K39J37P8K35o20J07K51p8p5M3p8J57j05m7k12K17m1J77N7K7k99K98
6225A71oj23Q9k55M1J09o8k2rK18J2j61K2j05K06J16K4j81l98J51K24j01K7k8
6249d7k08O7J84l04L09J19l00J22j34R4R9J29R8k77R2lk20K46J8j87j82M04j54
$$ y = [-190, -88, 309, 109, -300, -288, 153, 17, 33, 13, 222, -174, -26, 94, -154, 64, -132, 200, 147, 0, -85, 173, -83, -58, -176, 278, -155, 38, 328, -31, 5, 163, -94, -54, 47, 132, 35, 1, -74, 135, -218, 2, -178, -147, 103, -121, 13, 98, -108, 68, 54, -168, 66, 1, -103, 70, 190, 123, -152, -95, 206, -54, -101, -50, 196, 425, 37, -109, 91, -22, -131, -34, -171, 86, -161, -73, -110, 103, 172, 78, -63, 24, -212, -197, 153, -181, -75, 137, 8, -39, -33, -69, -233, 136, 14, 149, 20, 188, 39, 123, -28, 172, 369, 86, 71, -6, 224, 185, -60, -39, -122, -53, 54, 33, -297, -58, 79, 157, 392, -228, -121, 130, 52, -23, 20, -58, 99, -6, -53, -265, -48, -89, 88, 145, 172, -127, 171, 165, 42, 131, -124, -83, 26, -42, -64, -73, 145, 157, -4, 18, -87, 119, 235, 259, 78, -320, -169, 55, -46, -19, -47, -255, -188, -4, -308, 1, 120, -180, -58, -192, -98, 1, 130, 228, -49, 43, 40, -180, 66, 84, -103, -285, 119, -35]
6272c5J74j85N3P1k34K32kq8K21j48j38L01k93J43q5L5k72L64j24J37n0l7j43
6295a03P3j52L4K67J75j55k86L8K30j32q3J05j59L26p0l90L06M2l02L59L5Jl01
6318a42K56j64J39J33j88MJ7m6q5J55M7k15j09L59j77J47n9j1j29J72q2J9N1k23
6342a31n6K00o8p5L61j16l81N08k56K01k6r8k0k20K76n6K99l95O2n7o4K70j48
6365A0r6L97m00L30n08K30k3J50k38J45J34k97L10j86K52k66R5J60k29J15k66
6386a81J48J11j38J17j39J67j20J41j06J9k4l3PJ96m4k53K10J01mj85j00J46r0
6409e4J97Q1J67l77J19j60j24J5j21J94L93l48j97J33K91n9j48o1k86L30m4J21
6431F2k64j3L47m41M52l58L21j14L03l72O0J08l5J36J62l11R9K8r9J37j74R7o3
$$ y = [-35, 139, -46, 7, 78, -156, 76, 74, -14, 207, 59, -79, 222, -71, 72, -13, 22, -250, 114, -10, 127, 77, 40, -103, -30, -182, -148, 119, 294, 139, -147, -109, 121, -11, -94, 11, -148, 178, 108, -282, 24, 66, -236, 123, 158, 159, -142, 114, -50, 89, 222, 34, 38, 55, 9, -76, 79, 126, -89, -198, 161, -16, 131, 72, 61, -68, 104, 22, 41, 92, -131, -187, 13, -55, -130, 231, 115, -266, 242, -14, 187, 161, 63, 43, -177, 99, 43, 342, -53, 9, -48, -112, 158, 10, -86, 311, -89, 241, -267, -37, -60, 90, -148, -3, 131, -166, 144, -42, 210, -56, 39, 199, -30, 85, -181, -33, 78, -60, 57, -82, 85, -35, 106, 0, 19, -5, -38, -31, 165, 121, -132, 78, 179, 175, -10, -110, 36, -54, 143, 224, 391, 14, 133, -27, -151, -136, -257, -63, 330, -18, -215, -82, 209, 150, 2, -59, -345, -15, -59, 62, -202, -215, 132, -309, 143, -215, 106, -8, 295, -77, -17, 91, 56, 192, 354, 43, 142, 170, 71, 208, 34, 131, 68]
6454F8O7l67J86rR9O4j4m8k25K46j76J42j56K39k09J03k23K65qK67j30j44j65
6477a28J13K49l63K17KJ17k43k3P7k3j04J76M7j12q8N5j12K43j41L5k75N29l31
6500h3J64M5q7J42k37K92n0l4j08K10P1m9j85M8m57J77L01j70J89j02K6PJ09J86
6524D05m16J20j14n3j39L9L9Ro8J87j81Q6q2K93l04J05L4M6p8M0K02j00p6J18
6548A12R9j44J27k83J41p6k48L60j14J12J94k27l2MO5J90j66j42j84nJ14j37q4
6571c24J06K96k76M47k15J64k88J10K2K31m58O0K62j63L69k64k12J61p6m6J29
6592C5j63K00l62K93j57K9K22k6R1Lm6m10L45j23K2k22qL15J5p0O4j65K02k82
6616a98L22k54l9J10J97J9j32M8k21K4K09k49K88L7j00J59k4oj68j25k83L08M81
$$ y = [68, 135, -232, -46, -55, 44, 108, 94, 46, -179, 67, -109, 33, -123, 116, -93, 10, -213, 52, 44, 311, 181, 37, -128, -15, 234, -129, 88, 90, 207, -36, -59, 18, -5, -109, 67, 114, 2, -86, -31, -143, 100, -41, -6, -281, 248, -83, 81, 126, 39, 181, -56, 236, 186, 152, 44, 254, 325, 276, 91, 139, -318, -141, 160, -10, 179, 77, 103, 110, 219, 405, -11, 109, -5, -58, -197, -158, -119, -110, -178, 9, -172, -86, -168, 125, -179, -74, -40, 6, -72, -32, 170, 70, -6, 112, 211, 67, 194, -89, 52, -24, -272, 88, -26, 86, 280, 53, 21, 25, 90, 280, 114, -28, -212, -217, -103, -240, -324, -218, 78, -198, 249, 34, 198, -90, 20, 42, 273, -185, -125, 137, -26, 343, 79, -133, 28, -48, -94, 35, -128, 72, -290, 3, -154, -125, 97, 71, 162, 165, 119, -291, 54, -69, -47, -269, -277, 38, 53, -17, 47, -118, 84, -198, 124, -130, -169, -59, 138, 157, 25, 73, -148, -124, 85, -164, 124, 161, 61, 220, 196, 190, 22, -103, -386, -78, 403]
6639D03m02o2L44l91J96k94PJ95j88J15L0K21j38q0j42nm3J80p2k7P1j10K70j55
6663g7m2OJ66J19l17J98O2l31L01j86J69k91N53k41j6Q4k2n01M06r4K78j53J23
6686A94j59J44j74J7K41ok52Lp3J57j14j26K38r4j08J53j9o7j95Q6m9L50j89m9
6710i1K96m00J98q5l5j20J26J96O0j55M2J4P5k20P5K31n7r9K4M6j63J52l49R5
6734a44R7J41m3J19j48n6j67J53m7l28L25p7J09j03J80n2P1o4N3j49L53l29J78
6757G2R7j17j14J35K47l36k65J91L56k37j97J52r8P0M5J94l64q7K38K38m90J15
6779a55j72N92l48P6k27K36m7q1K91n4J9l7j75l9K6K90Mj79K19k30J21j32j60
6802a62O4J00J1J5jj39J06K40l13J99j02K2j57j12M5J76J38j70N1j11L16j74j77
$$ y = [403, 1, -61, 283, -108, 88, -206, -199, -4, -192, -77, -47, 174, 36, -44, -186, -191, -234, -54, -126, -153, -82, -192, 78, -77, -119, -113, 53, 172, -145, 53, 115, -216, 85, -101, 68, -223, 330, 89, 73, 157, 135, -366, 40, -54, 224, 71, 194, 35, 179, 5, 22, 263, 257, 5, 8, -65, 92, -22, -148, 90, -4, -112, 41, 22, -45, -240, -154, -203, 147, -42, -91, 205, -195, 3, -82, -117, -237, -111, 85, 145, -10, 32, 46, 121, -99, -24, 207, 150, 51, 75, 121, -42, 110, -239, -144, -47, 94, 51, 170, 22, -34, -201, -48, -95, -423, -98, -175, -66, -169, 11, -41, 30, -34, 19, -130, 223, -106, 72, 169, 52, -62, 73, 320, -16, -281, -90, 266, 29, -168, -16, -114, -44, 1, 195, -169, -256, -18, 220, -270, -155, -327, 265, -83, -7, -234, 2, -45, -126, 165, 111, 130, 93, -82, -121, -95, 195, 199, 20, 239, 9, 130, -2, -162, -98, 2, 13, 28, 27, -112, -6, 234, -79, 120, 18, 40, -117, -229, -184, -8, 130, -40, 11, -100, 216, 42, -135]
6825a35J26J86N5j60j27j19K28K68m98J55j81K50RK08o91L02K12k91J34J04J04
6846A39k50K85k6m73L79n41N63k54K53j65j96N27j24l17K32Jk8k08P6mK52j69
6868d8L6kn2K4PK4N7j71P4J33Ok56K50m1j20qj90J48N1J15r3k1l6Q3J00k60J69
6895b1J67k96M95p3j7m70J93j41K58o8l80K46K3J0r9l0L54P4K8m49M40k27k37
6918b20J21l2K47j11j95J68Jp0P9M39m17MJ68l90K77m1k3K2m9P9j7l2J57N7k46
6943b4q4K42j33K4j28N3q0R7m27L13K06j58Q6J58j61R7j48K21k22k14O5L20K64
6966C67j71l32K40q0k2k41K94P9k65K74l0l58J19O7n9J50r9j04J62J95j70K01
6988B17m05L36j18o4k7L49j30j65J51k31J67k23J96m04J03J38J63k17J56j01K8
$$ y = [-135, -9, 177, 232, 72, -55, -174, 54, 322, -176, -21, -202, 48, 57, 265, -426, -124, 88, -203, -69, 35, 139, -111, 174, 148, -325, 54, -487, 76, -178, 75, -90, -286, 241, 117, -200, 32, 33, 5, -203, -127, -131, 121, -48, -12, -14, -66, -42, -35, -11, 46, -125, -51, 82, 88, -168, 82, 41, -79, -87, -277, -129, -78, 37, -56, -77, -113, -30, 70, -190, -21, 146, -150, 345, 272, 255, -215, -22, -163, 95, 27, -353, -107, -84, -74, -173, -203, 151, 225, 253, -196, 244, 17, -220, -99, -131, 116, 5, -190, -22, -21, -91, -12, 427, 10, 14, 182, -208, 69, 28, 5, 27, -22, 57, 40, 8, 165, 222, -24, -108, 134, 1, 25, -103, -50, -130, -33, -460, -147, 59, -99, -13, 145, -16, 81, -67, 154, -68, -282, -217, 103, 367, 196, -136, 104, 24, 2, -239, 55, 134, -131, 143, 113, -245, -126, -59, -118, 32, -67, -171, -9, 186, 16, 217, -188, 148, 30, -34, -61, 288, 158, -7, 144, -87, 80, -143, 53, -351, -248, -110, 53, -164, -8, -109, -81]
7009h1r7M48k51o4q7J65N7r8K04k78J1J6J10J0q6j42L50j77k4j70K83J1j89j35
7033b14J85R6m6j1k21J41L82p0k45J70m41L91k62L98k48k90M50j26O7j58j35K3
7055a64M13j66J98l58J84k04K35Qj66j56O9J57j1j4j0K6r8J00k02N9O9M11n15
7078a35K52p5r6j4J91p0Q9j68j47M03j99J0N2j22K42k00k47J48J98k48L33k97
7100a00L2K21p0r9j66K74R8m19J03K03j09j90N57q3j34L42m09nj66K55%j03J07
7123A39j1k17pL0K01k81Q7O2O1j01K46j67R7j23k85L74l42M7M00j35l01L17k48
7146a57J3K95k20r1J82J05j32n8P4n3p9K55l16L36j25Q4j83O5J01m38L57Q6j99
7169i8J24k63M43n54J56M5QP2l1L54j36n9Lj03J09j44Q8m3k7J8P0RK00j37j73
$$ y = [-81, -178, 270, 19, -45, -132, 33, 90, -8, 196, -82, -71, -55, 55, 65, -21, -163, 187, 10, -14, -184, 99, 110, -79, -214, -29, 67, 21, 10, -211, -70, 312, 242, -3, 167, -274, 117, -145, 253, 5, -285, 165, 39, 106, -52, -187, -164, 249, 83, 281, -77, 107, -97, 138, 146, -20, -176, -107, 50, 39, 25, 15, 41, -57, 43, -159, -100, -31, 380, -135, 117, 42, -54, -68, 123, 53, 142, -26, -173, 230, 31, 41, 93, -29, 213, 13, -234, -86, 112, -136, 197, -100, -68, 153, 83, -16, -182, 92, 190, -229, -126, 77, -32, -222, 335, 252, 118, 460, 51, 46, -120, 135, 135, 32, 139, 128, -89, -96, -66, 135, -146, -59, 3, 64, -37, 209, 42, 139, 16, -269, 105, -237, -190, 210, 75, -226, 91, -157, -144, 151, -69, -160, 22, 127, -5, -63, 11, -42, -121, 134, -182, 154, 29, 113, -70, -5, 96, -342, 15, 101, -98, 26, -237, 206, -348, -192, -147, -139, -67, -98, 256, 120, 61, 64, -39, 70, -74, 14, -29, -56, -38, 32, 41, 241, 104, -69]
7194f9p1K69j01K47o41N26m1j05R1j43M0L7n7O6k07j00Q3L39l98J13PJ22K51l41
7218h3N1k27L80j23j27J54l3r7K14n3j03J57J02k61K77j46J20k71K4J07o9K17
7240B10n01L88k26n1Q1R9j69L9J68k02P6N5M1O1J4J18j83K5N9j52j4Q5p5j92M89
7265B43k47q5J62k12K7N34l03k95J54J68j97m5J9l11K40O6n0M51k61j05J37j40
7287e0J36mr2L55l30Q6m00L02L20n46M76l92J22n8j6J54l5M8k6L4mk5k79K10J42
7312A28j14l1k03L13nk6R0j14j29J31l8k17K50M7O3j37J19p4j42K38Q4j53j33
7335e3J31k87L75l12K5O6J27m0J39n3P2p3j65Q7O4l63L77k10J51r6j39L70k9L0
7359A94O7m0m58J28j24N20l23j76M42l88L80l06k0J17J0K86n13J51R6k93M38k92
$$ y = [-69, -140, 129, 28, 275, -366, 160, 119, 14, 105, -38, 2, 39, -18, 48, -159, -259, -176, 163, -235, -122, -115, 7, 258, -83, -32, -259, 121, -2, -129, 25, -8, -105, 109, 56, -47, 110, 212, -49, 228, 82, 202, -69, -45, 62, -7, 210, -291, 97, -129, -180, -99, 0, -169, -130, 38, -164, -88, -33, 8, 69, 83, 201, 18, 43, 102, -50, -64, 21, -54, -246, 243, -4, -89, 73, -139, -112, 422, 119, -176, -22, 146, -51, -96, -77, -388, -148, -82, -132, 319, 58, -47, 90, -50, 86, 82, -10, 345, 15, 101, -299, 3, 323, -223, 253, -139, -17, -75, -91, 63, 28, 76, 50, 84, 80, 55, -224, -14, 128, 14, -17, -220, 93, 88, 62, 152, 38, -91, 40, 2, -215, 35, 82, 145, 8, 127, 53, -89, 149, 233, 80, -53, 78, -209, 166, -146, -121, -55, 72, 32, 171, 118, 190, 117, -48, 39, 103, -260, 117, -93, 58, -38, -177, 193, 164, 194, 261, 221, -237, -109, -233, 287, -36, -212, 230, -158, 222, -84, -104, 13, 23, 309, -204, -53, 43, -250, 188, -104]
7381a04k57M68J6k32J7J41J87q0K65m99J41J4k15N9J81j29J04r5J2OJ05O4l93
7404b24L63l06R5j15l1J37J25j39q1J63K03n91J69L67k80J77K35l51J40j67J63
7425E2qj06q7J10K8n6J29o9j47lJ66k57J39K05m5N9J7j60K90j75k37K45k01K23
7449A12j83K67p5J1J40m49L88k79K45l23J54J6Nl31J57K40r0J9J08j51l6R7J6
7472E8J1j25J67l97L88J13m11J68M37l49q7k60M86l04K52J01k38O8R3j21j03M09
7494C56m89L23l32L6K9J10M5q8J81k15p5J87j2N1k21K7k11M7J43o9K58j35J16
7517F2l1j11L1K39k24J63k43Q1m8J34N1j60J12N7k77J36j00Q2Rk85K53J22J63
7540B16l00j54L77J01l77N9K08j16o0J53j78j9M69m34j06N9J35M0j4k68K52j18
$$ y = [-104, -361, 107, 123, -109, -92, 49, 236, 156, 421, -78, 63, 77, -138, -79, 102, -27, 77, -18, -6, 0, 105, 169, -224, 139, -167, -72, -187, -218, -81, 44, -95, -176, -13, 190, -401, -232, 135, -145, 32, 267, -84, 56, -111, 52, 44, -62, -149, -39, -11, -67, 62, -7, -154, -157, 9, -248, -109, 96, 51, 110, 127, -33, 257, 82, -155, 90, -111, 112, -71, 196, 121, 132, 272, -177, 211, -68, 177, -146, 8, 24, 29, -302, -145, 95, 5, 24, 132, -19, -55, 42, 58, 69, -56, 111, -286, 102, 215, -196, -28, 409, 60, -27, -287, 199, -105, 147, 248, 10, 78, 171, 50, -53, 356, -133, 190, -142, -106, -77, 33, 78, -10, 171, -44, -119, 68, 56, 107, -114, -87, -298, -251, -108, -177, 81, -54, 62, 31, -80, -49, 190, -34, 129, -114, -33, -81, 53, 104, -56, 56, 113, -164, -28, -128, -46, -37, -322, -69, 53, 216, -84, -238, 139, 240, -137, -78, 130, 14, -46, 107, -71, -90, 379, -55, -161, -102, 33, 73, 59, -209, 43, -75]
7562g5j78L04q7j55L11L2j76j11J04q9r1J59k7J61m28M01R7k77l5J40MJ4o3L5
7586c0N2K2m1j57J83j47M15j76Q1l15j00J63K13l23j7K29J92j60k01M26l8m67
7608a96oK66j37J44M0k12L5Mk6J81L1j37j92J50o9L13j98jl4K77l50N1j76J39
7632a03N8l1P2l4J14n7n1l2L4q2m5K24j95J52J07j46J4pn2j12K30k13L59j54J22
7657A72j11k08K9K35l76L64N1j63K35k68k75N03l57O2J09R9m4k10J38k01jM56
7679B39m24l9M02k41J85k05K82j97l37L51J05m3j51j08n1M15k91K93j75o7O0j34
7701a31L42K6k19J37j48J03k16Mp3J86L5j86J29l6Q3kJ89j74o6J48m0o6P4k55
7725a56O9L12j15J09j45l6k31J16J50j65J06n1J63l71L21k04J66J0j46L8M7J2
$$ y = [-75, -253, 51, -36, -191, 120, 152, -24, -135, -31, -120, -211, -52, -79, 82, -346, 55, 152, -125, -160, -20, -16, -2, -65, -30, 22, 44, 3, -154, 29, -118, 297, 121, 202, -113, -213, -50, 163, -160, -177, 52, 244, 84, -117, 309, 271, -196, -202, 64, -73, 71, 111, -101, -66, -62, -88, 93, 124, -13, -205, -55, -124, 189, -9, -10, -44, 233, -117, -66, -242, -103, -45, -76, -4, -38, 76, 19, -32, -64, -30, -112, -157, 67, -128, 24, 131, -15, -1, -8, -60, -172, 58, -155, 204, 50, 172, 61, -147, -118, 117, -259, 105, 156, -7, 228, -40, -315, 188, -169, -107, 2, 101, 57, -153, -15, -216, -217, 239, -185, -224, 178, -63, 122, -83, 199, 2, -335, 16, 121, 78, -73, -181, -232, 183, -108, 185, 10, -57, 3, -131, 211, 237, 18, 155, 7, 110, -106, -102, -175, 11, 46, -140, -11, -47, 36, 34, 223, 49, -17, 131, 91, 25, 99, -156, -87, 225, 110, 219, 74, 38, -193, -77, 73, -92, 14, -37, 126, -245, 76, -128, 38, 48, -98, -60, -13, -1]
7747aj37Q3j5K6K65m5l51P1J16k54K12J19k05L82q2j23k31J85L8Q4n5N1j37j61
7771a65K81k81R0N4J29j8k58p7M15o2j84L06l23K18L4m3j16j57j21K85Q5j98o4
7794a70L50l33j8L89l80J55N7Q3m3k40J23j15N2k6kJ31lj25L91k66k6R7P6k61
7818a04K07k26l42J67N18j95J42Q9k25P7j36j34L40j51k80L17K1O6Q4j18l5j90
7840a08j80M34m00L71p5J04m8j96K4J68P1j85j13M93l20k65M94m56J35K89l40
7861a03K53j49j7k6o6L0j22K03o0m2j53L76O5l75k9L0J57l6K63J17j31k08J38
7884A15j22R3j78J92k89L44n10K10Q2n7J47J0K00j95k7m2q9j8L09o1l6O3j88K1
7908b6Q9j57L11k29k34K40o0J95K13m54J17J93q4j91J74j60R2k20M17l67L3J97
$$ y = [-1, -138, -55, -70, -44, 221, 176, -175, -104, 12, -242, -30, 89, -116, 266, 184, 61, -170, 15, 53, 137, 82, 133, -4, -165, 116, -165, -75, -21, 108, 90, -168, -245, 170, 108, -76, 230, -93, 125, 159, 116, 0, -157, -278, 7, 92, -106, -170, 180, -153, -171, 218, -162, -7, 50, 133, 90, -150, -27, -142, -90, -116, -118, 13, 10, -115, 276, 10, -16, 81, 157, -104, 103, -123, -465, -298, 220, 25, 167, 256, 31, 108, -28, -162, 178, 27, -253, 64, 85, 151, 235, 117, 82, -108, -288, 146, -254, 117, 42, 146, 98, -98, -74, 94, 165, -20, -133, 360, 40, -225, 269, -187, -52, 237, -103, 150, 1, -16, -42, -108, -78, -200, 3, -57, -99, -252, 124, 189, -186, -215, -185, -28, -64, 199, 316, 185, -23, 115, -7, 86, -92, 100, -189, 155, -355, -145, -63, -120, 27, 37, 237, 42, 15, -27, -116, -134, 175, 114, 78, 141, -47, -26, 63, -94, 217, -12, -246, -6, -66, 129, 342, -112, 5, 198, 114, -77, 97, -63, 29, -191, 226, -141, -108, 89]
7930H9j28K33j28kj59J00KJ30m5k47K99p9j61Q3K06r1k07M63m70O2L11k51j2o8
7954g0j41K94l30M43q2n8j15jL17m98L85j07O5l41L94k3K8k90oK11k25J67j40
7977a23k3L45j11M0M4k34L34k17j64K07K0l34J87L0J2J65k12J72k47q1K24j29
7999i5L6J64j66p2L15k04L2K30l81l1K50J79o55N85j09j2J48k74J06L5j97J15
8021aj9J92l35J30J29k89j19L88k92K14O4o5K98l46R6P8j53k74N36j70J9m1Oj89
8045a43K61j46k00L44j94J45j66K01k44K9J99k45QJ10P4%J2j01J92m6n5N8o6j53
8069a26M81l91K79n3J06m36M6J5O1J55L4J56k61K7k0k10J30Kj6n1j50J09J19M6
8093E2L14m72J07J9j02n4mK02j20K74j05k75O2M1J82l33L93j53K3R8L9j5m28L48
$$ y = [89, -39, 194, 66, 64, -95, 5, 7, 137, 92, -155, 144, 65, -96, -13, 193, 102, -105, 358, -112, -50, 261, 10, -2, -70, -211, 83, -247, 196, 114, 56, -59, -60, 257, -241, 144, 37, 102, -239, 155, 132, 160, -130, -136, 75, -150, 17, -123, -146, 199, 88, 128, 172, -62, 272, 55, -109, 98, 118, -216, -29, 1, 13, 178, -34, 138, -109, -190, 34, -95, -59, 105, -61, -133, 182, -22, 10, 240, -141, -172, 78, 257, -398, 187, 78, 66, 214, -60, 46, 81, -116, -1, -20, 172, -163, -33, 96, -193, -312, 76, -216, -2, 62, -3, 295, -51, 45, 123, -30, -304, 232, 62, 81, 40, 46, -143, 118, -28, -228, 116, -78, 67, -99, 102, -142, -113, 86, -159, -151, -41, 33, 33, 45, -56, 136, 90, 35, 93, 27, -126, 355, -36, 243, 190, 296, -140, -94, -79, -18, 137, 171, 327, 66, 93, 73, -137, -7, -5, -21, -72, -222, -113, 6, 52, 366, -106, 1, 20, -82, -136, -140, 62, -58, 216, 111, -164, -102, -61, 121, -212, 181, 28, 51, 149, 188, 173, -255, 93]
8117I3r1Q9p9r5p0J36j40J18j76J93j95J92r0O4L6P7k45J89K1N6j77J39j71Q9
8141c7J60k27K5q9O4p0O1L83j17n1J11l51K37m2N3K1l05J26J80p3K5o0rk3O8j78
8167a18K24J57m44r6L56J3q5k88K75R4j24L24k51j45J36J97k16j46K13M3k22J35
8189C2K04k82
$$ y = [93, 2, 91, 12, -83, -153, -17, -157, -39, -215, -22, -217, -25, -115, -51, -15, 62, -183, 6, 27, 83, -94, 45, -126, -37, 123, -104, -79, -168, -104, -174, -113, 270, 153, 102, 213, -138, 99, 57, 110, 131, -174, -48, 132, 59, 84, 24, 15, -8, 60, -118, 106, 263, -181, -277, 79, 92, 7, -281, -6, 88, -36, 288, 37, -108, 28, 225, 9, -137, 76, 119, -103, 32, 236, -46]
8191d6
$$ Imaginary data points
##PAGE= N=2
##DATA TABLE= (X++(I..I)), XYDATA
0@%%%%%%%%%%%%Qj6J6j6J6k4L2m0M8n6O7p5Q8j04J23j46J68j92K22k53K87l25
34a72L68m16M67n23N84o52P27q09Q98r97J105j221J349j488J639j805J989k192
52a149K415k663K941l254L609m014M482n031N685o481P473q751J0468j2912J6698
67I516k3412L8959j45557q0267J23106o1272M939N3134O9017K7426K9369k644
79D2314L4302M4528P183l0550R411J0260r579k5106l7364l7334J3250j0786o8542
92e8013l4527L0720L181k4738j2296Q120K8454L2922n664j1052L2463L9557l502
105B5625p472J5577J5575N717k688j7425N174K2253k0482m0392k4J4045j1016
118D467k6085j8239M775J9543m484k5422K159K7169M594j5119K733J4935J1561
$$ y = [0, 0, 0, 0, 0, 0, 0, 0, 0, 0, 0, 0, 0, 8, -8, 8, -8, 8, -16, 16, -24, 24, -32, 35, -40, 48, -56, 67, -79, 89, -103, 119, -134, 153, -172, 196, -220, 247, -276, 308, -344, 383, -426, 472, -525, 580, -641, 708, -780, 859, -946, 1043, -1149, 1266, -1397, 1544, -1710, 1899, -2115, 2367, -2664, 3021, -3460, 4013, -4738, 5730, -7182, 9516, -13896, 25063, -120494, -200761, -77655, -138927, -133988, -80854, -11837, 15589, 44958, 42314, 76616, 121144, 128327, 97777, 107188, 117448, 107869, 82763, 45399, 8065, 21315, 10529, -58013, -92540, -61820, -58639, -83377, -95673, -87553, -59099, -26177, -31841, -42893, -10430, 29127, 25625, 18153, 33730, 49305, 55022, 52334, 34909, 40083, 62336, 41854, 1462, 1438, 15483, 4467, -21618, -39857, -35082, -15539, -20023, -45445, -43286, -16117, -11523, -26642, -23909, -8974, 2587]
131B587O866n126j143K2167J2927j6991j0942J1789J3123n824k3117j3305J5225
144H236J2403k2735k7563P891K0033p133j9158k540J4057J3493n752j4640R336
157a4072K4509K295j2923m97J5373J4006n351j8719m185J9853O576k5334j8089
170a6558J4884J3654j1364j7841k657J3125Q476j1915j1250J0553J5662j418j0387
183g036n47J3291R020p017j2420K476J7392J977j8766p221J4118Q135j1035j3370
197a1003K838J4062J030j2888m492R643P753o189r671K239R532K084p746o688
211i496O831J1546l722j3732O42J3601M592j1057q445R995J1137m980j2016K13
225d891J1493L491j1276o511P547O232l876q527l061P582O046o635q905M634J2718
$$ y = [2587, 9453, 4327, 3184, 25351, 38278, 21287, 10345, 22134, 35257, 29433, 6316, -6989, 8236, 20639, -2096, -29659, -21768, -1735, -8868, -28026, -30566, -16509, -3016, -8768, -23408, -14072, 10437, 12732, -191, -688, 14685, 28691, 23340, 4621, 436, 20289, 26865, 1531, -16558, -1674, 11980, 616, -17225, -19882, -6757, 1719, -10196, -21446, -10893, 4769, 3351, -7036, -7583, 5708, 14728, 7711, -4709, -2233, 15159, 17136, -1630, -8851, 5267, 13402, 2367, -11003, -8165, 5897, 6927, -5961, -10453, -810, 6943, 754, -8917, -6678, 2854, 4938, -2808, -9496, -2665, 8881, 5159, -8573, -7931, 5670, 10262, -795, -9240, 755, 11892, 6912, -5104, -4891, 6602, 10093, -1183, -7694, -147, 6085, 2209, -6318, -9379, -1797, 4249, -2386, -11291, -6657, 6061]
240F061J421j1945k269J0944O655p161r802L019J2442l64j1925k073Q336L882
254G221n881r000J136P780K321p697n618O346R900l551q909R59R549M149q105
269F00p774P232R503n872j0087K078Q245J481o534m142L944N584p93p607k522
284f664O728M483m436m892K143P386K614q782n044P784N361p070o905L008Q221
299C935k66o922j270N399M669l333o238J246O344Q71m847l859L434O180j707q468
315d832K12P398J813o408m946M777N729l181n881J010O877K364m628k465L958
330A797L297j361l936k809L001L805k851n620J331N854Q52o599k782N660M083
345C722m291m313K592O450j45n346k55M264K184k836l461N6L756N25l781l283
$$ y = [6061, 7482, -4463, -6732, 4212, 10867, 3706, -6096, -3077, 9365, 9001, -2924, -4997, 3339, 7221, 1340, -7660, -6524, 1256, 3577, -4120, -9738, -3392, 6508, 2957, -5952, -4993, 4556, 8705, 600, -7174, 58, 9561, 3689, -6398, -4320, 3925, 5406, -1128, -5270, -1326, 4258, 3465, -4142, -6664, 64, 4547, 111, -4781, -2638, 4748, 7362, -1420, -6464, 1320, 6681, -389, -7294, -4286, 3935, 3669, -3253, -4523, 876, 5545, 2212, -4026, -2780, 3564, 4435, -412, -4271, -837, 5343, 3636, -4832, -4620, 2778, 4591, -1817, -6763, -1986, 3743, 562, -5319, -4309, 2568, 4932, 304, -2161, 1797, 5094, 3733, -203, -3012, -11, 3794, 943, -4677, -3346, 2508, 3360, -3239, -6021, -361, 3722, -569, -4882, -2290, 4160, 4015, -1331, -1586, 2678, 4862, 2026, -1435, -1379, 2377, 2902, -879, -4162]
361d162J704M251r32n163j8N687K258m149k951L618M248k423m149O69L962J075
377C525l306k027K027J801o39l049k150K708K689j722l330J036L792J734m060
392i71k713M424L418k640l873J700M057m26m553o92K608J002j098k294J18K777
408H44O05k116j457J086K572n14k455n3L145J243k266k424J545K768j973k883
424b333P49K245K86j449j395J581J438l70j462o07J401J909j131k265N68K189
440A354L05l014j166L130J324k442j669J361K364m67k839J50K535M20j096o40
456c90M04J454K65j411j761L17K009o58k482J92K598J103k314j301J311K301q88
473G49k045P08K187O07j551r93O21J038m77o79j242J23J616l41j949o10J982P58
$$ y = [-4162, -2458, 1793, 861, -4302, -4320, 1367, 3625, -524, -3475, 143, 4391, 1968, -2181, -1512, 2450, 3525, 219, -1808, 219, 2020, 1381, -1668, -3818, -1110, 1579, -143, -3473, -2437, 1355, 3089, -971, -3684, 740, 4158, 1518, -2355, -655, 3402, 2976, -1577, -2269, 339, 1341, 243, -2051, -1933, 844, 1449, -667, -2124, -1038, 1534, 1020, -1435, -1488, 1657, 2900, 634, -1790, -245, 2523, 550, -2333, -1584, 661, 947, -502, -1897, -316, 1122, 752, -710, -1317, 84, 1993, 862, -1403, -835, 1354, 1659, -1355, -2521, 609, 1933, -509, -2178, -817, 1547, 1080, -1759, -1609, 926, 1346, 250, -390, 14, 1468, 1733, 322, -1439, -1122, 887, 229, -2253, -2061, 537, 1640, -674, -1975, -664, 1637, 749, -1296, -588, 1599, 2206, 655, -338, 283, 1321, 844, 165, -1077, -954, 662, 321, -1628, -2238, -256, 502]
491E02j461j139K460J704j261j408R38J164l16j460K04Q81l02Pr6p73J11K26l98
510d17p46r39J321N51o48J94J310N62o20p17R40J031j230j129J054P73j034k82
528b6j74k64J60J47k62o16K83M65K3m33Q8P28Q19j150l93K028P58k099p61J079
548D00M75p14j163J20Q63M93m74m57N19p4l1m77J14m83P59R81j634m3J957j83
568I48j126m94O54P31n10n51l07J086M22o99n70M14q2L59L80q91o65J168J54j257
588h36J3P00L37m79k14Q48P73p14j100O25P12k65p39O54k25q4K29N52j000o37
608h50K38L67P6l80m3M07j47M9N03M29n49r6O79K08p39J26L87n26k45K70n16j59
630e11J84r4M16om65R1L65k20m33O82N22q05J77J013Po63k85O38k41k31l28pJ06
$$ y = [502, -959, -2098, 362, 2066, 805, -603, 335, 1499, 1183, -277, -73, 808, 506, 513, 417, -356, -245, -19, -417, -1163, -2102, -781, -230, -878, -684, 626, 1188, 568, -149, 791, 1822, 592, -537, 517, 1290, 256, -26, -200, -464, -304, -157, -419, -1035, -752, -287, -264, -697, -609, 119, 938, -212, -605, 1423, 2181, 82, -679, 400, 875, 161, -1002, -882, -19, 474, 0, -457, 62, -12, -43, -520, -406, -889, -130, 851, -783, -826, 1131, 948, -178, -672, -18, 713, 203, -348, -655, 431, 853, 154, -416, -2, -84, 275, 655, -236, -901, 267, 421, -836, -823, -123, 214, -265, -479, 369, 1142, 428, -672, -47, 665, 400, -339, 315, 90, 6, 235, 787, -213, -850, -612, -245, -169, -549, -592, -185, -332, -283, 220, 649, 100, 4, 683, 891, 152, 278, 665, 139, -106, 164, -352, -511, -327, -421, -5, -11, -476, -385, -20, -240, -673, 9, 531, -274, -97, 916, 923, 260, -25, 613, 372, 141, -187, -194, -88]
653h8j67k46M86j81j61m2J68L23p55P90L98k57q3K24L8n36m6mO89M8n92j06j23
676b23k31j48K47m2k18M04N9J74l17P93k60m5l5L5K97j35n49M46M9l22m79L48
698a52K65o26M31J88K4j21n8N64l22m56N35J91j93m11p7M35j93m13M33k20k00
719c76R7M88L0l23k23L94M1j26k27L0K16J14J82m5j13k18k10K30m14J51O9M91
741B58n24J35J16M64n54J53K76j18l60K40J98q5m16J69L63l40l46K71L03k82k06
762b85K45J42j46l31N38J42k80J63K85P7l60k3L16n90m2j63J54J99L9m01N29l19
784a11l42L86J60l15K9K30M61j56l26P22n21j19k35N98p52L54j06n8j6k31O2K49
806c7Q5l08L55J66k06r3k7K31K9n25M26R2j41j04L67l46j06k4n5J0k26M27M1k15
$$ y = [-88, -255, -501, -15, -196, -357, -399, -231, 92, -663, 127, 525, 268, 185, 409, 447, -89, -135, -139, 550, 598, 6, -100, -223, -454, -602, -355, -397, -615, -211, -152, 22, -295, 498, 238, 193, 158, 193, 490, 355, -194, 252, 301, -21, -500, -152, 113, -513, -82, 106, 130, 9, -49, 515, 193, -263, 272, 463, 270, -141, -218, 217, 24, -389, 44, -176, -376, -279, 209, 239, -84, -307, 87, 128, 2, -225, -195, 21, 135, 317, 272, 159, -59, -269, -39, -453, -302, -233, 258, -266, -131, -15, 449, -105, 48, 324, 206, -154, 86, 284, 199, -217, -48, 315, -25, -371, -100, 203, -79, -285, -40, 102, -44, -375, 163, 305, 25, 188, 473, 550, 190, 167, 483, -107, -149, -312, -158, 41, 80, -321, 208, -111, -453, -67, 93, -222, -193, 37, 498, 342, 16, 738, 217, 98, -137, 461, -291, 63, -43, -101, -117, -348, -286, -37, 48, -260, 95, 261, 55, -38, -65, 166, 195, -330, 96, 188, 47, -57, 310, -36, -142, -166, -221, -211, -437, -10, 31, -184]
830a84K06J17m1j82J90O1Q4l5j96P9M4p5j71J98q2j58l00P74k48r1J85k07J03
853G1j31k0J4K42l95K81J48j99N7P2K5K0k76R3M2n4j6j83N11m64o0L14kr1j50
878a51L61j18j04P8k01P9l43K23J39O4j40J77M1k6m16K90K34k34j78L82j74J03
900H6o9O5M3k01j01P5mNL12k09K34k12r4N71n72j2M62k44N1k69p0J92j17l64L89
925e3J35k74M2K31k11r5J9N6K05l08M94J06o0m13L01J16q3l10o8R6JQ2j2k73K51
950b5L00l25L6j47K10R7O6k74J57J9M04o89J39K2k20k9K49J79k25j12P3J14M7
973F6k0n6J31Jm81N36j80P4q0K11j86J4N7J48n00N1K69j49n2J2m4M02l03J33j5
998C9p9k7ML19l43J01k8j9m6J27Oj04K98n04K00L79n45K9L26k41R0rK90M9j16
$$ y = [-184, 22, 139, 98, -84, 106, 167, 251, 216, 20, 99, 143, 68, -103, 95, 13, -145, -445, 329, 81, -10, 175, -32, 71, -60, -80, -66, 176, -219, 62, 210, 11, 68, 140, 165, 185, -91, 2, 44, -10, -26, -209, 302, -162, -222, 92, 90, -1, -151, 210, 92, -12, 66, -135, -56, -399, -176, -37, 27, -113, 64, 105, 79, -337, -47, 187, -47, -225, 157, -17, 86, 17, 82, 125, -76, -177, -102, -106, -101, 211, 2, 236, 24, -70, 501, -71, -83, 379, 135, 186, -83, -153, 39, -78, -442, -53, 82, -192, -150, 81, -130, -225, -206, -150, 55, -253, 241, 347, 287, -126, 175, 291, 208, -102, -170, -74, -73, 9, -3, -276, -25, 275, -50, -14, -161, 49, 146, 212, -62, 95, 114, 518, -171, -32, -10, -230, -259, -10, 169, -56, -168, -95, 19, 66, 46, -10, 121, 122, -359, 177, -3, 71, -9, 202, 16, 30, 87, 235, -265, -214, 55, -94, -146, -134, -178, 224, -79, 54, 39, -40, -67, -63, 256, -87, 14, -14, -33, -79, 48, 54, -50, 248, -256, -56, 323, -222, -193, 133, -108, -18, -27, 263, 312, 196]
1023A96n05J92L34k04k05K73M5k03j77L23j04j23J89J05j29lJ21j45J50J46k80
1044dQ3Q9k69K58J78m15Q1j08L36n08J06M95m4j03k64K34j13n4J26Qn9m8N4j30
1068g1j20J57l9M2J32j58P2K24k23k94K72K51m1j32l1Ql11N74J8l39k49L56n4
1091D4k12K5K73j73K30j20J04L1j88L13l75J43l8J16q1J29l73j1J21K12l49K81
1113A02o8J29l98K99j01j02K1J48j00L4R2kK86m27J26o5k21M21j45J3k80K76k9
1136IJ32l56l03O41l4q7j79m0J61j75o1L71j64J66L87n56l05L33k30K96R7j12
1158iJ76l38J71M0n2M5q6O5q9k7n0RO7N0m0J49j06j14J6Q5l7J37l8M9l4Kj04K49
1186A86k28J43j41K8K54O1l65j23j6M64Q9n50K05k01K48Q9l29J96L9l4J8PJ14
$$ y = [196, -309, -117, 217, 13, -192, 81, 126, -77, -254, 69, -35, -158, 31, 136, 7, 4, 125, -20, 130, 276, -4, 79, 168, -101, 157, 335, -80, 1, -107, 229, -279, -173, 322, 278, 175, -89, 145, 32, -22, 104, 112, 53, 5, 59, -71, -191, -34, -73, -31, 101, -57, 15, 239, 16, -278, -6, 245, 204, 72, 41, 49, -262, 312, 330, -9, -258, 98, 44, -168, -143, 130, -43, 187, 67, 171, 202, 14, 327, -48, 95, 57, 173, 92, 221, -152, -163, -42, 170, -179, 102, 34, 163, -235, 64, -37, -139, -118, 30, -70, -36, 56, 54, 340, -87, 39, -26, -247, 174, 29, 42, -238, 38, 9, 141, -215, -518, 123, 89, 2, -177, -217, -56, -231, -292, 79, -85, 81, 468, -88, -393, -60, -290, 6, 103, -9, 167, -171, 0, 40, -12, 33, -53, 12, -77, -104, -154, -145, -78, -28, -68, 81, -25, -139, -123, -38, -75, 62, 24, 73, 39, 41, -63, 186, -42, 101, -40, -12, 242, 303, -62, -185, -201, 263, 352, -198, 7, -194, 54, 143, -186, 10, 49, 15, 33, 40, 154]
1209A54m61K38j25L28J23l20J55l4J00k57J12K44j75N6n7k04M8j50K51R3M0k7
1231A32l70k0K35k47K98J11L8j51k55K38o5J38p0J80j52rj36J82j31Q5l9j12L58
1254B38l58J94l53K9J9N09R1j81r6L5j63M7n5j9J8k98K52J84o0j17J68K34k88
1277C0K8K6k8J2p4j83K12J85l06N5NpN9r5J97m45J91J92l29K19N0m6J1Q7R0K9
1303A65l22n0Q1l2L31R8m15J2J01J39r8l8q2j7N3J86k65J64P2p4k73K06L0k6j25
1328a79K67n5J17N0J50l56m57O90k66j44k4J45L28k36Q0k39J78J47%J14l72p3
1350a35K61j41J89j61MJ9o1k41RR5J54l9K81m63L60m7J8l36L36j28P9J07j17M
1374D7Rl34N14J88m68K32n1j6j08l12r6M28p5P2LJ19j33J14m36N06j93R4M5j48
$$ y = [154, -307, -69, -194, 134, 257, -63, 92, 58, 158, -99, 13, 257, 82, 138, 81, -123, -75, -225, 26, 119, 159, 132, -238, -258, -23, -270, 28, 139, 177, 26, -229, 9, -56, 82, 12, 192, 40, 31, -105, 77, -54, 31, -8, -120, 238, -120, 74, -279, -250, -231, 278, 369, 188, 92, 127, -36, 11, -44, -63, -45, -343, -91, 93, 33, -84, 84, 318, 30, 58, 84, 56, 68, -6, -189, 23, 208, -98, -43, -38, -45, 14, -81, 116, -329, -138, 54, -275, -56, -6, -52, -41, 46, 136, 165, -157, -207, -126, -158, 173, 271, -144, -132, -31, 108, 10, -28, -110, -127, -74, 112, -153, 11, 83, 9, -264, -58, -28, -54, -179, 88, 33, 150, 200, 350, -6, -463, 227, -39, -183, -207, -62, 266, 30, 110, -129, 49, 196, 196, 310, -62, -135, 126, -15, 174, 13, 17, 36, -25, -266, -257, -162, -8, -47, 234, -229, 131, 84, 102, -234, 102, -26, 53, 160, 43, 47, 56, -278, 236, 424, -44, 188, 137, 121, 13, -299, -395, 33, -42, 30, 33, 152, 19, 133, -303, 203, 10, 104, 149, 1]
1398AK26j4k27J15r6k90L52m39L74j15K3k3k32K00J07K40j87K7k63J99J86j63
1420AmJ30j38J76o1k29M57l46P9j06J63j74j22L06l5J82l81L9K62j04p5J12k51
1443a19K02J68j91N6K38k52j20J51j50l1O5N0j60l5Q4j80N9J22J08k02J05l01
1465c33L2L85j34p8K44j22l2l30O12k94J25l2k59J74k10L18N3K01j14j19k15J10
1487a8o3K28k30q5K74l04K17KP8k84j01M29J93k59j86j08K92p1j66m2j41K66J31
1510E2k24L78k01P8J19j69m7p7q1K80j03j65j06M31o7L8k8p6K0L0K4r5o3k50K91
1535a1j51N31j44j39j39k42N12k56K3k27K24jn3J19o7K51l19j60K19O2r8K3O4
1558B1l5J28k90K70j41L14r1j99J73o7k16J68n9jl1j35K45k27P0j15L14p3k97
$$ y = [1, 227, 213, -14, 101, 5, -285, 67, -372, 2, -113, -90, -113, -345, -145, -38, 202, 15, 42, -221, -22, 164, 1, -3, 127, -11, 165, 104, -125, 332, -14, 65, -41, 122, -52, -174, 132, 97, 279, -102, -63, 199, 95, 20, 132, -119, 83, 251, 60, 116, 354, 102, -18, 133, -17, -48, 17, 67, -93, -128, -44, -224, -165, -43, 65, -137, -32, -333, -301, 84, -50, -128, 116, -6, -38, -368, 244, -50, 75, 43, -216, -42, -252, 66, 119, 320, 206, 87, -128, -18, -81, 147, -83, -168, 106, -198, 19, 21, 99, -185, -286, 143, 336, 77, -109, -217, 75, 4, -162, -204, -345, -79, 52, -172, 206, 5, 83, 202, 33, -14, -91, -172, 108, 5, -160, -266, 165, 98, 136, 108, 32, 52, 82, 106, 11, -52, -302, -11, -162, 369, 225, 86, -53, -295, 217, -39, -16, -243, -19, -20, -73, 46, -21, 230, -89, -249, -30, 32, -66, -43, 21, -14, 114, -176, 94, -47, 267, 176, -23, 150, 83, -133, 35, -24, -25, -56, -191, 54, -173, -103, -218, 96, 23, -274]
1581b74N39m61K1n7L25K8l75J74L0j92k4N47n61K87Q3K88j22P5j72J15n77L94
1603I1l1%m9P7J03j70j07Q2k96K13K70q1J78l22m0j8J5m4K21j36J10J32j06l24
1627b32K13J73l41J60M63m15k71M62j89j81rJ14J30j68J31rL86l38K7l04K62o1
1649CJ64n3nk76J73J99n30K07m8K4K30j56l6m3J71r1Q0M2J7j48Rj82O8K17n3k04
1675b21K20J6Q6m85L38J13l54O70l24q7L0q9J29O1q7l8j21r1J17O1n0L15l44K16
1699H1j36L01j81O2j53N8m7J66J8k27J18M9n5j30R7K42k47j56K54j53J14j49R1
1722A7j01N4j18L00k90K78m0k1Q2m95K44K65j18p2Lk53P7R5K00j85k74L72j01
1745h1J67l99K37J54l93K20m6L02j43o3j2R3j91L85n5k45n6J78j23L1k87M99j96
$$ y = [-274, 265, -196, -175, -232, 93, 121, -254, -80, -50, -242, -266, 281, -280, 7, 90, 378, 256, 331, 159, 274, -303, 91, 60, 60, 11, 88, 191, 21, -86, -4, -300, -87, 183, 102, 280, -42, -82, -100, -85, -129, 92, -44, 66, 198, 92, -232, -19, 154, -187, -27, 436, 21, -250, 212, 23, -158, -167, -53, 77, -91, 40, 31, 417, 79, 106, -198, 64, 3, 167, 114, 109, -167, 6, 205, -325, -118, -166, -142, 88, -68, -104, -147, 24, -67, 13, 55, 72, -76, -67, -249, -181, 36, -17, -221, -1, 15, 101, -384, -46, 67, -287, 383, 59, -28, 2, -87, 42, 103, 16, -22, -143, -234, -117, -56, -106, 209, -135, 81, -55, 246, 65, 127, -26, 32, -15, 151, 169, -58, 60, 109, 54, -76, 21, 263, 16, -140, 114, -39, 75, -74, 17, -84, -30, -148, 152, -138, 140, 100, 79, 161, -334, -90, 175, 57, -15, -12, -265, -188, -93, 107, -78, -352, 20, -81, 86, -313, -76, 78, -315, -95, -141, 161, 18, -45, -57, 36, -155, 230, 175, -70, -126, 52, -71, -40, -327, 172, -24]
1768b4n4j15N4L27K4k13R8o7r2K59k94p9R3J40o1j75J99l37K47J89m0k63K54N0
1792A20j81J59j9P7Nk32L0j09L1M09j83Lj54K43l4j57j67K10k0K6j21%K18K15
1816C69m59l0M9j15j0J75J00j31mj85J97O2J26k31P2J89j57N8k00J11k61L20K14
1839B59k48O1N5J3rJk21j72R6J95P9M0J39m64J09L6j31p8K03o2K49j71J27p9k42
1864b15M42p7m44L91P7j20J2m84K42M17k83j39K80O0n9J6j51J13j43l0m3P5K07
1887A44L2l96K06j85k4J81R2k28L67P6n4j00r5J4Lr0J82J20k30J01k35L99j57
1910A23M1k66L42l64K49Jl06J90J84p9j05j81M40j20l50J42J6J61j5k63L08k59
1932a11K36J29o14L99j17K50Kn04M66k33j74L34J30m05P1K70n3O0j68K17r4j56
$$ y = [-24, -78, -193, -139, 188, 212, -1, 97, 30, -62, 197, -97, -176, -83, 57, -4, -179, 20, -317, -70, 119, 79, -184, 70, 120, -61, 98, 79, 156, 161, -71, -41, -150, -119, 290, 107, 110, -44, 199, 165, 8, -159, 51, 31, 57, -64, -64, 154, 369, -90, -120, -71, -186, -196, -21, 79, -52, -56, -241, -44, 18, 144, -87, -15, 174, 17, 75, -125, -14, -275, 45, 259, 11, 72, 127, 140, 131, 132, -89, -261, -165, 30, 109, 149, 288, -176, -67, -31, -162, -240, -37, -99, 150, -21, 106, 27, -215, 227, 150, -294, 97, 174, 54, 66, -418, -176, 241, -42, -181, 99, 159, 100, 116, -35, 78, -65, -95, -138, -63, 144, 176, -220, -14, -199, -223, -42, 50, -178, 189, 265, 211, 111, 16, 30, 33, -57, 125, 245, 15, 116, -119, 280, 123, 164, -102, 240, -124, 125, 126, -180, 10, 194, 115, 10, -171, 269, 149, -201, -59, -43, 118, 103, -160, 148, -111, 125, 254, -360, 39, -78, 172, 174, -330, 136, -97, -271, 63, 193, -212, -141, 129, 76, 136, -32, 185, 91, -65]
1954f5L17r0m37K38k68K79K45k82n6L10o3l3j23j66J62K28l74j63P79n63J77J38
1976A90j64K55k37M7K7N7j29J27j09m60L12J23j93o3J38O2J10n0Q1j16n1J5K5
1999cK53k92Q9n4n2J91J22j75n6k33L58J6k72j83P9J28j56J56L2L80k12j25k73
2022b82K57M7j72P0J53r5k52J89K2j09J85j36J33p0N6J11m00M76j30Q7Pk12O8
2045CR5J02l89L17n6j2mJ23m92L00L69l35p0J19O6M7k37o7j38J77o9L24J30k73
2069C0K25l31j4J56L9j15j12m3L6J76K1J52k35L6o9o1Q2O9O5J2p9K30l06j9rr1
2095a55P3L03l9m03K47j22L91l40J7k00J47R1J2k0q1K9l85L66K7n2K19N5K5k47
2119d2J15P6P5k01p5J42k74l4J81j13J14p3K23Q5l80J61j19K94l67L17j57K72
$$ y = [-65, 252, 162, -275, -37, -305, -26, 219, -63, -119, 191, 128, 95, -28, -194, -32, 196, -178, -341, 438, -125, 52, 190, 26, 281, 44, 91, 118, 175, 46, 173, 64, -396, -84, 39, -154, -217, -79, -17, 93, 43, 124, 8, -43, -28, -3, 250, -42, 47, -7, -59, 132, 254, 79, 23, -210, 148, 164, -108, -291, -212, -84, -240, -84, -52, 328, 116, -9, -282, -25, 22, -150, -80, 73, -22, -274, -85, -63, -172, 13, -123, 10, -60, -4, 107, -293, 183, 53, 140, 147, -65, 3, 98, 200, -189, 128, 72, 60, 56, 179, -313, -13, 356, 21, -49, 70, 136, 183, -54, -121, -259, -82, -151, 173, 303, 30, 255, -76, -90, 66, 105, -10, -122, -165, -129, 47, 68, 220, -15, 21, -48, -109, -27, 42, 107, 119, 40, 270, -36, -55, -64, -155, -82, 221, 182, -221, 26, -96, 295, -45, -28, -228, -81, 10, 22, 2, -79, -50, -435, -69, -42, -94, 125, 180, 205, -42, 73, 149, 224, 23, -52, 90, -184, -218, -37, -150, -36, -109, 114, 199, -181, -20, -139, 155, -212, 105, -52, 220]
2141B20k80l0p8L7K8K04l07J53L08j69j37O0Q7J73j73k08N9J07K6q9PP3Pk62l9
2166b23J8M89j97l82K10P8j29Q6K02n7k72j99M06j56K9J71k15kK9r9N13m06K21
2189A15j27J17J06k57L2P9k72M49l17J00o9M21l79j10J80o4j07K04J74l89M6k7
2211i5N3kj92M79k58j23J26j15j10J94k08K0N6K56k42K87k30J86k40K04p4l3J6
2234d5n2p1L48k91L21p6o7R9k86R3R4mn4L9l27J94K41L3j27j85P5J49j35N3L0
2259D9r1p7P7Q3K77j55lk37K33l11l8J41j29J88j44M10l63p9j26L03K3p4J19q0
2283dJ6m1J3j25L24k64K2J69m7J26l15K05k6l8J11J02m21K99R3k62J25J12j68
2306FK83m27Q3N8J95j06mj12k00K93RJ61k3j84j53j1J3K99k76j05j64M93J03l63
$$ y = [220, -60, -90, -168, -131, -103, 101, -206, -53, 255, 86, -51, 9, 96, 269, 96, -112, -53, 54, 80, -9, -2, 71, 78, -184, -223, -205, 284, 87, -295, -85, -7, -136, -50, 152, 95, -177, -376, 30, -126, -97, 74, -141, -143, -114, -213, 300, -106, 115, -12, 105, 211, -46, -14, 65, -207, 242, -75, 25, -44, 377, -2, -112, 68, 4, -103, 101, 275, -114, -68, -95, -42, -44, -236, 243, -15, -138, -12, -127, -237, -43, -251, -231, -175, 81, -161, 126, -104, 82, -158, 46, -28, -61, -45, -97, -168, 180, -111, 210, 134, 67, 166, -120, -27, 67, 63, 9, 48, -279, -85, 156, 189, 62, -123, -48, 101, -34, 19, 49, -42, -119, -42, 41, 318, 163, 160, -77, 156, -155, -193, -52, -181, 7, -137, 273, -90, -169, -295, 8, 31, -43, 76, -4, 12, -29, -16, -141, 183, -81, -59, 110, 63, 189, -126, 79, 53, 15, 126, 228, -193, 106, 199, -63, 62, 174, 6, 289, -138, -55, 3, 198, 92, 88, -24, -224, 69, 78, 239, 216, 32, -121, -132, -119, 180, -96, -201, -365, 128, 231, -132]
2330a32M0J36j9j0%J35k23J35k59L2M0nJ75M6k50J24J1K4M3j09j60K59l96M7O6
2355b50L68j72J51j91P9J41j50J38k53J31P4j52k09K86j02K51Pj33j48K14j89
2376a09J1K84k38k24K45R5m5J47k96L8K52k25mO5k8Q6m6J55m06K41k3M5M4j86
2400a22K27l46J31J43Jp3J00K1o6j26J49j46j99M27j6k23j31L23k13J36K63l25
2422f5l2l26M02p4J66j50K25j62M7J7j33L13p5J2n23K68K6J61J60k20N3j65Q5
2445A0R5K38l18O1j75K64k26L2J09K82m01j60K10J10O7o2k67L61m00M60l13J99
2467A76l69K10q7P1n4o2K67r9r5r5J98k25%J51J04j29J60k69M13l16k28L31j82
2490a29k08K54n7K15k1Q3J23j43k35J84r2p2K20M3L8k52KJ71j10j69R1J54m40
$$ y = [-132, -92, 44, 25, 15, 15, 150, -73, 62, -197, -165, -125, -130, 45, 91, -159, -35, -24, 0, 43, -66, -226, 33, -363, -316, -250, 118, -54, 97, -94, -15, 126, -24, 114, -139, -8, 66, -86, -295, -9, -111, 140, 147, 14, -134, 80, -109, -98, 186, -52, -276, -31, 64, 19, 166, -130, -92, 160, -65, -69, -4, -32, 54, 8, 163, -243, -2, -25, 20, 64, -122, 105, -241, -110, 33, 34, -39, 61, 82, 16, -110, 39, -107, -306, 121, 105, -118, -249, 74, -139, -3, 260, -65, -97, -423, -21, -95, 71, -79, 146, -16, 31, 48, -85, 228, 153, 165, -358, -90, -64, 97, 257, 37, 90, -75, 10, 105, 343, 25, 86, -89, 175, -51, -19, 90, 372, -29, -189, 21, 131, 198, 136, -131, 230, -170, 290, -23, 176, -193, 17, -70, 1, -53, -115, 152, 53, -42, -137, 61, -164, -164, -13, 91, -38, 122, -147, 266, -50, -278, 53, -129, -337, -83, -140, 75, 54, 137, 260, 117, -118, 66, -26, -98, 122, 165, 203, -49, -47, 124, 14, -155, -64, 90, -350]
2513c50L45k88L78R4m28K98j39J61j56j1L06l10j0K39j77R9L6K31k64k03J36j70
2535a83j64M47j68L07j12k37K52j04p9L29k28J22j58o4Kj52K20j27n4J06J40r1
2557Dj61L35j48n1k07j2K66o6N8k3o3j23K59j8M8k24L88m94L76n1j81k00J38K91
2581A41m07P4K66k02L2J68k55J78r4J56j69J31PJ79N6k81RJ57J5k99qJ54K9k36
2605a99J42J38m2NK73j98l71K83k19R3J18nJ40k86K05K9j14J85k86M8L11j27O0
2628A83m22P6L74l60r3J78O3j01J11k50J75K25m0j63J04QJ22q5k92J93j07K25
2650A24k3J54N1n00R4M6m9J09P4k8r0j7j51K79n3k24J78J75j41K06j77J84q7q8
2674D6j20J80k27J45N4K9o5j87NQ0J36R7k62k11J60kR9O8l9MO2l51L45j39R5J74
$$ y = [-350, -5, -293, 85, 179, -249, 49, -90, 71, -85, -96, 210, -100, -110, 129, -48, 51, 87, 318, 54, -149, -13, -183, -347, 100, -68, 239, 127, -110, 142, 38, -41, 288, 60, 182, 24, -40, -38, -190, 30, -97, -151, -45, 95, 4, -157, 178, 30, -21, -228, -240, 26, -40, 18, -5, -68, -191, 68, 50, 98, -126, 262, -232, 144, 93, -88, -288, -150, 141, -266, -192, 74, -128, -96, 72, -183, -5, -99, 57, -112, 19, 26, 205, 261, -20, -11, 146, 161, -138, -146, 8, 37, -199, -57, 81, 39, 44, 317, 119, -252, 31, -188, -95, 23, 18, 158, -128, 77, 106, -8, 177, -109, -61, 250, 123, 183, -239, -163, 211, -149, -242, -64, -1, -102, 9, -241, -66, 159, 119, -44, 60, 68, 190, 105, -187, 6, -101, 124, 101, 255, 306, -194, -100, -54, -103, 6, 80, 52, -38, -55, -206, 73, 20, -204, -26, 149, 8, 214, 37, 221, 134, 46, -74, 106, -121, 24, 78, 107, 42, -145, -140, -60, 76, 173, -89, -300, -140, -142, -43, 25, -14, -10, 52, -299, 46, -93, 2, 176]
2700A76o4j68J86l30J73j48M71l73J90J17j65o6L45k50j61J81Q0l67J09R7k97
2721b64L15k05l4L01j42J64j72r0N6J2K99J3l19R1p5n5J00J65j55J18j46mJ13
2744H6J51Kl51K32J89m79K16M4R2j03j19j43K86k2j47l0P0k4K7K2P1k95J74q0
2768a31J28M4k14K87O7j86k65L56O7k78O9m7j52P4J54j5o4K18j19K95m99J04K05
2791I8r7J8j69K13r8R9J59m8m27L82k93K06p5N4R2l23J81o6Np2j01J03K80j02
2815A9Q0q8j73K07p6l1Q5Q7n9j15N9Q5r9k2o3K31k91J66m4k35N10k17J18q4M2
2840I2j06l9J18o0L7pm8L22k02j44L81k80K08l75J45Mk50K47j8q2r3N6K86l98
2864b06K65jj19o7J52j08q2P0J44j96M30l40J52l1N6k17Q9K96p5n2q4o5j70J07
$$ y = [176, 112, -56, 130, -200, -27, -175, 296, -77, 113, 230, 65, -1, 344, 94, -67, 114, 194, -173, -64, 33, -264, 51, -154, -188, 113, -29, 135, -37, -127, -71, -59, 240, 253, -66, 25, -50, -105, -5, 160, 5, 123, -23, -27, 86, 237, 239, -112, 120, 309, -170, 46, 90, 182, 79, -40, -183, 103, 81, -66, -96, -26, -50, -23, -1, 70, -225, -51, -131, -3, 41, -173, 114, 181, -5, -270, 86, 153, -125, -56, -103, -255, -181, -27, -42, -106, 112, -7, 288, -211, -107, 98, 1, 19, -150, 63, -35, 64, 223, 175, -252, 130, -163, 43, -32, 22, 114, -209, -28, -94, -89, -161, -262, -159, 121, 19, 99, 11, -162, 45, -31, -62, 23, 110, 51, -64, -5, 80, -19, -41, -104, 127, -164, 2, -42, -277, 233, 16, 134, 50, 92, -14, -53, 65, 5, 42, 35, -13, 309, 107, -37, 344, 64, 272, -103, 42, 46, -204, 43, 25, -57, -150, -94, 192, -206, 59, 58, -61, -128, 24, -84, -166, -96, 48, -148, 282, -58, 94, 63, 119, -98, -9, 287, 212, 160, 76, 11, -159, -52]
2888e2L83k25J03n2l35K43o4j21N5L6J78k84r4J50K37k82J00N3jk67J63j54K15
2911a5k80K63K56l35R8L9N9J6k10j50K86j34n1L8k3J61R5nJ00l08J14n3K11j20
2935E2j62J53J92l72J31j93L64k39JJ49N6J8l08p5K92J2J04k54q3J04O2j01J35
2958C8r2N0J06j28K71k48K11m00L35j2j40p8L46l29J18p6J14q1j14K40l32O74
2980D73m34k77K10O3k74J66j05J5J29n5J01rkK51k70K86l00M4K34j91N7J1Om9
3004H0j00ko3K14k82J02J62m5k81L65k45k9J00p3R7k9k26K43R0K74n82K83J13
3027A66O5n74Q8M37n91K64M19k55K6J14k33j1k39L33J32mk40K95l83K7n6J66K02
3050A48j66p6L9j09J70l6r4P9M42k30j24j05R1j74K79j29k69R2J9M09j85m2P8
$$ y = [-52, 331, 106, 209, 157, -178, 65, 1, -120, -65, -29, 149, -135, -229, -79, 158, -124, -24, 29, 28, -239, -76, -230, -15, -295, -32, 224, -111, -13, 26, 85, 101, -109, -259, 27, -107, -158, -120, -143, 18, 113, 108, 208, -100, 14, -39, 172, 52, -110, 43, 235, -137, -6, -199, 165, -74, -73, 76, 132, 150, -158, -233, 59, 71, 175, -79, -162, -58, 4, -97, 38, -54, -4, 102, -26, 245, -3, 208, -192, 143, 131, -9, -87, 259, -70, 48, -28, 86, 5, -109, 131, -201, 473, 39, -238, -28, 35, -239, -73, -178, -163, -34, -89, 12, 3, 1, 252, -18, 268, -32, 12, 246, 55, 112, 123, 129, 80, -20, -22, -85, 129, -153, -51, 111, 66, -215, 150, -95, -124, -24, -97, 0, -29, -255, -12, 78, 352, -230, 53, 166, 231, -343, -255, 182, -409, -145, 274, 19, 45, 159, -74, -85, -324, 9, 141, 137, -103, 192, -191, -164, -220, -54, 148, -18, -94, -55, -164, 6, -30, -124, -45, 397, 167, 43, -62, 29, -145, 134, 5, -264, -172, -153, 256, 71, 29, 107]
3073A07O7o7r1l04L44J28M9Lj40k64J10j67K42j00J90r3M1q1K4J29j8r8J85J3
3097B09L4k87J96k59M9J92m38K04N3J16K19k12j49%Q2j48l1O1J61Q6r4P4k56L1
3121a07q9K19Q4o5j4k86J88J83J48l53J5J32K45m20L09k66j63K08j27J41J16J53
3143B51j22qK1j84K43l81N9r5O0K29K64n14L36o4j97J13K53j15k68L63m33L86
3165A97j88J51k01Q2r5Q4k25L57ol79K79k23L16J01k14J92N0j31l3q0M0n7j55
3188a38m7K78k29J80o7q0J22j52J9M32j67k45L4L2O2J74k32K74m80J79j18QL64
3211B03l23M59l11k3o9r5L04k02R9k01K27P4m32K61J99l89K01j05L03j49K0QQ4
3234A43j98L42l64Q7L7j84K70j10Q1j16Q9N5mk01J29j29J14J74k95K57j35k19
$$ y = [107, 174, 107, 16, -288, 56, 184, 233, 236, 96, -168, -58, -225, 17, -83, 107, 14, 55, -26, -2, 127, 109, 11, 196, 209, 243, -44, 152, -107, -58, 134, -304, -100, -47, 69, 288, 76, -73, -73, 9, -139, -170, -109, 52, 138, 44, 118, -138, -107, -196, 23, 107, 42, 28, -258, -70, 113, 261, -92, -77, 55, 300, -120, 189, -77, -240, -32, -159, -18, 98, 251, 129, 121, 142, -42, 201, -180, -121, -216, -156, 73, 337, -177, 159, 95, -102, 11, 264, 149, -119, 244, -189, 197, 9, 160, -41, 41, -54, 30, -195, 162, 156, -223, 56, -167, 149, 250, 36, 228, 278, 147, 114, 34, 74, 17, -138, -185, 93, -136, 44, -23, -103, 19, -133, -114, 318, 151, -94, -60, -28, 34, 208, -24, 250, -230, -51, -169, -161, 203, -120, 339, 28, 5, -64, -159, 145, -57, 42, -159, 68, 142, -290, -29, 170, -219, -18, -123, 180, 31, 51, 59, 143, -55, 287, -77, 10, 47, -137, 133, 23, 104, -12, 77, 132, 128, -73, 56, -73, 41, 215, -80, 177, 42, -177]
3256a77M4J43l0K53j11m21O63l05k82M36j71J66j56j86L77k58K15l09M87n28O6
3277h4L19l7l84K57J01k79J62j01R4j80O3pO0l2k8j58K03K24q7j04k3j24J50m6
3301d1K76j80j87R9j64K20l16M52l21K45j4k15L5K76j96q4L06j05k1J3J9j97L12
3324B12o06K35J1j39L17k4J5n7P7o2p9j93K53J97j30j79J66J47j11l2kJ81m60
3347b63K67q2J66q3n1R0J88j07k32j36p5K4J07K34j34L19j30k61M66k97J31j30
3369A1J87j17n2j8j90L49J71l29L9Jj8q0k06K81j55J18j64m9J49k0K1N18n45o
3393a04M3p3K13l85M65k28J37K11j36j26J93l08J60J36k5k55J90J35l74J77j48
3414a02J9J51j01J94p7J01j21k86J98L1j29J56P2K27m01R2k24l9J69Q1N3K3j8
$$ y = [-177, -133, 10, -20, 233, 122, -299, 364, 59, -223, 213, 42, 208, 52, -134, 243, -15, 200, -109, 378, -150, -84, 235, 198, -186, 71, 172, -107, 55, -46, 48, -132, -69, -76, -16, -48, -76, -234, -31, 193, 106, 2, -21, -145, 5, -41, 235, 55, -132, -33, -197, 23, -293, 159, -162, 83, 69, -146, -111, 165, -31, -115, 191, 86, 65, 78, 97, -100, 212, -394, -159, -148, -287, 30, 6, 21, -36, 41, -21, -100, -293, -40, 157, 27, -152, 14, 161, 50, 18, 16, 197, -263, 4, -78, 88, 5, -46, 44, 232, 125, -107, -243, -318, -294, -187, 47, -87, 232, 102, -159, 307, 10, 141, 11, 198, 81, 29, 11, -179, 170, 341, 12, 51, 52, 34, -46, -252, 29, -126, -8, -172, -221, -72, -92, -71, 447, -98, -104, -61, -134, 79, -306, 159, -69, 68, 279, 143, 17, 210, -98, 62, 198, 173, -82, 108, 243, -131, 46, -102, -83, 68, -33, 161, 84, 185, 64, -222, -24, 7, -122, 34, 106, 333, -68, 24, -200, -239, -70, 11, 64, 87, 69]
3437F9J06k61p5K02j64P7j61N52l23l6J36o2l34J12J51mN2p0j55J55L4J5J82l23
3461a25qN2J10J30k79R8L13j49j54n8j8J4J78k49J35M16m45J4k06J39J76P9J1
3484A74o3j62p3K61k1j58j49K51m8M1m0n4M3k66J39n7Q4K51j34k9J47k44K09k27
3508a25NJ47k42L37j92J73j86l8q8L19j98R2r6k92N16mj77K3j29L0k3J50J98n0
3532A50r3Jj25n6KK18j39j1J36K08k16M3k25Q9K2M3P2k85J92j74M74k43l09M00
3556A74j01L0l40P2K5J59j06L5K71j28L5l32J73m4n4K23Nj60J56n1p7j94L06R0
3580A67k87K61l24N5J24L2MM2j72k7q4L73m22j6K41j84R8L08k27p6MP1J61n24
3604d02M94j08q1J79j43K63r3l4j94K8J57j47J39j48L86k12J05m59M04o8J3l26
$$ y = [69, 175, -86, -161, 41, -123, -46, -207, 345, 22, -14, 122, 60, -274, -162, -11, -15, 37, -33, -188, -33, 1, 16, 198, -125, -133, -81, 29, 159, -120, -22, 291, 142, -12, -70, -88, -74, 104, -145, -10, 406, -39, -25, -231, -92, 84, 163, 174, 111, -51, -124, 137, 116, -42, -191, 60, 12, 53, 13, -41, 2, -264, -125, -182, -98, 153, 19, -10, 137, -107, 102, -125, -120, 27, -215, 122, -70, 103, -83, -121, -209, 110, -88, 4, -92, -384, 132, 128, -49, -26, -155, -125, -148, 2, 200, 150, 57, 58, -67, -123, -121, 97, -42, -53, 83, 291, 75, 118, -107, -18, 4, 47, 119, -166, 26, -148, 326, 83, -226, 174, 73, 103, -237, -165, -140, 19, -87, -52, 219, 91, 126, -206, -33, -77, -131, 92, 97, -63, 93, 42, -35, -229, 77, 167, -120, 141, -183, -128, -4, 28, 32, 74, -98, -125, -209, 164, -258, -274, -33, -217, -119, 189, -38, -114, -110, -39, 122, -402, 92, -16, -97, 82, -61, 202, 109, 75, -119, -91, 66, -81, 58, -90, 296, 84, 189, -270, 134, 66, 79, -247]
3626b47J50R0J28k57K23K8j33l3J4N3P4j6l6m7L4j8k24J77j28L15k73P0J58K5
3650A27k85J33n0r1K30q0K1l97J85L71k85r4M17j74NJ65N9k77rj44J18N4L3Q2
3674A14m2j32O4p3K82j80K3k79L25k90m1K82l16M05j53J73j07j81k4J31K62j12
3696A31k34J33O2k56L06J25l31J91m1j98K36p6l05R3M07j30k06J27m10M62j60
3717g4Q5p8j81L27l74J16J99q8r1l15J85K13K21K1m5j83L3L66k67q9l6J54K72
3740C71m87J01R8M1Q0j44J98k36N0m5N6N5n6l97J73K98k97J57J9k19m0N6L23j83
3764b8J61l7k3mO6k66J01l8J67O9O5j05r0j10o3K28P7o5k36J33K7j89J31j65L18
3789A24k18L3N2j0j31K50j41j88L6J68K11r9k78R7n6k8J50J15l34n7J51K9K49
$$ y = [-247, -97, -7, 121, -136, 87, 115, -18, -51, -37, 16, 90, 74, 38, -9, 25, 7, -217, -40, -168, 147, -126, -56, 102, 127, -158, -25, -75, -166, 64, -16, 5, -392, -207, 164, -121, -215, 202, 28, 33, 198, 257, -20, -29, -173, -55, -1, 32, 114, 72, -60, 4, -69, 213, 33, 56, -223, 102, -188, -229, 53, -263, 142, -11, 162, 55, -126, -150, -19, 243, 131, -103, 30, 92, -164, 142, 267, -64, 127, 86, -112, 124, 48, -257, -164, 243, 113, -93, 34, -376, 86, -74, 11, -67, -248, 79, -295, -179, 20, -68, -159, -474, -289, -76, 145, 166, 121, -62, -29, 337, 70, -19, -55, 99, 371, -116, -15, 83, 124, 204, 60, 258, 22, 72, 27, 83, 138, 82, -315, -142, 156, -141, 16, 35, -184, -224, -168, 155, -28, 133, 96, 73, 69, 135, -131, -30, -68, 99, 168, 233, 128, 38, -72, -135, 93, 170, 105, -131, 2, 29, -160, -29, -194, 124, -94, -61, -9, -19, -150, 100, -41, -229, -193, -25, 186, 87, -191, -94, -150, -178, -28, 87, -247, -304, -153, -124, 125]
3812A25k53J49J48k95K48n0po8qJ17Lj65J23j49R6J35m63J96M1K14j09K25k98
3835d5Rj28R4L26l57j2K95r3n1k7k42K10O2j18J4n9J91l78L59m8o6K79N8j60l90
3860b77L86k18J55k10J95j94K07p6j7J01P5jl8k22L5m2K97j55O6O0n3q2J90k83
3884a01q9J95J04O1j93j94J45J84j80K90l32N0J77j30l52M09k92j77M14J14q2
3905B1J37k30L4J42j0pj35ok06L70k21pJ06L58m92K63j57J41k27qJ21J85j55J65
3929A82m3m29L18j85K20M2M6j77J12r8J23l76M70k01j80L51l21L78k76m7K49k71
3951a13o6J15pJ6n5M7k64K95K15k3n9j44J03k50K42M9j1n2j9K63m70K85j21Q0
3975E6j16J10K0N3n2J06m63L35K07l03k3L3J15Q8m51L42l4j98m1K15J13q9j96
$$ y = [125, -128, 21, 169, -126, 122, 72, 65, -3, -11, 106, 109, -56, 67, -82, 14, 149, -314, -118, -77, 137, 28, 253, -45, -36, -164, -70, 256, -101, -113, 182, 89, 38, 11, -231, -21, 41, -77, -63, -122, 69, -309, 50, 2, -64, 215, 273, 113, -277, 109, -109, 46, -164, 31, -163, 44, -32, -49, 52, 127, 126, 88, -134, -99, -141, 156, 1, 67, 127, 74, -8, 182, -101, -190, 5, 109, 170, -23, -217, -72, 112, -68, 222, -110, -60, 117, -13, -365, 44, -248, -425, -11, 103, 21, 158, -72, -38, 104, 94, 87, -48, -54, -260, 110, -111, -118, -12, 346, -146, 117, -40, 101, -126, -134, -13, 172, 17, 182, 139, -290, 28, -157, 63, 105, 151, -26, 86, -12, 111, -265, 205, 4, -176, 175, -146, 232, -44, -91, 158, -113, -179, -64, -71, -55, -110, -63, -327, -32, 183, 160, 101, -43, 60, -190, 52, 101, 90, 38, 19, 282, -188, 97, -24, 56, -60, 50, 70, 123, 71, 177, -286, 49, 256, -47, -70, -37, 78, 166, -285, 57, 23, -175, -216, -1, 112, 23, -173]
3998a73KQ0RL8r8Q2K9K4L4J17K7p9K04j20o4k8j49O6r0J94J42j73lk34K19n6j2
4025a2J82k04k07J80L1R9k36q1L99m14K19M0J57k4k09j0K18k15k92M24k4J60j52
4048B9k36K59k51R7j26M29m28O3L09l04Q1j21P3L68l10J72K34k25l2k71J83k52
4070b59K8J77n0K7O4J61l4Ln7J53l12K99k53J41k49K46q0L13m17j26M43k86K02
4093A34k75M18l96M4kJ15k7n4J69J7k80J12m8k08K63j94K41j66J82K00k97m6K31
4116A33k89J61pj35M1M69l72j32J71j4k04N5J67j40L01j73M2p2M0M5j83k1K91
4139A74j08k76J90Lp9k8K6K90o3q3j27N2j08j43L12k49M06k13J48J49k59R8K32
4162C44j87j90o5O6k4Rj11M18k94n7p7J77J97k77M90m66L0l0j01P5L9o7J52L1
$$ y = [-173, -171, -91, -82, -44, -142, -60, -31, -7, 27, 144, 171, 92, 296, 176, 112, 84, -65, 1, -89, 105, 247, 74, 71, -163, 56, 0, -12, 170, -34, -241, -61, -30, 69, -167, -248, 151, -263, -44, -4, 153, 129, -80, -90, 128, -87, -379, 45, 21, 181, 29, -207, 52, -199, -102, -228, 201, -227, -164, 145, -159, -78, -199, -126, 242, -68, 104, 338, 113, 81, -190, -7, -259, -231, -54, -104, -77, -13, 148, 114, 117, 60, 213, -99, 200, -53, 88, -161, 85, 5, 318, -99, -225, 218, -68, 134, -141, 277, -119, -75, -77, 38, 11, -43, 126, 143, -137, -25, -73, -281, -18, -212, 29, -137, 45, 245, -52, -98, 133, -156, 5, -2, -137, -96, 373, 1, -131, 40, 26, -178, -123, 44, -96, 205, 32, 74, 2, 42, 87, -96, -117, 174, 66, -210, -20, -17, -96, -124, -98, 192, 129, 46, -81, -29, -137, -280, 32, -217, 189, -24, 124, 273, 14, 112, 344, 157, -33, -98, -32, -56, -47, -158, 260, -34, -91, -168, 9, 206, -71, 419, -47, -17, -47, -148, -73, -34, -101, 51, 82]
4186H2lj38J27k12K31O2m35M90j57j11J0J3j72P1N0k18K03j40J93MJ0L8j65k3
4210a90K17k68J12J14j74J18l6q4L20K7j89M6j8j4J39n0j51j03K25k82L35l49
4232b55K05p4P9m2k6N9K93Mk82J37j64q3J12J88l37l7K27J92m52J10j49K36j14
4255a73O6Q6J45pk40J58k39J72K98k42O8J03l00p5N7J50k66J68J0K3J38l04J86
4278a8J50l64J42J63nj10k71L41p8O9J90k79kK11k01K77m74J47N0m1J86o3m3J13
$$ y = [82, 79, -59, 68, -144, 87, 149, -286, 204, 47, -64, -54, -41, -213, -142, -92, -310, -107, -247, -54, -50, -40, -2, -167, -190, 27, -241, -129, -15, -189, -71, -107, -191, 129, 156, -33, 13, -5, -19, 120, 70, -81, -184, 41, -241, 94, -255, -50, -124, -45, -87, -113, -54, 239, 243, -39, 98, -66, -149, -37, 151, -186, -223, 4, 196, -256, -146, -295, -59, -173, -107, -21, 124, 117, -123, 35, -204, -32, 266, 24, 92, 195, -105, -180, -123, 27, -239, -71, -61, -38, 100, -204, -18, 132, -232, -90, 73, 68, -42, -313, 28, -50, 19, 209, -70, -72, 139, -62, 215, -259, -112, -62, -103, 83, 20, -23, 90]
$$ [...]
8191a14
##END NTUPLES=NMR FID
##END=
