##TITLE=1H_DE-129_ITA_TFA
 200.13MHz,DMSO-d6+CCl4.
 8 sc
 
 13.2.2026
##JCAMPDX= 6.0         $$ Bruker NMR JCAMP-DX V2.0
##DATA TYPE= NMR FID
##DATA CLASS= NTUPLES
##ORIGIN= UXNMR, Bruker Analytische Messtechnik GmbH
##OWNER= pz
$$ XWIN-NMR		Version 3.5
$$ Fri Feb 13 16:21:01 2026 Russian Standard Time (UT+4h)  she@DPX200
##.OBSERVE FREQUENCY= 200.1313
##.OBSERVE NUCLEUS= ^1H
##.DELAY= (6, 6)
##.ACQUISITION MODE= SIMULTANEOUS
##.ACQUISITION SCHEME= undefined
##.AVERAGES= 8
##.DIGITISER RES= 18
##SPECTROMETER/DATA SYSTEM= spect
##.PULSE SEQUENCE= zg30
##.SOLVENT NAME= D2O
##.SHIFT REFERENCE= (INTERNAL, D2O, 0, 14.3821)
##AUDIT TRAIL= $$ (NUMBER, WHEN, WHO, WHERE, WHAT)
$$ ##TITLE= Audit trail, XWIN-NMR		Version 3.5
$$ ##JCAMPDX= 5.01
$$ ##ORIGIN= Bruker BioSpin GmbH
$$ ##OWNER= she
$$ F:/spectra/data/she/nmr/H-C/1/audita.txt
$$ ##AUDIT TRAIL=  $$ (NUMBER, WHEN, WHO, WHERE, WHAT)
(   1,<2026-02-13 16:19:01.95 +0400>,<she>,<DPX200>,
      <created by zg, POWCHK disabled, PULCHK disabled
       configuration hash MD5:
       00 E9 B6 7A A2 85 ED C7 34 08 36 98 17 FE 4E 26
       data hash MD5: 16K
       9F 2B 4F 94 69 B6 D7 D2 56 52 05 BE 5B 54 BE 65>)
$$ ##END=
$$ 
$$ hash MD5
$$ 5A F3 2D DF 2A E0 54 5C EB D1 85 77 B1 10 47 C3
##$RELAX= 
##$RELAX= 
##$RELAX= 
##$RELAX= 
##$RELAX= 
##$RELAX= 
$$ Bruker specific parameters
$$ --------------------------
##$DU= <F:/spectra>
##$EXPNO= 1
##$NAME= <H-C>
##$PROCNO= 1
##$TYPE= <nmr>
##$USER= <she>
##$AMP= (0..31)
100 100 100 100 100 100 100 100 100 100 100 100 100 100 100 100 100 100 
100 100 100 100 100 100 100 100 100 100 100 100 100 100 
##$AQSEQ= 0
##$AQ_mod= 1
##$AUNM= <au_zg>
##$AUTOPOS= <>
##$BF1= 200.13
##$BF2= 200.13
##$BF3= 200.13
##$BF4= 200.13
##$BF5= 200.13
##$BF6= 200.13
##$BF7= 200.13
##$BF8= 200.13
##$BYTORDA= 1
##$CFDGTYP= 0
##$CFRGTYP= 5
##$CHEMSTR= <none>
##$CNST= (0..31)
1 1 145 1 1 1 1 1 1 1 1 1 1 1 1 1 1 1 1 1 1 1 1 1 1 1 1 1 1 1 1 1 
##$CPDPRG= <>
##$CPDPRG1= <>
##$CPDPRG2= <>
##$CPDPRG3= <>
##$CPDPRG4= <mlev>
##$CPDPRG5= <mlev>
##$CPDPRG6= <mlev>
##$CPDPRG7= <mlev>
##$CPDPRG8= <mlev>
##$CPDPRGB= <>
##$CPDPRGT= <>
##$D= (0..31)
0 0.7 0 0 0 0 0 0 0 0 0 0.03 0 0 0 0 0 0 0 0 0 0 0 0 0 0 0 0 0 0 0 0 
##$DATE= 1770985141
##$DBL= (0..7)
120 120 120 120 120 120 120 120 
##$DBP= (0..7)
150 150 150 150 150 150 150 150 
##$DBP07= 0
##$DBPNAM0= <>
##$DBPNAM1= <>
##$DBPNAM2= <>
##$DBPNAM3= <>
##$DBPNAM4= <>
##$DBPNAM5= <>
##$DBPNAM6= <>
##$DBPNAM7= <>
##$DBPOAL= (0..7)
0.5 0.5 0.5 0.5 0.5 0.5 0.5 0.5 
##$DBPOFFS= (0..7)
0 0 0 0 0 0 0 0 
##$DE= 6
##$DECBNUC= <off>
##$DECIM= 32
##$DECNUC= <off>
##$DECSTAT= 4
##$DIGMOD= 1
##$DIGTYP= 9
##$DL= (0..7)
0 120 120 120 120 120 120 120 
##$DP= (0..7)
150 150 150 150 150 150 150 150 
##$DP07= 0
##$DPNAME0= <>
##$DPNAME1= <>
##$DPNAME2= <>
##$DPNAME3= <>
##$DPNAME4= <>
##$DPNAME5= <>
##$DPNAME6= <>
##$DPNAME7= <>
##$DPOAL= (0..7)
0.5 0.5 0.5 0.5 0.5 0.5 0.5 0.5 
##$DPOFFS= (0..7)
0 0 0 0 0 0 0 0 
##$DQDMODE= 0
##$DR= 18
##$DS= 0
##$DSLIST= <SSSSSSSSSSSSSSS>
$$ [...]
##$SUBNAM0= <"">
##$SUBNAM1= <"">
##$SUBNAM2= <"">
##$SUBNAM3= <"">
##$SUBNAM4= <"">
##$SUBNAM5= <"">
##$SUBNAM6= <"">
##$SUBNAM7= <"">
##$SUBNAM8= <"">
##$SUBNAM9= <"">
##$SW= 18.0517328524113
##$SWIBOX= (0..15)
0 0 2 0 0 0 0 0 0 0 0 0 0 0 0 0 
##$SW_h= 3612.71676300578
##$TD= 16384
##$TD0= 1
##$TE= 0
##$TE2= 300
##$TE3= 300
##$TEG= 300
##$TL= (0..7)
0 120 120 120 120 120 120 120 
##$TP= (0..7)
150 150 150 150 150 150 150 150 
##$TP07= 0
##$TPNAME0= <>
##$TPNAME1= <>
##$TPNAME2= <>
##$TPNAME3= <>
##$TPNAME4= <>
##$TPNAME5= <>
##$TPNAME6= <>
##$TPNAME7= <>
##$TPOAL= (0..7)
0.5 0.5 0.5 0.5 0.5 0.5 0.5 0.5 
##$TPOFFS= (0..7)
0 0 0 0 0 0 0 0 
##$TUNHIN= 0
##$TUNHOUT= 0
##$TUNXOUT= 0
##$USERA1= <user>
##$USERA2= <user>
##$USERA3= <user>
##$USERA4= <user>
##$USERA5= <user>
##$V9= 5
##$VALIST= <valist>
##$VCLIST= <CCCCCCCCCCCCCCC>
##$VD= 0
##$VDLIST= <DDDDDDDDDDDDDDD>
##$VPLIST= <PPPPPPPPPPPPPPP>
##$VTLIST= <TTTTTTTTTTTTTTT>
##$WBST= 1024
##$WBSW= 4
##$XGAIN= (0..3)
0 0 0 0 
##$XL= 0
##$YL= 0
##$YMAX_a= 211839
##$YMIN_a= -228789
##$ZGOPTNS= <>
##$ZL1= 120
##$ZL2= 120
##$ZL3= 120
##$ZL4= 120
##$ABSF1= 10
##$ABSF2= 0
##$ABSG= 5
##$ABSL= 3
##$ALPHA= 0
##$AQORDER= 0
##$ASSFAC= 0
##$ASSFACI= 0
##$ASSFACX= 0
##$ASSWID= 0
##$AUNMP= <proc_1d>
##$AZFE= 0.1
##$AZFW= 0.1
##$BCFW= 1
##$BC_mod= 2
##$BYTORDP= 1
##$COROFFS= 0
##$CY= -3
##$DATMOD= 1
##$DC= 2
##$DFILT= <>
##$DTYPP= 0
##$F1P= 0
##$F2P= 0
##$FCOR= 0.5
##$FTSIZE= 0
##$FT_mod= 4
##$GAMMA= 1
##$GB= 0.15
##$INTBC= 1
##$INTSCL= 1
##$ISEN= 128
##$LB= 0.25
##$LEV0= 0
##$LPBIN= 0
##$MAXI= 10000
##$MC2= 0
##$MEAN= 0
##$ME_mod= 0
##$MI= 1.114404
##$NCOEF= 0
##$NC_proc= 0
##$NLEV= 6
##$NOISF1= 3.799351
##$NOISF2= 2.8
##$NSP= 1
##$NTH_PI= 0
##$NZP= 0
##$OFFSET= 14.38212
##$PC= 1
##$PHC0= -3703.985
##$PHC1= 9.792321
##$PH_mod= 1
##$PKNL= yes
##$PPARMOD= 0
##$PSCAL= 0
##$PSIGN= 0
##$REVERSE= no
##$SF= 200.129724274929
##$SI= 16384
##$SIGF1= 3
##$SIGF2= 2
##$SINO= 400
##$SIOLD= 16384
##$SREGLST= <1H.CDCl3>
##$SSB= 0
##$STSI= 0
##$STSR= 0
##$SW_p= 3205.1282051282
##$SYMM= 0
##$S_DEV= 0
##$TDeff= 0
##$TDoff= 0
##$TI= <>
##$TILT= no
##$TM1= 0
##$TM2= 0
##$TOPLEV= 0
##$USERP1= <user>
##$USERP2= <user>
##$USERP3= <user>
##$USERP4= <user>
##$USERP5= <user>
##$WDW= 1
##$XDIM= 8192
##$YMAX_p= 0
##$YMIN_p= 0
$$ End of Bruker specific parameters
$$ ---------------------------------
##NTUPLES= NMR FID
##VAR_NAME=  TIME,          FID/REAL,        FID/IMAG
##SYMBOL=    X,             R,               I
##VAR_TYPE=  INDEPENDENT,   DEPENDENT,       DEPENDENT
##VAR_FORM=  AFFN,          ASDF,            ASDF
##VAR_DIM=   8192,          8192,            8192
##UNITS=     SECONDS,       ARBITRARY UNITS, ARBITRARY UNITS
##FACTOR=    0.0002768,     1,               1
##FIRST=     0,             0,               0
##LAST=      2.2672688,     0,               0
##MIN=       0,             -228789,         0
##MAX=       2.2672688,     211839,          0
$$ Real data points
##PAGE= N=1
##DATA TABLE= (X++(R..R)), XYDATA
0@%%%%%%%%%%%%%%%%%%%%MrJ3j6J6j6J6j8K4l0L2l6M2m6N3o0O7p5Q4r5J05j15
$$ 0 0 0 0 0 0 0 0 0 0 0 0 0 0 0 0 0 0 0 0 0 4 -5 8 -8 8 -8 8 -10 14 -16 16 -20 22 -24 29 -31 36 -39 45 -50 55 -60
42f0J27j42J58j75J94k13K33k57K85l14L45l81M20m66N19n78O46p26Q22r41J091
$$ -60 67 -75 83 -92 102 -111 122 -135 150 -164 181 -200 220 -246 273 -305 341 -385 437 -504 587
63E87j285J550j933K534l621O175k1936q961N4047k6847m1440q53J9078L7543
$$ 587 -698 852 -1081 1453 -2168 4007 -17929 -26890 27157 310 -41130 -41983 -22905 14638
77A4638p459n9006j1497K4293O2747N2608n8140q0731j3280L7774J00792M9634
$$ 14638 7179 -51827 -63324 -39031 23716 76324 18184 -62547 -75827 -38053 62739 112373
89A12373q2650j05701n2549N7327J44385N1441q2677j37819q8983R5758J83660
$$ 112373 29723 -75978 -128527 -71200 73185 124626 41949 -95870 -184853 -89095 94565
100I4565N9574q7461j68723q3941J22019J78230P2837q3205j87948p6798J10013
$$ 94565 154139 66678 -102045 -185986 -63967 114263 187100 103895 -84053 -160851 -50838
111e0838J61892Q9296r3578j99220o8449R5751J58918Q1828j10047j65265m3777
$$ -50838 111054 200350 106772 -92448 -160897 -65146 93772 175600 65553 -99712 -143489
122a43489Q5235J49374N0811j06253j08339k7389P1751J23122J6760q5686p8009
$$ -143489 -58254 91120 141931 35678 -72661 -100050 -28299 94823 111583 25897 -52112
133e2112k2089P7501Q5601k3869p3970o2567L880Q7947L7338m9049n9471l7027
$$ -52112 -74201 3300 88901 65032 -8938 -71505 -67625 20322 57660 8611 -50860 -87887
145h7887M3726Q0878L915m4816n5077j9291P0185O3501l986m2526p1502p343Q0990
$$ -87887 -44161 36717 40632 -4184 -59261 -78552 -8367 55134 51148 8622 -62880 -70223 10767
158A0767N3902l939o2447p8758J3706P0419M6087Q00p0213n9234K4204M8288N2975
$$ 10767 64669 60730 -1717 -80475 -66769 3650 49737 50537 -19676 -78910 -54706 -6418 46557
171D6557J2745o3246m3031R890M0040O3486O29n7594l3635m744M4337N2042k1648
$$ 46557 59302 -3944 -46975 -37085 2955 66441 67070 9476 -24159 -28903 15434 67476 45828
184D5828m2070k7740r046M6167L0787k2675k7362l4283N450N5140J9920j3318
$$ 45828 3758 -23982 -33028 13139 43926 21251 -6111 -40394 -34944 20196 40116 26798
196B6798l6869m0788L5266O1245J1451k4577o3798l0411N6087N5500J2933m1975
$$ 26798 -10071 -50859 -15593 45652 57103 32526 -31272 -61683 -5596 49904 62837 20862
208B0862q4561j7815N7217O3612L3021o1860j01037j3462O4130R4310M1095q3588
$$ 20862 -63699 -81514 -24297 39315 72336 10476 -90561 -104023 -39893 54417 95512 11924
220A1924r9418j4785O9072J13709K9307q9066r1531l0913O7525J13711J8427p3993
$$ 11924 -87494 -102279 -33207 80502 109809 20743 -70788 -101701 -34176 79535 97962 23969
232B3969r0068m2333P1692J00614J5729n5259q8578k8955P5283O9846J2449l6704
$$ 23969 -66099 -108432 -36740 63874 79603 24344 -64234 -93189 -17906 51940 64389 27685
244B7685o6922l875N0859L2553J3034k8605l9668J1789J7197O873P54k9498j158
$$ 27685 -39237 -43112 7747 40300 53334 24729 -14939 -3150 14047 20920 21674 -7824 -8982
257h982K8334j549j2446k7370j9460M2854M0850n607l5115n5542J911O8669M4946
$$ -8982 19352 17803 5357 -22013 -41473 1381 42231 36624 1509 -54033 -52122 16547 61493
270F1493J584n4337p3642O689O3692N7634J4533p3238q3223k233N5875P9175K1318
$$ 61493 63077 8740 -64902 -58213 5479 63113 77646 4408 -78815 -81048 -25173 54002 75320
283G5320p6264p3343j6710M7332Q9757K5298n3730o2313l9203L6530Q4093L4730
$$ 75320 -944 -74287 -90997 -43665 46092 71390 17660 -44653 -83856 -47326 36767 71497
295G1497k0072o5898o2013K5836O7644M4931Q37o9608o2217J0272M5032N9503
$$ 71497 51425 -14473 -76486 -50650 16994 61925 62762 -6846 -69063 -58791 -13759 45744
307D5744J7082n7361n1696j3079L3680P2481J8691m1523m3447k7933L3170O1630
$$ 45744 62826 5465 -46231 -59310 -25630 46851 65542 24019 -19428 -47361 -14191 47439
319D7439Q704k3185l8720k6042K9889K9511N46q468l1979r606K2998M008N50p053
$$ 47439 56143 32958 -5762 -31804 -1915 27596 28142 19674 -12305 -21911 1087 5095 5645 -1408
333a408j6633J9256J6701j2148j1740j7201J2191M2867L480k5846l2443k1499
$$ -1408 -18041 1215 17916 5768 -5972 -23173 -10982 31885 35365 9519 -22924 -44423
345d4423L8442M8329l534l3613n3985j7056N2534M6808O377l9493o7699l511N8215
$$ -44423 -5981 42348 38814 5201 -48784 -65840 -13306 33502 39879 386 -67313 -70824 -12609
358a2609N0313J5821n1310o4135R490N0048M9907R735n8503m5240R846L6237M6987
$$ -12609 37704 53525 2215 -61920 -52430 -2382 47525 57260 -1243 -46483 -36637 -400 46587
371D6587m206n3559k6236M211L3155L8876j8145l7987j3732P781M1471K1297k7590
$$ 46587 42381 -11178 -37414 -33203 -48 38828 20683 -17304 -31036 -23255 18216 39513 11923
384A1923k1288p579J6712L9322j583k6655j6666j0588K4732K9636j0579k0180
$$ 11923 -9365 -16944 -232 39090 37507 10852 -5814 -16402 8330 37966 27387 7207
396G207k6239j0472L3257K1020m836j6077l4994k820L2082J8569J0677j5470l4685
$$ 7207 -19032 -29504 3753 24773 19937 3860 -31134 -33954 -1872 16697 27374 11904 -22781
409b2781j207J4638K2137K5116j9011l2798j3555k418L1963K8566j6829k4643
$$ -22781 -23988 -9350 12787 37903 18892 -13906 -27461 -29879 2084 30650 13821 -10822
421a0822k7173o935L5927K4094m95j5345l6398l850L0450K1252J7575j3671l5082
$$ -10822 -37995 -44930 -9003 15091 14596 -749 -37147 -40997 -10547 10705 28280 14609 -20473
434b0473q11J4207J8825J9410j7707j9703j770m417J3096J0274q975N007m540
$$ -20473 -21284 -7077 11748 31158 13451 -6252 -8022 -12439 657 10931 1956 6963 2423
447B423j3542M474k912P534K4340q81j0467j7165j9326K4356L6473J1205j0480
$$ 2423 -11119 -6645 -9557 -2023 22317 21436 10969 -6196 -25522 -1166 35307 46512 36032
460C6032m7465l1834K9052M3775K9419j7128o8825l5671K3693N2993M9656k0783
$$ 36032 -11433 -43267 -14215 29560 58979 41851 -26974 -62645 -38952 14041 63697 42914
472D2914p0385l9018J0532O4460O1455k0199o2701m8021J402O8296N4337j2929
$$ 42914 -27471 -66489 -55957 8503 69958 49759 -12942 -60963 -59561 8735 63072 50143
484E0143m9068n7080m135N6745L9926K816l5773n4578m164L5084L2348K0362k4075
$$ 50143 1075 -56005 -60140 -3395 36531 39347 3574 -51004 -55168 -20084 12264 32626 8551
497H551l7046l789R434K5910K5059j0681j2530j1579j3548J5562J7871Q093O547
$$ 8551 -28495 -32284 -22850 3060 28119 17438 4908 -6671 -20219 -4657 13214 21307 27854
510B7854k2635k4386R17P220K6568J7832k1923k3073j5479K426L8458K2754q324
$$ 27854 5219 -19167 -18250 -11030 15538 33370 11447 -11626 -27105 -24679 13779 36533 28209
523B8209k0139l2004J014L3998K1111P899k0681l7965k327J6043J9529K0737j7011
$$ 28209 8070 -23934 -22920 11078 32189 40088 19407 -18558 -20885 -4842 14687 35424 18413
536A8413l0390j3249l789K4832K6639o173j4519k5633j5146K7080K6810J1335
$$ 18413 -11977 -25226 -29015 -4183 22456 16283 1764 -23869 -39015 -11935 14875 26210
548B6210n113l7002k0188J6811K4756K7996n718m1970k1753K749K8362L7000j1150
$$ 26210 21097 -15905 -36093 -19282 5474 33470 27752 -14218 -35971 -33222 -4860 32140 20990
561B0990l5631k1304l935L4517L2571j0693k2913k2372R99L6718J7839p881j6151
$$ 20990 -14641 -35945 -39880 -5363 27208 16515 -6398 -28770 -27771 8947 26786 18905 2754
574B754k2182J0298K7507K112p419j7825j2593K1118J4241o073j0593j9036N664
$$ 2754 -19428 -9130 18377 20489 13070 -4755 -17348 3770 18011 11938 1345 -17691 -12027
587a2027K5257L527o151j6302j5989K0292K2711K444p287k6126p665K3372J4352
$$ -12027 13230 16757 10606 -5696 -21685 -1393 21318 23762 16475 -9651 -17316 6056 20408
600B0408M815j3270k9115M5J5894R998Q312j7745j8932O135M640J0312O181j4610
$$ 20408 25223 11953 -17162 -17117 -1223 8775 17087 -658 -19590 -13455 -8815 1497 7678 -6932
614f932j857L543k651R141j948n131J1030j442m131k033j1977O988J5068j801
$$ -6932 -8789 -5246 -7897 1244 -704 -5835 5195 3753 -378 -2411 -14388 -7400 7668 5867
628E867k256j5819j5172J5568J4889Q312j83k4717j1145J2496J3655K0162p35
$$ 5867 3611 -12208 -27380 -11812 3077 11389 11206 -13511 -24656 -12160 1495 21657 20922
641B0922k4598r906j326J4171K7993j192j6420j5542j6435J3205K4833P259j913
$$ 20922 -3676 -13582 -14908 -737 27256 26064 9644 -5898 -22333 -9128 15705 22964 21051
654B1051k4153k5164R200J9061K3486J1747k8554k8349m591J3642L9391J7558
$$ 21051 -3102 -28266 -19066 -5 23481 35228 6674 -21675 -26266 -12624 26767 44325
666D4325k5510l0625k2840J2044M4804J8976j3013l4549l7556J1221L9755K3539
$$ 44325 18815 -11810 -34650 -22606 22198 41174 28161 -6388 -43944 -32723 7032 30571
678C0571O90l6968l7554Q004K8038L1092R966l3050k8240k340J4529L3288J0191
$$ 30571 31261 -5707 -43261 -35257 -7219 23873 33839 789 -27451 -29791 -15262 18026 28217
691B8217k0525j6830j5151L908K5565Q698o62q911k2595l010Q629R097J9773p99
$$ 28217 7692 -9138 -24289 -20381 5184 13882 13220 4309 -18286 -21296 -12667 -3570 16203 15404
705A5404j9126j1569j0543J3805L1816Q396r017k5055k6066J4615L1812K0191
$$ 15404 -3722 -15291 -25834 -12029 19787 28183 19166 -5889 -31955 -17340 14472 34663
717C4663L24l6756l2104R024K6677L3398N431l9404l1009l542K3434M1887O179
$$ 34663 34987 -1769 -33873 -24849 1828 35226 40657 1253 -29756 -33298 -9864 32023 38202
730C8202k9410k7218j5608K2180L8748P136j4592k7215k2333J6824K4605J1541
$$ 38202 8792 -18426 -34034 -11854 26894 34030 19438 -7777 -30110 -13286 11319 22860
742B2860k65k6588j9827O476J0532J8664P217j9523j2747p546J415K3126R644
$$ 22860 22595 -3993 -23820 -17344 -6812 11852 19069 -454 -13201 -20747 -19332 3794 13438
755A3438n330p866j8961r43J8593R801Q455q968k3708j760P718J2033J5006j0854
$$ 13438 8108 242 -18719 -19662 -1069 8732 17187 8219 -15489 -17249 -9531 2502 17508 6654
769F654j6975l629j289J5455J2811r051n596p276l101J5072L867k258K494q247
$$ 6654 -10321 -13950 -15239 216 13027 3976 -1620 -8896 -11997 3075 6942 4684 7178 -1069
783a069L36O458m953M555L302m801M082o951q376Q053K714N304K839j5320n054
$$ -1069 -733 5725 772 5327 8629 3828 7910 959 -7417 636 3350 8654 11493 -3827 -8881
798h881N099L934J3623k334j5235k617q72R594J4322r064r077k371l090J2076
$$ -8881 -3782 152 13775 11441 -3794 -6411 -7283 2311 16633 7569 -1508 -3879 -6969 5107
812E107M447j0657k365m084K183J1282p293q043J682m10J2255M046j5237n275
$$ 5107 9554 -1103 -3468 -7552 -5369 5913 -1380 -9423 -7741 -8151 4104 8150 -7087 -12362
826a2362q5Q284J9158m048j6794q858l375K0063J9713r078j5540j6978l421K5556
$$ -12362 -12447 -4163 14995 10947 -5847 -14705 -18080 1983 21696 12618 -2922 -19900 -23321 2235
840B235J6070l748j3608k3801M30K3885J3244O088j3269k3836J126J1526J4402
$$ 2235 18305 14557 949 -22852 -22422 1463 14707 20795 7526 -16310 -15184 -3658 10744
853A0744J4023j2478j7114m299j397J5426J4850n336o531j4753j1900J3664J2737
$$ 10744 24767 12289 -4825 -9124 -10521 4905 19755 14419 7888 -6865 -18765 -5101 7636
866G636Q306J526k1432j4686M682J1120K2848M966k1736j6458q906J1349K9237
$$ 7636 15942 17468 -3964 -18650 -13968 -2848 20000 24966 3230 -13228 -22134 -10785 18452
879A8452O016j3639j9357j9907J1446K6205J0041k332k3009k2583P765J6121J7603
$$ 18452 24468 10829 -8528 -28435 -16989 9216 19257 16925 -6084 -28667 -20902 -4781 12822
892A2822Q070k0995j8325j935O081K3694J2129j1616j2528j7291k166K2919J4597
$$ 12822 20892 -103 -18428 -20363 -14282 9412 21541 9925 -2603 -19894 -22060 859 15456
905A5456M580j0195k7648p213J3829J8461K0466q891k9732j4178J649K5308K9462
$$ 15456 20036 9841 -17807 -25020 -11191 7270 27736 18845 -10887 -25065 -23416 1892 31354
918C1354n869k3155k2708q120K8527K8686J158j5902l1567j1830K3912K3261J1530
$$ 31354 25485 2330 -20378 -28498 29 28715 29873 13971 -17596 -29426 -5514 17747 29277
931B9277j0810l2803j0278J2133J8937J9706r050k4265r254j215J6188J9960m011
$$ 29277 18467 -14336 -24614 -12481 6456 26162 17112 -7153 -16407 -17622 -1434 18526 14515
944A4515j0054j1609j0369J1850J2616L595K181j4736j3281L591L687J3561R698
$$ 14515 4461 -7148 -17517 -5667 6949 10544 12725 -2011 -15292 -11701 -8014 5547 15245
957A5245j2774j0247q514j123J9636J1324m218q942j8466j174J8674J1233O363
$$ 15245 2471 -7776 -16290 -17413 2223 13547 9329 387 -18079 -19253 -579 10654 17017
970A7017j0019k2176m00J0453J2166J2275j2394j6987j968J407J5243J1322r790
$$ 17017 6998 -15178 -15578 -5125 7041 19316 6922 -10065 -12033 -10626 4617 15939 6149
983F149p710p009j820J4547N017k670q89j0624l65P904k9N746M99r707J175j901
$$ 6149 -1561 -8570 -10390 4157 9174 6504 5615 -5009 -5374 2530 2501 8247 8746 -961 214 -1687
999a687q61R246j856k949k47q597L081P260j840L610l579q125N072J181Q73M849
$$ -1687 -2548 6698 4842 1893 1646 -6951 -3870 3390 1550 5160 1581 -6544 -1472 -291 582 5431
1015E431p783j042M375l016L465q32o512O274J975k930J293q504j259R929J544
$$ 5431 -2352 -3394 981 -2035 1430 598 -5914 360 2335 -595 698 -7806 -9065 864 2408
1030B408K411m972j2618M617Q231N530O496j2342j2677L913N937J2918N393j5306
$$ 2408 4819 -153 -12771 -8154 77 5607 12103 -239 -12916 -9003 -3066 9852 15245 -61
1044f1q858j875N034J7175J746j0330o538r379N705J5081R21l72o374j1629M348
$$ -61 -8919 -10794 -5760 11415 13161 2831 -3707 -13086 -7381 7700 8621 8249 1875 -9754 -5406
1059e406O059M235Q218o889r068j545m394Q798J2238k040l446j1873j1254J0914
$$ -5406 653 4888 13106 6217 -2851 -4396 -8790 8 12246 10206 6760 -5113 -16367 -5453
1073e453J2432P332m83k0356j2605O877J2155J8037Q43k1904j3020k408J3530
$$ -5453 6979 14311 13828 -6528 -19133 -12256 -101 17936 18779 -3125 -16145 -18553 -5023
1086e023K4113J08j6291j5726j1254J5037K2510L452o658j9103j4666J1291J5262
$$ -5023 19090 19198 2907 -12819 -24073 -9036 13474 16926 10268 -8835 -23501 -12210 3052
1099C052J1344K284k0251j4126K211Q558J9610O568j4761j1570j0479L749K1755
$$ 3052 14396 16680 -3571 -17697 -15486 -6928 12682 19250 4489 -7081 -17560 -13811 7944
1112G944R408l144j2505k0447R33J7071J3590R345j3959k3495l219Q848J9038
$$ 7944 17352 14208 1703 -18744 -17811 -740 12850 22195 8236 -15259 -18478 -9630 9408
1125I408J5204j2795j9034j0254J079K2521J5719o166j3039j8105k919J9811J2382
$$ 9408 24612 11817 -7217 -17471 -16392 6129 21848 15682 2643 -15462 -18381 1430 13812
1138A3812K907p962k1065m256J0231J0726J2440n478j6302o044k427J0202J6268
$$ 13812 16719 8757 -12308 -16564 -6333 4393 16833 11355 -4947 -10991 -13418 -3216 13052
1151A3052j180p557j0821j1570R918J4426N439J451j5213j4451M473Q471J4839
$$ 13052 11872 4315 -6506 -18076 -8158 6268 11707 13158 -2055 -16506 -12033 -3562 11277
1164A1277N720j6658j2588l485N725K0359O048j1145j1173j1244N891J8650N105
$$ 11277 16997 339 -12249 -15734 -10009 10350 16398 5253 -5920 -17164 -11273 7377 12482
1177A2482k756j1074j4109O364J1498O611M084j1991j1257L594L631R109M848
$$ 12482 9726 -1348 -15457 -9093 2405 9016 13100 1109 -10148 -6554 -2923 6186 11034
1190A1034r515m535j954p58R899K319l263M87p298j229N901j00M324N52p727j85
$$ 11034 1519 -3016 -4970 -5728 4171 6490 3227 3714 -3584 -4813 1088 988 5312 5864 -1863 -2048
1206b048k85p5Q218j282l631m38o490K756O654k115J902k760o381M934J207j90
$$ -2048 -2333 -2408 5810 4528 897 459 -6031 -3275 3379 1264 3166 406 -5975 -1041 166 -24
1222b4L953n120j167L188l813K581J376l748M939o13m123K468l570J049O935k664
$$ -24 3929 -1191 -2358 830 -2983 -402 974 -2774 2165 1552 -2571 -103 -3673 -2624 4311 1647
1238A647j106k201o517N884N884k28J847p815n231N694K812N316K053j0028l205
$$ 1647 541 -1660 -8177 -2293 3591 3363 5210 -2605 -7836 -2142 670 5986 8039 -1989 -5194
1253e194L49J700R762J323o301k366o180J513R952J114Q30l721j0588J407M989
$$ -5194 -4845 -3145 6617 7940 1639 -727 -6907 -5394 4558 5672 6502 2781 -7807 -6400 -1411
1268a411N033Q225n987j0536k582j181J0248J1228m605p625j0150m894J3405J1623
$$ -1411 3622 11847 5860 -4676 -7258 -8439 1809 13037 8432 807 -9343 -14237 -832 10791
1282A0791R44n129j6660o087J1410J0590R307n261j8710n973M594J1595J5042
$$ 10791 11735 6606 -10054 -16141 -4731 5859 15166 9905 -8805 -14778 -10184 1411 16453
1295A6453n211j4250q353l504J2690J5175j935o823j2449q369J0755J1424N986
$$ 16453 11242 -3008 -11361 -14865 -2175 13000 11065 4242 -8207 -16576 -5821 5603 11589
1308A1589k76j4972r861L958O892J3619L286j2254r334o165M405J7600O347n313
$$ 11589 11313 -3659 -13520 -9562 -2670 10949 14235 1981 -7353 -13518 -9113 8487 14834 9521
1322I521j0854j4493L347J5543R247L435j2489j7598O03R619J3860R535j2687
$$ 9521 -1333 -15826 -12479 3064 12311 15746 3257 -14341 -13738 -4119 9741 19276 6589
1335F589j5471n336L545J7242J0846q058j1152j1952m12J6722R420N80p428j6401
$$ 6589 -8882 -14218 -10673 6569 17415 9357 -1795 -13747 -14159 2563 11983 12563 5135 -11266
1349a1266k796J0082R030R278n844j5125m619Q56R959J4149l245r550r459o479
$$ -11266 -14062 -3980 5050 14328 8484 -6641 -11260 -10404 -445 13704 10459 909 -8550 -15029
1363a5029J0603J3169K163l258j3529r151Q252R490R176J08j5296q441K333O686
$$ -15029 -4426 8743 10906 7648 -5881 -15032 -6780 2710 11886 11994 -3302 -11743 -9410 -2724
1377b724J3192J315j1521o559n015O137J3475O67m102o843q875N426Q401L062
$$ -2724 10468 11783 262 -6297 -11312 -5175 8300 8967 4865 -1978 -10853 -5427 2974 6036
1391F036K184q057p602L086K148O370M452o711l903k393j962Q250L955k218r73
$$ 6036 8220 163 -7439 -4353 -2205 4165 8617 1906 -1997 -4390 -6352 1898 5853 3635 2662
1406B662p209j627O409J683L709j019q616n79J746K059O832k376n251j76k837
$$ 2662 -4547 -6174 235 1918 5627 4608 -4008 -4587 -2841 -782 6050 3674 -1577 -1753 -4590
1421d590L743O006l445p94k124l691M940J130j280K637l614q88L344k915J394
$$ -4590 -847 5159 1714 920 -1204 -4895 45 1175 -105 2532 -1082 -1970 1374 -1541 -147
1436a47J568k906L128m85l789K080j173O77N204k643j803m95m478N154L732j444
$$ -147 1421 -1485 1643 1158 -2631 -551 -1724 -1047 4157 1514 -289 -784 -5262 -108 3624 2180
1452B180N60m730l844N050J758L042J657p692k304J312R01P178P72n784j847m225
$$ 2180 2740 -1990 -5834 -784 974 4016 5673 -2019 -4323 -3011 -2110 5068 5840 56 -1791 -6016
1468f016J848Q633J070q26m391q260K665N790L635M813p162q811L96K470Q378
$$ -6016 -4168 4465 5535 4709 318 -7942 -5277 513 4148 8961 1799 -7012 -6616 -4146 4232
1483D232O581p030p113m644o59J1412O579k911n274j0346j086J0390O241L850
$$ 4232 10813 3783 -3330 -7974 -8633 2779 9358 6447 1173 -9173 -10259 131 6372 10222
1497A0222n102j3193j797N020P528Q796m483j0629m494j430R297J0896k040n810
$$ 10222 5120 -8073 -9870 -4850 2678 11474 6991 -3638 -8132 -9562 -265 10631 8591 2781
1511B781r309o002Q990R193M056j404j2547p615M807P399J0372Q69j2139p832
$$ 2781 -6528 -12530 -3540 5653 9709 8305 -4242 -11857 -7050 349 10721 11590 -549 -8381
1525h381k979O375J4580K496p657r400q801N985J3811N114j414j0991j2209L674
$$ -8381 -11360 -4985 9595 12091 4434 -4966 -13767 -7782 6029 11143 9729 -1262 -13471 -9797
1539i797R737R285M068j1896j1235q19M901J3373N847q651q996p213J823J3264
$$ -9797 -60 9225 13293 1397 -9838 -10657 -5756 7617 13464 4813 -4183 -11396 -9573 3691
1553C691O598j832o868j1862j60R561P106N622o558j2723k224L382Q575R677m793
$$ 3691 10289 8457 1589 -10273 -10433 -872 6234 11856 5298 -7425 -9649 -6267 2308 11985 7192
1568G192q984n960k243R788R653j070m570j0338n032Q682P486M590j789j1679
$$ 7192 -1792 -7752 -9995 -207 9446 8376 3806 -6532 -11564 -2882 4604 9194 7405 -4274
1582d274n098M144N496Q778p56r151n034k493N303J0283j1m087n603o378M859
$$ -4274 -9372 -5228 268 9046 8290 -861 -5895 -8388 -3085 7198 7187 3100 -2503 -8881 -4022
1597d022P505J880Q26o869o775K834L142N429L567o582m660j047J80P873K667
$$ -4022 3483 5363 6189 -680 -7455 -4621 -1479 3950 7517 935 -3725 -4772 -4592 3281 5948
1612E948l932k206n038J10O589J574Q61j632o855R26K904J690M008l292m197N98
$$ 5948 2016 -190 -5228 -5118 1471 3045 3906 2274 -4581 -3655 -751 939 4947 1655 -2542 -1944
1628a944p42K939L463k745n75p36k418L194Q22j207K277k742j214K395j781J296
$$ -1944 -2686 253 3716 971 396 -340 -2758 436 1258 51 2328 -414 -1628 767 -1014 282
1644B82J652k153J651o30l093K075K03J05L045l139j318P33j909L269K292k237
$$ 282 1934 -219 1432 802 -2291 -216 -13 92 3137 -2 -1320 -587 -2496 773 3065 828
1660H28M98k925k793M256J201J329M09n478r64J696J001M728om856j376k437J913
$$ 828 1326 -1599 -4392 -136 1065 2394 2803 -2675 -3639 -1943 -942 3786 3780 -1076 -2452 -4889 -2976
1677b976O866o3j910l192n328L403N477J788J328n637o194K203K410N495L946
$$ -2976 3890 3827 1917 -1275 -6603 -3200 2277 4065 5393 -244 -6438 -4235 -1825 3670 7616
1692G616o158m798k108K17Q933M129l770m318o829L23Q240M151J365l825r447
$$ 7616 1458 -3340 -5448 -5231 3702 7831 4061 -257 -7086 -6763 1477 5628 6993 3168 -6279
1707f279q44M774N732O172m479r151l119M95P952Q065k776n940o543l372Q268
$$ -6279 -7123 -2349 3383 9555 5076 -4075 -7194 -6699 1253 9318 6542 602 -5941 -9313 -1045
1722a045P501J203k914j0072m771N839O835O270j347j0840m864R50N724R868r4
$$ -1045 6456 7659 4745 -5327 -10098 -4259 2576 8846 7499 -3341 -8205 -7255 -1531 8337 8243
1737H243p570o362m577N842J0156K377k590q387p829M403Q048N650J405q951q263
$$ 8243 673 -5689 -10266 -4424 5732 8109 5519 -2868 -10697 -6294 1754 7404 8809 -142 -8405
1752h405P21M454R302M360p453o846n035K459J0937M515l227n725q858P43Q732
$$ -8405 -7684 -3230 6072 10432 2979 -3867 -8902 -6443 4494 9009 5782 57 -8801 -8058 674
1767F74N458K980n638j0151q99M319O962O465n270q200l500p3Q424O923k649m442
$$ 674 6132 9112 3474 -6677 -7576 -3257 3705 10170 4900 -3300 -6800 -6873 1551 8474 5825 1383
1783A383p000k390P166N600K134k371r276l035M092M775O266j103q415l211o03
$$ 1383 -5617 -8007 -841 4759 6893 4522 -4754 -7789 -3697 1078 7344 6241 -2174 -5385 -5988
1798e988M279P845n79m381m624m175M342O834J156m84o122n086L350L894L478
$$ -5988 -1709 6136 5557 1176 -3448 -7623 -3281 3553 4709 4225 -1897 -6983 -3633 261 3739
1813C739J325n676l611L12J354N769J991m012k175k984N54N606N72k18j696m510
$$ 3739 5064 -612 -4223 -3911 -2557 3212 5203 1191 -984 -3968 -3414 2192 2764 2546 850 -3660
1829c660J208K710P51K765j730l811M86r01K276L550k294j155n83k058K740J555
$$ -3660 -2452 258 1009 3774 2044 -1767 -1281 -2182 94 3644 1350 195 -388 -2446 294 1849
1845A849r89J490k741j355J813l07J006J136k839O32L30j711K427m27n44K060
$$ 1849 860 2350 -391 -1746 67 -240 766 1902 -937 -305 25 -1686 741 314 -230 1830
1861A830j982j094Q26j740K618J985k292L33j871j616L367P96L28L25m317q68
$$ 1830 -152 -1246 -420 -2160 458 2443 151 484 -1387 -3003 364 1160 1488 1813 -2504 -3372
1877c372K349R23L350o86m469l22o10J514N161j188k189j894l330L087M294N61
$$ -3372 -1023 -100 3250 2564 -1905 -2227 -2837 -1323 3838 2650 461 -1433 -4763 -1676 2618 3179
1893C179K79m017m117K454K512L036K123n201l377p35Q62O119K783l253l184m925
$$ 3179 3458 -559 -4676 -2222 290 3326 5449 248 -3129 -3864 -3002 3117 5900 2647 -537 -5462
1909e462N77P517K741l88l699o937M18M916M063L597m368p399j005J328N979N920
$$ -5462 -4885 2632 5373 4985 1286 -5651 -5233 -317 3746 7343 2975 -4424 -5429 -4101 1878 7798
1925G798m156n635l706r36P405N341r38l303o689k631N756M662L439j741q536
$$ 7798 3642 -1993 -5699 -6635 770 6111 5173 1870 -4819 -7450 -1694 2968 6407 4666 -3870
1940c870l037K379M708O740r88o807m109k291M617P785Q41k684o279n928M576
$$ -3870 -6907 -4528 180 6920 5932 -875 -4984 -7275 -2658 5127 5968 3284 -2995 -8923 -4347
1955d347O886L940M88p952o312J934M358O869K330p213n525k067K448Q912K887
$$ -4347 2539 6479 6967 -985 -7297 -5363 -1005 5864 8194 981 -4544 -6611 -4163 4749 7636
1970G636l691n142o208K066P912L273l1m830p080R05M120M837L746m412o670j529
$$ 7636 3945 -1197 -7405 -5339 2573 5846 5815 985 -6095 -5190 -1070 3767 7513 3101 -3569 -5098
1986e098O72O330N070l174m146m580j077O328M139M85k037o979k502M114L836
$$ -5098 -4426 1904 6974 3800 -346 -4926 -6003 325 4464 4949 2912 -4067 -6569 -2455 1381
2001A381M373j333p226k323O44M087O028j457m550k973k344L846N535k03j177
$$ 1381 5754 4421 -2805 -5128 -4484 -397 5631 4174 -376 -3349 -5693 -1847 3688 3485 2308
2016B308m494l690L576L249K267N77n153k414J281J189M186P99l446j198j734
$$ 2308 -2186 -5876 -2300 949 3216 3793 -1360 -3774 -2493 -1304 2882 3681 235 -963 -2697
2031b697O32M339N40o24j395l754Q46K743L55K078j496l519Q01l1J465K939k031
$$ -2697 -2065 2274 2814 2190 795 -2959 -2113 630 985 3063 1567 -1952 -1151 -1182 283 3222 1191
2048A191j556l86j611L113J657j506K95j848j149K633o46R3J139k350O69J39j353
$$ 1191 -365 -751 -2362 751 2408 902 1197 -651 -1800 833 187 280 1419 -931 -262 -123 -1476
2065a476J975m94p90J913j428j042J131j512J934J934k537l65r23q08L483N89
$$ -1476 499 5 -785 1128 -300 -1342 -211 -1723 211 2145 -392 -757 -1680 -2488 995 1584
2081A584r10J74l342K96K378K96J695p93l937N09L78J516L358j617k223o15j577
$$ 1584 674 848 -2494 -2198 180 476 2171 1378 -2559 -2050 -1672 -156 3202 1585 -638 -1253 -2830
2098b830K310K937p18M85k750l055K384J994K277J436m675k699M80R17M802J472
$$ -2830 -520 2417 1699 2184 -566 -3621 -1237 757 3034 4470 -205 -2904 -2424 -1507 3295 4767
2114D767l671k330k856Q93O031J680j003k951n680J208N200K253J358l827n516
$$ 4767 1096 -1234 -4090 -3197 2834 4514 3511 560 -5120 -3912 1288 3541 4899 1072 -4444
2129d444O89K050L892L655l901m261k188k23N781L672j979k511m792j018M977
$$ -4444 -3755 -1705 2187 5842 1941 -2320 -4508 -4731 1050 4722 2743 232 -4560 -5578 -601
2144f01L318J613j330o180j964K162L304N006r81n921l051q65M056O676m16l490
$$ -601 2717 4330 3000 -3180 -5144 -2982 322 5328 4347 -1574 -4625 -5490 -1434 5242 4826 1336
2160A336m483l468M018N672K138p60n988m635K676M415M390P63o495l671q4K418
$$ 1336 -3147 -6615 -2597 3075 5213 4453 -1535 -6170 -3494 921 5311 6074 -421 -4092 -4176 -1758
2176a758O392J142m027l491l279J795N923J762o31l653n542J726L689L161K093
$$ -1758 4634 5776 1749 -1742 -5021 -3226 2697 4459 3828 175 -5367 -3641 48 3209 5302
2191E302l614m780m26P33M778L889l191l326l789q70N741L483n89k183n487j060
$$ 5302 1688 -3092 -3518 -2785 1993 5882 2691 -635 -4424 -5294 447 3930 3341 1158 -4329 -5389
2207e389M145L147K299j715n534j351J026L581M547j625m118k075j054L406M412
$$ -5389 -1244 1903 4202 2487 -3047 -4398 -3372 209 4756 3131 -987 -3062 -4116 -710 3702
2222C702j232j284l301k382L090K559J230K70l838k098J845R54K950Q55l378r59
$$ 3702 2470 1186 -2115 -4497 -1407 1152 2382 2652 -1186 -3284 -1439 -485 2465 3320 -58 -1017
2238a017q91L79L530P07q33r03l024K61K665P05J102j839l172R81N05J387K418
$$ -1017 -1908 -1529 2001 2708 1875 972 -2052 -1791 874 1579 2681 842 -2330 -1349 -844 543 2961
2255B961k399j525J43q24K441J176j455N7j432o67K190j33L7M19j899M17R15j694
$$ 2961 562 -963 -820 -1644 797 1973 518 575 -857 -1524 666 533 570 989 -910 -493 422 -1272
2273a272J400J15j071J326j252j063J564o54J472Q53j876k48k13m63K458L92j254
$$ -1272 128 243 -828 498 -754 -1817 -253 -907 565 1418 -458 -706 -919 -1382 1076 1468 214
2290B14J64k094M56K105oL87m65k623O13N43K07K454r33j549l8j295J844K548
$$ 214 378 -1716 -1260 845 839 1226 761 -1862 -1249 -706 -499 1955 1022 -527 -565 -1860 -16 2532
2308B532q61K2k137k310K092J564J533P80l359k343N91J077L477R89l601j879
$$ 2532 1671 1693 -444 -2754 -662 902 2435 3215 -144 -2487 -1896 -819 2658 3647 46 -1833
2324a833j524J184M856N55j640k307l282J697L948J045N69k970m101J207K140
$$ -1833 -3357 -2173 2683 3238 1598 -709 -3991 -2294 1654 2699 3268 298 -3803 -2596 -456
2339d56K330J921l077l067o70Q3L967K506j993j778l198r77M262K716Q05j198
$$ -456 1874 3795 718 -2349 -3019 -2936 1031 3537 1544 -234 -3432 -4409 -147 2569 3374 2176
2355B176m958j167K342K778L387j362m897k220L4L364N230j178l385l059k123
$$ 2176 -2782 -3949 -1607 1171 4558 3196 -1701 -3921 -3887 -523 4707 3529 144 -2915 -5038
2370e038L867M287N32j362m561k639L326L164K653k81m715k520R78K005M168K92
$$ -5038 -1171 3116 3648 2286 -2275 -4914 -1588 1576 4229 3948 -767 -3287 -2309 -304 3864 4156
2386D156l648k200k251J790M599J069j285k663l807J081L540K147J645l577l925
$$ 4156 508 -1692 -3943 -2153 2446 3515 2230 -433 -4240 -3159 381 2528 4173 596 -3329
2401c329J49J444L734K956l147l245j986p6M480K639j194k384l987l95M329K040
$$ -3329 -3180 -1736 1998 4954 1807 -1438 -3424 -3500 980 3619 2425 41 -3946 -4341 -12 2028
2417B028J052j814m497j95J963K188K661j699l118o88l95K645L153j374j240k398
$$ 2028 3080 1266 -3231 -3426 -1463 725 3386 1687 -1431 -2119 -2514 131 3284 1910 670 -1728
2433a728j284K652K005R5N9l036j466J300J137K141Q30k874j039o00Q92L090K78
$$ -1728 -3012 -360 1645 1740 1799 -1237 -2703 -1403 -266 1875 2705 -169 -1208 -1808 -916 2174 2452
2450B452j221j078k235Q78K587J92L48j674k294R61R68O53J439j992j142M32k96
$$ 2452 1231 153 -2082 -1204 1383 1575 1923 249 -2045 -1084 -116 537 1976 -16 -1158 -726 -1022
2467a022J679J000j636L03n45q76J893l74m35O11r12J44K96j088R99M38q32N17
$$ -1022 657 1657 21 324 -221 -1097 796 422 -13 598 -314 -170 126 -962 37 475 -357 160
2485A60j273o10J571l79P03P44j917o0M57p5J752N1j340M41j118K95J589l91O0
$$ 160 -1113 -1723 -152 -531 172 916 -1001 -1061 -604 -679 1073 1124 -216 225 -893 -598 991 600 660
2504F60j18j834Q90J25J75J577j011j071j76p47J313K171q61j81j247j421J795
$$ 660 542 -1292 -402 -277 -102 1475 464 -607 -783 -1530 -217 1954 1093 912 -335 -1756 39
2521C9J692L39J41l037j290J371J007K054J64l228j142l02J213L124j34k054j244
$$ 39 1731 2070 2211 -826 -2116 -745 262 2316 2480 -748 -1890 -2192 -979 2145 2011 -43 -1287
2538a287j689J636L031K74Kk316k399J359J509J530J044k352k554NL32K638J775
$$ -1287 -2976 -1340 1691 1965 1967 -349 -2748 -1389 120 1650 2694 342 -2212 -2207 -1875 763 2538
2555B538j533j761k136l27L204K014L01j328l769l34K653K348J874j485m168p98
$$ 2538 1005 -756 -2892 -3219 -15 1999 2300 972 -2797 -3131 -478 1870 3744 2259 -1909 -2707
2571b707O50L006L046j703k942j838j020L532K685k68j445l316j156K933K033
$$ -2707 -2057 949 3995 2292 -650 -2488 -3508 24 2709 2441 996 -2320 -3476 -543 1490
2586A490J387l20l673j218J103J400L210l1k980j684j572J690L421K04q89k184
$$ 1490 2877 2557 -1116 -2334 -1231 169 3379 3348 368 -1316 -2888 -1198 2223 2427 1538 -646
2602f46k915J219K793J792N84k762l336O47J563K909K068l167k518q90O24L801
$$ -646 -3561 -2342 451 2243 2827 65 -3271 -2624 -1061 1848 3916 749 -1769 -2659 -2035 1766
2618A766J408j795j810k680L28L378J047K18j886k847M04J941J352J586j259k425
$$ 1766 3174 1379 -431 -3111 -2783 595 1642 1860 -26 -2873 -2469 -528 824 2410 1151 -1274
2634a274l14J86J874K134j008j235j233j334K150J615K21k52k338j624J514P43
$$ -1274 -1588 -1402 472 2606 1598 363 -870 -2204 -54 1561 1782 1530 -808 -2432 -918 -175
2650a75J908K16k619p05MP34K595r3j227q62j251Q41K160M7m82j157j702J259
$$ -175 1733 1949 -670 -1375 -1371 -637 1958 1865 638 -224 -1475 -634 1526 1573 1091 -66 -1768 -509
2668e09O47K92Q38j591j166Q05j86J018O94j318L78k01o26J323j09j58P29j267
$$ -509 138 430 1268 -323 -1489 -684 -870 148 842 -476 -98 -299 -925 398 289 131 860 -407
2686d07K8N11o08R70J71j094L08p11k46J417l62j52L98j329L06Q38k69J103j74
$$ -407 -379 132 -476 494 665 -429 -121 -832 -1078 339 -23 -175 223 -1106 -800 38 -231 872 698
2705F98q46L32m44P2J192o02J69L0j323K79L56K10J117r53j097K39m87R41J375
$$ 698 -148 184 -260 -188 1004 402 571 601 -722 -443 -87 123 1240 287 -810 -571 -1058 -117 1258
2724A258m89o37q41o79J438J698k07k19k179p19J550O42R35j72k358r05N81P46
$$ 1258 769 132 -709 -1388 50 1748 1541 1322 -857 -1576 -26 616 1551 1379 -979 -1884 -1303 -557
2742e57K030m22j452q49j056J236K429j61j49j303j852J207J499P44R51k110j876
$$ -557 1473 1051 -401 -1250 -2306 -1070 1359 1198 1049 -254 -2106 -899 600 1344 2295 185 -1691
2759a691L78J93K191J121j990j178j378J65K968J073k66j583k362L7K423J386
$$ -1691 -1313 -1120 1071 2192 202 -976 -2354 -2189 779 1852 1586 3 -2359 -2322 101 1487
2775A487J108j375k949p4J039K060J903j904k326p28k83K348J971q65j431j766
$$ 1487 2595 1220 -1729 -1803 -764 1296 3199 1295 -1031 -1759 -2042 306 2277 1412 -19 -1785
2791a785p64K463J457N81k92k824q79J194J366K076j89k635r71n68J043K910j03
$$ -1785 -2549 -86 1371 1952 1660 -1164 -2043 -849 517 2593 2404 -231 -1202 -1770 -727 2183 2080
2808B080j396j608k008J115K914N49J9k143k415J023J866J981N84k500j858n4
$$ 2080 684 -924 -2932 -1817 1097 1646 1665 -478 -2893 -1870 -4 1977 2561 61 -1797 -1851
2824a851J097K545P41j594j610j496N40K602M21K1j402k172L20J531R20J169j212
$$ -1851 -754 1791 2532 938 -672 -2168 -1628 974 1395 1416 14 -2158 -1838 -307 613 1782 570
2841E70j696o4K03J392J845q62j236j127o41J949J237J2p02j680j024J194Q12
$$ 570 -1126 -1190 -987 405 2250 1388 152 -975 -1616 333 1570 1582 880 -800 -1824 -630 182
2858A82J538m89k258n75O08O80K122m02j533j78p74O80J958n33l26q49j217J253
$$ 182 1720 1231 -1027 -1602 -994 -314 1808 1406 -127 -305 -1079 -399 1559 1026 700 -149 -1366 -113
2876a13O22j99P77j114j117O24j81O34M37p51N1k70m11J125L87k31N96j228j12
$$ -113 509 310 1087 -27 -1144 -520 -701 -67 370 -381 -330 -600 -1011 114 501 270 866 -362 -474
2895d74N71k01P36K88j422K48l07L9Q47j96j15j57p44K50R63n60O58j59m65K91
$$ -474 97 -104 632 920 -502 -254 -561 -522 325 129 14 -143 -887 -637 326 -234 424 265 -200 91
2915I1j33j37R37Qj59j6r05P0O86k67N16l21j246L66K6O63R92p29j030k51q9J150
$$ 91 -42 -179 758 766 607 591 -314 -244 442 175 691 370 -876 -510 -484 179 1171 442 -588 -839 -928 222
2937B22J022m76k43j091n19J252N03J92R4j615n89O16K46J361j91j449m44m30
$$ 222 1244 768 525 -566 -1085 167 670 862 956 -659 -1248 -632 -386 975 784 -665 -1109 -1539
2955a539Q52J777k36l89p76j316Q51J290M56N20j459j267K75M95J516P22j752
$$ -1539 -687 1090 854 465 -311 -1627 -776 514 970 1490 31 -1236 -961 -466 1050 1772 20
2972B0j028q44K68K153Q55o67j135j520K46K246P74L66j161k078J12J027J526
$$ 20 -1008 -1852 -1584 569 1424 757 -378 -1898 -1652 594 1368 1734 573 -1505 -1393 -366 1160
2989A160J159j233j663m52j82J629J720j202r64j429p01J932J181N59l99k021
$$ 1160 2319 1086 -577 -1029 -1211 418 2138 936 -28 -1457 -2158 -226 955 1514 1115 -906
3005i06r54J220J088J419n6k232o81j71J021K078j91j327j210j374J396J836K85
$$ -906 -1860 -640 448 1867 1811 -421 -1102 -1273 -252 1826 1635 308 -902 -2276 -880 956 1241
3022A241m31j699j388R15J559Q99P18j940j433L70O64J705P80j562q99q55M79
$$ 1241 810 -889 -2277 -1362 197 1096 1814 -126 -1559 -1189 -525 1180 1960 398 -501 -1356 -877
3039h77J925K93n34p23j566K32J260N09P50q89j679J70K88J272J217m47j212o54
$$ -877 1048 1341 807 84 -1482 -1250 10 519 1269 380 -1299 -1129 -841 431 1648 1201 -11 -665
3057f65l46J407J076l66l57j432p48J294R35L97k61j824k90M84O91J083j84j292
$$ -665 -1011 396 1472 1106 749 -683 -1431 -137 798 1195 934 -890 -1180 -696 -5 1078 894 -398
3075c98j73l22P05J219p0l68m86r76P71P15j84L03q45n99L62j24M36O04p68j38
$$ -398 -571 -893 -188 1031 961 593 107 -869 -98 617 433 736 -109 -708 -346 -470 -34 570 -198 -336
3095c36k04l37Q90M73l53J65n23k49O39K62K03jq73M6K39k46P00k52n19K92o15
$$ -336 -540 -877 13 486 133 298 -225 -474 165 427 630 629 -244 -198 41 -205 495 243 -276 16 -599
3116e99Q5P47m21M50l7o80M13j56J29O30k37P4J02p51J9P24q0K06l88j029L43
$$ -599 -514 233 -188 262 225 -455 -42 -198 -69 561 324 398 500 -251 -232 492 412 618 230 -799 -456
3137d56LO42P27q64p65J49k06J184K76k78k82p42j23J007K40J46j41j117j21M11
$$ -456 -453 189 916 52 -713 -564 -770 414 690 412 130 -612 -735 272 512 658 517 -600 -721 -310
3157c10L46Q30l96j009k73j80L75J644k12p05p31o09N13J209M28J66j025j371
$$ -310 36 866 470 -539 -812 -992 -617 1027 815 110 -621 -1230 -717 492 920 1086 61 -1310
3175a310P03N67R36M96j271q65j74J21J512L89q64o70j078L39J723L10L95j066
$$ -1310 -607 -40 896 1392 121 -744 -918 -797 715 1104 240 -430 -1508 -1169 554 864 1259 193
3193A93j548M05J008P46J097j461j194j00O1J252J090p46o89j182o34J670J034
$$ 193 -1355 -950 58 804 1901 440 -754 -854 -793 459 1549 803 114 -1068 -1702 -32 1002
3210A002qo07j459m94J072Q26R49j82j485n98J61P49J493j81j401n63o32P46J759
$$ 1002 994 387 -1072 -1566 -494 332 1281 1099 -386 -984 -823 -74 1419 1238 -163 -726 -1358 -612 1147
3229A147k6p02j101j082Q58J090P12Q8j391r32M36P21J343K95j293n96o31O06
$$ 1147 1121 419 -682 -1764 -906 184 896 984 -407 -1339 -903 -182 1161 1456 163 -433 -1064 -458
3247d58J184L69n80n30j360K91J356K46M75r49r05j05M69P50J070q42j029k22
$$ -458 726 1095 515 -15 -1375 -1084 272 518 993 44 -861 -966 -497 253 1323 481 -548 -770
3265g70r4J183R05m33m01r92l50J298R0M17m84j147k01N81K33R38j6j155j0k91
$$ -770 -864 319 1224 791 390 -602 -952 346 436 853 369 -778 -979 -398 -165 773 757 -398 -408 -699
3285f99L60J270l29l75r5o92N19O33k49K61l13r81L58j38P15L32o25k34j90j03
$$ -699 -339 931 602 227 132 -560 -41 592 343 604 291 -690 -332 -470 245 577 -48 -282 -472 -575
3305e75Q62lj87j11m19K31K57J99K80k62n88K89L6p5N69l39l04K10m77P2N81l53
$$ -575 287 284 97 -14 -433 -202 55 254 534 272 -316 -27 9 -66 503 164 -140 70 -407 -335 246 -107
3327a07L81nn33L17k65q0P79j22o83L29l16L14N31j71K4l29o63M58L10j6L75l47
$$ -107 274 269 -264 53 -212 -292 487 365 -318 11 -305 9 540 369 393 64 -599 -141 169 153 528 181
3349A81p57L54l85O51O21n69j90l86j28P53K19R7o6p79p8J90L95N33O5j063l99
$$ 181 -576 -222 -607 44 665 96 -94 -480 -608 145 364 461 395 -384 -462 -272 123 656 721 -342 -741
3370g41J46K31J009j86n31l26n91O30R57K3J61j067p78O04P40O27K23q96j114
$$ -741 -595 -364 645 459 -72 -398 -989 -359 598 621 782 -285 -1063 -459 281 908 1131 235 -879
3389h79L74QJ356Q9q61m03p00M03J254J55l45m99q73L41O93O82M16r04q40n2K79
$$ -879 -505 -497 859 948 87 -316 -1016 -613 641 796 451 -48 -921 -580 113 795 1211 307 -533 -585 -306
3410c06Q21R03r10o74n20k55J130P37j92n84r63o85J175Q59L74m56j045l66M83
$$ -306 515 1418 508 -166 -686 -941 189 926 734 150 -813 -1498 -323 536 910 454 -591 -957 -474
3429d74O57R60k64r47q65j6N35J550m20j85r60o28O80Q85j20L84j080o33M88O5
$$ -474 183 1143 879 -68 -933 -949 -414 1136 716 531 -429 -1057 -377 508 388 772 -308 -941 -453 -388
3449c88J303J64r11o34j66K91R67M58o93n00o90j44J191L30K66p43j242M03O33
$$ -388 915 1079 168 -466 -632 -341 626 1084 391 -109 -799 -943 248 578 844 101 -1141 -738 -105
3468a05L55O23p85p31J61j81Q35P37l15l17o90k28P56N77j84k15q23k19O45J84
$$ -105 250 873 88 -643 -482 -663 172 909 594 277 -413 -641 115 692 508 293 -530 -749 -104 80
3488H0O66k31r23p7p0O0J227l82k79j03o97N08O95l33N6k80p56P59J66L0M46q13
$$ 80 746 515 -408 -485 -555 -495 732 350 71 -32 -729 -221 474 141 197 -83 -839 -80 86 116 562 -251
3510b51k61K90k67M92L71m00L2q8l11P04j46J22j78k08K36q3j3M63m19nj20j04
$$ -251 -512 -222 -489 3 374 -26 6 -82 -393 311 165 287 109 -99 137 54 41 504 85 80 -40 -144
3532a44j01J91J42j60K23n54R1L22j9J98j19l08L52m88M79K60j03n9o5o47N04
$$ -144 -245 -54 88 -72 151 -403 -312 10 -9 189 70 -238 114 -374 105 365 262 203 138 -509 -5
3553eK67J3M8l72l62K34j62M30L67m09q2k38k39N90M27m98M18r31K19L75ML91
$$ -5 262 275 323 -49 -411 -177 -339 91 458 49 -33 -271 -510 80 507 9 427 -504 -285 90 94 485
3575D85n0n91k53M1L97P13n98m42J99p01P93N41q5m6q37l12M49O68J94J16j063
$$ 485 435 -156 -409 -368 29 742 144 -298 -99 -800 -7 534 449 403 -434 -746 -297 371 565 681 -382
3596c82k28K96L1R42k6p02l88k06j4Q92M82m73m59o17M15O05M26K6p10o75L28
$$ -382 -610 -314 -283 659 633 -69 -457 -663 -677 215 697 224 -235 -852 -437 168 594 620 -90 -765 -437
3617d37MN71O35m00p36k77l5Q12P10m79m73n50k07Q68N16Q2l37q77j28K72O00
$$ -437 -433 138 773 373 -363 -640 -675 137 847 368 -105 -655 -862 6 522 604 267 -610 -738 -466 134
3638A34O80k99p44k40k92Q03R76m07m28o41o14J016N11O8q2p74n25N53M50L54
$$ 134 814 515 -229 -469 -761 42 1018 611 183 -458 -1072 -56 455 523 441 -333 -858 -305 145 499
3658D99J00o72m70j57K42J181Q4o64j68p25K12J055p8J43m57q22K34P10R5K61
$$ 499 599 -73 -543 -700 -458 723 807 143 -25 -750 -538 517 439 582 125 -697 -463 247 342 603
3678F03m09r48J72K38O92L38l64m19n16J43N81K99m0j23o10j24L94K31L54q2p08
$$ 603 194 -754 -582 -344 348 686 322 -97 -613 -470 111 410 370 247 -363 -487 -93 138 492 410 -298
3699b98l72L80J14O19m6m25k88j38N29L98j88q4k16m53L99J92J53ll97k71M02
$$ -298 -670 -290 -176 443 397 -28 -316 -454 75 473 285 201 -15 -468 -69 123 276 273 -124 -395 7
3720Gk02M61Kj88j83m9J43K19j32j31K54n09J87K21j59K10J52m80NJ01nL19j36
$$ 7 -195 266 268 80 -103 -152 -9 210 78 -53 201 -308 -121 100 -59 151 303 -177 -172 -71 -76 243 107
3743A07k00J63l13%K46q4M15l72j94L3J19N7J86J30J1l15m04K69M07j61k8k17
$$ 107 -93 70 -243 -243 3 -81 334 -38 -232 -199 -80 -23 163 293 304 -11 -415 -146 261 100 72 -145
3765a45j50L01j55K37J57k80Q8k43r9N11q9p3J14n21j28N08J88K50k48m25k35
$$ -145 -295 6 -149 88 245 -35 53 -190 -289 222 133 60 174 -347 -475 33 221 471 223 -202 -437
3786d37L22K89K71j05l52k25l85N89L00j55j12k82l84N56L12K21p6p55Q7M1L26
$$ -437 -115 174 445 340 -12 -237 -622 -33 267 112 0 -282 -666 -110 202 423 347 -408 -321 -280 46
3807D6M06K3n77l05J3NQ92l8l91j54n97K41P96N6J11m82o13J68L44M67J93n51
$$ 46 452 475 -102 -407 -394 -389 503 465 74 -80 -677 -436 360 416 527 45 -568 -400 -56 411 604 53
3829E3l42k76M09M19N45o23l48l38p7N23N65K9k24n97j31L87M38K14l55o19kP
$$ 53 -289 -565 -156 263 808 185 -163 -501 -578 -55 510 539 315 -282 -413 -26 412 626 271 -348 -350 -343
3851c43L34N78j64k65l91k19M18O1M26j39o47k28P00O9K93Q6p95j73l6M80L92
$$ -343 -9 569 405 140 -251 -470 -52 9 435 296 -351 -579 121 190 483 569 -226 -399 -435 45 437
3872D37K0m97l92j02L04N76J13r4o45l18L42M08K21O7n64j43j85L03N72P4k97
$$ 437 457 -40 -432 -534 -230 346 459 365 -280 -598 -256 152 373 440 -124 -267 -452 -149 423 497 200
3893B00k53k49J75J43M39j55k42l07l80N78J46J31j01l42j21J14K55L93r8o08
$$ 200 -53 -302 -127 16 455 300 58 -249 -629 -51 95 226 125 -217 -338 -224 31 424 326 -282
3913b82J94k48K94M42k38L36n89k90K81L39J33M7o73J48j58J34L36P0o6k56k35
$$ -282 -88 -336 -42 400 162 498 -91 -381 -100 239 372 419 -254 -106 -264 -130 206 276 210 -46 -281
3934b81R6L60p8rN5k24KJ83k03M36m4l22J6k78L81k06K91j12K23m94m6O67m05
$$ -281 -185 175 97 88 143 -81 -79 104 -99 337 293 -29 -13 -291 90 -116 175 63 286 -208 -254 413 8
3957HJ38k18j15J51k3K75J41l00J8j28k8J97N9r5M5j2m44J55J99L23j71k22j58
$$ 8 146 -72 -187 -36 -59 216 357 57 75 -53 -81 116 175 80 125 113 -331 -176 23 346 175 -47 -205
3980b05J87l53O38R9l62j59r3j52N82O4k18R0k89J7L01j04M46l76l28O1k68M58
$$ -205 -18 -371 267 366 4 -155 -248 -400 182 246 28 118 -171 -154 147 43 489 113 -215 -154 -422 36
4002C6L23r7l19l5l48M39L26j38j9l19k37L69R4J58K18m74l00J07J68K89P3l53
$$ 36 359 262 -57 -92 -440 -1 325 187 168 -151 -388 -19 75 233 451 -23 -323 -216 -48 241 314 -39
4024c9J3n52M75K22J98O7o63m15M97L32J97L7k70m68q0K99N09K56m03j73l95j07
$$ -39 -26 -578 -103 119 317 384 -279 -694 -197 135 332 369 99 -369 -449 -150 359 615 212 39 -356 -463
4046d63N94M9rj35m41m3L91J40K76m4o77L21k26M39L77k41l44k03j34M19K89m6
$$ -463 131 180 171 36 -405 -448 -57 83 359 315 -362 -41 -267 172 549 308 -36 -239 -373 46 335 289
4068B89j25n28r2L14K94j22J60k65j47k5R2N42k24l51J01j91J01P06k92n6k22
$$ 289 164 -364 -456 -142 152 30 190 -75 -222 -247 -155 387 163 -188 -87 -278 -177 529 237 181 -41
4089d1m70L60K48L33J33l89o20L05R0K4M67k05m78J18j68K10M32l24nj72k93O27
$$ -41 -511 -151 97 430 563 174 -446 -141 -51 -27 440 235 -243 -125 -293 -83 349 25 20 -152 -445 182
4111A82M5k2j12k33j98L51J50N7k4k97j19k13K18M11M0k64j24j06L56PL2q5r7
$$ 182 227 205 93 -140 -338 13 163 220 196 -101 -220 -433 -215 196 236 -28 -152 -258 98 105 137 52 -45
4134d5l88M76J22P0O5l54j28J99j70M09k09N1J24j56k12J18j21K55J19n20P1K02
$$ -45 -433 43 165 235 300 -54 -182 17 -153 256 47 98 222 66 -146 -28 -149 106 225 -295 -224 -22
4156b2J75j10J06k42L87m77K54q5m0K11p1k99K57p7K37Kl21q8L02k92J49L86m49
$$ -22 153 43 149 -93 294 -183 71 -14 -54 157 86 -213 44 -33 204 206 -115 -203 99 -193 -44 342 -107
4179a07L4L7k95L42Q1K07j83k05n2j31K96L16k72M0j72p1L4J94J75k89j5l61J13
$$ -107 -73 -36 -331 11 92 299 116 -89 -141 -272 24 340 68 108 -64 -135 -101 93 268 -21 -36 -397 -284
4202b84K46L42K04m18j87j21J7L57J37k17o1j18o4K00OJ74j33l57j5K9K09K93
$$ -284 -38 304 508 90 -97 -218 -201 156 293 76 15 -103 -167 33 39 213 80 -277 -292 -263 -54 239
4224B39J68o23j75L12K96J76r8n19K52j84pK99J8K3k49j11j17J92K95J17k48p29
$$ 239 407 -216 -391 -79 217 393 295 -224 28 -156 -163 136 154 177 -72 -183 -300 -108 187 304 56 -673
4246f73L77L24K67k1k60j16p0p3M88K46j68l39k80RM01p2K74l76r2M0j71M98K28
$$ -673 -296 28 295 274 14 -102 -172 -245 243 489 321 -18 -298 -289 112 40 314 -62 -154 -114 -285 213 441
4269D41j25n36k3R8K90L83l82l2l16k06K98J86K46l76j23j11K93lM37j64m32J19
$$ 441 316 -220 -243 -145 145 528 146 114 -202 -408 -110 76 322 -54 -177 -288 5 2 439 275 -157 -38
4291c8l70L05K30m3K0k48j59R8K15M4K28l39l33P6J34M07K5k02o5j5j53K62J46
$$ -38 -408 -103 127 84 104 -144 -303 -205 10 54 282 -57 -390 -314 -180 227 252 50 -15 -30 -183 79 225
4314B25k72j4j75j62M78l22L31j27l55J15K75J64M7r6m04J17n7J90L28l69K09
$$ 225 -47 -61 -236 -398 80 -242 89 -38 -393 -278 -3 161 208 112 -292 -175 -232 -42 286 -83 126
4335A26j73j28J96J31r2N9n5l33K64k47M26J61l94o2K14k16J19qQ2o8j50K26p4
$$ 126 -47 -175 21 152 60 119 64 -269 -5 -252 174 335 -59 -121 93 -123 -4 -12 70 2 -148 78 4
4358DJ82j38j50O2nMJ2J9O0j26M3m9J50lq8K01l67p5J90J22j1j4j30O7l6M1P7
$$ 4 186 48 -102 -40 -45 -41 -29 -10 50 -76 -33 -82 68 65 -23 178 -189 -264 -74 48 37 23 -107 -40 -76 -35 42
4385D2J2j38J42j21L0j6K30j35K89m00NL15l73N8K21k24J06n5j81K66L1n5j89
$$ 42 54 -84 58 -63 -33 -49 181 46 335 -65 -60 255 -118 -60 161 -63 43 -12 -193 73 104 49 -140
4408a40J55p3J90J51m3j24k85N3J38M3J08k8k68j23J11J56J56L6j33j52k10K87
$$ -140 15 -58 132 283 240 116 -169 -116 22 65 173 145 -123 -246 -135 21 177 213 80 -72 -282 5
4430EJ21o8L1k76J79J04j8K40k91k33J12L6j58N12N0j86K3n48L95j2Q3J35l17
$$ 5 126 58 89 -187 -8 96 78 318 27 -206 -94 -58 -216 296 346 160 183 -365 30 18 101 236 -81
4453h1M0P0J7K12J61l08k14J4J39O5J46j92k37lr3K98K08l8j56m60L21q7J98K67
$$ -81 -41 29 46 258 419 111 -103 -89 50 115 261 69 -168 -171 -264 34 242 204 48 -412 -91 -178 20 287
4477B87l26r6K2n0L40j55m6L7k09P2K20J52j48J7l97J98K53k28L91J72q80K51
$$ 287 -39 -135 -113 -163 177 22 -24 13 -196 -124 96 248 100 117 -280 -82 171 -57 334 506 -374 -123
4499a23j46J04K70O8Ql82rK55J92l7j31j17o9K42J25k79J40j36j76qJ51J50J07
$$ -123 -269 -165 105 173 181 -201 -210 45 237 200 69 -48 -117 125 250 -29 111 -25 -201 -209 -58 92 199
4522A99r8m4k45o2K91K04Q6m15p1J46P5L1J05M6k65m7j30M41j28q2L3r9k36K68
$$ 199 101 57 -188 -250 41 245 331 -84 -155 -9 66 97 202 248 -17 -64 -194 247 119 37 70 -29 -265 3
4546CN2Q8q1J84l12j40J38O7K71l44m3J67n1M3J11j2j07j48N2J00j8K40j07j64
$$ 3 55 143 62 246 -66 -206 -68 -1 270 -74 -117 50 -1 42 153 141 34 -114 -62 38 20 260 153 -11
4570a1J03k3o4J09k24J79o9j34J40N9r5J58o4k71J56K48j31j5o8k9K9Q6r7o3l3
$$ -11 92 69 5 114 -110 69 0 -134 6 65 -30 128 64 -207 -51 197 66 51 -17 -46 -17 69 -28 -91 -124
4595a24K1j54M4M1P4Q4O0q7n7J91j22J41J9jl4o4j49K86J33l79L5k22J19K31k0
$$ -124 -103 -257 -213 -172 -98 -14 46 -41 -98 93 -29 112 131 130 96 32 -117 169 302 -77 -42 -264 -145 86 66
4620F6m2K1k08J43j47L34n5q7j3q3j17m1L74k57J26k61P1K56J07o9O6j61j16j11
$$ 66 24 45 -163 -20 -167 167 112 25 12 -71 -188 -229 145 -112 14 -247 -176 80 187 118 184 23 -93 -204
4644b04J15J86K2l14l0P8J28K54j02j46j2k15J50K62p1Q5l1m38PL92J45Pk36j84
$$ -204 -89 97 119 -195 -225 -147 -19 235 133 -13 -25 -240 -90 172 101 186 155 -283 -276 116 261 268 32 -152
4668a52K42l3Q3pn8j20j17K8O7J75n1j13q9J55l6O9K51k37j21j41L20P3P8j69
$$ -152 90 57 140 133 75 -45 -162 -134 -67 108 57 -56 -145 10 -26 43 294 57 -64 -205 115 188 266 97
4692I7J01l35j97K84K76k39P8k29L8J18o7K91mj92k42L9N7L99k19p4J29l94K32
$$ 97 198 -137 -334 -50 226 -13 65 -164 -126 -8 -75 216 212 20 -222 -183 -126 273 54 -20 109 -285 -53
4715e3J87k53L39k17mj79J13Q0J95k40j78P0K52K5M4k10O5pj21J78J3k21J81o1
$$ -53 134 -119 220 3 -1 -180 -67 13 208 -32 -210 -140 112 137 181 -29 36 29 -92 86 99 -122 59 -2
4739bj48K61k1L2j5k45m9K46p5J99p9k50J77j46nK09j45K85j84j89K34m2J01l1
$$ -2 -150 111 90 122 107 -138 -187 59 -16 183 104 -146 31 -115 -120 89 -56 229 45 -144 90 48 149 118
4763A18j01k13K78q2K17m6m25J65K59k93K69R1k35lL7k44L43j02J66K4m40J14
$$ 118 17 -196 82 0 217 171 -254 -89 170 -123 146 237 2 -1 36 -208 135 33 199 223 -217 -103
4785a03n6j2J84J44j96O0k05J71Qo5J09J60l51L90k90p2J25J64k33J94l99K40
$$ -103 -159 -171 13 157 -39 21 -184 -13 -5 -70 39 199 -152 238 -52 -124 1 165 -68 126 -273 -33
4807c3n4M8K06k84K8j19K32J01n0j56J57j42m7L00O5j93k8m9r7K92k65J80j74
$$ -33 -87 -39 167 -117 -89 -208 24 125 75 -81 76 -66 -113 187 252 59 31 -18 -115 177 -88 92 -82
4830h2P6j82L63k30J44q8q5J25j1R3j28n5J9j55k01N03K6J3K2l67QL04o4K54j63
$$ -82 -6 -188 175 -55 89 1 -84 41 30 123 -5 -60 -41 -196 -397 106 132 145 167 -200 -192 112 48 302 139
4855A39j41J07j69R9J24J5l60J81j09M9L21k30J1l2j62J02k00K65J77q2j46j7
$$ 139 -2 105 -64 35 159 174 -186 -5 -114 -65 256 26 37 5 -157 -55 -255 10 187 105 -41 -58
4877e8J43j43L58l40l6kL2R7K36j00M0m04r1L84j35J49n0k74P8j29K30R0m5m4
$$ -58 85 -58 300 -40 -76 -78 -46 51 287 187 227 -177 -268 116 -19 130 80 -194 -116 -245 -15 75 30 -14
4901a4j66q6K30J35k34J49k18lK72j18K21j89k87J29R7Q9J96Q3k40j16J69j03
$$ -14 -180 -266 -36 99 -135 14 -204 -207 65 -53 168 -21 -308 -179 -82 7 203 286 46 -70 99 -4
4923dj97O9J03P9j44M2O8Q8j27r8J00L8J44P3J2r0k20j6R0J31j59J66l86L4J62
$$ -4 -201 -132 -29 50 -94 -52 16 104 -23 -121 -21 17 161 234 246 156 -64 -80 10 141 -18 148 -238 -204 -42
4948d2n8J47m8q2KJ48j9p8Nq3K24k34j44M28j3k61k3K81l32J48j37J39J66J8k48
$$ -42 -100 47 -1 -83 -81 67 48 -30 -25 -108 116 -118 -262 166 153 -108 -131 150 -182 -34 -171 -32 134 152 -96
4973i6J24r3j7L22j15j9k31M5L13j91p2K63l59N3K5J08J41j79q8J01L9j09k9L28
$$ -96 28 -65 -82 240 125 106 -125 -80 233 42 -30 233 -126 -73 -48 60 201 22 -66 35 74 -35 -64 264
4997B64k93O1l16M29l08K04o3J54l58K38J59k1M1k32J04j06q8K43P2j32m2j24
$$ 264 -29 32 -284 145 -163 41 -22 132 -226 12 171 150 191 -41 63 -43 -131 112 184 52 10 -114
5019a14R3J60r3J30J7J6m36J37M4K22j32o6M1j22J84L3j4k17J61j28J83o7J00
$$ -114 -21 139 46 176 193 209 -227 -90 -46 176 44 -22 19 -103 81 114 100 -117 44 -84 99 32 132
5042A32p9K5J7Q6l51K53m5J31j47q6J0J71L5k13nL9J07j51J03O5L8l63J82J05
$$ 132 53 78 95 181 -170 83 38 169 22 -64 -54 117 152 -61 -66 -27 80 -71 32 97 135 -228 -46 59
5066E9m2l3J04l4m7r3R5N8Q6j26k75p7L00O9J27Ll39P1J61k71K00r0j44K0J63
$$ 59 17 -16 88 54 7 -86 9 67 153 27 -248 -325 -25 44 171 174 -165 -94 67 -204 -4 -94 -238 -218 -55
5091e5N1R9L2k70rK00p1l6l7K23l04l1Q8M9L39k11r9K7k2k23K96M6j37J06j96
$$ -55 -4 95 127 -143 -152 48 -23 -59 -96 127 -177 -208 -120 -71 268 57 -42 -15 -37 -260 36 82 -55 51 -145
5116a45J35K28OrJ24n62K43j00rL87k63j66P2j69J76J44jj17q7J36P2J9k42J68
$$ -145 -10 218 224 215 339 -223 20 -80 -89 298 35 -131 -59 -228 -52 92 91 -26 -113 23 95 114 -128 40
5140D0j83kL52l90o7K96J13K2l86J34lK83l3m4k34p7L29J11j71k72J24m5J6j70
$$ 40 -143 -145 207 -183 -250 46 159 181 -205 -71 -74 209 176 132 -102 -179 150 261 90 -182 -58 -103 -87 -257
5164b57K80k21L34j99K53j88J16J8l56K19n6r0K37j39K9j40r6L42J2J59j68J3
$$ -257 23 -198 136 -63 190 2 118 136 -220 -1 -57 -147 90 -49 -20 -160 -256 86 98 257 89 102
5186A02j41M0p1K65k32j54K52j42Q9N9k12R8R4m3O7j01J09L9p7m7K9J8j22K36
$$ 102 -39 1 -70 195 -37 -191 61 -81 8 67 -145 -47 47 4 71 -30 79 118 41 -6 23 41 -81 155
5210A55q5k2j02p8J05jK22j40k2p3lN0K10O8l43J95k95J49J23j68L49j35J3j05
$$ 155 70 48 -54 -132 -27 -28 194 54 32 -41 -44 6 216 284 -59 136 -159 -10 113 -55 294 159 172 67
5234F7qj25OJ98l27R2j6J46J43j71J39l16J26J49j02N5o6k8o3N4l0K6J72m6k2
$$ 67 59 -66 -60 138 -189 -97 -113 33 176 5 144 -172 -46 103 1 56 -10 -38 -101 -47 -77 -51 121 75 53
5259E3n4p1R5L3Q0k11j32n7L21j09LP6O4k80J73M6JK73l43q6M0R5J93j19lJ9k38
$$ 53 -1 -72 23 56 136 -75 -207 -264 57 -52 -49 27 91 -189 -16 30 31 304 -39 -125 -85 10 203 84 81 100 -138
5286a38J07J60l3O8j68Oj22P0Q0J17k29mL8j61L98J20l11m3J61l05J53J0l5J91
$$ -138 -31 129 96 164 -4 2 -120 -50 30 147 -82 -86 -48 -209 189 309 -2 -45 116 -189 -36 -26 -61 130
5310A30j25j85J53K03r4R0k61NN2J48N8j92j7k03L60j1P2p8R4j79j60K44M6j71
$$ 130 5 -180 -27 176 82 172 -89 -84 -32 116 174 -18 -35 -238 122 111 183 105 199 20 -140 104 150 -21
5334b1J43j8j89J22o3N6M2M9l54J98k6mQNm6N8j21J67mJ20l14K02l9m2R2K95n65
$$ -21 122 104 -85 37 -26 30 72 121 -233 -35 -61 -65 -57 -52 -98 -40 -161 6 2 122 -192 10 -29 -71 21 316 -249
5361b49L21J4j72J42j1K9K9l68J07O8L1O9m2j02J28L9j16J77j04j2L1N3K0j38
$$ -249 72 86 -86 56 45 74 103 -265 -158 -90 -59 10 -32 -134 -6 33 -83 94 -10 -22 9 62 82 -56
5385e6J05J04j5k31J91k1j54K28k1l9n2L4m4p3K99ol40J5J29j13Q3J01k42J03
$$ -56 49 153 138 -93 98 77 -77 151 130 91 39 73 29 -44 255 249 -91 -76 53 -60 23 124 -118 -15
5409a5P3n4o7J31Nj62J80N1k23J34K6o5j33k8K02K8l2j42K35r2l49L42k49J26
$$ -15 58 4 -63 68 73 -89 91 142 -81 53 79 14 -119 -147 55 83 51 -91 144 52 -297 45 -204 -78
5433g8m9q2K82j75J48j7m3k98J58K58j24j2Q4j18J04j37j61L49L9n1j0k85L47
$$ -78 -127 -209 73 -102 46 29 -14 -312 -154 104 -20 -32 52 -66 38 -99 -260 89 128 77 67 -218 129
5456A29j14K54l50O5o1p5K70j12p3L0K7j49J27K09k92L44k47j09R3Q9J80n7k86
$$ 129 15 269 -81 -16 -77 -152 118 6 -67 -37 -10 -159 -32 177 -115 229 -18 -127 -34 55 235 178 -108
5479a08n3J75m0J70N8j65k18K86k29J53j34R0J49j24J11j30K69l16K59k51j12
$$ -108 -161 14 -26 144 202 37 -181 105 -124 29 -105 -15 134 10 121 -9 260 -56 203 -48 -160
5500a60K54j95R7qk32K69j01k8L06j89J1P2k40J11J48J26k28k8R4k32K55m5p8
$$ -160 94 -101 -4 -12 -244 25 -76 -104 202 13 24 96 -144 -33 115 241 13 -15 79 -153 102 57 -21
5523b1l4K8m8N1J67m4r8n1r5RL02k27Q4L7j45k0K45j25J22p7L7k42K08L29j67
$$ -21 -55 -27 -75 -24 143 99 1 -50 -145 -136 166 -61 23 60 -85 -105 140 15 137 60 97 -145 63 392 225
5548B25j11k28K8j06J58K38j43J0j9J2j28J82K19l59o7p4M6O2K54n9j80j13m2
$$ 225 114 -114 -86 -192 -34 204 61 71 52 64 -64 118 337 -22 -89 -163 -117 -55 199 140 -40 -153 -195
5571a95J04J52j99K08j74k38L04j00J42K5L1m12K55j22K13J36j04j70K66k33J66
$$ -195 -91 61 -138 70 -104 -342 -38 -138 4 29 60 -352 -97 -219 -6 130 26 -144 122 -111 55
5592E5K9j59J64j82m1K23p6KQ8Mj52K06r9J17m4j87j05J59Q2j78K1J60m7j31J37
$$ 55 84 -75 89 -93 -134 89 13 15 103 107 -45 161 62 179 135 -52 -157 2 84 -94 -73 87 40 -91 46
5617D6P9l63M01lj41j13J02k9k03L72q8k05P4J73j38M5J07k38j4Q5o9L75l77P9
$$ 46 125 -238 163 160 19 -94 8 -21 -224 148 60 -145 -71 102 -36 9 116 -122 -136 -51 -120 255 -122 -43
5641d3j27K20K58r1j80K01k32j38o2J60o7k3j71L20q2K11r2n4J54j09j22l7l4
$$ -43 -170 50 308 217 37 238 6 -132 -194 -34 -101 -124 -295 25 -57 154 62 8 162 53 -69 -106 -140
5664a40K40j50J88j74j8J91j71K18k63K34k35LNK60O1j91m1Nk7J04K8j22J67k51
$$ -140 100 -50 138 -36 -54 137 -34 184 -79 155 -80 -77 -72 188 249 58 17 22 -5 99 127 5 172 -79
5688g9R8q9K2jo0R6rKR8j32J95k4l55J01J91J75j71j99K68j84P1j17K11j42j4
$$ -79 19 -70 -48 -49 -109 -13 -22 -20 78 -54 141 117 -238 -137 54 229 58 -141 127 -57 14 -103 108 -34 -48
5713d8j00K94L3o4m9j19r0j23M01j42j34L18l40r7L29J4q7J23Q6m13P3j32L38
$$ -48 -148 146 179 115 66 -53 -143 -266 135 -7 -141 177 -163 -260 69 83 -4 119 205 -208 -135 -267 71
5736G1K25m80R7l3M2N58l97Q0Rk34j47J32J87J02j94k66L78m29K27L19p5j99J0
$$ 71 296 -184 -87 -120 -78 480 83 163 172 -62 -209 -77 110 212 18 -248 130 -299 -72 247 172 -27 -17
5759a7L5l4K83k39j81J83j47K68j07j14R0j93M5J1Q4N7O0j50J19k19J56P3L6o2
$$ -17 18 -16 267 28 -153 30 -117 151 44 -70 20 -173 -128 -117 -33 24 84 -66 53 -166 -10 63 99 37
5783C7J89j81j10O2J70j2j27m0j03Q2J80j56p0L71k86L3J67k45K4M7nm0J30l03
$$ 37 226 45 -65 -3 167 155 28 -12 -115 -33 147 -9 -79 292 6 39 206 -39 -15 32 27 -13 117 -186
5807a86j5K34j60jJ24J92j20J9j49K36l26J59J01r4O7q0j62J54o2l0J31p6p9N2
$$ -186 -201 33 -127 -128 -4 188 68 87 -62 174 -152 7 108 14 81 1 -161 -7 -69 -99 32 -44 -123 -71
5831g1j97K41J37j51R4J23j55n0O7l6r0p5jK29J07k64R5m2N5k34J49K16q3K05
$$ -71 -268 -27 110 -41 53 176 21 -29 38 2 -88 -163 -164 65 172 -92 3 -39 16 -218 -69 147 64 269
5855B69p5j67k31J6K38p2Q8k83O2K80m5K8n5j44K14j46L50m1l44J19o6j52R3K96
$$ 269 194 27 -204 -188 50 -22 66 -217 -155 125 80 108 53 -91 123 -23 327 286 -58 61 -5 -157 -64 232
5879B32m08K36j13Lj92L0L17k01J30j46J15K6K1K93p5m46j26J38Q9nJ29j54r2
$$ 232 -176 60 -53 -50 -242 -212 105 -96 34 -112 3 29 50 343 268 -178 -304 -166 -77 -82 47 -107 -199
5902a99P1P4L37Kl14j46j01K12J36Mj13L1m7rJ47m3l4J07M9k03l3P8qoM5k52j2
$$ -199 -128 -54 283 285 -29 -175 -276 -64 72 76 -37 -6 -53 -62 85 42 8 115 164 -39 -72 6 -2 -8 37 -215 -227
5929b27L67n3J7l1k57K21j74J75J14rJ32m72K55p1P5P9k46o2J31RP7R7k03J52
$$ -227 140 87 104 73 -184 37 -137 38 152 143 275 -197 58 -13 62 141 -105 -167 -36 -27 50 147 -56 96
5953I6j94N7m1R2l5j15Q0j45L25r4K52k92o3j46J62R8R3nk83Jj56M91O2k44K25
$$ 96 -98 -41 -82 10 -25 -140 -60 -205 120 26 278 -14 -77 -223 -61 37 130 125 -158 -157 -313 178 240 -4 221
5978B21m56J11P5m1J65n2q0m9L7R4O3L7Qj32k10L15j46N9l6k1P5j56J95k37K92
$$ 221 -235 -124 -49 -90 75 23 -57 -106 -69 25 88 125 133 1 -209 106 -40 19 -17 -38 37 -119 76 -161 131
6003A31l28N8l4J46R5M0J40j91r3r1NO6k1J16k35N5N8J43L3j18q5qo0J81O9J94
$$ 131 -197 -139 -173 -27 68 108 248 57 -36 -127 -122 -56 -77 39 -196 -141 -83 60 93 -25 -110 -118 -178 3 72 266
6029B66j45j07J99j64l7n6K41l48L0j87J71K33Ql81L55k83K16k56K94j95k1J45
$$ 266 121 14 213 49 12 -44 197 -151 -121 -308 -137 96 104 -277 78 -205 11 -245 49 -146 -167 -22
6051b2p6J32J9j01R0K6j14l4j91M00p8lQ2m00K53M4J44q3q5j75M4q8K35J12o2
$$ -22 -98 34 53 -48 42 68 -46 -80 -271 129 51 48 130 -270 -17 27 171 88 3 -172 -128 -216 19 131 69
6076F9n3j89K97L7j13l8Q4l18J96o5J84Q3j31k81K6J79J78o4J09m11R7J0K27J18
$$ 69 16 -173 124 161 48 10 94 -224 -28 -93 91 174 43 -238 -212 -33 145 81 190 -221 -124 -114 113 231
6100B31k39rJ08K7j25K37k76L4j18j26J00K17K0J31r0k33M3J40o7r4K38o3l7j55
$$ 231 -8 -17 91 118 -7 230 -46 -12 -130 -256 -156 61 81 212 122 -111 -68 72 5 -89 149 86 49 -106
6124a06j28K57J16o9j04j64P1J75N9N5l76K39jM6M9N5j97q0o9J61J92j78k0L9
$$ -106 -234 23 139 70 -34 -198 -127 48 107 162 -214 25 24 70 119 174 -23 -103 -172 -11 181 3 -17 22
6148B2n6J02O7L6p8m68K51N7J71j25l8K84k80k0R6K6J6k31K95k90J44J75j35J09
$$ 22 -34 68 135 171 93 -375 -124 -67 104 -21 -59 225 -55 -75 21 47 63 -168 127 -163 -19 156 21 130
6172A30j05L8k41K49k0QL3j70J58k54J57J71j46K5j36L4k27N05j29j91K8L4jJ07
$$ 130 25 63 -178 71 51 59 92 -78 80 -174 -17 154 8 33 -103 -69 -296 209 80 -111 -83 -49 -50 57
6196E7j29L5J31k18j2J5K87r0j21J64m55K64R0J63m6k35M7k05L01J59j96m3n6
$$ 57 -72 -37 94 -124 -136 -121 166 76 -45 119 -336 -72 18 181 135 -100 -53 -258 43 202 6 -37 -93
6219i3LK5j3JJ99j4j68J39j85L21l01pj96K39J67j27J09n6p9J20j84O9rN8P9k45
$$ -93 -90 -65 -78 -77 122 108 -60 79 -106 215 -86 -93 -289 -50 117 -10 99 43 -36 84 -100 -31 -40 18 97 -148
6245a48J04J55j64m8K53j2k01j9j09L07Qp6o4k68K53kJ28l4o7PL3JL43j98j34
$$ -148 -44 111 -53 -101 152 140 -61 -80 -189 118 126 50 -14 -282 -29 -31 97 63 -4 3 36 37 380 182 48
6270D8p0q0J14m0J73j52L8mk07R9J45K4J04k1l09K47j35p5J47j81q5K58J1p8J24
$$ 48 -22 -102 12 -28 145 -7 31 27 -180 -81 64 88 192 171 -138 109 -26 -101 46 -135 -220 38 49 -29 95
6295I5j18L6n0r2J79M1k7j76m2o3J23L3J99k27N9j0j16J56j46K42k70K72l99L76
$$ 95 -23 13 -37 -129 50 91 64 -112 -154 -217 -94 -61 138 -89 -30 -40 -156 0 -146 96 -174 98 -301 75
6319G5j18J52j57l4L1L7M5o3J63k77J73j32J10J21J6k01l0J08N2j37qK28k68K15
$$ 75 -43 109 -48 -82 -51 -14 31 -32 131 -146 27 -105 5 126 142 -59 -89 19 71 -66 -74 154 -114 101
6343A01m1k78K23k04J99j42J59k6j34K53k88J29K9j56J71J36J31k72m2N5p0J41
$$ 101 60 -218 5 -199 0 -142 17 -9 -143 110 -178 -49 -20 -176 -5 131 262 -10 -52 3 -67 74
6365G4J05o8k11j18J92J12j00M05l47r5J33j4p8M6K33m10r3L15j92K57Q6n2k45
$$ 74 179 111 -100 -218 -26 86 -14 391 44 -51 82 68 -10 36 269 -141 -234 81 -111 146 232 180 -65
6388f5j6L0j19L75k94J18j88J21j91L51J06j36j14j65M8J89j04K97k88O3R5j04
$$ -65 -81 -51 -170 205 -89 29 -159 -38 -229 122 228 92 -22 -187 -139 50 -54 243 -45 18 113 9
6410IL9k88L80j91k65L44j20K60j43j75J26J74j07p4J10j9k60J22M5j2J53J1k96
$$ 9 48 -240 140 -51 -316 28 -92 168 25 -150 -24 150 43 -31 79 60 -200 -78 -33 -45 108 119 -177
6433a77J15N4L4qO7q3j41K54J00l41J11j09J11p1j04L57L1j83J43j44o4J03J3
$$ -177 -62 -8 26 18 85 2 -139 115 215 -126 -15 -124 -13 -84 -188 169 200 17 160 16 -48 55 68
6456F8o2J87m94J96J01l7J2K02j35j00k04J11L24j73L9J45j57j7l5k11K77J09
$$ 68 6 193 -301 -105 -4 -41 -29 173 38 -62 -266 -155 169 -4 35 180 23 6 -29 -240 37 146
6478A46l47P9O8K0JQ5J04k06J90k19J15N1k3q6R7q4j1J80R0j06J6j24p4L26j47
$$ 146 -201 -122 -54 -34 -33 52 156 -50 140 -79 36 87 64 -22 75 -9 -20 160 250 144 160 36 -38 288 141
6503A41j48K9r0j91K14P0j05J23j87J07j00J74J16l3p2J3k00J14n1N8j21L01j52
$$ 141 -7 22 -68 -259 -45 25 -80 43 -144 -37 -137 37 153 120 48 61 -139 -25 -76 -18 -139 162 10
6526A0K5q8K34J4j99l7J7p5J60j4k25J3J79j39J38R8k00j31J56N1K92l62J46M3
$$ 10 35 -53 181 195 -4 -41 -24 -99 61 47 -178 -165 14 -125 13 111 -89 -220 -64 -13 279 -83 63 106
6550A06j80j21O6J10P7k06J40k21j7L15K32l33Q7j01m3J61l1J1j39p2Q1M4J84
$$ 106 -74 -195 -129 -19 58 -148 -8 -229 -246 69 301 -32 55 -46 -89 72 41 52 -87 -159 -78 -34 150
6573A50Nj01l0k0M0j21L36l81L72m09j3J82J00m2k07J15r3N6K9O8K05k82j3J24
$$ 150 155 54 24 4 44 -77 259 -122 250 -159 -172 10 110 68 -139 -24 -117 -61 -32 36 241 -41 -54 70
6597G0Nj5k2l7L5q6K57k80K51j4j23j99K72j43O5p7O6j80K81p2n2M0J17o1l53
$$ 70 75 60 38 1 36 -50 207 -73 178 164 41 -158 114 -29 36 -41 25 -155 126 54 2 42 159 98 -255
6622b55J81J21j70J89j20J15j57L49m9k21M4J11q1j23j57K70j17J14o0k08J78
$$ -255 -74 47 -123 66 -54 61 -96 253 204 -17 27 138 57 -66 -223 47 -70 44 -16 -224 -46
6643d6k8J79r8o3p5n9Q5Q3N2q2J1kOoJ51j30R4j14N5J55m13O14k72j64j29L37
$$ -46 -74 105 7 -56 -131 -190 -105 -22 30 -52 -41 -43 -37 -43 108 -22 72 -42 13 168 -245 369 97 -67 -196 141
6669A41r3L9m3j48J00J5n5l1L51k13j30O1L1O6r5P4j14J63m3mk14J62r2J23Q9
$$ 141 48 87 44 -104 -4 11 -44 -75 276 63 -67 -6 25 91 -4 70 -44 119 76 72 -142 20 -72 51 140
6694A40k65K06R1K0l04K57k30R6j03J63o8j28N1QL6o0K46j66j61L76k67K26j07
$$ 140 -125 81 172 192 -112 145 -85 11 -92 71 3 -125 -74 -66 -30 -90 156 -10 -171 205 -62 164 57
6717E7l0k0q0j30K88r9J32R9j59q3o0j8K14o3l3O6j65J51n4m4j04J46k77K22K43
$$ 57 27 7 -73 -203 85 -14 118 217 58 -25 -85 -103 111 48 15 81 -84 67 13 -31 -135 11 -266 -44 199
6742A99k55J13n1j58K54l5K83k80j64K60j81J40J03q0P6l42R7j6k6M3K12m3l10
$$ 199 -56 57 6 -152 102 67 350 70 -94 166 -15 125 228 148 224 -118 -21 -37 -63 -20 192 149 -161
6765a61K12m8K4K6j03j32J59j46J04J78J31l49j71J38J60J2j38K33k52P3n6O8
$$ -161 51 3 27 53 -50 -182 -23 -169 -65 113 244 -105 -276 -138 22 34 -104 129 -123 -50 -106 -38
6787c8Q0j60J47p8j44K51k84M54j65j8k97N3M20l49K03Q4n88L24qJ14K05j21k44
$$ -38 42 -118 29 -49 -193 58 -226 228 63 45 -252 -199 221 -128 75 159 -429 -105 -113 1 206 85 -159
6810a59J00M1j4K58j26j60J45l29J27L5J65J05k49r4RJ64R7m5j72P6j34K01r4
$$ -159 -59 -18 -32 226 100 -60 85 -244 -117 -82 83 188 -61 -155 -146 18 115 70 -102 -26 -160 41 -53
6833e3K07Rk29K26q2r2l8J27j32k2q9pJ13J27Lr7q2P8O6R3k3j44J06K4l1j48J75
$$ -53 154 163 -66 160 78 -14 -52 75 -57 -79 -168 -175 -62 65 68 -29 -111 -33 33 126 103 -41 65 89 58 -90 85
6860H5o1r4N5k5n4J3Q8kJ3j63J4K21j26J01q8n6m8J20J21r8k32J07K45l13L79
$$ 85 24 -70 -15 -40 -94 -81 7 5 18 -145 -131 90 -36 65 -23 -79 -127 -7 114 16 -216 -109 136 -177 202
6885B02Ok10R3l7j63K28K2Rj26R3j47J04K4j47L7R1J19m66J57J57j25K5L69l66
$$ 202 208 -2 91 54 -109 119 141 150 24 117 -30 74 98 -49 -12 79 198 -268 -111 46 -79 -54 315 -51
6909e1Q7K00r8mj06L1k29J91n3J27m3J11j77O0J5J14J15Q2l31j07M5K43n7k93
$$ -51 36 236 138 134 28 59 -170 21 -32 95 52 163 -14 46 61 175 290 372 41 -66 -21 222 165 -128
6933a28J66J55j48p6J62r3j43r6J79r5J61J4Lj03jP4J04N0J5j43q0K9r6K72j77
$$ -128 38 193 45 -31 131 38 -105 -201 -22 -117 44 58 61 -42 -43 31 135 185 200 57 -23 6 -90 182 5
6958En4l4j01L87o4k10K61j79J6j73J40P2J43j89O7o3j0J13k13J73O0q8j80N3
$$ 5 -49 -83 -184 203 139 -71 190 11 27 -146 -6 66 209 20 87 24 14 127 -86 87 147 59 -121 -68
6982f8J55l2p2j4L0K2rJ23%j75j78J26rM74l86J76l57M1Q7R4O9k53K29J3j19Q5
$$ -68 87 55 -17 -31 -1 21 12 135 135 -40 -218 -92 -101 373 -13 163 -194 -153 -66 28 97 -156 73 86 -33 52
7008E2o7J79l18o0J4p6M79m34J89O4o6j4K06Nj8k87K00p6J28O7j01k6k06j11J87
$$ 52 -15 164 -154 -214 -200 -276 203 -231 -42 22 -44 -58 148 153 135 -152 48 -28 100 167 66 40 -166 -277 -90
7033i0J2K90q6j39J19j03QO5J71j40k11J01j61P5R6J42p2j38j05J12L48k30j44
$$ -90 -78 212 126 -13 106 3 11 76 247 107 -104 -3 -164 -89 7 149 77 -61 -166 -54 294 64 -80
7056h0M5J11j41J33Mj54m2P6K36o6q8J5j74M7j60J29J32R4J9n9j42n2K6K89k73
$$ -80 -35 76 -65 68 72 -82 -124 -48 188 122 34 49 -125 -78 -238 -109 23 117 136 77 -65 -117 -91 198 -75
7081g5k8J14K4K9Q5m8p0o7o6K75j16O4j4J47j50k14J05K1l6K30j83l82L29j23
$$ -75 -103 11 35 64 149 101 31 -36 -102 173 57 121 107 254 104 -110 -5 16 -20 210 27 -355 -26 -149
7105a49L15q6L9j71N8j84J58Q8k87L30q9m5P9M5j88M8j2N7j4p8J15l4k1J21%r0
$$ -149 166 80 119 -52 6 -178 -20 68 -219 111 22 -23 56 101 -87 -39 -51 6 -8 -86 29 -5 -26 95 95 5
7131Ej0J76k20o1O8M1q4R6K6j9j57J1K00j85J64k1r1l7M3K10R8j80j0O3k41K34
$$ 5 -5 171 -49 -110 -42 -1 -85 11 37 18 -139 -128 72 -113 51 30 -61 -98 -55 155 253 73 63 126 -115 119
7157A19J17k00pm5j09J28p2K68p8k76L73n03K64J74J3j43Qok23L13J5j44R0p2
$$ 119 236 36 29 -16 -125 3 -69 199 121 -155 218 -285 -21 153 166 23 31 25 -198 115 130 -14 76 4
7181Dl1K1K03J27m31n2J3P6Q6J8j80r5J62J29J05q3j2P6O9j25j33o8K72k08M04
$$ 4 -27 -6 197 324 -107 -159 -146 -70 16 34 -146 -241 -79 50 155 72 60 136 205 80 -53 -121 151 -57 347
7206C47j60n1j32Omj7M8j18r2J50M9K1m6j56J11J35j18J31j04m1op2L26j69k18
$$ 347 187 136 4 10 6 -11 37 -81 -173 -23 26 47 1 -155 -44 91 -27 104 0 -41 -47 -119 207 38 -180
7231a80P6J36o7l5R9P2k24L3p7j7K40J67k37P1r2j62M21j92j47J13KL3M3j46L0
$$ -180 -104 32 -35 -70 29 101 -123 -90 -167 -184 56 223 -14 57 -35 -197 224 32 -115 -2 0 33 76 -70 -40
7256d0K85m23K3R6J64p0j01J36j08j08j9K36j89L28P7k1j33q3m1k9J42k60L1j3
$$ -40 245 -178 -155 -59 105 35 -66 70 -38 -146 -165 71 -118 210 287 266 133 50 9 -20 122 -138 -107 -120
7280a20M7J06P9j55j03J68j67J18J52J7m10K81Op5J33j21O2j0l3j72P3O5N1L7
$$ -120 -73 33 112 -43 -146 22 -145 -27 125 142 -268 13 19 -56 77 -44 18 8 -25 -197 -124 -59 -8 29
7304B9j48R1Q1L3j30j41K03j67K30j7j08J01q9k31K59j8J58k29J00j42N6J50J7
$$ 29 -119 -28 53 86 -44 -185 18 -149 81 64 -44 57 -32 -263 -4 -22 136 -93 7 -135 -79 71 88
7327H8P8k33J55m1qK6j39K90k31J2r8k8K24j29J0j92Q5n1K10L8k6K0j11o9O9J78
$$ 88 166 -67 88 47 39 65 -74 216 -15 -3 -101 -129 95 -34 -24 -216 -131 -182 28 66 40 60 -51 -120 -51 127
7353A27l8k25N5J09p8K06M8l70Q6K7J76j68r8n7K45j13J85j7K6o6L4j37l0O7l3
$$ 127 89 -136 -81 28 -50 156 204 -166 -80 -53 123 -45 -143 -200 45 -68 117 100 126 60 94 -43 -73 -6 -39
7378c9N7p9R8j7o9pJ00J1o3L4l43K76j7r3M03m35K50Nr0L57o21J08K83j73k14
$$ -39 18 -61 37 20 -49 -56 44 55 -8 26 -317 -41 -58 -151 252 -183 67 72 -18 339 -282 -174 109 -64 -278
7403b78L27J8J5j05j38J30J12k29L56m72J11K37r1N6M0K5j56J10j39R0o5K00K1
$$ -278 49 67 82 -23 -161 -31 81 -148 208 -264 -153 84 -7 49 89 114 -42 68 -71 19 -46 154 175
7426A75k23l2RJ27Q6j42J13j71k5j19L60k37K31j92Qj8k6J65J45l31q7J40nJ70
$$ 175 -48 -80 -71 56 142 0 113 -58 -83 -202 158 -79 152 -40 -32 -50 -76 89 234 -97 -184 -44 -49 121
7450A21j68K9r7K5M7N1l9j34K71k10K67l91L82l09L30j93O6k3k18K64Q0%o4j06
$$ 121 -47 -18 -115 -90 -43 8 -31 -165 106 -104 163 -228 154 -155 175 -18 48 25 -193 71 151 151 87 -19
7474a9K3j4J10J33l89j19L63O6k38K06J39j66l48M86k32J1j05l2j21L89j01k26
$$ -19 4 -10 100 233 -156 -275 88 154 -84 122 261 95 -253 233 1 12 -93 -125 -246 143 42 -184
7496a84J82KJ3j07K07o5j05K72k58rJ27l58M86k10J55k23j09R8J48N3j07Oj07
$$ -184 -2 0 13 -94 113 48 -57 215 -43 -52 75 -283 203 -7 148 -75 -184 -86 62 115 8 14 -93
7519i3K14j12MJ35l04M3j0l3L37j07r6M5k05J63J30j52J3N0j96K50R4j08Mj37
$$ -93 121 9 13 148 -156 -113 -123 -156 181 74 -22 23 -182 -19 111 -41 -28 22 -174 76 170 62 66 -71
7543g1K5q8j8J7J81j01Q9J2j1j89L55k1j73nj31Q0m1J64R5l59m8K60l2J30J10
$$ -71 -46 -134 -152 -135 46 -55 34 46 35 -154 201 180 7 2 -129 -49 -90 74 169 -190 -238 22 -10 120 230
7568B30k15L5j27K26k73M9j02J35m5K15j48J05l5J10k95L07j01j03p7L49J22k93
$$ 230 15 50 -77 149 -124 -75 -177 -42 -87 128 -20 85 50 160 -135 172 71 -32 -109 240 362 69
7590F9l37J85J89o2J31r9p8k17K87L3L6j78n5J6Q2N9O7j24l9j24J48p2M4L05k12
$$ 69 -268 -83 106 44 175 76 -2 -219 68 101 137 -41 -96 -80 2 61 128 4 -35 -159 -11 -83 -39 266 54
7615E4k28l8K42M1j15K86l84p2J81o7K83qKl66K44O0k80K03k2j2K00j93l6J0K7
$$ 54 -174 -212 30 71 -44 242 -142 -214 -33 -100 183 175 177 -189 55 115 -165 38 16 4 204 11 -25 -15 12
7640A2j97q9R4K46m2Q9j21J37q1j93J57J29j13j41K33j77K69k10j4j20K5ok4J5
$$ 12 -185 -274 -180 66 24 113 -8 129 48 -145 12 141 28 -113 120 -57 212 2 -12 -132 -107 -113 -137 -122
7664a22L42k14j16oJ69k82J28K75j75p2q6K02j54j5N1L7k56L44p9J36j09J39j23
$$ -122 220 6 -110 -116 53 -229 -101 174 -1 -73 -159 43 -111 -126 -75 -38 -294 50 -29 107 -2 137 14
7687A4k14K43R0m22M53n2k85Q8J73J35j92K50m42M61k36M6j47J25r9o2k25J33
$$ 14 -200 43 133 -289 164 112 -173 -85 88 223 31 281 -161 300 64 110 -37 88 -11 -73 -298 -165
7709a65J15q3K72k91l2K97o3J39k0j44j97j9J46K91k29k14M01l09K35l7J32k97
$$ -165 -50 -133 139 -152 -184 113 50 189 169 25 -172 -191 -45 246 17 -197 204 -105 130 93 225 -72
7731g2K03l98J91l4J57m7N1J4kp7K86j39q7k03P3O8J54lk43k9RK14q9NL5o8j11
$$ -72 131 -267 -76 -110 47 0 51 65 63 -14 272 133 46 -157 -84 -16 138 135 -108 -137 -128 86 -3 2 37 -31 -142
7758a42J44m0j10K82kj73J48j90J0O2N4k2o6j87J54K73l5k30P4j30k2J70k20K22
$$ -142 2 -38 -148 134 132 -41 107 -83 -73 -11 43 21 -45 -232 -78 195 160 -70 4 -126 -148 22 -198 24
7782B4Rj55L16l60L33r0K9P6j27l3j10K2J31k3r6J40k53L06j01k1J52o8k47J85
$$ 24 33 -122 194 -166 167 77 106 182 55 22 -88 -66 65 42 -54 86 -167 139 38 17 169 101 -146 39
7806C9q7J23j00J46j69n7J70Q1q7M5n7j32k01O00l31J32J30k35J08j76J10J15
$$ 39 -48 75 -25 121 -48 -105 65 146 59 104 47 -85 -286 314 -17 115 245 10 118 -58 52 167
7828A67k50J82j6k98L59p1o5J04k34k00L83n4J04k67N3K72k75o0M07k12m6j53
$$ 167 -83 99 83 -215 144 73 8 112 -122 -322 61 7 111 -156 -103 169 -106 -166 241 29 -17 -170
7850a70J08J55l7R9l61M9RJ04Q4j28J44q5N6N6O5oj23J62p8k14J17O7r2J06j3
$$ -170 -62 93 56 155 -206 -157 -148 -44 40 -88 56 -29 27 83 148 142 19 181 103 -111 6 73 -19 87 74
7875G4k13K55j72J40k48O3K1j57K10j96L53n50O77l29j36J12J50p2n5j29J62p1
$$ 74 -139 116 -56 84 -164 -101 -80 -237 -27 -223 130 -420 257 -72 -208 -96 54 -18 -73 -202 -40 -111
7897a11l1N8J72m4k59J03J04M8k05K12j19J57l05K57J40J2j32k6k85L11O3l9M8
$$ -111 -142 -84 88 44 -215 -112 -8 40 -165 47 -72 85 -220 37 177 189 57 31 -254 57 120 81 129
7920A29l65K62k16J08qJ22p9J2j4K03Nj75l0J8O1k8J3M4j03p2j73L13j25K03p2
$$ 129 -236 26 -190 -82 -90 32 -47 -35 -49 154 159 -16 -46 -28 33 5 18 62 -41 -113 -286 27 -98 105 33
7945C3n4J00k43J1J55O0o8K6O4j59J74q9J67r6p2o5r7J89o0R0j44Q4q8L14j75
$$ 33 -21 79 -164 -153 2 62 -6 20 84 -75 99 10 177 81 9 -56 -153 36 -24 66 -78 6 -82 232 57
7970E7J86j69j67k9Q3J95j24Kk44N0J88j72m7L01j38n3Q9j55P3P9L7J10m73M40
$$ 57 243 74 -93 -122 -39 156 32 34 -210 -160 28 -144 -191 110 -28 -81 8 -147 -74 5 42 152 -321 119
7994A19k5j19L03k08J08k09J18j23kK6l6J27o1j00K76k48L19k69m0k6K72l11K94
$$ 119 94 -25 278 70 178 -31 87 -36 -38 -12 -48 79 18 -82 194 -54 265 -4 -44 -70 202 -109 185
8017A85k04J41Q2m97L48o7L6j78K98k25K54jm36L97k05p9L08J85k24M3k26j12
$$ 185 -19 122 204 -293 55 -12 24 -154 144 -81 173 172 -264 133 -72 -151 157 342 118 161 -65 -177
8039a77J47K8Q6p2MO9m7K1m0M3r5j48M3J04J36K1j05J90l29J80j22K04O5l59N9
$$ -177 -30 -2 84 12 16 85 38 59 19 62 -33 -181 -138 -34 102 123 18 208 -121 59 -63 141 206 -153 -94
8064i4k5J93P9j43L7n1p0RJ36K6K49k79r6p4K75n6O3j35n6M6j07J87j79J56J22
$$ -94 -119 74 153 10 47 -4 -74 -65 71 97 346 67 -29 -103 172 116 179 44 -12 34 -73 114 -65 91 213
8089B13m29K21m3M8K86j73m7k05r3K15O6R5j47K8j77L45k07n4O3N8m2J38j81K49
$$ 213 -216 5 -38 10 296 123 76 -129 -222 -7 59 154 7 35 -142 203 -4 -58 5 63 21 159 -22 227
8113B27l16N6LJ51j03J22o2J60O8j96k3k00J49k3q0n3K01j28J70j08L9j93K90
$$ 227 -89 -33 -30 121 18 140 78 238 306 110 87 -113 36 13 -67 -120 81 -47 123 15 54 -139 151
8136A51j09qj02L17l67K60k80P7j2K53m3o0q5Q2J8j63J44o5QK60l72J61K1j36
$$ 151 42 34 -68 249 -118 142 -138 -61 -73 180 137 77 -8 74 92 -71 73 8 16 276 -96 65 86 -50
8160e0J51j73oK21j10R5N7k50p1L52j66j19J47r7r4j51L70L3k82P3jp7K02K4J51
$$ -50 101 -72 -78 143 33 128 185 -65 -136 216 50 -69 78 -19 -113 -264 106 139 -143 -70 -71 -148 54 78 229
8185B29l16r4N5L7P1J75
$$ 229 -87 -181 -126 -89 -18 157
8191A57
$$ Imaginary data points
##PAGE= N=2
##DATA TABLE= (X++(I..I)), XYDATA
0@%%%%%%%%%%%%Qj6J6j6K4l2M0m8N6o5P3q8J04j21J45j68J92k24K56k91L31l76
$$ 0 0 0 0 0 0 0 0 0 0 0 0 0 8 -8 8 -8 16 -16 24 -24 32 -33 40 -48 56 -65 80 -88 104 -120 136 -155 176 -200
34b00M25m79N39o06O78p56Q42r36J040j153J276j410J557j717J893k085K296k530
$$ -200 225 -254 285 -321 357 -399 443 -493 547 -606 670 -740 817 -900 993 -1092 1204 -1326
52a326K790l078L398l757M166m636N177n812O568p489Q635j0111J2097j4922J9294
$$ -1326 1464 -1614 1784 -1973 2193 -2443 2734 -3078 3490 -3999 4636 -5475 6622 -8300 10994
67A0994k7031M4833j63079m6320K92476P9409p3367k42306j04398J07021K15175
$$ 10994 -16037 28796 -134283 -180603 111873 191282 117915 -124391 -228789 -121768 93407
78I3407J18432q1331k20599q5476P5035J76160J15949q8379j81138o6833N4833
$$ 93407 211839 130508 -90091 -175567 -100532 75628 191577 103198 -77940 -144773 -89940
89h9940J47364P6378p9831j12876m6516M7024J13999K8672m8043m6868l3263L6738
$$ -89940 57424 133802 53971 -58905 -105421 -58397 55602 84274 36231 -10637 -43900 -7162
101g162O9149L00k5737l5430j7315M5451K1416k8119k7210k9408K5489N2146j7864
$$ -7162 61987 62287 36550 1120 -16195 29256 50672 22553 -4657 -34065 -8576 43570 25706
114B5706m0164l2151j2356N8811M6632j4902l6115n5735k788P1731N0876J1620
$$ 25706 -14458 -46609 -58965 -154 46478 31576 -4539 -60274 -63062 8669 59545 71165
126G1165n2167r3690m246P2812O8089K3363q0997j01476m651O1391R0978L3807
$$ 71165 18998 -74692 -78938 -6126 61963 85326 4329 -97147 -101798 -40407 50571 84378
138H4378q5743r0172k1947N6159J18702L9528p8880r1789m0562P3766J26717K3353
$$ 84378 -1365 -91537 -113484 -57325 61377 100905 22025 -69764 -110326 -36560 90157 113510
150A13510p3377r9687m2364Q8225J01274M653o4349r9145k6520Q8411P9211J0164
$$ 113510 40133 -59554 -101918 -13693 87581 92234 27885 -71260 -97780 -9369 69842 80006
162H0006o6413r6413O127Q9574O9501M203r0683p7744M3159Q6295N4682k5234
$$ 80006 13593 -82820 -76693 12881 82382 86585 -4098 -81842 -38683 47612 102294 77060
174G7060j05662m6887N2993P6355M6645n6276j06943k6650M9907Q8019M6074p8954
$$ 77060 -28602 -75489 -22496 53859 100504 44228 -62715 -89365 -39458 48561 94635 15681
186A5681r7806j5376O0351J04830K5209q6972p9189j4148O9523R7342k112p1793
$$ 15681 -82125 -97501 -37150 67680 92889 5917 -73272 -87420 -17897 79445 77333 5540
198E540o3644k1367O6477P2416r419n1035o2667j6450O4910M6776n004l6620n0412
$$ 5540 -58104 -79471 -12994 59422 50003 -1032 -63699 -80149 -15239 31537 26533 -10087 -60499
211f0499J4442N2163J4368k325k4517k1538L0232K0867m415o539k5026N879L3174
$$ -60499 -46057 6106 20474 18149 -6368 -27906 2326 23193 18778 12239 -12787 -6908 26266
224B6266J787r421k8191k9353L0704L7628O663j6322n5201k0646M8140M5630K4282
$$ 26266 28053 18632 -9559 -38912 -8208 29420 36083 19761 -35440 -56086 -7946 37684 61966
237F1966k7963o8037j2646L5721N0598M4837l2685p3374l2796J1637P0625O1357
$$ 61966 34003 -34034 -46680 -10959 39639 84476 51791 -21583 -54379 -42742 27883 89240
249H9240l3409p4132o1198N56Q7868O5407j5569o5567q4257l681Q7836P3943J7146
$$ 89240 55831 -18301 -79499 -78943 8925 74332 58763 -6804 -91061 -94742 -6906 67037 84183
262H4183o4970j00556j0957P1798Q5825L6153p6018j00320j6146N2770Q9161L4628
$$ 84183 19213 -81343 -92300 -20502 65323 101476 25458 -74862 -91008 -38238 50923 85551
274H5551o9798p6558k6386L7089Q4733K6052m6366n2906l1274L7508O6985R316
$$ 85551 15753 -60805 -87191 -50102 34631 60683 14317 -38589 -69863 -32355 34630 43946
286D3946k3116l3927j8838L5993K5432j0929r015j3668Q536K0725k0648j9944
$$ 43946 20830 -13097 -31935 4058 29490 18561 9546 -4122 4414 25139 4491 -15453
298a5453M79J0203L7045M699m4450k9227n183M0683O4439m680n5921n1591r739
$$ -15453 -14974 -4771 32274 36973 -7477 -36704 -41887 -1204 63235 58555 2634 -48957 -58696
311e8696P3394P1788j1961o2500p4336r080Q2490O4133m261o3428q4935l006P1481
$$ -58696 14698 86486 74525 12025 -62311 -71391 11099 75232 70971 7543 -77392 -80398 -8917
324h917O0924J5351o2139q0198K05N3822O3502K3924n8679n9003k880L2860N7998
$$ -8917 52007 67358 5219 -74979 -74774 -20952 42550 66474 7795 -51208 -54088 -21228 36770
337C6770J7099m2233l5872k0559J4859M7568R541j8227k4330l0267J3511L3746
$$ 36770 53869 11636 -24236 -44795 -29936 17632 27173 8946 -15384 -45651 -32140 1606
349A606Q950K132k0561k1805J5334J2985J2628J1646j9897q982P599J666J8155
$$ 1606 10556 12688 -7873 -29678 -14344 -1359 11269 22915 3018 -5964 1635 3301 21456
362B1456J212k1668m73O56O131J3484j9088j5188O826M855J9990J345k9256o345
$$ 21456 22668 1000 527 1183 7314 20798 1710 -13478 -6652 -1797 18193 19538 -9718 -16063
376a6063O891J7675K8948j2667k9482j0844J10L5259K8427k3285l0770k4371M422
$$ -16063 -9172 8503 37451 24784 -4698 -15542 -15432 19827 48254 24969 -5801 -30172 -25750
389b5750M6229J6077k5259l0931k8072J8483M2486O352j3861k9519k0315L0565
$$ -25750 20479 36556 11297 -19634 -47706 -29223 13263 19615 5754 -23765 -44080 -13515
401a3515K9029K204j0470l0989l367L2538J2519l352k1859k5291K1450K6880o61
$$ -13515 15514 17718 7248 -23741 -27108 5430 17949 14597 -7262 -32553 -11103 15777 15116
414A5116j4893l4822n959L9805K2428j793k8440m0456J3937M7209L0130J554m8880
$$ 15116 223 -34599 -40558 -753 21675 19882 -8558 -49014 -35077 12132 42262 43816 -5064
427e064m2678K2048M5722M1333l365o5238m0904J5802M5545N0206j1925o1378
$$ -5064 -47742 -25694 20028 61361 57996 -7242 -48146 -32344 13201 63407 51482 -9896
439i896l6435R5M6942N3201r447m2265l9048j2320M7792M7630P68k4143m4175
$$ -9896 -46331 -46236 706 53907 44460 2195 -36853 -49173 -1381 46249 47017 22874 -21301
452b1301j7315L2722K9959J6672j0642m4415j9208P490J7799L2687j84l0852k0807
$$ -21301 -38616 -5894 24065 40737 30095 -14320 -33528 -26038 -8239 24448 24264 -6588 -27395
465b7395j5851J5629L7800R175p890k2565k8256J2319K7223J9483J2912k6105
$$ -27395 -43246 -27617 10183 19358 11468 -11097 -39353 -27034 189 19672 32584 6479
477F479l2541o50J0548K8382J8645k2028k1945j5960l736L0735J9056j307o974
$$ 6479 -26062 -26712 -16164 12218 30863 8835 -13110 -29070 -32806 -2071 16985 15678 8704
490H704k9463j2018J9865J9833K6370J651l4467k0017l254K1361M4815P211k8443
$$ 8704 -20759 -32777 -12912 6921 33291 34942 475 -19542 -22796 -1435 43380 50591 22148
503B2148l5394l0462K2733N3583J9834j6784n3407m3573K6236N3424L7666o447
$$ 22148 -13246 -43708 -20975 32608 52442 35658 -17749 -61322 -35086 18338 56004 49557
515D9557o3949m4603J9598M9176N0981m210o1804m1041L449M4459N3260q878m9491
$$ 49557 -14392 -58995 -39397 9779 60760 56550 -5254 -46295 -42846 1613 54873 45995 -3496
528c496l7579q984M1227M1069r547k7709l0070q268L3243K2155o01r266k1850
$$ -3496 -41075 -50059 -8832 32237 22690 -5019 -35089 -43357 -10114 12041 11440 2174 -19676
541a9676J94J7129J932O492m03r505Q005l650j0927N280J881R768R024j9573j5135
$$ -19676 -19482 -2353 -421 6071 5668 -3837 4168 518 -10409 -5129 -3248 6520 15544 -4029 -19164
556a9164r11Q091K8669N591k2556j2969q890J5523L3700K137j5248j8101j5124
$$ -19164 -20075 -11984 16685 22276 -280 -13249 -22139 -6616 27084 29221 13973 -4128 -19252
569a9252K0108K3929J303n994k4126j3866J7469J0156N585j702k2079m333P285
$$ -19252 856 24785 26088 20094 -4032 -17898 -429 9727 15312 13610 -8469 -12802 -5517
582e517J704J2641n15j0130K137o280K004J3315l436M96o99j3231L914M507k187
$$ -5517 -3813 8828 8313 -1817 320 -5960 -3956 9359 5923 6419 5720 -7511 -3597 910 -1277
597a277P397q652r954O231k006L245L970j3021J391O950K85Q132p929j1640J0941
$$ -1277 6120 -2532 -12486 -6255 -8261 -5016 -1046 -14067 -12676 -5726 -5441 2691 -5238 -16878 -5937
612e937Q657R251J824k3697q177J1745J2858J8722r823l2054q933Q008K6604K4882
$$ -5937 2720 11971 13795 -9902 -18079 -6334 6524 25246 15423 -16631 -25564 -17556 9048 33930
626C3930j9520l1248j4259O413L9942K4199j9182k7757k3239R503M3244J8220
$$ 33930 14410 -16838 -31097 -24684 15258 39457 20275 -7482 -30721 -21218 22026 40246
638D0246j1480k6754k9920J0860L1374J4002J56k6859k7203Q896J5556J5218P604
$$ 40246 28766 2012 -27908 -17048 14326 28328 28484 1625 -25578 -16682 -1126 14092 21696
651B1696k0107j3600m40m14J6628R025n448P49j2634j1297R452O342J4074R000
$$ 21696 1589 -12011 -12451 -12865 3763 12788 7340 8089 -4545 -15842 -6390 -48 14026 23026
665B3026k1956j8621p076O411L0724J2162j7276k2864k4527R544L9663J8003n572
$$ 23026 1070 -17551 -24627 -18216 12508 24670 7394 -15470 -39997 -30453 9210 27213 21641
678B1641k9274l4813J0464L4710K6101P457l4117l5439K837K2656L5216J3693
$$ 21641 -7633 -42446 -31982 2728 28829 36286 2169 -33270 -30433 -7777 27439 41132
690D1132l1818l0369j2416J1178L9451J7312j6220k4588k6987N788L5075K0106
$$ 41132 9314 -21055 -33471 -22293 17158 34470 18250 -6338 -33325 -27537 7538 27644
702B7644M891k1147l5749j644K0504K6310K1691j9562l4459j3655M529L2420K7756
$$ 27644 32535 11388 -24361 -26005 -5501 20809 42500 22938 -11521 -25176 -20647 11773 39529
715C9529j3298k7451k7537n785L4854K6878j92j8572l5099p175K7191K2791J3542
$$ 39529 26231 -1220 -28757 -34542 312 27190 26998 8426 -26673 -33848 -6657 16134 29676
728B9676j4554l3370o355J1209J8651K0115j1933k0876p776m653J4642J6391m655
$$ 29676 15122 -18248 -24603 -13394 5257 25372 13439 -7437 -15213 -19866 -5224 11167 6512
741F512l597j1530j3345Q564P477R144J1142j2873j3450l765r01K1515J7727q549
$$ 6512 2915 -8615 -21960 -13396 -5919 3225 14367 1494 -11956 -15721 -16622 4893 22620 14071
755A4071j3403k0119l957K6931J8242J657j5106l1837k722K4081J9368J1002j9625
$$ 14071 668 -19451 -23408 3523 21765 23422 8316 -23521 -26243 -2162 17206 28208 8583
768H583l0828m28J5743K2991J4563k1121k1365k692Q328K4243Q077j8495j1274
$$ 8583 -22245 -22673 -6930 16061 30624 9503 -11862 -14554 -6226 18017 26094 7599 -3675
781c675p112N813J9163j710r224n110p753Q707P737p862J18k490k379J0056m025
$$ -3675 -10787 -4974 14189 12479 3255 -1855 -9608 -901 6836 -1026 -908 -3398 -5777 4279 254
796B54n449L653l145O825O544j0266k086j663j418J2157j031q059N59p200K485
$$ 254 -5195 -1542 -4687 2138 8682 -1584 -3670 -5333 -6751 5406 4375 -3684 -3125 -10325 -7840
811g840R235l830J689j172p909M721j31j128J0670j196l468R5r446M929J2720
$$ -7840 1395 -2435 -746 -1918 -9827 -5106 -5237 -6365 4305 3109 -359 -264 -9710 -4781 7939
826G939P58K164r925j5081O962R629R041N840j8831j2624M200O790J7928M167
$$ 7939 8697 10861 936 -14145 -7183 2446 11487 17327 -1504 -14128 -9928 -3138 14790 18957
840A8957j7629r214m381O883K1332Q05q749p088j2151O959J3282J443L714q539
$$ 18957 1328 -7886 -12267 -5384 15948 16753 8004 916 -11235 -4276 9006 10449 14163 5624
854E624j4816J953M84O913J3506n270r076r276j0991J3689J8694L749l497k2601
$$ 5624 -9192 -7239 -6755 158 13664 8394 -682 -9958 -20949 -7260 11434 15183 11686 -10915
868a0915j7450J4128K0023J7931r78l2193j9397O053K0750K9677k344l1969k1216
$$ -10915 -28365 -14237 5786 23717 22739 -9454 -28851 -22798 -2048 27629 25285 -6684 -27900
881b7900n629K4212L4929q26k2071k5161j2699K5249K9538N480j0413k8435j5060
$$ -27900 -33529 -9317 25612 24786 2715 -22446 -35145 -9896 19642 25122 14709 -13726 -28786
894b8786J7994J9774J5300j958k6292j3370K861J0614K2693L000j5984j2369j3682
$$ -28786 -10792 8982 24282 22324 -3968 -17338 -14477 -3863 18830 21830 5846 -6523 -20205
907b0205O188K3330Q856M06j3005k3700Q62J5646J6483J3998j5533k5450p098
$$ -20205 -14017 9313 18169 18575 5570 -18130 -17268 -1622 14861 28859 13326 -12124 -19222
920a9222M571K4340K0088j2629k0767j8012l114K7055J9058l139j4651k6235m880
$$ -19222 -14651 9689 29777 17148 -3619 -21631 -24745 2310 21368 18229 3578 -22657 -27537
933b7537K2117J6730J0196j0502k6831n610Q979J5091J8606p553j9443r642n214
$$ -27537 -5420 11310 21506 11004 -15827 -21437 -12458 2633 21239 13686 -5757 -15399 -20613
946b0613J5365K0110j262p744j6468j3687J3263J5487R464J465k1035j5084N877
$$ -20613 -5248 14862 13600 5856 -10612 -24299 -11036 4451 13915 15380 -5655 -20739 -14862
959a4862J1393K0366N227j9812j3702n844R358K4841L929j2363j4063j3957J0680
$$ -14862 -3469 16897 22124 2312 -11390 -17234 -7876 16965 20894 8531 -5532 -19489 -8809
972h809K0752M022l289j5789j3753J0315J1200O430J969j5104p427O057K930R664
$$ -8809 11943 15965 12676 -3113 -16866 -6551 4649 11079 13048 -2056 -9483 -3426 -496 9168
986I168R87j0518N64j721j440P366l341r42M350o606r32O16m327Q223L586n357
$$ 9168 10155 -363 201 -1520 -2960 4406 1065 123 4473 -2133 -3065 -2449 -6776 1447 5033 -324
1002c24k01p982q37J1255J380L20k245j1399L528P673J355M317p587p982N796
$$ -324 -525 -8507 -9344 1911 3291 3611 1366 -10033 -6505 1168 2523 6840 -747 -8729 -2933
1017b933L40L259L490q574P69L823l252M490k148m541P811N22j732L42q480L143
$$ -2933 -2593 666 4156 -4418 -3649 174 -3078 1412 -736 -5277 2534 3056 1324 1666 -6814 -3671
1033c671R648K59J930p061j1364O922P341N103L123j4289r307N200N082J2598
$$ -3671 5977 6236 8166 1105 -10259 -3337 4004 9107 12230 -2059 -11366 -6166 -1084 11514
1047A1514J860j4163n689k962M559J6181Q92p708n982j0795N098J2786L151L192
$$ 11514 13374 -789 -6478 -9440 -4881 11300 12192 4484 -1498 -12293 -7195 5591 8742 11934
1061A1934r100j4349J918M688R249J0863r535j2826o507k198J7297J4829n492
$$ 11934 2834 -11515 -9597 -4909 4340 15203 5668 -7158 -13665 -15863 1434 16263 10771
1074A0771j0118j6823m759J9707J4100L974r266k4127n247J5009J5184J3351j0439
$$ 10771 653 -16170 -20929 -1222 12878 16852 7586 -16541 -21788 -6779 8405 21756 11317
1087A1317k3821o380M786J7336J7953r196j6561j0524l100J7837J5855j668o647
$$ 11317 -12504 -18884 -14098 3238 21191 11995 -4566 -15090 -18190 -353 15502 13834 7187
1100G187j6501q212J2800J0717Q858L30j7927r773J258O860J8740M735j3042j1746
$$ 7187 -9314 -17526 -4726 5991 14849 15179 -2748 -12521 -11263 -4403 14337 19072 6030 -5716
1114e716j2538N685K1703Q743k389j5320k1710M609J8807J4840O662j8826k2983
$$ -5716 -18254 -12569 9134 17877 15488 168 -21542 -16933 1874 16714 23376 4550 -18433
1127a8433k79J1080K1388J1272j7582j9216q834N436K5127J1033j0415j3971j7190
$$ -18433 -18712 -7632 13756 25028 7446 -11770 -20604 -15168 9959 20992 10577 -3394 -20584
1140b0584K606K0678J0587J478j1944j9293K99J0975J1228J1385r463j6006m683
$$ -20584 -17978 2700 13287 14765 2821 -16472 -16173 -5198 6030 17415 7952 -8054 -12737
1153a2737j20J3234J4684m980r011j1000p171J3356J2387L839k405j7307r330
$$ -12737 -12857 377 15061 10081 1070 -9930 -17101 -3745 8642 12481 10076 -7231 -16561
1166a6561Q988R193J2384J16j7195p921J83Q058J7027o58j1287p477p773Q324
$$ -16561 -7573 1620 14004 14120 -3075 -10996 -10813 -2755 14272 13614 2327 -5150 -12923 -4599
1180d599J4027K16k273r357j0022P800P073L691L372j0286o463K524L53P994M430
$$ -4599 9428 9644 7371 -1986 -12008 -4208 2865 6556 9928 -358 -6821 -4297 -3944 4050 8480
1195H480p167j518m420k164R178K104l79k16j0041r59N483J377O192j711r114
$$ 8480 1313 -205 -4625 -6789 2389 4493 4114 3898 -6143 -7102 -1619 -242 5950 4239 -4875
1210d875J14l58L439Q497m448m481p39l765O116M700m076Q50l017k134O591j657
$$ -4875 -4761 -5119 -1680 6817 2369 -2112 -2851 -6616 -500 4200 124 974 -2043 -4177 2414 757
1226G57j858K324m100L174K958n558J023n37o98Q223j328n350p73m410N430Q559
$$ 757 -1101 1223 -2877 297 3255 -2303 -1280 -1817 -2515 5708 4380 -970 -1743 -6153 -723 7836
1242G836l029k818n543n289R142O290J73n77j0999l835P312L406O290q49j1661
$$ 7836 4807 1989 -3554 -8843 299 6589 6762 6185 -4814 -8649 -1337 2069 8359 7510 -4151
1257d151k373J197L706J0506j420o761l311o459M409R953L44R50o668j0457L751
$$ -4151 -6524 -5327 -1621 8885 7465 704 -2607 -9066 -4657 5296 5640 6590 -78 -10535 -6784
1272f784N704O439O568r358j0563k000J370J3220Q718q023q062r920l40J6144
$$ -6784 -1080 5359 11927 2569 -7994 -9994 -8624 4596 13314 5291 -2771 -12691 -13031 3113
1286C113Q350r16p868j6275o66J3122Q971O818q740j6757j926N001J2223J2137
$$ 3113 11463 10547 2679 -13596 -14262 -1140 7831 14649 5909 -10848 -12774 -7773 4450 16587
1300A6587p844j2330p386k553J3978J2351j870n992j3471o844J1540J0765O714
$$ 16587 8743 -3587 -10973 -13526 452 12803 10933 4941 -8530 -15374 -3834 6931 13645
1313A3645j503j7029q768L706Q892J5567J245j5163j0662n480R200J9268L127
$$ 13645 12142 -4887 -13655 -9949 -1057 14510 15755 592 -10070 -15550 -6350 12918 16045
1326A6045q462j3633j2988Q812J7181P590q57j6684j4168N268J1580J3229L993
$$ 16045 7583 -6050 -19038 -10226 6955 14545 13688 -2996 -17164 -11896 -316 12913 16906
1339A6906j6324j2689j549O309J6936N469j0504r099r703L338J5642N945n71q445
$$ 16906 582 -12107 -13656 -7347 9589 15058 4554 -4545 -14248 -10910 4732 10677 10106 1661
1353A661j4298R47Q978Q122Q162p484j3236l365R76J1605J1806m967q996r404
$$ 1661 -12637 -11690 -2712 5410 13572 6088 -7148 -10513 -9537 2068 13874 8907 -89 -9493
1367i493m509J2697J1326Q24m244j4678n919R990Q930P287k342j5243n572L195
$$ -9493 -14002 -1305 10021 10845 6601 -8077 -13996 -4006 4924 12211 9869 -5374 -10946 -7751
1381g751P571J2329k724j0521n356l374P740J1047j188l884p388o851O973O586
$$ -7751 -180 12149 9425 -1096 -6452 -9826 -2086 8961 7773 3889 -3499 -10350 -3377 3209
1395C209K344J757q698n761L152J835P047K636p387l007k542%Q615J849k188j651
$$ 3209 5553 7310 -1388 -7149 -3997 -2162 4885 7521 134 -2873 -5415 -5415 3200 5049 2861 1210
1411A210p282J082O455O67K578k653p480K116J579J888N310m392l309J317k079
$$ 1210 -6072 -4990 1465 2132 4710 2057 -5423 -3307 -1728 160 5470 1078 -2231 -914 -2993
1426b993L501K643l895J704j200k387L825j679o06L797k552M99P93m828K251K043
$$ -2993 508 3151 -744 960 -240 -2627 1198 -481 -1087 2710 158 657 1450 -3378 -1127 916
1442I16r85M004k947m447J912n98L566M480m531k318j834j953O088K773j806k16
$$ 916 -69 3935 988 -3459 -1547 -2145 1421 5901 1370 -948 -2782 -4735 1353 4126 2320 2104
1458B104o033j423N495J436L150j22p831j085P85K093P656j000n447k216m594
$$ 2104 -3929 -5352 143 1579 4729 4607 -3224 -4309 -3524 -1431 6225 5225 -222 -2438 -7032
1473g032L759Q351M27m93o180q203M088O262M923L020r036q073J203L363J0333
$$ -7032 -3273 5078 5505 5012 -1168 -9371 -5283 979 5902 8922 -114 -8187 -6984 -3621 6712
1488F712M327q588p104n137K192J2852N072m034o945j0706K090J1296N977K478
$$ 6712 11039 2451 -4653 -9790 -7598 5254 10326 6292 -653 -11359 -9269 2027 8004 10482
1502A0482q041j2398J82N655R032P767p145j0531m032j49J1601R232l768o772
$$ 10482 2441 -9957 -9775 -4120 4912 12679 5534 -4997 -9029 -9178 2423 11655 7887 1115
1516A115j0154l262J0997Q959K650l555j3845m982O317Q526R741k735j3229o702
$$ 1115 -9039 -12301 -1304 7655 10305 6750 -7095 -12077 -5760 2766 12507 9772 -3457 -10159
1530a0159l65Q684J3716j011q783r012o506Q775J2650K787l024j2369r041O319
$$ -10159 -10524 -1840 11876 10865 2082 -6930 -13436 -4661 7989 10776 7752 -4617 -13658 -7339
1544g339R224Q337J660j3208q626O34N758J2656K817r087p658o460L451J3242
$$ -7339 1885 10222 11882 -1326 -9952 -9318 -3560 9096 11913 2826 -4832 -11292 -7841 5401
1558E401M785j984q167j1415K245R536O854M138p995j1736j109L922R921P888
$$ 5401 10186 8202 35 -11380 -9135 401 7255 11393 3398 -8338 -9447 -5525 4396 12284
1572A2284o618q883n645n90J1808P756l120n288j0343j883R980O419L103m037
$$ 12284 5666 -3217 -8862 -9452 2356 10112 6992 1704 -8639 -10522 -542 5877 8980 4943
1586D943j0974k649M245N995P703l363q748l477j056O467Q467k104m019n193m220
$$ 4943 -6031 -8680 -4435 1560 9263 5900 -2848 -6325 -7381 -914 7553 5449 1430 -3763 -7983
1601g983N693N662J165O33p313m433L436K504N581J706p126k764p26Q10P047O16
$$ -7983 -2290 3372 4537 5170 -2143 -6576 -3140 -636 4945 6651 -475 -3239 -3965 -3155 3892 4508
1617D508l290j449m620J274N595P94Q30k299n550K043J865J104L377l526k719
$$ 4508 1218 -231 -4851 -3577 2018 2812 3642 1343 -4207 -2164 -299 805 4182 656 -2063
1632b063J293j669K991K647k690O74j580k287L111k31k73K006k794L0J410k716
$$ -2063 -770 -2439 552 3199 509 1183 -397 -2684 427 196 -77 1929 -865 -835 575 -2141
1648b141K249J349j701J802k060k438K658p78J262K905l227j010j55j997M279
$$ -2141 108 1457 -244 1558 -502 -2940 -282 -1060 202 3107 -120 -1130 -1285 -3282 997
1663I97K249k200K75m399j453M672J560J500n8o169n89J392J819N857j103n738
$$ 997 3246 1046 1321 -3078 -4531 141 1701 3201 3143 -3026 -3615 -2223 -404 5453 4350 -1388
1679a388j612k525M147P107j079k215m752m685M701N816J804L80p312n156K657
$$ -1388 -3000 -5525 -1378 5729 4650 2435 -2317 -7002 -2301 3515 5319 5699 -1613 -6769 -4112
1694d112L216O980K196p716m917j777K487R162K052m352m878o517K139Q577L720
$$ -4112 -896 6084 8280 564 -4353 -6130 -3643 5519 7571 3219 -1659 -8176 -6037 2540 6260
1709F260Q33o039r121J057N414O069M865o904q383j595J130R214O588m571n844
$$ 6260 7093 1054 -8067 -7010 -1596 4473 9338 2434 -5949 -7544 -6414 2800 9388 4817 -1027
1724a027o770j604R996O412M96m649j0335k282P150O352N770l559j0649l531J663
$$ -1027 -7797 -9401 595 7007 7503 2854 -7481 -9763 -2613 3739 9509 5950 -4699 -8230 -6567
1739f567O763R624k017q159n946l707Q030R786P68l754r044o031N875P702N042
$$ -6567 196 9820 7803 -356 -6302 -10009 -1979 7807 8575 4821 -4223 -10254 -4379 3323 8365
1754H365K72j0315o996J729N624R762J567q720o521l487M351J0471K414l686o815
$$ 8365 8637 -1678 -8674 -6945 -1321 8441 10008 1288 -5233 -8720 -4369 6102 8516 4830 -1985
1769a985p543L076Q696M540J532p637r022J391M528O926M640o976p053k167J022
$$ -1985 -9528 -6452 2244 6784 8316 679 -8343 -6952 -2424 4502 9142 2166 -4887 -7054 -6032
1784f032Q706N151l213m729o831q47Q116M484J232l222q693j065M460M470N007
$$ -6032 2674 7825 4612 -117 -6948 -7795 321 4805 6037 2815 -5878 -6943 -2483 1987 6994
1799F994k681p254k355k63N049P091j730m387m247k812N592N370J07q57n883l324
$$ 6994 4313 -2941 -5296 -5559 -510 6581 4851 464 -3783 -6595 -1003 4367 4474 3617 -2266 -5590
1815e590M034K469L568O37o092k320O74J482N310L0l637j348k920J422M675k16
$$ -5590 -1556 913 4481 5118 -974 -3294 -2620 -1138 4172 4202 565 -783 -3703 -2281 2394 2178
1831B178K60j450m331J612J997Q37K837l334l057J158n72K179K209k470K57j006
$$ 2178 2438 988 -3343 -1731 266 1103 3940 606 -2451 -1293 -1865 314 2523 53 310 -696
1847f96k047K900P08r09J192k183p28J980j662J220J261j631J376p86k142K058
$$ -696 -2743 157 865 -44 1148 -1035 -1763 217 -1445 -225 1036 -595 781 -5 -2147 -89
1863h9m41Q98K095k912j062N41j247L506J400j985k30l122o29M372R58N77q84
$$ -89 -530 368 2463 -449 -1511 -970 -2217 1289 2689 704 474 -2648 -3277 1095 2053 2630 1746
1880A746m879K59K748J302L341j776m521j74o88K844M312j501k491k673k674M269
$$ 1746 -3133 -2874 -126 1176 4517 2741 -1780 -1954 -2642 202 4514 3013 522 -2151 -4825 -556
1896e56M136J01j49n305l472K922K523M169J143o226l165q53K138P505Q93m206
$$ -556 3580 3681 3532 -1773 -5245 -2323 200 4369 5512 -714 -3879 -4732 -2594 4911 5804 1598
1912A598l825m128K210P064K232p16m996o734K007N288M216K721n998o738j80
$$ 1598 -2227 -6355 -4145 2919 5151 4435 -561 -7295 -5288 0 4216 6937 939 -5799 -5979
1927e979K634O933L849n164m982l306L16P652M070j111l677p492r39O496M664
$$ -5979 -3345 3588 7437 2273 -2709 -6015 -5699 1953 6023 4912 1235 -6257 -7196 -700 3964
1942C964K769k963q296j799K632N139O566k486o609m122j830O310P759k97l908
$$ 3964 6733 3770 -4526 -6325 -3693 1446 8012 5526 -1083 -5205 -7035 -725 7034 6737 2829
1957B829p121l928O235O249K953j345q601m496K639M656O876J65p514m563j492
$$ 2829 -4292 -8220 -1985 4264 7217 5872 -2729 -7225 -4586 70 6946 7111 -403 -4966 -6458
1972f458M064Q575O82m684n119m632L773O967K072k51n445o379K056M016M927
$$ -6458 -2394 6181 6863 2179 -2940 -7572 -3799 3168 5240 4989 -456 -6835 -4779 -763 4164
1987D164K508n849n420q53J282O766L439l575l569m474j49O774L436K02k977o995
$$ 4164 6672 823 -4597 -5450 -4168 2598 6037 2462 -1107 -5581 -5730 1044 4480 4682 1705 -5290
2003e290o99M918L716L581l353o592q41R95M627M789k550l926k824j598N005M276
$$ -5290 -5989 -1071 2645 6226 2873 -3719 -4560 -3565 1062 5851 3301 -625 -3449 -5047 -42 4234
2019D234q55j464m334j778L931K240J565j83m638j361J046P67L989J01l105j082
$$ 4234 3379 1915 -2419 -4197 -266 1974 3539 3356 -1282 -2643 -1597 -830 3159 3260 155 -927
2035i27j632Q69L993k41m76j271l393J458K151M90J963k291k809J071k64K269
$$ -927 -2559 -1690 2303 2062 1586 315 -3078 -1620 531 1021 2984 693 -2116 -1045 -1309 960
$$ [...]
8191g1
##END NTUPLES=NMR FID
##END=
