##TITLE=1H_DE-128HK
 200.13MHz,D2O.
 8 sc
 
 25.2.2026
##JCAMPDX= 6.0         $$ Bruker NMR JCAMP-DX V2.0
##DATA TYPE= NMR FID
##DATA CLASS= NTUPLES
##ORIGIN= UXNMR, Bruker Analytische Messtechnik GmbH
##OWNER= pz
$$ XWIN-NMR		Version 3.5
$$ Wed Feb 25 15:22:25 2026 Russian Standard Time (UT+4h)  she@DPX200
##.OBSERVE FREQUENCY= 200.1313
##.OBSERVE NUCLEUS= ^1H
##.DELAY= (6, 6)
##.ACQUISITION MODE= SIMULTANEOUS
##.ACQUISITION SCHEME= undefined
##.AVERAGES= 8
##.DIGITISER RES= 18
##SPECTROMETER/DATA SYSTEM= spect
##.PULSE SEQUENCE= zg30
##.SOLVENT NAME= D2O
##.SHIFT REFERENCE= (INTERNAL, D2O, 0, 14.3821)
##AUDIT TRAIL= $$ (NUMBER, WHEN, WHO, WHERE, WHAT)
$$ ##TITLE= Audit trail, XWIN-NMR		Version 3.5
$$ ##JCAMPDX= 5.01
$$ ##ORIGIN= Bruker BioSpin GmbH
$$ ##OWNER= she
$$ F:/spectra/data/she/nmr/H-C/1/audita.txt
$$ ##AUDIT TRAIL=  $$ (NUMBER, WHEN, WHO, WHERE, WHAT)
(   1,<2026-02-25 15:21:06.92 +0400>,<she>,<DPX200>,
      <created by zg, POWCHK disabled, PULCHK disabled
       configuration hash MD5:
       00 E9 B6 7A A2 85 ED C7 34 08 36 98 17 FE 4E 26
       data hash MD5: 16K
       68 F2 30 24 0B 32 AC 93 57 1B 2E 19 B2 32 EC 2B>)
$$ ##END=
$$ 
$$ hash MD5
$$ A2 41 1A 16 FC BA 89 5E BF 1E B5 8F CA 23 B4 DE
##$RELAX= 
##$RELAX= 
##$RELAX= 
##$RELAX= 
##$RELAX= 
##$RELAX= 
$$ Bruker specific parameters
$$ --------------------------
##$DU= <F:/spectra>
##$EXPNO= 1
##$NAME= <H-C>
##$PROCNO= 1
##$TYPE= <nmr>
##$USER= <she>
##$AMP= (0..31)
100 100 100 100 100 100 100 100 100 100 100 100 100 100 100 100 100 100 
100 100 100 100 100 100 100 100 100 100 100 100 100 100 
##$AQSEQ= 0
##$AQ_mod= 1
##$AUNM= <au_zg>
##$AUTOPOS= <>
##$BF1= 200.13
##$BF2= 200.13
##$BF3= 200.13
##$BF4= 200.13
##$BF5= 200.13
##$BF6= 200.13
##$BF7= 200.13
##$BF8= 200.13
##$BYTORDA= 1
##$CFDGTYP= 0
##$CFRGTYP= 5
##$CHEMSTR= <none>
##$CNST= (0..31)
1 1 145 1 1 1 1 1 1 1 1 1 1 1 1 1 1 1 1 1 1 1 1 1 1 1 1 1 1 1 1 1 
##$CPDPRG= <>
##$CPDPRG1= <>
##$CPDPRG2= <>
##$CPDPRG3= <>
##$CPDPRG4= <mlev>
##$CPDPRG5= <mlev>
##$CPDPRG6= <mlev>
##$CPDPRG7= <mlev>
##$CPDPRG8= <mlev>
##$CPDPRGB= <>
##$CPDPRGT= <>
##$D= (0..31)
0 0.7 0 0 0 0 0 0 0 0 0 0.03 0 0 0 0 0 0 0 0 0 0 0 0 0 0 0 0 0 0 0 0 
##$DATE= 1772018466
##$DBL= (0..7)
120 120 120 120 120 120 120 120 
##$DBP= (0..7)
150 150 150 150 150 150 150 150 
##$DBP07= 0
##$DBPNAM0= <>
##$DBPNAM1= <>
##$DBPNAM2= <>
##$DBPNAM3= <>
##$DBPNAM4= <>
##$DBPNAM5= <>
##$DBPNAM6= <>
##$DBPNAM7= <>
##$DBPOAL= (0..7)
0.5 0.5 0.5 0.5 0.5 0.5 0.5 0.5 
##$DBPOFFS= (0..7)
0 0 0 0 0 0 0 0 
##$DE= 6
##$DECBNUC= <off>
##$DECIM= 32
##$DECNUC= <off>
##$DECSTAT= 4
##$DIGMOD= 1
##$DIGTYP= 9
##$DL= (0..7)
0 120 120 120 120 120 120 120 
##$DP= (0..7)
150 150 150 150 150 150 150 150 
##$DP07= 0
##$DPNAME0= <>
##$DPNAME1= <>
##$DPNAME2= <>
##$DPNAME3= <>
##$DPNAME4= <>
##$DPNAME5= <>
##$DPNAME6= <>
##$DPNAME7= <>
##$DPOAL= (0..7)
0.5 0.5 0.5 0.5 0.5 0.5 0.5 0.5 
##$DPOFFS= (0..7)
0 0 0 0 0 0 0 0 
##$DQDMODE= 0
##$DR= 18
##$DS= 0
##$DSLIST= <SSSSSSSSSSSSSSS>
##$DSPFIRM= 0
$$ [...]
##$SUBNAM0= <"">
##$SUBNAM1= <"">
##$SUBNAM2= <"">
##$SUBNAM3= <"">
##$SUBNAM4= <"">
##$SUBNAM5= <"">
##$SUBNAM6= <"">
##$SUBNAM7= <"">
##$SUBNAM8= <"">
##$SUBNAM9= <"">
##$SW= 18.0517328524113
##$SWIBOX= (0..15)
0 0 2 0 0 0 0 0 0 0 0 0 0 0 0 0 
##$SW_h= 3612.71676300578
##$TD= 16384
##$TD0= 1
##$TE= 0
##$TE2= 300
##$TE3= 300
##$TEG= 300
##$TL= (0..7)
0 120 120 120 120 120 120 120 
##$TP= (0..7)
150 150 150 150 150 150 150 150 
##$TP07= 0
##$TPNAME0= <>
##$TPNAME1= <>
##$TPNAME2= <>
##$TPNAME3= <>
##$TPNAME4= <>
##$TPNAME5= <>
##$TPNAME6= <>
##$TPNAME7= <>
##$TPOAL= (0..7)
0.5 0.5 0.5 0.5 0.5 0.5 0.5 0.5 
##$TPOFFS= (0..7)
0 0 0 0 0 0 0 0 
##$TUNHIN= 0
##$TUNHOUT= 0
##$TUNXOUT= 0
##$USERA1= <user>
##$USERA2= <user>
##$USERA3= <user>
##$USERA4= <user>
##$USERA5= <user>
##$V9= 5
##$VALIST= <valist>
##$VCLIST= <CCCCCCCCCCCCCCC>
##$VD= 0
##$VDLIST= <DDDDDDDDDDDDDDD>
##$VPLIST= <PPPPPPPPPPPPPPP>
##$VTLIST= <TTTTTTTTTTTTTTT>
##$WBST= 1024
##$WBSW= 4
##$XGAIN= (0..3)
0 0 0 0 
##$XL= 0
##$YL= 0
##$YMAX_a= 104754
##$YMIN_a= -128400
##$ZGOPTNS= <>
##$ZL1= 120
##$ZL2= 120
##$ZL3= 120
##$ZL4= 120
##$ABSF1= 10
##$ABSF2= 0
##$ABSG= 5
##$ABSL= 3
##$ALPHA= 0
##$AQORDER= 0
##$ASSFAC= 0
##$ASSFACI= 0
##$ASSFACX= 0
##$ASSWID= 0
##$AUNMP= <proc_1d>
##$AZFE= 0.1
##$AZFW= 0.1
##$BCFW= 1
##$BC_mod= 2
##$BYTORDP= 1
##$COROFFS= 0
##$CY= -3
##$DATMOD= 1
##$DC= 2
##$DFILT= <>
##$DTYPP= 0
##$F1P= 0
##$F2P= 0
##$FCOR= 0.5
##$FTSIZE= 0
##$FT_mod= 4
##$GAMMA= 1
##$GB= 0.15
##$INTBC= 1
##$INTSCL= 1
##$ISEN= 128
##$LB= 0.25
##$LEV0= 0
##$LPBIN= 0
##$MAXI= 10000
##$MC2= 0
##$MEAN= 0
##$ME_mod= 0
##$MI= 1.114404
##$NCOEF= 0
##$NC_proc= 0
##$NLEV= 6
##$NOISF1= 3.799351
##$NOISF2= 2.8
##$NSP= 1
##$NTH_PI= 0
##$NZP= 0
##$OFFSET= 14.38212
##$PC= 1
##$PHC0= -3705.888
##$PHC1= 7.992321
##$PH_mod= 1
##$PKNL= yes
##$PPARMOD= 0
##$PSCAL= 0
##$PSIGN= 0
##$REVERSE= no
##$SF= 200.129724274929
##$SI= 16384
##$SIGF1= 3
##$SIGF2= 2
##$SINO= 400
##$SIOLD= 16384
##$SREGLST= <1H.CDCl3>
##$SSB= 0
##$STSI= 0
##$STSR= 0
##$SW_p= 3205.1282051282
##$SYMM= 0
##$S_DEV= 0
##$TDeff= 0
##$TDoff= 0
##$TI= <>
##$TILT= no
##$TM1= 0
##$TM2= 0
##$TOPLEV= 0
##$USERP1= <user>
##$USERP2= <user>
##$USERP3= <user>
##$USERP4= <user>
##$USERP5= <user>
##$WDW= 1
##$XDIM= 8192
##$YMAX_p= 0
##$YMIN_p= 0
$$ End of Bruker specific parameters
$$ ---------------------------------
##NTUPLES= NMR FID
##VAR_NAME=  TIME,          FID/REAL,        FID/IMAG
##SYMBOL=    X,             R,               I
##VAR_TYPE=  INDEPENDENT,   DEPENDENT,       DEPENDENT
##VAR_FORM=  AFFN,          ASDF,            ASDF
##VAR_DIM=   8192,          8192,            8192
##UNITS=     SECONDS,       ARBITRARY UNITS, ARBITRARY UNITS
##FACTOR=    0.0002768,     1,               1
##FIRST=     0,             0,               0
##LAST=      2.2672688,     0,               0
##MIN=       0,             -128400,         0
##MAX=       2.2672688,     104754,          0
$$ Real data points
##PAGE= N=1
##DATA TABLE= (X++(R..R)), XYDATA
0 0 0 0 0 0 0 0 0 0 0 0 0 0 0 0 0 0 0 0 0 0 0 -1 5 -8 8 -8 8 -8 8 -12 15 -16 16 -20 23 -24 28 -31 36 -39 44 -47 52 -59
44 -59 65 -71 77 -85 96 -104 113 -127 140 -155 172 -190 212 -237 267 -304 348 -404 476 -577 720
65 720 -946 1336 -2162 4607 -28520 -128400 -93514 -20171 -18827 -35037 17437 86352 92156 43103
79 43103 -10120 -52589 -74757 -61677 -24103 1373 20461 64637 104754 70324 -15548 -59375
91 -59375 -50351 -57286 -75934 -40052 38764 80805 65754 37700 18454 -10892 -53857 -82901 -67101
104 -67101 -11830 43778 66664 62060 50906 36497 2730 -55656 -100157 -83034 -18558 31219
116 31219 42140 45566 57331 52473 9299 -54710 -93931 -73024 -11784 30600 37962 47927 73589
129 73589 68938 7823 -64516 -88575 -62954 -29806 -8091 18724 58170 80190 57215 2863
141 2863 -47223 -68548 -59613 -37252 -12832 23960 70372 91061 57994 -634 -38980 -52062
153 -52062 -62136 -64944 -35858 23920 72255 74019 41422 8330 -15225 -41893 -68837 -69601 -28654
166 -28654 32554 72454 70995 46259 22711 -1775 -40879 -79526 -78826 -31647 24272 51857 52591
179 52591 46911 36708 5169 -44340 -78310 -66585 -21808 19121 40371 53570 63269 51589
191 51589 7544 -47440 -74076 -61404 -30270 -3482 20699 49157 66926 50374 3464 -42780
203 -42780 -60737 -51671 -32462 -12120 18388 57103 76416 53451 5168 -32211 -45948 -50149
215 -50149 -50143 -30725 12115 54084 64817 42980 10055 -16638 -38278 -53616 -53962 -29682 14116
228 14116 54033 64593 46402 21889 -131 -28548 -58667 -64549 -34580 9365 37987 46601
240 46601 44667 33373 7342 -30687 -59226 -59999 -32592 4988 32261 46714 53726 47656 18216
253 18216 -27133 -58213 -56701 -35912 -11975 13516 40862 56075 46943 15555 -23029 -50341
265 -50341 -55225 -40548 -16467 11278 42008 64416 58523 22869 -17509 -40413 -49292 -49883 -34016
278 -34016 2426 40942 57457 48543 24137 -6793 -36091 -53685 -52864 -34251 481 39406 62059
291 62059 56409 31515 3436 -25157 -51576 -61390 -41878 -3575 30838 49276 51012 36849 7868
304 7868 -26447 -52372 -59445 -42346 -7538 28521 51500 56820 46089 18940 -18375 -50088 -59134
317 -59134 -44400 -15769 15783 42480 54545 45314 17871 -16589 -46030 -58680 -47883 -18873
329 -18873 14588 41730 56975 53785 28858 -9291 -40978 -53991 -47706 -27252 3026 34639
341 34639 53166 49340 26311 -5693 -35726 -53501 -51330 -29666 1614 31981 52602 56108 37034
354 37034 2618 -29770 -47230 -48542 -35907 -10248 23324 48476 51094 32351 4293 -23280
366 -23280 -44593 -52243 -39929 -11511 21001 46094 53989 41446 14406 -14799 -37214 -48524
378 -48524 -44226 -20770 13563 40763 47272 36668 17576 -7608 -34978 -53006 -47315 -20915 11232
391 11232 35480 47216 45113 29260 1086 -29635 -49153 -46724 -26025 1824 25719 40445
403 40445 44101 31906 3823 -29582 -49448 -46587 -28224 -4840 19203 41857 52805 40752
415 40752 9816 -22465 -41333 -43294 -34218 -15251 11492 38699 50550 38765 10432 -18516
427 -18516 -37323 -44429 -40335 -22514 8758 40412 54273 42370 16971 -7603 -27657 -43348
439 -43348 -46896 -28664 6280 36746 46819 38369 21036 -768 -26690 -48019 -50530 -29998 3737
452 3737 32730 44784 42100 31197 10675 -20948 -48531 -51699 -29527 273 22624 36633 43493
465 43493 37453 11559 -24407 -48610 -49369 -31552 -6868 16497 36196 48650 44812 17260 -20410
478 -20410 -43362 -42474 -31620 -17961 6328 36350 52096 41172 13757 -15524 -35969 -44844 -39965
491 -39965 -22246 4932 33928 51848 46403 18326 -11465 -25918 -34805 -44673 -35925 2627 40348
504 40348 46856 32206 19554 5388 -20988 -46461 -50524 -30401 787 28682 43714 41989 25762
517 25762 6534 -12840 -36933 -52858 -37659 1928 28853 32086 32792 35354 18689 -18008 -46462
530 -46462 -47267 -29186 -8402 10747 31681 46356 40539 15858 -13591 -33842 -41553 -34611 -16051
543 -16051 6658 28851 44897 41690 15614 -14254 -30855 -35239 -35160 -27871 -4412 30267 52150
556 52150 42463 13283 -7001 -15981 -29254 -43377 -35898 -3735 31155 45506 36755 18995 2136
569 2136 -15399 -33931 -44150 -35684 -9250 24062 43214 38554 22677 9601 -5784 -31252 -48275
582 -48275 -37058 -6895 18465 31022 36452 34261 17649 -11700 -36752 -42726 -32553 -15428 5626
595 5626 28926 42949 39396 19130 -8590 -31211 -38584 -31406 -18553 -2244 21358 43884 46634
608 46634 22491 -10897 -30358 -32535 -31075 -28993 -11827 21974 48322 45399 20869 -4228 -19194
621 -19194 -29193 -36334 -32976 -11207 20892 42871 42014 23932 2676 -14357 -29413 -40413 -37646
634 -37646 -13443 18822 38608 38175 28298 13955 -7287 -31419 -44320 -35134 -10500 12970 28748
647 28748 36295 34870 20287 -6786 -33104 -43570 -33646 -13684 5385 21677 35537 40271 26478
660 26478 -3815 -31766 -39643 -30425 -17033 -2816 17319 38109 43874 25679 -4099 -26500 -34509
673 -34509 -32337 -24998 -9186 16025 38962 42798 25972 800 -18496 -28992 -33649 -30932 -13357
686 -13357 15775 37785 39279 25061 7103 -10639 -27565 -38991 -35213 -14075 14006 33142
698 33142 35754 27378 14302 -3719 -25687 -40631 -36626 -14230 11535 26667 31603 31549 21988 -405
712 -405 -26904 -40441 -35032 -16839 3487 20418 31973 35683 26136 2085 -24127 -36980 -32906
725 -32906 -19067 -2718 14461 31732 39623 28177 2238 -21168 -31554 -32143 -25525 -10431 12136
738 12136 32504 39447 28242 5881 -14448 -27227 -32704 -29797 -14370 10399 31855 38210 27915
751 27915 9431 -8006 -23673 -35105 -34420 -17374 8233 28136 34784 28962 15920 -1374 -21366
764 -21366 -35809 -35709 -18401 5206 23319 31607 30701 21412 2563 -20349 -35960 -35284 -20079 41
778 41 17506 29631 33632 25679 5725 -18002 -33341 -34210 -22220 -4892 12646 28208 35597 28625
792 28625 8186 -15196 -30427 -32358 -25389 -11273 8258 27525 36778 29397 10182 -10264 -25190
805 -25190 -32081 -29146 -15597 5980 26036 35127 29980 13817 -5776 -22243 -31787 -31473 -19269
818 -19269 2481 23335 33753 29935 16626 -17 -17842 -31627 -33809 -21143 722 19796
830 19796 30429 30726 21743 4463 -15815 -31245 -33610 -22838 -3694 15362 28335 31711 24561
843 24561 8363 -12316 -29187 -33693 -24895 -7374 10654 25353 32294 27826 11639 -10052 -26597
856 -26597 -32053 -26137 -12050 6295 23798 32536 28896 14181 -5720 -23100 -31651 -28014 -15844
869 -15844 2136 20320 31650 30641 17117 -2347 -19794 -29202 -29412 -19794 -1354 18395 30845
882 30845 30991 19616 1781 -16069 -28090 -30881 -22459 -4818 14810 29022 30987 21446 5455
895 5455 -11939 -25690 -31952 -25042 -7615 12360 26293 30037 23991 9893 -8451 -24512 -31621
908 -31621 -26511 -10653 8316 23695 29234 26017 13559 -4912 -22232 -31073 -27582 -12860 5085
921 5085 19827 28229 28116 17355 -1808 -20676 -30270 -27604 -16077 344 16123 27559 30147
934 30147 19627 802 -17637 -27652 -27599 -19054 -4079 13363 26791 30807 21669 2934 -14012
947 -14012 -24790 -27577 -22239 -8463 10246 25574 30844 22804 6674 -9313 -21492 -28197 -25187
960 -25187 -11179 8704 24632 29337 23029 9857 -4495 -18970 -29525 -27988 -12849 6342 20505
973 20505 26533 24916 14618 -1286 -17769 -28747 -28165 -15413 2679 17750 25748 26031 18238 3197
987 3197 -15827 -29349 -28404 -15535 -1097 11464 23226 28943 21786 4072 -14553 -25749 -26518
1000 -26518 -18814 -6172 8580 23227 29623 23300 6883 -11649 -23751 -25821 -20387 -10922 4799
1013 4799 22833 31096 23467 7240 -8268 -18782 -24667 -24457 -14706 4373 22301 28644 22830 11457
1027 11457 -1836 -16181 -26379 -26668 -15977 2103 18703 26126 23385 14761 2621 -13663 -26904
1040 -26904 -28541 -16607 1519 15809 21853 23365 20297 7129 -12975 -27730 -27257 -16437 -2777
1053 -2777 9868 20114 25825 22728 8501 -11515 -25420 -26344 -17653 -6490 6063 19003 27340
1066 27340 25083 10197 -9649 -21947 -23977 -20007 -11157 2462 17999 27180 24850 10882 -5789
1079 -5789 -17374 -23203 -23510 -15354 896 18457 26806 22890 12695 -381 -12512 -23617 -26694
1092 -26694 -17613 -81 16423 23760 21790 14455 4517 -8869 -23132 -28542 -19158 -932 14144
1105 14144 20224 21024 18745 9545 -7909 -24031 -28334 -18470 -3161 9406 17072 22167 21774 11352
1119 11352 -6626 -22473 -26382 -18796 -6654 4653 15083 23494 24333 12719 -5363 -19018 -22905
1132 -22905 -19976 -12327 59 15333 25236 23955 12173 -2971 -14647 -21008 -21737 -16215 -2668
1145 -2668 14314 24996 23824 12858 261 -9673 -18708 -24651 -20036 -3679 13855 21928 21295 15303
1159 15303 5610 -7223 -19430 -25566 -20590 -5089 11164 20584 21084 16651 9620 -3346 -18823
1172 -18823 -27130 -20589 -5455 7334 14846 20841 21502 11967 -4061 -17835 -23998 -20282 -9348 2664
1186 2664 13357 21207 23287 14507 -2174 -17090 -22136 -18744 -12159 -2930 10900 23311 24341 13373
1200 13373 -842 -12285 -19497 -20916 -15529 -4597 9659 21902 24394 14956 1427 -9122 -16664
1213 -16664 -21257 -19593 -7314 9858 21369 21647 14709 6131 -4635 -16746 -23217 -20273 -7604
1226 -7604 7090 18169 20792 17079 9741 -1710 -15322 -24060 -20802 -8378 4910 14046 19066
1239 19066 19458 12965 -107 -14987 -22926 -19879 -10088 832 11021 18801 21537 15415 1087 -13691
1253 -13691 -20623 -19137 -12555 -2841 8555 19096 22399 16246 2273 -11039 -18149 -18943 -15313 -6743
1267 -6743 7026 19236 22721 15922 4114 -6922 -15638 -19711 -17984 -8608 5652 17792 21748
1280 21748 16842 6681 -3946 -12950 -19960 -20610 -10507 4614 16120 19224 16780 10139 -258
1293 -258 -12478 -21006 -20252 -10956 1819 12809 18577 18470 12787 2221 -10579 -20368 -20572 -11540 -556
1308 -556 9190 16245 19915 15477 3239 -10567 -18596 -19587 -13847 -3924 7249 15956 20372 16588 5320
1323 5320 -7926 -16916 -18671 -14606 -7083 4129 15658 21289 17110 6008 -5656 -13999 -18187 -17233
1337 -17233 -9491 2714 14659 20094 17452 8120 -2552 -12035 -17773 -18303 -11569 780 13173 19023
1351 19023 16846 10305 831 -9440 -17884 -19767 -12641 -624 10834 17102 17723 12922 3237 -7759
1365 -7759 -17060 -19761 -14034 -2422 8127 15716 17823 14792 5718 -6561 -16618 -19040 -13996 -5063
1379 -5063 5113 13900 18566 16275 7099 -4959 -14727 -18297 -15260 -7513 2552 11927 18568 17268
1393 17268 8786 -3311 -12782 -16932 -16300 -10022 -199 11203 18414 18004 9855 -825 -10113 -15904
1407 -15904 -17161 -11897 -1891 9613 17687 17320 11159 1307 -8032 -15350 -17803 -13502 -3494 8161
1421 8161 16420 17105 12556 4209 -5251 -14353 -18361 -14802 -4894 6223 14066 16473 14210 6889 -3640
1436 -3640 -13942 -18540 -15165 -6456 3932 12124 16457 15207 8997 -1805 -12650 -17710 -15387 -8021
1450 -8021 1303 10407 16494 16491 10136 -621 -11166 -16640 -15799 -9874 -1139 8524 15941 17349 11723
1465 11723 1323 -9151 -14859 -15482 -12085 -3685 6981 15463 17133 12160 2855 -6622 -13418 -16054
1479 -16054 -13826 -5735 5684 14235 16788 13254 4879 -4135 -11868 -15675 -14660 -7333 4427 12936
1493 12936 15341 13257 6869 -1463 -10868 -16999 -15797 -7668 2754 10535 14728 14765 9602 204 -9662
1508 -9662 -16152 -15592 -8661 800 8570 13457 15166 11410 1574 -9353 -15500 -15189 -9828 -2442 6098
1523 6098 13484 16451 12325 2639 -6805 -12876 -15142 -11532 -4417 4369 12786 16426 13092 3932 -5533
1538 -5533 -11634 -14490 -13146 -6803 3156 11904 15868 12843 5986 -2402 -9821 -14800 -14624 -8176 1748
1553 1748 10921 15098 13108 7461 122 -8178 -14653 -15821 -9246 515 9086 13534 13780 9777 2251
1568 2251 -6895 -14154 -15494 -9876 -1008 7062 12152 14130 11451 3968 -5962 -13899 -15081 -10650 -2954
1583 -2954 4270 10809 14978 12768 5100 -4973 -12103 -14028 -11518 -5306 2392 10350 15133 13537 5818
1598 5818 -3448 -10189 -13503 -12507 -7640 347 10056 15297 13649 6630 -1391 -8314 -12664 -13784 -9160
1613 -9160 -461 8874 14137 13592 7927 591 -6833 -12703 -14348 -10580 -1660 7621 12507 12799 9541
1628 9541 3570 -4800 -12657 -14984 -10410 -2378 5263 11367 13583 11102 4655 -3871 -11744 -15010 -11315
1643 -11315 -3907 3252 9339 13260 12278 6615 -2993 -11006 -13550 -10524 -5862 566 8611 13647 13145
1658 13145 7189 -1633 -9341 -12908 -11843 -7739 -941 7405 13442 13155 8225 -28 -7162 -11134 -12147
1673 -12147 -9246 -2389 6983 12906 12933 8430 1962 -5042 -10759 -13294 -10922 -3438 5388 11193 12282
1688 12282 10055 3789 -3274 -9898 -13071 -11077 -4219 4153 9629 11566 10709 6223 -1538 -10033 -13643
1703 -13643 -11335 -5537 1510 7636 11861 11714 7205 -970 -7992 -12518 -11542 -6132 403 6078 11185
1718 11185 12916 8721 192 -7648 -11025 -11217 -8397 -2340 5184 11434 12574 8476 1733 -4932 -10341
1733 -10341 -11333 -8791 -3440 3897 10645 13204 9495 2595 -3482 -8875 -12129 -11299 -4647 3288 9510
1748 9510 11655 10262 5040 -1938 -8294 -11949 -11134 -6072 2120 9101 11578 10109 6435 279 -7223
1763 -7223 -12656 -11696 -6196 887 6470 10535 11378 7644 1045 -6172 -11322 -11450 -7057 -699 5376 9612
1779 9612 11860 9171 2345 -6038 -10877 -11157 -8242 -2979 3576 9618 12163 9352 2790 -4154 -9077
1794 -9077 -10684 -9137 -4001 2674 9084 11674 9916 3752 -2723 -7806 -10625 -10084 -5639 1387 8368
1809 8368 11275 9545 5040 -640 -6729 -10747 -11029 -6365 957 7034 10550 10051 6454 798 -5527
1824 -5527 -10532 -11448 -7402 -607 5707 9165 10029 7702 2687 -4563 -9802 -10836 -7468 -1543 4041
1839 4041 8390 10541 9228 3339 -3709 -9269 -10600 -8542 -3301 2326 7413 10660 9642 4432 -2556
1854 -2556 -8073 -9997 -8852 -4924 1108 6920 10789 9818 4969 -1475 -6469 -9638 -9662 -6139 -470 6573
1870 6573 10021 9814 5850 349 -5173 -9040 -10127 -6891 -1161 5374 9804 9722 6667 1836 -3745 -8952
1886 -8952 -11003 -7791 -1624 4589 7908 9370 7979 3597 -3135 -8580 -10315 -8155 -2898 2884 7618
1901 7618 9593 9039 4482 -1635 -7771 -10438 -8681 -3929 1449 6305 9461 9302 5307 -1054 -6671
1916 -6671 -9515 -8953 -4977 -62 5427 9813 9617 5905 -97 -5594 -8703 -9232 -6863 -1278 4875 8999
1932 8999 9712 6246 766 -4198 -8411 -9291 -7512 -2279 4020 8823 9633 6720 2221 -2654 -7284 -9751
1948 -9751 -8462 -2978 3170 7370 9087 7456 3601 -1648 -6917 -10153 -8525 -3595 2350 6363 9048
1963 9048 8232 4825 -476 -6067 -9660 -8637 -4298 403 4976 8293 8742 5836 394 -5617 -8883
1978 -8883 -8536 -5189 -783 4310 7840 9705 6521 1046 -4344 -7785 -8340 -6441 -2243 3313 7914
1993 7914 9242 6667 1767 -3246 -7295 -8532 -6969 -3113 2457 7646 9132 7124 2869 -1609 -6163
2008 -6163 -8771 -8132 -4053 1825 6884 8252 7240 4251 -157 -5595 -8609 -8327 -4108 938 5311
2023 5311 7686 8188 5566 632 -4773 -8309 -8525 -5489 -320 4134 7129 8005 6191 1244 -4255 -8049
2039 -8049 -8398 -5613 -1626 2909 6973 8921 7062 2213 -3150 -7024 -8172 -6682 -2741 1842 6303
2054 6303 8538 7155 2634 -2356 -6207 -7762 -7224 -3883 1121 5959 8729 7412 3739 -1105 -5040
2069 -5040 -7741 -7609 -4871 372 5220 8015 7610 4344 290 -4281 -7459 -8161 -5573 -417 4572 7315
2085 7315 7494 5736 1376 -3688 -7214 -8343 -5460 -1427 3361 6703 7870 6172 2490 -2953 -6929
2100 -6929 -8070 -5986 -2372 2400 5875 7714 7182 3116 -2129 -6221 -7464 -6493 -3633 1158 5542
2115 5542 8027 7306 3179 -1159 -5095 -7113 -6971 -4387 329 4688 7890 7355 4596 -293 -4172 -6824
2131 -6824 -7399 -5197 -519 4294 6919 7061 4747 977 -3082 -6682 -8031 -5978 -1605 3062 6427
2146 6427 7241 5612 1959 -2229 -6100 -7908 -6257 -2094 2209 5379 7197 6404 3086 -1784 -5803
2161 -5803 -7394 -6171 -2699 1345 4767 7097 7133 3697 -1019 -5046 -7321 -6545 -3793 49 4254 6693
2177 6693 7032 4292 37 -4300 -6715 -6613 -4597 -722 3722 6984 7420 4714 701 -3267 -6109 -6826
2193 -6826 -5510 -1316 2808 6326 7176 5147 1947 -2477 -5718 -7208 -6071 -2487 1926 5904 6911
2208 6911 5628 2767 -1396 -5234 -6927 -6120 -2733 1312 5099 6560 6295 3514 -627 -4690 -6978
2223 -6978 -6719 -3524 484 4276 6160 6336 3888 125 -3836 -6428 -6625 -4292 -477 3446 5993 6694
2239 6694 4836 899 -3328 -5979 -6523 -4579 -1315 2514 5612 7068 5306 1651 -2507 -5517 -6601
2254 -6601 -5495 -2158 1741 5302 6703 5515 2319 -1369 -4765 -6441 -5965 -3285 1209 4933 6596
2269 6596 5738 2898 -698 -4248 -6296 -6167 -3583 355 4262 6168 5872 3757 91 -3574 -6025 -6486
2285 -6486 -3989 -365 3598 5726 6204 4389 918 -2785 -5959 -6398 -4519 -966 2544 5333 6382
2300 6382 5293 1617 -1956 -5515 -6285 -4933 -1812 1842 4787 6175 5691 2458 -1493 -4714 -6087
2315 -6087 -5419 -2966 573 4394 6401 5756 2661 -1086 -4057 -5694 -6039 -3856 525 3994 6116 5700
2331 5700 3038 -48 -3545 -5512 -5859 -4284 -797 3425 6129 5837 3953 569 -2437 -5172 -6302
2346 -6302 -4594 -1049 2698 5133 5733 4652 1735 -2099 -5180 -6203 -4529 -1934 1775 4657 5819
2361 5819 4941 2532 -1325 -4660 -5756 -4875 -2178 856 3933 5574 5515 2981 -578 -3973 -5672 -4913
2377 -4913 -3094 -187 3420 5938 5673 3275 -57 -3207 -5112 -5023 -3889 -731 3013 5305 5635 3643
2393 3643 503 -2726 -4736 -5489 -4482 -1438 2167 5130 5521 4106 1037 -1602 -4457 -5640 -4763 -1994
2409 -1994 1836 4630 5425 4624 2271 -1182 -4180 -5458 -4738 -2446 1021 3859 5373 4548 2835 -590
2425 -590 -3865 -5628 -5156 -2872 375 2917 5082 5472 3497 -154 -3570 -5341 -5146 -3582 -722 2583
2441 2583 4999 5749 3979 510 -2361 -4802 -4971 -3690 -1382 1741 4687 5685 4077 1085 -1892 -4713
2457 -4713 -5383 -4302 -1899 1356 4157 5655 4411 1991 -932 -3684 -5078 -4838 -2644 1065 4170
2472 4170 5306 4557 2888 -383 -3413 -5250 -5287 -2858 360 3353 4829 4693 3214 303 -3058 -5158
2488 -5158 -5224 -2962 -145 2636 4648 5285 3729 755 -2441 -4795 -4963 -3634 -965 1760 4202 5045
2504 5045 4201 1328 -1910 -4287 -4808 -3958 -1581 1535 4019 5244 4621 1616 -1345 -3659 -4729 -4650
2520 -4650 -2568 698 3703 5028 4360 2157 -698 -3027 -4839 -4829 -3248 654 3361 4800 4337 2863
2536 2863 330 -2821 -4524 -4885 -3482 -266 2464 4272 4420 3183 974 -2282 -4315 -4842 -3417 -637
2552 -637 1826 4127 4739 3921 1334 -1907 -4111 -4994 -3571 -1215 1320 3394 4471 4201 1942 -1222
2568 -1222 -3713 -4539 -4145 -1879 453 3228 5170 4535 2178 -952 -3113 -4273 -4383 -2687 -122 2631
2584 2631 4441 4629 2408 -53 -2620 -4350 -4573 -3139 -336 2564 4293 4712 3119 922 -2039 -4134
2600 -4134 -4794 -3608 -970 1937 3825 4585 3284 1589 -1506 -3838 -4552 -3618 -1377 1276 3801 4574
2616 4574 3829 2120 -932 -3678 -4435 -3716 -2094 585 2902 4430 4074 2270 -404 -3186 -4383 -3874
2632 -3874 -2600 98 2807 4400 4532 2711 -246 -2638 -3974 -4106 -3053 -813 2395 4237 4327 2705
2648 2705 843 -2078 -3884 -4191 -3392 -914 2069 4034 4241 3443 863 -1488 -3783 -4447 -3564 -1483
2664 -1483 1455 3328 4256 3581 1738 -770 -3469 -4336 -3933 -1646 765 3114 4307 3935 2065 -345
2680 -345 -2868 -4127 -4000 -2067 580 2489 4042 4023 2660 -57 -2568 -4207 -4014 -2545 81 2518
2696 2518 3711 4263 3092 869 -1967 -3927 -3924 -2887 -1072 1667 3531 4329 3304 879 -1598 -3281
2712 -3281 -3984 -3585 -1389 1360 3221 4071 3301 1445 -649 -2864 -3954 -3663 -2058 573 3218 4023
2728 4023 3402 2036 -316 -2561 -3875 -3841 -2421 110 2263 3833 3767 2557 199 -2136 -3788 -3910
2744 -3910 -2816 -441 1739 3306 3963 2512 285 -1660 -3503 -3925 -2753 -1002 1763 3270 3930 2995
2760 2995 1043 -1456 -3448 -4138 -3275 -1441 1052 3137 4092 3347 1337 -1021 -3118 -3760 -3385 -1555
2776 -1555 740 2790 3930 3800 2064 -432 -2737 -3635 -3581 -2049 109 2372 3631 3608 2246 -200
2792 -200 -2306 -3450 -3619 -2578 -223 2046 3616 3980 2183 309 -1659 -3501 -3902 -2694 -493 1401
2808 1401 3209 3476 2895 956 -1571 -3308 -3825 -3083 -1231 1047 2812 3740 2841 1561 -1069 -2957
2824 -2957 -3737 -3243 -1512 595 2439 3541 3265 1977 -371 -2786 -3529 -3414 -1669 121 2043 3619
2840 3619 3843 2093 -184 -2290 -3306 -3836 -2298 -337 2154 3197 3555 2420 393 -1932 -3056 -3310
2856 -3310 -2262 -792 1300 3371 3650 2656 863 -980 -2882 -3770 -2994 -680 1183 2455 3346 3013
2872 3013 1530 -844 -2905 -3420 -3126 -1550 896 2539 3312 2849 1851 -290 -2546 -3626 -3319 -1533
2888 -1533 -63 2042 3109 3260 2349 63 -2115 -3230 -3384 -1959 13 1652 2889 3468 2537 467
2904 467 -2034 -2967 -3465 -2560 -832 1296 2871 3420 2742 994 -1295 -3084 -3524 -2731 -970 1140 3218
2921 3218 3436 2782 1422 -994 -2262 -3463 -3430 -1449 718 2378 3235 2887 1428 -345 -2278 -3479
2937 -3479 -3352 -1819 319 2326 3152 2990 2149 22 -1902 -3316 -3358 -2103 79 1976 2970 3292 2455
2954 2455 400 -1744 -2860 -3264 -2374 -400 973 2981 3637 2669 832 -1061 -2752 -3320 -2601 -1079
2970 -1079 1215 2473 3135 2790 1145 -912 -2384 -3231 -2827 -1476 738 2549 3457 2711 1340 -443
2986 -443 -2026 -2916 -2845 -1635 216 2118 3094 2835 1802 6 -1767 -3053 -3154 -2144 31 1707 2886
3003 2886 3256 2126 757 -1288 -2836 -3215 -2124 -724 1363 2510 3093 2504 930 -1337 -2821 -3280
3019 -3280 -2053 -985 525 2383 3115 2400 1121 -1007 -2344 -2954 -2406 -1283 322 2015 3115 2858
3035 2858 1361 -426 -2084 -2679 -2712 -1864 137 1979 2590 2709 1637 10 -1841 -2499 -2616 -2018 -168
3052 -168 1693 3020 2950 2007 415 -1193 -2667 -2980 -2270 -731 1550 2505 2961 2234 971 -768 -2620
3069 -2620 -3047 -2093 -808 1022 2162 2954 2699 1005 -749 -2397 -3198 -2413 -963 623 1958 2754 2916
3086 2916 1654 -332 -1857 -2716 -2830 -1513 190 1717 2819 2881 1900 -384 -1892 -2789 -2637 -1809 -440
3103 -440 1263 2689 2629 1888 29 -1281 -2515 -2894 -2007 -456 1202 2630 2783 2062 457 -1118 -2226
3120 -2226 -3117 -2321 -735 809 2157 2681 2159 704 -733 -1942 -2711 -2353 -1074 917 1637 2547 2483
3137 2483 1522 -243 -2054 -2857 -2629 -1481 189 1763 2772 2465 1714 34 -1671 -2699 -2471 -1517 -108
3154 -108 1328 2632 2520 1723 -56 -1429 -2586 -2901 -1944 -396 1320 2590 2675 2184 524 -856 -2048
3171 -2048 -2509 -2068 -756 984 2254 2640 2011 960 -523 -2209 -2512 -2553 -1235 706 1901 2427 2131
3188 2131 1131 -315 -1687 -2462 -2408 -1297 437 1659 2629 2364 1723 102 -1547 -2419 -2366 -1435 -111
3205 -111 1452 2726 2540 1644 345 -1134 -2200 -2457 -1619 -425 1284 2455 2487 1732 503 -973 -2080
3222 -2080 -2533 -2023 -498 1022 2156 2391 2041 778 -731 -1860 -2642 -2141 -1064 483 2025 2792 2154
3239 2154 1084 -191 -1722 -2232 -2355 -1276 396 1795 2275 2124 1622 -220 -1689 -2399 -2242 -1484 -111
3256 -111 1126 2451 2562 1502 192 -1515 -2603 -2458 -1688 -264 872 2069 2202 1644 615 -1225
3272 -1225 -2058 -2426 -1837 -583 654 1934 2708 1985 919 -663 -1955 -2444 -1956 -948 620 1894 2240
3289 2240 1982 1150 -335 -1963 -2503 -2368 -1230 185 1673 2338 2176 1291 -404 -1513 -2232 -2169 -1538 -39
3307 -39 1326 2185 2509 1634 225 -1199 -2054 -2500 -1418 -93 1299 2311 2141 1676 500 -1059 -1836
3324 -1836 -2249 -1840 -773 714 2048 2227 1763 457 -525 -1779 -2072 -1808 -954 736 1714 2292 1891 924
3342 924 -468 -1409 -2148 -2035 -1183 311 1693 2213 1925 1290 -295 -1331 -2150 -2059 -1233 87 1165 2207
3360 2207 2154 1474 230 -1206 -2303 -2215 -1218 -371 926 2067 1934 1771 370 -1039 -1967 -2242 -1595 -631
3378 -631 876 1844 2146 1866 473 -831 -1549 -2193 -1924 -928 545 2193 1959 1894 745 -228 -1277 -2161
3396 -2161 -2006 -1131 311 1415 1918 1709 1063 -77 -1238 -2060 -2220 -1497 54 1468 2013 2282 1427 140
3414 140 -1112 -1977 -1872 -1403 -336 954 1831 1986 1438 375 -772 -1868 -2187 -1488 -454 725 1706
3431 1706 2243 1697 744 -828 -1630 -2054 -1578 -959 397 1708 2247 1601 961 -510 -1617 -2113 -1907 -1089
3449 -1089 400 1459 2035 1998 1015 -103 -1455 -2019 -1790 -1206 118 1323 1905 1897 1231 175 -1202 -1797
3467 -1797 -1891 -1426 -118 1097 2086 2291 1196 118 -992 -1906 -1953 -1545 -331 906 1679 2023 1707 422
3485 422 -790 -1698 -1993 -1605 -570 495 1596 2007 1671 962 -375 -1280 -1732 -1703 -991 387 1445 1973
3503 1973 1710 1088 -121 -1337 -1847 -1817 -1120 43 1280 1943 1756 962 138 -1068 -1760 -2021 -1264 -55
3521 -55 1142 1369 1959 1264 319 -849 -1918 -1719 -1197 -451 708 1605 1805 1675 724 -680 -1846 -1881 -1611
3540 -1611 -661 652 1398 2083 1807 829 -237 -1208 -1902 -1559 -725 143 1345 1744 1963 973 -292 -1426
3558 -1426 -1762 -1598 -956 -24 1250 1962 1714 1096 -79 -747 -1608 -1734 -827 -267 1094 1816 1792 1137 216
3577 216 -813 -1715 -1708 -1515 -308 697 1575 1740 979 360 -698 -1648 -1946 -1568 -684 629 1543 1751 1463
3596 1463 743 -459 -1607 -1774 -1271 -880 136 1133 1764 1350 863 -109 -1311 -1482 -1655 -1055 175 1125
3614 1125 1583 1831 1031 81 -1254 -1691 -1552 -1065 -304 1152 1452 1461 1115 41 -1141 -1369 -1565 -1325 -201
3633 -201 635 1571 1848 1222 383 -616 -1445 -1863 -1229 -452 773 1367 1700 1498 838 -415 -1290 -1753 -1322
3652 -1322 -643 271 1113 1701 1530 790 35 -1476 -1647 -1490 -784 297 1103 1678 1516 921 278 -879 -1554
3671 -1554 -1561 -997 -91 856 1670 1862 1046 33 -912 -1613 -1441 -1233 -549 733 1456 1617 1181 519 -585
3690 -585 -1251 -1670 -1328 -465 381 1406 1693 1368 563 -287 -1325 -1741 -1376 -719 507 1164 1733 1215 678
3709 678 -402 -1238 -1658 -1577 -685 131 883 1701 1415 793 95 -1014 -1451 -1432 -586 -295 796 1508 1826 1050
3729 1050 75 -637 -1459 -1644 -1130 -423 664 1175 1599 1061 -35 -760 -1120 -1419 -1324 -487 502 1278 1625
3748 1625 1240 369 -319 -1032 -1511 -1275 -231 278 1177 1697 1246 880 -139 -1256 -1303 -1514 -610 125 810
3767 810 1607 1421 679 -266 -1109 -1428 -1647 -897 -44 947 1497 1412 1198 139 -586 -1270 -1468 -966 -179 651
3787 651 1390 1466 1038 213 -874 -1379 -1303 -1142 -298 702 1216 1516 972 474 -453 -877 -1241 -1141 -670 541
3807 541 1184 1199 1138 798 -348 -914 -1637 -1455 -693 144 1037 1466 1384 746 -345 -984 -1402 -1165 -697 134
3827 134 923 1386 1404 1072 169 -714 -1666 -1324 -898 79 603 1055 1465 986 101 -459 -1374 -1539 -1210 -423
3847 -423 614 1034 1416 990 467 -556 -1085 -1603 -967 -369 154 1443 1603 1232 685 -92 -837 -1545 -1408
3866 -1408 -789 157 919 1343 1319 705 -589 -1010 -1209 -1276 -941 -108 934 1190 1114 1068 -250 -741 -1056 -1420
3886 -1420 -873 -66 667 1099 1273 1029 372 -530 -1138 -1223 -958 -191 458 1217 1075 1160 790 -491 -927 -1308
3906 -1308 -1251 -540 460 1336 1426 1283 214 -133 -902 -1392 -1190 -607 170 589 1251 1127 641 -229 -832 -1368
3926 -1368 -1101 -846 316 944 1027 1177 800 -97 -675 -1153 -1286 -862 -210 866 1009 1430 804 118 -820
3945 -820 -827 -1310 -1191 -635 447 1054 1000 977 307 -203 -1163 -1495 -1045 -387 451 940 1366 1179 393 -485 -974
3966 -974 -983 -1073 -567 -1 544 905 1217 653 -146 -805 -1355 -953 -704 256 555 1206 1237 532 44 -955 -1396
3987 -1396 -1161 -622 -313 697 1155 1348 827 96 -555 -996 -1160 -1117 -168 400 980 1093 1135 431 -439 -825
4007 -825 -969 -1142 -301 273 1146 1032 739 480 -495 -1014 -1357 -1034 -604 146 745 924 1276 650 -51 -572
4027 -572 -1220 -1023 -773 114 455 1002 992 675 76 -725 -1000 -1093 -845 -121 473 830 1276 760 95 -650 -998
4048 -998 -1065 -855 -182 695 944 1030 723 524 -635 -762 -1101 -1232 -177 428 1006 1018 824 407 -319 -1110
4068 -1110 -1114 -1133 -333 350 847 873 928 469 168 -719 -1073 -776 -411 36 638 1109 1059 590 -191 -747 -1193 -1032
4090 -1032 -980 100 601 817 1027 730 111 -218 -1182 -1031 -512 -120 193 804 1186 570 311 -359 -878 -928
4110 -928 -773 -307 302 922 1000 722 283 -81 -831 -1116 -973 -295 123 649 880 893 491 -112 -712 -843 -1183
4131 -1183 -500 -62 508 891 1096 753 5 -683 -1142 -1145 -419 132 616 1057 1002 478 56 -508 -997 -888 -803
4152 -803 -86 429 941 1196 795 56 -282 -997 -980 -854 -261 191 914 1017 943 437 -300 -715 -1159 -922 -473
4173 -473 15 524 1098 895 285 -361 -667 -967 -808 -320 118 750 1205 967 600 -13 -835 -881 -850 -748 -6
4194 -6 600 1188 912 874 138 -391 -786 -1051 -600 -221 558 978 861 581 161 -141 -725 -870 -652 -299 316
4215 316 854 992 506 285 -458 -726 -1219 -871 -400 300 880 1050 605 235 -165 -571 -951 -833 -142 -120
4235 -120 536 889 567 407 166 -662 -540 -765 -503 309 638 889 1005 753 12 -553 -917 -968 -690 -48
4255 -48 434 647 780 608 304 -526 -794 -1200 -648 -384 293 696 808 809 336 -408 -662 -855 -932 -594 164
4276 164 568 623 630 268 -54 -656 -869 -895 -459 112 642 1030 616 245 -45 -565 -905 -957 -599 14 529 651
4298 651 578 562 -86 -532 -782 -915 -639 14 725 805 817 640 390 -361 -835 -731 -528 -172 271 879 906 684
4320 684 122 -179 -450 -907 -820 -172 199 633 719 669 616 -156 -674 -913 -593 -356 -148 650 634 743 212 -101
4342 -101 -411 -914 -922 -657 -119 390 838 831 411 94 -327 -764 -760 -395 -76 468 894 696 618 -36 -202 -552
4364 -552 -927 -355 -129 385 798 834 696 179 -195 -680 -585 -648 -457 163 763 688 577 168 -92 -309 -888
4385 -888 -980 -499 97 452 1259 639 350 -55 -510 -844 -789 -604 -267 529 741 532 433 112 -327 -1064 -796
4406 -796 -242 97 460 891 848 590 -292 -72 -664 -814 -568 -95 324 941 622 553 181 -370 -997 -873 -404
4427 -404 -58 458 507 739 683 242 -175 -748 -685 -455 -340 67 556 652 476 316 -320 -354 -727 -554 -116 66
4449 66 685 791 693 574 63 -313 -926 -733 -442 12 279 849 384 523 140 -403 -766 -522 -304 102 388
4470 388 555 574 548 235 -240 -428 -528 -316 119 301 199 753 494 118 -185 -609 -548 -477 -40 61 399
4491 399 671 609 327 31 -528 -783 -653 -466 56 433 727 839 329 -66 -260 -655 -611 -180 -54 575 591
4512 591 707 554 -281 -283 -762 -768 -386 -197 256 950 534 537 228 -449 -827 -807 -446 -239 471 678 660 557 297
4535 297 -502 -418 -584 -567 -219 359 635 658 400 236 -119 -644 -680 -685 -186 141 500 816 588 193 -81 -580
4557 -580 -546 -544 -440 -264 470 586 457 538 -84 -285 -813 -802 -207 -127 146 787 642 316 102 -399 -485 -568 -440
4580 -440 147 249 583 832 417 392 -120 -467 -674 -509 -87 123 686 494 595 383 -222 -521 -515 -504 -99
4601 -99 -74 581 576 700 198 73 -434 -678 -260 -145 226 526 428 459 474 50 -633 -626 -226 -224 87 454 492 649
4625 649 229 -221 -149 -572 -589 -402 -43 135 348 667 396 189 -386 -588 -825 -902 -203 225 572 370 293
4646 293 345 -264 -617 -734 -471 -305 19 490 735 466 167 -66 -581 -554 -371 -426 -209 385 481 387 282 -15
4668 -15 -267 -509 -397 -395 -163 185 559 633 264 -226 -389 -340 -334 -268 -231 233 379 588 201 231 -216 -490 -625
4691 -625 -259 -213 295 477 419 505 141 -136 -173 -658 -661 -404 114 386 430 387 99 -91 -337 -462 -466 -247 208
4714 208 286 725 599 411 177 -434 -469 -571 -67 152 447 384 282 318 -43 -187 -512 -446 -399 -252 229 436
4736 436 314 16 -82 -351 -291 -492 -204 -281 165 245 701 292 201 -264 -550 -249 -534 -226 201 586 677 397
4758 397 105 -183 -561 -495 -698 -362 52 284 615 257 234 -403 -339 -790 -297 -139 221 211 482 424 5 -79
4780 -79 -445 -769 -640 -319 -260 316 487 519 159 8 -247 -541 -640 -391 -324 245 433 932 250 126 -90 -338
4802 -338 -454 -238 91 -66 744 226 318 380 -239 -5 -683 -414 -182 47 214 683 144 454 1 -277 -229
4823 -229 -305 -353 -81 311 195 133 331 72 -268 -289 -47 -211 -63 227 524 482 266 261 -142 -209 -509 -154 -212
4846 -212 177 431 690 290 102 -200 -231 -332 -478 -176 255 402 119 231 -170 148 -474 -559 -174 -112 83
4867 83 168 404 264 79 -99 -459 -497 -584 -168 333 422 487 372 208 -170 -77 -448 -471 -398 193 306 434 475
4890 475 252 8 -234 -337 -459 -303 81 161 392 463 524 106 -420 -459 -333 -186 180 335 459 138 271
4911 271 219 32 -447 -242 -22 10 72 235 356 116 134 -87 -386 -387 -342 -131 493 297 400 346 337 -172 -467
4934 -467 -608 -420 -528 287 397 403 238 24 67 -467 -347 -204 -457 131 196 477 457 168 -275 -115 -379 -498
4956 -498 -250 287 464 325 151 -108 162 -205 118 -126 -439 -116 61 408 347 164 164 -142 -193 -600 -392
4977 -392 -285 58 155 440 458 393 -40 -399 -342 -475 -258 -105 207 528 583 106 61 -190 -685 -319 -420 231
4999 231 343 493 348 239 -25 -313 -588 -301 -377 -120 164 197 414 158 195 -456 -195 -288 -118 53 -21 560
5021 560 372 448 20 -354 -441 -488 -128 137 370 556 377 286 -38 -255 -207 -402 41 -268 147 236 441 418
5043 418 -6 44 -265 -402 -297 -289 -66 420 561 424 204 -180 -575 -274 -442 -315 252 268 120 429 122
5064 122 -103 -104 -346 -274 -171 -147 365 550 245 384 68 -7 -413 -354 -212 -230 107 318 409 281 31 52 -87
5087 -87 -282 -404 -114 162 228 402 314 81 -64 -227 -346 -425 -182 119 283 601 535 52 -74 -97 -373 -41
5109 -41 -267 -9 157 124 505 309 -115 -427 -304 -556 -246 -153 227 385 501 154 -12 -300 -32 -290 -442
5130 -442 -76 197 389 334 183 -10 -208 -318 -448 -149 -327 64 207 226 193 16 -341 -249 -6 -275 -146
5151 -146 300 308 446 209 55 52 -156 -479 -328 -126 47 167 318 437 168 160 -26 -158 -566 -214 348 203
5173 203 440 239 369 209 -117 88 -248 88 -204 150 503 452 371 268 -79 -360 -283 -42 288 242 289 301
5195 301 4 -42 -124 -144 -331 -235 -209 199 313 553 373 125 -118 -214 -305 -346 -2 75 211 643 372 163 118
5218 118 -70 -280 -309 -333 243 474 330 121 212 -411 -89 -77 -443 34 11 -113 22 165 207 -198 -159 -389
5240 -389 -201 -434 -179 225 133 418 291 233 -505 -290 -393 -294 126 51 90 363 191 291 -243 -134 -425 -299
5262 -299 -91 -99 137 172 185 41 -124 -80 -75 -246 -122 -58 502 144 418 -52 -206 -45 -79 -272 -216 77 66 343
5286 343 267 174 -132 -132 -5 -74 -83 -9 279 272 142 291 -273 -90 -226 -226 -387 -211 -2 191 115 -76 -36 -59 -238
5311 -238 -21 -37 85 128 83 166 161 -81 -76 -259 -390 -131 -222 100 73 203 223 48 -101 -5 -189 -210 -53 60
5335 60 190 131 173 -95 -32 -227 -380 -262 -115 293 202 119 425 260 -93 -89 -110 -322 -258 -190 324 310 34 57
5359 57 -225 -146 -55 -21 -187 3 110 127 319 220 -39 -155 -448 -192 -248 -105 43 64 -74 546 1 -156 -89
5382 -89 9 3 -85 249 -128 219 230 11 -98 7 -223 -464 -176 -32 19 242 99 45 255 -41 -170 -155 -209
5405 -209 223 204 241 270 124 135 -133 -338 -105 -177 -256 340 376 308 226 -75 -191 -260 -358 -232 -80 139 467 298
5429 298 121 -46 -84 -274 -440 -474 -304 62 253 0 182 287 85 -185 -321 -166 -250 215 242 180 131 230
5451 230 254 -66 -461 -268 -207 129 144 657 323 -159 -100 -137 -18 -189 63 -316 112 -128 63 142 52 -306
5473 -306 -440 -87 -176 -165 44 162 2 226 -3 -78 -198 -337 -218 138 -11 218 97 173 -148 -242 -104 -172
5495 -172 -142 -217 208 94 -172 128 105 67 -347 -164 -116 -95 166 205 350 232 -48 -157 -267 -498 4 -442
5517 -442 120 101 217 -7 210 260 -164 -469 -252 -324 -140 32 320 65 244 126 -172 -309 -265 -69 -141 -13
5539 -13 321 224 157 73 123 -228 -138 -250 -10 -1 206 375 77 224 -92 -175 -256 -122 -180 -169 278 -22 221 89
5563 89 -99 -20 -490 -148 -102 67 345 355 -2 -100 144 -214 -187 -243 -12 -128 119 372 297 46 3 -227 -265
5586 -265 -416 -10 69 173 106 389 160 57 -251 -273 -212 -138 -6 124 109 325 276 37 28 62 -309 -291 -171 -284
5610 -284 124 364 309 91 -2 -276 -136 -147 -309 -43 144 237 187 427 -159 -165 -210 -460 -78 -116 233 -21 180
5633 180 -16 -392 -149 -228 -280 45 133 -92 425 552 101 9 -169 102 -176 -540 76 200 53 528 139
5654 139 -425 -182 -59 -200 -222 1 -112 185 335 54 257 -16 -145 20 -41 75 50 59 497 374 343 78
5676 78 -291 -217 -181 -18 156 365 152 110 160 -446 17 -240 -122 112 76 -9 137 291 191 139 103 -296 -451
5699 -451 -138 -162 -166 113 363 128 131 -250 -110 17 -198 -327 134 430 322 330 101 145 -243 -403 -390 -229 68
5722 68 219 251 243 88 97 5 -450 -195 -264 1 161 465 190 130 55 -293 -83 -97 -84 -199 256 178 15 78 -128
5747 -128 -137 -323 -261 -112 38 144 129 135 233 89 -221 -437 -379 -466 -197 84 467 322 132 108 -61 -180 -345
5770 -345 -406 213 215 458 379 235 47 -206 -54 -77 -157 -303 14 172 -1 412 214 -58 -320 -28 -193 42
5792 42 -108 141 491 54 392 -87 -230 -80 -454 -359 -68 87 -33 202 155 -237 -309 -323 -245 -48 -82 23
5814 23 366 29 121 116 -35 -44 -25 -206 -79 358 309 259 173 120 -141 -352 -196 -158 130 81 337 449 35 190
5838 190 -107 -255 -278 -176 -228 121 160 230 15 109 103 -72 -180 -51 -122 -14 104 256 297 125 328 -19 -140
5861 -140 -53 -306 -145 201 -75 179 550 115 -10 -61 -59 -389 -113 133 230 404 272 170 114 -88 -343 -118
5883 -118 45 -141 390 50 261 18 163 -208 -15 -347 75 184 53 265 314 276 113 -476 -301 -97 -250
5904 -250 -87 258 449 178 237 -30 238 -293 -245 -153 -187 145 115 141 263 143 -132 -213 -247 83 55 110 224
5927 224 -112 162 12 -142 -288 -259 -119 141 -43 329 385 103 85 -43 -274 -476 -390 -129 267 119 298
5948 298 259 51 -82 -18 -132 -301 -52 -69 -115 102 -53 -118 -219 27 -272 -157 -221 -25 63 261 98 222
5970 222 119 -225 -106 -237 18 -179 -38 278 217 285 30 168 -184 65 -208 -271 91 114 56 420 128 -121
5992 -121 -158 -349 -177 -158 23 231 8 169 -126 171 -311 -119 -233 -233 123 402 537 231 246 -13 169 -266
6014 -266 -209 -183 -175 265 195 44 114 -75 -298 -415 -212 -105 -10 0 254 374 332 301 8 -243 -127 -166 38 301
6038 301 -15 562 66 183 -88 -165 -238 -392 -251 -12 86 259 322 223 35 -310 48 -419 -202 -260 390 272
6060 272 402 95 22 -37 -190 -125 -253 62 -17 250 -98 -177 -99 -30 -234 -294 -168 -94 310 383 538 192 143 -32
6084 -32 -454 -77 0 2 -47 518 212 185 47 -167 -374 -268 -287 -307 -79 148 255 155 185 -272 -229 -322 -365 -169
6108 -169 15 155 189 385 174 -164 -458 -39 -153 -146 48 270 267 193 206 73 -20 -194 -306 -226 -101 -14 251
6131 251 464 292 99 -189 -273 -93 -203 -79 180 34 172 235 154 -37 -155 -267 -7 -222 -136 420 167
6152 167 453 88 -270 -440 -322 -146 -46 -53 222 183 186 -26 92 -39 -369 -387 -127 -36 336 268 258 144 -43
6175 -43 -166 -535 -238 -171 -154 224 99 123 -44 88 -235 -164 -216 -263 -40 -26 281 460 313 56 -132 -187 -313
6198 -313 -165 139 166 289 517 255 -119 -257 -362 -459 -280 -67 -285 490 213 407 263 29 -121 -293 -317
6219 -317 -232 -110 273 414 258 154 96 -1 -79 -226 -391 -55 141 355 131 393 146 -45 -453 -293 -207 43
6241 43 177 131 437 257 -153 40 -262 -395 -118 21 34 302 348 25 -89 187 -346 -367 53 39 4 454
6263 454 321 68 416 17 -155 -279 -211 -474 39 269 285 398 266 373 -251 -382 -581 -125 13 346 368
6284 368 154 293 -88 -110 -380 -395 -421 -150 103 339 371 332 53 198 -201 -11 -148 -89 192 289 454 265
6306 265 -51 390 -94 -324 44 -28 -222 -60 358 408 225 -13 -209 -297 -587 -48 81 244 366 195 135
6327 135 157 -160 10 -306 -351 358 127 309 -25 116 21 -246 -186 -442 -577 137 82 325 362 298 -48 -189
6349 -189 -175 -20 -147 -210 324 114 320 255 58 0 -236 -77 -191 17 56 279 184 214 26 301 -215 -424
6371 -424 -308 190 -16 -161 207 270 379 25 -232 -343 13 -46 223 76 305 201 397 -96 -233 -349 -365
6392 -365 -165 7 435 246 328 190 258 -164 -313 -317 -223 199 153 480 210 181 112 -311 -257 -480 -494 -145 367
6415 367 8 310 84 155 -272 -451 -429 -107 -158 117 317 447 246 343 -98 -119 -241 -489 -382 -38 449 372
6437 372 430 282 81 -324 -259 -389 -26 308 221 180 525 220 200 -122 -262 -347 -153 -76 104 509 196 233 121
6460 121 35 -386 -417 -311 -112 -158 51 105 327 292 33 0 -416 -274 -304 84 434 212 406 169 194 -191 -256
6483 -256 -102 -145 171 165 21 401 87 15 -55 -537 -540 -67 263 87 100 238 115 85 -97 -492 -267 -239 48
6506 48 88 619 159 467 -17 -260 -116 -355 -200 -260 196 363 216 378 48 -295 -308 -334 -259 -30 153 431
6528 431 373 270 179 12 -361 -513 -114 -334 63 141 447 230 33 -251 -105 -213 -363 -366 105 244 212 230
6550 230 297 33 -362 -500 -410 -305 -15 233 324 512 429 -286 -258 -90 -596 -408 72 309 204 515 145 -100
6572 -100 -329 -549 -230 -309 282 23 241 187 364 -155 -209 -321 -334 -263 -211 405 244 382 352 309 101 -184 -190
6595 -190 -292 28 -35 60 472 358 239 -173 -165 -566 -647 -202 54 -44 171 205 320 29 -84 -204 -726 -124
6617 -124 -142 256 475 428 381 -98 -154 -186 -421 -100 -71 -42 215 226 141 243 72 -154 -449 6 -293 136 596
6640 596 348 361 39 104 -120 -435 -180 -95 -50 369 419 333 -101 282 -256 -350 -277 -183 -300 479 145 218 312 98
6664 98 -127 -103 -334 -245 114 298 293 276 369 124 83 -111 -303 -285 -151 31 301 331 446 8 66 -424 -349 -388
6688 -388 41 38 70 147 362 182 -47 -138 -194 -208 32 -164 176 358 349 318 -140 -268 -340 -359 -416 37 30 208 242
6713 242 306 250 -128 -596 -445 -453 5 227 215 301 266 -162 -129 -35 -402 -417 -62 -52 580 344 220 149 -8 -76
6737 -76 -28 -185 -98 290 354 246 219 288 -71 -284 -390 -235 -254 -25 408 220 182 144 44 -27 -344 -64 -480
6760 -480 -322 328 564 346 268 -65 -29 -142 -311 -236 -98 215 355 255 116 89 -265 122 -350 -102 65
6781 65 263 408 32 336 -9 -30 -183 -390 -387 -236 121 284 255 410 198 57 -275 -485 -371 -192 -277 165
6803 165 448 270 359 -94 9 -414 -365 -107 187 232 518 253 75 235 -276 -345 -491 -194 -89 2 152 298
6825 298 551 -71 -143 -180 -468 -180 -92 359 319 307 204 6 90 -182 -305 -502 58 247 455 432 323 81
6847 81 28 -286 -612 -330 -238 -146 209 501 356 265 -107 -447 -210 -172 -16 84 164 230 258 353 -238 -201 -304 -512
6871 -512 -214 -135 45 66 231 259 -174 -237 -342 -320 -307 17 86 342 403 228 6 6 -274 -182 -379 -121 190 201
6895 201 226 329 274 -161 -263 -499 -573 -75 38 149 138 545 -5 -221 -179 -353 95 -299 -270 530 416 320
6917 320 416 -202 -58 -407 -308 -317 -101 563 318 391 246 -67 -170 -264 -123 -445 57 200 409 212 256 117
6939 117 -219 -194 -413 -217 -105 -11 169 320 254 -48 -33 -341 -286 -146 -231 -18 241 367 109 225 -84 -470
6961 -470 -145 -161 34 -256 178 295 444 415 -64 -12 -319 -256 -248 175 70 508 464 39 109 -98 -241 -311 -81
6984 -81 -266 215 416 209 229 -208 -318 -320 -442 -334 -162 289 378 78 548 -40 -220 -567 -229 -402 -344 -183
7006 -183 199 613 157 357 29 -336 -457 -461 -158 157 457 465 491 427 155 -289 -164 -351 -110 18 312 223
7028 223 464 531 195 -85 -373 -249 -174 -78 -23 253 285 56 97 47 -274 -168 -302 21 -155 401 472 157 235
7051 235 -100 -518 -304 -282 -163 125 200 455 540 50 -21 -338 -328 -200 -367 136 243 624 52 166 -14 -319
7073 -319 -379 -438 -303 86 488 193 343 149 94 -113 -437 -357 -235 61 117 483 410 419 -184 -73 -321 -348 -407
7096 -407 -199 57 295 393 227 -164 -176 -80 -483 -205 -187 281 349 181 170 148 16 -167 -165 -493 -220 89 671
7119 671 298 204 152 -376 -295 -423 -580 -36 -242 351 401 591 0 59 -205 -293 -155 -25 -144 291 111 467
7141 467 350 40 -225 -314 -362 -242 12 81 576 446 264 196 103 -231 -136 -236 -236 126 328 424 302 51 -226
7164 -226 -576 -342 -256 -37 33 436 429 188 82 89 -278 -458 -350 -302 -148 104 96 225 -46 -119 -235 -315 -434 -240
7188 -240 193 276 502 331 513 236 -241 -439 -339 -213 -113 215 368 273 252 258 -425 -426 -406 -252 50 256 434
7211 434 383 196 81 -285 -199 -327 -330 -202 13 293 268 320 173 -144 -476 -431 -124 -423 -236 323 107 568
7233 568 75 -29 -120 -295 -251 -234 128 368 383 360 340 -44 -461 -313 -79 -405 -52 310 657 156 -14 172
7255 172 -218 -249 -320 -385 -75 230 55 432 115 407 59 -349 -383 -534 -394 255 218 468 516 333 -167 -163 -244
7278 -244 -255 -105 49 453 297 321 -3 -363 -253 -208 -363 -141 113 450 368 545 255 -200 -315 -445 -272
7299 -272 -217 73 228 200 352 308 130 -227 -328 -551 -287 94 261 186 169 298 -111 -75 -396 -233 -284 -283 19
7322 19 204 410 346 -3 -55 -217 -458 -203 -89 -50 110 70 392 353 -2 -9 -262 -377 -2 304 189 492 397
7345 397 151 -51 -416 -630 -211 -33 -124 227 299 293 102 -42 -152 -364 -166 -165 99 173 378 340 238 74 -430
7368 -430 -421 -343 -191 142 41 427 194 373 3 -180 -334 -372 -489 -204 -97 286 417 95 101 -158 -129 -415
7390 -415 -268 -254 -50 44 391 89 271 -48 -41 -421 -353 -13 -213 25 505 485 249 13 -212 -150 -320 -79
7412 -79 66 441 628 281 383 155 -171 -305 -144 -193 -167 155 68 194 297 248 53 -489 -235 -125 113 125
7434 125 131 296 345 80 173 -258 -505 -395 -101 89 -115 324 391 -81 -231 -149 -243 -282 -84 -97 286 434 241
7457 241 22 180 60 -467 -301 -248 283 114 20 326 178 10 -336 -159 -431 12 -146 296 267 438 482
7478 482 313 -27 -271 -422 -293 -338 -188 276 125 373 -224 -260 -358 -455 -376 -72 68 359 373 371 237 -238 -195
7501 -195 -466 -234 -127 -145 104 120 344 27 112 -130 -562 -296 -297 -229 207 355 305 73 -66 -73 -149 -376 -253
7524 -253 25 -128 106 380 311 20 -179 -330 -286 -417 -490 -31 441 316 543 -192 140 -318 -393 -110 -100 87
7546 87 152 204 429 284 -11 -339 -206 -180 -72 83 203 556 93 119 116 -27 -214 -558 -274 -130 15 182
7568 182 263 142 110 -346 87 -319 -223 -202 204 139 80 393 418 -140 -346 -328 -463 -65 421 381 307 153 -120
7591 -120 -211 -69 -168 -332 -255 113 139 343 363 159 -20 -118 -321 -252 -320 111 269 484 490 82 -163 -228 -192 81
7615 81 -176 6 220 123 380 116 -75 22 -345 -408 9 190 279 317 139 198 -10 -370 -355 -446 -175 58 -126
7638 -126 247 354 354 220 -307 -160 -502 -246 109 19 380 375 457 173 -212 -441 -415 -492 37 127 253 372 303
7661 303 54 77 -323 -351 -274 -331 172 313 118 367 209 153 -305 -169 -107 -40 -99 -1 114 182 287 197 -201 -475
7685 -475 -223 -415 68 -139 141 222 82 -148 -23 -209 -184 -317 -230 5 320 425 243 134 52 -45 -229 -189
7707 -189 -169 -163 445 330 71 22 -73 -423 -268 -539 78 96 189 38 133 -11 133 -180 -344 -217 40 106 155
7730 155 39 81 242 -226 -133 -345 -398 41 107 333 356 298 75 -154 -158 -411 -437 -229 138 77 232 227 251 183 -40
7755 -40 -431 -370 -40 -124 -104 174 142 309 205 -89 -127 -98 -271 -429 141 363 340 305 66 170 -170 -360 -281
7778 -281 144 78 159 259 584 419 31 137 -400 -386 -259 -182 247 537 271 331 167 -41 -286 -128 -48 -40 170
7801 170 174 446 -109 -26 -159 -386 -613 -311 -111 137 368 275 287 234 -102 -243 48 -159 73 136 186 326 325
7824 325 106 -287 -144 -300 -251 -182 197 450 567 216 202 -45 -47 -30 -282 -114 51 106 66 288 64 126 -43
7847 -43 -170 -157 -310 -82 130 263 315 128 196 27 -210 -140 -300 -241 268 161 321 219 -69 -123 -164 -99 178
7870 178 36 40 167 369 52 105 237 -124 -240 -333 115 28 -13 176 581 94 -86 -179 -286 -351 -443 195 -146
7893 -146 311 240 87 205 -108 -138 215 30 192 8 198 139 -133 -42 -111 -496 -336 -312 18 347 162 291
7915 291 111 -213 60 -220 -272 56 -289 247 -60 233 189 -178 17 -189 -347 -391 -107 -150 99 126 260 154
7937 154 -136 -189 -542 -220 -475 -63 157 281 316 112 120 -409 -81 -405 8 -66 183 147 154 253 287 -249 -246 -92
7961 -92 -69 196 256 305 248 492 67 62 -219 -208 -375 -71 270 361 413 219 220 -179 -98 16 -306 -615 31 225
7985 225 109 278 -93 -160 -155 -465 -105 -78 9 -182 176 282 238 208 -41 -154 -142 -282 -161 201 114 427 243
8008 243 206 -97 -64 -262 -243 33 -117 -34 314 163 -56 -174 -313 -140 -238 -114 390 547 246 448 73 -42
8030 -42 -60 -174 -274 98 -192 89 505 211 75 -21 -190 -158 -329 -81 -82 3 123 -102 217 -86 -100 -253 -292
8053 -292 -238 156 320 -5 162 252 4 103 -280 -89 -127 24 34 148 313 155 -57 117 -195 -166 170 -169
8075 -169 38 301 -39 80 -56 -69 -3 -76 -329 -296 -8 379 254 376 276 -93 187 -126 -146 -18 -3 46
8097 46 194 10 142 155 -71 -45 -151 -239 -146 230 165 95 234 51 -153 -32 -378 -365 -77 64 177 294 129
8120 129 69 130 -113 -376 -167 -130 -51 71 320 72 270 225 -190 -306 -344 67 164 263 116 169 -56 -71 -145 -249
8144 -249 -80 -73 91 -40 303 351 47 195 -210 -227 -197 -23 15 -42 311 29 385 8 -69 -214 -306 -102 187
8167 187 47 259 147 419 -123 -166 -122 -500 -488 -108 171 288 -78 216 319 -149 -105 -137 36 -42 -16 190
8189 190 279 -34
8191c4
$$ Imaginary data points
##PAGE= N=2
##DATA TABLE= (X++(I..I)), XYDATA
0 0 0 0 0 0 0 0 0 0 0 0 0 0 0 -1 8 -8 8 -8 9 -16 16 -20 24 -26 32 -40 45 -50 58 -66 77 -89 99 -113 129 -144
36 -144 163 -182 203 -226 251 -280 312 -345 380 -419 463 -510 563 -622 683 -753 830 -916 1012
55 1012 -1122 1244 -1385 1550 -1745 1980 -2266 2629 -3104 3753 -4701 6222 -9066 16246 -77773
70 -77773 -92058 50666 46061 32914 57297 99300 49965 -30325 -86352 -86982 -64992 -11829 40598
83 40598 68406 63584 65862 52929 -11263 -98272 -110384 -55968 -15323 -4226 39494 97826 95604
96 95604 29539 -28606 -51532 -59685 -66016 -48039 4024 66269 93704 70534 22022 -17484 -41813
109 -41813 -62365 -81315 -70907 -10938 64344 90935 61316 23919 5825 -15074 -52041 -80812
121 -80812 -66220 -4559 63564 82979 53149 24157 15954 -8391 -63469 -97784 -69283 -3016
133 -3016 42857 51742 50198 52257 36324 -9710 -59220 -75785 -52282 -8809 27290 45656 55458
146 55458 60663 40330 -15102 -67245 -74871 -48280 -23222 -4189 27904 66922 75438 37549 -15656
159 -15656 -45253 -47676 -43420 -37776 -12952 33586 73508 73429 34054 -11490 -36254 -45769 -57186
172 -57186 -59078 -27113 30400 70632 65464 33193 6235 -12511 -36736 -62456 -60487 -19244 34752
185 34752 62107 56147 39556 22771 -4534 -46360 -77000 -67394 -23102 21501 43683 49952 51230
198 51230 39565 1833 -45611 -70507 -56640 -19488 14553 36207 52121 62386 47956 180
210 180 -51445 -71230 -56008 -31109 -8164 21263 56175 71254 47847 268 -38947 -54402
222 -54402 -51904 -38463 -12514 25573 61316 72708 48330 2795 -34095 -50205 -57136 -54782 -28177
235 -28177 21045 60687 65864 42036 11921 -15317 -41469 -60493 -55752 -22378 24036 57917
247 57917 63355 46355 20710 -7690 -41455 -68361 -64799 -27442 16098 42627 51712 49929 32806
260 32806 -1969 -40159 -61354 -55794 -26400 11519 40551 53745 54006 39706 4833 -39459 -64599
273 -64599 -56924 -30451 -4511 21712 48643 59973 40811 2876 -31323 -49837 -51598 -35924
285 -35924 -7066 24330 49620 59945 46402 10724 -26555 -47494 -51330 -44299 -23140 12257
297 12257 45476 55851 41288 14501 -13231 -37861 -50942 -45310 -21469 12359 42984 56741
309 56741 47314 22665 -6075 -32962 -52196 -53361 -31748 2859 32231 47352 46124 29627 1343
322 1343 -28486 -47744 -49374 -32056 -1258 30449 49712 50390 36215 10266 -21629 -48556 -55493
335 -55493 -39080 -10740 17452 39606 49309 41000 14421 -17801 -42295 -50287 -40194 -15423 16606
348 16606 42561 52463 45429 23290 -9172 -40564 -55168 -46137 -22909 4599 30583 49376 49441
361 49441 26730 -7523 -35537 -47688 -45268 -27796 1754 33391 52941 52558 33042 1042 -30583
374 -30583 -49620 -49920 -34958 -8894 22699 48527 53126 33348 2356 -24453 -42123 -49438 -39673
387 -39673 -10809 26197 50921 53342 37723 12374 -16666 -42146 -54256 -45861 -17462 17409
399 17409 42257 48879 38119 16754 -10648 -38593 -54206 -46040 -16526 17687 39866 48588 44834
412 44834 27153 -4687 -38421 -55434 -47066 -21621 6061 28548 43994 46548 29661 -3100
424 -3100 -35776 -50466 -43826 -23604 990 25528 46617 53348 35959 1034 -31624 -45813 -43077
437 -43077 -31053 -11376 17406 44661 51586 32998 1735 -23501 -37681 -42972 -36540 -13943 19157
450 19157 45869 51687 35657 9361 -14008 -32156 -45455 -45053 -21560 14822 40570 43442 32361
463 32361 16104 -4643 -30156 -48807 -45387 -19458 12972 35094 42334 38320 25506 2922 -26835
476 -26835 -49900 -47421 -21141 5779 21753 34511 42980 33173 2824 -28927 -44625 -41776 -26369
489 -26369 -3784 19758 38956 46141 37367 10824 -23512 -43669 -39723 -25876 -15255 4063 37083
502 37083 55174 36301 1880 -18626 -27184 -37925 -41219 -21976 11679 39620 48672 39002 15829
515 15829 -10673 -29465 -37100 -39366 -30631 72 38501 50652 31987 11845 1380 -17763 -44694
528 -44694 -50811 -26147 8093 30354 38460 39348 31096 6890 -24188 -44508 -44046 -28181 -3836
541 -3836 21007 37360 41204 33137 9519 -23262 -45228 -42481 -24988 -6764 11285 32379 49349
554 49349 44876 12038 -25899 -40622 -33690 -27022 -20555 1597 34747 52892 40593 9352 -18605
567 -18605 -32932 -36353 -34489 -22298 2975 32081 49861 43760 16139 -13273 -27386 -32394 -37640
580 -37640 -30748 -1435 32624 45674 35919 18473 49 -21372 -41187 -44847 -25870 2446 24546
593 24546 36766 40053 30600 6588 -21543 -40548 -42599 -26677 -2191 18059 29656 36518 35317
606 35317 15336 -18929 -44182 -43736 -23449 -3779 8158 24154 42908 44260 17217 -18893 -38567
619 -38567 -36682 -26119 -14372 2077 24815 43044 40889 17162 -13627 -32284 -35097 -30258 -20605
632 -20605 -2165 24592 44485 41420 18813 -5758 -21956 -32585 -37667 -28140 -1818 25788 38804
645 38804 34818 21107 3814 -16226 -35565 -42578 -29645 -2297 22320 33767 33468 26859 13295
658 13295 -10288 -35726 -45155 -30175 -3597 16366 26817 32768 33649 18360 -10905 -36610 -42337
671 -42337 -29090 -8805 8196 23081 35989 38452 21347 -8373 -31876 -37895 -29174 -15244 403
684 403 20197 38996 40447 20457 -7167 -25945 -33368 -32894 -24061 -4172 21540 40002 39365 21266
698 21266 -1415 -18172 -29950 -35624 -29231 -8119 20576 38371 36324 21268 5371 -11175 -29762
711 -29762 -40737 -32170 -7996 17541 32701 34630 26806 12617 -7787 -29418 -40902 -32978 -10066
724 -10066 13098 27073 32620 30795 18601 -4876 -30595 -40511 -30892 -12482 5364 21312 34360
737 34360 35897 21410 -3760 -26684 -36416 -30585 -17181 -884 18287 34892 38162 23011 -1831
750 -1831 -22975 -32253 -31189 -23222 -6507 16506 35205 37809 23683 2319 -16247 -28579 -33245
763 -33245 -28250 -10341 14764 33474 36069 24369 7117 -10195 -26750 -36028 -31474 -12265 12324
776 12324 29414 33539 27054 13778 -5166 -24792 -36310 -32622 -14386 8061 24658 31759 29843
789 29843 18403 -1204 -23369 -36232 -32603 -16368 3042 19282 30699 33502 22961 906
801 906 -21242 -33395 -31314 -19890 -3071 15501 30371 34531 24369 3977 -16996 -30336 -32370
814 -32370 -23165 -7249 12005 29203 35758 26650 6819 -13378 -26667 -31521 -27222 -12442 9416
827 9416 28137 34409 26892 10804 -7907 -23963 -32999 -29856 -14719 6667 24787 32706 28765
840 28765 15031 -3702 -21092 -31935 -31793 -17840 2973 22077 30751 29177 18595 1585 -18563
853 -18563 -31770 -32391 -19668 -654 16867 28819 31007 22378 4207 -15660 -29709 -32158 -22378
866 -22378 -4601 13720 26925 31403 25116 8382 -12395 -27898 -31546 -23923 -8700 9048 24965
879 24965 32215 27136 10821 -9247 -24721 -30874 -26073 -12791 5203 22073 31777 28713 14237
892 14237 -5357 -21695 -29523 -27658 -16306 1507 20244 31379 29228 16307 -1501 -17751 -28603
905 -28603 -29464 -19525 -1369 17669 29206 29830 18997 2406 -14241 -26719 -30418 -22400 -4800
918 -4800 14893 27612 29221 21226 6789 -10587 -25975 -31753 -24422 -7020 11620 24120 28806
931 28806 24353 11327 -7275 -24637 -31352 -24894 -9926 7029 21405 28929 26406 14361 -4726
944 -4726 -22704 -30484 -25408 -12977 2177 17608 28521 29092 16886 -1965 -19986 -28027 -26083
957 -26083 -16524 -1727 15248 28952 30090 18625 -123 -15964 -25110 -26972 -21166 -6212 14032
970 14032 28365 28982 19187 4718 -10832 -23631 -28249 -23035 -8445 11194 25681 28599 21140
983 21140 7641 -7642 -21251 -29335 -26499 -10679 10086 22990 25589 22385 13663 -2813 -21088
996 -21088 -29890 -25878 -11614 5193 18420 25235 25547 16382 -936 -18922 -29140 -26347 -13620
1009 -13620 1813 14346 23890 27931 20261 940 -18240 -26211 -23962 -15990 -4287 10609 24803
1022 24803 29617 20105 1924 -13781 -22005 -25228 -20468 -7980 9418 23873 28847 20826 5331
1035 5331 -9483 -19456 -25514 -23789 -11199 8099 24078 27257 19477 7925 -3200 -16036 -27813
1048 -27813 -27462 -12300 7086 20171 24227 21394 13609 834 -15539 -28094 -27299 -13327 3866
1061 3866 16830 22358 23001 17323 3594 -14536 -27611 -26520 -14510 -16 11534 20801 25139
1074 25139 20132 5464 -12908 -24865 -24964 -16637 -5371 7954 21236 27701 21404 5697 -10624
1087 -10624 -20401 -23483 -20380 -10472 5801 21244 27581 21043 6486 -7043 -16617 -22512 -23243 -14205
1101 -14205 3756 21392 27199 20324 8792 -1809 -12692 -23485 -26820 -16224 3221 19024
1113 19024 23661 20137 12577 2716 -11239 -24087 -27289 -16353 1291 15370 21215 21110 16588 5801
1127 5801 -10028 -24212 -26316 -16375 -2083 9329 19124 24277 20420 6859 -10371 -22202 -23480
1140 -23480 -17186 -6614 5341 17929 25560 22380 8357 -9006 -19446 -21500 -17889 -11462 1309
1153 1309 18097 27114 21707 8197 -5228 -14511 -20623 -21411 -14243 115 16674 25876 22031 10189
1167 10189 -2183 -11638 -19356 -23505 -17889 -1032 16349 22756 19471 13011 4175 -8974 -21675
1180 -21675 -24682 -16844 -2499 11672 20055 20946 16450 7130 -6965 -20814 -25224 -17786 -3484 8077
1194 8077 15552 21090 20606 9661 -7555 -19873 -22330 -17414 -7589 4095 15052 22211 21792 11518
1208 11518 -5192 -18057 -21096 -17290 -11087 -813 12961 24006 23318 11091 -3656 -13134 -18673
1221 -18673 -20049 -14834 -2185 12771 22426 21825 12666 194 -10248 -17727 -21543 -17672 -4255 11981
1235 11981 21021 20598 13806 4349 -6370 -17601 -23360 -18434 -4722 9208 17897 19439 16398 8295
1249 8295 -4483 -17739 -23599 -18363 -6159 5665 14709 19521 18818 10959 -3036 -16570 -22678 -18268
1263 -18268 -8202 2270 11860 19788 21095 12766 -1834 -14915 -20097 -17997 -11531 -1514 10494
1276 10494 19901 21570 13690 -163 -12094 -18480 -18409 -13782 -4627 9134 20112 21990 13712 1932
1290 1932 -8217 -15971 -20185 -17188 -5663 7981 18230 20553 15073 5065 -5682 -14614 -20578
1303 -20578 -18313 -7891 6447 16751 18696 15788 8815 -1969 -14586 -21060 -18622 -8174 3465
1316 3465 13204 18441 17806 11154 -190 -12766 -20289 -19286 -10009 1370 10311 17186 19347 14051
1330 14051 1223 -12105 -19010 -17667 -11645 -2571 8275 17440 19967 14729 3097 -9408 -17046
1343 -17046 -18229 -13782 -5322 6011 16296 20372 15646 4314 -6866 -14548 -17734 -15779 -7891 4621
1357 4621 15928 19789 15990 6732 -3648 -12801 -18095 -17473 -9672 2797 13870 19091 16245 8621
1371 8621 -765 -10851 -18488 -18655 -10993 1361 11902 16978 16951 11401 1396 -10102 -17946 -18592 -11710
1386 -11710 -903 9223 16019 17426 13147 3813 -8377 -17402 -18527 -12456 -2945 6462 14698 18605
1400 18605 15173 5193 -6838 -15534 -17749 -13768 -5888 3938 13562 18480 16224 6599 -5210 -13688
1414 -13688 -16905 -14779 -8195 1996 12527 18695 16607 7968 -2933 -11380 -16114 -16229 -10498 286
1428 286 11551 17997 16290 9386 5 -9085 -15780 -17496 -11772 -918 9957 16280 16254 11054 2457
1443 2457 -7161 -14831 -17802 -13037 -2750 7782 14434 16397 13090 4745 -5479 -14334 -17619 -13766
1457 -13766 -4330 5318 13030 16334 14750 6959 -3613 -13457 -17180 -14125 -6412 2554 10671 16052
1471 16052 15579 8586 -2288 -12041 -16661 -14435 -8471 297 9260 16421 16668 9607 -333 -9644 -15234
1486 -15234 -15194 -10263 -2352 7824 15759 17043 10223 982 -7403 -13534 -15944 -12655 -3639 7366 15195
1501 15195 16447 11331 3972 -4785 -13040 -16250 -13449 -5009 5745 13732 15074 11982 5660 -2923
1515 -2923 -12061 -17351 -14230 -5936 3947 10955 14722 14207 8316 -1482 -11328 -16003 -14356 -7592 1369
1530 1369 9605 14429 14782 9959 295 -10533 -15669 -14088 -8557 -1111 7423 14533 16127 10830 1247
1545 1247 -8011 -13808 -14304 -10877 -3603 6148 13757 15857 11331 2636 -6360 -12370 -14231 -12654 -5524
1560 -5524 4656 13598 16033 11581 4499 -3591 -10267 -14302 -13420 -6598 3535 11696 14722 12209 6365
1575 6365 -1246 -9317 -15019 -14638 -7275 2153 10157 13494 12732 8825 1032 -8546 -14421 -14465 -8251 541
1591 541 7558 12371 13613 10188 2181 -7658 -14080 -13794 -9266 -1884 5294 11733 14917 12044 3176
1606 3176 -6734 -12460 -12901 -10167 -4413 3520 11314 14903 11731 4133 -4737 -10964 -13090 -11464 -6414
1621 -6414 1994 10769 14828 12256 5616 -2074 -8333 -12579 -13242 -7925 1678 9592 13345 12313 7178
1636 7178 -327 -7578 -13052 -13969 -8867 -219 8316 12636 12207 8826 2575 -5665 -12893 -14354 -9274
1651 -9274 -852 6177 10808 12801 10819 3855 -5513 -12244 -14366 -10224 -3029 3903 9913 13137 11970
1666 11970 5272 -3797 -10921 -12763 -10411 -4740 1852 8941 13670 12559 5487 -2909 -9415 -12246 -11434
1681 -11434 -7138 53 8279 13618 12449 6356 -631 -7372 -11894 -12296 -8260 -724 7715 12719 12452
1696 12452 7123 813 -5613 -11483 -13649 -9387 -1612 6368 11505 11975 9046 3195 -4427 -11002 -13016
1711 -13016 -9847 -2930 5237 10515 11580 9778 4954 -2954 -10737 -13787 -10049 -3628 2532 8279 12080
1726 12080 11892 6138 -2087 -9091 -12251 -10508 -5716 1674 7574 11664 11850 7503 -1227 -8529 -11411
1741 -11411 -10577 -7484 -1140 6827 12148 11718 7369 507 -6134 -10268 -11490 -8241 -1889 5660 11058
1756 11058 12143 8015 1163 -4459 -9185 -11846 -10296 -3333 4927 10185 11303 8831 4204 -2646 -8937
1771 -8937 -11715 -9725 -4270 3402 8979 11439 9237 5132 -927 -8047 -12468 -11112 -4633 1880 6849
1786 6849 10723 10961 6600 -386 -7394 -10924 -10623 -6439 -197 6074 10201 11149 7607 805 -6339 -10598
1802 -10598 -10731 -7325 -1991 4423 10112 11793 8349 1785 -4947 -9339 -10511 -8362 -3214 3414 9684
1817 9684 11361 8687 2862 -3133 -8447 -10826 -9933 -4550 2743 8763 11199 9219 4547 -1454 -6840
1832 -6840 -10963 -10431 -5418 1805 7951 9986 9559 6040 -265 -6315 -10778 -10873 -6246 391 6461 9811
1848 9811 9670 7382 1445 -5224 -9965 -10709 -6533 -771 4688 8916 10474 8174 2046 -4880 -9378
1863 -9378 -10332 -7802 -2754 3306 8834 10739 8461 3156 -3179 -7904 -10002 -8524 -3650 2458 8007
1878 8007 10883 9218 3863 -2341 -7141 -9549 -8937 -5729 1111 7537 10266 8565 4908 -351 -5628
1893 -5628 -9587 -9954 -5943 235 6454 9884 9305 5746 833 -5037 -8924 -10418 -7108 -670 5257
1908 5257 8613 8904 6911 2475 -3547 -9054 -10021 -7138 -1851 3767 7833 9731 8083 3213 -3139
1923 -3139 -8178 -9779 -7817 -3351 2049 7149 9723 8210 4337 -2078 -7161 -9185 -8033 -4346 882
1938 882 6234 9672 9269 4919 -1006 -5929 -8483 -8641 -6026 -524 5606 9201 9214 5329 353 -4635
1954 -4635 -8198 -8937 -6691 -1177 4904 8761 8855 6489 1668 -3559 -8010 -9651 -7459 -2301 4082 7621
1970 7621 8643 7037 3111 -2519 -7321 -9779 -7796 -3113 2520 6421 8674 7980 4253 -1704 -7094
1985 -7094 -9446 -7626 -4132 1096 5430 8373 8863 4734 -884 -6105 -8675 -8353 -4764 -94 4873
2000 4873 8605 9176 5735 -257 -4804 -7939 -8052 -6262 -1348 3991 8324 8961 6082 1089 -3867 -7249
2016 -7249 -8754 -7064 -2200 3422 7524 8786 6342 2237 -2639 -6677 -8521 -7395 -3141 2669 7113
2031 7113 8336 6936 3286 -1121 -6179 -8817 -7738 -3800 1633 5809 7578 7975 4758 -578 -5642
2046 -5642 -8365 -8186 -4504 230 4775 8139 8042 5529 534 -5097 -7861 -7866 -4936 -901 3809 7339
2062 7339 8808 6163 1290 -4048 -7239 -7651 -5798 -2216 3041 6919 8509 6751 1956 -3024 -6445
2077 -6445 -7695 -6933 -3142 1982 6523 8395 6661 3144 -1392 -5454 -8173 -7650 -3701 1412 5751
2092 5751 7653 7052 3879 -175 -4980 -7988 -7772 -4673 480 4869 7652 7322 4755 480 -4327 -7690
2108 -7690 -7804 -4978 -728 3614 6420 7674 5621 1508 -3346 -7243 -7583 -5323 -1573 2576 6198
2123 6198 8152 6268 2394 -2693 -6435 -7599 -6209 -2644 1549 5832 7727 6477 2907 -1923 -5706
2138 -5706 -6882 -6609 -3860 744 5502 7590 6919 3719 -740 -5076 -6922 -7025 -4108 -128 4584 7140
2154 7140 6997 4336 360 -3576 -7024 -7214 -4765 -809 3907 6229 6893 5298 1499 -3122 -6261 -7374
2170 -7374 -5335 -1617 2916 6275 7028 5881 2415 -2399 -5974 -7486 -5985 -2477 2044 5354 7326
2185 7326 6415 2913 -1570 -5289 -6847 -6056 -3364 718 4779 7032 6687 3832 -652 -4830 -6741 -6305
2201 -6305 -4121 42 4039 6856 7005 4208 259 -3620 -6125 -6604 -4897 -596 3695 6504 7013 4722
2217 4722 1008 -2687 -5852 -6932 -5534 -1565 2756 5871 6877 5030 1987 -1989 -5572 -7380 -5512
2232 -5512 -2560 1872 5388 6679 5692 2834 -1478 -4983 -6821 -6177 -2819 1349 4748 6247 6226 3514
2248 3514 -275 -4716 -6894 -6151 -3673 146 3472 6267 6233 4088 448 -3798 -6075 -6289 -4154 -987
2264 -987 3075 6154 6639 4422 928 -3080 -5795 -6367 -5020 -1660 2416 5394 6554 5124 1591 -1732
2280 -1732 -5163 -6204 -5479 -2400 1874 4967 6627 5326 2325 -1331 -4480 -6304 -5833 -3062 1237
2295 1237 4494 6094 5529 3282 -356 -4104 -6294 -5914 -3599 101 3674 5830 5987 3633 189 -3310
2311 -3310 -6115 -5943 -4018 -338 3074 5247 6017 4640 1281 -2914 -5535 -5987 -4072 -1470 1823 5047
2327 5047 6355 4663 1687 -2032 -5034 -6217 -5181 -2414 1616 4422 6135 5327 2225 -1503 -4321
2342 -4321 -5698 -5216 -3279 445 4771 6144 5025 2811 -614 -3386 -5704 -5721 -3157 91 3657 5669
2358 5669 5841 3780 53 -2869 -5121 -5772 -4238 -618 2874 5380 5457 4322 1193 -2478 -5523 -6120
2374 -6120 -4058 -1200 2240 4655 5558 4938 1782 -2063 -4899 -5735 -4461 -1907 1258 4000 5749 5552
2390 5552 2396 -1252 -4301 -5735 -4776 -2566 680 3546 5634 5818 3196 -803 -3730 -5337 -4875 -3233
2406 -3233 -183 3179 5742 5757 3299 48 -3398 -4912 -5538 -3683 -634 2622 5574 5580 3965 839
2422 839 -2203 -4660 -5672 -4618 -1024 2579 4527 5232 4342 2005 -1543 -4764 -5833 -4378 -1428 1406
2438 1406 4193 5357 4662 2384 -1076 -4182 -5537 -4732 -2172 946 3313 5078 5351 2879 -701 -3771
2454 -3771 -5073 -5021 -3036 112 2899 5080 5734 3422 44 -2937 -4735 -4827 -3515 -941 2403 5266
2470 5266 5267 3717 709 -2317 -4342 -4848 -4077 -1452 1928 4548 5200 3715 1497 -1368 -3946 -5166
2486 -5166 -4603 -1839 1699 4037 5075 4094 1894 -801 -3736 -5457 -4894 -2332 702 3231 4520 4378
2502 4378 2904 50 -3368 -5087 -4659 -2816 44 2736 4599 4830 3622 384 -2918 -4855 -5081 -3234
2518 -3234 -782 2141 4317 5238 3653 740 -2273 -4195 -4690 -3654 -1094 1947 4418 5351 3918 1197
2534 1197 -1786 -3727 -4941 -4218 -2073 837 3852 5276 4251 2192 -811 -3404 -4778 -4616 -2393
2549 -2393 1164 3357 4514 4364 2576 -233 -2896 -5103 -4942 -2862 225 2805 4449 4632 2992 548
2565 548 -2331 -4526 -4582 -3048 -461 2577 4510 4694 3774 1132 -2358 -4221 -4629 -3244 -916 1488
2581 1488 4072 4659 3869 1412 -1765 -3816 -4346 -4027 -1669 1114 3656 4838 3983 1858 -1182 -3412
2597 -3412 -4470 -4063 -2588 549 3359 4671 4343 2191 -531 -2946 -4546 -4405 -3012 242 2898 4509
2613 4509 4840 2806 353 -2723 -4035 -4914 -3321 -531 2432 3932 4515 3274 826 -1677 -3795 -4583
2629 -4583 -3367 -678 1683 3379 4622 3487 1541 -1648 -3778 -4575 -3762 -1375 808 3196 4729
2644 4729 3803 1687 -881 -3206 -4384 -3857 -2160 796 3114 4435 4270 2164 -479 -2697 -4111 -3879
2660 -3879 -2560 89 2397 4055 4247 2336 564 -2029 -3916 -4147 -2891 -540 2177 3929 4271 3060
2676 3060 660 -1581 -3670 -4352 -3230 -897 1669 3568 4279 3153 1456 -1144 -3536 -4302 -3427 -1313
2692 -1313 1036 3089 4331 3836 1997 -927 -3221 -4209 -3697 -1973 569 2982 4111 4129 2246 -309
2708 -309 -2911 -3976 -3932 -2463 192 2390 3943 4265 2712 440 -2242 -3739 -3835 -3075 -486 1954 3739
2725 3739 3962 3159 467 -1451 -3614 -4234 -3041 -1031 1776 3505 3938 2991 1293 -1491 -3336 -4304
2741 -4304 -3406 -1503 1037 3074 4274 3396 1494 -740 -2894 -3816 -3648 -1815 859 2933 3917 3449
2757 3449 2139 -590 -2740 -3855 -3808 -2019 -88 2320 3647 3679 2363 -57 -2270 -3527 -3547 -2239
2773 -2239 -434 2022 3655 3869 2932 604 -1757 -3687 -3795 -2445 -615 1471 3055 3915 3013 1236
2789 1236 -1193 -3134 -3850 -3012 -1028 1071 2783 4051 3274 1501 -923 -2998 -3804 -3197 -1809 283
2805 283 2638 3647 3315 1853 -9 -2180 -3592 -3459 -1951 140 2199 3490 3702 2137 216 -1709
2821 -1709 -3238 -3680 -2581 -385 1884 3204 3531 2675 825 -1233 -3184 -3477 -2767 -697 1597 3023
2837 3023 3444 2622 1127 -1257 -3197 -3685 -3092 -1263 901 2901 3726 3250 1257 -697 -2405 -3807
2853 -3807 -3333 -1585 687 2500 3579 3623 2070 -164 -2383 -3217 -3561 -2212 -32 2358 3456 3497 2175
2870 2175 165 -1894 -3546 -3259 -2229 -12 1786 3470 3571 2152 649 -1521 -2988 -3479 -3075 -574
2886 -574 1708 3196 3362 2704 1180 -1253 -3141 -3690 -2865 -1164 920 2943 3004 2925 1761 -727 -2360
2903 -2360 -3415 -3068 -1401 395 2496 3293 2976 1708 -437 -2267 -3136 -3214 -1919 165 1975 3346
2919 3346 3302 2010 205 -2274 -3306 -3141 -2200 -245 1763 3174 3333 2053 441 -1470 -2850 -3402
2935 -3402 -2262 -554 1374 3139 3558 2426 626 -1124 -2569 -3281 -2711 -1231 1059 2330 3293 2677
2951 2677 1117 -595 -2238 -3322 -2846 -1080 917 2549 3187 2918 1545 -100 -2140 -3316 -3095 -1722
2967 -1722 139 2047 2908 2911 2049 186 -1795 -3079 -3038 -1815 -553 1461 2768 3428 2306 293 -1466
2984 -1466 -2666 -3001 -2330 -793 1118 2865 3201 2578 891 -1232 -2434 -3313 -2829 -1066 715 2480
3000 2480 3462 2516 1049 -191 -2175 -3042 -2845 -1721 520 1923 3038 2892 1526 -335 -2118 -3057
3016 -3057 -3078 -1501 66 1791 3036 2851 2019 40 -1544 -3043 -2997 -1974 140 1516 2851 3185 2321
3033 2321 280 -1394 -3019 -2708 -2061 -656 1304 2495 3214 2672 844 -1251 -2437 -2835 -2224 -1013
3049 -1013 466 2316 2904 2509 1317 -840 -1938 -2760 -2743 -1402 375 2089 3171 2600 1489 -297
3065 -297 -1745 -3033 -2847 -1974 106 1819 2821 2532 1519 55 -1509 -2850 -2765 -1877 -231 1999 2489
3082 2489 2978 1929 409 -993 -2558 -3088 -2168 -524 1289 2358 2814 2253 784 -830 -2313 -2859
3098 -2859 -2218 -956 708 2247 2625 2371 1165 -599 -2391 -2869 -2360 -913 630 2298 2902 2658 1121
3115 1121 -405 -1836 -2707 -2589 -1712 -184 1661 2728 2573 1475 -322 -1606 -2453 -2814 -1836 -223 1667
3132 1667 2679 2599 1858 162 -1078 -2536 -2676 -2398 -354 1245 2328 2967 1977 943 -1016 -2282 -2873
3149 -2873 -2149 -820 928 2104 2647 2385 1168 -643 -2011 -2748 -2248 -1017 556 1877 2845 2618 1530
3166 1530 -261 -1667 -2525 -2301 -1499 -23 1596 2668 2619 1521 -307 -1508 -2717 -2726 -1354 -180 1373
3183 1373 2549 2584 1645 341 -1417 -2404 -2631 -1930 -694 1225 2115 2654 1845 704 -1174 -1965 -2879 -2249
3201 -2249 -800 930 2351 2722 2310 767 -843 -1742 -2538 -2490 -1170 587 1793 2704 2255 1298 -397
3218 -397 -1791 -2744 -2388 -1480 455 1568 2569 2364 1755 67 -1484 -2095 -2479 -1665 -71 1276 2111
3235 2111 2576 1676 -44 -1212 -2251 -2597 -1835 -303 1202 2250 2239 2022 477 -702 -1967 -2272 -1865
3252 -1865 -751 1144 1914 2717 2020 896 -490 -1921 -2679 -2178 -1181 705 1952 2130 2147 1157 -475
3269 -475 -1608 -2448 -2125 -967 292 1408 2258 1959 1431 6 -1629 -2266 -2529 -1530 229 1245 2334
3286 2334 2427 1607 168 -961 -2146 -2223 -1718 -402 995 2218 2329 1913 620 -781 -2351 -2179 -2033
3303 -2033 -526 833 1945 2484 1674 745 -516 -1804 -2280 -2093 -774 646 1864 2224 2062 1348 -263
3320 -263 -1828 -2170 -1900 -1440 246 1588 2134 1918 1344 -185 -1265 -2167 -1977 -1467 -145 1030 2097
3337 2097 2086 1708 293 -1375 -2024 -2396 -1654 -303 905 1919 2217 1539 702 -720 -1869 -2269 -1812 -775
3355 -775 932 1951 2326 1850 723 -825 -1657 -2172 -1994 -744 382 1917 2319 1828 929 -347 -1470
3372 -1470 -2031 -1942 -1060 348 1430 1988 2142 1434 -55 -1417 -2305 -1946 -1130 67 1040 2101 2321 1277
3390 1277 111 -1242 -1954 -1832 -1617 -447 1172 1965 2015 1602 97 -647 -1886 -2052 -1658 -565 495
3407 495 1724 2354 1712 529 -715 -1440 -1987 -1672 -685 615 1435 2199 1954 964 -280 -1604 -2268 -1947
3425 -1947 -857 520 1362 1938 1892 1059 -21 -1483 -2063 -1983 -991 128 906 1944 1947 1182 349 -1349 -2146
3444 -2146 -2059 -1520 -88 1127 1921 2143 1535 335 -838 -1748 -1835 -1663 -545 702 1802 2237 1735 590
3462 590 -639 -1438 -1793 -1807 -890 335 1577 2107 1619 713 -765 -1407 -1823 -1877 -1000 88 1536 1949 2036
3481 2036 1238 -130 -1358 -1807 -1770 -1072 90 1105 1948 1948 1326 317 -1098 -2015 -1852 -1380 -327 800
3499 800 1678 1913 1402 504 -695 -1696 -2132 -1437 -543 670 1507 1659 1694 830 -642 -1315 -1886 -1692 -688
3518 -688 464 1330 2244 1226 792 -504 -1231 -1891 -1743 -922 472 1373 1897 1780 780 -79 -1088 -1897
3536 -1897 -1840 -1201 166 892 1952 1886 1137 55 -1122 -1894 -1884 -1227 175 1074 1776 1906 1365 255 -643
3555 -643 -1713 -1697 -1436 -489 582 1816 1726 1361 611 -673 -1447 -1670 -1624 -414 400 1259 1701 1751 797 -519
3575 -519 -1250 -1435 -1702 -943 184 1113 2155 1656 869 -132 -1442 -1544 -1186 -1120 38 1127 1683 1532
3593 1532 1149 -13 -770 -1775 -1963 -1081 -139 1061 1761 1596 1188 597 -665 -1529 -1877 -1272 -472 656
3611 656 1520 1634 1481 551 -479 -1419 -1879 -1404 -496 435 1377 1810 1381 934 -325 -1501 -1755 -1853 -824
3630 -824 349 1458 1696 1716 907 -91 -1063 -1521 -1587 -878 -52 1026 1697 1546 1003 119 -785 -1722 -1430 -1127
3650 -1127 -264 738 1497 1741 1378 135 -867 -1413 -1607 -1526 -388 863 1426 1347 1193 629 -453 -1518
3668 -1518 -1517 -1545 -722 547 1400 1677 1237 524 -182 -1228 -1846 -1563 -780 394 1263 1636 1470 874 -205
3687 -205 -962 -1259 -1308 -640 71 922 1710 1735 733 -15 -906 -1491 -1532 -958 -352 677 1329 1517 923 431
3707 431 -859 -1428 -1503 -1266 -214 765 1371 1769 1108 841 -517 -1314 -1483 -1141 -398 699 1465 1671 1424
3726 1424 603 -249 -1515 -1554 -1342 -667 433 1150 1475 1540 482 -93 -1048 -1274 -1326 -788 138 939 1198 1271
3746 1271 913 -90 -901 -1670 -1704 -939 97 669 1408 1302 968 85 -826 -1569 -1751 -992 -343 654 1653
3765 1653 1461 1143 508 -774 -1487 -1590 -1030 -526 496 1318 1234 1387 430 -294 -1111 -1819 -1442 -482 203
3784 203 1062 1512 1331 667 -110 -1128 -1419 -1199 -678 35 825 1618 1262 872 -73 -766 -1401 -1366 -971 98
3804 98 656 1574 1682 844 183 -704 -1290 -1461 -1316 -330 566 1389 1561 1096 290 -596 -1338 -1453 -1095 -473
3824 -473 303 1122 1677 1321 475 -533 -1003 -1763 -1028 -476 383 1082 1534 1211 534 -164 -1130 -1237 -1078 -609
3844 -609 32 828 1333 1505 946 -58 -689 -1192 -1649 -1156 58 538 1414 1270 758 -6 -637 -1504 -1338
3863 -1338 -1009 -143 656 1309 1298 1084 -98 -747 -1040 -1143 -1069 -425 621 1318 1288 1011 376 -254 -1257 -1331
3883 -1331 -1300 -614 340 905 1036 1032 396 -31 -885 -1313 -1220 -719 64 1212 1168 1167 600 -27 -681 -1221 -1033 -1109
3905 -1109 16 488 924 1201 1025 352 -592 -1304 -1380 -851 -129 741 1182 1400 963 54 -277 -947 -1245 -893
3925 -893 -265 465 839 1171 777 652 -362 -926 -1450 -1197 -542 73 1046 1417 864 444 -214 -728 -1299 -1098
3945 -1098 -718 82 1077 1178 1003 732 84 -800 -1309 -1344 -720 22 424 1121 1088 536 27 -557 -1060 -1290
3965 -1290 -833 -228 562 1328 1156 960 231 -766 -1132 -1197 -806 -321 393 1205 1319 1088 461 -263 -1155 -1158 -1014
3986 -1014 -404 535 755 1064 1223 596 -104 -972 -1157 -1135 -307 186 764 1095 1056 241 -232 -630 -961 -1092
4006 -1092 -793 168 630 1035 1016 749 63 -921 -997 -1334 -730 163 875 992 1113 749 87 -414 -924 -1301
4026 -1301 -715 -398 601 930 1169 1039 560 -333 -960 -1154 -949 -332 419 962 868 1221 443 -202 -1112 -1015
4046 -1015 -1292 -648 313 900 1110 1138 531 87 -638 -1225 -973 -544 261 922 847 1094 460 -124 -689 -1089
4066 -1089 -1047 -625 -110 619 956 1034 849 -208 -48 -1156 -1214 -863 -9 174 1405 1190 830 229 -459 -1067
4086 -1067 -988 -739 -216 504 850 1230 908 473 -203 -728 -1173 -670 -266 -117 769 1393 896 528 46 -584
4106 -584 -859 -920 -674 89 806 1016 672 568 88 -526 -929 -1230 -678 -208 526 910 1184 867 10 -614
4126 -614 -830 -1113 -661 -293 428 937 1016 1091 301 -521 -838 -1290 -602 -276 344 711 1083 732 618 -30 -941
4147 -941 -1017 -833 -378 131 782 885 1123 317 -39 -974 -740 -1000 -593 50 494 965 832 482 -10 -605
4167 -605 -882 -1194 -619 -122 604 1144 899 723 -30 -429 -840 -971 -596 -257 360 838 1140 576 212 -410
4187 -410 -784 -947 -807 -95 323 679 880 566 523 -311 -967 -744 -799 -325 246 648 735 1121 297 -447 -342
4208 -342 -1037 -838 -338 130 569 856 882 580 212 -644 -914 -781 -322 -37 509 1158 847 577 145 -386
4228 -386 -976 -961 -688 76 411 596 956 773 157 -153 -819 -789 -717 -37 126 584 971 892 280 -367 -797
4249 -797 -1073 -755 -354 203 837 1271 686 536 -138 -645 -841 -766 -479 225 759 564 635 772 88 -503 -1074
4270 -1074 -1028 -453 169 314 962 833 688 21 -568 -833 -897 -656 -81 471 584 801 768 318 -357 -947 -806
4291 -806 -636 -270 312 656 909 505 308 -499 -732 -940 -665 -222 363 805 981 754 447 -78 -680 -684 -937
4312 -937 -440 14 663 983 985 470 96 -401 -799 -706 -700 82 480 785 759 768 -283 -640 -965 -884 -213 -32 472
4335 472 714 817 717 110 -392 -789 -717 -666 -411 178 868 775 692 204 -188 -820 -500 -579 -120 90 445 1035
4357 1035 542 332 181 -333 -520 -221 -566 269 673 1160 961 562 -99 -346 -538 -831 -594 145 490 721
4377 721 669 581 -102 -400 -520 -668 -211 21 309 682 914 533 226 -433 -823 -1042 -440 -246 344 737 847
4398 847 452 181 -402 -815 -854 -685 -255 193 625 621 563 251 -117 -543 -732 -597 -350 130 384 697 666 180
4420 180 -33 -489 -902 -713 -284 67 542 613 772 391 229 -347 -659 -605 -232 32 414 261 829 381 142
4441 142 -367 -586 -767 -584 -6 477 896 907 536 184 -280 -769 -970 -849 -155 59 588 698 605 335 -95
4462 -95 -368 -723 -651 -295 -268 557 569 408 484 90 -751 -751 -562 -517 -84 897 781 677 276 33 -435 -562 -736
4485 -736 -307 -18 364 935 691 439 71 -149 -547 -741 -558 -216 320 697 701 177 160 -581 -628 -761 -414
4506 -414 -46 -6 690 837 591 287 -48 -535 -741 -664 -330 241 457 507 376 167 -454 -557 -799 -643 -313
4527 -313 301 505 659 753 277 -118 -488 -659 -564 -223 11 252 595 728 257 -148 -296 -593 -667 -447 103
4548 103 134 392 666 448 -55 -321 -899 -543 -503 -170 401 482 679 265 53 -250 -413 -675 -572 -517 313
4569 313 527 864 788 322 -114 -269 -498 -594 9 48 514 690 608 233 94 -494 -633 -660 -83 53 281 544
4591 544 713 391 39 -484 -468 -641 -510 145 361 515 712 545 224 -123 -332 -616 -631 -46 192 600 792
4612 792 713 337 2 -422 -478 -504 -85 454 452 463 398 270 -100 -629 -495 -640 -346 64 611 583 237 291 -110
4635 -110 -356 -442 -445 -270 79 413 390 557 311 -53 -283 -482 -585 -415 -95 181 375 588 511 -180 -137 -562
4657 -562 -450 -492 -583 251 495 435 288 -9 -208 -683 -528 -532 -169 246 708 469 347 275 -150 -157 -805 -332 -359
4680 -359 -26 542 436 549 206 -147 -257 -605 -403 -437 -19 530 432 413 164 -64 -397 -650 -527 -320 -97
4701 -97 168 769 451 362 137 -193 -663 -589 -273 -231 484 -8 602 435 330 -351 -522 -875 -468 -340 134
4722 134 459 729 311 64 -161 -439 -70 -419 -117 235 265 501 274 348 -180 -480 -749 -311 -273 18 486
4743 486 359 453 381 -76 -9 -428 -508 -391 -103 152 96 455 661 213 -359 -395 -483 -366 48 12 532 692 270
4766 270 -130 -374 -152 -477 -400 -57 297 317 573 199 35 -141 -585 -686 -335 -192 277 445 341 435 90
4787 90 -191 -402 -586 -319 -368 28 289 668 356 230 14 -568 -512 -497 -295 19 236 436 368 163 132 -468
4809 -468 -594 -732 -137 -120 230 493 568 351 205 -70 -641 -486 -309 -68 54 201 343 414 -76 -185 -504
4830 -504 -407 -174 -100 68 148 588 365 29 -348 -252 -367 -275 -613 57 491 658 395 291 -43 -305 -336 -616
4852 -616 -277 -94 358 579 228 250 -58 -447 -267 -632 -78 -193 179 501 334 176 -183 -193 -601 -575 -252
4873 -252 242 173 427 415 353 168 -278 -172 -367 -204 56 56 373 379 275 63 -295 -272 -457 -440 -41 -132 604
4896 604 375 356 130 -189 -67 -657 -473 -114 68 319 319 377 171 -46 -174 -431 -561 -330 105 325 355 189
4918 189 225 -57 -489 -388 -304 -389 -21 219 360 393 146 198 -248 -350 -613 -465 -121 377 374 658 251 30
4940 30 -157 -394 -317 -253 309 -20 274 152 382 -71 83 -333 -143 -237 -109 31 138 328 356 379 -224 -302
4962 -302 -488 -346 -195 90 404 479 556 158 49 -222 -292 -453 -259 -72 29 315 303 147 122 -248 -530 -268
4984 -268 -542 -79 61 398 349 75 197 -3 -434 -567 -260 -207 19 513 215 268 27 -441 -337 27 -209
5005 -209 -204 197 461 288 358 292 -15 -434 -417 -426 -35 -80 0 181 -22 -7 -248 -181 -387 -307 -224 30 352 290 262
5030 262 297 16 -98 -285 -469 -153 -16 182 242 465 382 -52 -300 -360 -385 -235 154 190 140 383 202 -88
5052 -88 -382 -73 -363 -379 43 108 326 272 426 183 -196 -203 -353 -403 -270 306 143 182 600 315 -59 -143 -652
5075 -652 -498 188 353 416 127 461 278 -280 -276 -220 -439 -408 -39 397 73 439 296 -254 -171 -326 -214 -372
5097 -372 -25 99 500 197 227 120 -68 -387 -274 -101 -123 176 45 387 227 361 -270 -171 -426 -118 10
5118 10 116 300 546 260 45 -48 -247 -143 -235 -73 -3 -151 303 501 42 39 -262 -605 -185 -62 -182 150
5140 150 245 190 195 -28 -435 -157 -520 -267 73 7 267 89 128 149 -62 -407 -309 -302 105 77 -229 410 285 -17
5164 -17 -194 -360 -234 -275 43 254 158 337 284 169 -138 -327 -268 -432 -112 174 294 476 463 123 10 -427
5186 -427 -541 -261 -50 69 277 250 36 138 90 -545 -106 -263 -95 165 300 370 -24 18 151 -161 -482
5207 -482 -325 -93 -210 238 214 161 406 3 241 -490 -129 -136 -108 203 191 177 -19 170 67 -463 -556 -50 -235
5230 -235 71 -86 193 -36 156 140 -309 -422 -302 -213 -133 257 202 6 283 -147 -216 -305 -431 -405 -119 297
5252 297 214 294 207 -58 38 -477 -290 -170 -191 -258 58 369 131 -92 -51 11 -165 -279 75 42 505 273 18
5275 18 102 23 -351 -365 92 -241 -105 344 201 22 -197 -19 -192 -237 -208 -71 421 393 288 248 110 -61 -29
5298 -29 -347 -83 -317 -248 339 360 148 236 2 -364 -405 -298 -129 0 110 253 166 46 13 -399 -287 -458
5320 -458 -163 -61 29 157 489 5 -87 -94 -67 -236 -331 22 24 121 275 67 186 -212 -333 -206 -161 62 173
5343 173 282 545 212 120 -89 21 -191 -244 42 129 -105 295 518 -79 -54 -162 -188 -342 -157 93 349 133
5365 133 250 150 58 -86 -373 -191 66 127 134 182 212 195 227 -180 -231 -98 -438 151 345 264 114 226 -108
5388 -108 -47 -290 -35 -274 -152 140 46 -121 120 -106 -153 -161 -398 -331 -184 380 324 191 178 236 -96 -308 -250
5411 -250 -229 -105 194 -142 210 178 54 -42 -118 -80 -86 131 53 122 308 402 -84 -167 -37 -234 -305 -265 103 97 140
5436 140 130 212 117 -87 -235 -82 27 -24 -131 424 71 18 167 -122 -269 -290 -304 -42 4 231 353 215 -103
5459 -103 -16 -143 -351 102 -106 79 170 264 337 170 -149 -302 -100 -95 -144 151 163 252 50 379 12 -148 -211
5482 -211 -50 -32 -17 78 282 314 257 -53 -144 -264 -7 -46 79 216 210 173 32 -158 -96 -500 -197 119 62 167
5506 167 395 391 327 297 -37 -286 -257 -5 -224 -102 43 169 91 114 -80 -141 -330 -147 89 26 101 430 300
5529 300 -116 39 -241 -328 -53 24 42 169 229 155 109 70 84 -354 -176 -181 -386 4 185 413 -70 115 -93
5552 -93 -275 -202 70 -25 108 180 155 347 104 130 -128 -39 -320 129 103 466 343 90 66 -119 -250 -1 -527
5575 -527 -246 107 469 261 84 215 -167 -146 -107 -362 -16 54 195 253 50 -63 102 -229 -151 -226 69 161
5597 161 185 467 60 -33 62 -291 -274 48 -163 128 -44 212 69 199 148 -314 -314 -164 -136 -128 417 -8 70 69
5621 69 40 38 -190 -298 -282 111 21 227 127 161 126 -318 -227 -447 -378 -216 87 292 143 286 143 -125 -314
5644 -314 -554 -279 95 -83 264 275 547 166 6 -151 -109 -470 -33 -86 -85 130 7 55 10 -233 -350 -59
5666 -59 -200 -113 279 77 222 199 201 -162 -52 -264 -152 -127 8 56 -49 350 13 -9 -284 -387 -183 107 -73
5689 -73 189 285 249 59 -227 -239 -101 -386 9 -28 32 199 -71 -94 -154 22 -489 -12 -56 58 22 187 435
5712 435 15 -70 -62 -119 -327 -190 13 190 -20 407 -172 -163 -250 -86 -96 -189 -209 -157 277 438 200 -22 -148 -93
5736 -93 -85 -198 -164 23 222 232 170 -170 -79 -164 -235 -284 -201 175 -77 174 217 43 -72 3 -147 -270 -315 108 111
5761 111 308 151 -59 49 43 -208 -184 59 92 80 332 76 447 -69 -280 -141 49 -97 169 71 282 210
5783 210 54 218 -73 -119 -168 251 -155 136 17 423 -46 -168 -21 -502 -255 -412 -28 -169 -101 295 227
5804 227 -124 78 -31 -237 -143 -21 149 164 -14 390 206 -27 -400 -132 -185 -229 91 184 524 445 223 -149
5826 -149 -200 -165 -432 -365 -20 102 58 203 271 102 -188 -232 -371 -129 -173 -13 203 353 253 248 -292 -263 -266 -159
5850 -159 -70 272 155 384 238 7 112 -391 2 -166 -363 -3 522 102 502 232 86 -180 3 -611
5870 -611 -252 389 28 132 71 276 38 -270 -381 -8 -144 129 -79 284 31 323 120 -226 -144 -307 127
5891 127 18 334 484 297 380 -50 -38 -361 -80 -285 13 152 321 217 444 35 -190 -257 -274 -371 10 125
5913 125 179 142 681 -7 222 -128 17 -208 -142 -14 -122 281 164 94 -56 26 -225 -161 -47 29 87 322 203
5936 203 74 -12 -172 -244 -65 -230 -87 38 431 415 208 378 95 -318 -300 -194 260 26 443 231 163 216
5958 216 -85 127 -155 -618 -184 -28 113 36 216 -124 -68 -66 -417 -165 -175 -17 275 81 150 416 -62 -18
5980 -18 -128 66 -62 -118 179 500 384 55 -58 -35 -193 -251 -196 -320 300 333 513 54 -177 -234 -92 -203
6002 -203 -204 61 134 283 275 306 163 -237 -194 -260 -482 -123 -96 383 614 176 121 77 -163 -346 -105 -74 47 55 44
6027 44 314 125 363 -82 -309 -291 -244 -169 34 -108 157 274 435 -148 -396 -383 -238 -84 295 93 278 298
6049 298 118 -104 -382 -390 -215 42 195 192 326 188 135 -183 -354 -115 -310 -113 156 496 360 347 185 227
6071 227 -1 -571 -349 -44 -45 162 209 210 54 -174 -14 -320 -204 -107 -113 353 507 408 79 136 -149 -391 -372 -209
6095 -209 104 223 319 397 56 116 -169 -248 -240 -177 -133 73 287 161 89 142 37 -298 -284 -235 -180 140 506 473 665
6120 665 -120 -75 -296 -156 -294 -93 171 254 535 158 370 -235 -260 -435 -540 -152 -98 115 380 290 223 184
6142 184 -17 -22 -102 -144 237 447 388 314 246 309 -169 -360 -435 -293 -25 185 396 327 271 -33 141 -80 -304 100
6166 100 -25 104 111 129 143 14 -11 -121 -274 -188 -70 165 66 -29 40 299 187 -152 -170 28 64 -205 267 224
6190 224 240 489 137 -144 -416 -238 15 53 -75 66 445 440 202 -101 -372 -197 -261 -176 176 139 312 342 -271
6213 -271 -147 -183 -398 -385 41 67 155 379 10 47 -118 -67 -409 -409 -201 -105 -21 381 174 191 -215 -375 -454 -31
6237 -31 -142 -94 106 182 241 209 -118 -186 -443 -238 -332 138 205 242 118 299 -105 -241 -491 -202 -78 -354 199
6260 199 417 426 155 150 -208 -692 -520 -405 -139 147 374 145 106 -171 37 -152 -235 -398 59 41 113 201 313
6283 313 -40 88 -179 -287 -320 -26 325 324 447 380 -22 -285 -8 -186 -178 71 257 334 414 322 315 311 -233 -295 -279
6308 -279 -135 -117 -63 253 185 315 56 -370 -100 -252 -36 -143 164 287 297 121 197 -405 -113 -380 -216 -78
6330 -78 -47 220 260 321 -161 122 -238 -458 -268 -415 -68 177 362 31 132 55 -154 -4 -230 142 -259 362
6352 362 86 445 -37 63 -53 -404 -256 -67 152 190 203 60 154 86 83 -180 -235 -281 195 -29 352 179 592
6375 592 121 -58 -393 -525 -156 -156 83 385 376 405 -12 -389 -366 -179 -158 -141 -74 267 388 404 87 85 -352 -141
6399 -141 -313 -81 -56 293 485 599 19 3 12 -268 -368 -276 91 81 84 93 230 259 -346 -399 -554 -206 -62 -18
6423 -18 554 284 337 229 -366 -462 -360 -262 60 206 224 441 390 -190 -322 -344 -490 -249 -221 45 306 354 172
6446 172 60 -107 -237 -276 -76 -206 -31 444 476 287 317 -251 -84 -63 -402 -97 12 318 459 165 256 -476
6468 -476 -61 -643 -451 113 -110 93 381 372 56 237 -84 -195 -216 -309 -32 98 305 483 288 171 -236
6489 -236 -296 -462 -137 -447 63 263 493 171 292 -70 -286 -427 -251 -123 143 300 387 203 50 -70 -174
6510 -174 -216 -265 155 80 336 282 609 3 -14 -279 -169 -35 -30 149 392 464 341 369 235 24 -322 -256 -310 340
6534 340 186 233 320 443 264 -132 -159 -411 -222 75 302 439 270 373 -33 -460 -191 -440 -246 172 2
6555 2 394 142 447 57 100 -161 -188 -258 28 -6 273 318 433 185 -74 -258 -478 -494 -292 -45 315 62 295
6578 295 103 -137 -248 -471 -463 -162 -32 126 353 695 230 -51 -119 -210 -634 -440 48 118 196 505 436 181
6600 181 -73 -308 -475 -264 -248 116 557 405 241 -24 -218 -185 -379 -390 -263 13 105 516 247 45 -11 -110
6622 -110 -324 -552 -144 115 60 463 473 416 177 -247 -181 -306 -117 136 405 560 198 314 230 -178 -170 -324
6644 -324 -110 -32 300 432 202 87 219 -194 -124 -387 -304 -64 87 331 165 409 153 91 -521 -358 -194
6665 -194 -196 319 -74 441 292 28 -55 -102 -187 -294 -9 25 271 256 445 229 81 -139 -190 -283 -264 21 30 412
6689 412 462 329 -124 79 -226 -220 -218 -431 70 171 237 196 -142 -201 -188 -290 -355 -154 -133 206 508 264 62 22
6713 22 -26 -341 -365 -87 563 397 599 293 156 -338 -117 -393 -277 23 42 389 381 436 223 8 -283 -337 -146
6736 -146 -316 121 185 251 484 168 94 -215 -271 -167 -24 63 106 313 283 442 158 -309 -265 -476 -195 -3 241
6759 241 425 350 256 367 69 -60 -350 -100 -168 111 276 169 541 282 143 -284 -373 -351 -196 323 413 76
6781 76 296 -59 44 -118 -425 -441 -296 -273 86 418 182 155 79 86 -217 -182 -93 -21 244 311 261 332 357 -214 -2
6806 -2 -480 -197 -138 -116 157 239 337 192 80 -284 -395 -292 -67 30 330 153 272 331 -96 -592 -219 -474 -347
6829 -347 -30 522 251 195 71 -178 -7 -476 -374 -108 -172 -25 562 361 347 176 -46 -371 -277 -323 -156 153
6851 153 271 342 -89 161 35 74 -340 -405 -169 26 194 512 260 28 0 -335 -567 -414 -32 237 240 487
6873 487 526 94 23 -168 -467 -475 -36 29 263 438 345 150 -26 -387 -353 -235 -206 101 344 433 198 10 138
6896 138 -244 -250 -480 -289 -176 439 283 91 343 116 -61 -351 -456 -271 -207 14 455 440 438 200 -59 -270
6918 -270 -440 -334 -384 38 461 265 450 320 -163 -377 -179 -275 -255 -60 252 339 393 192 -107 -182 -358 -106
6940 -106 33 -10 100 558 106 366 307 -114 -258 -201 -70 73 177 624 219 9 114 -346 -249 -241 -262 137
6962 137 246 581 368 210 328 -158 -630 -330 -401 -58 156 350 392 401 116 -286 -123 -425 -245 -266 58 220
6984 220 259 351 48 -51 -32 -456 -343 -6 21 365 178 552 110 -7 -178 -364 -226 -413 269 10 310 174
7006 174 270 81 -277 -113 -298 -133 -31 194 257 835 551 -30 -119 -259 -416 -18 146 58 449 320 31
7027 31 300 -54 -324 -652 -225 -340 -144 73 146 350 237 33 -302 -272 -532 -97 220 185 208 163 443 -427
7049 -427 -255 -443 -364 -131 218 314 369 316 289 244 -116 -336 -450 -282 23 187 478 342 145 355 -549 -427
7071 -427 -577 -329 48 73 159 499 400 46 103 -254 -363 -330 -305 -83 652 299 318 210 -59 -200 -95 -730
7093 -730 -292 12 311 515 666 89 68 -25 -356 -506 -337 67 492 165 325 222 38 -183 -194 -285 -50
7114 -50 -26 398 314 282 222 -46 -89 -430 -58 -171 133 -121 109 450 265 91 111 -406 -323 -199 -156 318 323 153
7138 153 339 264 88 -251 -285 -249 250 110 263 330 290 326 10 -271 -370 -287 -359 44 -36 396 606 466 -148
7161 -148 -141 -293 -441 -192 -12 399 386 402 56 -51 -230 -199 -223 -128 -6 337 487 173 276 189 -227 -378 -405
7184 -405 -440 23 344 460 525 160 164 49 -334 -182 -318 -379 108 254 413 325 202 -63 22 -442 -303 -150
7206 -150 92 355 324 441 113 26 -513 -16 -177 -378 -229 226 605 503 201 206 -245 -357 -425 -278 -89 134
7228 134 525 359 346 224 -217 -22 -165 -419 -122 5 544 303 106 -22 88 -454 -608 -169 70 423
7248 423 459 408 236 482 -1 -278 -254 -200 -193 20 306 407 323 188 47 -261 -500 -277 -29 -92 134 300 454
7271 454 388 134 -89 -300 -118 -366 -25 149 433 354 311 -80 -99 -315 -716 -311 -182 -24 193 244 493 35
7293 35 -25 -38 -543 -172 -268 248 371 253 430 189 14 -397 -405 -359 -44 310 195 142 352 136 5 -296 -373
7316 -373 -390 -98 -78 346 449 231 234 -64 -191 -426 -380 -412 123 113 227 332 279 -10 -242 -391 -36 -274 -72
7339 -72 228 85 559 154 328 -317 -216 -668 -352 -147 77 333 179 535 153 -198 -331 -336 -167 -267 -183
7360 -183 60 422 734 -28 -284 -100 -240 -185 51 -389 408 438 521 237 58 -211 -402 -305 -332 -106 279 139
7382 139 429 191 62 -284 -211 -369 -135 -94 212 354 349 363 47 53 -369 -331 -231 -200 125 441 433 191 179 -87
7406 -87 -411 -200 -258 -362 -50 374 471 318 87 -33 -50 -302 -201 25 333 166 433 76 -25 -231 -94
7427 -94 -358 -247 -372 19 376 194 538 485 234 -74 -214 -336 -223 -217 -43 349 376 289 -53 -126 -392 -654
7449 -654 -484 -394 -6 220 272 348 200 -120 -118 -296 122 -112 -259 283 325 209 345 28 -261 -277 -281 -360 63
7472 63 63 241 212 178 29 -145 -182 -188 -151 4 195 428 311 -27 -67 -143 -340 -94 -280 -38 91 -5 281 186
7496 186 127 21 -177 -308 -18 -12 238 112 170 363 141 -35 -85 -441 -280 -176 122 139 393 175 -37 -263
7518 -263 -100 -321 -421 -45 252 173 438 380 230 134 -467 -505 -459 -123 63 487 303 285 260 194 -327 -140 -377
7541 -377 -28 77 262 309 602 338 -130 12 -228 -148 -15 -105 73 246 203 274 -141 -101 -212 -434 -206 30
7563 30 -89 378 98 364 292 -139 -160 -430 -215 -178 118 -58 526 401 -17 -177 -42 -272 -386 -251 36
7584 36 327 341 392 131 -88 -246 -280 -559 -297 133 6 77 140 261 234 -196 -424 -203 -185 -94 145 436 225
7607 225 95 155 -33 -280 -182 -214 -130 315 375 433 374 223 -23 -142 -527 -496 -273 -144 87 471 15 112 193
7630 193 -96 -181 7 -139 161 138 429 296 387 68 -117 -396 -461 -176 79 150 228 79 273 273 -173 -68 -238
7653 -238 -321 -257 -118 384 428 474 -181 -220 -307 -256 -198 15 90 176 233 258 -90 -145 -83 -199 -192 -201 -187 -2 73 159 285
7680 285 -153 -50 -181 -307 -333 -215 238 117 157 208 -110 -93 -349 -231 -266 77 247 317 404 40 -78 -134 -131
7703 -131 -345 -291 -226 215 260 406 304 -61 -80 -163 -324 -187 -246 157 301 449 271 -178 -327 -187 -246 -260 188
7726 188 81 348 -6 274 110 -147 -289 -575 -117 109 136 291 434 349 225 72 -310 -344 -147 -49 224
7747 224 148 528 418 244 -140 -61 -232 -675 45 -66 100 123 151 245 -222 -180 -442 -464 -147 -239 34 181 166
7770 166 388 -53 -292 -418 -266 -327 -92 206 -92 479 205 305 -29 44 -227 -334 -117 355 -36 416 101
7791 101 286 69 -247 34 -182 -254 355 284 311 548 -72 -100 -414 -181 -339 -297 86 -17 338 448 139 -46
7813 -46 -197 -112 -170 -467 105 -79 156 384 187 34 -103 -74 -12 13 64 181 204 350 517 122 -167 -211 -162
7836 -162 -352 2 266 360 519 143 338 97 -421 -313 29 -23 -30 478 97 150 89 -11 23 -317 -451 196
7858 196 43 250 388 337 -7 158 -73 -380 -583 -2 102 -29 494 82 114 250 -28 -443 -252 -276 -242
7879 -242 91 260 377 370 143 10 -417 -331 -110 -78 -18 167 320 168 144 17 69 -216 -364 -85 -27 507 119
7902 119 181 131 -116 -16 -142 -77 -126 273 163 335 9 -117 82 -82 -290 -357 -72 141 41 189 209 324
7924 324 71 58 -393 -378 -93 -162 173 57 201 203 148 25 -204 -91 -189 2 34 296 274 538 87 99 -269
7947 -269 -547 -48 -194 122 298 344 85 84 -306 63 -197 -323 0 191 52 326 298 441 -230 69 -129
7968 -129 -237 78 -158 228 278 84 72 225 -138 -206 -56 -389 99 116 272 34 120 302 -219 -187 -457 -261
7990 -261 -293 -70 219 270 189 35 107 84 -469 -38 -166 -240 272 239 223 394 130 -354 -190 -139 -19 95 149
8013 149 307 -34 157 10 -339 -366 -284 -369 -4 422 297 164 210 44 175 -97 -28 -407 -66 157 106 355
8035 355 28 68 -41 -306 110 -197 4 79 146 181 200 320 -319 -12 -12 -57 73 260 266 228 49 -197 88 -315
8059 -315 -116 -182 64 154 199 323 257 -211 -32 -14 -383 -232 -267 14 208 324 223 16 -39 -183 -189 -71 -148
8082 -148 118 147 449 278 116 77 26 -256 -217 -254 41 -88 158 433 323 67 12 -114 -442 -49 -211 152
8104 152 129 371 196 314 203 -430 -152 -248 -140 0 255 282 155 142 -177 82 -229 -499 -178 -310 189
8125 189 104 287 -187 43 -26 -206 -269 -160 -129 -11 278 361 298 27 -4 -7 -149 44 382 78 -114 247 212
8148 212 -91 -24 36 -529 -337 171 252 276 394 19 325 -258 -109 -268 -209 7 282 75 285 236 -206 -122
8170 -122 -224 -373 -380 -314 106 40 66 520 116 56 39 -184 -38 -131 68 155 117 338 -140 -21 -325
8191c25
##END NTUPLES=NMR FID
##END=
