##TITLE=1H_DE-128H
 200.13MHz,D2O.
 8 sc
 
 20.2.2026
##JCAMPDX= 6.0         $$ Bruker NMR JCAMP-DX V2.0
##DATA TYPE= NMR FID
##DATA CLASS= NTUPLES
##ORIGIN= UXNMR, Bruker Analytische Messtechnik GmbH
##OWNER= pz
$$ XWIN-NMR		Version 3.5
$$ Fri Feb 20 13:57:18 2026 Russian Standard Time (UT+4h)  she@DPX200
##.OBSERVE FREQUENCY= 200.1313
##.OBSERVE NUCLEUS= ^1H
##.DELAY= (6, 6)
##.ACQUISITION MODE= SIMULTANEOUS
##.ACQUISITION SCHEME= undefined
##.AVERAGES= 8
##.DIGITISER RES= 18
##SPECTROMETER/DATA SYSTEM= spect
##.PULSE SEQUENCE= zg30
##.SOLVENT NAME= D2O
##.SHIFT REFERENCE= (INTERNAL, D2O, 0, 14.3821)
##AUDIT TRAIL= $$ (NUMBER, WHEN, WHO, WHERE, WHAT)
$$ ##TITLE= Audit trail, XWIN-NMR		Version 3.5
$$ ##JCAMPDX= 5.01
$$ ##ORIGIN= Bruker BioSpin GmbH
$$ ##OWNER= she
$$ F:/spectra/data/she/nmr/H-C/1/audita.txt
$$ ##AUDIT TRAIL=  $$ (NUMBER, WHEN, WHO, WHERE, WHAT)
(   1,<2026-02-20 13:56:02.51 +0400>,<she>,<DPX200>,
      <created by zg, POWCHK disabled, PULCHK disabled
       configuration hash MD5:
       00 E9 B6 7A A2 85 ED C7 34 08 36 98 17 FE 4E 26
       data hash MD5: 16K
       D6 7F 8B 5B 48 80 C8 00 79 9A DE 41 E8 E2 EA 03>)
$$ ##END=
$$ 
$$ hash MD5
$$ F4 BD 9D 9F 92 12 15 6A 8A 91 69 50 A2 DE D4 26
##$RELAX= 
##$RELAX= 
##$RELAX= 
##$RELAX= 
##$RELAX= 
##$RELAX= 
$$ Bruker specific parameters
$$ --------------------------
##$DU= <F:/spectra>
##$EXPNO= 1
##$NAME= <H-C>
##$PROCNO= 1
##$TYPE= <nmr>
##$USER= <she>
##$AMP= (0..31)
100 100 100 100 100 100 100 100 100 100 100 100 100 100 100 100 100 100 
100 100 100 100 100 100 100 100 100 100 100 100 100 100 
##$AQSEQ= 0
##$AQ_mod= 1
##$AUNM= <au_zg>
##$AUTOPOS= <>
##$BF1= 200.13
##$BF2= 200.13
##$BF3= 200.13
##$BF4= 200.13
##$BF5= 200.13
##$BF6= 200.13
##$BF7= 200.13
##$BF8= 200.13
##$BYTORDA= 1
##$CFDGTYP= 0
##$CFRGTYP= 5
##$CHEMSTR= <none>
##$CNST= (0..31)
1 1 145 1 1 1 1 1 1 1 1 1 1 1 1 1 1 1 1 1 1 1 1 1 1 1 1 1 1 1 1 1 
##$CPDPRG= <>
##$CPDPRG1= <>
##$CPDPRG2= <>
##$CPDPRG3= <>
##$CPDPRG4= <mlev>
##$CPDPRG5= <mlev>
##$CPDPRG6= <mlev>
##$CPDPRG7= <mlev>
##$CPDPRG8= <mlev>
##$CPDPRGB= <>
##$CPDPRGT= <>
##$D= (0..31)
0 0.7 0 0 0 0 0 0 0 0 0 0.03 0 0 0 0 0 0 0 0 0 0 0 0 0 0 0 0 0 0 0 0 
##$DATE= 1771581361
##$DBL= (0..7)
120 120 120 120 120 120 120 120 
##$DBP= (0..7)
150 150 150 150 150 150 150 150 
##$DBP07= 0
##$DBPNAM0= <>
##$DBPNAM1= <>
##$DBPNAM2= <>
##$DBPNAM3= <>
##$DBPNAM4= <>
##$DBPNAM5= <>
##$DBPNAM6= <>
##$DBPNAM7= <>
##$DBPOAL= (0..7)
0.5 0.5 0.5 0.5 0.5 0.5 0.5 0.5 
##$DBPOFFS= (0..7)
0 0 0 0 0 0 0 0 
##$DE= 6
##$DECBNUC= <off>
##$DECIM= 32
##$DECNUC= <off>
##$DECSTAT= 4
##$DIGMOD= 1
##$DIGTYP= 9
##$DL= (0..7)
0 120 120 120 120 120 120 120 
##$DP= (0..7)
150 150 150 150 150 150 150 150 
##$DP07= 0
##$DPNAME0= <>
##$DPNAME1= <>
##$DPNAME2= <>
##$DPNAME3= <>
##$DPNAME4= <>
##$DPNAME5= <>
##$DPNAME6= <>
##$DPNAME7= <>
##$DPOAL= (0..7)
0.5 0.5 0.5 0.5 0.5 0.5 0.5 0.5 
##$DPOFFS= (0..7)
0 0 0 0 0 0 0 0 
##$DQDMODE= 0
##$DR= 18
##$DS= 0
##$DSLIST= <SSSSSSSSSSSSSSS>
##$DSPFIRM= 0
$$ [...]
##$SUBNAM0= <"">
##$SUBNAM1= <"">
##$SUBNAM2= <"">
##$SUBNAM3= <"">
##$SUBNAM4= <"">
##$SUBNAM5= <"">
##$SUBNAM6= <"">
##$SUBNAM7= <"">
##$SUBNAM8= <"">
##$SUBNAM9= <"">
##$SW= 18.0517328524113
##$SWIBOX= (0..15)
0 0 2 0 0 0 0 0 0 0 0 0 0 0 0 0 
##$SW_h= 3612.71676300578
##$TD= 16384
##$TD0= 1
##$TE= 0
##$TE2= 300
##$TE3= 300
##$TEG= 300
##$TL= (0..7)
0 120 120 120 120 120 120 120 
##$TP= (0..7)
150 150 150 150 150 150 150 150 
##$TP07= 0
##$TPNAME0= <>
##$TPNAME1= <>
##$TPNAME2= <>
##$TPNAME3= <>
##$TPNAME4= <>
##$TPNAME5= <>
##$TPNAME6= <>
##$TPNAME7= <>
##$TPOAL= (0..7)
0.5 0.5 0.5 0.5 0.5 0.5 0.5 0.5 
##$TPOFFS= (0..7)
0 0 0 0 0 0 0 0 
##$TUNHIN= 0
##$TUNHOUT= 0
##$TUNXOUT= 0
##$USERA1= <user>
##$USERA2= <user>
##$USERA3= <user>
##$USERA4= <user>
##$USERA5= <user>
##$V9= 5
##$VALIST= <valist>
##$VCLIST= <CCCCCCCCCCCCCCC>
##$VD= 0
##$VDLIST= <DDDDDDDDDDDDDDD>
##$VPLIST= <PPPPPPPPPPPPPPP>
##$VTLIST= <TTTTTTTTTTTTTTT>
##$WBST= 1024
##$WBSW= 4
##$XGAIN= (0..3)
0 0 0 0 
##$XL= 0
##$YL= 0
##$YMAX_a= 107238
##$YMIN_a= -115013
##$ZGOPTNS= <>
##$ZL1= 120
##$ZL2= 120
##$ZL3= 120
##$ZL4= 120
##$ABSF1= 10
##$ABSF2= 0
##$ABSG= 5
##$ABSL= 3
##$ALPHA= 0
##$AQORDER= 0
##$ASSFAC= 0
##$ASSFACI= 0
##$ASSFACX= 0
##$ASSWID= 0
##$AUNMP= <proc_1d>
##$AZFE= 0.1
##$AZFW= 0.1
##$BCFW= 1
##$BC_mod= 2
##$BYTORDP= 1
##$COROFFS= 0
##$CY= -3
##$DATMOD= 1
##$DC= 2
##$DFILT= <>
##$DTYPP= 0
##$F1P= 0
##$F2P= 0
##$FCOR= 0.5
##$FTSIZE= 0
##$FT_mod= 4
##$GAMMA= 1
##$GB= 0.15
##$INTBC= 1
##$INTSCL= 1
##$ISEN= 128
##$LB= 0.25
##$LEV0= 0
##$LPBIN= 0
##$MAXI= 10000
##$MC2= 0
##$MEAN= 0
##$ME_mod= 0
##$MI= 1.114404
##$NCOEF= 0
##$NC_proc= 0
##$NLEV= 6
##$NOISF1= 3.799351
##$NOISF2= 2.8
##$NSP= 1
##$NTH_PI= 0
##$NZP= 0
##$OFFSET= 14.38212
##$PC= 1
##$PHC0= -3702.552
##$PHC1= 9.79232
##$PH_mod= 1
##$PKNL= yes
##$PPARMOD= 0
##$PSCAL= 0
##$PSIGN= 0
##$REVERSE= no
##$SF= 200.129724274929
##$SI= 16384
##$SIGF1= 3
##$SIGF2= 2
##$SINO= 400
##$SIOLD= 16384
##$SREGLST= <1H.CDCl3>
##$SSB= 0
##$STSI= 0
##$STSR= 0
##$SW_p= 3205.1282051282
##$SYMM= 0
##$S_DEV= 0
##$TDeff= 0
##$TDoff= 0
##$TI= <>
##$TILT= no
##$TM1= 0
##$TM2= 0
##$TOPLEV= 0
##$USERP1= <user>
##$USERP2= <user>
##$USERP3= <user>
##$USERP4= <user>
##$USERP5= <user>
##$WDW= 1
##$XDIM= 8192
##$YMAX_p= 0
##$YMIN_p= 0
$$ End of Bruker specific parameters
$$ ---------------------------------
##NTUPLES= NMR FID
##VAR_NAME=  TIME,          FID/REAL,        FID/IMAG
##SYMBOL=    X,             R,               I
##VAR_TYPE=  INDEPENDENT,   DEPENDENT,       DEPENDENT
##VAR_FORM=  AFFN,          ASDF,            ASDF
##VAR_DIM=   8192,          8192,            8192
##UNITS=     SECONDS,       ARBITRARY UNITS, ARBITRARY UNITS
##FACTOR=    0.0002768,     1,               1
##FIRST=     0,             0,               0
##LAST=      2.2672688,     0,               0
##MIN=       0,             -115013,         0
##MAX=       2.2672688,     107238,          0
$$ Real data points
##PAGE= N=1
##DATA TABLE= (X++(R..R)), XYDATA
$$ [...]
1702d01L16L72J76K35j55m58l59k83j12N9N9Q09L73J52k84k03k85m07k06o8L11
1723c59M98M83J25k52l73j34l78m92J90L55M59M38NKl4o81l89k35J53K76M99J44
1745C00J83J48l77k02k26m04j62L71L05L37J32K19j49m29m43k23LK34N10o1L85
1766D51K21j62l07l63l96J84m9K48L40M67j67j44j37m66j86m1L7R0L27M85M5j46
1788C31j68m9j64m89lN49K2L12L38j71j65m47l29j71J72K48L46N2L95n1l45k87
1810g4l00k5l07N01K1N93jK24j28l06l21k94l6J71J55K00L12O0j17l79k50Ok02
1833d97K4N39k7L28N3J03n35j70l74J39R5J34M28J00J53j07k14k34m22r4O6J48
1855c64M59L44R4J3j80m39k67k02NJ67L07O10l37J78J22l62n64kn5M8M59R7L05
$$ plain form
1702 -401 -85 287 463 698 543 85 -274 -557 -669 -610 -551 258 631 783 499 296 11 -396 -602 -670 -359
1723 -359 139 622 747 495 122 -12 -390 -882 -692 -337 122 560 565 567 533 -148 -537 -772 -619 -343 156 300
1745 300 483 631 254 52 -174 -578 -740 -369 -64 273 405 624 475 46 -397 -620 -617 -383 127 66 451
1766 451 672 510 203 -160 -556 -372 -421 -173 167 634 467 323 186 -280 -466 -507 -470 -380 -53 432 477 331
1788 331 163 114 -50 -539 -542 7 29 341 679 508 343 -104 -433 -604 -432 -184 162 214 609 558 213 -74
1810 -74 -374 -399 -706 -205 -184 409 408 632 504 198 -123 -417 -453 -282 -127 73 385 445 328 -51 -301 -295 -497
1833 -497 -473 66 39 367 420 523 -12 -182 -556 -417 -322 -188 240 340 493 386 172 -62 -484 -578 -512 -364
1855 -364 95 439 533 546 366 -73 -340 -542 -537 -370 -63 547 210 388 510 148 -416 -418 -473 -425 34 131 436
1878D36n3N4m40k64r0l8N3J81K84K19K73k21m04l03j0j29J74P3K94J62J91N0m31
1901F1k95k22J98o5J58K73L04k04J5O0j60l91j51K07M5L37J59rL7k39k84l5m52
1924f53K67K76j1K24M19j9k49k31k56k14qK52K26K72o8N9j08n28J65j76j17N08
1946C0P7o1L13j03Mj44l85j37O7K91M6K66J23Q9j80m1n13J28l29L80N3J62L83
1969E19k0j90j39l10k57j53K66K84Q8J66J86k04j84K4l37m6r1J99QM48m2j00p3
1992D2O0l92j50J64J03K93J52QM6j50j79l69K5r6J61L83O2N8K06p1m45k81p6l8
2016d84K14K95K82J51o5lq3m99J14k70L10p1K56K18J66j72k81k62m5r9J48J35
2038d5J86K8O3J53m42j15l8j84J82j06M93l6K39j12m2j71k40k23M4N3L71L17k29
$$ plain form
1878 436 383 437 -3 -267 -357 -395 -342 -161 123 342 615 394 -10 -313 -323 -452 -278 -205 89 251 442 492 61
1901 61 -234 -456 -258 -323 -165 108 412 208 223 283 123 -268 -419 -212 -167 170 329 320 357 118 -166 -201 -653
1924 -653 -386 -110 -121 103 522 503 254 23 -233 -447 -455 -203 23 295 227 286 178 -350 -185 -361 -478 30
1946 30 107 46 359 256 260 116 -269 -406 -339 -48 -2 264 387 476 296 255 -258 -130 -459 -79 -26 136 519
1969 519 499 309 170 -140 -397 -550 -284 0 88 254 440 236 52 76 -261 -307 -398 -199 -191 257 215 115 42
1992 42 102 -290 -440 -276 -173 120 272 280 326 176 -3 -372 -347 -443 -282 101 163 221 427 356 -89 -370 -446 -484
2016 -484 -270 25 307 458 393 390 307 -192 -78 -348 -38 -109 147 365 531 359 78 -184 -229 -328 -180 -45
2038 -45 141 169 232 385 -57 -172 -210 -394 -212 -318 175 139 378 266 224 53 -187 -410 -366 -313 58 375 146
2061A46N6k32J13k76l4J14m1K82k1l6J72n9m09N7j65Q3J57L30q5J03m3Nk84j19
2085a86j48Q7k8K35L41j25P4j06ml35j78P3J9L58J70j01K08l21n5k32Q2j83L5
2108c20J62J57J95j3j39R5j00l76n0K55K4Q1M55r2l02R4k34k83K92k55L39J13
2130I8J30r3J1M6k51j29j85J12n8L31J71no5J4k22P9j0Jj3n5K53Q5j00o3r6j79
2156a93j73J14K49j91M71j31K08M0n18J36j93j13K1J09L19K17J0k00J06k41l22
2177b75J04mM3K1N34j50j66j50J30k33j73J85k10M37L42k34J38k93N6m50J45J62
2199d1lJ47qJ02K16l80m1j38k85J97Q9K4K22l3K01j07j2j89k05j0o4K76J16L25
2223C99l11K03j62l93J12j90J37J41J28K78q1K2k44j05k13M1j3N3J91K45M4n9
$$ plain form
2061 146 202 -30 83 -193 -227 -113 -154 128 107 71 243 184 -225 -168 -333 -250 -93 237 152 255 212 217 -67 -186
2085 -186 -334 -247 -275 -40 301 176 250 144 140 -195 -373 -300 -281 77 247 146 354 33 -22 -254 -172 -355 -320
2108 -320 -158 -1 194 181 42 137 37 -339 -389 -134 -110 -29 426 334 32 126 -108 -391 -99 -354 -15 98
2130 98 228 135 146 192 -59 -188 -373 -261 -319 12 183 178 113 127 -95 -16 -26 -25 -38 -93 160 245 145 82 -14 -193
2156 -193 -366 -252 -3 -194 277 146 354 394 -124 12 -181 -294 -273 -164 155 372 382 182 288 47 -275
2177 -275 -171 -175 -132 -111 423 273 107 -43 87 -146 -319 -134 -344 93 435 201 339 46 102 -348 -203 -41
2199 -41 -44 103 95 197 413 33 -8 -146 -431 -234 -145 -121 101 68 269 162 150 -39 -244 -254 -318 -42 74 399
2223 399 88 291 129 -264 -152 -342 -205 -64 64 342 261 283 39 -66 -279 -238 -251 -198 -7 238 282 223
2245B23o1j39k16O8k13J52K37L37j06k3j34j84j55o1k2K03M6K85%l41K41j76j98
2268b37K13n9j57J96K62N6p5n9m06J09J89j22J22j18O4o8J91K76k76l29P0J02
2290e6j57J51M06k41L55l91J43k12k88O5P0K41j84J69Q0J47k09m10K09k49QL07
2312d6R9k3K39p2r3j8m63K98j93n8J10K51K58j14m2k26l0R4Lj20K6K97rl8r6j24
2338i0J10l07J26m2KL14K52j28j75J6j62r2K4L1R6K30J22j47J94n13L7Ol7j24
2362b57J32J64J70n3j78m4r5P0K8j82M38k47K20J49k39J03o4k46k23kO5M95k38
2385c4N15l60k7k13j53K21j12K35J32q9N2Kj07r1r2m0K4n3K66J7O6j24N0L7k67
2410a45Q6j3J37k9j28J25K74k22j85J9n8k7J01oK31Q4m8J91l89R4J1m8j77O2n8
$$ plain form
2245 223 162 23 -193 -125 -338 -186 51 388 282 259 125 -59 -214 -275 -297 -94 -48 237 237 -104 137 -39 -237
2268 -237 -24 -83 -240 -44 218 274 199 140 -266 -157 32 -90 32 -86 -22 -90 101 377 101 -228 -158 -56
2290 -56 -213 -62 344 103 458 67 210 -2 -290 -225 -155 86 -98 71 151 298 89 -321 -112 -361 -353 -46
2312 -46 53 30 269 197 104 86 -377 -79 -272 -330 -220 31 289 175 133 -93 -123 -29 -26 -146 -120 177 168 130 34 -90
2338 -90 20 -287 -161 -203 -201 113 365 237 62 78 -84 -176 -152 -121 -25 205 327 180 374 -139 -102 -96 -133 -257
2362 -257 -125 39 209 156 -22 -66 -161 -91 -63 -245 193 -54 166 315 76 179 115 -131 -354 -356 -291 204 -34
2385 -34 481 121 94 -119 -272 -51 -163 72 204 115 167 169 62 -29 -121 -161 -137 -190 76 93 159 35 85 122 -145
2410 -145 -59 -72 65 36 -92 33 307 85 -100 -81 -139 -166 -65 -71 160 244 196 387 -2 92 103 55 -122 -60 -118
2435a18K20L4r5J89k10Jj70R2jJ20nn9K56j51j70k20J33k5K28O8l6m3L3R8j7j71
2461a9r5j19K1J67J13J96O2j10k31n3P0j83o6NK46K62l5j30j66j18j36M7R5M5
2485a32J40K32%j94j84J20j72l0J09K1J66Q9j32Q5jj63j26K37k95qK97l3K66J1
2509C03k61J07o3j87J13j62J55p8K54k3%r0j79K20k73m3j9M53j43Q3j32k8j84
2532a77L4p0R8O3r2K81j7j13R8r0j18q0K41j65N8J07K92j30k21j44j62K05K3Q
2556g1j61K50K45k6j15j99M9l88R9K3K68K39j61O7l8q2m0j07p5M0mK21J50j51
2580C3J49m3k67k11Q5J33J21J56R7Q0k34R1j60l18m0J90L4K46J4K2j92Q8l68L17
2604B3j62j2k8J25K18L6m4Kl02j8J78k57J74J28J09j53L17j60l85M4j01K84j97
$$ plain form
2435 -118 102 136 41 230 20 21 -149 -57 -58 62 57 -2 254 103 -67 -287 -154 -179 49 117 81 38 71 169 152 -19
2461 -19 -114 -233 -212 -45 68 264 326 216 -15 -68 2 -181 -247 -242 4 266 231 101 -65 -183 -319 -272 -177 -132
2485 -132 8 240 240 46 -138 -18 -190 -220 -111 -90 76 165 33 118 117 -46 -172 65 -230 -238 59 26 292 303
2509 303 42 149 86 -101 12 -150 5 -73 181 158 158 68 -111 109 -164 -207 -226 227 84 167 35 7 -177
2532 -177 -143 -213 -115 -52 -144 137 120 7 105 15 -103 -183 58 -107 -49 58 350 220 -1 -145 -307 -102 -79 -71
2556 -71 -232 18 263 237 122 -77 -28 -416 -317 -294 -26 213 52 119 81 -1 -41 -148 -223 -183 -187 34 184 33
2580 33 182 139 -128 -339 -254 -121 0 156 253 333 99 190 30 -288 -328 -138 -104 142 156 178 -14 74 -294 23
2604 23 -139 -151 -179 -54 164 200 156 158 -144 -162 16 -241 -67 61 170 17 334 174 -211 -167 -268 16 -181
2627a81J80Q1p0P1J21j15k12K0j73Q4kO1J65K24J5j19q0k90K02j22K9M8R6J34
2651A67K19j93j43qP9j86J59R5k35J49M7l09K28r9r1P4r7R9J50q5J23K05l61k44
2675b57K39j66J72j21J71K49j50J41k18Qj93k62L07J86J20Q1j83J56l34j33j00
2696b87P3J87n5K13p3K6J67l83P7m3o4KO6J92n9J01J90m31J23l92jJ69N4M8K49
2721A49K5oj28R4j94l6o7J22J35N1L9j09N0J6j71k12J66j32L08j55K13K0J18j13
2745A83k43l60J77K73l15K36p0J01P8n2k21K30j90R1J47j36J86O0k7j60K15m33
2767b30QJ91j59K81rJ84J9j90k21K01l86J6L14J75l19M01j13k37j5m5J4m0M8k3
2791a35N4L76k5j66q8j09j14j51L01n5L47j27J01q2j49J1k03o1J86J06o5K70k96
$$ plain form
2627 -181 -1 80 10 81 202 87 -125 -105 -278 -194 -196 -135 30 254 269 150 70 -220 -18 -140 -111 -63 33 167
2651 167 386 193 50 42 121 -65 94 189 -46 103 150 -159 69 -30 -121 -47 -144 -45 105 20 143 348 -13 -257
2675 -257 -18 -184 -12 -133 38 287 137 278 60 68 -125 -387 -80 106 226 307 124 280 -54 -187 -287
2696 -287 -214 -27 -82 131 58 84 251 -132 -55 -98 -162 -160 -94 98 39 140 330 -101 22 -370 -371 -202 -148 -100 149
2721 149 174 168 40 134 -60 -96 -163 -41 94 145 184 75 125 141 -30 -242 -76 -208 100 -55 158 178 296 183
2745 183 -60 -420 -243 30 -285 -49 -119 -18 60 8 -213 17 -173 -82 65 -71 115 175 148 -12 203 -230
2767 -230 -222 -31 -190 91 82 266 285 95 -126 75 -311 -295 19 194 -125 276 163 -74 -89 -134 -120 -160 -112 -135
2791 -135 -81 295 270 104 16 -93 -207 -358 -57 -112 235 108 209 127 -22 -11 -214 -275 -89 17 -48 222 -74
2814g4J47j35l1o2q3K96l56K12L11j66lQ2j83k58M0qK08L33P6j72j34J46k38r7
2838a49j03pK74j13K53p4r1O2K6j40nm2J75r6J43J57j26K07n18J67j30lQ1M8j07
2863a11K38J51k33k18J46k1K9j56J32PK29M1j39R7k66j25J16j67K65m4J76qJ1
2886A50l23K15l6j82j44N4M17l2J56l66K29n0j34j36J20j28NK51J13J55j35r5
2908A04Q0n63J19j04K49M2kJ12J18k93J6K9K13r9j2k0q2K59o1r6j21K5N3j02R1
2933d5Q7j4J39J72k16m8k3j93q3R3J57J07PK3j42r5M5l10J25J46J0J15J1o5M3
2958D6Q6l11P2n4l6J25qJ42K41j94L0j30J18j92l4j0Q4n4K76k00J77j34j82P6
2982f6l4L13J29k75J42O6m5k31j02j83O2L4N5J71J31O0k49J32j47k01J56q4K00
$$ plain form
2814 -74 73 -62 -93 -155 -238 58 -298 -86 225 59 56 138 -45 -303 -263 -271 -63 270 346 174 40 186 -52 -149
2838 -149 -252 -259 15 -98 155 81 -10 52 78 -62 -67 -109 66 -30 113 270 144 351 -167 0 -130 -133 -52 -4 -111
2863 -111 127 278 45 -173 -27 -48 -19 -175 -43 -36 193 234 95 192 -74 -199 -83 -250 15 -29 147 139 150
2886 150 -173 42 6 -176 -320 -266 151 119 275 -91 138 88 -46 -182 -62 -190 -185 66 179 334 199 104
2908 104 184 -379 -260 -364 -115 -73 -75 37 155 -138 -122 -93 120 21 9 -11 -93 166 105 9 -112 -87 -34 -136 -45
2933 -45 42 28 167 339 123 75 52 -141 -224 -131 26 133 140 163 21 -74 -29 -339 -214 -68 -58 57 68 3 46
2958 46 132 -179 -107 -161 -197 -72 -80 62 303 109 139 9 127 -65 -99 -109 -25 -79 197 -3 174 40 -142 -66
2982 -66 -100 213 342 67 209 275 230 -1 -103 -286 -224 -190 -135 36 167 227 -22 110 -37 -238 -82 -166 34
3005C4j08J86KJ20j39k3k65J36R1k5K77n8J3j71R3j47O8l95K44n7O9K72j77K31
3029B71j97r9J5k00m4J82J19O1P4qj64M9q6j90q7M31j14k67K74J85j3l03k34M17
3053G2j93o6J61K9L51k35M5j59Lk32R8J65R3l4J00j39mj3LMj46j79K56o0qL24
3079B36k36M7k62J21j23N8J6K08J05j44JL6Kq4P9k08PK28J89j44j54J26L0l56
3103b22J74q3O4L3K00O6j73O5j56j16K45l31J55j6J64N4J61j10l52J90r5N6j53
3126a80K1K47J4J51j86J06j57k47J00m4K10q3K07l8J22l17K1j99R1L5K28j53K0
3149c1j44M60j21j04j64n0J32kj67J49J14Q0k91O1J10l08L68l43K41L8o2K37p3
3172A30j01m0J00j96J58O3r4J99k23l0J40l38j1J64J6J61j90J47K17m7j25kk92
$$ plain form
3005 34 -74 112 114 234 95 72 -193 -57 34 9 286 228 241 70 163 16 84 -311 -67 -124 -55 217 40 271
3029 271 74 -25 -10 -210 -254 -72 47 108 182 174 10 59 -27 -217 -304 127 13 -254 20 205 192 -111 -345 72
3053 72 -121 -187 -26 3 354 119 164 5 8 -224 -126 39 132 98 198 59 55 42 45 49 -97 -276 -20 -80 -88 236
3079 236 0 47 -215 -94 -217 -159 -143 65 170 26 27 63 65 -19 60 -148 -141 87 276 132 -22 104 134 -222
3103 -222 -48 -131 -67 -34 166 232 59 124 -32 -148 97 -234 -79 -95 69 123 284 174 -178 12 -83 -27 -180
3126 -180 -159 88 102 253 67 173 16 -231 -131 -175 35 -48 159 121 243 -74 -53 -252 -161 -126 102 -51 -31
3149 -31 -175 285 164 60 -104 -154 -22 -24 -191 -42 72 152 -139 -78 32 -276 92 -251 -10 28 -34 203 130
3172 130 29 -11 89 -107 51 114 20 219 -4 -34 106 -232 -243 -79 -63 98 -92 55 272 225 100 98 -194
3195a94Q4m5R1L5k7R3J9j05l2K24j09m5j20J35L3Q4K05k84M3j50p9Np3j82N15
3220A21p2j09K41k71N0j91m3K85K3J35Q3m9j94l9j18Q4k96M62j37J67j55Q8Qn6
3244A7J10j51j68l6R7L31j04J31l17J16L8P1k00o8Q7j16L35M2k06J05M0l63J78
3267c1j48J83OJ68o0q4j52J07r8k5K49k05%J27j3J62K13l32P0k49j6oK77o5k1
3292E7J03j38kj86K87k74n1J51O4M9J16r3o5q4J8j99K01o6J3nJ91j50N9L2O7j37
3318d2L4j6Q8j51K38r4k31K91j49j28J98Nr5K11j35L7j33N4k8K4p1K3M2k1J67
3343A18L2L4l56J34j16r6J49J02l53M98o9K5J9j27o6m9K01k16J11J11q4M2j51
3366a07nO6J24n7k18K0L72Kj50L40k43j83J87l88K31J8J26J60l32J14k61N8r2
$$ plain form
3195 -194 -110 -155 -64 -29 -56 37 56 -49 -81 143 34 -11 -131 4 37 121 326 42 85 -65 -144 -139 -212 -394 121
3220 121 49 -60 181 -90 -40 -231 -274 11 34 169 252 203 9 -30 -148 -64 -360 102 -35 132 -23 65 73 17
3244 17 127 -24 -192 -228 -131 200 96 227 -90 26 64 135 -65 -133 -46 -162 173 215 9 114 154 -209 -31
3267 -31 -179 4 10 178 118 34 -118 -11 -109 -134 115 -90 -90 37 24 186 399 67 137 -112 -128 -134 143 78 57
3292 57 160 22 20 -166 121 -153 -204 -53 11 60 176 83 18 -66 -48 -247 -46 -112 -99 -104 87 -63 -4 28 95 -42
3318 -42 -8 -24 64 -87 151 57 -174 117 -32 -160 38 43 -52 159 24 61 -72 -18 -46 -22 -93 -70 -28 -49 118
3343 118 150 184 -172 -38 -154 -250 -101 1 -352 146 77 102 121 -6 -72 -121 80 -136 -25 86 2 44 -107
3366 -107 -112 -46 78 21 -197 -177 195 197 47 387 144 -39 148 -240 -9 9 135 295 -37 77 -184 -126 -218
3389b18J93J40k70L11j74J83j45p8k05J57K3q7J42P8p3n3M0k7l7N5o1K09j91K34
3413A46K4j56Q1j62o2Q1j9j22R4M9n4L16r6K51k92l93L0L97o1N5j46J15K3r2L
3438A0m9r1J56O6P7k87J68r9L3J43J3o5j52R7M7J9p5K46j60j26L1j42K72k27J60
3463F5j18k48M10j78K39k23K85k60j13J0j24L94r3R6k99J43j20P8j44J02K0R0
3485A2K33r4j03j54J7j1K04l07K55j34O7L2J99k70M4N8j06O5RL04j89p1l0k02
3509a72P4m2r4J3K90q2J9o9L12j47j20j00K76k25j29K15Q1j60J19J14m17J88o8
3532a24N7%n2J1K65q8lk25J54L3J76l70J28Q0r8QQ5q3j83O5K70q9M3N7m3k8J97
3559B43l28J9j35J6K57j26K08j56J06k07j00K63j80J97J4n7J56o6K7l64P9K37
$$ plain form
3389 -218 -25 115 -155 156 -18 165 20 -58 -263 -106 -83 -170 -28 50 -23 -76 -36 -63 -100 -45 -106 103 -88 146
3413 146 170 14 95 -67 -129 -48 -67 -189 -95 -46 -100 216 120 371 79 -314 -284 113 52 107 -39 76 99 7 10
3438 10 -39 -130 26 92 169 -118 50 -49 -16 127 140 75 -77 20 67 86 11 257 97 -29 2 -140 132 -95 65
3463 65 -53 -301 109 -69 170 -53 232 -28 -141 -131 -255 139 46 142 -157 -14 -134 -56 -200 -98 -78 12
3485 12 245 151 48 -106 -89 -100 104 -203 52 -82 -15 17 216 -54 -10 48 -58 7 16 320 131 60 30 -172
3509 -172 -98 -140 -234 -221 69 -13 6 -63 249 102 -18 -118 158 -67 -196 19 100 -60 59 173 -244 -56 -124
3532 -124 -67 -67 -119 -108 157 69 66 -159 -5 28 204 -166 -38 42 -56 -48 37 -46 -229 -164 106 17 60 117 74 46 243
3559 243 -85 -66 -201 -185 72 -54 154 -2 104 -103 -203 60 -120 77 91 34 190 124 151 -213 -134 103
3581A03k28J05j21m9L12p9N4L6k25R0j65J54p3m8O1k5J03l7J84j03J2r9J17j46
3605f7j24pL17j68N3N8mN4k82K37j87K27j90p2J23J68j69k43K77L0j47J04N5j26
3629h3PJ46m5J69j68k11J53L87Pl65j32J72o9J8L3Q6l4pJ4K54k84q5n2m7L6O8
3655c2j18K22K00k30r1J38lk64Q6j08J88L9j70Q6J03j2j80mK60o6r9RL24k10j72
3680a04m4J03j04J82O4k26R0R3J2j5R8l8r2j58N4j7Q2N9j6kk84L48K8k13K7j46
3706b19K96LM5l4j01j98Q2m7P8q0M8J70J00j03q9kk35J36j07Q5L37j91L9J83l12
3731a16K08k08j9J86j02J62j11P8j49OJ45k08J06j29J90j68J97J9J73j81j47j15
3753a83K29p4p2L1o9O8p1M0J02j00M1J89l74L42J13j92j0M2J2j05O2o9pOJ32l5
$$ plain form
3581 103 -125 -20 -141 -190 122 43 97 133 -92 -2 -167 -13 -86 -134 -73 -98 5 -32 152 49 61 -38 79 -67
3605 -67 -191 -198 119 -49 4 62 58 112 -170 67 -120 107 -83 -155 -32 136 -33 -276 1 31 -116 -12 43 -83
3629 -83 -76 70 25 194 26 -185 -32 355 362 -3 -135 37 -32 -14 19 105 71 64 78 332 48 -37 -89 -136 -100 -32
3655 -32 -150 72 272 42 -49 89 86 -178 -92 -200 -12 27 -143 -57 46 34 -146 -150 110 44 -55 -46 278 68 -104
3680 -104 -148 -45 -149 33 97 -129 -39 54 66 51 149 111 19 -139 -85 -102 -20 39 23 21 -263 85 113 -100 -73 -219
3706 -219 77 80 125 91 -10 -208 -126 -173 -95 -175 -127 43 143 40 -49 -51 -286 -150 -257 -172 165 -26 13 196 -116
3731 -116 92 -116 -135 51 -51 111 0 78 -71 -65 80 -128 -22 -151 39 -129 68 87 260 79 -68 -183
3753 -183 46 -28 -100 -69 -138 -70 -141 -101 1 -99 -58 131 -243 99 212 20 10 52 64 -41 21 -48 -55 -49 83 48
3779D8j00J70J45j10j93J8q3J53k35K96q1j67L1J22j91j28K33l3j2kJ87M1p8n1
3803b0n0k07O3p9K42j05K11%o1O2K9j54l8p0J05R5j27J55j74J22l2p9o2K0J89
3828C5l3J13l06K62j22M6j43J7K03j33%K63q8J35m28J90j03m9J93K6j77Q3O5J04
3852A53n3j37j2n4J17k3j06j48L50o3n0J33l6J18k29J07J79l53J96k18K10M2p6
3875D7k18J67k56K24J72k9J8j39K46k49j49K12k3q7J40l20N07l96J32j52J17J48
3897A12j50O5j97K59p0J22j46%p8K6L03m00LK09n8j57K99j32J00k67o1K79MM4
3921A09j27J62k23J6Qk03J43K83r4j13K9J86j28r3j28r9N00l13L3P0K18j65j58
3944h7J28j17J97k30J86j3j32N8k8p8M0K25nn3N4k03J28Q4k35J88j80Q5j10N5
$$ plain form
3779 48 -52 118 263 153 -40 -22 -105 48 -187 109 28 -139 -108 14 -177 -305 -72 -105 -117 -119 68 109 31 -20
3803 -20 -70 -277 -214 -293 -51 -156 55 55 -6 56 85 -69 -107 -177 -72 23 -104 51 -123 -1 -33 -112 -174 -154 35
3828 35 2 115 -191 71 -51 -5 -148 -131 72 -61 -61 202 114 249 -179 11 -92 -141 52 78 -99 -16 49 153
3852 153 100 -37 -49 -103 14 -9 -115 -263 87 24 -26 107 71 189 -40 67 246 -107 89 -129 81 123 47
3875 47 -171 -4 -260 -36 136 107 125 -14 232 -17 -166 46 23 -64 76 -244 263 -133 -1 -153 -36 112
3897 112 -38 27 -170 89 19 141 -5 -5 -83 -57 246 -154 -151 58 0 -157 142 10 110 -157 -218 61 65 109
3921 109 -18 144 -79 -63 -55 -258 -115 168 74 -39 -10 176 48 -45 -173 -272 228 -85 -52 18 236 71 -87
3944 -87 41 -76 121 -109 77 64 -68 -10 -38 -116 -76 149 144 91 145 -58 70 154 -81 107 -73 12 -98 -43
3968d3j05L7J75k19K55j23R2pj53L9Q1p9j3J3j73K45j05Q0LN8k7k36J5K94J70
3993B74k87p6NJ56j09L2P3j73J91j0j84O4L4R6L0k36j24K13R8k4o0l1N2n1k8K41
4019A66l56L20l2j04JJ43R8l00l3L9J32j65K00p6L7p2J32l91R5j3O2K22l39K74
4043D0J18k58O5j36J40k7P2O5R4k46J75l7j1r0J38q7o0J90k60l0K05qJ1m0m0j18
4069a35N7j20l4K38m1K03Nj71L5j76J90M8k00J34Pm7l4l7j4n3j2J81PJ59O1M4
4095B95l46L4K45k25L5j23R1q5j01K32J84k91J6Ll2o9J27%j29J8J12J16%j42J28
4120I3p8p8J96l51J04J22q7M0J33k35J38o9QmOOP3P9j09k2m8M2J07n6K36j23N2
4147A75j72J73j34J51l37J36P6k85K51L8p5J00Rj97J46j19K39j0k50J17k67N8
$$ plain form
3968 -43 -148 -111 64 -155 100 -23 69 62 -91 -52 29 -50 -63 -50 -223 22 -83 -3 0 58 31 -205 -190 104 274
3993 274 -13 -89 -84 72 -37 -5 68 -105 86 76 -108 -44 -10 86 116 -120 -244 -31 67 43 -17 -48 4 -47 -75 166
4019 166 -190 130 98 -6 -5 138 236 -64 -97 -58 74 -91 109 33 70 -2 130 -261 -166 -179 -117 105 -234 40
4043 40 158 -100 -35 -171 -31 -58 14 79 173 -73 102 65 54 -36 102 15 -45 145 -115 -145 60 52 63 23 -17 -135
4069 -135 -78 -198 -232 6 -35 168 173 2 37 -139 51 99 -101 33 40 -7 -41 -78 -92 -145 -157 24 31 190 251 295
4095 295 -51 -17 228 3 38 -85 6 -79 -180 52 236 -55 -39 -36 -68 -137 -10 -10 -139 -121 -9 107 107 -35 93
4120 93 15 -63 133 -218 -114 8 -79 -39 94 -141 -3 -72 -64 -68 -62 -56 17 96 -13 -35 -83 -41 66 10 246 123 175
4147 175 3 176 42 193 -144 -8 68 -217 34 72 -3 97 106 -91 55 -64 175 165 -85 32 -235 -177
4169a77K63k15R8j5J01j93J43r7J3PR6j58K36j65j8K45k06J68k2N6k47j61J4Q6
4193a48J73k31Q3J76M6j33J43j35j23J78k75J96P6r7K30k17N8k0j35L8m3K29o4
4216Ej7J94m4l0L4q1jj28n6L01p9j31K17l68L17j05k24J7J28J54K5j46K21k48
4240d5j50J83k53L41k16J73O5p1j15Q1p7J43j98K16R0j60K09l64J83p4J44j94
4262h9Q0J00n5k85K55p9J3QJ20k8j53K8K02j75J41j18J43k52K04J7k46K07qj05
4286g5k7k9K28K4j47p0J25j59K60k31R0q0K26k28l8j7J04p8P9lJ16j18J48n4K03
4311B49l00J35k19J04N9q3j2lJ36J04k46K1Q7rj67J48J30p5J36m10K38L2j69J91
4335G7k69J40m8L9R3J14n2j35J30j35J68j43J61p2m2o8L22k82J3O7r7l5o0J04
$$ plain form
4169 -177 86 -129 -31 -46 55 -138 5 -92 -79 -72 24 -134 102 -63 -81 164 -42 126 104 160 -87 -248 -234 -148
4193 -148 25 -206 -123 53 99 -34 109 -26 -149 29 -246 -50 26 -71 159 -58 0 -20 -155 -117 -160 69 5
4216 5 -12 182 138 108 142 61 60 -68 -124 177 98 -33 184 -184 133 28 -196 -179 -51 103 128 -18 203 -45
4240 -45 -195 -12 -265 76 -140 33 98 27 -88 -7 -84 59 -139 77 167 7 216 -148 35 -39 105 -89
4262 -89 -9 91 36 -249 6 -73 -60 -52 68 40 -113 -85 117 -58 83 -35 108 -144 60 77 -169 38 30 -75
4286 -75 -102 -131 97 121 -26 -96 29 -130 130 -101 -11 -91 135 -93 -131 -148 -44 -122 -43 -46 70 -48 100 46 249
4311 249 -51 84 -135 -31 28 -55 -67 -70 66 170 -76 -55 32 23 -144 4 134 59 195 -215 23 55 -114 77
4335 77 -192 -52 -100 -61 32 146 94 -41 89 -46 122 -21 140 68 26 -42 280 -2 11 78 -19 -54 -114 -10
4359a0j41J58j26R2q7K57q0M9R3l37L23j27r4P6K1N4k30N5L7J87k45j7M3k27K79
4384CJ15j70n6Q5O7j12J22j48L89j49j19L0j75Q7j15L18k85M4K1J7m1l1n4P4J27
4409D4k7M4P8k95J72j49K07j22p0J23l0J21k6j09M1l6j38K90r7J2n9J4l8J79j06
4434B3L3m4o0m0J5R6o1K81m41Q6J5J70j2k18K52k09P9P4j9O2l51J37J62j3np1
4460e9N6j93J76k26L05j82L6N4j14J76J5r1j73L95r3q2Oj90J64n3J48K1j12Q3
4484F7J66k85J89j8k54K95j21l5M1M9k80O1L55k3k45M2J6k3J27n5j01l4K21m11
4508b56L44m0j48%J34m2J71o4q0M6PLj1P5q1Ll8j71J97m4K4Rk95K54k78K15n8
4535a24L87l19J26r3j06j8J48j34K86m0n3n6k35K70Q2j33j14j07K73j81L04r6
$$ plain form
4359 -10 -151 7 -119 -27 -114 143 63 112 205 -132 191 64 -30 46 67 121 -109 -54 -17 170 -75 -92 -49 -276 3
4384 3 118 -52 -108 -23 44 -68 54 -94 295 146 27 57 -118 -31 -146 172 -113 -69 -48 -31 -72 -103 -157 -83 44
4409 44 17 61 139 -156 16 -133 74 -48 -118 5 -25 96 70 -39 2 -34 -172 118 21 33 -26 -12 -50 129 23
4434 23 56 12 -48 -88 -73 23 -38 243 -198 -112 -97 73 61 -157 95 -114 -35 39 20 82 -269 -132 30 17 12 -59
4460 -59 -3 -196 -20 -246 59 -123 -87 -33 -147 29 44 -47 -220 175 82 0 6 -184 -20 -73 75 96 -16 67
4484 67 233 -52 137 119 -135 160 39 4 45 94 -186 -125 230 207 -38 4 20 -3 124 69 -32 -66 155 -256
4508 -256 88 48 -100 -100 34 -8 163 99 19 65 72 75 64 139 58 61 23 -148 49 5 29 38 -257 -3 -281 -66 -124
4535 -124 263 -56 70 -23 -129 -147 1 -133 153 113 60 4 -231 39 121 -12 -126 -233 40 -141 163 67
4557F7j91J98K2j12j65p6L12j3n2K11k85M7J67j44l7J13n8P3j32J81J47m55K14
4580C2o8J04L1q4n1J62j42j83K70j28J72j43J74j64J31k18L0J0k7N4K99k57J62
4603A66j35m7k57J99K03j34o9o2K63j62j65J64K06l11J91r5k7J76L3k60J21M1
4625C9j6o2Q5q0J39j32L4L1k7O5J31k92P2J60k30j56L84j79J91K4k79K00j73J40
4649F9N9J7j76j05J71Qo1Q4j92m4RL09k28J93l22K8K69r3J67l88K31K7L6r2p1
4674i5O3j19J49J92q5j81n0J10J14K8j88J00N4Kj01M2%%m6K36j98k47J12J1J52
4699E5j00j7R2o6P4k5N8m7J25k10J10M3j15j3l3Q6J77j69j86O6J29r7m2J04J18
4724A17l6K7r9K8Q3r0M7k47K33j24k9L8Q3l6m0L04k70l0J09J1j35j28J35j26J66
$$ plain form
4557 67 -124 74 96 -16 -181 -257 55 42 -10 201 -84 -37 130 -14 -51 62 4 77 -55 126 273 -182 32
4580 32 -36 68 99 15 -36 126 -16 -199 71 -57 115 -28 146 -18 113 -105 -75 -65 -92 -38 261 4 166
4603 166 31 -16 -273 -74 129 -5 -74 -136 127 -35 -200 -36 170 -141 50 -45 -72 104 137 -123 -2 39
4625 39 23 -39 46 -34 105 -27 7 38 11 76 207 -85 -13 147 -83 -239 145 -34 157 181 -98 102 -71 69
4649 69 128 145 -31 -136 35 43 -18 66 -126 -170 -161 148 -80 113 -209 -181 88 -5 162 -226 5 32 68 -24 -95
4674 -95 -32 -151 -2 190 105 -76 -126 -16 98 126 -62 38 92 94 -7 35 35 35 -11 225 27 -220 -108 -97 55
4699 55 -45 -62 30 -36 38 13 71 24 149 -61 49 92 -23 -36 -69 17 194 25 -161 -95 34 -63 -105 -1 117
4724 117 81 108 9 37 120 30 77 -170 63 -61 -90 -52 31 -5 -45 259 -11 -41 68 79 -56 -184 -49 -175 -9
4749im4J20j65n7J18J72m27L09k92J00O6J39l8m4J0J24j08j2J64l35L42J3k1p5
4773E0k64J56J04o9K67k83m5K01j32k14L40p9k35j30L19J18j83J74j68M20j68
4794A79k57K06No7k62K05K4Lk4q7k1L6q7K8J57j74j57K28o2K22k9k30J84N7p3
4819DM8M0J50j13m7L0k2mj63J28P6j88M8PJ65o6O0j18k42J51qJ19M3p4l7n7j85
4846b55K59Mj79K59j87M6o9l0J29L8M9j15O5L5L9L5q2JK7r4J24j06j14J92j04
4871c3O6p3J91j42j27O0jM7O0o0J3K21l41J36J57j09j19p6J89l0RM2k00K16k9
4896F7l8Q9k29R5J42j86k4K1O7J1o4k1J6J6qj06k4K56k87Q7K72j77J91l22J55
4921aj46K44m5j86J68K83l56J00j32J98O8k96P5%P1j47J10q9J57r1Np6R1l9%M9
$$ plain form
4749 -9 -53 67 -98 -155 -37 135 -292 17 -275 -175 -109 30 -8 -52 -42 82 -26 -38 126 -209 133 146 125 50
4773 50 -214 -58 46 -23 244 -39 -84 117 -15 -229 111 32 -203 -333 -14 104 -79 95 -73 347 179
4794 179 -78 128 133 66 -196 9 33 36 12 -75 -96 -60 -147 -119 38 -136 -293 -65 -127 95 66 -164 20 77 4
4819 4 52 92 242 129 82 112 90 86 -77 51 127 -61 -13 -6 159 93 153 35 -207 -56 -64 55 98 24 -13 -70 -255
4846 -255 4 8 -171 88 -99 -53 -122 -152 -23 15 64 -51 14 49 88 123 41 42 69 -25 99 -7 -121 71 -33
4871 -33 33 -40 151 9 -118 -58 -59 -12 48 -12 1 222 -119 17 174 65 -54 -130 59 29 38 80 -120 96 67
4896 67 29 118 -111 -16 126 -60 -84 -63 4 15 -49 -70 -54 -38 -46 -152 -176 80 -207 -120 152 -25 166 -156 -1
4921 -1 -147 97 52 -134 34 317 -39 61 -71 127 195 -101 -26 -26 45 -102 8 -81 76 -15 -10 -86 5 -34 -34 15
4947A5L5K5J99k42M2Q7k44J13j0p3p3oJ05P8L4j39K5m9J16Q9j68J48j03l8K3j3
4973b4J42j94K25j69N9p2m2n5Q3J58j55J70l3j02P0K6k63L9K74m6k00J55K14l89
4997a29J39j36J68j08Q7n8j3M5j45K62j16J73r0j4m8j15J64k41J4J70j21o3M03
5020B28k04R6k66L1K09j09J44j02M6j89o8L65j03j53r1J73j57K58k3j06J97o1
5042A15J6j82o7O7L53k49j79M5p4m6J78r6q2L04q6%k16J07L44l18K8J20J4k60
5066a64J94k32K64j9R6n5q5j35K59l0k09K45K4k05n8J66l0j83J44p2kO3Q7R6k67
5091a08J74k70J68j7M8J96l13P0L1K4J11j22q2J03j75K40r2n6J61j72K9k48J86
5114a14J22J46n6k18K36N3r9O0k78K58r2p3p3K68N0k73J44j7K8Or7n8R9j53J04
$$ plain form
4947 15 50 75 274 32 74 161 -83 30 20 -53 -126 -132 -27 51 85 -54 -29 -78 38 127 -41 107 4 -34 -11 -24
4973 -24 118 -76 149 -20 39 -33 -75 -130 -47 111 -44 126 93 -9 61 87 -176 -137 137 91 -109 46 260 -129
4997 -129 10 -126 42 -66 21 -37 -50 -5 -150 112 -4 169 79 65 17 -98 66 -175 -161 9 -112 -175 228
5020 228 24 120 -146 -115 94 -15 129 27 73 -116 -184 181 78 -75 -166 7 -150 108 85 -21 176 115
5042 115 131 -51 -118 -51 302 53 -126 -81 -155 -201 -23 -119 -201 103 17 17 -199 -92 252 -66 -38 82 96 -164
5066 -164 30 -202 62 43 139 84 -1 -136 123 93 -116 129 153 -52 -110 56 26 -157 -13 -85 -87 -24 63 159 -108
5091 -108 66 -204 -36 -53 -5 191 -122 -52 -21 3 114 -8 -90 13 -162 78 -14 -70 91 -81 -52 -300 -114
5114 -114 8 154 98 -120 116 169 70 130 -148 110 18 -55 -128 140 190 -83 61 44 72 78 -19 -77 22 -131 -27
5139b7Q0J46l21L55k70J47Kj19pJ74k22J28N1p5j14n0J48Q9j36J03j6p3PM7j49
5164a02J49k03J33J37k50R3K27j89k22K21K6l6J84j86kN6p4m6j8K40q1%k79L17
5188I5J24k61q3q6K00N9p6K4N6j67J15J85r7P8j9k84J38N3Q4L3j55PK3r5k2J37
5214F6N5j21J98l56J62J26j27Q3p9L5q6P8l2q9M2j98L69p9O7k59R8j3J22k25K80
5239A17j86R1R4j46J06l5p9p0J36m9J56k00K17q7j69j27K45j08j4J94Jk86o7K99
5263C3Mj84J94l00M60k22n3k6K1K74m8j18l7N6j40J14k3J30k92j7K59q8J57k60
5287a06Rp0K39J32j16k70K02j57j3L33j33K4p1R8k26mK41j91L6J6K1k48M7L5J45
5312b7J51o3m09M50n4M4o4L8j23J29p6p8Q4q3J82j70j90L16O7j10o5Q5j42L0R1
$$ plain form
5139 -27 53 199 -122 233 -37 110 112 -7 -14 160 -62 66 117 42 -72 -122 26 115 -21 82 66 -7 0 47 -102
5164 -102 47 -156 -23 114 -136 -43 184 -5 -227 -6 20 -16 168 -18 -20 36 -38 -84 -102 138 57 57 -222 95
5188 95 219 -42 -125 -211 -11 48 -28 -4 52 -115 0 185 88 166 147 -137 1 54 138 171 16 23 46 -49 -71 66
5214 66 121 0 198 -158 4 130 3 86 7 42 -44 34 2 -87 -45 -243 126 47 114 -145 -47 -60 62 -163 117
5239 117 -69 22 116 -30 76 41 -38 -108 28 -21 135 -65 152 65 -104 -231 14 -94 -108 86 87 -199 -266 33
5263 33 37 -147 47 -253 207 -15 -68 -94 -73 201 153 35 -2 54 -86 28 5 135 -157 -174 85 -3 154 -106
5287 -106 -97 -167 72 204 88 -182 20 -137 -150 183 50 74 3 101 -125 -129 112 -79 -43 -27 -6 -254 -207 -172 -27
5312 -27 124 61 -348 102 48 92 28 66 -57 72 -4 -82 2 -81 101 -69 -259 57 124 14 -51 34 -108 -78 13
5337A3m4m4j01J50R7l5L1lj05O0j97L3J83Q4Nk93J86k31K58k7l0m8J80j70o9L06
5363A89j93M8k44J75j79J61J80k28k1M8n9K1J75m0j23K00k01pK12j4j46n3q5J38
5387d6J42J7j40N8j88J39J38n8j01r3L8Q9P8n4J37Rq7q9P3j49J36l1p0N5M9jj27
5414g6K72j68J2k22J46kJ48p6k5O5k59P8J70q1J0j32J23J3R7l8Ol2p9J42j7l63
5440b88L12j46J59K31l24J81l01K98J42l19Q3n6K04l38J78K6n3j32j6J63P0p2
5462Bj9k8j50K47k30r0K83j01k2K22k21L3N2QJ44j21N2j74J17Po1P9J19k77O2
5487f7J5Lj53Q6M0K95j03j27j1J15j55N5J78k31J59k51L3J34j9k45L52k92K30
5510D1L3r9j36J69K6n4Q2n4L9o2J59k92J76M0O9j30p4Q9R2p8j66m2K55o0M2j58
$$ plain form
5337 13 -31 -75 -176 -26 71 36 67 64 -41 19 -178 -145 38 122 127 -166 20 -211 47 20 -10 -58 122 -48 -117 189
5363 189 -4 44 -200 -25 -204 -43 137 -91 -112 -64 -123 -102 73 33 -90 110 -91 -98 114 100 -46 -99 -184 -46
5387 -46 96 113 -27 31 -157 -18 120 62 -39 -132 -94 -5 73 19 156 165 78 -11 62 -87 49 18 -52 3 52 51 -76
5414 -76 196 28 40 -182 -36 -38 110 34 9 74 -185 -107 63 -18 -8 -140 -17 -4 93 55 61 29 -50 92 75 -288
5440 -288 24 -122 37 268 -56 125 -176 122 264 -55 28 -28 176 -162 16 42 -11 -143 -159 4 74 2
5462 2 -17 -45 -195 52 -178 -268 15 -86 -108 114 -107 -74 -22 -14 130 9 61 -113 4 11 -50 29 148 -129 -67
5487 -67 -52 -49 -202 -116 -76 219 116 -11 -22 93 -62 -7 171 -60 99 -152 -119 15 -4 -249 103 -189 41
5510 41 74 -25 -161 8 34 -20 62 8 47 -15 144 -148 28 68 137 7 -67 22 114 36 -130 -172 83 23 65 -93
5536i3M6M1J54j92L6o6K6J56j5K40l72j32k0J88n0m7K27q8j61J42k5j6J95j90
5560a6n7j04K38Qj38j8J85r7R6j52J48o8M1j6kk12P6J50k1r5M6m0J24n5q2J47
5586H6k26K30j03J02j27n2L18k43J0Q7Jm4j21L5L6n6Q4j27Q3Q1K6k77J52Q7j80
5611a38L17j25k8P1p3K78k94r9q0K02MM8r2j45K34j15K2k01K04J48N9p9j76J12
5635E4o9K82m01J45J68l85K10l3J44j64N9J21k15K8Q1j63K73j9k09K76q6j95K82
5658A84j47qQ4j0k14L16j69K27k74l27L46p8K7K52p4l4n7l5O5j40M0O3M7j83J11
5683A2rJ33mr5J07j60MJ8r8P6J42L3l21J67l7K4j60L44l57J91j4J4L1j87J17K19
5709A90k91N7K23k17K6l9J93l00K64J00k89q8J82j9MJ74k05J7J70q9Jm5j4K44
$$ plain form
5536 -93 -47 -6 148 -44 -8 -74 -48 108 93 333 -39 -171 -191 -3 -53 -100 127 39 -122 20 -5 -21 174 -16
5560 -16 -73 -177 61 69 -69 -87 98 1 97 -55 93 25 66 50 48 -164 -88 62 41 -54 -8 -48 76 21 -61 86
5586 86 -140 90 -13 89 -38 -90 228 -15 -5 82 83 39 -82 -47 -11 -67 17 -110 -27 54 80 -197 -45 42 -138
5611 -138 179 54 26 97 24 302 8 -91 -171 31 35 83 -9 -154 80 -35 -13 -214 -10 138 197 118 -58 54
5635 54 -15 267 -134 11 179 -206 4 -29 115 -49 10 131 -84 -56 25 -138 135 116 -93 183 97 -98 184
5658 184 37 29 113 103 -111 205 36 263 -11 -338 8 -70 -43 209 135 101 44 9 74 -66 -26 37 84 -99 12
5683 12 3 136 132 37 144 -16 -12 6 -92 -16 126 159 -162 5 -32 -8 -168 176 -181 10 -4 10 41 -146 -29 190
5709 190 -101 -44 179 -38 -12 -51 142 -158 106 206 -83 -171 11 -8 -4 170 -35 -18 152 63 64 19 5 249
5733B49l11R6j26J47o5M9j8j02N6Q7j45o2k5K94k5k19L74k67q3J7J19m7K7P1k7
5758F4j49J57j76K22q9k54J66nJ17P5j27P1j17k08L65l37J57j15J62K08k05Q6
5780F8k32M04m00K68l9o8L3j15K63k35L0M8j71L20k87K18j15j00J32q5J1J11l26
5803b67K95q3J19J5j60K07j39k07K00k7P6n3l1R8n0p0j26PQ8Q4J81j44j42K31
5827A02j73J92j22K10k85o1M1K88j17p2r8J89p7J14n5n2j7K8p6K3o4L2j06j56
5851c12K09P5q0L0J3O8J49j87p6M3j1o5J46N6j43K39j59L6Pj59J2L0J09j06J03
5876B7j02J93oN7k25O3m0J07Lj33L6j3K6R7Rj70l0J65j04j43L09j02q3K24k22
5901e7k0N1J04j45K57j56J10j29n7K67j72M3l11M8l0L54l29L83m71J59k3K38j76
$$ plain form
5733 249 -62 34 -92 55 -10 39 21 -81 -25 62 -83 -145 -170 124 99 -120 254 -13 -96 -79 40 -7 20 91 64
5758 64 -85 72 -104 118 29 -225 -59 -64 53 128 1 72 -45 -253 112 -225 -68 -183 -21 187 -18 68
5780 68 -164 240 -160 108 69 1 34 -81 182 -53 -23 25 -146 174 -113 105 -10 -110 22 -63 -52 59 -267
5803 -267 28 -55 64 79 -81 126 -13 -220 -20 -47 29 -24 -55 43 -7 -77 -203 -196 -108 -24 157 13 -129 102
5827 102 -71 121 -1 209 -76 -137 -96 192 75 3 -95 94 17 131 76 24 7 35 -41 -18 -82 -50 -156 -312
5851 -312 -103 -28 -108 -78 -65 3 152 -35 -111 -68 -79 -144 2 58 -85 154 -5 31 38 -121 -109 -79 30 -76 27
5876 27 -75 118 112 169 -56 7 -33 74 77 -56 -20 -33 -7 90 99 -71 -101 64 -40 -183 126 24 -59 165 -57
5901 -57 -77 -26 78 -67 190 34 144 15 -42 225 53 96 -215 -167 -197 157 -172 211 -260 -101 -124 114 -62
5924f2J1j3j57K06K48k41J17n2k35L44k0k26M7r5K28p3L2j5j61MJ42j18P9j81
5948a91K05L2NJ09j67N3j55L00j43o0p2J39r1J19j39N0Q8n1k39J78RJ27k06J00
5972@R7k08J21L7J15j88M9P3j10P8q2j59m6j21J49j1K62j0R5j21r1M7N8J15k4
5997A25j11j59JL71m26L91k49J37k23J32R0r1q9K03j59N7j3R4o0j26j30J7L41
6020A23k00J08R1l80K97o3k19K86r1K24k15O1j79J6J01J84j38L2J22j41J64j92
6042iM2k5Lj68l1M80m62J91R5j09j61Plo6R0J39K11j84j10L4O8OO0j43j0p0k6
6069a51K09l1n5j4M4K65l96K58j35j1M1j82J09rJ18Qj18K36l50J44q5J28K7p3
6093b3l4K37j63L4j73q2K34m7l5NR1k2r6M7P2L2O0k64K4N2o8L41m95L19J04k34
$$ plain form
5924 -62 -51 -64 -221 -15 233 -8 109 57 -178 166 146 -80 -33 -128 100 27 59 44 -117 -113 29 -89 -10 -191
5948 -191 14 46 51 160 -7 46 -109 191 48 -12 -84 55 -36 83 -56 -6 82 31 -208 -30 -21 106 -100 0
5972 0 97 -111 10 47 162 -26 23 96 -14 64 -18 -177 -223 -344 -195 -206 56 46 141 20 -71 -24 34 149 125
5997 125 14 -145 -144 227 -199 192 -57 80 -143 -11 79 -12 -101 102 -57 0 -13 81 21 -105 -235 -218 123
6020 123 -77 31 122 -258 39 -24 -243 43 -48 176 -39 22 -157 -141 -40 144 6 38 160 19 183 -9
6042 -9 33 8 11 -157 -188 292 -170 21 116 7 -154 -147 -150 -216 -126 13 224 40 -70 -36 32 38 98 -45 -55 -125 -151
6069 -151 58 27 -28 -42 2 267 -129 129 -6 -17 24 -158 -49 -58 60 68 -50 186 -164 -20 -105 23 50 -23
6093 -23 -57 180 17 51 -122 -204 30 -17 -52 -47 44 22 -74 -27 45 77 137 -127 -103 -51 -119 222 -273 46 150 -84
6119h4J83j69N1j56J2K65r8J01%j76K9N5j51L9J67j77J56R7k15J43j2j97K19o2
6143B0j32M4L2J03J51k42%l8m5O3k8J43Jj12O4p0J07j00N1o7j44K61OJ50l60k2
6169a64J00P3KP0j49q1J99qj56J75N4Nj2j08j65L03N1L5l63J02M5j25L66l75l0
6194a56J65J04J6k67L41k85R8L7qm3l0O0j67O4o0J28K05l05J05J31j22J63k68
6217i4J01j20K81l37K13J9J87k84J4L1Lj37M5qL8J82l4q8km6Q8Qn0q7Q3r3K56
6244A69k60m3K06k8n0j05J80O5j26l3Q6p9r3J98J99l68K88j60r1J79j69J55j49
6267b9J49m2j57J46j15KN7J9L0j45Q7N9l02K53O7J8j03O8l54L11J94j11j17j77
6291a92L2J81K0L25o07K12O8J10j97K4j24l6J45n0l9K0K5j53L46j55J80m1pN7
$$ plain form
6119 -84 99 -70 -19 -175 -163 102 4 105 105 -71 -42 13 -138 -99 68 -109 47 144 -71 72 60 -137 82 20
6143 20 -112 -68 -36 67 218 -24 -24 -62 -107 -44 -72 71 72 -40 24 -46 61 -39 12 -55 -199 62 68 218 -142 -164
6169 -164 -64 9 11 81 -68 -149 50 42 -114 61 115 120 108 0 -165 138 189 224 -139 -37 8 -117 249 -126 -156
6194 -156 9 113 129 -138 203 -82 16 53 45 2 -28 32 -135 -71 -131 -3 202 -103 2 133 11 174 -94
6217 -94 7 -113 168 -169 44 63 250 -34 -20 11 14 -123 -78 -86 -48 134 100 12 10 -36 52 60 10 -77 6 -87 169
6244 169 -91 -134 72 44 -6 -111 69 134 8 -25 61 -18 -111 87 286 -82 206 46 -45 134 -35 120 -29
6267 -29 120 78 -79 67 -48 -46 11 30 60 -85 2 61 -241 12 79 97 -6 62 -292 19 213 102 -15 -192
6291 -192 -160 21 41 366 -241 -29 39 149 -48 -24 -148 -184 -39 -89 -128 -108 -83 -236 110 -45 135 94 87 144
6315A44m9J17j24j30J18k39J59k4M4j0J46j04j58J22k7J19j1k25j02L15n4p6j06
6338a55M7K59L8k62n0J00Lj93L45k54M7R5%j60N0j6J63M0o2L4J31k86J3J36l15
6363b52K91l27M02j40p3Q3m1q8J33k1K17j24j25J41K09m24J39R1nJ3l20J27J41
6386D7J16l66K76J18j0j14r6k41L34m3m3j46K25j72K18j54J95j26j38K32l40J68
6408f0j9mK15j47K05k57R3q8K04o8j61O0J55k74r6M11j68O5k04J55j43K41P5k20
6432c0j33K50j73P9J3j7m4Oj7N6k5j39J58J45J69l91K2R0j4pK35l17J91j79p7
6457a49K04Nk46K18m9L6j16N4j7J94k98J03N5L4r6oR3N3j42L27m30K65l07J24
6481i1n1J63J19L8k50%K70k99J56k11J82k02J87k61L2L03P6j39p0j63K03pJ60
$$ plain form
6315 144 95 212 88 -42 76 -163 -4 -28 16 6 152 48 -110 12 -15 104 93 -132 -234 81 27 -49 -155
6338 -155 -108 151 189 -73 -123 -23 -20 -213 132 -122 -75 20 20 -140 -90 -106 57 97 35 69 200 -86 -73 63 -252
6363 -252 39 -288 114 -26 -99 -16 -57 -145 -12 -33 184 60 -65 76 285 -139 0 91 86 99 -221 -94 47
6386 47 163 -203 73 191 181 67 -29 -270 64 21 -22 -168 57 -115 103 -51 144 18 -120 112 -228 -60
6408 -60 -79 -83 132 -15 190 -67 26 -62 142 74 -87 -27 128 -146 -242 169 1 66 -138 17 -126 115 190 -30
6432 -30 -163 87 -86 -7 6 -11 -55 -49 -66 -10 -35 -174 -16 129 298 -93 -71 19 5 -2 233 -84 107 -72 -149
6457 -149 55 60 -186 32 -17 19 -97 -43 -60 134 -164 -61 -6 28 -68 -74 19 72 -70 257 -173 92 -215 -91
6481 -91 -142 21 140 178 -72 -72 198 -101 55 -156 26 -176 11 -250 -218 85 161 22 -48 -211 -8 -15 145
6504A45k59j0J75j55N2Q9j48o2J77q0qM7J05k58J00M2j9J10L0rk8j3p1M4K2j04
6530h6J81j29L8k2nkp6L0J75J32l56J94l5j19p8K73l8j31K4K74j47m2j1k0j20
6555i6k86M07p1k4K01j45mMR4j48K2J72j60Lk23M19j81m8J79q9n0k5N6M5N8k16
6581a06J19q5J33l7J11o6j27j03L04l3l5k1j84K17k37Q2q6o3L00K29j43j46k75
6604b52M5J86J4J28J3Mj3j26N8j7m8L7J23j57N8k03J90j61q5J78r4J31Q2n9N1
6629H3p4N3p6M3P0l8n8J09j92J77J5k98K2K48j46k28K87K07l64l3J73j4J51j06
6653A1m4K06j77m9j27oK04j3r4R3k70J77L35l04J47k17j34J82J39k30K82p7j32
6676i8J79j80Q5l6QL02l59k3L57k51p4m0O4q8K00L97l02k9j51J53m2N6j27j76
$$ plain form
6504 145 -114 -124 51 -104 -52 37 -111 -173 4 -76 -84 -37 68 -190 -90 -48 -67 43 73 64 36 23 -48 -4 18 -86
6530 -86 95 -34 4 -18 -23 -25 -101 -71 104 236 -120 74 39 -80 -158 115 77 -54 -30 244 97 55 44 24 -96
6555 -96 -382 25 -46 -70 131 -14 -18 -14 80 -68 -46 126 -34 -31 -254 165 -16 -64 115 26 -24 -49 7 52 110 -106
6581 -106 13 -72 61 24 135 69 -58 -161 143 110 75 54 -130 87 -150 -68 -154 -217 83 312 169 23 -252
6604 -252 -207 -21 -7 121 134 138 125 -1 57 40 -8 29 152 -5 53 -150 40 -121 -206 -28 -122 9 91 32 83
6629 83 9 62 -14 29 99 61 3 112 -80 97 112 -186 -164 84 -62 -290 -3 204 -160 -193 -20 -34 117 11
6653 11 -33 173 -4 -53 -180 -186 18 5 -89 4 -266 -89 246 -58 89 -128 -262 -80 59 -171 111 34 -98
6676 -98 81 -99 -14 -50 -42 260 -99 -122 235 -16 -90 -130 -66 -154 46 443 141 112 -39 114 72 128 1 -175
6700a75R6P6J50l18K42P4k25J12O7j08l3m8J13o3O5J41j17k11O0J08m9j10K10
6723E7j81n1K85j14q9K26N2r4j63lP6K03k35J36m3j31L9Om2J47nK00k39OP8k07
6749h6J66j31P6rM6j08j35J02O2o3N6K34j95Q6O2j37J7o8L0Q1N1k33K2K33l21
6774a62L79j64o0J7J03j83J86k51J63K73k83O1omJ18k67kp4J63P5K8j17l0n4J6
6799g5K79j44j1m6J68k64L9O4oJ92k81q2O9J10m3kq0K43K6l60K09m3J99q9l14
6824b42L06j85J77j25O2J74j52o1j07L50k15o1m2K87j8k85J21J37j31L0J73k68
6846g5J38q8J16j51j93K82J83k86J00j33M4M4l6j25K01j00l6K15j67J43j28J4
6868c8J59k41N0j14K72k9M1l8j79J32j70l1L41K1k88K89l91L65j64J08p9k43R8
$$ plain form
6700 -175 -79 -3 147 -171 71 145 -80 32 99 -9 -42 -90 23 -40 25 166 49 -162 -102 6 -43 -153 57
6723 57 -124 -175 110 -4 -93 133 185 91 -72 -75 1 204 -31 105 62 -69 -30 -24 -66 81 76 276 37 43 121 -86
6749 -86 80 -51 25 16 62 -46 -181 -79 -17 -80 -24 210 15 101 163 26 43 -25 5 86 137 -96 -74 159 -162
6774 -162 217 53 -7 10 113 -70 116 -135 28 301 18 79 73 69 187 -80 -82 -156 7 82 110 -7 -37 -91 -75
6799 -75 204 60 49 3 171 -93 -54 10 4 196 -85 -167 -98 12 -31 -33 -113 130 156 -204 5 -38 161 72 -242
6824 -242 64 -121 56 -69 -7 167 15 -46 -153 197 -18 -79 -121 166 148 -137 -16 121 -10 20 193 -75
6846 -75 63 -25 91 -60 -253 29 212 -74 26 -107 -63 -19 -55 -180 21 -79 -115 100 -67 76 -52 -38
6868 -38 121 -120 -70 -184 88 59 100 62 -117 15 -155 -186 155 176 -112 177 -214 151 -13 95 16 -227 -129
6891a29k8J01J12OL4j40o4J89N1j9nk91J95J90k95K31l11K05m1j1p7%J85p2j20
6916a04M4J9J21k74K04j13M4O6J53j28K0p5M4J25l06J25J91k67J35O8j61J11l
6939C9m0kJ32p5j11J8K07j93K4j02J56J03j51r6o6J29l7R7j8N4k04K55j80j52
6963b13K56J21l21J34o1J13mJ9M4j83J43l8J35j90j01Q7M3j57Q7j26P7R5M0O6
6987F6j33J4r0K64j46J25K25m11LQ2J39j21k8M3j26j04K77Q5r1j66L2K34k92L46
7011B27k34J94j43j5j92J19l4JR2j38J06Q6j70R0M1K3K58m49K09N3j55m8R1j32
7035a20M62n49L02j50J63l05P6K72k14J46k16J58m4j9L06k77j28K42j8k01K50
7056A36r3l6N2J6Prk8j84P6L1L2Q9r0j05K03k58R9k7j7O6N5J21j89J2o0J34P9
$$ plain form
6891 -129 -157 -56 56 62 96 -44 -108 81 132 113 108 -183 12 202 -93 138 -173 32 -9 -20 -97 -97 88 16 -104
6916 -104 -60 -41 80 -194 10 -103 -59 7 160 32 52 -23 21 146 -160 -35 156 -111 24 92 -69 42 39
6939 39 -1 -3 129 54 -57 -39 168 -25 -1 -103 53 156 5 -91 -157 -28 -65 32 14 68 -136 119 -61 -213
6963 -213 43 164 -157 -23 -84 29 25 44 88 -95 48 10 145 -45 -146 -59 -16 -173 -86 -212 -135 -40 0 66
6987 66 -67 -53 -143 121 -25 100 325 -86 -83 -1 138 17 -11 32 -94 -198 79 164 73 -93 -61 173 -119 227
7011 227 -7 187 44 29 -163 -44 -78 -77 15 -123 -17 69 -101 -11 30 53 311 -138 71 124 -31 -79 12 -120
7035 -120 342 -207 95 -55 108 -197 -121 151 -63 83 -133 25 -19 -38 268 -9 -137 105 87 -114 136
7056 136 43 7 59 75 82 73 45 -139 -63 -32 0 89 -1 -106 97 -161 -62 -89 -106 -40 15 136 -53 -41 -101 33 112
7083A12j18l7K51k68J96k73K60r3Rqk4J06N3Q6k45j67J12Qj17J10M7j5L4o2j24
7108a67K36R3p0j79J65j14m1J93j92J40K5M3k86J50K8j09j04K10O6j87K35N7k50
7131e8J03%l04K56J07j91K04j41J20K1k07J97m12M35j63m4P4J23m4j62P8K31k07
7154A6J56j71j3q6K20l3j30J28Q5j03J8J7%j94J23j13Q8J53k14K40j34J18j03
7177F8j64mO1L7Q0p4k5J57j72K9J34j94n1O7Om4J99m6k2n9J1j04K58j19P3k85
7203a83P7M6r6J91k47K32j57Q2J23q0n7l4J21n4J33j55K29m6k63K62j47m5R6n3
7227b5L2rj75K60r9K14k99O4q2J85j71k4J36J41N9j37l1Q2j20K30l09J92l53J68
7251g1J45l2O0j94K45j93J16k4n7N2j50O6MnJ58j32R5k12J84J71j29k3l29K19
$$ plain form
7083 112 -6 -43 208 -60 136 -137 123 30 39 31 7 113 166 252 7 -160 -48 -40 -157 -47 0 -15 19 -43 -167
7108 -167 69 162 92 -87 78 -36 -77 116 -76 64 89 132 -154 -4 24 -85 -189 21 87 -100 135 192 -58
7131 -58 45 45 -259 -3 104 -87 117 -24 96 117 -90 107 -305 130 -33 -77 -3 120 76 -86 -8 223 16
7154 16 172 1 -12 -98 122 89 -41 87 172 69 87 104 104 -90 33 -80 8 161 -53 187 53 171 68
7177 68 -96 -100 -39 -2 78 4 -21 136 -36 -7 127 -67 -118 -51 -45 -89 110 64 42 -17 -6 -110 148 29 102 -183
7203 -183 -106 -60 -156 35 -212 20 -137 -55 68 -12 -69 -103 18 -36 97 -58 171 125 -138 124 -23 -68 28 -25
7227 -25 7 -2 -177 83 -16 198 -101 -37 -119 66 -105 -129 7 148 207 70 39 121 1 231 -78 114 -239 -71
7251 -71 74 42 102 -92 153 -40 76 52 -5 47 -103 -37 -33 -38 120 -12 83 -129 55 226 97 74 -255 -36
7275c6K51n9k04J34j25K75k04j88K63%k08J80o0n2o0K92m33K96P7k83j9J18j44
7298a89K37k1J25k14J59m0j27J16j74K34k51J07o6J57j10O2NJ13k25o2J58J40
7320A34j81O6j04L16j95O0R4k71j2m2J26l5K9J0R3O1j03j49n7K52j88OJ37J73
7344B20k13j62J81k24J01n0n0Q6J78j25M7Q5j25m3J4J08l9Q5jj4k19K09r2R1k7
7369B1J21l0j30o8j6J69n9L17m36J41J22k41K42p3m4M1k94K06j15Q5j9K25j12
7392E3k9o9p4J05J32J90k77J9N5j44p5J93r6J66j48q6pQ8O0m2Qk3P8%K1o7oK25
7420B50k39j32J13Q2J8j27N5M3L7j69M3m4M1J90J1j88J97q7j27J56o7L2J8k11
7444a05J11J8j97L5L13j05J46k23j46J53q8J81j70K25O5l11J24k03L62l10O3J78
$$ plain form
7275 -36 215 156 -48 86 -39 236 32 -156 107 107 -101 79 19 -33 -93 199 -234 62 139 -144 -163 -45 -189
7298 -189 48 27 152 -62 97 57 -70 46 -128 106 -145 -38 -104 53 -57 5 10 123 -102 -164 -6 134
7320 134 -47 19 -85 231 36 96 190 -81 -93 -135 -9 -44 -15 -5 88 149 46 -103 -160 92 -96 -90 47 220
7344 220 7 -155 26 -198 -97 -147 -197 -111 67 -58 -11 74 -51 -94 -80 28 -11 74 73 59 -160 49 -43 48 21
7369 21 142 112 -18 -86 -102 67 8 325 -111 30 152 -89 153 80 36 77 -217 -11 -126 -41 -60 165 53
7392 53 24 -45 -119 -14 118 308 31 50 105 -39 -114 79 -17 149 1 -85 -92 -4 56 14 22 -1 77 77 98 31 25 250
7420 250 11 -121 -8 74 92 -35 20 63 100 -69 -26 -70 -29 161 172 -16 181 94 -33 123 56 88 106 -105
7444 -105 6 24 -173 -138 175 70 216 -7 -153 0 -88 93 -77 148 213 -98 26 -177 185 -125 -62 116
7466A16j19K1k1o7J50k83J52O4J8M0k99J25j50L22nj40K48k64J52K24l02m3Q0
7489A9Nj53J19J93j58k31J58J8jj13M2p0J29j3P5j30L07j36p9j14K54j65j6J00
7513D0k0k36L04j61j41K87j13LrK1R9j56l8J58lQ1p3q4j39J34p8qK77l08J90j20
7539i3j63N23l43N9K0M2n3q5Q8m8k8n1n0J39R8k9Km6o4m3K00k43J65r9J6J89l8
7566F5k05K21k0KM4m0j76q8P8L8j39J52JN2J85m31O7K45j5j38K52j81oJ95qr3
7592E7n0J29j26n3K39k40RJ79j70Q0m3K3r5L0J01N2r1j83J81K68k74J09j18l8
7616b4P1J3k25K54j75J19n4O5JN3N3k02q5J08o3K60k74K91k15L2nO0p8Q7N8k10
7642h5M06m98K90j62j02J99k7j49J64J76l26N4j38K43k6o8K26k33J22n9LQ3k29
$$ plain form
7466 116 -3 18 -3 -70 80 -203 -51 13 31 71 -228 -103 -253 69 64 -76 172 -92 60 284 -18 -61 19
7489 19 24 -129 -10 183 25 -206 -48 -30 -31 -144 -102 -172 -43 -56 19 -111 196 60 -19 -133 121 -44 -60 40
7513 40 20 -216 88 -73 -214 73 -40 -37 -46 -25 74 -82 -120 38 35 116 43 -41 -180 -46 -124 -132 145 -163 27 -93
7539 -93 -256 267 -76 -17 3 45 -8 -93 -5 -53 -81 -132 -182 -43 55 26 28 -18 -82 -125 75 -168 -3 -102 -86 103 65
7566 65 -140 81 61 63 107 67 -109 -197 -119 -81 -220 -68 -67 -15 170 -261 -194 51 36 -102 150 -31 -37 158 150 57
7592 57 7 136 10 -43 196 -44 -35 144 -26 54 11 34 -61 -31 70 122 31 -152 29 297 23 132 14 -24
7616 -24 47 60 -165 89 -86 33 -21 44 45 98 151 -51 -136 -28 -91 169 -105 186 -29 3 -2 58 -20 67 125 -85
7642 -85 321 -177 113 -49 -151 48 21 -128 36 212 -114 -60 -198 45 19 -49 177 -56 66 7 10 93 -136
7665a36J07l4J98j30j69M3J70j15m1L3M7J40j71J68j6k43n6L86r8j03O2j2k45
7688b15J16J01l8K78l49K09j41j92K51J01j86P6P7k02Q3O0k8j64J40o0j08K13
7710B2J20J9j13j68L16k46K81l58K0J30N7j48J7P9j04j00k8K96K19l52R9k6j2
7733B0K8m5j04l0R4q3L09k8k16J91j81k2PJ41j74K69l59k2J55n2m1J73O3j87J42
7758D8N0j50j32N5J75p7K02M6l94P8J91n3R8j65O1Q7m19M87j04p7J65j86q6J02
7782Bp6J28q9q4O2m1nJ5J95m1k3J6J09j79j00q7N52m33J07N3l2J48n24K95LM4
7808A5m0l9J54r0J6m2j58J18K02k59N2K87j08J12q8l5j23nj05K85j19m9n3Q5L4
7833D7rm5j14J18J6r0J07o2o5K82k96J36n1P1j39P4k62L66j83K42r3om2l1J4L41
$$ plain form
7665 -136 -29 -63 135 5 -164 -121 49 -66 -107 -74 -27 113 -58 110 94 -149 -205 181 83 -20 42 30 -215
7688 -215 -99 2 -36 242 -107 102 -39 -231 20 121 -65 11 88 -114 -31 29 1 -163 -23 -83 -191 22
7710 22 142 161 48 -120 196 -50 231 -127 -107 23 80 -68 -51 28 -76 -176 -204 92 311 -41 58 32 20
7733 20 48 3 -101 -131 -37 -120 189 161 -55 136 -45 -67 -60 81 -93 176 -183 -205 -50 -102 -143 30 93 -94 48
7758 48 98 -52 -184 -129 46 -31 171 217 -177 -99 92 39 137 -28 33 120 -299 188 84 7 172 -14 -100 2
7782 2 -74 54 -35 -119 -57 -98 -103 -88 107 66 43 59 168 -11 -111 -198 354 -79 28 81 49 197 -327 -32 -29 15
7808 15 -25 -64 90 0 16 -26 -184 -66 136 -123 -71 216 108 220 132 97 -26 -31 -136 149 30 -19 -72 13 47
7833 47 38 -7 -121 -3 13 -77 30 -32 -97 185 -111 25 -26 45 -94 -20 -282 84 -99 143 50 44 2 -29 -15 326
7859C26j16j26j05j5J14n2L0n3k5N8rj47R9K19l10Q9N3j9Q2l7l6k10j24L00l7
7884e1J7J64k52K54j9l46O4J19m4j2J74j58J71q0J11m5k35L23l58L64l43K16r7
7907f3N7J41j50K7p9q9J53M9J40k46J16nj23n3N5J6j6J58l57J34N9L11k16k73
7931b54P6K56j46p4oJ05R1m5J90j35J0N7L1l10R2lJ39k05o4nJ99K0O7r9k31K63
7957A9k5l7k05M53j73pK95l50J16J70k48o2j21K03R4n3l21J76K36k38L2Q0l7R
7981FJ19j95J54R6l94K59Pq8JQ5k8J28r2P0p6j30OP8j65K46j84j00L99k43Q2P4
8007A15r6K3j11l8J93j85oJ27L34m00N5o1l9Q2j50Q9J73j33J9J3J1M3o0k4O0j61
8033a27J79r2J16l19J76r4J33j1j08K30l6r8L7P3J06j49m3M8K42j77J45j34l3
$$ plain form
7859 326 210 84 -21 -36 78 26 56 3 -22 36 27 -120 -21 198 -112 -23 30 11 93 56 20 -190 -314 -14 -51
7884 -51 -34 130 -122 132 113 -233 -169 -50 -94 -106 68 -90 81 1 112 67 -168 155 -203 161 -182 34 -63
7907 -63 -6 135 -15 12 -67 -156 -3 46 186 -60 56 51 -72 -125 -70 -54 -70 88 -269 -135 -76 235 19 -254
7931 -254 -178 78 -68 -142 -148 -43 48 3 193 58 68 125 156 -154 -62 -65 74 -131 -195 -200 -1 19 86 -13 -244 19
7957 19 -6 -43 -248 205 32 25 320 -30 86 256 8 -54 -175 28 122 69 -252 -76 160 -78 -46 34 -3 6
7981 6 125 -70 84 180 -214 45 52 -36 -35 50 22 150 58 128 52 -78 -72 6 -159 87 -97 -197 202 -41 41 115
8007 115 19 42 -69 -107 86 -99 -105 22 356 -44 11 -50 -89 -7 -157 -68 105 -28 -9 4 15 58 -2 -26 34 -127
8033 -127 52 -40 76 -243 -67 -161 -28 -39 -147 83 47 -51 -14 59 165 16 -27 21 263 86 231 97 64
8056F4o4O0nj11n4O8J00qK16j87q9j86K36k06K95j6j11J82j06l22K27N5m1j61
8080a64K13j21J75j34qj4o3Q5J40p0Q9k22K55j35J18r5mJ84k00k3j41J60J22k4
8104A23k73K17l9P9O1l24Q3nJ51j32K23j34Pj08J89k1po9j40K32j14o3J98n1n6
8129B7LM3M6Lk53j7K03l7j00Q0L51l15j0L23m63M9Q9r9J65l9j20J62j14q4R1k13
8155b29J22P2K1J83k03koK83k70J12k9j09JJ31o7N5R0j72q8J07j1J9QK36j56r0
8181Hj69M8K54r2j6m9r8L48k33q3
$$ plain form
8056 64 0 60 55 -56 -110 -42 58 50 266 79 -10 -196 40 -166 129 113 2 184 78 -244 -17 38 -3 -164
8080 -164 49 -72 103 -31 -39 -53 -116 -31 109 39 128 -94 161 26 144 49 45 229 29 6 -135 25 147 123
8104 123 -150 67 28 107 168 -156 -73 -78 73 -59 164 30 37 -71 118 97 90 21 -119 113 -1 -64 134 83 27
8129 27 30 73 119 122 -131 -148 55 18 -82 -2 349 34 24 347 -116 -67 22 -77 88 49 -71 91 -23 -107 -16 -229
8155 -229 -107 -35 -14 169 -34 -36 -42 241 -29 83 54 -55 -54 77 10 65 155 -17 -105 2 -9 10 18 254 98 8
8181 8 -161 -113 141 49 33 -16 -114 234 1 -82
8191h2
$$ Imaginary data points
##PAGE= N=2
##DATA TABLE= (X++(I..I)), XYDATA
0@%%%%%%%%%%%%%%Qj6J6j6J6k4L2l3M1m9N7o9P9r1J06j22J39j61J83k05K31k59
36a37K92l32L71m12M60n13N70o30O98p72Q53r40J035j140J255j384J525j681J856
55I74k053K277k534K831l179L594m097M724n533O617q162J0558j4806K4618r3015
70g7186k6294J34049J1858M051K4868L3014n1933p9912o0114o721J9657N2402
82b2261N5042L6894N692J179k0873o5755q2744j7464M3177L9200K2018N1656N6246
95A02007l861o1462n5450k9676j9610r160K2423N5281O2313K8862j7558m1918
107C2191l7780l2819l1515j9259J8761O0623O8399K6904j9567k6684k0840l4740
119a6326m6415k4151K1820N7732N8198K0754j4927j6822j3171l8114n7822k5757
$$ plain form
0 0 0 0 0 0 0 0 0 0 0 0 0 0 0 0 8 -8 8 -8 8 -16 16 -17 24 -25 32 -37 42 -49 57 -65 74 -87 96 -109 122 -137
36 -137 155 -177 194 -218 242 -271 299 -331 367 -405 448 -492 543 -597 658 -726 799 -882 974
55 974 -1079 1198 -1336 1495 -1684 1910 -2187 2537 -2996 3621 -4541 6017 -8789 15829 -77186
70 -77186 -103480 30569 42427 46478 71346 104360 52427 -27485 -87599 -94320 -74663 -22261
82 -22261 32781 69675 75367 76546 55673 -10082 -92826 -110290 -67113 -27913 -5895 45761 102007
95 102007 98146 36684 -18766 -48442 -68052 -77212 -54789 492 62805 91667 74109 32191
107 32191 -5589 -38408 -69923 -89182 -70421 -9798 58601 85505 65938 39254 18414 -16326
119 -16326 -62741 -86892 -65072 -7340 50858 71612 56685 39863 26692 -11422 -69244 -95001
131i5001L1265N5296L8825J7896J1623M092k3402n2007m8104j2897J9244L2678
143b0492L3879K9166J9619K692k6671n2828m4071p585J4703J6755K6562M2789
155C4518L7043M23l5659m3054k7236j2330p863N496L4488N0156L1032m985k8952
168C3077l1837k5494k2830j7555N680L9910N1728K7425m110j5749j9188k8043
180f986l5445k3358R512L9633M1368K0155M350k269j6241l7264m1853k0335J3579
193e5154L4021L1887K2564J8333P816j8829m2392l9835j5527Q634K1370K5154
205a958K7505K6145R557k1389m2966l5986j3289K691J1119K3645L7688L4154O954
218F3870k3996l4610k7444j9180j1081O883K8608L8801K8830N704j7611k8285
$$ plain form
131 -95001 -63736 -8440 30385 48281 59904 63996 40594 -11413 -59517 -72414 -53170 -20492
143 -20492 13387 42553 62172 64864 38193 -14635 -58706 -66291 -51588 -34833 -8271 34518
155 34518 71561 71984 36325 -6729 -33965 -46295 -54158 -48662 -14174 35982 67014 62029 33077
168 33077 1240 -24254 -47084 -64639 -58959 -19049 32679 60104 55994 40245 21057 -6986
180 -6986 -42431 -65789 -56277 -16644 24724 44879 49229 46960 30719 -6545 -48398 -68733 -55154
193 -55154 -21133 10754 33318 51651 59467 40638 -1754 -41589 -57116 -48482 -27112 -1958
205 -1958 25547 51692 61249 39860 -3106 -39092 -52381 -49690 -38571 -14926 22762 56916 63870
218 63870 39874 5264 -22180 -41360 -52441 -45558 -16950 21851 50681 56385 38774 10489
230A0489k7070k3551j6714L915L1160M1422K6944N001q962j7765k8826l3436j9518
243e6911P654K8781L2798K4124J1070k142j7362l1122l4782j9932P775K6390K7800
256D141K3323J9374O148j7375l4775l1939j5962J564J5927K5566K7588K0837N482
269D9899j4889l1052l2319j7422L46J1259K0822L0386K8336O915j6821k6189k4206
282a4935j9956j0745O883K4160K9597K2997P988r624k2913k5866k1234j1872K927
295d2593K1660L1486K4459Q549n354j5799k4387k6049j5477L270J9079K5346K2715
308B6905J2806j143j4748k3608k5796j7042L52J6967K3849K2661J6099M632j1181
321C0753k4602k5495j6542l168J0514K1199K3678J7493N273q677k0923k5422j9204
$$ plain form
230 10489 -16581 -40132 -56846 -52931 -21771 19651 46595 51596 42634 24869 -3957 -37393 -56911
243 -56911 -49257 -20476 12322 36446 47516 45374 28012 -3110 -37892 -57824 -50049 -23659 4141
256 4141 27464 46838 52986 35611 836 -31103 -47065 -45501 -29574 -4008 23580 44417 49899
269 49899 35010 3958 -28361 -45783 -45437 -34178 -13356 17030 45366 52281 35460 9271 -14935
282 -14935 -34891 -45636 -38753 -14593 15004 38001 45989 36365 13452 -12414 -33648 -45520 -42593
295 -42593 -20933 10553 35012 43561 38207 22408 -1979 -28028 -43505 -40235 -21156 4190 26905
308 26905 39711 38568 23820 212 -25584 -42626 -42274 -25307 -1458 21203 37302 41934 30753
321 30753 6151 -19344 -35886 -39054 -28540 -7341 16337 33830 39103 30426 9503 -15919 -35123
334c5123m981R098J8550K2824K0872J0093o458k0491k3077j8920r034L150J6292
347a7205K3692K0368J0351l703j5777k3323k0869j0703K314J3766K1592K3008
359B3511J4637j152j5228k0962j9069j4356l920J1326K2524K2477J3211J373j0412
372B3960j8778k2018j6402m200R817K0282K2955J6446M374q621j6359k0857j9679
385b9080q387Q243J9708K0440J5207O917l208j5675k3313j9894p358P028J5783
398a3589J9330J7982J1390j730j5204k2508j9686r027L645J2409J7508J9013J3927
411C3460k96j5149k1385j8015r324p1R102J8407K1932J5336l42j3339j7757j6972
425a4413j3039m722P722J8406K1722J4344L14r806j5105j6572j5477o896P008
$$ plain form
334 -35123 -40104 -31006 -12456 10368 31240 41333 34875 14384 -8693 -27613 -36647 -33497 -17205
347 -17205 6487 26855 37206 33503 17726 -5597 -26466 -37169 -34855 -21089 503 23511
359 23511 38148 36996 21768 806 -18263 -32619 -36539 -25213 -2689 19788 32999 34372 23960
372 23960 5182 -16836 -33238 -37438 -27621 -7339 15616 32062 36436 27815 11456 -9401 -29080
385 -29080 -37467 -29224 -9516 10924 26131 33048 29840 14165 -9148 -29042 -36400 -29372 -13589
398 -13589 5741 23723 35113 33383 18179 -4329 -24015 -33042 -29397 -16988 520 19533 33460
411 33460 33164 18015 -3370 -21385 -30709 -30780 -21678 -3271 18661 33997 33655 20316 2559 -14413
425 -14413 -27452 -32174 -24452 -6046 15676 30020 30334 20528 5423 -11149 -26626 -33522 -26514
438b6514J9140K1079J3232K404n464j1424j8504j9105q250P532J6681J7168J2798
451B0773O972j449j1543k0067j8887p396O453J3571J4921J4231J0748J467j1668
464A8126k0863j7778o300K830P774J3428J7466J3082Q18j1642j7692j5861q108
477b4720m60N972J3249J9388J4687P32j1597j4107j2531j0899p400M410J6786
490f490J8946J0123J501m665j1344j5660j3039o226L241J4413J8924J2385J200
503B3309l694o405j3615j9179j0380P027J5998J2426P429P941M062r725j8214
516c020j5417n842J813R956J3855J2496P380L108o039j6552j7796p748L142P117
530a3547R134J3108J3607L926j0641j5354j0871o991m789K725J3419J7080J1038
$$ plain form
438 -26514 -7374 13705 26937 29341 23877 12453 -6051 -25156 -33406 -25874 -9193 7975 20773
451 20773 27745 26296 14753 -5314 -24201 -31597 -25144 -11573 3348 17579 28327 29794 18126
464 18126 -2737 -20515 -26815 -23985 -16211 -2783 14683 27765 28583 16941 -751 -16612 -24720
477 -24720 -25180 -19208 -5959 13429 28116 28848 17251 3144 -9387 -20286 -27686 -23276 -6490
490 -6490 12456 22579 24080 19415 8071 -7589 -20628 -26854 -23613 -9200 9724 22109 23309
503 23309 19615 13210 -405 -19584 -29964 -22937 -6939 5487 12916 20857 24919 15194 -3020
516 -3020 -18437 -24279 -22466 -12510 1345 13841 21221 24329 18290 1738 -16058 -23806 -20664 -13547
530 -13547 -4413 8695 22302 26228 15587 233 -10638 -17629 -22418 -19693 -6274 10806 21844
543B1844J005o948r788j0970j1715q012K836J4390J6164R861J501m050p256j0613
557a751j3573j0027K937J4846J5311P981K115j87l751j2256j6853r946M244J2716
571h194J0741Q039P290L199o721j3636j4057p997J265Q216J0933J0806Q547K876
585B1307o475j2602j2784p617o13M330Q919J3077J1710J823p856j0345r075q364
599a4565n594K148J1123J5210J0307N30n715p473q374j0430p693J524J0552J4732
613F282R802P30l686m580p791j2317r599J623J1406J2746P982L077J16l924j0534
628A333j3195p743K038Q358R551Q735O211J754m455j0926j2261o381R02N401P498
643c180R940R248K936n863j1179r907n716j465J648P186J2231J0018J922n870
$$ plain form
543 21844 22849 15901 6113 -4857 -16572 -24584 -21748 -7358 8806 18667 20168 16118 8862 -1751
557 -1751 -15324 -25351 -22414 -7568 7743 15724 17839 17652 13901 1645 -15208 -25154 -20910 -8194
571 -8194 2547 10586 17876 21075 14354 718 -13339 -21336 -20071 -11855 -922 9884 18431 21307
585 21307 14832 2230 -10554 -18171 -18784 -14454 -5535 7542 19252 21075 13219 2874 -6201 -14565
599 -14565 -20159 -18011 -6888 8322 18629 19159 13444 5971 -2403 -12833 -20526 -19002 -8450 6282
613 6282 16084 16814 13128 8548 757 -11560 -21159 -19536 -8130 4616 12598 15675 15791 11867 1333
628 1333 -11862 -19605 -17567 -9209 342 9077 15288 17042 12587 1661 -10600 -16981 -16079 -10678 -3180
643 -3180 6760 16008 18944 13081 1902 -8005 -13721 -15186 -13538 -6352 5879 15897 17819 11949
657A1949q654q184o695m053L07P708J2741R723J668m393o357p321q168o468k01
672a6398Q345J2178P829K225j614l915q396r899o811R82P844R627O855M126R86
687A3964l309r179j0726o069R23N889P557O869O504K838l752r787r708n393N7
702a3322L644O105Q238P776L347m173q954q584m751j986J045N714R632Q040L027
717A4798l973p076o907n963m380O12O382R670P715K583k335n345o507p249n197
732a3172l30O592R039P009K515m75l244p012q477n834L46O159P474O157M302J059
748A2108k897p509q611n375P6M386O042O428N605K646l048p637q001m690r00K662
764h715N109O879O767K819k878p007p118m653k212J095M756P530P150K688k584
$$ plain form
657 11949 3295 -4889 -11584 -15637 -15330 -7622 5119 14842 16510 12117 5760 -1561 -9729 -16197 -16398
672 -16398 -8053 4125 11954 14179 12565 8650 254 -9645 -16456 -15474 -7630 1997 8852 12978 13964
687 13964 10655 1476 -9250 -15319 -14396 -8507 -950 5919 12423 15261 11509 1722 -7986 -13379 -13322
702 -13322 -9678 -3573 4665 12441 15788 11615 2661 -5923 -10674 -12660 -11615 -5901 3731 11771 14798
717 14798 10825 3749 -3158 -9121 -13501 -12889 -6507 3163 10878 13461 11126 5781 -726 -7975 -13172
732 -13172 -13502 -6910 2129 9138 11653 11178 7934 922 -7555 -13389 -13043 -6884 590 6747 11049 12108
748 12108 9211 1702 -6909 -12284 -12208 -7822 -1780 4648 10253 12899 9851 2214 -5787 -10477 -11377 -8715
764 -8715 -3606 3273 10040 12859 9981 2974 -4144 -8797 -11009 -9914 -5158 2372 9522 12210 9626
779I626n505o098n697l485L15M940P603O594K833j115m443n730o124m385m88M830
795f329P013O080L409l42l030n705o641n080l27M246O102N653L939J395k567n763
811B053o906m899m20K975N175N639M724K086k166n359o539m684j561K139M409
826c334N613N411K443j419m955o234m802k084Q73L854O012N849K429p41m661n331
842a077m997l124K93L433O032N583K905m35l482m972n174l858k64L185N527N458
858E033L364K63k676m787n303l921j095K531N393N092L463J333k328m266n246
873c150m022j574J956M524N321L767J696j414l949n628m307j711J513L849M750
888A621M046K677q07l678n439m294j969P53L162M660M721K487k08l723m647m100
$$ plain form
779 9626 4121 -1977 -7674 -11159 -10844 -5904 1699 8293 11126 10011 5568 -162 -6286 -10671 -11159 -6329
795 -6329 684 6764 10173 9831 6801 1096 -5545 -10625 -10952 -6706 -604 5049 8988 10383 7816 2053
811 2053 -4853 -9752 -10172 -7197 -2022 3617 8341 10427 8261 2902 -3637 -8321 -9882 -7743 -3334
826 -3334 2279 7690 10133 8714 3759 -2475 -7277 -9361 -8488 -4634 1378 7227 9656 8915 4254 -1077
842 -1077 -6074 -9198 -8905 -5472 560 6143 9048 8613 5131 159 -5015 -8873 -9137 -5952 -425 5033
858 5033 8397 8660 5984 1197 -4106 -8027 -9122 -6591 -1198 3894 7357 8690 6362 2096 -3150
873 -3150 -7172 -8746 -6790 -2266 3055 6822 8518 7104 3155 -2473 -6780 -8491 -6978 -3129 1621
888 1621 5667 8344 7537 3859 -1580 -5874 -7843 -7090 -3928 732 5453 7940 7732 4009 -638 -4738
904d738k676n5K551M557M949K981j65k894m255m037l129n84K256M310M795L161
920G027M08k258m159l933l263j432J830M308M675L158N08j430l262m265m126j513
936g727J876L910M299L056J574q19l299m468l975j630J095L472L904L170K106
951F544l09k813m300l986j784R87K282L628L603K710J36k673m326l743j711k31
967e986J787L633L869K927M6k511l599l209k149r49J474L482M129K926K20j918
983D172k876l447k908j227J463L014M234K735M94j351k396l239l292j465J005
998e084L401L656K360P74k59k107l575l545j718J282K492K987K880J699J20k302
1014C061l638l277j557O11K243K453K942K211P12k468l743l068j354K37J128K326
$$ plain form
904 -4738 -7414 -7469 -4918 -361 4588 7569 7404 4510 255 -3782 -6911 -7495 -5239 -929 3866 7027
920 7027 7435 5177 1018 -2915 -6178 -7610 -5780 -1472 3203 6361 6869 5439 2177 -2088 -6214 -7727
936 -7727 -5851 -1941 2358 5414 6988 6169 2870 -1598 -5573 -7203 -6108 -2636 1268 4438 6544
951 6544 6235 3422 -878 -4864 -6648 -5661 -3379 249 3852 6562 6698 4025 -301 -4044 -5755 -5986
967 -5986 -4199 -566 3303 6230 6276 3765 166 -3043 -5192 -6141 -4667 -1185 2944 5870 6090 4172
983 4172 1296 -2151 -5059 -6286 -4823 -1809 2425 5160 5654 4303 1907 -1332 -4624 -6089 -5084
998 -5084 -1683 1973 4333 5107 4848 2741 -834 -4379 -6097 -4815 -2323 664 3544 5243 5363 3061
1014 3061 -577 -3854 -5411 -4800 -2557 -104 2838 5049 5761 3293 -450 -3518 -4872 -4635 -3507 -1181
1030a181L697K687R9k050k733k765j857p50M86L120L829K249K27j914k113k365
1046a334k508j384O27L183L705J803M18r37j780k464k950j516Q93K804K778J948
1062C286Q76j28j695k598l243j305O52K109K783J910J636qj302l275k735j283
1078d320K52J518K360K571J938K35j656l142k294j068m57J177J935L198J891J82
1094D320j818k212j823j598r41N30K304L083K127J05j347j916j716j959j609M48
1110d022K810K948J783O0q16j280j953k279j447M86K342K356J579Q73j54j088
1126B198k512k588j053O51J579K341J252J525M45j575k443k318j003L79J362J372
1142c88K206J676N06j823k249j876r95l40Q48J572K081K317K59j362k157j658
$$ plain form
1030 -1181 2516 5203 5302 3252 519 -2246 -4103 -4853 -4367 -1247 2582 4831 5058 3144 1031 -1334
1046 -1334 -3842 -5226 -4599 -1416 2289 4092 4510 3573 1793 -671 -3621 -5137 -4244 -1440 1338 3286
1062 3286 4162 4034 2339 -259 -3502 -4807 -4155 -2046 737 2647 4283 4275 2973 -302 -3037 -4320
1078 -4320 -4068 -2550 -190 2381 4319 4554 2898 -244 -2538 -3606 -4063 -2886 -951 2247 4138 4320
1094 4320 2502 290 -1533 -3131 -4072 -3542 -1238 1845 3972 4077 2730 814 -902 -2861 -4470 -4022
1110 -4022 -1212 1736 3519 3579 2763 1483 -470 -2749 -4196 -3710 -1368 988 2567 3440 3286 2198
1126 2198 -314 -2902 -3955 -3304 -1725 616 1868 3393 3838 2263 -180 -2498 -3501 -3122 -1760 -388
1142 -388 1818 3494 4000 2177 -72 -1948 -2943 -3283 -2435 -863 1218 3535 3794 2432 275 -1383
1158a383j253o18L45J965K235J877K67j051j811j349j581r33K08J928K334J582
1174B762L17n65j054j847j941j317P05K094J541J453P09k54p92j942k170r29M08
1191b822J670J333J292J343K04r67k098j967q77L02J018J155J728J497L82j287
1207A906k040j584p43j11M15J463J723J768K82j035j730j468j154m95M01J491
1223i11K186J393K89j193j193j161j330r57K61J589K066J240L04m20j047j362
1239b46j613q75j6J842J531J069M69K69p20j742j741j271M98J248J719J050P06
1256B177K87r11j739j712l29j46J098Q53J669R97L22q64j604j242j089n6N01J114
1274f74J627J256M89r19j403j287r46m61N50J150J407J379J12o85j016r53j232
$$ plain form
1158 -1383 -2636 -3254 -2909 -944 1291 3168 3435 2384 573 -776 -2357 -3290 -3082 -1154 1180 2762
1174 2762 3079 2514 1460 -387 -2328 -3645 -2940 -846 695 2148 2857 2603 1811 -131 -2301 -3230 -2822
1191 -2822 -1152 181 1473 2816 3020 2053 -45 -2012 -2889 -2587 -1569 -414 1314 2811 3193 1906
1207 1906 -134 -1718 -2461 -2572 -2157 -694 1029 2797 3079 2044 314 -1154 -2308 -2803 -2402 -911
1223 -911 1275 2668 2957 1764 571 -590 -1920 -2877 -2616 -1027 1039 2279 2583 2163 1116 -246
1239 -246 -1859 -2734 -2750 -908 623 1692 2161 2430 1710 -32 -1773 -3044 -2546 -1298 421 1471 2177
1256 2177 2464 1553 -186 -1898 -2227 -2373 -1275 -422 1247 2244 2566 1702 98 -1144 -2233 -2289 -1788 -674
1274 -674 953 2209 2698 1779 376 -911 -1857 -2318 -1768 -618 789 2168 2280 1595 579 -374 -1606
1291a606n20J24J139J448J340L07n65p25j101j640l46R2J128J375J049M94Op46
1309A253j337j514o06K45J003J100J123P57Q4n83j690j099r76M24P13J099J117
1326A113Q62J95n96j641j272n37p5L93J310J032J084K24q77j046j089p32k47M11
1344a488Q19J333J100J34l40j191q40r76o26N05P76J383J052K89k95j000o78j235
1362a278n59J03P24J262J010M94p1q41q28j069r90M37Q37R47P89O30m0n87r77
1381gj279k89j8N93R04R15P86O0n45j045j021o61J82N42N09Q87R37L99p01r94
1401A54r76m51k21J92R22Q39Q53K83k82j078p31q18n8%N99J098R89K06k44o69
1421F07q27q68m31p9R95R17P95L02k35n55o53r67n64Q2Q79R25N00N94J19o42p88
$$ plain form
1291 -1606 -2126 -2002 -863 585 1925 2232 1667 942 -159 -1799 -2145 -2053 -925 450 1499 1993 1999 1253
1309 1253 -84 -1598 -2204 -1959 -956 144 1267 2024 2108 1525 -165 -1264 -2240 -1816 -1103 -4 1113
1326 1113 1975 2170 1574 -67 -1339 -1876 -1951 -1558 -248 784 1868 2092 1215 169 -920 -1652 -1899 -1488
1344 -1488 -669 664 1764 1898 1558 367 -473 -1449 -2075 -1570 -794 589 1641 1930 1635 635 -43 -1278
1362 -1278 -1837 -1734 -1010 252 1262 1756 1685 844 16 -1053 -2043 -1606 -769 178 967 1597 1557 970 -7
1381 -7 -1286 -1575 -1593 -1000 -96 819 1605 1665 1120 75 -946 -1607 -1425 -883 -374 513 1450 1849 1148 154
1401 154 -822 -1273 -1494 -1302 -380 459 1312 1595 1313 235 -496 -1314 -1372 -1372 -773 325 1314 1520 1276 607
1421 607 -220 -1088 -1519 -1598 -603 314 1109 1411 1176 621 -32 -999 -1563 -1481 -602 323 823 1417 1536 894 106
1442A06j055o24J37O67O94J060K55J7k23o28j186p70K41L11Q32P72N57Q9k75p54
1462B23j084l51Q4K46N06Q71N14M11n25o51n77o64n9N7N45O69Q94L71m44p43q00
1483e07l75l42Q0N69Q58N25M54n12j17q07n59m68K6N03R25O87Qj5m37o49o39l96
1505a188J9O13Q78J18N79J24l96m54r19o46MP09O85M02M72J17k27q33q71j52R0
1526h76J51M15P30O62R7k55q45n35o19j15M17K49Q69P43r4j84q69k80n09l5L1
1547h52M88Q50M71K36m01l47n12p01k10P2N22M85P53K44k49k60n26m80o18k8N08
1568e55P97L18N23j97l92m73n21n95J85M91M15M77L98K3r6o56p90m32J74M82L96
1589b8L06O71o5j23q93l33n10R9L25K19O68O00k4k90m65o31j43k30K31J37P73
$$ plain form
1442 106 -949 -1573 -1436 -769 -75 985 1240 1257 1034 406 -780 -1550 -1309 -998 -166 606 1163 1252 977 223
1462 223 -861 -1212 -1128 -882 -376 495 1009 1420 895 244 -333 -997 -1056 -999 -454 215 1109 1480 1036 293 -507
1483 -507 -882 -1224 -1144 -575 283 808 1262 750 633 -174 -733 -1201 -1175 -672 253 940 948 933 496 -153 -792 -1188
1505 -1188 -1169 -556 322 440 1019 1143 747 293 -626 -1272 -1268 -559 126 528 1000 1117 890 57 -814 -966 -876
1526 -876 -725 -310 420 1082 1179 924 79 -456 -1075 -1190 -773 -524 345 1088 994 810 -59 -339 -848 -883 -852
1547 -852 -364 486 957 1193 792 445 -67 -768 -978 -906 -384 101 854 1098 849 589 63 -417 -1035 -1063 -555
1568 -555 242 560 1083 886 494 21 -500 -1095 -910 -419 -4 473 871 894 798 142 -648 -1080 -906 -424 -28
1589 -28 278 949 884 761 -132 -465 -975 -876 -551 -332 336 936 912 622 157 -474 -617 -847 -616 -479 294
1610B94N47J33m15l62n47k30n88K38O51N38N49L4j27k54n98m22n49L34L03Q72
1630D01K30J86j70mn65n78k67R0J74M21P29O2k04j35m89l75q8j40M69L60K76J94
1652E77K77q8n57n49l15k22M87K53M80L95m6j24n89j99n90J55K79J58N53K08K31
1673G74k21j86p62l39N9J19J90M76O55j30k04k83l37m06j90j48N37M75N55m2J97
1694G89o89j64n45l9j01L30O84Q5K20J09j07o74l10k58k38N09M03J65N61l6l38
1715C56l08l44k37l9J49K30L26M23K12q8n66m54k09J27j79J38O71K50M8Q4l48
1736B42l43k19m51K89M69K67L18J14l26k35m20j87k64J6N14L70L92n0J67m61j26
1757G6l99j11j8P0M52K70J10J95r4m09m32n37K04M62R4L09K09K47k66n80l16p4
$$ plain form
1610 294 841 974 559 197 -350 -580 -1168 -930 -279 259 808 842 715 461 -137 -559 -1108 -774 -471 401
1630 401 631 817 647 643 78 -500 -767 -677 -503 -82 647 709 505 370 -119 -494 -582 -722 -253 107 383 577
1652 577 854 766 209 -340 -655 -877 -390 -137 343 738 692 568 -21 -220 -810 -655 -376 -218 335 543 774
1673 774 553 367 -395 -734 -675 -556 -366 110 765 635 431 148 -189 -595 -785 -933 -396 79 634 592 789
1694 789 100 -64 -609 -648 -749 -419 265 350 570 679 572 -102 -412 -670 -908 -399 4 169 730 694 356
1715 356 48 -296 -533 -572 -423 -193 133 556 768 680 114 -340 -549 -422 -601 -463 208 458 506 590 242
1736 242 -101 -320 -771 -482 -13 254 572 686 360 125 -295 -482 -746 -730 -216 154 546 496 663 202 76
1757 76 -323 -434 -452 -382 70 340 450 645 551 142 -290 -827 -623 -161 -67 242 451 698 432 -148 -464 -538
1779e38p1J81L49K55L88J1k22k05l18m49J83P9J62K91N33q4p8l07l99l4o5r7L55
1802h0K72L67J6k01j77m01l82l2K21K97L81R9Q7j03L4j19n58m27J28M85L06K37
1824D50J96k02j65k82r6l90K06o4L88L59j22K18k8l39o00O9j60K54J39L36K91
1845D58j16J0m90j44P3j05L7K95J05O05r3k03l84j23l37k66M69J03J52M17j77
1866B86J1j90j58l47r8K35J87K98K07J72k75p6j92m40j24K53K4K55K52M6m3K00
1888D83p32Jk95J20N29q1K01K73p7o1l92l16L3j81L46K39J11J97j54J08n09k14
1910c71K6n3J83K74M0L65j21p7l01j23p8o3j09M35K52J87K8k24j62k27k79mJ2
1933c90J40M39J55l8o6k31j49j0k46l5M07K4K63K34k50jk62n19L28j43L44K9L29
$$ plain form
1779 -538 -609 -428 -79 176 564 575 353 148 -170 -619 -436 -357 -195 96 629 545 467 160 -239 -273 -338 -435 -80
1802 -80 192 559 575 374 197 -204 -586 -618 -397 -100 281 380 467 364 398 279 -279 -706 -578 -93 213 450
1824 450 646 444 279 -3 -99 -489 -283 -347 41 400 278 496 468 129 -471 -402 -562 -308 -169 167 458
1845 458 342 352 -138 -282 -209 -314 -277 18 123 728 635 432 48 -75 -412 -678 -209 -106 46 463 286
1866 286 297 107 -51 -398 -496 -261 -74 224 431 603 328 252 60 -380 -504 -251 -227 28 280 326 283 483
1888 483 -249 -248 -543 -423 106 25 226 499 422 361 -31 -347 -314 -495 -149 90 201 398 244 352 -157 -371
1910 -371 -345 -398 -215 59 99 464 343 266 -35 -158 -236 -299 -408 27 279 466 494 270 108 -119 -398 -402 -390
1933 -390 -250 189 344 306 240 9 -140 -150 -396 -431 -24 0 263 497 247 246 -16 -535 -207 -350 -6 23 352
1956C52l1K32l73l12k29q4rM13J11N7K35J32l36j54l46n7r6L87K48r9J84R1J1
1979C27l97j78l33J79k9L78L83L2J18k38m16M3k10k7k69L69K59M44q8l53J05k43
2001a44J36l64K3L29J96K10l0j06k25l7j35k69K5P9K96K66J43j06k7k98k18r9
2023c55O8R5J04K25J66J68k14m02j09j65J86m6J30L44r1K49k25o6k10j51J66o9
2045b02O6J66M87l4m79M8l61j08L48k61K63K16K04J03j33q1m00m5j30J11j4L13
2067G7M90m43Q6j25j42l90P8J52R8K24J72l7p6l8m4m24O3J39q8L99R6k58K12q9
2091A32j40j74j60m3J41K38K51J24j12p1j96j82j34L1J15J01L60J30k68L9j27
2112E5k26k24j3L37N9L21L0k10K7j81j26J21k65L5j3L58P7K49m12J73k01l41Q4
$$ plain form
1956 352 321 553 180 -132 -361 -445 -454 -41 70 127 362 494 158 4 -342 -399 -495 -108 140 41 225 316 327
1979 327 -70 -248 -581 -402 -431 -53 330 362 480 242 -174 -131 -341 -368 -637 -268 -9 435 347 -6 99 -144
2001 -144 -8 -372 -349 -20 176 386 356 250 25 -12 -147 -416 -391 -312 -16 250 393 287 260 -38 -256 -355
2023 -355 -287 -192 -88 137 303 471 257 -145 -254 -419 -233 -279 -149 195 104 353 128 62 -148 -299 -133 -202
2045 -202 -136 30 517 483 4 52 -309 -417 -69 -330 -67 149 353 456 323 242 -158 -203 -333 -222 -236 77
2067 77 567 124 210 85 -57 -447 -369 -217 -119 105 277 240 164 126 82 -342 -279 -140 -228 171 267 9 221 132
2091 132 -8 -182 -342 -385 -244 -6 245 369 257 186 -10 -192 -326 -295 -180 -79 281 411 143 182 55
2112 55 -171 -395 -408 -71 -12 309 339 129 156 -25 -151 -30 -295 -260 -273 85 162 411 -1 172 -29 -370 -286
2135b86jl5M21Q9K05j63k95M6k35m6m2J79L06l49M11J09k09j82p6k19K74NML15
2159B26O6j52k8j95qk40J4J99J23M5K02kn7n7k24k1m08M99k0K14J41K0j96l46
2183b05L08k23k04J15M34k28K55kmM8n44p3K81j45J23J81M4o1Q2k26j66Q1j78
2206c07J30J64K4n4K01J2k1j52l12M9p1K78Q1K82NM3o2l53pL2k97l9J96J96L41
2231C59j4k16r1k00q8R8O8n4K08L27l59j18K7m9p1P9J89j59J20K10J7j81k59j36
2255b93L8J3J37R4J96J26k0k32L6q8l49J68J4R6K17r4P0J65k69l27J14k17J50
2278b55L48k24K88j69L01l23j02l1j54P6l4K69J97o8O7k5N3m85J61j18R2J76J48
2301A88j0J31r2l76P6q3p3J62Q4OJ0L21k57q4k2k86J51J07L7MK47J36k98J60o0
$$ plain form
2135 -286 -287 -322 99 188 393 230 -65 -19 -254 -300 -342 -163 143 -206 205 314 105 -77 -153 -372 -98 -93 -89 226
2159 226 292 140 112 -83 -91 -331 -317 -118 5 50 252 250 193 136 -88 -109 -517 -18 -38 176 317 337 141 -205
2183 -205 103 -120 -324 -209 225 -3 252 250 246 294 -250 -323 -42 -187 -64 117 161 100 182 -44 -210 -129 -307
2206 -307 -177 -13 11 -43 158 170 149 -3 -315 -266 -337 -59 22 304 309 352 290 -63 -70 -38 -335 -374 -178 18 359
2231 359 345 129 38 -162 -250 -152 -84 -138 70 397 38 -80 -53 -102 -173 -94 95 -64 56 266 283 102 -157 -293
2255 -293 -255 -242 -105 -11 185 311 291 59 95 7 -342 -174 -160 -64 153 59 129 294 25 -302 -188 -405 -255
2278 -255 93 -131 157 -12 289 -34 -136 -167 -321 -245 -279 -10 187 119 186 161 214 -271 -110 -228 -136 40 188
2301 188 178 309 217 -159 -83 -166 -239 -77 7 13 23 344 87 3 -19 -305 -154 -47 -10 -6 241 377 79 239 179
2326A79l49j71O2J88K36J75jj77j2r4k28L2J9J4J01m9L87o7j77j1k89m6o9K22
2350a25J3J80R3J8j18k06l4K0p6J42K55m4J52K0l23ol6j05JP9O3J30j44K6J24
2375I9J02q6m22K01j56K01p3L48J80k76l41N6L6R5O8j99K15L26j32j77J12l74
2397a97j06J76j97L10j89L10M5n5Q1r1j66k10J98j70J57K27R5k8L4l22j43J34
2419a07J2n5K91k02J56K12k04r5Q9l27J23j56k2K89L04j80J01j80p6m2j83K97
2441D5j37K72l7j14J44q1q0j39j34Q6L4L15k1J53k68J20j78j16q%L21j7J55J41
2465D56j88j39j49r1j68r5L82o4J1P4M9Q3l66J99m18K66K72n3n4K73k00J07j28
2488E9k96J17q3K20m4J85J11p3p2j88O0j44n4k8J38L0K32J86j14l38j15J19l08
$$ plain form
2326 179 -170 -341 -279 -91 145 320 319 142 130 36 -192 -160 -141 -127 -26 -75 312 245 68 57 -232 -278 -347 -125
2350 -125 -112 68 161 179 61 -145 -179 -159 -235 -93 162 118 270 290 -33 -39 -75 -180 -179 -100 -37 93 -51 -25 99
2375 99 201 115 -307 -106 -262 -61 -134 214 394 118 -223 -167 -131 -36 32 -167 48 374 242 65 177 -197
2397 -197 -303 -127 -324 -14 -203 107 152 97 178 87 -79 -289 -91 -261 -104 123 218 190 224 -98 -241 -107
2419 -107 -95 -150 141 -61 95 307 103 8 97 -230 -107 -263 -285 4 308 128 229 49 -27 -69 -252 45
2441 45 -92 180 143 29 173 92 12 -127 -261 -175 -141 174 153 306 38 158 -20 -136 -144 -144 177 160 315 456
2465 456 268 129 -20 -111 -279 -374 8 -56 -45 29 78 161 -205 -6 -424 -158 114 61 7 280 80 187 59
2488 59 -237 -120 -203 17 -27 158 269 196 124 -64 -4 -148 -202 -230 -92 -62 170 356 242 -96 -211 -92 -400
2511d00L12L5J94r5l7J9nq2j20p4O8J7J96O0J44r2j42p6n0q3o1K07r8K51opj9
2538E6p5j07J50q8j44M00n9J36k00J81j25l16J45j76N1J47K07J30J8m09J88l16
2560b06j24L35l79K31J34K52k96K55j54l6N7j39j87K23O7K1M41n90M05m43j33
2581b66O4k97M63k8J13K26j24J06k64j60j24O2N1K40q7J59l0rj11l9J5j49J00
2604h9J04k9J20K95m80jk05J80j39P1J19L03k9Q1j98j03j16J96k96J91j56J1J92
2627B2K37n2k19J31k94k8K1P3K50j22L8J50j5k61J4j36M7J54m6K1R2K63k14l65
2651b39L05k85j41J35J95m7K81k28L02j79l18P2R6l3K48l09K17P9j66R8k42J22
2673c7n7j92L01j64K14L48p9k52j22k16kK72j11K60j20L91m01j9r3L12k93j07
$$ plain form
2511 -400 -88 -53 141 46 9 28 23 -59 -179 -253 -185 -168 28 88 232 140 -2 -78 -128 -211 -272 -65 -163 88 82 75 56
2538 56 -19 -126 24 -64 -208 192 133 269 69 250 125 -191 -46 -222 -171 -24 183 313 331 -78 110 -206
2560 -206 -330 5 -374 -143 -9 243 -53 202 48 12 69 -70 -257 -34 33 54 495 -95 310 -133 -266
2581 -266 -202 -499 -36 -64 49 275 151 257 -7 -167 -291 -229 -178 62 -25 134 104 95 -16 -55 -40 -189 -89
2604 -89 15 -14 106 401 -79 -80 -285 -105 -244 -173 -54 249 220 301 103 0 -116 80 -216 -25 -181 -170 22
2627 22 259 207 -12 119 -175 -203 -182 -109 141 19 57 207 192 -69 -55 -191 -144 10 -36 -15 77 340 126 -239
2651 -239 66 -219 -360 -225 -30 -77 204 -24 278 99 -219 -147 -51 -84 164 -145 72 151 -15 83 -159 -37
2673 -37 -94 -286 15 -149 65 413 334 82 -40 -256 -258 14 -97 163 43 434 33 14 -79 233 -60 -167
2695a67K01R0n9R1j74K8j45J97j81r3J55%K43m6k7j62J19j88k2o7O6L05K7j31
2719F0J1R1l7q9k23N7J9j32M16l53K21jj56J1J35j64K07L4j07J62K4L6j76J17
2743A63k61j66Q4O0K15N7j41L4J15j48k34QN2mK61P3K04k00k5l2j72j48J51j78
2767b32J61K19j32J77J3l41M63o06J57j59M23Om6J14j11k0j83M5n2m8J65o0K02
2790A55j25K18j79j83Rl4O2k36M44j12K70j21j46k8N1k94o3J29Q8K81k5J2o1k23
2814a11J55j96l5K00j58L49j66P4j25l6j76J01m07K87N8L2K18K67m6j14k18J29
2836H2j91J47j95K90K61J04m87K27n2l61M0q2P2J96J14j1n5j31J32j71p4K15j31
2859f1J89k2M5Q1k46J43j46j82r9K17M0J07RQ0j36K13j69k25n4l5P7J9M13j83
$$ plain form
2695 -167 34 124 65 156 -18 10 -135 62 -119 -212 -57 -57 186 140 113 -49 70 -118 -140 -207 -141 164 191 60
2719 60 71 162 125 36 -187 -130 -111 -243 173 -180 41 40 -116 -105 30 -134 73 107 0 162 186 222 46 163
2743 163 -98 -264 -180 -120 95 152 11 45 160 12 -222 -214 -162 -166 95 168 372 172 147 115 -57 -205 -54 -232
2767 -232 -71 148 16 193 206 -135 328 -278 -121 -280 143 149 103 217 106 86 -97 -52 -104 -152 13 -47 155
2790 155 30 248 69 -114 -105 -139 -77 -313 131 19 289 168 22 -6 45 -249 -312 -183 -95 186 161 173 112 -111
2814 -111 44 -152 -187 13 -145 204 38 112 -13 -49 -225 -124 -531 -244 -186 -154 64 331 285 171 -47 82
2836 82 -109 38 -157 133 394 498 11 238 186 -175 -135 -217 -145 51 165 154 99 -32 100 -71 -145 70 -61
2859 -61 128 106 151 232 -14 129 -17 -199 -298 -81 -41 66 75 155 19 232 63 -162 -216 -251 -174 -155 258 75
2883G5j39n5nj13M4J15J62J92j61r6J50J8k67j46J75q6o5K44J05K6k47J77J6j19
2907@j05l6j86L82K1N9q0O7p5q2p8j01L07q2L9P3J69k55N6m2j14k1L5J66j73K65
2933B09r9m5o0j5M8p2J2o5K92j43J43q0L2k59m9K0k33K13K8J99P2j27P1j8k25
2958a51Q0r2j4K43K28j45J69k85P7k00j21Q9L1J5J16J23jR5k84l0l6k65K17K06
2982F5o9l5J18O9m5j31k38K43l8J24q7L68k43n0p9O1j56o0l4J80N0N9PJ8r6j6
3008a5k4j5k8J40j78K13J99k54p0K36n0l80J16J19J38j49J77J38l12J50p1r1k71
3031b82K77m9K8J51nq8K48l44N5k16K1Q7L1M01j52K71m19K9j68Lk02L93L5o4J96
3056B37j95L4o6ol07M12k17L01J0Oj02R4j48k10mK42k15K41j10M0q3K07j48p5
$$ plain form
2883 75 -64 -119 -124 -237 -193 -78 84 276 115 19 169 187 -80 -226 -51 -137 -202 42 147 173 -74 103 119 0
2907 0 -105 -141 -327 55 76 135 55 122 47 -35 -113 -214 93 11 50 123 292 37 93 51 -63 -84 -49 117 -56 209
2933 209 110 65 5 -10 38 -34 -22 -87 205 62 205 125 157 -102 -151 -131 -364 -151 -123 76 148 21 92 74 -151
2958 -151 -71 -163 -177 66 294 149 318 33 110 -90 -211 -122 -91 -76 40 163 162 257 -27 -57 -93 -358 -141 65
2982 65 -4 -39 79 148 103 -28 -266 -23 -61 63 -24 344 101 51 -28 33 -123 -183 -217 -37 13 72 79 97 1 -15
3008 -15 -39 -54 -82 58 -120 93 292 38 -32 204 154 -226 -110 9 147 -2 175 313 1 151 80 -11 -282
3031 -282 -5 -54 -26 125 120 32 280 -64 -9 -225 -204 -117 -86 315 163 434 15 44 -124 -121 -323 70 105 41 237
3056 237 42 76 10 4 -303 109 -108 193 203 209 107 201 53 -157 -161 81 -134 107 -3 37 -46 161 13 -62
3080f2k36K05p3J15l2J57nm9J13j44L2qJ8j78Q7J71N6J36m01nj51N5J37RR6k00
3106a57L15Lq0r2j39J85j49K20o2j04J75j06J50n8p2k94J55k7K14p4J67J73k73
3129G0m1k15J97k37P1L8J84J15J02l07P4j62L7l1M9N9J67l3n8o0M9j21j68K41
3153B0l85M49j97MJ39J41o1l37J02J07Q2j71J69K2P1Om4j57j07J73k46J57N4l6
3177d5M7L9N0j98K19l46L11j91p4K61j50J52j11J62j92j17J24L4lJ86k2K3J09
3200B68l68J05r5J5j08J02J77j20K37k80P0P2k97J38J15n6K4P5J16m8nk05k09
3223b77o6O6M7K36J65j84K51R2j45k55n2O1M0J8j16K75j28J38k68mK2N7K02m51
3247b76M55k66K6QQm9j1oJ48J5J6l7J23l2r0j53l6m5J23J30j96K69J31l45K5P5
$$ plain form
3080 -62 -298 -93 -166 -51 -83 74 69 20 133 -11 21 13 31 -147 -60 111 167 303 -98 -103 -254 -199 -62 -53 43 -157
3106 -157 158 161 81 -11 -150 35 -114 106 44 -60 115 9 159 101 29 -265 -110 -137 77 3 170 343 70
3129 70 29 -186 11 -226 -155 -117 67 182 284 -23 51 -111 -74 -105 -56 3 170 137 79 19 68 -53 -221 20
3153 20 -365 84 -113 -109 30 171 110 -227 -125 -18 64 -107 62 84 155 161 117 -40 -147 26 -220 -63 -9 -45
3177 -45 2 41 91 -107 112 -234 77 -114 -188 73 -77 75 -36 126 -66 -183 -59 -25 -28 158 136 159 268
3200 268 -100 5 -90 -75 -183 -81 96 -24 213 -67 3 75 -222 -84 31 -25 -1 74 190 142 137 -68 -277
3223 -277 -343 -277 -230 6 171 -13 238 330 185 -70 -122 -61 -21 -3 -119 156 28 166 -102 -106 -84 -27 175 -276
3247 -276 179 -87 -61 -53 -45 -94 -105 -111 37 52 68 31 154 122 32 -121 -157 -202 -79 51 -145 124 255 -90 -65 10
3273A0l0j39O8LJ19NL2k0J90k47k9m8j00K16OL7Q3j90J43k27n0K48j08o6J32j90
3299a52L21m4j06o2l5j5R8j01j5N2J8J82n2j12P0J4Q2k96mL31r5J7k49Q3oj55
3325b31N9K45k5p6K4J01J0Mj48PO3l00K99M1J28j20P0r4M8k61J26j41J39M3j42
3350a31P9K05j03j64M7j19O5lJ62N3K5q1j64J50J23p4p5r7J16j30J78J60j80J92
3374B34l36O0J87k69R4J04j94K23L9K35l76m4n1R1n9J99k82K50r0J39j24k78J82
3397f6K6O6k9P2N0j9p1l7J29k30NK35m1j54N9J4k3n3PJ30l91J45O4J12K00j11
3423H9o1Rk77L24k65M08l13O2m6K03k13K41j83J64m0l53K59k00K97Q4O2o9j87
3446eK0k36J89o3K6M20l45J03n8j63N8J07K8k16R0M4J28N5j17j55L4J9k7N8l5
$$ plain form
3273 10 -20 -159 -91 -88 31 36 68 48 238 -9 -38 -86 -186 30 36 73 156 -34 109 -118 -168 80 -28 -94 38 -152
3299 -152 169 125 19 -43 -78 -93 5 -96 -111 -59 -41 141 89 -23 47 61 143 -153 -157 174 79 96 -153 -70 -76 -231
3325 -231 -172 73 48 -28 -4 97 107 111 -37 -30 33 -267 32 73 201 81 151 57 105 -156 -30 -171 -32 11 -131
3350 -131 -52 153 50 -114 -67 -186 -121 -124 38 91 116 35 -129 21 144 70 -5 -102 14 -116 62 222 42 234
3374 234 -102 -42 145 -124 -30 74 -120 103 142 377 1 -43 -94 -3 -62 137 -145 105 15 154 30 -248 -66
3397 -66 -40 26 -3 69 119 100 29 -8 121 -109 -104 131 90 -64 -5 9 -14 -67 -60 70 -321 -176 -112 0 200 89
3423 89 28 37 -240 84 -181 227 -86 -24 -70 133 -80 161 -22 142 102 -251 8 -192 105 189 251 182 -5
3446 -5 15 -221 -32 -95 -69 351 6 109 51 -112 -54 53 81 -135 -45 -1 127 182 65 -90 -56 -37 -64 -6 -41
3471d1J15J10j62r1J3j60K48k40J97LJ03k37K82k27j92K59j85L79l23K39Lk86
3493a93Q2J73k9l14J06J69m6J23L7R1j70n9j67J91J75j92p3r0N01l37J66q5j59
3516a00N7L2k03K77o7L6j8N4l1jn3j5k36K54k32L22k5k30K08J93k23j41Q0J50
3540H8j00J4K46l32J28K10k38j49j5r3K21N3K06k99K41k72M9jk55K55o9L47j71
3563F4j26lj85J87J7m7o5J3J02M1J89j32Q1j46O0j18j31J10K96j92JR9k14K54
3587A55m0k55J5K01p3k0J08j3p2prj33Q5J67k98J93Q9O2k27%J22j67O3n5J45K8
3613F4O4l7j19N9K4k50L0k17L90j28J45L0J53k02r7J70J3k37J05J15j25J40m2
3636D8ll3J50j26j61L10k89J08j10J55m9L9K3q8J3j32J41j1Q9K15j20m6j3k43
$$ plain form
3471 -41 74 184 22 -69 -56 -216 32 -208 -11 -8 95 -142 140 -87 -279 -20 -205 174 -149 90 93 -193
3493 -193 -111 62 33 -281 -175 -6 -52 71 108 199 29 -30 -197 -6 169 -23 -96 -186 315 -22 144 59 -100
3516 -100 -43 -11 -214 63 -4 32 14 68 37 36 -17 -32 -268 -14 -246 76 51 -179 29 222 -1 -142 -62 88
3540 88 -12 2 248 -84 44 254 16 -133 -148 -241 -20 33 239 -60 181 -91 -42 -43 -298 -43 -112 235 64
3563 64 -62 -65 -250 -63 -46 -93 -158 -145 -43 -2 187 55 136 -10 50 -68 -199 -89 207 15 16 115 -99 155
3587 155 115 -140 -125 76 3 -17 91 78 6 -1 -10 -143 -58 109 -189 4 93 155 -72 -72 50 -117 -54 -109 36 64
3613 64 128 91 -28 31 55 -195 -165 -382 8 -120 25 55 208 6 -91 79 92 -145 -40 75 -50 90 48
3636 48 45 12 162 36 -125 185 -104 4 -106 49 0 39 62 -26 -13 -145 -4 -15 74 289 169 123 110 -133
3660a33L45j93N0Nj06J73r1J70P1k60j9k11L01kj48L16l76J31K1p3J04k88J70
3683d3J22j71J09O3m5J9j90K15k30K93k21L19k20r0on7J45p9j11j04L42r6p0J60
3707E4K7n3q1j73K50j16L17k20J98l50lJ48j12J84l69K20k6N5J43j01j17q9K08
3730fj38K3J64l2J88n90L99Q9J17j21j04J45n9k78J07p6K24R4r8M7k95K30K3N
3754E8k31J49j8K13j28J77k32J0r6K7j52J54J28k38R6O4k3QLk69M44r7r2kj09
3779a56L82n24L04kp0q2J85P7j30J12j33J16ok00P1j71J94J32j68L10l48J28J46
3802A67j24k21J59J12k03L8q6J34j35K91l43K79j53j05M21k62J04j50R5J05k20
3823i7J8j00K35j00Q4N3j87K14k23m0J58m8O4k60J93L36k69j28N5q3O9K9J18Q3
$$ plain form
3660 -133 212 19 69 74 -32 141 50 220 291 31 12 -199 102 100 -48 268 -108 23 44 -29 75 -213 -43
3683 -43 79 -92 17 80 35 54 -136 79 -151 142 -79 240 20 -70 -76 -133 12 -67 -178 -282 60 -36 -106 54
3707 54 81 28 -53 -226 24 -92 225 5 203 -147 -150 -2 -114 70 -299 -79 -105 -50 93 -8 -125 -214 -6
3730 -6 -144 -121 43 11 199 -391 8 97 214 93 -11 134 75 -203 -96 -172 52 146 48 95 -200 30 53 58
3754 58 -173 -24 -42 171 43 220 -12 -2 -98 -71 -223 -69 59 -179 -83 -19 -42 -34 -31 -300 144 47 -45 -47 -156
3779 -156 226 -298 6 4 -66 -148 37 114 -16 96 -37 79 73 -127 -56 -227 -33 99 -69 241 -107 21 167
3802 167 43 -178 -19 93 -110 -72 -158 -24 -159 132 -211 68 -85 -190 231 -31 73 -77 18 123 -97
3823 -97 -79 -179 56 -44 40 93 -94 120 -103 -143 15 -33 31 -229 -36 300 31 -97 -42 -125 -56 -27 91 174
3847A74j37j00J02Pj5j17l7k0J43o2O6m4L11p5j58j02J75k09J31k3j8K03k07J62
3871A50p3j99K14j04M8J12k47L02n6k83R0oN2p6RK94l75K30M3k6q3k4j07Q1l8
3896g2Q0J82j11k07J55n2R5k02j12J87R1J65j72j04J51Mj68J52nk07J40m7O9O4
3920G6k05K93j35kj40K32n4m9J76j75j05N4j66J42L0Nm7J73J57k99L41k86oQ1
3944I1o9j92K28m8O4m9n8J5M1j09J03j75J90j35K37j08J48J05l10J79j93OK35
3967A96j94pM3j40M02k09J21m36K42jk5P6k51L82j72J38l38qK33j3J5o5J10pq9
3992CJ28R1m44J80N6o4J2L05j42k35K13j53K5M9q1L6l9J19k6K41k48m6J40j59
4016c9o9J40k50J93m6K64j71j83J1J63q3M5K81l55j06L25m3k15J12o3j06M2K67
$$ plain form
3847 174 37 -63 39 46 31 -86 -123 -143 0 -62 4 -40 271 196 38 -64 111 -98 33 10 -8 195 -12 150
3871 150 77 -122 92 -12 36 148 -99 203 147 -136 -46 -52 0 -76 -67 227 -148 82 125 99 16 -8 -115 -34 -72
3896 -72 8 190 79 -128 27 -25 70 -132 -244 -57 34 199 27 -77 74 78 -90 62 57 -150 -10 -57 12 76
3920 76 -129 164 29 27 -113 119 65 16 192 17 -88 -34 -200 -58 -28 -23 -70 103 260 -39 302 16 10 91
3944 91 22 -170 58 10 74 25 -33 -18 23 -86 17 -158 32 -103 134 26 174 279 -31 148 -45 -39 196
3967 196 2 -5 38 -102 300 91 212 -224 18 17 -8 68 -183 199 27 165 -173 -181 52 39 54 -11 99 92 3
3992 3 131 222 -222 -42 14 -50 -38 267 125 -110 103 -50 -25 24 -57 -21 -60 59 33 274 26 -20 120 -39
4016 -39 -108 32 -218 -25 -71 193 22 -161 -150 13 -70 -25 256 -99 -205 120 77 -138 -26 -89 -195 -153 114
4039A14L0j65j6m5n8K46j79L8O2n5q9J13Q9j68M1j62J3J28K4K3L00k44o6J91O4
4064B29j86k51r3K71P2n0m1J08j15K38J1k56J77q8j11l4K24o8K96l43J8k6p6j92
4088b86J55R4J60j16K67m81J93P5j03n1N1J3L0k14O1J90j19o4Q7R0k8k50J72M7
4112b7J74j39j27J2N4o9L99j26j99K15r8j09j46O9K22k61J24l7n5K70k20K55j61
4135B0j41Q7L8R6L0k11J38L0N8q1O0m04J02K74k44L62k99k5J85K5j01J62k81J91
4159G1M1j69K8j11K14L1j12l5j19J96j94J50J57l5j80J02n4J20o9j44J37r1J20
4182E4Qj75J68J98k13O2j65J94k13Q0j70K23P5j35R0q7j67L53k20J3J36k66J78
4205B1R8o0M9J2j75O4K06j56K6K0k11Q6j06J09O1k10J13j26K4K15j78K16k30K69
$$ plain form
4039 114 144 -21 -37 -82 -140 106 -73 -35 27 -28 -117 -4 85 -83 -42 -204 -191 -63 -39 -16 284 40 -26 165 229
4064 229 43 -208 -301 -30 42 -8 -49 59 -56 182 193 -63 114 26 -85 -119 105 37 333 -10 8 -18 -94 -286
4088 -286 -131 -37 123 7 274 -207 -14 61 -42 -93 -42 -29 1 -213 -152 38 -81 -145 -58 32 4 -246 -74 -27
4112 -27 147 8 -119 -107 -53 -122 277 151 -48 167 69 -40 -186 -117 105 -156 -32 -69 -124 146 -74 181 20
4135 20 -121 -34 4 100 130 -81 57 87 145 64 124 -280 -178 96 -148 214 -85 -110 75 100 -1 161 -120 71
4159 71 112 -57 -29 -140 74 105 -7 -42 -161 35 -159 -9 148 113 -67 35 -19 101 32 -112 25 -66 54
4182 54 62 -113 55 253 40 102 -63 131 -82 -2 -172 51 126 -9 81 -6 -173 180 -40 -27 109 -157 21
4205 21 119 59 108 120 -55 9 215 59 85 105 -106 -20 -126 -17 44 -166 -53 -179 -155 60 -118 98 -132 137
4229A37l73K57r7q7J73j21J42q1P4q5K26k16J02J58k98K79l80J00J26mj45o7J71
4252iJ77l03l1K70k73P4n6J25K41o4k24O5O7rJ3j01J81n11L60n2J28j61Q4N1K8
4277G0K7L6O7q0k00J74k79M4K91j61N8R6k38R1L1n5O8N8j12P8%j20K82k16k15
4302b05J57J01m5q3J06qk19K03q0k7J66k5o4K0n0j03N9r8J10m0m4M39k19r8J50
4327A03J29k40j56K00p5J37j42R9k19K14j08q8M3J14L0P1Q2j03j04J42j96j3J4
4350f6l1J32p2q4R3J33k1N9j70R1l3r5J34o3O3Q8j71MJ13j82J19k02K15R5L1k4
4376A56j3n8j32J34j16O5M0j36J35k00J63j47K03p4O7n1r0J79m00L10P0p4k22
4399a91L36j21J13j52N3J5j32K15j42K04j50M3Pq0P4r1J52j86q2P0O9k35K60J60
$$ plain form
4229 137 -236 21 -76 -163 10 -111 31 -50 24 -61 165 -51 51 209 -89 190 -190 -90 36 32 -113 -180 -9
4252 -9 168 -135 -166 104 -169 -95 -151 -26 215 151 -73 -8 59 50 63 -38 143 -368 -8 -60 68 -93 -9 42 70
4277 70 97 133 200 120 -80 94 -185 -141 150 -11 47 143 -95 -4 27 -28 40 98 -14 64 64 -56 226 10 -205
4302 -205 -48 53 8 -75 31 23 -196 7 -73 -100 66 41 -23 -3 -53 -156 -97 -195 -85 -125 -169 270 51 -47 103
4327 103 232 -8 -164 36 -39 98 -44 55 -164 50 -58 -146 -103 11 41 112 194 91 -13 129 -67 -80 -66
4350 -66 -97 35 -37 -121 -28 105 84 143 -27 64 31 -64 70 7 70 158 -13 -9 104 -78 41 -161 54 149 180 156
4376 156 143 85 -47 87 -29 36 76 -60 75 -125 38 -109 94 20 87 36 -54 125 -275 35 105 31 -191
4399 -191 145 24 137 -15 38 53 -79 136 -6 198 48 91 98 18 92 1 153 -33 -115 -45 24 -211 49 209
4423B09q7j26j24q0L81j95J43N5j24j08p9P7K42j81j43L82l31K38k12K05j04J69
4445B07j10L7q8J1l65K03J23j28K8q5r4M61j1k23P5j92J58J26j46J00k00N5K7
4468c1M5J26P0k99L05n0k46p1L01J03l8j96K36k20J4J6k0j71J18L4k0k3N6l7R1
4493I3K6q6j19J8J31J38j19j77N4lJ48j64J09k7j91L15j35n1K30k27Mk77K0L72
4517H2j9j71O3L1mO0m4P4j11j1m5J40j23p8R6o2M8j7J43k03K67j51J79k13J14
4542D5P1j00RJ88l08K92r6K38m59j82L20j63J70k16J09R5r2lK11m8P3k80J05l7
4566e8JP8j57J41J72j43J6rJ50o9k69O6J44p8J21j04M4l3jN1j21k0J02j63J18
4591b1K48k73M4j66L98k37M0n4m3Q5K32l72M4J86j93O2n9K9K0q7K37k83L03p5
$$ plain form
4423 209 122 -4 -128 -208 173 -22 121 176 52 -56 -135 -58 184 3 -140 242 -89 149 -63 142 38 207
4445 207 97 134 46 57 -308 -105 18 -110 -82 -167 -261 200 189 -34 41 -151 7 133 -13 87 -113 -58 -31
4468 -31 14 140 210 -89 216 166 -80 -151 150 253 215 19 255 35 49 65 45 -126 -8 26 6 -17 39 2 93
4493 93 119 33 -86 -68 63 201 82 -95 -41 -44 104 -60 49 22 -169 146 11 -40 190 -37 -33 -310 -290 82
4517 82 63 -108 -45 -14 -18 42 -2 72 -39 -50 -95 45 -78 -156 -60 -122 -74 -91 52 -151 116 -35 144 -69 45
4542 45 116 16 25 213 -95 197 101 339 -120 -302 18 -145 25 -191 -82 13 -79 -82 129 81 154 -126 -21 -58
4566 -58 -57 21 -136 5 177 34 50 41 191 122 -147 -81 63 -15 106 2 46 13 12 63 -58 -78 24 -139 -21
4591 -21 227 -46 -2 -168 230 -7 33 -21 -64 21 253 -119 -75 111 -82 -20 -79 -50 -30 -117 120 -163 140 65
4615F5k57J36M6j43N4J93n2J34r3k78J83Q4j23R6j62L0L17j94K3l8q2J62j58K12
4639A55k33J11Jm5o5j2r4K46N4j63R7j07J22m0k4J00Q1k37L8J08j57Q6Q1k13K58
4664A48m9J26m07N9J41k58L58k32R5o3J51k6LQ9J9r2%k07J57K00k48J51j18j1
4688a4p4K20j54n8K77j31L6k35K71k08R6j9j37J95k46J93r0N0p2j31K13j03O8
4711e3J0J5N4m4J39p9o1J7k9M0l8O7o6kK60l11O5p6J00n0J21K2n2k10J91q0J13
4738F3r8N2q9mQ6j85K59P9r2l0p0l4P8j23L4J03L9k07J11Q2K8mJ0M7n9j03L1J18
4766A22j98mm6K23k19K29j07k42K77M1lj03k0J69L4j95P5R6Lk26J65j9N7l35J65
4791f1o2J59J17l24J61M1p6J56q0J16k26l7R2J00J0j91J93o9j02L3p2N2K48k57
$$ plain form
4615 65 -192 -56 -10 -153 -99 94 42 176 83 -195 -12 72 -51 45 -117 -87 230 36 59 21 -61 101 -57 155
4639 155 -78 33 34 -11 -76 -88 -182 64 118 -45 52 -55 67 27 3 103 184 -53 -15 93 -64 22 103 -110 148
4664 148 99 225 -182 -123 18 -240 118 -114 -19 -82 69 43 46 135 154 62 62 -145 12 212 -36 115 -3 -14
4688 -14 -88 132 -22 -80 197 66 102 -133 138 -70 26 7 -130 65 -181 12 -78 -28 -100 -231 -18 -121 -53
4711 -53 -43 -28 26 -18 121 42 -19 -2 -31 9 -29 38 -28 -30 230 -81 -16 -92 8 -42 79 101 49 -161 30 -50 63
4738 63 -35 17 -72 -76 10 -175 84 163 71 41 -29 -63 15 -108 -74 29 68 -139 -28 54 82 78 88 135 76 -27 4 122
4766 122 -76 -80 -126 97 -122 107 0 -242 35 76 73 -30 -50 119 153 -42 33 129 132 -94 71 52 109 -226 -61
4791 -61 -123 36 153 -171 -10 31 -45 111 31 147 -79 -116 -24 76 86 -105 88 19 -83 -50 -122 -70 178 -79
4815g9O9J36j35N1J79j04N9l3j99Q1j41Q9Jj03r9K33M4k89J21J22O1P0l11K80
4839A03P3r5J09k58K88k20k60L4L68j4Q7j41l88L11m7J27k5k20L5j16J19K79j12
4862C7p7j24K66lj86R6q1j66K08p5LJ8J33j49J48O3j94J17p1J25p6L3N6K2k07
4887h4N4K3J59k30L8N6j70K22k28O8O5j33M5N1m3K45l58K32j15J1J22n7N3J4j34
4912i4K9Q9n9O9j2R0j77K09j12J01k37J91Q9l51L2N7J13j6J22k8r5k61K35J05
4936H9l56K48J40j91K51k82K14j17m2qM1N2J52r5Q6n5q6K10j29r2J35j88N7j20
4960h6O3L9q6J12l00M19r1K8k80Q8J14j99K28j69K45k34Q6J45R6m0o9k21J21j2
4984cqK24k01j62J68p4JL7r2K38p4k6k67K52k11L4K23k30J05J96j8k6q3O2k58
$$ plain form
4815 -79 -10 126 -9 42 221 117 176 143 -56 25 -116 -27 -26 -129 -228 5 49 -240 -119 3 64 134 -177 103
4839 103 176 81 190 -68 220 0 -260 -226 142 128 215 74 -314 -3 -50 77 52 -168 -133 -249 -130 149 37
4862 37 -40 -164 102 99 -87 9 -72 -238 -30 -105 -102 -84 49 -100 48 111 -83 34 -37 88 12 45 101 123 -84
4887 -84 -30 -7 152 -78 -40 16 -154 68 -160 -92 -27 -160 -115 -64 -107 138 -220 12 -103 -92 30 -27 26 40 -94
4912 -94 -65 24 -35 34 22 112 -65 144 32 133 -104 87 176 -175 -143 -86 27 11 133 105 10 -251 -16 89
4936 89 -267 -19 121 -70 181 -101 113 -4 -46 -54 -13 39 191 96 182 127 41 251 122 30 165 -23 34 -86
4960 -86 -23 16 -70 42 -258 161 70 98 -182 -94 20 -179 49 -120 125 -109 -23 122 218 178 109 -112 9 -3
4984 -3 -11 213 12 -150 18 -56 -55 -18 -110 128 54 28 -239 13 -198 -164 59 -171 -66 130 112 86 3 65 -193
5009a93K95j64N2J0o8J48j37J52j60R2J32l6m2l3M5M4k35k1J86r7P3k8j22J52
5033D5k1j42R3k19K31no3q3k4J47J02K24j90k08K98r6p9l0P4J06j20Om6m8n9o9
5059a76K01K05l59M49j26k55J54j98k0p6J45K14l2K0j01K4N3qk8m9q2J88j71L2
5083DK6j61K35k32J01K04j65M7Q7j35k3n9J89n3k56L40k19N8J38l5R8j41J63k07
5107Dm0K0M8m5Pp1P4P5j6j47K12j41r6n6J27J11k50J67r6J0j45J67Q9O6p6R8Q4
5134A80j28l2L3Q2j14Jp0l6Q0k00J59K3M1LJ06l3q8O0j66O5k9J39k09K45j44J52
5160A20j99K27k76J19j64L82l26J80j43l0K85k90J03j31J47m5jO9j20J3J38m6
5182A2PQ7p4P7j31j7k91K95o1J87k43J13J34N2r3j85K32M6j00Q8j37L0L8j12J47
$$ plain form
5009 -193 102 -62 -10 0 -68 80 -57 95 -65 27 159 123 81 48 93 137 -98 -119 67 -30 43 15 -107 45
5033 45 24 -118 -25 -244 -13 -18 -81 -164 -188 -41 61 285 95 -113 185 89 10 -20 54 160 40 46 0 -48 -107 -176
5059 -176 25 230 -129 320 194 -61 93 -105 -125 -201 -56 158 126 146 45 69 122 114 86 37 -45 143 -28 4
5083 4 30 -131 104 -128 -27 177 12 59 146 11 -12 -71 118 65 -191 149 -70 -12 126 91 189 48 211 4
5107 4 -36 -16 32 -13 -6 -77 -3 72 56 -91 121 -20 -116 -172 -45 66 -184 -17 -113 -103 -248 -81 8 74 -2 96 180
5134 180 52 20 53 135 21 22 -48 -84 -4 -204 -45 -22 19 22 128 95 7 67 -99 -34 -63 76 -133 112 -32 120
5160 120 -79 148 -128 -9 -173 209 -117 63 -80 -110 175 -115 -12 -143 4 -41 -42 27 -93 -80 58 12
5182 12 19 106 32 109 -22 -39 -330 -35 -96 91 -152 -39 95 147 54 -131 101 147 47 135 -2 28 66 -46 101
5207A01k00J01KO6K7j15j9oo3J44r0k2N6OK24P0k67O7m5K7k37K68O0k72J69P4
5233A26j16m8Qm3j27J80K89k79l9j7K12j28j29K59r6j88J63n1M7o3O8J1R7l49
5257b13L37p7J36k76J36j3j13Q6J84j89L5Q2k80J42N4j78P1J48l6P8j79m7K65
5280A53k42qK02r6r0J83m1O7K26r5l41L0K0p7K4K30k97L8J74l4l7r6Q4j7j02m4
5306a86L94j28k0J7j95q2J65n4R4P6l3K1J2j60J29j67K5j4nn2J94J26k23J54j43
5331e5L9j94KJ4K64n7K6P3j49K31oj88j09J10J13j19r0J03r0j3K19j10J02j47
5355c1l6L80k51m3R9r6j37q5J25Q9%J24j86j41J41L20k98P5q4L8j91K25J95m2
5379A90k90J82r2nJ24k13L7M5J93k22J4J17M2j71L6L4l2r5J96P1Pj9r2n2J2m9
$$ plain form
5207 101 -99 2 4 70 97 -18 -37 -43 -106 38 -52 -74 -18 -12 212 282 15 82 37 64 -173 95 155 -117 52 126
5233 126 10 -38 -30 -73 -200 -20 269 -10 -49 -66 146 18 -111 148 52 -136 27 -24 23 -40 28 39 136 -213
5257 -213 124 47 183 -93 43 30 -83 3 187 -2 33 115 -165 -23 31 -147 -76 72 36 114 -65 -112 153
5280 153 -89 -97 105 9 -81 102 61 128 354 259 -82 -52 -32 -109 -85 145 -152 -114 60 26 -11 -107 -23 -40 -142 -186
5306 -186 208 80 60 77 -118 -200 -35 -89 5 81 48 69 81 -79 50 -117 -92 -106 -111 -163 31 157 -66 88 -55
5331 -55 -16 -210 -208 -194 70 13 39 112 -37 194 188 0 -109 1 114 -5 -95 8 -82 -95 124 14 116 -31
5355 -31 -67 313 62 19 118 22 -115 -200 -75 14 14 138 -48 -189 -48 272 -26 49 -35 3 -188 37 232 190
5379 190 -100 82 -10 -15 109 -104 -67 -22 171 -51 -37 80 122 -49 -13 21 -11 -106 90 161 168 149 57 5 17 -32
5405c2K53k16Q0q0j90J06J13r8J04K2n6M8k77J23J04J49j42N8K5j12oJ09O2l44
5429a97K03r8J8J29k36K04J33J49j89j41rj03J57j41RL55k21J47k22K76j16n2
5451E5pj43R2o9M1K0J44Q8l35K04k23j05J94N0l0j49R0q8K63q8j32L04j5k8j55
5476b2n2J26j28N7J21n1K03j45j61j91N41k84nJ45j24N4j40K25k17J05n5J4j20
5499a04J63o0m5j21J46j06J05JN3J41k6j27r3P3q6j8j49N98j88k04J29k52M08
5522B38r3q7j64K92k07r8K2j07J20k5j39Q3L5P1J44Q0j20L2R0k87O7L4J28JP4
5547A84l49J87j01J09P0k11J35QJ52k47M5k2J52k78J35j1P8M6k77M54j20jJ07
5570B45j94j48L31k98j16J66j34J33J17j53L0Rq7O2mK08k49L4O0j60J56j35K82
$$ plain form
5405 -32 221 5 85 5 -185 -79 34 -64 40 62 6 54 -223 -100 4 153 11 69 94 -18 -24 85 147 -197
5429 -197 6 -92 -74 55 -181 23 156 305 116 -25 -34 -137 20 -121 -112 243 22 169 -53 223 107 55
5451 55 48 -95 -3 -72 -31 -11 133 221 -114 90 -133 -238 -44 6 -24 -173 -83 -171 92 4 -128 176 161 133 -22
5476 -22 -74 52 -76 -19 102 51 254 109 -52 -243 298 14 9 154 30 84 -56 169 -48 57 2 16 -104
5499 -104 59 -1 -46 -167 -21 -127 -22 -21 32 173 147 20 -73 0 -86 -104 -253 345 157 -47 82 -170 238
5522 238 145 58 -106 186 -21 -119 -97 -204 -84 -109 -248 -165 -130 -59 85 165 45 77 167 -120 -53 -19 109 110 184
5547 184 -165 22 -79 30 100 -111 24 32 184 -63 -18 -40 112 -166 -31 -42 36 82 -195 259 139 138 245
5570 245 51 -97 234 -64 -180 -14 -148 -15 102 -51 -21 -12 -99 -37 -41 167 -82 -48 12 -148 8 -127 155
5593A55p2j39q5J37n6k9K82l39O3K92k38p7R4j87K45n2J7J99q7p6j11Q6NJ41k85
5618a17P4J76l19J59J21m2K36k38Pj9j81J54No6L4N5R7J13j37j50Nr2K8K3j90
5643b64K44J93j58k4k10L71k72J72k9p1J8j90L43j32OJp1M4J26Ql00L05L4j95
5667e1K4J17J38O2n9j43qk23J40P4j66QR7j48l7Q9n7K36L9j14l5P9r7j0K8j00
5693a17J87m6J28j27o9J04j92J53J69j33j89O2M6N3l5M2p6k11L38kj07J67k43
5716i8K19J1l81P2K00k12K59j28J87k2j91M0N7J07l8o6O4o4j6NL7k95K42R0k9
5741E0oo9N5J41j7j63J5j22J17K05k10oQ5r0j70K32J44j11l5j40J94l9j87L66
5765B39j87q0nQj8j18L21m14K8K69o0j3M0J12l77L18p5n6J94J4j74N6J38j69q2
$$ plain form
5593 155 83 -56 -141 -4 -60 -89 193 -146 -83 209 -29 -106 -12 -199 46 -6 11 210 123 47 -64 22 27 168 -117
5618 -117 -43 133 -186 -27 94 52 288 50 57 38 -143 11 16 -50 -16 39 136 249 112 -38 -33 -125 -97 -74 -264
5643 -264 -20 173 15 -9 -219 152 -120 52 23 -48 -30 -220 123 -9 -3 -2 -73 -29 97 105 -195 110 144 -51
5667 -51 -27 90 228 290 231 88 80 -143 -3 71 -95 -87 10 -138 -175 -86 -143 93 132 18 -17 62 -35 -45 -17 -117
5693 -117 70 24 152 25 -44 60 -132 21 190 57 -132 -70 -24 29 -6 36 -40 -251 87 85 -22 145 -98
5716 -98 121 132 -249 -177 23 -189 70 -58 129 107 -84 -44 13 120 82 16 80 16 0 5 42 -253 -11 79 50
5741 50 44 -25 30 171 154 -9 6 -116 1 206 -4 -10 75 -15 -185 47 191 80 45 -95 99 60 -127 239
5765 239 52 -28 -33 -25 -43 -161 160 -254 -226 43 -17 -30 10 122 -255 63 -12 -68 126 140 -34 22 160 -9 -91
5790i1r0Q2j9J47j87L40j56j36n9J81j06J19J39k31K7Q7N9p8L8o4l0J45k55J21
5814a7J35J93k25j05l3o4M6J49j00J8J06ok88R6P9L4m3j53Q3K56q3J47j39k89
5838b03K04J0j60P1J58P8p5K5n5N8j96r8J32j9K23l03n8M30j86O6j32J7n2J39
5862G4k02jJ80l54N52k76M7N0j79P2n5J08Pj61K15q8j6Ok42L94q4j11J39j91K32
5887A16n5k6qM5j26K20rj78j8j4J1L2j01%L5j24J30J81ll4j39M1k5p2M6P3j48
$$ plain form
5790 -91 -181 -99 -118 29 -158 182 26 -110 -169 12 -94 25 164 -67 -40 47 106 28 66 2 -28 117 -138 -17
5814 -17 118 311 86 -19 -52 -116 -70 79 -21 -3 103 97 -191 -95 -16 18 -25 -178 -95 161 78 225 86 -203
5838 -203 1 11 -149 -78 80 158 83 108 53 111 -85 -183 -51 -70 153 -150 -208 222 36 102 -30 -13 -65 74
5862 74 -128 -129 51 -303 249 -27 20 70 -109 -37 -92 16 23 -138 77 -11 -27 -21 -263 131 47 -64 75 -116 116
5887 116 61 35 27 72 -54 166 157 -21 -39 -53 -42 -10 -111 -111 -76 -200 -70 111 108 74 -65 -24 -49 -121 -75 -2 -150
$$ [...]
8191D4
##END NTUPLES=NMR FID
##END=
