##TITLE=1H_DE-127H2
 200.13MHz,D2O.
 8 sc
 
 13.2.2026
##JCAMPDX= 6.0         $$ Bruker NMR JCAMP-DX V2.0
##DATA TYPE= NMR FID
##DATA CLASS= NTUPLES
##ORIGIN= UXNMR, Bruker Analytische Messtechnik GmbH
##OWNER= pz
$$ XWIN-NMR		Version 3.5
$$ Fri Feb 13 15:42:48 2026 Russian Standard Time (UT+4h)  she@DPX200
##.OBSERVE FREQUENCY= 200.1313
##.OBSERVE NUCLEUS= ^1H
##.DELAY= (6, 6)
##.ACQUISITION MODE= SIMULTANEOUS
##.ACQUISITION SCHEME= undefined
##.AVERAGES= 8
##.DIGITISER RES= 18
##SPECTROMETER/DATA SYSTEM= spect
##.PULSE SEQUENCE= zg30
##.SOLVENT NAME= D2O
##.SHIFT REFERENCE= (INTERNAL, D2O, 0, 14.3821)
##AUDIT TRAIL= $$ (NUMBER, WHEN, WHO, WHERE, WHAT)
$$ ##TITLE= Audit trail, XWIN-NMR		Version 3.5
$$ ##JCAMPDX= 5.01
$$ ##ORIGIN= Bruker BioSpin GmbH
$$ ##OWNER= she
$$ F:/spectra/data/she/nmr/H-C/1/audita.txt
$$ ##AUDIT TRAIL=  $$ (NUMBER, WHEN, WHO, WHERE, WHAT)
(   1,<2026-02-13 15:41:23.39 +0400>,<she>,<DPX200>,
      <created by zg, POWCHK disabled, PULCHK disabled
       configuration hash MD5:
       00 E9 B6 7A A2 85 ED C7 34 08 36 98 17 FE 4E 26
       data hash MD5: 16K
       21 E4 21 B8 98 9C 36 EE D5 08 24 6C D7 F8 10 64>)
$$ ##END=
$$ 
$$ hash MD5
$$ 7E F0 57 C5 30 9F EA C5 A3 14 19 F2 7C D2 DF AF
##$RELAX= 
##$RELAX= 
##$RELAX= 
##$RELAX= 
##$RELAX= 
##$RELAX= 
$$ Bruker specific parameters
$$ --------------------------
##$DU= <F:/spectra>
##$EXPNO= 1
##$NAME= <H-C>
##$PROCNO= 1
##$TYPE= <nmr>
##$USER= <she>
##$AMP= (0..31)
100 100 100 100 100 100 100 100 100 100 100 100 100 100 100 100 100 100 
100 100 100 100 100 100 100 100 100 100 100 100 100 100 
##$AQSEQ= 0
##$AQ_mod= 1
##$AUNM= <au_zg>
##$AUTOPOS= <>
##$BF1= 200.13
##$BF2= 200.13
##$BF3= 200.13
##$BF4= 200.13
##$BF5= 200.13
##$BF6= 200.13
##$BF7= 200.13
##$BF8= 200.13
##$BYTORDA= 1
##$CFDGTYP= 0
##$CFRGTYP= 5
##$CHEMSTR= <none>
##$CNST= (0..31)
1 1 145 1 1 1 1 1 1 1 1 1 1 1 1 1 1 1 1 1 1 1 1 1 1 1 1 1 1 1 1 1 
##$CPDPRG= <>
##$CPDPRG1= <>
##$CPDPRG2= <>
##$CPDPRG3= <>
##$CPDPRG4= <mlev>
##$CPDPRG5= <mlev>
##$CPDPRG6= <mlev>
##$CPDPRG7= <mlev>
##$CPDPRG8= <mlev>
##$CPDPRGB= <>
##$CPDPRGT= <>
##$D= (0..31)
0 0.7 0 0 0 0 0 0 0 0 0 0.03 0 0 0 0 0 0 0 0 0 0 0 0 0 0 0 0 0 0 0 0 
##$DATE= 1770982882
##$DBL= (0..7)
120 120 120 120 120 120 120 120 
##$DBP= (0..7)
150 150 150 150 150 150 150 150 
##$DBP07= 0
##$DBPNAM0= <>
##$DBPNAM1= <>
##$DBPNAM2= <>
##$DBPNAM3= <>
##$DBPNAM4= <>
##$DBPNAM5= <>
##$DBPNAM6= <>
##$DBPNAM7= <>
##$DBPOAL= (0..7)
0.5 0.5 0.5 0.5 0.5 0.5 0.5 0.5 
##$DBPOFFS= (0..7)
0 0 0 0 0 0 0 0 
##$DE= 6
##$DECBNUC= <off>
##$DECIM= 32
##$DECNUC= <off>
##$DECSTAT= 4
##$DIGMOD= 1
##$DIGTYP= 9
##$DL= (0..7)
0 120 120 120 120 120 120 120 
##$DP= (0..7)
150 150 150 150 150 150 150 150 
##$DP07= 0
##$DPNAME0= <>
##$DPNAME1= <>
##$DPNAME2= <>
##$DPNAME3= <>
##$DPNAME4= <>
##$DPNAME5= <>
##$DPNAME6= <>
##$DPNAME7= <>
##$DPOAL= (0..7)
0.5 0.5 0.5 0.5 0.5 0.5 0.5 0.5 
##$DPOFFS= (0..7)
0 0 0 0 0 0 0 0 
##$DQDMODE= 0
##$DR= 18
##$DS= 0
##$DSLIST= <SSSSSSSSSSSSSSS>
##$DSPFIRM= 0
$$ [...]
##$SUBNAM0= <"">
##$SUBNAM1= <"">
##$SUBNAM2= <"">
##$SUBNAM3= <"">
##$SUBNAM4= <"">
##$SUBNAM5= <"">
##$SUBNAM6= <"">
##$SUBNAM7= <"">
##$SUBNAM8= <"">
##$SUBNAM9= <"">
##$SW= 18.0517328524113
##$SWIBOX= (0..15)
0 0 2 0 0 0 0 0 0 0 0 0 0 0 0 0 
##$SW_h= 3612.71676300578
##$TD= 16384
##$TD0= 1
##$TE= 0
##$TE2= 300
##$TE3= 300
##$TEG= 300
##$TL= (0..7)
0 120 120 120 120 120 120 120 
##$TP= (0..7)
150 150 150 150 150 150 150 150 
##$TP07= 0
##$TPNAME0= <>
##$TPNAME1= <>
##$TPNAME2= <>
##$TPNAME3= <>
##$TPNAME4= <>
##$TPNAME5= <>
##$TPNAME6= <>
##$TPNAME7= <>
##$TPOAL= (0..7)
0.5 0.5 0.5 0.5 0.5 0.5 0.5 0.5 
##$TPOFFS= (0..7)
0 0 0 0 0 0 0 0 
##$TUNHIN= 0
##$TUNHOUT= 0
##$TUNXOUT= 0
##$USERA1= <user>
##$USERA2= <user>
##$USERA3= <user>
##$USERA4= <user>
##$USERA5= <user>
##$V9= 5
##$VALIST= <valist>
##$VCLIST= <CCCCCCCCCCCCCCC>
##$VD= 0
##$VDLIST= <DDDDDDDDDDDDDDD>
##$VPLIST= <PPPPPPPPPPPPPPP>
##$VTLIST= <TTTTTTTTTTTTTTT>
##$WBST= 1024
##$WBSW= 4
##$XGAIN= (0..3)
0 0 0 0 
##$XL= 0
##$YL= 0
##$YMAX_a= 204917
##$YMIN_a= -219294
##$ZGOPTNS= <>
##$ZL1= 120
##$ZL2= 120
##$ZL3= 120
##$ZL4= 120
##$ABSF1= 10
##$ABSF2= 0
##$ABSG= 5
##$ABSL= 3
##$ALPHA= 0
##$AQORDER= 0
##$ASSFAC= 0
##$ASSFACI= 0
##$ASSFACX= 0
##$ASSWID= 0
##$AUNMP= <proc_1d>
##$AZFE= 0.1
##$AZFW= 0.1
##$BCFW= 1
##$BC_mod= 2
##$BYTORDP= 1
##$COROFFS= 0
##$CY= -3
##$DATMOD= 1
##$DC= 2
##$DFILT= <>
##$DTYPP= 0
##$F1P= 0
##$F2P= 0
##$FCOR= 0.5
##$FTSIZE= 0
##$FT_mod= 4
##$GAMMA= 1
##$GB= 0.15
##$INTBC= 1
##$INTSCL= 1
##$ISEN= 128
##$LB= 0.25
##$LEV0= 0
##$LPBIN= 0
##$MAXI= 10000
##$MC2= 0
##$MEAN= 0
##$ME_mod= 0
##$MI= 1.114404
##$NCOEF= 0
##$NC_proc= 0
##$NLEV= 6
##$NOISF1= 3.799351
##$NOISF2= 2.8
##$NSP= 1
##$NTH_PI= 0
##$NZP= 0
##$OFFSET= 14.38212
##$PC= 1
##$PHC0= -3704.639
##$PHC1= 6.992321
##$PH_mod= 1
##$PKNL= yes
##$PPARMOD= 0
##$PSCAL= 0
##$PSIGN= 0
##$REVERSE= no
##$SF= 200.129724274929
##$SI= 16384
##$SIGF1= 3
##$SIGF2= 2
##$SINO= 400
##$SIOLD= 16384
##$SREGLST= <1H.CDCl3>
##$SSB= 0
##$STSI= 0
##$STSR= 0
##$SW_p= 3205.1282051282
##$SYMM= 0
##$S_DEV= 0
##$TDeff= 0
##$TDoff= 0
##$TI= <>
##$TILT= no
##$TM1= 0
##$TM2= 0
##$TOPLEV= 0
##$USERP1= <user>
##$USERP2= <user>
##$USERP3= <user>
##$USERP4= <user>
##$USERP5= <user>
##$WDW= 1
##$XDIM= 8192
##$YMAX_p= 0
##$YMIN_p= 0
$$ End of Bruker specific parameters
$$ ---------------------------------
##NTUPLES= NMR FID
##VAR_NAME=  TIME,          FID/REAL,        FID/IMAG
##SYMBOL=    X,             R,               I
##VAR_TYPE=  INDEPENDENT,   DEPENDENT,       DEPENDENT
##VAR_FORM=  AFFN,          ASDF,            ASDF
##VAR_DIM=   8192,          8192,            8192
##UNITS=     SECONDS,       ARBITRARY UNITS, ARBITRARY UNITS
##FACTOR=    0.0002768,     1,               1
##FIRST=     0,             0,               0
##LAST=      2.2672688,     0,               0
##MIN=       0,             -219294,         0
##MAX=       2.2672688,     204917,          0
$$ Real data points
##PAGE= N=1
##DATA TABLE= (X++(R..R)), XYDATA
$$ [...]
$$ plain form
2137 2507 3151 1969 553 -1026 -2428 -3292 -2072 -726 841 2188 3054 2307 939 -395 -2097 -3204
2153 -3204 -2593 -1042 81 2135 2953 2442 1221 -170 -1825 -2843 -2592 -1214 -119 1804 3063 2525
2169 2525 1641 201 -1515 -2962 -2713 -1654 -675 1249 2769 2853 1992 535 -1212 -2578 -2743 -2138 -646
2186 -646 1062 2725 2695 2081 1011 -921 -2726 -2684 -2142 -1197 468 2241 2980 2403 1201 -452 -2158
2203 -2158 -2671 -2520 -1347 394 2016 2874 2485 1816 -91 -2168 -2770 -2347 -1745 -192 1689 2768 2774 1872
2221 1872 198 -1352 -2860 -2554 -2129 -540 1406 2482 2794 2236 794 -1285 -2456 -2586 -2344 -1169
2237 -1169 1044 2588 2553 2206 1388 -535 -2171 -2823 -2178 -1292 531 1857 2603 2616 1469 -367 -2082
2254 -2082 -2530 -2626 -1793 155 1952 2399 2640 1875 209 -1902 -2504 -2549 -2120 -308 1295 2345 2858 1733
$$ packed form
2137B507O44j182j416j579j402q64J220J346J567J347Q66p47j368j334j702j107
2153c204O11J551J123K054Q18n11j221j391j655j018K51J378J095J923J259n38
2169B525q84j440j716j447K49J059R79J924J520Q4q61j457j747j366j65O05J492
2186f46J708J663l0o14j070j932j805M2N42R45J665J773P39n77j202j653j706
2203b158n13J51J173J741J622Q58l89o69j907k077o02M23O02J553J881J079Or02
2221A872j674j550j508L06M25J589J946J076L12n58j442k079j171j30K42J175
2237a169K213J544l5l47q18j923j636o52O45Q86J823J326P46J3j147j836j715
2254b082m48r6Q33J948J797M47K41p65j666k111o02m5M29J812J603J050N13j125
$$ plain form
2272 1733 390 -1231 -2286 -2777 -2349 -516 943 2310 2888 2275 792 -866 -2025 -2661 -2294 -1231
2288 -1231 761 1962 2771 2541 1104 -483 -2051 -2641 -2634 -1315 316 1759 2649 2624 1445 -52 -1622
2305 -1622 -2423 -2814 -1851 38 1280 2386 2704 1771 499 -1209 -2484 -2661 -1853 -416 1158 2152 2709
2322 2709 1964 772 -822 -2377 -2795 -2253 -786 608 1898 2807 2435 1069 -554 -2040 -2716 -2136 -1199
2339 -1199 505 1703 2527 2276 1381 -87 -1461 -2590 -2564 -1447 -150 1437 2516 2514 1727 72 -1397
2356 -1397 -2441 -2602 -1824 -312 1296 2146 2596 1893 566 -1016 -2302 -2627 -1979 -907 944 1987 2392
2373 2392 2334 956 -655 -2004 -2660 -2351 -952 715 1658 2512 2170 1291 -347 -1735 -2387 -2525 -1410
2390 -1410 309 1687 2448 2421 1511 -232 -1176 -2263 -2328 -1605 -158 1316 2367 2532 1865 284 -995
$$ packed form
2272A733j343j621j055m91M28J833J459J367N78o13j483j658j159o36L67J063
2288a231J992J201Q09k30j437j587j568n90PJ319J631J443Q90k5j179j497j570
2305a622q01l91R63J889J242J106L18r33j272j708j275j77Q08J437J574R94N57
2322B709p45j192j594j555m18N42J467J394J290R09l72j366j623j486o76N80R37
2339a199J704J198Q24k51q95j468j374j129K6J117J297J587J079kp87j655j469
2356a397j044j61P78J512J608Q50M50p03j327j582j286l25O48J072J851J043M05
2373B392n8j378j611j349o56L09J399J667R43Q54l42q79j638j388o52j38J115
2390a410J719J378P61k7r10j743r44j087o5P23J447J474J051J65o67j581j279
$$ plain form
2407 -995 -2037 -2718 -1999 -136 1129 1799 2512 2064 674 -842 -2009 -2536 -2017 -756 727 1704 2537
2424 2537 2077 693 -232 -1797 -2505 -2284 -907 297 1383 2461 2416 988 -198 -1546 -2459 -2320 -1358
2441 -1358 118 1061 2316 2476 1596 266 -1107 -2491 -2572 -1461 -293 985 2165 2459 1491 531 -767
2458 -767 -2190 -2470 -1759 -594 778 2129 2290 1901 884 -579 -2010 -2544 -1844 -1006 159 1730 2493
2475 2493 1788 1134 -147 -1583 -2473 -2045 -1083 -7 1319 2426 1810 1340 267 -1397 -2579 -2010 -1304
2492 -1304 -442 1383 2076 2158 1646 634 -1022 -2206 -2106 -1408 -741 1031 2129 2231 1804 1015 -678 -2145
2510 -2145 -1926 -1742 -966 584 1999 2140 1811 1241 -427 -1973 -2153 -1898 -1132 114 1920 1967 1842 1400
2528 1400 -107 -1694 -1930 -1879 -1621 -49 1507 2161 1879 1782 331 -1397 -2046 -2023 -1781 -458 1199 1815
$$ packed form
2407i95j042o81P19J863J265O70P13m48j390j516j167n27N19J261J483R77Q33
2424B537m60j384r25j565p08K21J377J204J086J078m5j428j186j348r13J39R62
2441a358J476R43J255J60q80j330j373j384q1J111J168J278J180K94r68r60j298
2458g67j423k80P11J165J372J351J61l89j017j463j431n34P00Q38J165J571P63
2475B493p05o54j281j436q90M28R62J076J326J107o16m70j073j664j182N69P06
2492a304Q62J825O93Q2n12j012j656j184J00O98O67J772J098J02m27p89j693j467
2510b145K19J84P76J550J415J41l29n70j668j546j80K55P66J246J806M7j25m42
2528A400j507j587k36N1K58J572J556O54k82r7j451j728o49K3K42J323J657O16
$$ plain form
2546 1815 2290 1984 573 -1065 -1846 -1969 -1828 -700 1001 1714 1937 1954 691 -791 -1682 -1926 -2214 -1103
2564 -1103 926 1468 1934 2092 1250 -545 -1473 -1932 -2468 -1168 445 1289 1987 2185 1458 -179 -1108 -1827
2582 -1827 -2197 -1561 138 1163 1367 2283 1656 73 -979 -1885 -2352 -1697 -419 815 1511 2048 1907 331
2600 331 -708 -1492 -2310 -1935 -598 734 1473 2112 1907 661 -523 -1310 -2132 -1937 -998 362 1116 2047
2618 2047 1991 893 9 -1105 -2157 -2272 -942 95 969 1884 2107 1204 87 -867 -1859 -2332 -1136 -107
2636 -107 760 1974 2178 1231 131 -386 -1582 -2186 -1378 -402 409 1782 2379 1483 602 -420 -1536 -2154
2654 -2154 -1533 -819 130 1367 2289 1618 913 -170 -1377 -2211 -1589 -974 -118 1164 2044 1642 914 91
2672 91 -987 -1924 -1642 -1141 -378 733 1834 1878 1224 484 -895 -1812 -1758 -1271 -383 614 1754 2083 1087
$$ packed form
2546A815M75l06j411j638p81j23J41J128J701P13K23J7j263j482q91k44k88J111
2564a103K029N42M66J58q42j795r28m59n36J300J613Q44O98J98p27j637r29p19
2582a827l70O36J699J025K04R16o27j583j052r06m67O55J278J234O96N37j41j576
2600C31j039p84q18L75J337J332P39O39k05j246j184p87q22J95R39J360P54R31
2618B047n6j098q84j114j052j15J330J037Q74R15K23r03j117r54r92m73J196J029
2636a07Q67J214K04r47j100n17j196o04Q08R76Q11J373N97q96q81j022j116o18
2654b154O21P14R49J237R22o71p05j083j207q34O22O15Q56J282Q80m02p28q23
2672I1j078r37K82N01P63J111J101M4o54p40j379r17N4M87Q88R97J140L29r96
$$ plain form
2691 1087 696 -498 -1711 -1956 -1502 -583 532 1598 1841 1365 784 -408 -1692 -1756 -1558 -1035 97 1656
2709 1656 1780 1786 937 25 -1480 -1861 -1516 -1242 -7 1162 1815 1533 1269 330 -1306 -1742 -1679 -1387 -574
2728 -574 1392 1721 1748 1595 287 -881 -1668 -1651 -1286 -753 557 1390 1650 1679 871 -442 -1151 -1523 -1430 -791
2748 -791 611 1235 1643 1442 878 -325 -1244 -1542 -1696 -1066 255 1277 1556 1709 1038 -198 -1085 -1499
2766 -1499 -1718 -1181 -83 977 1244 1801 1370 164 -1082 -1511 -1509 -1425 -243 635 1169 1785 1414 488 -752
2785 -752 -1202 -1586 -1364 -435 773 1266 1547 1539 495 -555 -1270 -1678 -1565 -667 255 1166 1362 1428 815 -92
2805 -92 -1053 -1605 -1678 -760 -55 1003 1216 1563 937 196 -951 -1195 -1736 -1237 59 769 1335 1666 1439 181
2825 181 -554 -1340 -1643 -1131 -108 635 1338 1524 1320 556 -435 -1171 -1554 -1481 -605 358 1058 1503 1258 880
$$ packed form
2691A087l91j194j213k45M54R19J115J066K43m76n81j192j284o4J98N23J132J559
2709A656J24Oq49r12j505l81L45K74J235J169O53k82k64r39j636m36O3K92Q13
2728e74J966L29K7j53j308j168p87J7L65N33J310Q33K60K9q08j313p09l72R3O39
2748g91J402O24M08k01n64j203r19k98j54O30J321J022K79J53o71j236q87m14
2766a499k19N37J098J060K67N57m31j206j246m29KQ4J182Q78N34O16l71r26j240
2785g52m50l84K22R29J208M93K81qj044j050p15m08J13Q98R22R11J96O6o13r07
2805i2r61n52p3R18P05J058K13L47o26p41j147k44n41M99J296P10N66L31k27j258
2825A81p35p86l03N12J023P43P03J86k04p64r91p36l83P3Q76R63P00M45k45l78
$$ plain form
2845 880 -277 -922 -1501 -1269 -708 256 1017 1569 1466 711 57 -1105 -1463 -1293 -1055 -33 844 1352 1473
2864 1473 936 134 -741 -1389 -1350 -1152 -273 883 1313 1674 1114 193 -726 -1292 -1520 -1309 -328 488 1350 1537
2884 1537 1392 588 -512 -1094 -1385 -1394 -740 475 1167 1249 1337 559 -258 -1278 -1615 -1282 -644 199 1035 1370
2904 1370 1242 769 -197 -827 -1339 -1259 -720 54 750 1348 1571 928 25 -754 -1178 -1462 -1043 -320 642 1085
2924 1085 1433 1002 342 -522 -1115 -1514 -1128 -303 412 991 1305 1354 289 -276 -539 -1509 -1207 -563 171 882
2944 882 1474 1281 587 -18 -880 -1357 -1270 -509 254 795 1409 1262 606 274 -801 -1300 -1433 -522 -270 649
2964 649 1292 1410 967 77 -659 -1254 -1366 -891 -177 299 1204 1314 864 361 -300 -1099 -1431 -1048 -441 244
2984 244 957 1422 895 477 29 -810 -1426 -950 -542 -28 841 1274 988 658 185 -649 -1311 -1176 -548 -125
$$ packed form
2845H80j157o45n79K32N61R64P61N52j03p55o54j162l58J70K38J022Q77N08J21
2864A473n37q02q75o48L9J98Q79J156M30L61n60r21r19n66k28K11R81Q16Q62J87
2884A537j45q04j100n82k91rO54J215O92Q2Q8p78q17j020l37L33O38Q43Q36L35
2904A370j28m73r66o30n12Q0N39P74O96N98K23o43r03p79m24k84M19P23R62M43
2924A085L48m31o60q64n93l99L86Q25P15N79L14M9j065n65k63r70L02O44P34P11
2944H82N92j93o94o05q62m77Q7P61P63N41O14j47o56l32j075m99j33R11K52R19
2964F49O43J18m43q90p36n95j12M75P14M76R05J10m50n03o61p99l32L83O07O85
2984B44P13M65n27m18m48q39o16M76M08N14Q69M33k86l30m73q34o62J35O28M23
$$ plain form
3004 -125 584 1263 926 824 91 -716 -1378 -1049 -791 -339 676 1176 1190 972 327 -742 -1446 -1068 -1068 -400
3024 -400 624 1001 979 898 611 -437 -1080 -856 -896 -535 239 1044 1243 1006 588 -288 -1077 -1261 -931 -700
3044 -700 156 1017 1071 823 763 -91 -931 -1195 -1055 -802 -242 831 1051 938 921 33 -872 -1106 -1255 -844 -134
3065 -134 614 872 1034 978 398 -611 -988 -1076 -1087 -438 622 814 1093 1065 471 -481 -860 -983 -914 -386 435
3086 435 804 856 1101 540 -447 -928 -880 -1005 -566 275 525 917 928 924 -9 -657 -752 -1082 -978 181 601 1108
3108 1108 1282 700 71 -505 -937 -1321 -842 -234 366 661 1182 973 223 -480 -994 -1151 -774 -234 397 954
3128 954 1022 1065 447 -315 -721 -1112 -960 -260 216 303 855 1266 543 -269 -668 -951 -1027 -223 50 353 975
3149 975 1145 355 13 -254 -884 -1039 -450 88 357 917 951 937 162 -101 -870 -1202 -699 -218 177 901 1144
$$ packed form
3004a25P09O79l37j02p33q07o62L29K58M52J015N00J4k18o45j069p04L78%O68
3024d00J024L77k2q1k87j048o43K24m0L61P74Q05J99k37m18q76p89j84L30K31
3044g00Q56Q61N4k48o0q54q40k64J40K53N60J073K20j13j7q88r05k34j49M11P10
3065a34P48K58J62n6n80j009l77q8j1O49J060J92K79k8n94r52l79j23O9N28Q21
3086D35L69N2K45n61r87m81M8j25M39Q41K50L92J1mr33o48r5l30J04J159M20N07
3108A108J74n82o29n76m32l84M79O08O00K95N21k09p50p03n14j57L77N40O31N57
3128I54O8M3o18p62m06l91J52P00M76Q7N52M11p23q12l99k83p6Q04K73L03O22
3149I75J70p90l42k67o30j55N89N38K69N60L4j4p75k63p69l32N03M81L95P24K43
$$ plain form
3170 1144 678 347 -63 -804 -1241 -680 -465 30 693 1114 735 509 -149 -773 -1037 -849 -545 104 462 1392
3190 1392 975 484 39 -594 -1181 -799 -564 12 209 992 915 664 -136 -475 -847 -792 -463 -411 436 1019 753
3211 753 785 322 -366 -846 -850 -628 -378 292 870 872 544 530 -336 -1056 -1091 -835 -373 351 655 976 822 469
3233 469 -68 -571 -801 -916 -588 53 660 1091 863 432 5 -710 -859 -667 -672 -20 670 1040 747 543 207
3254 207 -575 -871 -827 -773 -329 446 862 948 756 346 -309 -920 -885 -595 -364 458 687 744 882 341 -325 -824
3276 -824 -798 -550 -115 3 725 860 817 421 -133 -622 -860 -981 -534 48 339 684 898 642 116 -447 -837
3297 -837 -705 -594 -103 628 633 803 492 37 -482 -646 -770 -776 -105 513 506 1003 661 235 -369 -787 -856 -724
3319 -724 -259 430 553 804 468 321 -142 -452 -662 -949 -463 -58 536 965 566 417 28 -486 -900 -692
$$ packed form
3170A144m66l31m10p41m37N61K15M95O63M21l79k26o58o24k64J88L04O49L58R30
3190A392m17m91m45o33n87L82K35N76J97P83p7k51q00l39l72N5L29N2Q47N83k66
3211G53L2m63o88m80mK22K50O70N78Kl28j4q66p20l5K56M62P24L04L21j54l53
3233D69n37n03k30j15L28O41O07M31k28m31m27p15j49J92nO52O90L70k93k04l36
3254B07p82k96M4N4M44P75M16Q6j92m10o55o11L5K90K31Q22K29N7J38n41o66m99
3276h24K6K48M35J18P22J35m3l96n54m89k38j21M47N82K91L45K14k56n26n63l90
3297h37J32J11M91P31NJ70l11m55n19j64j24oO71O18pM97l42m26o04m18o9J32
3319g24M65O89J23K51l36j47m63l10k10k87M86M05N94M29l99j49l89n14m14K08
$$ plain form
3339 -692 -580 87 512 645 919 460 298 -335 -851 -756 -866 -109 423 592 789 492 109 -646 -696 -770 -557
3360 -557 -149 410 830 880 680 431 -182 -670 -852 -508 -366 191 644 697 792 289 -140 -519 -859 -663 -391
3381 -391 222 636 880 708 446 -188 -357 -656 -624 -487 67 492 817 932 556 -117 -633 -747 -597 -800
3401 -800 -13 421 687 795 641 8 -113 -497 -889 -764 -33 482 717 683 727 516 -289 -558 -593 -742 -368
3422 -368 65 363 829 853 480 -68 -513 -665 -772 -380 36 457 703 581 370 234 -424 -585 -650 -550 162
3443 162 220 606 651 249 -128 -374 -529 -801 -349 55 275 681 768 541 13 -472 -658 -607 -547 10 186 469
3465 469 714 673 55 20 -547 -587 -459 -231 295 401 860 652 484 -181 -342 -640 -599 -298 232 224 627 819
3487 819 368 -5 -154 -562 -748 -522 44 292 568 525 293 101 -84 -656 -809 -590 20 381 526 740
$$ packed form
3339f92J12O67M25J33K74m59j62o33n16R5j10P57N32J69J97k97l83p55n0p4K13
3360e57M08N59M20N0k00k49o13m88j82L44J42N57M53N3R5n03m29l79l40J96K72
3381c91O13M14K44j72k62o34j69k99L2J37N54M25L25J15l76o73n16j14J50k03
3401h00P87M34K66J08j54o33j21l84l92J25P31N15K35l4M4k11q05k69l5j49L74
3422c68M33K98M66K4l73n48m45j52j07L92M16M21K46j22k11j36o58j61o5J00P12
3443A62N8L86M5m02l77k46j55k72M52M04K20M06Q7k27n28m85j86N1O0N57J76K83
3465D69K45m1o18l5n67m0J28K28N26J06M59k08j68o65j61k98M1L01N30qM03J92
3487H19m51l73j49m08j86K26N66K48K76m3k32j92j85n72j53K19O10L61J45K14
$$ plain form
3507 740 455 69 -88 -612 -863 -365 -178 197 603 694 310 314 -192 -714 -725 -600 -340 -250 625 746 420 486
3529 486 40 -616 -846 -693 -152 -35 631 973 450 203 170 -329 -467 -622 -222 -55 129 675 695 489 19
3550 19 -209 -672 -480 -519 -306 62 638 515 384 404 -260 -360 -510 -307 -203 -6 499 598 647 428 -70 -329
3572 -329 -529 -370 -410 68 709 421 357 175 116 -474 -412 -518 -634 26 384 747 539 525 -29 -377 -586 -493
3594 -493 -468 -256 557 625 453 638 198 -296 -391 -662 -624 -322 34 389 594 493 360 -99 -314 -501 -883
3615 -883 -246 142 510 606 589 450 -157 -306 -419 -581 -368 190 164 603 774 314 1 -410 -389 -662 -622 -85
3637 -85 225 297 451 491 98 -106 -333 -584 -420 -93 -12 573 445 530 214 -272 -283 -723 -396 -178 169 201
3659 201 799 251 -64 -132 -260 -651 -654 -385 -4 163 478 619 195 -248 -265 -437 -622 -248 -6 286 409
$$ packed form
3507G40k85l86j57n24k51M98J87L75M06R1l84Mn06n22j1J25K60R0Q75J21l26O6
3529D86m46o56k30J53N41J17O66L42n23k47l3m99j38j55M00J67J84N46K0k06m70
3550A9k28m63J92l9K13L68N76j23j31K0o64j00j50K03J04J97N05R9M9k19m98k59
3572c29k00J59m0M78O41k88o4j82n9n90O2j06j16O60L58L63k08j4n54l48k09R3
3594d93K5K12Q13O8j72J85m40m94r5k71L8L02L56L55K05j01j33m59k15j87l82
3615h83O37L88L68R6j7j39o07j49j13j62K13N58k6M39J71m60l13m11K1k73M0N37
3637h5L10P2J54M0l93k04k27k51J64L27Q1N85j28Q5l16m86j1m40L27K18L47L2
3659B01N98n48l15o8j28l91lK69L81J67L15J41m24m43j7j72j85L74K42K92J23
$$ plain form
3680 409 321 356 139 -346 -460 -644 -301 -143 31 340 729 174 -32 -59 -551 -637 -249 -27 -69 357 510 296
3702 296 163 182 -304 -407 -410 -173 13 216 655 538 367 -112 -286 -582 -467 -105 -164 281 479 448 79 -14
3724 -14 -15 -782 -623 -109 -236 142 468 425 468 217 -183 -320 -282 -204 16 219 396 713 350 310 -211 -546 -586
3747 -586 -237 -511 -121 483 343 447 256 -23 -216 -675 -172 -307 239 477 289 304 295 34 -304 -511 -200
3768 -200 -349 -59 123 392 270 324 -14 -347 -385 -193 -478 -60 236 373 391 239 266 -361 -378 -388 -471 -154
3790 -154 202 489 308 368 243 -92 -441 -544 -268 -185 -67 314 151 380 424 1 -422 -359 -185 -362 -42
3811 -42 167 139 493 379 -104 -437 -436 -365 -165 -14 271 521 364 294 202 -52 -273 -403 -102 -352 87 231
3833 231 414 312 -88 61 -204 -349 -411 -250 90 249 723 301 101 -281 -442 -486 -434 -275 -1 246 346
$$ packed form
3680D09q8L5k17m85j14j84L43J58J74L09L89n55k06k7m92q6L88K22m2M26J53k14
3702B96j33J9m86j03lK37J86K03M39j17j71m79j74k96J15L62n9M45J98l1l69r3
3724a4jp67J59N14j27L78L26m3M3k51m00j37L8P8K20K03J77L17l63m0n21l35m0
3747e86L49k74L90O04j40J04j91k79j93m59N03j35N46K38j88J5rk61l38k07L11
3768b00j49K90J82K69j22N4l38l33l8J92k85M18K96J37J8j52K7o27j7j0q3L17
3790a54L56K87j81O0j25l35l49j03K76Q3J18L81j63K29M4m23m23O3J74j77L20
3811d2K09k8L54j14m83l33JP1K00J51K85K50j57p0r2k54k21j30L01k50M39J44
3833B31J83j02m00J49k65j45o2J61L40J59M74m22k00l82j61m4N2J59K74K47J00
$$ plain form
3854 346 414 79 80 -311 -327 -189 -275 258 78 352 320 255 -15 -98 -270 -304 -394 -157 329 462 387 249 30 -61
3878 -61 -370 -387 -389 -41 -37 230 319 325 195 -179 -174 -363 -378 13 65 363 370 269 279 -26 -242 -403 -208 -203 -140 -60 271
3905 271 -11 322 -51 -164 -381 -447 -103 108 192 284 400 174 207 -69 -147 -280 -302 -181 56 307 250 321 -17
3928 -17 -114 -293 -460 -335 -201 180 178 204 376 155 3 -249 -262 -245 -256 -76 322 379 311 171 -72 -5 -178 -284
3952 -284 -307 -78 31 299 392 145 -69 -11 -197 -153 -201 146 306 54 347 276 128 -8 -187 -387 -339 20
3974 20 189 209 278 132 -56 -53 54 -227 -364 -20 -215 274 316 313 109 95 -267 -274 -115 -116 -2 17 412 223 195
3999 195 13 -139 -169 -285 -24 -130 128 345 128 302 -72 55 -190 -503 -333 -17 182 565 303 115
4019 115 127 81 -223 -209 -25 -234 -46 152 391 415 114 -33 -232 -315 -312 -87 -60 174 202 -22 136 136 -248 -159
$$ packed form
3854C46O8l35Jl91j6J38q6N33j80K74l2o5k70q3j72l4r0K37M86J33p5j38k19r1
3878f1l09j7kL48MK67Q9Oj30l74Nj89j5L91N2K98Pj01J0l05k16j61J95NO3Q0L31
3905B71k82L33l73j13k17o6L44K11Q4R2J16k26L3k76p8j33k2J21K37K51n7P1l38
3928a7r7j79j67J25J34L81kK6J72k21j52k52j3J7j1J80L98N7o8j40k43O7j73j06
3952b84k3K29J09K68R3k47k14N8j86M4m8L47J60k52K93p1j48j36j79k00M8L59
3974B0J69K0O9j46j88LJ07k81j37L44j95M89M2lk04j4l62pJ59jJ14J9L95j89k8
3999A95j82j52l0j16K61j06K58K17k17J74l74J27k45l13J70L16J99L83k62j88
4019A15J2m6l04J4J84k09J88J98K39K4l01j47j99q3LK25K7K34K8k24J58%l84Q9
$$ plain form
4043 -159 -75 -101 -6 203 429 174 120 -24 132 -405 -266 -178 -116 19 336 448 160 226 -85 -202 -20 -137
4065 -137 -279 22 211 141 78 183 108 -184 -99 -268 -146 121 265 391 358 239 57 -145 -387 -84 -145 -26
4087 -26 72 126 188 244 -34 -128 -321 -236 -200 -88 -80 282 236 15 47 -178 -221 -207 -285 -4 86 -78 354 176 114 23
4113 23 -56 -169 -233 -63 4 35 294 59 -7 28 -255 -305 -193 -235 122 310 11 248 158 -23 -37 -113 -3 -277
4137 -277 -48 -45 118 183 20 -282 -55 -135 -340 -180 222 -74 69 103 3 236 18 -100 -269 -269 -180 30 160
4160 160 285 203 189 -44 -137 -239 -145 -149 -87 138 166 413 232 121 -164 -296 -182 -260 -174 -22 66 201 227 -47
4184 -47 77 -326 -170 -76 -129 62 205 157 71 -59 -12 -115 -95 -170 -76 -5 274 262 269 159 120 -287 -270 -120 -49
4209 -49 -113 136 183 -24 193 63 -119 -206 123 -80 -178 -136 217 179 139 4 87 -361 -69 -278 -175 39 124
$$ packed form
4043a59Q4k6R5K09K26k55n4j44J56n37J39Q8O2J35L17J12k88O6l11j17J82j17
4065a37j42L01J89p0o3J05p5k92Q5j69J22K67J44J26l3j19j82k02k42L03o1J19
4087b6R8N4O2N6k78r4j93Q5L6J12QL62m6k21L2k25m3J4p8K81R0j64M32j78o2r1
4113B3p9j13o4J70O7L1K59k35o6L5k83n0J12m2L57J88k99K37r0j81j4p6J10k74
4137b77K29LJ63O5j63l02K27q0k05J60M02k96J43L4j00K33k18j18j69%Q9K10J30
4160A60J25q2j4k33r3j02R4mO2K25K8K47j81j11k85j32J14p8Q6J52Q8J35K6k74
4184d7J24m03J56R4n3J91J43m8q6j30M7j03K0p5R4P1K79j2Pj10l9m07J7J50P1
4209d9o4K49M7k07K17j30j82q7L29k03r8M2L53l8m0j35Q3m48K92k09J03K14Q5
$$ plain form
4232 124 87 127 238 -87 -129 -180 -3 -191 -108 138 238 225 -15 -92 -175 -291 -363 -256 -131 101 100 20 261 -20
4256 -20 -177 -158 -271 -118 -151 18 255 106 -15 184 -164 -128 -327 -334 -63 23 136 240 74 99 91 -135 -309
4279 -309 124 -190 -40 85 278 215 -129 -132 -96 -188 -126 -42 -51 143 -37 162 56 161 -147 -53 107 -249 -40
4302 -40 40 250 154 -52 -21 -163 -157 -369 -134 53 85 219 253 163 226 18 46 -103 -45 71 62 69 32 82 281 108
4328 108 -120 -49 -133 -21 137 57 136 396 136 -102 -127 -226 -129 -15 16 223 -3 167 -99 133 -81 -58 -1
4351 -1 -170 149 125 -66 148 71 -103 41 -53 -156 -95 89 26 307 180 217 88 22 -157 -161 -19 -53 -20 -7 221
4376 221 224 85 -217 -247 23 -38 -99 -39 94 -84 -50 6 82 -79 -158 -98 -172 -64 -28 72 180 117 -91 -34 28
4401 28 -68 -206 74 117 -9 76 302 56 -27 168 -34 -193 -90 10 -15 130 89 129 0 -121 -259 -194 -157
$$ packed form
4232A24l7M0J11l25m2n1J77j88Q3K46J00j3k40p7q3j16p2J07J25K32jq0K41k81
4256b0j57J9j13J53l3J69K37j49j21J99l48L6j99pK71Q6J13J04j66K5qk26j74
4279c09M33l14J50J25J93o3l44lL6r2O2Q4rJ94j80J99j06J05l08R4J60l56K09
4302d0Q0K10r6k06L1j42Ok12K35J87L2J34L4r0O3k08K8j49N8J16rPl7N0J99j73
4328A08k28P1q4J12J58q0P9K60k60k38k5r9R7J14L1K07k26J70k66K32k14K3N7
4351aj69L19k4j91K14p7j74J44r4j03O1J84o3K81j27L7j29o6j79mJ42l4L3J3K28
4376B21Lj39l02l0K70o1o1O0J33j78L4N6P6j61p9O0p4J08L6J00J08o3k08N7O2
4401B8r6j38K80M3j26Q5K26k46q3J95k02j59J03J00k5J45m1M0j29j21j38O5L7
$$ plain form
4424 -157 202 83 209 198 100 170 -132 -77 -238 -198 -190 18 81 245 247 48 -137 -208 -322 -82 -88 151 73 52 58 143
4450 143 -50 216 -388 41 51 -7 134 295 172 -15 -3 -131 2 -63 -118 -85 150 138 148 110 -126 -270 -55
4473 -55 -85 -90 123 32 -2 144 216 -12 33 -175 -106 -79 0 168 134 -28 -79 -22 -170 30 -152 -84 -40 74 103 90
4499 90 -162 286 252 -239 -159 44 -92 139 -2 65 236 4 13 -193 -193 -91 -106 92 265 2 63 95 152 -22
4523 -22 107 -256 -280 114 -49 71 334 138 183 78 60 -14 -130 -13 -52 -47 -98 -58 98 129 -54 75 -162 -35
4547 -35 38 412 192 44 47 59 10 -65 -133 -37 -88 -74 89 -277 0 228 12 -69 -91 17 226 -24 54 51 11 42
4573 42 43 -65 144 -171 79 82 61 -65 173 62 207 20 -183 -97 65 -12 142 325 114 -5 -166 -2 7
4596 7 -73 -252 -4 149 107 55 206 -160 -110 -147 -130 102 14 211 -71 239 213 165 103 -187 -15 -24 132 62 280
$$ packed form
4424a57L59j19J26j1r8P0l02N5j61M0QK08O3J64Kj99j85p1j14K40oK39p8k1OQ5
4450A43j93K66o04M29J0n8J41J61j23j87J2j28J33o5n5L3K35j2J0l8k36j44K15
4473e5l0nK13r1l4J46P2k28M5k08O9K7P9J68l4j62n1N7j48K00j82O8M4J14K9j3
4499I0k52M48l4m91Q0K03j36K31j41O7J71k32Rk06%J02j5J98J73k63O1L2N7j74
4523b2J29l63k4L94j63J20K63j96M5j05j8p4j16J17l9Nn1M0J56L1j83J29k37J27
4547c5P3L74k20j48LJ2m9p5o8R6n1J4J63l66K77K28k16q1k2J08K09k50P8lm0L1
4573D2Jj08K09l15K50Lk1j26K38j11J45j87k03Q6J62p7J54J83k11j19j61J64R
4596Gq0j79K48J53m2n2J51l66N0l7J7K32q8J97k82L10k6m8o2k90J72rJ56p0K18
$$ plain form
4621 280 176 7 72 -12 -162 -241 -117 67 -35 124 0 46 -1 6 -187 -143 -60 -376 150 175 75 201 103 -205
4645 -205 -20 -136 -296 117 -233 -35 40 -18 186 267 95 138 -138 -278 95 -143 163 244 101 -47 -16 -110
4667 -110 -114 -31 -204 41 -10 158 116 -243 105 -137 -229 -20 82 -72 -10 -33 162 224 -78 -203 29 -71 112
4690 112 33 -86 108 222 162 10 146 -8 -140 -284 -186 175 86 -99 26 162 -121 -79 -243 79 -275 -48
4712 -48 176 43 92 106 9 -62 -177 68 -108 -237 104 -55 59 88 -38 -83 252 79 87 -189 -28 153 -98
4735 -98 213 -27 -57 -87 162 42 22 223 286 290 30 73 -44 34 -8 -204 6 -66 175 98 55 -350 51 -239
4759 -239 -362 17 -128 61 95 165 107 115 46 -25 70 -144 -200 -4 15 -9 60 75 19 17 -17 -145 -14 -48 61 -38
4785 -38 78 216 -38 -27 -22 -72 -219 -186 151 102 -101 -177 -149 -29 -137 -42 -34 -196 -3 -115 45 136 -48 -100 163
$$ packed form
4621B80j04j69O5q4j50p9J24J84j02J59j24M6m7Pj93M4Q3l16N26K5j00J26r8l08
4645b05J85j16j60M13l50J98P5n8K04Q1j72M3k76j40L73k38L06Q1j43j48L1r4
4667a10mQ3j73K45n1J68m2l59L48k42r2K09J02j54O2k3J95O2l02j25K32j00J83
4690A12p9j19J94J14o0j52J36j54j32j44R8L61q9j85J25J36k83M2j64L22l54K27
4712d8K24j33M9J4r7p1j15K45j76j29L41j59J14K9j26m5L35j73Qk76J61J81k51
4735i8L11k40l0l0K49j20k0K01O3Mk60M3j17P8m2j96K10p2K41p7m3m05M01k90
4759b39j23L79j45J89L4P0n8Qo9p1R5k14n6J96J9k4O9J5n6kl4j28J31l4J09r9
4785c8J16J38k54J1Nn0j47L3L37m9k03p6K8J20j08R5Qj62J93j12J60R1j84n2K63
$$ plain form
4810 163 -122 2 -17 -138 -102 144 101 274 -41 -89 19 181 -142 -37 121 -38 -11 158 57 -226 -82 234
4832 234 -198 -107 64 60 168 186 -128 -79 -125 42 2 157 -30 -8 74 52 114 -148 61 5 -50 -149 -44 169 161
4857 161 193 -20 -41 148 -175 -21 103 -30 -21 262 -66 241 -148 6 97 -226 -340 -145 -93 42 58 23 -40
4880 -40 153 -166 -88 -70 -42 -62 131 -134 64 97 41 80 -55 -45 73 -85 -4 -206 -205 60 -119 8 42 -144
4904 -144 -36 -121 -90 10 112 34 66 49 4 30 -210 -267 -102 40 268 188 -24 68 -145 -224 -110 -161 -186 -43
4928 -43 61 -13 -42 -133 122 -200 251 -37 -227 -187 220 129 -37 -200 -17 -37 59 -77 -122 -65 96 20 17 102 -167
4953 -167 -224 -152 16 -155 -152 -168 0 36 -152 163 97 204 -134 -191 208 -133 47 3 -28 -177 238 119 11
4976 11 -94 -58 10 21 48 -22 13 -19 -1 -62 128 -44 90 208 -36 27 94 -151 42 -230 -101 -20 -21 157 365
$$ packed form
4810A63k85J24j9j21L6K46m3J73l15m8J08J62l23J05J58j59K7J69j01k83J44L16
4832B34m32R1J71mJ08J8l14M9m6J67m0J55j87K2Q2k2O2k62K09n6n5r9J05K13q
4857A61L2k13k1J89l23J54J24j33RK83l28L07l89J54R1l23j14J95N2J35J6l5o3
4880d0J93l19P8J8K8k0J93k65J98L3n6L9j35J0J18j58Q1k02JK65j79J27L4j86
4904a44J08q5L1J00J02p8L2j7m5K6k40n7J65J42K28q0k12R2k13p9J14n1k5J43
4928d3J04p4k9r1K55l22M51k88j90M0M07r1j66j63J83k0R6j36m5N7J61p6lQ5k69
4953a67n7P2J68j71Lj6J68L6j88L15o6J07l38n7L99l41J80m4l1j49M15j19j08
4976A1j05L6O8J1K7p0L5l2J8o1J90j72J34J18k44O3O7k45J93k72J29Q1jJ78K08
$$ plain form
5001 365 125 -207 -43 59 -61 -47 -181 160 131 -54 -108 25 -69 187 -15 -86 -351 -61 84 -54 23 204
5023 204 -40 -171 -2 -160 -10 32 -74 148 5 182 136 161 -150 -211 39 79 156 23 278 17 97 -215
5045 -215 -85 -83 -298 141 -41 151 105 -14 64 97 24 -23 -130 34 -113 -198 -160 40 -58 13 -149 -126 23 -50
5069 -50 -45 57 65 134 73 305 14 -193 -263 -85 -48 -8 -155 69 79 173 -27 -236 -237 7 -233 -43 -190 79 -18
5094 -18 44 -46 -37 -177 -66 30 124 35 -1 172 195 130 59 -123 -23 86 -122 -39 80 89 -24 -71 55 -48 -1 -112
5120 -112 -93 7 148 30 -4 -196 -54 -83 -223 -60 -268 38 70 103 157 -82 104 81 -131 -346 -21 -4 132
5143 132 284 159 357 -26 -88 -44 -35 -12 64 177 75 56 69 143 -38 -28 27 0 70 -83 111 51 193 121 -111
5168 -111 137 216 -139 -75 -135 150 -144 53 92 -91 -199 -76 -13 -144 92 -205 55 111 -93 173 -162 79
$$ packed form
5001C65k40l32J64J02j20J4j34L41k9j85n4J33r4K56k02p1k65K90J45j38P7J81
5023B04k44j31J69j58J50M2j06K22j43J77m6K5l11o1K50M0P7j33K55k61Q0l12
5045b15J30Kk15M39j82J92m6j19P8L3p3m7j07J64j47q5L8K00r8P1j62K3J49p3
5069e0NJ02QO9o1K32k91k07p0J78L7M0j47K24J0R4k00k09jK44k40J90j47K69r7
5094a8O2r0Rj40J11R6R4q9l6J73K3o5p1j82J00J09k08Q3J19Rj13m7J26j03M7j11
5120a12J9J00J41j18l4j92J42k9j40J63k08L06L2L3N4k39J86k3k12k15L25J7J36
5143A32J52j25J98l83o2M4RK3P6J13j02j9J3P4j81J0N5k7P0j53J94o0J42p2k32
5168a11K48P9l55O4o0K85k94J97L9j83j08J23O3j31K36k97K60N6k04K66l35K41
$$ plain form
5190 79 -94 -168 81 -43 94 294 -115 66 18 -147 86 -36 -8 -253 69 -85 22 -81 -15 -137 -256 -209
5212 -209 116 -143 141 -32 90 54 -140 -162 -40 -147 -146 78 -112 111 105 81 147 -89 46 302 -140 -63 -27
5235 -27 151 197 36 71 71 -190 120 -156 -72 135 13 -51 -211 152 -206 -206 -74 -59 -92 -22 -141 91 -135 -42
5259 -42 -80 -169 -34 124 47 170 141 -136 -192 -64 -13 113 138 160 -70 30 57 22 -38 154 135 22 -142 89
5283 89 -28 -55 -233 203 -42 100 87 67 228 99 81 47 -91 -193 123 132 -68 -5 -7 -144 -38 11 -10 24 208
5308 208 -68 -2 -4 166 -102 -36 212 57 -131 7 274 259 73 -38 111 24 31 -25 228 51 24 5 -138 54
5332 54 -145 -101 -252 105 21 -121 -39 -72 236 11 -29 -48 -109 -50 -61 8 -19 -71 47 -140 -29 -31 81 40 -16 56
5358 56 -112 15 -45 -30 -73 187 -275 -75 20 -10 316 4 71 348 -78 -40 -90 -103 -62 38 -5 -93 -103 -173 -9
$$ packed form
5190G9j73p4K49j24J37K00m09J81m8j65K33j22K8k45L22j54J07j03O6j22j19M7
5212b09L25k59K84j73J22l6j94k2J22j07JK24j90K23ok4O6k36J35K56m42P7L6
5235b7J78M6j61L5%k61L10k76Q4K07j22o4j60L63l58%J32J5l3P0j19K32k26R3
5259d2l8q9J35J58p7J23k9k77n6J28N1J26K5K2k30J00K7l5o0J92j9j13j64K31
5283H9j17k7j78M36k45J42j3k0J61j29j8l4j38j02L16Rk00O3kj37J06M9k1L4J84
5308B08k76O6kJ70k68O6K48j55j88J38K67j5j86j11J49q7Pn6K53j77k7j9j43J92
5332E4j99M4j51L57q4j42Q2l3L08k25m0j9o1N9j1O9k7n2J18j87J11kJ12m1n6P2
5358E6j68J27o0J5m3K60m62K00R5l0L26l12O7K77m26L8n0j3M1J00m3q8j0p0J64
$$ plain form
5383 -9 -161 -84 134 82 -296 -101 -31 134 95 -117 123 -26 -49 -183 191 61 -119 18 -3 -33 -70 -16 -205 -186
5407 -186 -56 4 2 308 -57 9 112 48 -122 147 -129 -105 -64 -108 -3 62 85 -64 20 37 81 9 -63 -57 -6 37
5433 37 115 -193 146 -153 -77 -12 107 125 -29 89 -52 8 -76 -85 -67 35 -42 -56 -49 -51 -31 -121 98 -174 -143 -146 -66
5460 -66 -56 270 79 -212 -48 -112 -241 -167 -107 -117 125 109 65 -82 105 27 -135 48 -59 -165 -105 117 -37
5483 -37 110 -40 15 -36 -49 57 -32 129 49 117 -45 -111 -25 173 -66 -65 -125 81 254 132 58 -58 -51 220 -67
5508 -67 145 120 38 17 80 -49 -133 3 12 85 -283 175 -170 -172 113 87 -23 157 34 -108 -20 -79 -8 -110 -3
5533 -3 -289 137 97 58 34 -60 86 -68 -37 66 74 9 334 -21 -21 125 -103 -186 -186 -94 -37 -132 144 39 -293 111
5559 111 -111 -8 -36 58 -78 2 -296 113 131 85 -30 -41 76 84 -3 209 200 26 99 5 -40 160 -54 -15 19
$$ packed form
5383ij52P7K18n2l78J95P0J65l9k12K40j49k3j34L74j30j80J37k1l0l7N4j89J9
5407a86J30O0kL06l65O6J03o4j70K69k76K4M1m4J05O5K3j49Q4J7M4p2p2ON1M3
5433C7P8l08L39k99P6O5J19J8j54J18j41O0q4rJ8J02p7j4PkK0r0K19k72L1lQ0
5460f6J0L26j91k91J64o4j29P4O0j0K42j6m4j47J87p8j62J83j07j06O0K22j54
5483c7J47j50N5n1j3J06q9J61q0O8j62o6Q6J98k39Jo0K06J73j22p4j16PK71k87
5508f7K12k5q2k1O3j29q4J36RP3l68M58l45kK85k6j10J80j23j42Q8n9P1j02J07
5533ck86M26m0l9k4r4J46j54L1J03Qo5L25l55%J46k28q3%R2N7r5K76j05l32M04
5559A11k22J03k8R4j36Q0k98M09J8m6j15j1J17Qq7K12rj74P3r4m5K00k14L9L4
$$ plain form
5584 19 249 53 81 -157 27 -1 -230 -44 118 -67 83 13 -9 -40 9 66 166 78 128 38 -23 80 88 -340 -22
5609 -22 64 3 -7 64 19 49 -122 230 -12 -305 -27 18 32 -35 141 -22 172 6 48 -104 244 122 -201 110
5633 110 -40 -327 9 5 289 -53 -164 125 4 -109 -159 17 -63 231 -81 51 136 -175 -32 -61 12 158
5655 158 -119 -79 93 8 -73 17 -79 152 71 -50 68 103 -60 108 252 -53 116 -48 -58 106 -55 4 84
5678 84 35 70 75 141 -112 88 29 166 94 -65 116 114 -7 -74 1 -166 5 85 76 287 109 -139 245 2 -58
5703 -58 -56 -8 7 -31 -97 -7 -35 -267 -80 -165 75 10 -74 135 -100 225 31 88 -129 -133 -199 -4 17 44 57 -88
5729 -88 -8 -147 209 -198 15 142 -21 89 189 -48 110 -155 84 32 -142 35 -1 -113 -2 130 118 14
5751 14 -74 9 -57 82 -49 208 -104 266 -130 -69 14 6 181 -61 -43 -139 14 40 6 61 -15 -248 -55 -145 0
$$ packed form
5584A9K30j96K8k38J84k8k29J86J62j85J50p0k2l1M9N7J00q8N0r0o1J03Qm28L18
5609b2Q6o1j0P1m5L0j71L52k42k93K78M5J4o7J76j63J94j66M2j52L48j22l23L11
5633A10j50k87L36mK84l42j11K89j21j13n0J76q0K94l12J32Q5l11J43k9P3J46
5655A58k77M0J72q5q1R0r6K31q1j21J18L5j63J68J44l05J69j64j0J64j61N9Q0
5678H4m9L5NO6k53K00n9J37p2j59J81kj21o7P5j67J71Q0rK11j78k48L84k43o0
5703e8KM8J5l8o6R0k8k32J87q5K40o5q4K09k35L25j94N7k17mo6J95K1K7J3j45
5729h8Q0j39L56m07K13J27j63J10J00k37J58k65K39n2j74J77l6j12J11J32j2j04
5751A4q8Q3o6J39j31K57l12L70l96O1Q3qJ75k42J8r6J53K6l4N5p6k33J93r0J45
$$ plain form
5776 0 6 -16 281 -138 -57 112 -15 19 153 -33 117 79 -122 -74 -276 -95 24 -90 -238 -115 56 -12 -142
5799 -142 -236 -16 -73 61 -16 -134 -71 18 -31 169 186 17 -41 -19 -107 52 19 -190 -106 101 -52 -74 2 -67 -264
5824 -264 171 71 56 123 -2 -43 59 -37 -16 142 88 -1 62 -102 -298 82 232 13 -123 139 41 4 132
5847 132 175 12 -37 -104 37 95 -65 -70 34 38 -345 -36 86 -10 -22 118 171 -14 -3 109 96 14 -49 -102 -168 144
5873 144 4 137 5 66 -59 -16 -4 88 67 -34 62 86 -20 67 3 27 197 -118 -65 -5 120 22 64 15 6 -255
5899 -255 -77 57 205 43 -85 -129 -12 -49 -349 -94 101 77 68 71 -2 -67 73 -124 -206 75 -45 57 84 23
5923 23 42 121 -63 -116 3 -133 40 6 -67 -101 61 -46 121 264 -247 -22 67 -134 131 66 93 54 -54 193
5947 193 -42 -266 -3 -68 20 181 144 -74 -27 30 55 91 -62 -48 56 244 87 -16 -265 77 -374 -222 -20
$$ packed form
5776@Ok2K97m19Q1J69j27L4J34j86J50l8k01M8k02J81J19j14j48J23J71o8j30
5799a42r4K20n7J34p7j18O3Q9m9K00J7j69n8K2q8J59l3k09Q4K07j53k2P6o9j97
5824b64M35j00j5O7j25m1J02r6K1J58n4q9O3j64j96L80J50k19j36K62r8l7J28
5847A32M3j63m9o7J41N8j60nJ04Ml83L09J22r6j2J40N3j85J1J12j3q2o3n3o6L12
5873A44j40J33j32O1j25M3J2R2k1j01R6K4j06Q7o4K4J70l15N3O0J25r8M2m9rk61
5899b55J78J34J48j62j28m4J17l7l00K55J95k4rLp3o5J40j97q2K81j20J02K7o1
5923B3J9P9j84n3J19j36J73l4p3l4J62j07J67J43n11K25Q9k01K65o5K7l9j08K47
5947A93k35k24K63o5Q8J61l7k18M7N7K5L6j53J4J04J88j57j03k49L42m51J52K02
$$ plain form
5970 -20 -38 -173 -79 78 68 47 73 53 166 -17 -22 -5 87 253 -83 209 -2 63 78 -68 111 39 348 43 42
5995 42 -177 -32 25 -59 -216 -31 -23 30 -58 26 -33 28 43 8 -50 -108 -90 33 77 153 -43 -102 -62 130 -185 -194 -25
6022 -25 -47 -23 -111 105 121 118 113 155 123 7 -153 -97 -55 -148 123 216 -80 123 75 12 -170 -38 -32 66 11 66 48 46
6050 46 26 70 -105 -175 26 -20 45 26 28 284 -226 32 136 162 -84 -7 26 80 -11 -197 156 -13 148 -134 -255
6075 -255 52 -10 -7 20 92 -62 -65 -32 39 -8 249 -117 132 15 -172 0 -357 -135 -140 135 114 -42 102 39 -136
6100 -136 -57 -167 125 -184 -259 -130 42 33 34 25 95 -80 68 35 4 116 -218 -92 -76 -34 57 -39 -3 -96 107 14
6126 14 12 -151 33 18 -72 -121 -54 -20 58 -336 -27 -57 83 -142 60 89 -155 -42 -292 316 -71 63 64 254
6150 254 82 -232 38 -196 85 23 -19 -237 229 37 70 93 99 6 129 -120 24 8 -69 64 145 82 -207 70
$$ packed form
5970b0j8j35R4J57j0k1K6k0J13j83nJ7R2J66l36K92k11O5J5j46J79p2L09l05j
5995D2k19J45N7q4j57J85QN3q8Q4n9O1J5l5n8n8J8J23M4P6j96n9M0J92l15rJ69
6022b5k2K4q8K16J6lnM2l2j16j60N6M2r3K71R3k96K03m8o3j82J32OR8n5N5j8k
6050D6k0M4j75p0K01m6O5j9KK56n10K58J04K6k46P7L3N4r1j86L53j69J61k82j21
6075b55L07o2LK7P2j54lL3P1m7K57l66K49j17j87J72l57K22nK75k1j56J44o3j75
6100a36P9j10K92l09p5J29J72rJrP0j75J48l3l1J12l34J26J6M2R1r6L6r3K03r3
6126A4kj63J84j5r0m9O7L4P8l94L09l0J40k25K02K9k44J13k50O08l87J34JJ90
6150B54j72l14K70k34K81o2m2k18M66j92L3K3Or3J23k49J44j6p7J33Q1o3k89K77
$$ plain form
6174 70 77 -31 -6 64 6 -35 -198 -32 -135 -198 -91 7 -207 -138 19 78 -18 -56 92 -73 -239 -140 -208 -187 51
6199 51 160 224 113 11 23 28 20 -73 -31 61 -18 185 -233 170 184 -52 -171 -18 -5 105 -181 12 115 124 195
6224 195 -26 106 -45 123 -108 79 33 42 -20 -13 268 -105 -117 32 130 5 157 40 30 172 -10 -120 -94
6247 -94 -188 -44 91 49 -126 -256 259 -115 99 -142 47 -165 -59 124 -46 84 52 -81 95 -19 -55 23
6269 23 218 70 3 134 -136 16 38 -29 167 40 -103 124 104 170 87 -158 -169 -89 5 54 -103 -64 122 59
6293 59 -86 100 -89 76 -43 97 46 103 293 -5 52 213 100 -117 82 284 -156 -66 -26 -52 147 53 84
6316 84 -101 92 -126 -12 62 -23 109 -98 161 71 -6 -81 -211 -54 37 34 91 18 22 50 47 -97 53 100 -174 -146
6342 -146 73 136 20 -56 84 -139 -174 75 -112 153 128 59 -56 -57 -24 99 -71 50 68 -173 -137 -23 99
$$ packed form
6174G0Pj08K5P0n8m1j63J66j03o3J07R8k14O9J57N9r6l8J48j65j66R9o8K1K38
6199E1J09O4j11j02J2Nqr3M2R2p9K03m18M03J4k36j19J53J3J10k86J93J03RP1
6224A95k21J32j51J68k31J87m6Ro2PK81l73j2J49R8j25J52j17j0J42j82j10K6
6247i4r4J44J35m2j75j30N15l74K14k41J89k12J06J83j70J30l2j33J76j14l6P8
6269B3J95j48o7J31k70J52K2o7J96j27j43K27k0O6q3k45j1Q0R4M9j57L9J86o3
6293E9j45J86j89J65j19J40n1N7J90k98N7J61j13k17J99K02m40R0M0k6J99r4L1
6316H4j85J93k18J14P4q5J32k07K59r0p7p5j30J57R1lN7p3MK8lj44J50M7k74K8
6342a46K19O3j16p6J40k23l5K49j87K65k5o9j15jL3J23j70J21J8k41L6J14J22
$$ plain form
6365 99 134 52 33 -58 -39 -149 -70 -1 -32 21 173 -274 -47 -18 -167 -16 -82 2 94 16 140 126 73 48 -31 -170
6391 -170 -124 -9 -27 19 279 123 -66 -31 -99 -165 168 -92 56 108 133 137 -5 42 -44 16 -54 -101 64 14 170
6416 170 101 -25 -77 -61 183 -9 108 41 -183 -90 -22 29 -106 130 -184 146 -50 -59 94 252 -26 58 117 -99
6440 -99 -158 -276 -168 -8 1 214 118 28 -111 -43 -73 -99 118 -26 98 -149 71 49 35 -31 -34 -65 -26 32 1 -54
6466 -54 -141 375 -86 179 -79 -209 -195 204 -51 95 77 311 41 -103 9 -3 53 59 -57 33 -88 186 152
6489 152 190 130 -225 58 -143 64 -126 91 92 -55 -22 27 -211 -27 5 -24 187 81 90 -313 109 -279 -99
6512 -99 -181 -46 -102 -154 -107 35 27 -35 25 -75 -247 -86 -14 -38 96 -49 32 -62 240 -100 11 -30 68 -72 -31
6537 -31 65 135 68 138 -33 -206 76 148 -52 9 -1 243 23 67 -4 25 -42 -85 29 -48 -36 102 -55 2 5 -11
$$ packed form
6365I9L5q2j9r1J9j10P9O9l1N3J52m47K27K9j49J51o6Q4R2p8J24j4n3k5p9j39
6391a70M6J15j8M6K60j56j89L5o8o6L33k60J48N2K5Mj42M7q6O0p0m7J65n0J56
6416A70o9j26n2J6K44j92J17o7k24R3O8N1j35K36l14L30j96rJ53J58k78Q4N9k16
6440i9n9j18J08J60RK13r6r0j39O8l0k6K17j44J24k47K20k2j4o6ll1L9N8l1n5
6466e4q7N16m61K65k58j30J4L99k55J46j8K34k70j44J12j2N6Oj16R0j21K74l4
6489A52L8o0l55K83k01K07j90K17Jj47L3M9k38J84L2k9K11j06Rm03M22l88J80
6512i9q2J35n6n2M7J42qo2O0j00j72J61P2k4J34j45Q1r4L02l40J11m1R8j40M1
6537c1R6P0o7P0j71j73K82P2k00O1j0K44k20M4p1K9o7m3J14p7J2J38j57N7Lj6
$$ plain form
6563 -11 79 -186 87 -147 30 -148 339 -129 -192 -280 85 -98 -29 -3 122 -25 -62 37 111 -78 13 -156 -82 -29
6587 -29 83 289 97 -6 38 86 -163 132 -147 42 -208 -14 39 87 -45 203 -42 -251 -43 111 -73 -100
6609 -100 48 86 78 44 21 -87 -189 33 193 -151 -46 -65 83 -223 11 110 -32 -205 -22 117 97 3 167
6632 167 16 -201 174 -28 -13 -24 172 -200 82 90 -44 -22 123 23 53 91 54 89 64 56 21 -46 89 -90 105
6657 105 -86 64 -69 -18 -62 33 -43 -13 84 -129 -50 -84 -49 19 29 40 -9 105 -56 198 -111 67 -232 -34
6681 -34 209 -23 -19 46 77 -291 -216 98 -14 7 153 197 -1 -54 -94 -174 -144 45 331 -133 172 48 72 72 -15
6706 -15 20 -41 17 -21 -82 223 31 103 -38 147 5 -303 -163 -67 -84 58 1 -10 77 112 32 72 -223 100 -65
6731 -65 59 160 61 101 -206 -14 -145 -122 -136 148 -48 58 180 -43 64 -26 -118 75 -68 -20 -128 -223 127
$$ packed form
6563a1R0k65K73k34J77j78M87m68o3q8L65j83O9K6J25j47l7R9P4j89R1j69P4N3
6587b9J12K06j92j03M4M8k49K95k79J89k50J94N3M8j32K48k45k09K08J54j84k7
6609a00J48L8ql4k3j08j02K22J60l44J05j9J48l06K34R9j42j73J83J39k0r4J64
6632A67j51k17L75k02J5j1J96l72K82Qj34K2J45j00L0L8l7L5k5ql5o7J35j79J95
6657A05j91J50j33N1m4R5p6L0R7k13P9l4L5O8J0J1m9J14j61K54l09J78k99J98
6681c4K43k32MO5L1l68P5L14j12K1J46M4j98n3m0q0L0J89K86m64L05j24K4%q7
6706a5L5o1N8l8o1L05j92P2j41J85j42l08J40R6j7J42n7j1Q7L5q0M0k95L23j65
6731f5J24J01r9M0l07J92j31K3j4K84j96J06J22k23J07r0r2J93j43M8j08r5L50
$$ plain form
6754 127 56 -8 -168 51 -114 -70 79 -54 -72 203 156 187 60 -142 -240 -108 -112 -55 91 -125 122 -107 105
6777 105 -64 -112 -100 -3 -78 -89 -12 128 -29 -91 7 -54 88 -62 -66 196 -39 -62 -21 -15 183 -184 -56 -32 153
6802 153 -81 99 -44 -29 20 -80 -3 -7 -94 -92 -44 -140 105 154 -18 48 53 -21 68 3 165 75 150 -29 141 12
6828 12 -105 59 83 -94 -136 135 -123 74 -7 0 7 -55 -178 -211 -186 95 15 288 79 124 -64 59 -47 -73 47
6853 47 -135 54 -36 110 69 158 80 -48 58 -57 118 119 72 49 104 52 -255 -112 -142 -16 -20 -77 0 -84 55 -214
6879 -214 71 -11 144 131 -175 76 7 -326 176 -28 150 -147 53 97 -38 -41 12 -49 74 38 -8 -16 42 5 54
6904 54 155 105 43 -99 24 -123 119 14 -101 -156 42 -75 -129 115 -59 81 -141 -51 50 -131 -28 146
6926 146 227 -4 46 -31 33 118 14 -81 -126 103 -61 -238 213 -32 13 -30 78 -12 77 0 217 126 150 132 201
$$ packed form
6754A27p1o4j60K19j65M4J49j33j8K75m7L1j27k02r8J32mN7J46k16K47k29K12
6777A05j69m8J2R7p5j1P7J40j57o2R8o1J42j50mK62k35k3M1OJ98l67J28K4J85
6802A53k34J80j43J5M9j00P7mq7KM8r6K45M9j72O6Np4Q9o5J62r0P5j79J70j29
6828A2j17J64K4j77m2K71k58J97q1PPo2j23l3K5K81q0K73k09M5j88J23j06k6J20
6853D7j82J89r0J46m1Q9p8j28J06j15J75Jm7k3N5n2l07J43l0J26mn7P7q4J39k69
6879b14K85q2J55j3l06K51o9l33N02k04J78k97K00M4j35lN3o1J23l6m6qN8l7M9
6904E4J01n0o2j42J23j47K42j05j15n5J98j17n4K44j74J40k22R0J01j81J03J74
6926A46Q1k31N0p7O4Q5j04r5m5K29j64j77M51k45M5m3J08r0Q9p7K17r1K4j8O9
$$ plain form
6951 201 136 -217 -90 -27 -21 -158 260 -79 115 -220 5 72 -111 -166 22 188 23 -8 78 4 121 -65 35
6974 35 -38 65 -127 184 72 30 24 -44 134 -189 136 -190 208 62 -27 -76 57 -31 32 -200 93 -244 73
6997 73 -54 22 77 -43 -108 196 -28 134 74 -240 39 -150 -39 7 189 22 -193 -274 -273 84 51 -14 -57 19
7021 19 -82 -59 183 39 173 -115 117 -87 298 -16 150 133 114 79 -123 -169 -105 44 -169 75 -134 48
7043 48 100 -154 -2 -70 2 -2 -126 170 -87 -102 -231 -135 -90 31 -1 169 79 117 151 123 -46 -52 -7 23 171 10
7069 10 -33 61 17 -155 -13 142 184 -132 -140 -255 222 166 48 -44 -78 -84 84 134 -68 132 -105 -128 7 -164 42
7094 42 155 -17 -18 7 83 -87 18 -77 26 123 -166 22 29 -98 -38 144 -85 103 187 190 6 -3 -69 87 172 -179
7120 -179 -49 12 47 -21 -51 22 -202 285 -51 -31 2 77 -163 -14 82 167 -45 -227 -149 -162 207 -74 35 -13
$$ packed form
6951B01o5l53J27O3Oj37M18l39J94l35K25O7j83n5J88J66j65l1Q6p4J17j86J00
6974C5p3J03j92L11j12m2oo8J78l23L25l26L98j46q9m9J33q8O3k32K93l37L17
6997G3j27P6N5j20o5L04k24J62o0l14K79j89J11M6J82j67k15q1JL57l3o5m3P6
7021A9j01K3K42j44J34k88K32k04L85l14J66j7j9l5k02m6O4J49k13K44k09J82
7043D8N2k54J52o8P2mj24K96k57j5j29R6M5J21l2J70r0L8L4k8j69oM5L0J48j61
7069A0m3R4m4j72J42J55M2l16qj15M77n6j18r2l4oJ68N0k02K00k37k3J35j71K06
7094D2J13j72jK5P6j70J05r5J03R7k89J88Pj27O0J82k29J88Q4Lj84ro6J56Q5l51
7120a79J30O1L5o8l0P3k24M87l36K0L3P5k40J49R6Q5k12j82P8j3L69k81J09m8
$$ plain form
7144 -13 6 -101 -97 68 -6 345 30 117 242 -10 -94 -94 -58 -28 -25 -133 -66 79 -20 14 44 129 -127 -42 -98 61 -202
7171 -202 176 -15 65 -120 52 42 -64 -290 -67 144 114 -52 -49 271 -15 -48 77 -8 96 -166 -182 -227 185
7194 185 36 -19 -228 -143 130 97 114 196 125 112 44 132 -136 17 -267 -62 -186 -274 15 -188 -12 -115 -77 -5
7218 -5 115 38 8 -52 -264 113 -40 26 39 6 -72 -51 -82 -27 59 229 -87 -14 286 -120 -62 0 -67 184 -1 37
7244 37 85 107 -45 -57 56 -7 41 -185 -40 -92 37 114 108 4 45 23 -62 108 -239 -151 51 2 39 155 149 -51
7270 -51 -20 -81 38 36 -142 -12 -29 -9 -38 81 76 144 -38 320 110 -94 -198 69 195 -244 -119 -141 122 22
7294 22 -105 -29 -133 -183 -112 -127 85 -180 105 -25 -12 14 -50 172 -42 45 130 -63 -17 91 2 32 22 -65 168
7319 168 96 -70 45 -22 -253 -111 -47 18 159 -53 -217 -79 -132 -49 -15 -88 44 -5 36 -26 -41 138 -62 -80
$$ packed form
7144a3J9j07MJ65p4L51l15Q7J25k52q4%L6L0Lj08O7J45r9L4L0Q5k56Q5n6J59k63
7171b02L78j91Q0j85J72j0j06k26K23K11l0j66LL20k86l3J25q5J04k62j6m5M12
7194A85j49n5k09Q5K73l3J7Q2p1j3o8Q8k68J53k84K05j24q8K89k03J76j03L8P2
7218eJ20p7l0o0k12L77j53O6J3l3p8K1l1N5Q6J70l16P3L00m06N8O2o7K51j85L8
7244C7M8K2j52j2J13o3M8k26J45n2J29P7oj04M1k2q5J70l47Q8K02m9L7J16ok00
7270e1L1o1J19kj78J30j7K0k9J19nO8j82L58k10k04j04K67J26m39J25k2K63j00
7294B2j27P6j04n0P1j5K12k65K85j30J3K6o4K22k14Q7Q5j93M6J08q9L0j0q7K33
7319A68p2j66J15o7k31J42O4O5J41k12j64J38n3Q3L4p3J32m9M1o2j5J79k00j8
$$ plain form
7343 -80 -18 41 -73 125 51 127 -69 -262 79 -30 -198 -120 -54 11 1 126 -122 104 -11 -37 138 15 162
7366 162 -75 -91 75 115 -61 -224 164 -108 249 16 63 -1 66 -45 41 -47 138 -246 -305 -44 -110 61 152
7389 152 -86 123 128 -78 36 90 60 -60 77 80 -188 192 -137 -143 23 -32 113 -84 -4 20 165 48 3 -13
7413 -13 148 6 -22 -179 54 92 -149 147 -15 -99 114 48 -195 -112 -172 80 120 -112 -9 -187 94 128 70
7436 70 -16 235 64 153 89 -137 -14 3 287 137 -62 -72 -14 161 -5 -77 -83 207 -206 10 -17 -7 -133 -65
7460 -65 58 111 -326 102 11 181 9 -17 -135 -1 485 -87 -47 139 -248 30 51 118 65 -100 35 -128 -45
7483 -45 -128 111 -46 39 -49 -167 -13 28 68 149 -36 -35 57 101 -194 -273 37 138 -12 133 69 105 -8 -295 41
7508 41 84 -108 -266 154 -34 -122 44 -150 176 24 -105 -59 -191 -14 -44 195 97 4 -41 202 68 -73 18
$$ packed form
7343h0O2N9j14J98p4P6j96j93L41j09j68P8O6O5j0J25k48K26j15k6J75j23J47
7366A62k37j6J66M0j76j63L88k72L57k33M7o4O7j11Q6q8J85l84n9K61o6J71R1
7389A52k38K09Nk06J14N4l0j20J37Lk68L80l29oJ66n5J45j97Q0K4J45j17m5j6
7413a3J61j42k8j57K33L8k41K96j62q4K13o6k43Q3o0K52M0k32J03j78K81L4n8
7436G0q6K51j71Q9o4k26J23J7K84j50j99j0N8J75j66p2oK90m13K16k7J0j26O8
7460f5J23N3m37M28r1J70j72k6j18J34M86n72M0J86l87K78K1O7n3j65J35j63Q3
7483d5q3K39j57Q5q8j18J54M1M0Q1j85JR2M4k95p9L10J01j50J45o4L6j13k87L36
7508D1M3j92j58M20j88q8J66j94L26j52j29M6j32J77l0K39r8r3m5K43j34j41R1
$$ plain form
7531 18 -48 127 154 -29 -43 -26 -39 109 150 142 -72 36 103 -29 -13 -55 -6 -395 43 162 81 40 204 7 -42
7556 -42 -128 -19 -134 36 -125 44 27 98 129 -45 -38 185 90 -64 -199 18 -52 -6 94 61 -127 58 -199 -87
7580 -87 165 -35 -78 -47 220 -20 37 -64 12 26 33 43 -25 309 -210 85 308 -78 -31 -56 -230 45 -136 87
7604 87 201 101 107 33 -20 101 -159 116 67 18 60 -120 -240 56 234 91 110 75 99 182 111 -74 -116 -28 -164
7629 -164 74 43 -193 71 -11 50 -42 -142 -60 110 15 -103 -106 23 -53 111 258 84 -59 7 129 36 38 180
7653 180 -47 183 -102 -33 -88 -132 -179 87 -70 163 -25 155 107 128 135 24 -78 -110 -96 -76 -245 -257 109 -79
7677 -79 -59 54 -102 -87 43 37 -107 -104 -105 79 70 -79 -160 -124 -15 -47 -17 -115 55 -23 21 125 -252 -67 62 -97
7703 -97 87 -35 -27 -72 -29 105 108 54 -34 -54 143 -113 -48 145 -36 -10 175 37 151 -4 -36 -52 70 6 10 -142
$$ packed form
7531A8o6J75K7j83j4J7j3J48M1qk14J08O7j32J6m2M9l89M38J19q1m1J64j97m9
7556d2q6J09j15J70j61J69j7P1L1j74PK23r5j54j35K17p0M6J00l3j88J85k57J12
7580h7K52k00m3L1K67k40N7j01P6J4PJ0o8L34n19K95K23l86M7k5j74K75j81K23
7604H7J14j00Op4n3J21k60K75m9m9M2j80j20K96J78j43J9l5K4Q3p1j85m2Q8j36
7629a64K38l1k36K64q2O1r2j00Q2J70r5j18lJ29p6J64J47j74j43O6J22r3KJ42
7653A80k27K30k85O9n5m4m7K66j57K33j88J80m8K1Pj11j02l2J4K0j69j2L66j88
7677g9K0J13j56J5J30oj44LjJ84rj49q1L6J09l2L0r8J70p8M4J04l77J85J29j59
7703i7J84j22Qm5M3J34Ln4q8k0J97k56O5J93j81K6J85j38J14j55l2j6J22o4Mj52
$$ plain form
7729 -142 134 63 -29 -71 -19 100 -185 116 90 31 37 -23 22 -125 -6 -46 53 1 54 2 -95 -104 -65 -57 -93 80 -98
7756 -98 -51 76 177 -133 -31 96 7 -12 101 -217 -56 151 -71 -89 -75 215 143 -44 -104 -150 -50 95 -17
7779 -17 192 8 62 -106 101 0 -45 -57 -45 -142 -97 -51 140 90 136 109 -126 -65 65 9 -103 -119 -170 -161 -251 111
7805 111 148 84 60 26 -230 -19 31 55 7 -185 43 -132 38 -107 217 -2 106 -105 183 41 -41 -10 129
7828 129 28 -36 -79 -76 -93 11 -20 -132 -97 27 31 -26 -11 62 5 11 179 -121 21 112 187 -231 48 -89 39 205
7854 205 22 22 -60 -65 -101 -41 -114 -87 -47 21 -66 61 163 -96 -13 83 67 -38 -3 11 21 -128 -122 -69 -189 15 125
7881 125 -48 -47 -49 -7 -4 -19 -155 -269 -173 81 37 88 82 22 -194 61 24 -85 108 -112 80 -20 41 -105 -134 68
7907 68 -40 -205 -83 -79 120 -78 -176 91 163 -71 -111 -21 221 -218 92 -212 10 -135 32 -126 -112 -247 -78
$$ packed form
7729a42K76p1r2m2N2J19k85L01k6n9Oo0M5j47J19m0R9n2N3n2r7rL9Ql6J73j78
7756i8M7J27J01l10J02J27q9j9J13l18J61K07k22j8J4K90p2j87o0m6J00J45j12
7779a7K09j84N4j68K07j01m5j2J2r7M5M6J91n0M6k7k35O1J30n6j12j6n1Rr0L62
7805A11L7o4k4l4k56K11N0K4m8j92K28j75J70j45L24k19J08k11K88j42q2L1J39
7828A29j01o4m3Lj7J04l1j12L5J24Mn7J5P3n7OJ68l00J42R1P5m18K79j37J28J66
7854B05j83%q2nl6O0p3K7M0O8q7J27J02k59Q3R6j6j05L5J4J0j49ON3j20K04J10
7881A25j73JkM2Lj5j36j14R6K54m4N1oo0k16K55l7j09J93k20J92j00O1j46k9K02
7907F8j08j65J22MJ99j98r8K67P2k34m0R0K42m39L10l04K22j45J67j58J4j35J69
$$ plain form
7930 -78 -4 -163 43 -239 96 45 99 -17 -36 -20 -47 -55 -105 -10 -110 -148 -62 -125 193 103 125 -24 235 146 -80 217
7956 217 149 -59 -143 -42 11 -183 -62 11 2 74 215 -7 40 82 236 0 49 64 -82 -145 58 77 78 13 -257
7981 -257 175 25 -63 -53 123 114 -38 -161 170 -185 -33 82 327 126 121 14 -119 -28 -190 -233 90 -197 -36
8004 -36 -4 178 -50 79 -14 88 -54 47 99 88 59 -46 -382 -208 -51 -128 -50 77 64 22 135 -7 -71 -114
8028 -114 -359 -46 -97 140 154 162 35 121 163 -14 41 -119 -75 -4 -2 -10 -80 128 172 -40 -86 -10 46 81 -113 332
8054 332 -5 -122 151 360 203 -54 4 -49 23 -180 45 16 81 -15 151 57 -102 -137 58 -86 38 33 47 28
8078 28 -100 -39 -41 -115 -100 146 11 189 273 -17 8 -12 -87 -80 39 -55 116 1 -70 22 18 96 -137 33 -83 45
8104 45 158 82 -82 30 191 19 28 26 207 40 149 0 -152 151 -194 -127 184 -19 -261 -32 -145 -15
$$ packed form
7930g8P4j59K06k82L35n1N4j16j9J6k7qn0R5j00l8Q6o3L18r0K2j49K59q9k26K97
7956B17o8k08q4J01N3j94J21P3rP2J41k22M7M2J54k36M9J5j46o3K03J9Jo5k70
7981b57M32j50q8J0J76rj52j23L31l55J52J15K45k01nj07j33R1j62m3L23k87J61
8004c6L2J82k28J29r3J02j42J01N2j1k9j05l36J74J57p7P8J27j3m2J13j42o4m3
8028a14k45L13n1K37J4Qj27Q6M2j77N5j60M4P1Kqp0K08M4k12m6P6N6L5j94M45
8054C32l37j17K73K09j57k57N8n3P2k03K25k9O5r6J66r4j59l5J95j44J24nJ4j9
8078B8j28O1kp4J5K46j35J78Q4k90K5k0p5PJ19r4J71j15p1R2mP8k33J70j16J28
8104D5J13p6j64J12J61j72RkJ81j67J09j49j52L03l45O7L11k03k42K29j13J30
$$ plain form
8126 -15 309 53 -141 37 2 333 -68 -72 151 -25 -46 11 4 -5 -132 -84 -121 -38 -33 75 -174 -35 180 37 -195
8151 -195 78 -195 -61 7 -150 1 237 53 10 212 202 28 -100 61 47 220 11 -96 71 25 38 -97
8173 -97 -18 51 115 66 -108 37 -191 -42 -39 -108 64 -292 -209 161 123 -15 1 -61
$$ packed form
8126a5L24k56j94J78l5L31m01mK23j76k1N7prj27M8l7Q3NJ08k49J39K15j43k32
8151a95K73k73J34O8j57J51K36j84m3K02j0j74j28J61j4J73k09j07J67m6J3j35
8173i7P9O9O4m9j74J45k28J49Lo9J72l56Q3L70l8j38J6o2
8191f1
$$ Imaginary data points
##PAGE= N=2
##DATA TABLE= (X++(I..I)), XYDATA
$$ plain form
0 0 0 0 0 0 0 0 0 0 0 0 0 -8 8 -8 8 -8 16 -16 24 -24 32 -39 40 -49 58 -71 80 -95 107 -122 142 -161 183 -208
34 -208 234 -264 297 -331 369 -413 459 -512 568 -629 695 -767 847 -933 1030 -1134 1249 -1377
52 -1377 1518 -1674 1849 -2049 2273 -2531 2832 -3186 3612 -4135 4792 -5650 6817 -8514 11219
67 11219 -16201 28473 -126829 -104487 107807 -26490 31986 185739 132315 -13861 -368
78 -368 -70272 -159745 -84047 12690 -2144 78772 154496 75504 20905 29971 -116541 -209614 -59952
91 -59952 18753 -67316 33400 204917 123718 246 26630 -39163 -153088 -81296 -4490
102 -4490 -50548 31188 174028 105007 -5817 18439 -35348 -152857 -106228 -29017 -52039 26236
114 26236 163591 116889 24526 44902 -5735 -118927 -93790 -42193 -63832 22993 146566
$$ packed form
0@%%%%%%%%%%%qJ6j6J6j6K4l2M0m8N6p1P9q9J07j29J51j75K02k29K64l03L44l91
34b08M42m98N61o28P00p82Q72r71J080j197J324j462J614j780J963k164K383k626
52a377K895l192L523l898M322m804N363o018O798p747Q927j0442J2467j5331J9733
67A1219k7420M4674j55302K2342K12294j34297N8476J53753n3424j46176J3493
78c68o9904q9473P5698R6737j4834Q0916P5724p8992n4599R066j46512r3073J49662
91e9952P8705q6069J00716J71517q1199j23472K6384o5793j13925P1792P6806
102d490m6058Q1736J42840o9021j10824K4256n3787j17509M6629P7211k3022P8275
114B6236J37355m6702r2363K0376n0637j13192K5137N1597k1639Q6825J23573
$$ plain form
125 146566 80353 1195 58902 10546 -142447 -120861 -26153 -49068 -9973 123562 115468 36892
137 36892 61871 32429 -96205 -109902 -46968 -53978 -14867 88449 80941 34493 68039 22626
149 22626 -107843 -102270 -31419 -60601 -38097 87694 105743 48547 73700 52409 -71373 -96301
161 -96301 -41025 -65457 -57229 53337 84420 40487 62454 47725 -61474 -85939 -38820 -66495
173 -66495 -59683 53309 91910 50267 74159 71647 -35048 -77666 -43493 -73356 -78598 22170
185 22170 67776 35785 63402 72158 -21455 -67391 -38460 -65716 -75422 18084 70592 45965
197 45965 71933 86483 -327 -57791 -42559 -71647 -90150 -11717 43078 32047 63139 84633
209 84633 11058 -42231 -31079 -61672 -85385 -13222 44761 36821 66893 94345 27330 -34799
$$ packed form
125A46566o6213p9158N7707m8356j52993K1586R4708k2915L9095J33535q094p8576
137C6892K4979k9442j28634j3697O2934p010L9111J03316p508m6448L3546m5413
149B2626j30469N573P0851k9182K2504J25791J8049n7196K5153k1291j23782k4928
161i6301N5276k4432Q228J10566L1083m3933K1967j4729j09199k4465M7119k7675
173f6495O812J12992L8601m1643K3892k512j06695m2618L4173k9863n242J00768
185B2170M5606l1991K7617Q756r3613m5936K8931k7256r706R3506N2508k4627
197D5965K5968J4550q6810n7464J5232k9088j8503P8433N4795j1031L1092K1494
209H4633p3575n3289J1152l0593k3713P2163N7983p940L0072K7452o7015o2129
$$ plain form
221 -34799 -33990 -65134 -97919 -40234 20622 24217 54964 90268 41378 -16239 -22500 -52877 -85632
234 -85632 -40227 16291 27493 59578 90985 47528 -6131 -21386 -61151 -97907 -55835 -3640
246 -3640 7153 47442 94845 60348 3253 -7196 -36303 -84780 -63758 -5517 17544 42210
258 42210 80481 68686 20273 -13794 -50385 -83680 -69790 -33314 -4972 42610 84689 67174
270 67174 30318 13164 -28251 -79857 -68865 -24339 -5029 25770 75991 77001 32870 1641
282 1641 -29279 -73236 -82115 -48392 -12516 25001 66414 77638 54028 22112 -18678 -59611
294 -59611 -68620 -49666 -23177 18269 61481 68596 48843 24478 -15631 -64129 -77436 -55514
306 -55514 -29311 5830 54283 78688 62873 32754 -573 -40336 -68424 -63957 -33741 4610
$$ packed form
221c4799Q09l1144l2785N7685O0856L595L0747L5304m8890n7617o261l0377l2755
234h5632M5405N6518J1202L2085L1407m3457n3659j5255l9765l6756M2072N2195
246c640J0793M0289M7403l4497n7095j0449k9107m8477K1022N8241K3061K4666
258D2210L8271j1795m8413l4067l6591l3295J3890L6476K8342M7582M2079j7515
270F7174l6856j7154m1415n1606J0992M4526J9310L0799N0221J010m4131l1229
282A641l0920m3957q879L3723L5876L7517M1413J1224k3610l1916m0790m0933
294e9611r009J8954K6489M1446M3212P115j9753k4365m0109m8498j3307K1922
306e5514K6203L5141M8453K4405j5815l0119l3327l9763k8088M467L0216L8351
$$ plain form
318 4610 39041 61234 62107 37310 -5163 -44657 -65151 -64828 -43407 -4609 38556 66607 68820
331 68820 46736 12093 -25013 -57041 -68127 -46780 -10054 21599 49488 64627 47778 8990
343 8990 -25253 -51549 -66069 -51490 -15932 19188 51439 70488 55156 21643 -7139 -40533
355 -40533 -68451 -56358 -20573 4543 31309 61848 56162 19904 -7555 -32986 -60889 -57600
367 -57600 -25375 2438 32886 64223 60658 30257 8123 -22419 -61712 -61663 -29935 -11416 12688
380 12688 53917 59517 28491 8560 -12511 -51629 -59911 -31433 -11592 11848 53501 62654 35749
393 35749 20071 -2800 -49481 -62662 -36377 -23984 -6071 41621 59086 33614 21854 7738
405 7738 -38558 -58683 -34371 -22174 -8500 38061 60641 38706 28539 15408 -34061 -59788
$$ packed form
318D610L4431K2193Q73k4797m2473l9494k0494L23K1421L8798M3165K8051K213
331F8820k2084l4643l7106l2028j1086K1347L6726L1653K7889J5139j6849l8788
343H990l4243k6296j4520J4579L5558L5120L2251J9049j5332l3513k8782l3394
355d0533k7918J2093L5785K5116K6766L0539n686l6258k7459k5431k7903L289
367e7600L2225K7813L0448L1337l565l0401k2134l0542l9293M9L1728J8519K4104
380A2688M1229N600l1026j9931k1071l9118q282K8478J9841K3440M1653R153k6905
393C5749j5678k2871m6681j3181K6285J2393J7913M7692J7465k5472j1760j4116
405G738m6296k0125K4312J2197J3674M6561K2580k1935j0167j3131m9469k5727
$$ plain form
417 -59788 -39631 -32254 -23182 25780 54974 36655 30961 25551 -22577 -53349 -34726 -29149 -26493
430 -26493 20765 55200 38748 32847 31125 -16288 -53386 -39849 -36643 -38450 8294 48364 37267
443 37267 34863 39405 -4667 -43878 -33482 -34134 -40643 4888 46257 33598 34253 45694 469
456 469 -46343 -35366 -35307 -51677 -10179 41000 34914 32438 50044 16394 -33017 -32891 -34275 -47535
470 -47535 -12060 31634 28624 35381 54471 14519 -34579 -27936 -32961 -60251 -25139 31169 28036
483 28036 28037 58070 32900 -23205 -27463 -27062 -52960 -31006 19147 24720 29178 55742 30801 -20474
497 -20474 -22884 -27862 -59980 -38022 17206 21976 24003 57936 43122 -9084 -17964 -23315 -55826
510 -55826 -39777 9319 12022 18964 59577 44468 -12786 -16415 -14425 -57197 -52662 5772 18409
$$ packed form
417e9788K0157P377R072M8962K9194j8319n694n410m8128l0772J8623N577K656
430b6493M7258L4435j6452n901j722m7413l7098J3537L206j807M6744M0070j1097
443C7267k404M542m4072l9211J0396o52o509M5531M1369j2659O55J1441m5225
456D69m6812J0977N9j6370M1498N1179o086k476J7606l3650m9411J26j384j3260
470d7535L5475M3694l010O757J9090l9952m9098O643n025k7290L5112N6308l133
483B8036JL0033k5170n6105m258M01k5898K1954N0153N573M458K6564k4941n1275
497b0474k410m978l2118K1958N5228M770K027L3933j4814n2206q880n351l2511
510e5826J6049M9096K703O942M0613j5109n7254l629J990m2772M535N8434J2637
$$ plain form
523 18409 13898 51221 55915 5812 -15304 -17522 -45359 -45549 -10033 1218 16918 56864 45041
536 45041 -2885 -2172 -2795 -55084 -59959 -2585 10058 2658 46455 62104 12152 -8739 -2038
549 -2038 -36674 -57855 -21762 1959 8820 39979 46077 13735 8276 3131 -46450 -59472 -11832
562 -11832 1939 -5623 35364 59023 21580 4808 6860 -34827 -58657 -21053 -3298 -9253 26312
575 26312 52536 24263 10189 9553 -32302 -55127 -17958 -5042 -17257 20845 58796 32265
587 32265 8590 9407 -21914 -48139 -25859 -15746 -20719 18709 52817 27646 10713 17143 -15137
600 -15137 -46396 -25098 -14841 -24559 13568 53934 29994 9136 21038 -3705 -42591 -33883
612 -33883 -20684 -24247 8613 44019 26246 13882 27823 1117 -40790 -31775 -17593 -25294 2526
$$ packed form
523A8409m511L7323M694n0103k1116k218k7837j90L5516J1251J5700L9946j1823
536D5041m7926P13o23n2289m875N7374J2643p400M3797J5649m9952k0891O701
549b038l4636k1181L6093K3721O861L1159O098l2342n459n145m9581j3022M7640
562a1832J3771p562M0987K3659l7443j6772K052m1687k3830L7604J7755n955L5565
575B6312K6224k8273j4074o36m1855k2825L7169J2916j2215L8102L7951k6531
587C2265k3675Q17l1321k6225K2280J0113m973L9428L4108k5171j6933O430l2280
600a5137l1259K1298J0257r718L8127M0366k3940k0858J1902k4743l8886Q708
612c3883J3199l563L2860L5406j7773j2364J3941k6706m1907R015J4182p701K7820
$$ plain form
625 2526 39777 26493 15617 31317 6606 -38708 -34051 -18311 -27228 -6417 30825 26909 19550
638 19550 33911 10162 -33523 -29501 -15741 -28477 -12694 26564 27853 20235 33059 13314 -27746
651 -27746 -28015 -17296 -32298 -19855 20200 27093 20910 33193 18399 -19936 -23117 -16172 -33576
664 -33576 -23604 17147 25649 18206 31578 22835 -14079 -22484 -17366 -33989 -27086 11236 22468
677 22468 17234 31933 27471 -6823 -17704 -16485 -33547 -28633 6842 18158 14331 31676 30859
690 30859 -3309 -16938 -14829 -32106 -32223 746 15530 13109 30328 33595 3840 -13268 -13439
703 -13439 -29035 -32666 -5396 10637 12218 28597 32871 6858 -8438 -11417 -29077 -33868 -8266
716 -8266 6612 8963 27965 35756 10382 -5962 -7160 -24859 -35727 -13927 4553 7087 22897
$$ packed form
625B526L7251j3284j0876J5700k4711m5314M657J5740q917K0811L7242l916p359
638A9550J4361k3749m3685M022J3760j2736J5783L9258J289p618J2824j9745m1060
651b7746k69J0719j5002J2443M0055O893o183J2283j4794l8335l181O945j7404
664c3576R972M0751Q502p443J3372q743l6914q405N118j6623O903L8322J1232
677B2468n234J4699m462l4294j0881J219j7062M914L5475J1316l827J7345q17
690C0859l4168j3629K109j7277j17L2969J4784k421J7219L267k9755j7108j71
703a3439j5596l631K7270J6033J581J6379M274k6013j5296k979j7660m791K5602
716h266J4878K351J9002P791k5374j6344j198j7699j0868K1800J8480K534J5810
$$ plain form
729 22897 33988 15844 -1926 -7194 -22835 -33091 -16856 -1017 5432 23116 33364 17567
741 17567 3039 -2509 -21087 -33533 -18640 -3729 891 18291 32681 20279 4677 -547 -16553
754 -16553 -31719 -21845 -6772 -115 15203 30413 23389 9553 1317 -13828 -28562 -23398 -11407
767 -11407 -3047 12951 27150 22909 12344 5168 -11306 -27215 -23509 -12809 -6172 8930 25977
780 25977 24888 14082 6875 -6739 -23637 -25112 -16134 -7770 5983 21344 23988 17193 9493 -4896
794 -4896 -20305 -23464 -17608 -10783 2906 19123 23924 18695 11582 -1103 -16887 -23387 -20011 -12462
808 -12462 57 14392 22032 20765 13883 1117 -13440 -20932 -20383 -14861 -2885 12143 21019 20559
822 20559 14976 4298 -9600 -20050 -21667 -15765 -4975 7644 18071 21929 17012 5971 -6479
$$ packed form
729B2897J1091j8144j7770n268j5641j0256J6235J5839O449J7684J0248j5797
741A7567j4528n548j8578j2446J4893J4911M620J7400J4390j2402j5602n224j6006
754a6553j5166R874J5073O657J5318J5210p024j3836q236j5145j4734N164J1991
767a1407Q360J5998J4199m241j0565p176j6474j5909L706J0700O637J5102J7047
780B5977j089j0806p207j3614j6898j475Q978Q364J3753J5361K644o795p700j4389
794d896j5409l159N856O825J3689J6217M801n229p113j2685j5784o500L376P549
808a2462J2519J4335P640j267o882j2766j4557p492N49N522J1976J5028Q876m60
822B0559n583j0678j3898j0450j617N902J0790J2619J0427L858m917j1041j2450
$$ plain form
835 -6479 -16708 -21458 -17732 -7432 5021 15885 21231 17773 8579 -2988 -14676 -21489 -18146 -9274
849 -9274 855 13107 21227 18783 9434 464 -11262 -20646 -19010 -10601 -1604 9651 19877 19194
863 19194 11285 3468 -8332 -19639 -19304 -11847 -4859 6602 19070 19488 12211 6248 -4861 -18035
877 -18035 -19338 -12711 -7291 3364 17261 19212 13195 8583 -1932 -16378 -19042 -13256 -9527 185
891 185 15449 19155 13234 10556 1443 -14214 -18747 -13406 -11261 -3145 13249 18310 13226 12004 4693
906 4693 -11790 -17887 -13478 -12788 -6102 10676 17338 13125 13481 7502 -9590 -16736 -12858 -13815 -8828
921 -8828 8439 15986 12462 14096 10117 -7010 -15274 -11908 -14253 -11463 5636 14981 11477 14462
935 14462 12630 -4457 -14247 -11412 -14408 -13605 2987 13306 10874 14449 14610 -1847 -12310 -10035
$$ packed form
835f479j0229m750L726J0300J2453J0864N346l458r194j1567j1688o813L343Q872
849i274J0129J2252Q120k444r349q970j1726r384J636Q409Q997J1255J0226o83
863A9194p909p817j1800j1307L35P457O988J1461J2468M18p277n963j1109j3174
877a8035j303O627N420J0655J3897J951o017m612j0515j4446k664N786L729R712
891A85J5264L706n921k678r113j5657m533N341K145Q116J6394N061n084j222p311
906D693j6483o097M409O90O686J6778O662m213L56n979j7092p146L878r57M987
921h828J7267P547l524J634l979j7127q264L366k345K790J7099R345l504K985
935A4462j832j7087r790K835k996Q03J6592J0319k432L575J61j6457j0463K275
$$ plain form
949 -10035 -14252 -15798 764 11823 9413 13890 16572 1097 -10808 -9270 -13680 -16782 -2124 9624
963 9624 8197 13644 17582 3040 -9106 -7314 -13096 -18284 -3842 8351 6306 12096 19101 5736
977 5736 -7604 -6186 -11132 -18470 -7028 5602 5347 11443 19077 7187 -5432 -4400 -10235 -19146
991 -19146 -8243 4654 3663 9712 19240 8982 -4001 -2548 -8046 -19433 -10747 3206 2704 7623
1005 7623 18753 10724 -1868 -1123 -6790 -19166 -11779 1568 1302 6040 17792 12126 -97 123
1019 123 -5840 -18444 -12323 278 -959 4055 17485 13379 784 1659 -3292 -17014 -13597 -1167
1033 -1167 -1975 1659 16212 14349 2306 2199 -1456 -15354 -14305 -2805 -3071 86 14952 14269 3266
1048 3266 3623 687 -13702 -14309 -3676 -4160 -1541 12930 14401 4141 4666 2208 -12408 -14617 -4483
$$ packed form
949a0035m217j546J6562J1059k410M477K682j5475j1905J538m410l102J4658J1748
963I624j427N447L938j4542j2146J792n782n188J4442J2193k045N790P005j3365
977E736j3340J418m946p338J1442J2630k55O096P634j1890j2619J032n835q911
991a9146J0903J2897r91O049R528j0258j2983J453n498j1387Q686J3953n02M919
1005G623J1130q029j2592P45n667j2376P387J3347k66M738J1752n666j2223K20
1019A23n963j2604O121J2601j237N014J3430m106j2595Q75m951j3722L417J2430
1033a167q08L634J4553j863j2043j07l655j3898J049J1500k66L157J4866o83j1003
1048C266L57k936j4389o07J0633m84K619J4471J471j0260N25k458j4616k209J0134
$$ plain form
1063 -4483 -4960 -3803 11363 14730 5074 5331 4385 -9965 -14008 -4832 -5615 -5189 9121 14050 5321
1078 5321 5817 5304 -8500 -13181 -5607 -6643 -6733 7362 13676 5962 6049 7140 -5869 -12247 -5917 -6799
1094 -6799 -7783 5561 12431 5478 6042 8354 -3855 -11536 -6497 -7073 -8779 3587 11386 5418 6460
1109 6460 9570 -1502 -10606 -6528 -6671 -9000 1566 9433 5234 6681 10331 -205 -9858 -5863
1123 -5863 -6313 -9754 -547 8258 5168 6689 11296 1517 -8398 -5478 -5738 -10242 -2808 6331 5265
1138 5265 6423 10761 2301 -6646 -4433 -5466 -10934 -3856 5662 4493 5972 11001 4233 -5434 -3523
1153 -3523 -4664 -11111 -6034 4359 4407 4642 9676 5806 -2886 -3394 -4935 -9951 -5786 2205 3225 4985
1169 4985 9996 6078 -1639 -1863 -4113 -11176 -7003 1957 1519 2645 9983 8322 -1443 -2611 -2290 -8938
$$ packed form
1063d483m77J157J5166L367r656K57r46j4350m043R176p83M26J4310M929q729
1078E321M96n13j3804m681P574j036r0J4095O314p714Q7J091j3009o378O330q82
1094f799r84J3344O870o953N64K312j2209p681N039n76j706J2366P799n968J042
1109F460L110j1072r104M078j43k329J0566P867m199J447L650j0536r653L995
1123e863m50l441R207Q805l090J521M607r779r915K920k60m504P434R139j066
1138E265J158M338q460q947K213j033n468P078R518j169J479N029o768r667J911
1153c523j141o447N077J0393M8K35N034l870q692n08j541n016M165P991J020J760
1169D985N011l918p717k24k250p063M173Q960m38J126P338j661r765j168L21o648
$$ plain form
1185 -8938 -8403 183 2367 2790 8192 8277 1314 -1566 -3286 -8452 -7545 -2019 -587 2384 8904 7579
1201 7579 941 693 -605 -8712 -8484 -848 166 -117 7679 9554 2195 -529 -178 -6193 -9564 -3540
1217 -3540 -166 829 5197 7900 4582 1639 -895 -5773 -7032 -3463 -2365 -63 6413 7749 2820
1232 2820 2456 1424 -6157 -8678 -3371 -1612 -2559 4088 8824 4627 1428 1815 -2587 -7280 -5267 -2568
1248 -2568 -817 3089 6203 4757 3391 1073 -3620 -6163 -4378 -4250 -2795 3198 6603 4139 3437
1263 3437 3477 -1684 -6162 -4727 -3107 -2641 1128 5196 4892 3591 2549 -1266 -4882 -4956 -4084 -3120 706
1280 706 4315 4552 4115 3635 269 -3795 -4314 -3794 -3095 -333 3212 4090 3676 3345 121 -3278 -4007 -4219
1298 -4219 -4094 -753 2952 4086 3938 3944 1660 -1981 -3848 -3734 -3414 -1883 1042 3283 3860 3122 1535
$$ packed form
1185h938N35Q586K184M23N402Q5o963k880j720n166R07N526J432K971O520j325
1201G579o638k48j298q107K28P636J014k83P796J875p359k724L51o015l371O024
1217c540L374R95M368K703l318k943k534m878j259L569J098K302O476J336m929
1232B820l64j032p581k521N307J759r47O647M736m197l199L87m402m693K013K699
1248b568J751L906L114j446j366k318m693k543J785J28J455N993L405k464p02
1263C437M0n161m478J435J620M66L769M068l04j301j042l815l616p4Q72R64L826
1280G06L609K37m37m80l366m064n19N20O99K762L545Q78m14l31l224l399p29k12
1298d219J25L341L705J134j48Ok284l641j867J14L20J531K925K241N77p38j587
$$ plain form
1315 1535 -1264 -3041 -3862 -3808 -1791 977 2960 3638 3871 2449 -291 -2509 -3434 -3634 -2576 -263 1855
1332 1855 3165 3335 2340 343 -1834 -3150 -3121 -2236 -370 1765 3183 3507 2864 1241 -1121 -2764 -3291
1349 -3291 -2893 -1854 503 2305 2793 2398 1649 -190 -2175 -2799 -2527 -1568 232 2377 3001 3034 2343 -40
1367 -40 -1968 -2694 -2706 -3017 -703 1723 2323 2340 2811 983 -1555 -2122 -2109 -2236 -1370 1489 2635 2530 2596
1386 2596 1296 -897 -2114 -2945 -3240 -1837 543 1117 2163 3484 1991 -867 -1083 -1371 -3155 -2266
1402 -2266 1083 1649 1334 2798 2657 -79 -1898 -2000 -2891 -2776 -675 950 1646 2819 2684 703 -356
1419 -356 -1353 -2844 -2262 -204 151 888 3338 2799 -195 -901 -271 -3270 -3682 -593 815 406 2179
1436 2179 4023 1579 -509 -399 -1560 -3004 -1578 -146 769 2185 2049 772 539 -18 -3030 -3709
$$ packed form
1315A535k799j777q21N4K017K768J983O78K33j422k740k218r25k00J058K313K118
1332A855J310J70r95j997k177j316K9Q85J866K135J418L24o43j623k362j643n27
1349c291L98J039K357J802M88l95p49j839j985o24K72R59J800K145O24L3o91k383
1367d0j928p26j2l11K314K426O00J7M71j828k538n67J3j27Q66K859J146j05O6
1386B596j300k193j217q31k95J403K380N74J046J321j493k858k16k88j784Q89
1402b266L349N66l15J464j41k736j819j02q91J15K101J625O96J173j35j981j059
1419c56r97j491N82K058L55P37K450n39k994p06O30k999m12L089J408m09J773
1436B179J844k444k088J10j161j444J426J432R15J416j36j277k33n57l012o79
$$ plain form
1452 -3709 -694 16 -805 2127 3889 1563 -11 810 -1040 -3173 -1930 92 35 983 2291 1288
1468 1288 741 260 -2009 -3110 -1207 -505 -1268 1138 3606 2140 406 1196 -207 -2494 -1761 -667
1484 -667 -1008 347 2008 1181 731 1377 -920 -2500 -755 -332 -2003 278 3269 1952 337 1571
1500 1571 1124 -1898 -2095 -900 -1132 -681 996 892 852 1807 1 -1971 -667 -362 -1870 -602 2378
1517 2378 1450 293 1830 1484 -1322 -1706 -506 -1680 -1335 227 299 507 1662 755 -1049 -338 -5
1534 -5 -1941 -1165 1107 1018 -16 1727 2142 -498 -1073 -116 -1409 -2142 -420 31 27 1258 1790 141 -119
1553 -119 180 -1270 -1733 394 298 -345 1469 2390 206 -231 72 -1220 -2434 -796 -539 -925 768 1979
1571 1979 1018 633 868 -614 -1743 -666 -147 -958 1050 2314 809 258 827 -818 -2432 -1269 -809
$$ packed form
1452c709L015P10q21K932J762k326j574Q21j850k133J243K022n7R48J308j003
1468A288n47m81k269j101J903P02p63K406K468j466j734P90j403k287P33J094
1484f67l41J355J661q27m50O46k297j580J745M23j671K281K991j317j615J234
1500A571m47l022j97J195k32M51J677j04m0R55j806j972J304L05j508J268K980
1517B378r28j157J537l46k806l84J200j174L45J562P2K08J155r07j804P11L33
1534ej936P76K272q9j034J743M15k640n75R57j293p33J722M51mJ231N32j649k60
1553a19K99j450m63K127r6o43J814R21k184m37L03j292j214J638K57l86J693J211
1571A979r61l85K35j482j129J077N19q11K008J264j505n51N69j645j614J163M60
$$ plain form
1588 -809 -1181 392 1937 1349 791 1648 20 -1759 -750 -706 -1311 -50 1740 1246 509 1363 -172 -2183
1606 -2183 -1606 -1182 -1482 -243 1873 1519 1404 2047 780 -1244 -1044 -1206 -1969 -436 1344 1113 876 2027
1624 2027 453 -1824 -1687 -942 -2017 -1238 1379 1865 1630 1779 1331 -497 -1267 -1568 -1912 -1068 390 729
1642 729 1575 2169 886 -1069 -977 -1114 -2289 -1359 1167 1201 957 2638 2144 -27 -911 -955 -1791 -1932 -208
1661 -208 1010 1183 1576 1271 442 -771 -1555 -1849 -1186 -211 469 1325 2661 2024 146 -225 -673 -2435
1679 -2435 -2326 -481 97 119 1608 2131 564 -236 -595 -1555 -2001 -985 408 1049 1601 2237 1519 379
1697 379 -1036 -1785 -2044 -1396 -1243 294 1732 1667 766 561 406 -1464 -2509 -1059 -123 -2 1050 2367
1715 2367 1846 441 -31 -670 -2139 -2219 -1364 -46 686 1277 1519 1715 701 -982 -1794 -1091 -901 -531
$$ packed form
1588h09l72J573J545n88n58Q57j628j779J009M4o05J261J790m94p37Q54j535k011
1606b183N77M24l00J239K116l54j15O43j267k024K00j62p63J533J780k31k37J151
1624B027j574k277J37P45j075P79K617M86k35J49m48j828p70l01l44Q44J458L39
1642G29Q46N94j283j955R2j37j175R30K526L4k44J681m94k171q84m4q36j41J724
1661b08J218J73L93l05q29j213p84k94O63R75O80Q56J336o37j878l71m48j762
1679b435J09J845N78K2J489N23j567q00l59r60m46J016J393O41N52O36p18j140
1697C79j415p49k59O48J53J537J438o5r01k05j55j870j045J450R36J21J052J317
1715B367n21j405m72o39j469q0Q55J318P32N91K42J96j014j683q12P03J90L70
$$ plain form
1733 -531 389 2166 2182 1050 586 -488 -1910 -2375 -1816 -971 282 1351 1960 2226 1276 -65 -1391 -1170
1751 -1170 -1411 -1626 -169 1668 2031 1632 1080 462 -1161 -2308 -2486 -1511 -399 802 1858 2444 2072
1768 2072 543 -472 -1387 -1941 -2095 -721 887 1781 1652 1878 905 -573 -2114 -2345 -2023 -1122 225
1785 225 1624 2676 2271 1400 7 -1217 -2120 -2251 -1609 -93 1075 2033 2191 1413 184 -1487 -2482
1802 -2482 -2200 -1917 -332 960 2331 2595 2055 740 -552 -1962 -2373 -2099 -893 607 1702 2334 1974
1819 1974 967 -807 -1915 -2632 -2237 -1178 225 2009 2637 2734 1561 0 -1621 -2256 -2553 -1435 87
1836 87 1503 2370 2338 1469 -180 -1351 -2327 -2687 -1679 -93 1739 2431 2706 2221 816 -1212 -2560 -2660
1854 -2660 -1717 -911 646 2363 2709 1840 317 -876 -1973 -3004 -2060 -688 838 2003 2973 2790 1371
$$ packed form
1733e31R20J777J6j132m64j074j422m65N59Q45J253J069O09K66r50j341j326K21
1751a170k41k15J457J837L63l99n52o18j623j147j78R75J112J201J056N86l72
1768B072j529j015r15n54j54J374J608Q94j29K26r73j478j541k31L22R01J347
1785B25J399J052m05q71j393j224r03j31O42J516J168R58J58p78j229j671r95
1802b482K82K83J585J292J371K64n40j315j292j410m11K74J206J500J095O32l60
1819A974j007j774j108p17L95J059J403J784O28R7j173j561j621o35k97J118J522
1836H7J416Q67l2q69j649j171r76l60J008J586J832O92K75m85j405k028j348j00
1854b660R43Q06J557J717L46q69j523j193j097j031R44J372J526J165R70j83j419
$$ plain form
1871 1371 -730 -2074 -2584 -2544 -1751 138 2071 2368 2115 1559 341 -1833 -2780 -2192 -1296 -11 1393
1888 1393 2737 2531 1555 356 -1091 -2608 -2958 -1789 -468 1124 2126 2818 2216 624 -1072 -1830
1904 -1830 -2476 -2169 -812 1111 2324 2321 2311 1227 -450 -2478 -2776 -2091 -1500 -43 1956 3002 2215 1069
1922 1069 -185 -1277 -2607 -2493 -1241 121 1504 2256 2813 1735 49 -1686 -2257 -2650 -2329 -620
1938 -620 1205 2483 2608 1982 938 -344 -2283 -2732 -2107 -883 848 1964 2589 2324 929 -1145 -2344
1955 -2344 -2608 -2629 -1632 646 2186 2610 2251 1580 116 -1719 -2550 -2380 -1306 -165 1456 2480 2711
1972 2711 1596 -216 -1494 -2389 -3006 -2245 -150 1201 2070 2706 2466 874 -965 -2541 -2452 -2169 -925
1989 -925 662 1926 2923 2440 733 -849 -2022 -2970 -2728 -1274 585 1966 2734 2962 1575 -295 -1890
$$ packed form
1871A371k101j344n10M0P93J889J933K97k53n56j218k174r47N88Q96J285J404
1888A393J344k06r76j199j447j517l50J169J321J592J002O92o02j592j696p58
1904a830o46L07J357J923J213lj0j084j677k028k98O85N91J457J999J046p87j146
1922A069j254j092j330J14J252J362J383P52N57j078j686j735n71l93L21J709
1938f20J825J278J25o26j044j282j939m49O25J224J731J116O25k65j395k074j199
1955b344k64k1R97K278J540M24l59o71j464j835q31J70J074J141J621J024K31
1972B711j115j812j278q95o17P61K095J351Q69O36k40j592j839j576Q9K83J244
1989i25J587J264R97m83j707j582j173r48K42J454J859J381P68K28j387j870j595
$$ plain form
2006 -1890 -2513 -2633 -1657 33 1585 2666 2745 1591 229 -1372 -2788 -3191 -1930 -86 1086 2432
2022 2432 3132 2178 376 -1015 -2601 -3034 -2450 -772 1015 2083 2797 2235 1023 -625 -2525 -3118 -2543
2039 -2543 -974 462 2007 3283 2722 1235 -197 -2167 -2999 -2811 -1466 -58 1611 2901 2703 1532
2055 1532 -67 -1581 -3069 -2634 -1675 -596 1465 3016 2916 1781 395 -1107 -2843 -3248 -1750 -1005
2071 -1005 833 2664 3017 1979 679 -927 -2511 -2868 -2054 -887 578 2661 3029 2354 1111 -364
2087 -364 -2433 -3253 -2403 -1341 -181 1922 3196 2347 1379 46 -1969 -2807 -2555 -1692 -138 1830 2922
2104 2922 2737 1884 186 -1861 -3002 -2654 -1973 -723 1186 2795 2891 2093 801 -1228 -2717 -2857 -2026
2121 -2026 -968 1324 2557 2677 2247 1065 -1166 -2478 -2519 -2550 -1462 630 2305 2678 2625 1666 -368
$$ packed form
2006a890o23j20R76J690J552J081P9j154j362j601j416m03J261J844J172J346
2022B432P00r54j802j391j586m33N84J678J787J068P14n62j212j648j900n93N75
2039b543J569J436J545J276n61j487j432j970q32J88J345J408J669J290j98j171
2055A532j599j514j488M35R59J079K061J551j00j135j386j502j736m05J498P45
2071a005J838J831L53j038j300j606j584l57Q14J167J465K083L68o75j243j475
2087c64k069q20Q50J062J160K103J274q49r68j333k015q38K52Q63J554J968J092
2104B922j85q53j698k047j141L48O81J250J909J609R6p98j292k029j489j40Q31
2121b026J058K292J233J20m30j182k231j312m1l1J088K092J675L73n3r59k034
$$ plain form
2138 -368 -2251 -2580 -2506 -1698 277 1987 2661 2538 1671 -78 -2064 -2550 -2914 -2075 -52 1703 2352 2631
2156 2631 2146 153 -1452 -2316 -2558 -2330 -510 1433 2046 2519 2551 762 -1167 -2053 -2606 -2597 -1163 920
2174 920 1899 2561 2662 1403 -598 -1910 -2658 -2648 -1380 255 1802 2496 2842 1551 -345 -1500 -2566
2191 -2566 -3018 -1751 237 1656 2739 2892 2011 151 -1212 -2650 -2985 -2149 -423 1093 2453 2899
2207 2899 1938 406 -902 -2286 -3057 -2209 -579 869 2040 3040 2632 932 -802 -1946 -2868 -2474
2223 -2474 -1197 535 1834 2558 2558 1038 -265 -1748 -2886 -2652 -1373 -126 1278 2958 3101 1446
2239 1446 -193 -1440 -2724 -3028 -1877 -371 1326 2469 2733 1993 478 -1026 -2556 -2861 -2118 -629
2255 -629 796 2353 2983 2268 871 -599 -2102 -3094 -2399 -899 546 2164 2801 2348 1275 -267 -2137
$$ packed form
2138c68j883l29P4Q08J975J710O74j23q67j749j986m86l64Q39K023J755O49K79
2156B631m85j993j605q64k42K28J820J943O13M73L2j789j929q86n53RJ434K083
2174I20R79O62J01j259k001j312p48J0J268J635J547O94L46j291j896j155j066
2191b566m52J267J988J419J083J53q81j860j363j438l35Q36J726J516J360M46
2207B899r61j532j308j384p71Q48J630J448J171J000m08j700j734j144r22L94
2223b474J277J732J299P24%j520j303j483j138K34J279J247J404J680J43j655
2239A446j639j247j284l04J151J506J697J143K64p40j515j504j530l05P43J489
2255f29J425J557O30p15j397j470j503r92O95J500J445J618O37m53j073j542j870
$$ plain form
2272 -2137 -2809 -2456 -1383 112 1903 2836 2468 1598 170 -1720 -2794 -2400 -1589 -159 1405 2766 2821
2289 2821 1789 391 -1124 -2595 -2844 -1973 -647 1148 2354 2568 2135 853 -951 -2230 -2863 -2002
2305 -2002 -987 814 2399 2733 2014 1073 -538 -1967 -2670 -2142 -1085 467 1917 2578 2316 1393 -215
2322 -215 -1903 -2685 -2592 -1586 -62 1674 2556 2631 1607 187 -1446 -2627 -2391 -1809 -106 1117 2540
2339 2540 2857 1895 517 -1211 -2231 -2520 -2073 -688 854 2327 2437 2326 1059 -813 -2057 -2719 -2242
2356 -2242 -1043 743 2127 2665 2143 1060 -505 -1727 -2546 -2367 -1197 137 1684 2857 2461 1398
2372 1398 171 -1609 -2615 -2440 -1830 -249 1287 2424 2745 1821 271 -1201 -2541 -2677 -1868 -624
2388 -624 1183 2132 2348 1951 709 -763 -2192 -2616 -2024 -973 688 1904 2360 2197 1009 -347 -1843
$$ packed form
2272b137o72L53J073J495J791R33l68q70j428j890j074L94Q11J430J564J361N5
2289B821j032j398j515j471k49Q71J326J795J206K14m33j282j804j279o33Q61
2305b002J015J801J585L34p19r41j611j429p03N28J057J552J450O61k62r23j608
2322b15j688p82R3J006J524J736Q82P5j024j420j633j181K36N82J703J223J423
2339B540L17r62j378j728j020k89M47J385J542J473J10j11j267j872j244o62M77
2356b242J199J786J384N38n22j083j565j222q19J79J170J334J547J173l96j063
2372A398j227j780j006J75O10J581J536J137L21r24j550j472j340j36Q09J244
2388f24J807R49K16l97j242j472j429m24N92J051J661J216M56j63j188j356j496
$$ plain form
2405 -1843 -2436 -2083 -1189 432 1740 2336 2018 1460 34 -1847 -2419 -2469 -1427 -107 1531 2100 2280 1799
2423 1799 290 -1397 -2268 -2064 -1684 -440 1383 2234 2438 1676 581 -1080 -2122 -2218 -1948 -696 905
2440 905 1892 2354 2186 1051 -730 -1891 -2320 -2274 -1210 745 1663 2362 2296 1262 -264 -1840 -2228 -2193
2458 -2193 -1465 287 1582 2244 2286 1441 -207 -1385 -2159 -2471 -1460 -27 1115 1891 2457 1898 187
2475 187 -1344 -1876 -2414 -1831 -513 977 1913 2488 1847 611 -919 -1744 -2358 -2160 -619 767 1338 2307
2493 2307 2206 716 -616 -1517 -2422 -2402 -1142 509 1438 2245 2411 1022 -123 -1192 -2170 -2287 -1489 139
2511 139 1260 2157 2690 1395 40 -897 -2199 -2267 -1530 -40 725 1948 2377 1637 343 -590 -1748 -2363
2529 -2363 -1732 -430 617 1851 2640 1715 658 -129 -1718 -2342 -1922 -672 455 1523 2542 2230 775
$$ packed form
2405a843n93L53Q94J621J308N96l18n58j426j881n72n0J042J320J638N69J80m81
2423A799j509j687q71K04L80J244J823Q51K04p62j095j661j042r6K70J252J601
2440I05R87M62j68j135j781j161m29M6J064J955R18O99o6j034j526j576l88L5
2458b193P28J752J295O62M2q45j648j178p74l12J011J433J142P76N66n59j711
2475A87j531n32n38N83J318J490R36N75o41j236j530q25o14J98J541J386N71R69
2493B307j01j490j332r01r05K0J260J651R29Q07J66j389j145j069r78j17P98J628
2511A39J121Q97N33j295j355r37j302o8P37J490P65J223M29p40j294r33j158o15
2529b363O31J302J047J234P89r25j057p87j589o24M20J250J127J068J019l12j455
$$ plain form
2546 775 -240 -1339 -2320 -1883 -712 -112 1436 2578 2072 950 137 -1063 -2408 -2177 -1170 -301 985
2563 985 2197 2174 1412 546 -958 -2089 -2194 -1342 -462 698 1999 2203 1509 816 -591 -1852 -2186 -1450
2581 -1450 -803 438 1705 2221 1486 840 -106 -1837 -2216 -1659 -944 43 1629 2238 1552 1096 119 -1510
2599 -1510 -2099 -1767 -1292 -287 1334 2008 1862 1487 435 -1319 -2008 -1688 -1450 -483 1061 2005 1852 1318
2617 1318 609 -987 -2067 -1903 -1444 -683 497 1726 1952 1551 868 -899 -2043 -1664 -1732 -893 556 1654
2635 1654 1768 1836 1376 -281 -1644 -1459 -1695 -1324 145 1299 1596 1819 1196 -222 -1413 -1668 -1923 -1449
2653 -1449 -45 1164 1700 1638 1599 204 -1071 -1673 -1914 -1612 -451 953 1629 1905 1724 647 -876 -1529
2671 -1529 -1594 -1643 -755 622 1369 1710 1805 857 -531 -1297 -1727 -1643 -969 498 1146 1743 1865 1241 -461 -1222
$$ packed form
2546G75j015j099r81M37J171O00J548J142n06j122q13j200j345K31J007Q69J286
2563I85J212k3p62q66j504j131j05Q52Q80J160J301K04o94o93j407j261l34P36
2581a450O47J241J267N16p35o46r46j731l79N57P15R87J586O09o86m56r77j629
2599a510n89L32M75J005J621O74j46l75j052j754o89L20K38R67J544R44j53n34
2617A318p09j596j080J64M59P61J180J229K26m01o83j767j144L79o8Q39J449J098
2635A654J14O8m60j657j363J85k36L71J469J154K97K23o23j418j191k55k55M74
2653a449J404J209N36o2l9j395j275o02k41L02J161J404O76K76j81j077j523o53
2671a529o5m9Q88J377P47L41R5r48j388p66m30Q4O74J467O48N97J22o24j702p61
$$ plain form
2691 -1222 -1683 -1836 -1324 259 1054 1626 2125 1117 -118 -935 -1604 -1936 -1191 -37 829 1488 2032 1267
2709 1267 237 -583 -1463 -1969 -1510 -267 688 1375 2148 1673 345 -486 -1297 -2045 -1660 -507 470 1201
2727 1201 1786 1538 676 -289 -1183 -1609 -1528 -916 -32 867 1728 1796 725 -125 -647 -1650 -1712 -1076 -165 706
2747 706 1651 1787 1196 258 -732 -1594 -1864 -977 -389 642 1491 1807 1461 273 -434 -1446 -1868 -1245 -530
2766 -530 312 1442 1784 1225 568 -123 -1270 -1820 -1516 -795 108 1040 1813 1523 688 -261 -952 -1454 -1517 -965
2786 -965 37 865 1590 1812 870 228 -987 -1397 -1731 -1010 -431 912 1329 1425 1200 430 -605 -1396 -1434
2805 -1434 -1149 -427 775 1622 1629 1271 317 -439 -1248 -1520 -1072 -595 436 1078 1510 1204 752 -344 -1282
2824 -1282 -1364 -1497 -672 -58 1199 1584 1394 1031 59 -1042 -1291 -1647 -1063 -119 1041 1700 1593 772 236
$$ packed form
2691a222m61j53N12J583P95N72M99j008j235q17o69l32P45J154Q66O59N44p65
2709A267j030q20q80n06M59J243R55O87P73m75j328q31q11p48L85J153R77P31
2727A201N85k48q62r65q94m26Q1O12Q84Q99Q61O8j071q50n22j003o2O36R11Q71
2747G06R45J36n91r38r90q62k70Q87N88J031Q49L16l46j188p07j012m22O23P15
2766e30Q42J130L42n59o57o91j147n50L04P21R03R32P73k90q35r49o91n02o3N52
2786i65J002Q28P25K22r42o42j215m10l34P21N79J343M17R6k25p70j035p91l8
2805a434K85P22J202Q47Pl58r54p56q09k72M48M77J031O42M32l06m52j096r38
2824a282q2j33Q25O14J257L85j90l63r72j101k49l56N84R44J160O59j07q21n36
$$ plain form
2843 236 -858 -1574 -1472 -1016 -243 757 1247 1717 1337 399 -550 -1125 -1367 -1340 -507 523 1093 1527 1300
2862 1300 325 -353 -1161 -1596 -1267 -577 505 964 1463 1312 596 -283 -1199 -1266 -1539 -488 77 1002 1483
2881 1483 1428 1040 -14 -950 -1700 -1310 -1041 -213 687 1536 1355 828 241 -534 -1422 -1551 -1015 -354 544 1388
2901 1388 1543 1061 575 -331 -1150 -1530 -995 -513 277 1113 1340 1267 604 -331 -1013 -1466 -1203 -516 23 1196
2921 1196 1436 1309 784 -265 -1053 -1201 -1239 -698 -55 937 1373 1375 1002 20 -847 -1234 -1182 -738 -197 846
2941 846 1380 1309 1034 202 -646 -1189 -1354 -1240 -641 612 990 1195 1057 428 -531 -970 -1453 -1105 -508 276
2961 276 1081 1124 1168 728 -217 -748 -1137 -1235 -853 -58 798 991 1350 746 -233 -1064 -1033 -1142 -712 49 889
2982 889 1049 1330 847 -53 -624 -1062 -1457 -1215 -135 567 845 1074 1005 152 -687 -839 -1355 -1358 -451 594
$$ packed form
2843B36j094p16J02M56P73J000M90M70l80r38r49n75k42K7Q33J030N70M34k27
2862A300r75o78q08m35L29O90J082M59M99j51p16q79r16o7k73J051N65R25M81
2881A483n5l88j054r36p50L90K69Q28R00Q49j81n27n87p75q88j29N36O61Q98Q44
2901A388J55m82m86r06q19l80N35M82P90Q36K27p3o63r35o82m53K63O87N39J173
2921A196K40j27n25j049p88j48l8N41O43R92M36Kl73r82q67l87N2M44N41J043
2941H46N34p1k75q32q48n43j65J14N99J253L78K05j38o29r59m39m83L48N97P84
2961B76Q05M3M4m40r45n31l89r8L82P95Q56J93L59o04r79q31L1j09M30P61Q40
2982H89J60K81m83r00n71m38l95K42J080P02K78K29o9q53q39j52n16lR07J045
$$ plain form
3002 594 820 1066 1005 326 -185 -758 -1098 -1066 -640 452 891 1231 1033 710 -84 -729 -1091 -1274 -530 346
3022 346 555 1291 1330 579 -120 -630 -953 -1399 -809 291 458 1018 1258 800 94 -417 -1081 -1464 -920 -74
3042 -74 174 940 1383 890 -31 -549 -1083 -1450 -909 -162 283 845 1435 985 155 -256 -608 -1308 -1140 -231
3062 -231 96 678 1287 950 551 -244 -574 -1389 -952 -622 32 650 1352 1198 584 272 -610 -1124 -1438 -589
3082 -589 -89 620 1181 1073 410 254 -407 -1278 -1103 -590 -338 367 964 1179 834 532 -162 -876 -1286 -1095
3102 -1095 -435 324 837 1312 678 341 -19 -933 -1230 -936 -444 -13 819 1207 977 593 136 -645 -1168 -952
3122 -952 -727 -256 740 1066 967 693 206 -718 -1133 -942 -681 -370 558 1293 1014 840 408 -430 -956 -908 -766
3143 -766 -464 234 905 917 1011 259 -336 -903 -823 -898 -292 588 1000 850 847 613 -280 -833 -917 -976 -570 309 740
$$ packed form
3002E94K26K46o1o79n11n73l40L2M26J092M39L40j98l23p94o45l62j83P44Q76
3022C46K09P36L9p51o99n10l23m46N90J100J67N60K40m58p06n11o64l83N44Q46
3042g4K48P66M43m93r21n18n34l67N41P47M45N62N90m50q30m11l52p00J68R09
3062b31L27N82O09l37l99p95l30q15M37L30O54O18P02j54o14l12q82n14l14Q49
3082e89N00P09N61j08o63j56o61q71J75N13K52P05N97K15l45l02o94p14m10J91
3102a095O60P59N13M75o34l37l60r14k97K94M92M31Q32L88k30l84m57p81n23K16
3122i52K25M71R96L26r9k74m87r24m15J91K61L11R28P35k79j74m32q38n26M8J42
3143g66L02O98O71J2R4p52n95n67Q0p5O06Q80M12j50lk34q93n53q4n9M06Q79M31
$$ plain form
3166 740 1027 952 573 -7 -822 -934 -1073 -651 -106 627 874 852 499 83 -555 -794 -844 -771 -153 409 775
3187 775 1169 923 482 -521 -688 -751 -899 -355 266 875 852 902 338 -385 -659 -663 -1016 -376 140 635 957
3208 957 987 541 -462 -408 -1009 -750 -674 48 761 786 1078 852 -41 -578 -653 -1061 -813 0 478 776 1031
3229 1031 638 160 -452 -948 -895 -643 -121 538 659 1013 715 124 -366 -709 -1041 -864 -267 328 589 866
3249 866 761 363 -291 -831 -912 -741 -261 169 592 891 895 257 -154 -294 -989 -978 -485 103 603 919 829 541
3271 541 -89 -639 -768 -892 -508 115 456 808 843 601 195 -329 -773 -1018 -569 -273 343 618 1098 519
3291 519 447 -237 -800 -1092 -539 -297 291 753 889 768 366 -156 -563 -826 -733 -221 126 496 648 724 260
3312 260 -84 -334 -845 -812 -569 -194 608 974 771 554 45 -405 -736 -734 -524 19 389 831 854 625 123
$$ packed form
3166G40K87p5l79n80q15j12j39M22N45P33K47k2l53m16o38k39n0P3O18N62L66
3187G75L94k46m41j003j67o3j48N44O21O09k3N0n64p23k74ml53O40N16M95L22
3208I57L0m46j003N4o01K59P6P22P13K5K92k26q93n37p5m08K48Q13M78K98K55
3229A031l93m78o12m96N3K52N22O59J21L54k98n91m90l43l32J77N97N95K61K77
3249H66j05l98o54n40q1J71M80M30M23K99Mo38m11j40o95J1M93N88N00L16r0k88
3271E41o30n50j29j24L84O23L41L52L5k42m06n24m44k45M49K96O16K75M80n79
3291E19p2o84n63k92N53K42N88M62J36j21m02n22m07k63R3N12L47L70J52P6m64
3312B60l44k50n11L3K43L75Q02L66k03k17n09m50l31KK10N43L70M42K3k29n02
$$ plain form
3333 123 -288 -777 -772 -610 -39 214 773 720 678 435 -159 -579 -908 -535 -268 301 668 791 696 370 -42 -610
3355 -610 -911 -842 -372 232 625 836 829 405 -206 -478 -850 -833 -329 -2 460 783 981 505 -21 -359 -627
3376 -627 -506 -480 -175 173 740 738 853 242 -175 -630 -719 -731 -343 294 574 855 656 371 -149 -648 -1024 -568
3398 -568 -416 264 463 748 600 158 -79 -546 -854 -568 -526 92 663 913 903 356 76 -386 -837 -935 -531
3419 -531 52 500 715 653 429 135 -369 -675 -731 -665 -36 290 769 644 515 73 -396 -554 -721 -471 -125
3440 -125 243 418 826 428 425 43 -771 -753 -452 -161 131 697 635 554 487 -304 -600 -597 -475 -382 -52 692 570
3463 570 729 416 111 -482 -552 -590 -547 -169 416 602 671 547 157 -299 -735 -588 -498 -237 324 749 495 817
3485 817 172 -388 -633 -374 -664 -241 180 858 602 810 388 -184 -554 -476 -439 -332 116 476 650 589 513
$$ packed form
3333A23m11m89NJ62N71K53N59n3m2k43n94m20l29L73K67N69L67J23r5l26m12n68
3355f10l01O9M70O04L93K11pm24o11k72l72J7N04L27M62L23J98m76n26l38k68
3376f27J21K6L05L48N67kJ15o11m17m55q9j2L88O37K80K81j99k85n20m99l76M56
3398e68J52O80J99K85j48m42k37m67l08K86M2O18N71K50j0n47k80m62m51r8M04
3419e31N83M48K15o2k24k94n04l06n6O6O29L26M79j25j29m42m69j58j67K50L46
3440a25L68J75M08l98ll82q14J8L01K91K92N66o2q1o7p91k96LJ22R3L30P44j22
3463E70J59l13l05n93p0l8M3L78N85J86O9j24l90m56m36J47R0K61N61M25k54L22
3485H17o45n60k45K59k90M23M21O78k56K08m22n72l70P8L7J07M48L60J74o1p6
$$ plain form
3506 513 112 -480 -603 -617 -634 58 748 678 553 403 -33 -177 -516 -656 -605 -134 150 445 608 626 58 -256
3528 -256 -420 -631 -654 -130 75 364 661 555 176 -222 -620 -582 -524 -132 252 262 641 745 424 -132 -328
3549 -328 -699 -453 -353 85 362 481 593 510 -204 -280 -698 -596 -452 5 312 426 648 300 45 -14 -358
3570 -358 -763 -336 -186 209 545 478 351 133 -140 -231 -554 -447 19 90 386 659 510 -106 60 -440 -692
3591 -692 -505 -124 0 340 471 505 170 65 -183 -672 -393 -106 -122 375 476 227 208 -169 -207 -471 -698
3612 -698 -461 -63 289 656 748 244 136 -145 -444 -548 -267 -149 93 518 562 371 123 -88 -651 -675 -375
3633 -375 -179 167 365 638 519 251 133 -443 -702 -382 -223 -103 539 480 615 304 -26 -381 -652 -467
3653 -467 -329 -158 188 553 566 398 341 -171 -583 -391 -528 -308 279 673 399 377 224 -346 -518 -352 -460
$$ packed form
3506E13m01n92j23j4j7O92O90p0j25j50m36j44l39j40N1M71K84K95J63J8n68l14
3528b56j64k11k3N24K05K89K97j06l79l98l98L8N8L92L84J0L79J04l21n56j96
3549c28l71K46J00M38K77J19J12q3p14p6m18J02J44M57L07J14K22l48k55n9l44
3570c58m05M27J50L95L36o7j27k18k73r1l23J07M66P1K96K73j49o16J66n00k52
3591f92J87L81J24L40J31L4l35j05k48m89K79K87j6M97J01k49j9l77l8k64k27
3612f98K37L98L52L67R2n04j08k81k99j04K81J18K42M25M4j91k48k11n63k4L00
3633c75J96L46J98K73j19k68j18n76k59L20J59J20O42n9J35l11l30l55k71J85
3653d67J38J71L46L65J3j68n7n12m12J92j37K20N87L94k74k2j53n70j72J66j08
$$ plain form
3674 -460 -461 162 316 588 500 356 -160 -363 -290 -365 -175 96 331 481 664 240 -73 -350 -454 -623 -258 -66
3696 -66 543 353 462 70 233 -408 -333 -385 -522 -20 452 223 508 392 16 -373 -439 -364 -523 -232 232 402
3718 402 348 479 220 -218 -319 -594 -758 -403 247 445 289 555 242 -139 -271 -503 -550 -416 59 312 447
3739 447 526 304 55 -249 -350 -486 -283 118 201 495 437 87 -7 -167 -198 -412 -385 16 204 250 632 401
3761 401 46 -238 -386 -540 -362 6 183 467 489 474 97 -5 -142 -606 -470 -174 -54 176 569 565 238
3782 238 -119 -190 -429 -270 -279 -64 251 370 409 349 -88 -168 -467 -442 -320 -4 28 220 579 244 -140 -8 -282
3805 -282 -351 -412 -142 71 427 417 214 125 -229 -438 -380 -135 -179 -52 244 485 427 450 -146 -331 -410 -250 -306
3828 -306 -130 253 654 366 203 142 -156 -275 -599 -309 -35 225 434 315 289 26 -340 -293 -373 98 -46
$$ packed form
3674d60jO23J54K72q8j44n16k03P3p5J90K71K35J50J83m24l13k77j04j69L65J92
3696f6O09j90J09l92J63o41P5n2j37N02M72k29K85j16l76l89o6P5j59K91M64J70
3718D02n4J31k59m38j01k75j64L55O50J98j56K66l13l81j32k32m7J34M75K53J35
3739D47P9k22k49l04j01j36K03M01Q3K94n8l50r4j60l1k14K7M01J88M6L82k31
3761D01l55k84j48j54J78L68J77K84K2j5l77j02j37m64J36K96J20K30L93ml27
3782B38l57p1k39J59rK15L15J19L9o0m37q0k99K5J22L16L2J92L59l35l84J32k74
3805b82o9o1K70K13L56j0k03q9l54k09N8K45m4J27K96K41n8K3n96j85p9J60n6
3828c06J76L83M01k88j63o1k98j19l24K90K74K60K09j19k6k63l66M7q0M71j44
$$ plain form
3849 -46 125 260 484 356 190 -138 -358 -369 -370 -292 33 286 354 543 282 59 -322 -318 -254 -268 8 30 316 295
3873 295 65 -280 -87 -386 -468 -160 -1 131 250 222 263 -74 -59 -238 -355 -241 198 -26 555 174 351
3894 351 106 -315 -78 -317 -179 -161 25 368 418 491 191 92 -60 -373 -370 -120 332 282 338 160 289 -133 -238
3917 -238 -104 -143 -185 -14 252 200 400 209 138 -360 -260 -413 -41 28 169 335 334 29 231 -165 -206 -392 -186
3940 -186 34 137 296 304 159 363 35 -363 -99 -377 -200 199 225 276 236 257 -100 -340 -514 -99 -213 20
3962 20 189 271 185 216 297 36 -190 -331 -239 -34 289 102 227 262 -16 -143 -335 -97 -344 -114 126 359
3984 359 146 223 39 -66 -318 -249 -84 -16 146 375 320 222 -90 -234 -175 -356 -178 13 6 187 220 292 90
4007 90 114 -247 -329 -557 -304 165 187 321 341 35 -62 -11 -226 -234 -2 53 243 316 230 318 21 -160 -307 -197
$$ packed form
3849d6J71J35K24j28j66l28k20j1jP8L25K53O8J89k61k23l81MO4j4K76K2K86k1
3873B95k30l45J93k99q2L08J59J32J19k8M1l37J5j79j17J14M39k24N81l81J77
3894C51k45m21K37k39J38J8J86L43N0P3l00r9j52l13LK50M52n0N6j78J29m22j05
3917b38J34l9m2J71K66n2K00j91p1m98J00j53L72O9J41J66jl05K02l96m1j86K06
3940a86K20J03J59Qj45K04l28l98K64k78J77L99K6N1m0K1l57k40j74M15j14K33
3962B0J69Q2q6L1Q1k61k26j41R2K05L23j87J25L5k78j27j92K38k47K30K40K33
3984C59k13P7j84j05k52O9J65O8J62K29n5r8l12j44N9j81J78J91pJ81L3P2k02
4007I0K4l61q2k28K53M69K2J34K0l06r7N1k15qK32N5J90P3q6Q8k97j81j47J10
$$ plain form
4031 -197 -120 21 130 196 168 94 80 11 -161 -199 -305 -20 319 189 432 158 120 127 -232 -143 -371 -163 114 84
4055 84 222 473 114 120 -37 -256 -163 -201 226 24 408 356 119 -142 -86 -157 -35 -340 -109 15 45 484 78
4078 78 77 122 -447 -287 -361 -55 36 247 219 218 120 8 -138 -239 -238 -48 -48 160 335 238 15 -148 -11 -422 -93
4103 -93 -188 22 250 103 260 437 77 22 -334 -336 -77 -101 -49 332 262 166 -45 -136 -39 -237 -197 -38 12 230
4127 230 215 72 89 179 -44 -295 -245 -233 230 263 188 217 140 -149 -121 -237 -93 -212 -41 43 275 271 166 61
4151 61 -3 -76 -40 -246 27 118 177 61 151 216 -234 -26 -228 -110 -114 121 159 147 211 116 67 -46 -90 -309 -66
4176 -66 -170 194 5 271 104 -21 64 -281 -321 -228 -102 163 93 293 162 12 -166 -110 -149 -69 -21 4 40 315
4200 315 219 159 -139 -229 -161 -254 108 121 303 238 179 235 -178 -221 -146 -10 -25 73 1 -18 276 53 -35 -85 -164 -218
$$ packed form
4031a97P7J41J09O6k8p4j4o9j72l8j06K85L39j30K43k74l8Pl59Q9k28K08K77l0
4055H4J38K51l59Oj57k19R3l8M27k02L84n2k37k61N6p1J22l05K31J24L0M39m06
4078G8jM5n69J60p4L06R1K11k8jr8j12j46j01JJ90%K08J75r7k23j63J37m11L29
4103i3r5K10K28j47J57J77l60n5l56kK59k4N2L81p0r6k11r1R7j98M0J59N0K18
4127B30j5j43J7R0k23k51N0J2M63L3p5K9p7k89K8j16J44j19J71Q4K32mj05j05
4151F1o4p3L6k06K73R1N9j16R0O5m50K08k02J18mK35L8j2O4r5m9j13m4k19K43
4176f6j04L64j89K66j67j25Q5l45m0R3J26K65p0K00j31j50j78N6l9Q0M8K5L6K75
4200C15r6o0k98r0O8r3L62J3J82o5n9N6m13m3P5J36j5R8p2j9K94k23q8n0p9n4
$$ plain form
4226 -218 -103 95 58 127 65 289 89 121 -41 -297 -183 -49 -25 84 143 50 200 -12 124 -59 -300 22
4248 22 37 171 273 121 177 -1 -196 -114 61 -187 -46 -83 392 54 43 55 -96 -180 -65 43 -11 82 335
4271 335 529 74 -78 -220 34 -108 -240 12 76 44 216 179 28 -85 0 -60 -159 31 -25 289 176 253 44
4294 44 118 -254 -169 -194 45 77 128 -69 185 199 -140 -89 -42 -236 -156 155 -123 206 62 64 33 55 -59 -74 131
4319 131 -193 92 79 36 210 64 -60 -64 -241 -65 -108 -97 261 -72 -87 41 -177 -273 -156 129 -228 -163 148
4342 148 101 120 -42 -148 -111 -333 -275 -251 -89 18 65 282 85 -4 -55 -208 -201 -48 -250 -177 131 72 -25 -4 -349
4367 -349 -126 -124 -23 -84 94 248 -5 201 -48 99 59 -264 -180 79 55 59 141 258 72 -69 -179 -67 -89
4390 -89 -129 40 238 223 157 156 -113 -55 -88 -16 35 -60 83 201 -85 185 110 0 -236 -207 -195 256 129 119 159
$$ packed form
4226b18J15J98l7O9o2K24k00L2j62k56J14J34K4J09N9r3J50k12J36j83k41L22
4248B2J5J34J02j52N6j78j95Q2J75k48J41l7M75l38j1J2j51q4J15J08n4R3K53
4271C35J94m55j52j42K54j42j32K52O4l2J72l7j51j13Q5o0r9J90n6L14j13P7k09
4294D4P4l72Q5k5K39L2N1j97K54J4l39N1M7j94Q0L11k78L29j44Kl1K2j14j5K05
4319A31l24K85j3m3J74j46j24mj77J76m3J1L58l33j5J28k18r6J17K85l57O5L11
4342A48m7J9j62j06L7k22N8K4J62J07M7K17j97q9n1j53PJ53k02P3L08n9r7K1l45
4367c49K23KJ01o1J78J54k53K06k49J47m0l23Q4K59k4MQ2J17j86j41j10J12k2
4390h9m0J69J98j5o6jk69N8l3P2N1r5J43J18k86K70p5j10k36K9J2M51j27j0M0
$$ plain form
4415 159 103 -207 17 -19 -265 -200 -102 80 -41 77 -187 -49 -20 -53 -200 -188 21 -47 137 90 -96 121 -183
4438 -183 -80 -193 -187 -97 76 18 -6 313 -39 -26 -9 -264 -16 -74 87 43 154 387 -183 77 -53 3 -158
4461 -158 -91 -18 308 272 -88 408 -178 -17 29 -33 -53 -215 123 179 249 -135 209 99 -171 -86 -75 19 -229 -114
4485 -114 -49 142 41 -64 -174 -79 -35 -45 154 224 42 316 100 93 -35 -106 -109 36 103 41 67 9 145 -80 74
4510 74 -19 168 -104 9 -38 199 6 116 73 -32 -1 -77 -15 124 48 98 1 207 121 -50 35 15 -58 -109 -198
4535 -198 220 231 75 190 105 -83 -241 38 -207 -138 151 107 9 6 108 -183 152 -18 -2 -153 113 278 91
4558 91 -33 -200 60 1 -53 -63 169 -152 30 251 117 157 -81 -57 -60 -279 93 60 -263 126 39 198 -93
4581 -93 -9 0 63 -7 -36 124 -25 81 28 -55 9 102 -328 -27 260 212 79 254 144 91 63 55 -45 -17 52 -75
$$ packed form
4415A59n6l10K24l6k46O5R8J82j21J18k64J38K9l3j47J2K09o8J84m7j86K17l04
4438a83J03j13OR0J73n8k4L19l52J3J7k55K48n8J61m4J11K33n70K60j30N6j61
4461a58O7P3L26l6l60M96n86J61M6o2k0j62L38N6P0l84L44j10k70Q5J1R4k48J15
4485a14O5J91j01j05j10R5M4j0J99P0j82K74k16pj28p1lJ45O7o2K6n8J36k25J54
4510G4r3J87k72J13m7K37j93J10m3j05L1p6O2J39p6N0r7K06q6j71Q5k0p3n1q9
4535a98M18J1j56J15q5j88j58K79k45O9K89m4r8lJ02k91L35j70J6j51K66J65j87
4558I1j24j67K60n9n4j0K32l21J82K21j34M0k38K4lk19L72l3l23L89q7J59k91
4581i3Q4RO3p0k9J60j49J06n3q3O4R3m30L01K87m8j33J75j10n3k8qj00K8O9j27
$$ plain form
4607 -75 7 6 190 517 -65 -165 -230 -122 -44 38 190 74 -42 99 5 -230 -68 -156 -197 -55 -26 162 290 21
4631 21 -16 -62 35 43 -55 13 -142 -106 124 136 289 -51 11 25 -145 83 -154 -60 201 50 -271 231 -17 5 93
4656 93 235 -199 -67 73 267 95 165 -141 129 -106 -40 -33 61 -107 236 244 -24 -58 -48 94 82 -73 169 -7
4680 -7 282 153 -95 75 -392 38 -60 -125 251 -79 -173 168 0 44 -190 -42 -76 28 -96 68 -186 83
4702 83 49 -12 -32 -7 27 7 -23 68 101 12 116 61 -43 237 -121 -54 -53 16 317 113 -19 100 -142 -138 27 -28
4728 -28 157 -38 -37 122 259 -7 29 115 -112 -126 116 -88 135 350 12 46 80 35 -186 56 -151 14 -118
4751 -118 94 103 -206 172 -267 -92 -141 -155 -6 -8 -29 86 27 97 -43 -97 -353 -72 -52 -77 165 214 113 -51
4775 -51 -69 68 -68 -78 16 -78 164 243 -172 -95 188 -2 -120 -77 -87 -165 107 -10 186 36 111 -165 19 -42
$$ packed form
4607g5Q2jJ84L27n82j00o5J08P8Q2J52j16j16J41r4k35J62q8m1J42K9J88J28k69
4631B1l7m6R7Qr8O8j55L6K30J2J53l40O2J4j70K28k37R4K61j51l21N02k48K2Q8
4656I3J42m34J32J40J94j72P0l06K70k35O6PR4j68L43Qk68l4J0J42j2j55K42j76
4680gK89j29k48J70m67M30r8o5L76l30r4L41j68M4k34J48l4J04j24J64k54K69
4702H3l4o1k0K5L4k0l0R1L3q9J04n5j04K80l58O7JO9L01k04j32J19k42MJ65n5
4728b8J85j95JJ59J37k66L6Q6k27j4K42k04K23K15l38L4L4m5k21K42k07J65j32
4751a18K12Rl09L78m39J75m9j4J49kk1J15n9P0j40n4k56K81K0k5K42M9j01j64
4775e1j8J37j36j0R4r4K42P9m15P7K83j90j18M3j0p8K72j17J96j50P5k76J84o1
$$ plain form
4799 -42 -104 -183 34 156 344 -38 218 -67 -106 -106 -134 -123 -138 -54 83 122 184 -245 -49 -22 -71 124 150 -4 -113
4824 -113 51 -125 132 -68 -101 64 -280 44 27 -8 -75 132 145 -112 146 -105 -238 -52 124 -35 -77 -95
4846 -95 -28 38 -144 -10 -62 -108 51 -110 51 1 -14 129 -30 -145 -291 -74 -4 -162 43 165 176 187 14
4869 14 -243 141 -52 -104 2 22 -18 0 91 94 -48 -256 30 -258 -122 -88 17 185 42 90 -127 -110 -78 -157
4893 -157 6 -68 -134 5 -93 -123 12 -44 -69 105 43 255 12 -37 184 288 68 -90 -203 -33 26 33 25 -44 30
4918 30 72 125 43 86 111 -148 -22 -193 127 143 154 16 -83 -143 -175 -66 -109 13 126 251 47 259 -80 -180
4942 -180 -57 -141 -28 69 -111 132 28 -132 10 -159 -109 83 78 35 -89 95 189 4 40 -19 107 -200 50
4965 50 73 -171 125 -59 -22 -16 -63 9 -1 -110 -170 80 169 -71 147 13 -130 -42 -135 -118 1 -28 124 35 -88
$$ packed form
4799d2o2p9K17J22J88l82K56k85l9%k8J1j5Q4J37L9O2m29J96K7m9J95K6j54j09
4824a13J64j76K57k00l3J65l44L24j7l5o7K07J3k57K58k51j33J86J76j59m2j8
4846i5O7O6j82J34n2m6J59j61J61n0j5J43j59j15j46K17P0j58K05J22J1J1j73
4869A4k57L84j93n2J06K0m0J8R1Lj42k08K86k88J36L4J05J68j43M8k17J7L2p9
4893a57J63p4o6J39r8l0J35n6k5J74o2K12k43m9K21J04k20j58j13J70N9Pqo9P4
4918C0M2N3q2M3K5k59J26j71L20J6J1j38r9o0l2J09m3J22J13J25k04K12l39j00
4942a80J23q4J13R7j80K43j04j60J42j69N0J92nm3j24J84R4j85L6n9J26l07K50
4965E0K3k44K96j84L7Om7P2j0j09o0K50Q9k40K18j34j43Q8r3J7J19k9J52q9j23
$$ plain form
4990 -88 17 -75 -32 -267 -232 124 -27 79 -103 -17 95 -116 -80 49 36 75 -193 40 185 -56 150 -63 15
5013 15 153 162 89 53 44 4 -11 194 30 -50 61 22 -30 189 42 95 144 -61 2 -100 152 55 196 -33 121
5038 121 -239 104 -112 -130 214 -33 -165 67 94 -212 258 41 111 116 -141 -7 -107 -217 -22 -131 13 -68
5060 -68 -179 -27 -5 -90 -108 -32 125 -261 -16 58 335 111 -145 -90 -129 43 -97 -46 -96 230 -48 -50 -72 -8 -51
5085 -51 -62 107 -210 -36 -49 -9 69 -165 -135 56 52 -62 33 97 70 9 -25 266 -51 -142 -106 -184 112 -104 91
5110 91 141 198 79 50 63 -118 -3 -39 49 243 174 141 90 -167 119 135 -90 -8 -152 21 14 252 -26 167 99
5135 99 37 -194 -103 92 -63 38 33 84 71 -176 101 -99 107 -32 -45 -149 137 51 60 -58 -239 -24 -65 119
5159 119 -47 -149 86 216 72 -39 115 -80 16 12 -60 25 123 150 -74 -200 97 -40 8 -115 -142 101 55
$$ packed form
4990h8J05r2M3k35L5L56j51J06j82Q6J12k11L6J29j3L9k68K33J45k41K06k13P8
5013A5J38Rp3l6rm0j5K05j64q0J11l9n2K19j47N3M9k05O3j02K52r7J41k29J54
5038A21l60L43k16j8L44k47j32K32K7l06M70k17P0Nk57J34j00j10J95j09J44q1
5060f8j11J52K2q5j8P6J57l86K45P4K77k24k56N5l9J72j40N1n0L26k78kk2O4m3
5085e1j1J69l17J74j3M0P8k34L0J91mj14R5O4k7o1l4K91l17r1L6p8K96k16J95
5110I1N0N7j19k9J3j81J15l6Q8J94o9l3n1k57K86J6k25Q2j44J73pK38k78J93o8
5135I9o2k31R1J95j55J01nN1j3k47K77k00K06j39j3j04K86q6Rj18j81K15m1J84
5159A19j66j02K35J30j44j11J54j95R6mp2Q5R8K7k24j26K97j37M8j23k7K43m6
$$ plain form
5182 55 195 169 -30 -108 57 -66 -162 -74 -21 -84 -27 -68 76 4 -44 35 53 -129 7 6 192 -179 -15 -73 253
$$ packed form
5182E5J40k6j99p8J65j23r6Q8N3o3N7m1J44p2m8P9J8j82J36jJ86l71J64n8L26
$$ [...]
8191B8
##END NTUPLES=NMR FID
##END=
