##TITLE=1H_DE-126_oil
 200.13MHz,D2O.
 8 sc
 
 9.2.2026
##JCAMPDX= 6.0         $$ Bruker NMR JCAMP-DX V2.0
##DATA TYPE= NMR FID
##DATA CLASS= NTUPLES
##ORIGIN= UXNMR, Bruker Analytische Messtechnik GmbH
##OWNER= pz
$$ XWIN-NMR		Version 3.5
$$ Mon Feb  9 13:47:45 2026 Russian Standard Time (UT+4h)  she@DPX200
##.OBSERVE FREQUENCY= 200.1315
##.OBSERVE NUCLEUS= ^1H
##.DELAY= (6, 6)
##.ACQUISITION MODE= SIMULTANEOUS
##.ACQUISITION SCHEME= undefined
##.AVERAGES= 8
##.DIGITISER RES= 18
##SPECTROMETER/DATA SYSTEM= spect
##.PULSE SEQUENCE= zg30
##.SOLVENT NAME= D2O
##.SHIFT REFERENCE= (INTERNAL, D2O, 0, 14.3821)
##AUDIT TRAIL= $$ (NUMBER, WHEN, WHO, WHERE, WHAT)
$$ ##TITLE= Audit trail, XWIN-NMR		Version 3.5
$$ ##JCAMPDX= 5.01
$$ ##ORIGIN= Bruker BioSpin GmbH
$$ ##OWNER= she
$$ F:/spectra/data/she/nmr/H-C/1/audita.txt
$$ ##AUDIT TRAIL=  $$ (NUMBER, WHEN, WHO, WHERE, WHAT)
(   1,<2026-02-09 13:46:20.73 +0400>,<she>,<DPX200>,
      <created by zg, POWCHK disabled, PULCHK disabled
       configuration hash MD5:
       00 E9 B6 7A A2 85 ED C7 34 08 36 98 17 FE 4E 26
       data hash MD5: 16K
       27 33 63 FC 01 85 BC 4E 1D 54 BF 14 21 AA 59 AC>)
$$ ##END=
$$ 
$$ hash MD5
$$ 86 2E 15 21 32 33 F6 76 CE 56 F5 57 04 86 F4 9E
##$RELAX= 
##$RELAX= 
##$RELAX= 
##$RELAX= 
##$RELAX= 
##$RELAX= 
$$ Bruker specific parameters
$$ --------------------------
##$DU= <F:/spectra>
##$EXPNO= 1
##$NAME= <H-C>
##$PROCNO= 1
##$TYPE= <nmr>
##$USER= <she>
##$AMP= (0..31)
100 100 100 100 100 100 100 100 100 100 100 100 100 100 100 100 100 100 
100 100 100 100 100 100 100 100 100 100 100 100 100 100 
##$AQSEQ= 0
##$AQ_mod= 1
##$AUNM= <au_zg>
##$AUTOPOS= <>
##$BF1= 200.13
##$BF2= 200.13
##$BF3= 200.13
##$BF4= 200.13
##$BF5= 200.13
##$BF6= 200.13
##$BF7= 200.13
##$BF8= 200.13
##$BYTORDA= 1
##$CFDGTYP= 0
##$CFRGTYP= 5
##$CHEMSTR= <none>
##$CNST= (0..31)
1 1 145 1 1 1 1 1 1 1 1 1 1 1 1 1 1 1 1 1 1 1 1 1 1 1 1 1 1 1 1 1 
##$CPDPRG= <>
##$CPDPRG1= <>
##$CPDPRG2= <>
##$CPDPRG3= <>
##$CPDPRG4= <mlev>
##$CPDPRG5= <mlev>
##$CPDPRG6= <mlev>
##$CPDPRG7= <mlev>
##$CPDPRG8= <mlev>
##$CPDPRGB= <>
##$CPDPRGT= <>
##$D= (0..31)
0 0.7 0 0 0 0 0 0 0 0 0 0.03 0 0 0 0 0 0 0 0 0 0 0 0 0 0 0 0 0 0 0 0 
##$DATE= 1770630380
##$DBL= (0..7)
120 120 120 120 120 120 120 120 
##$DBP= (0..7)
150 150 150 150 150 150 150 150 
##$DBP07= 0
##$DBPNAM0= <>
##$DBPNAM1= <>
##$DBPNAM2= <>
##$DBPNAM3= <>
##$DBPNAM4= <>
##$DBPNAM5= <>
##$DBPNAM6= <>
##$DBPNAM7= <>
##$DBPOAL= (0..7)
0.5 0.5 0.5 0.5 0.5 0.5 0.5 0.5 
##$DBPOFFS= (0..7)
0 0 0 0 0 0 0 0 
##$DE= 6
##$DECBNUC= <off>
##$DECIM= 32
##$DECNUC= <off>
##$DECSTAT= 4
##$DIGMOD= 1
##$DIGTYP= 9
##$DL= (0..7)
0 120 120 120 120 120 120 120 
##$DP= (0..7)
150 150 150 150 150 150 150 150 
##$DP07= 0
##$DPNAME0= <>
##$DPNAME1= <>
##$DPNAME2= <>
##$DPNAME3= <>
##$DPNAME4= <>
##$DPNAME5= <>
##$DPNAME6= <>
##$DPNAME7= <>
##$DPOAL= (0..7)
0.5 0.5 0.5 0.5 0.5 0.5 0.5 0.5 
##$DPOFFS= (0..7)
0 0 0 0 0 0 0 0 
##$DQDMODE= 0
##$DR= 18
##$DS= 0
##$DSLIST= <SSSSSSSSSSSSSSS>
##$DSPFIRM= 0
$$ [...]
##$SUBNAM0= <"">
##$SUBNAM1= <"">
##$SUBNAM2= <"">
##$SUBNAM3= <"">
##$SUBNAM4= <"">
##$SUBNAM5= <"">
##$SUBNAM6= <"">
##$SUBNAM7= <"">
##$SUBNAM8= <"">
##$SUBNAM9= <"">
##$SW= 18.0517148125397
##$SWIBOX= (0..15)
0 0 2 0 0 0 0 0 0 0 0 0 0 0 0 0 
##$SW_h= 3612.71676300578
##$TD= 16384
##$TD0= 1
##$TE= 0
##$TE2= 300
##$TE3= 300
##$TEG= 300
##$TL= (0..7)
0 120 120 120 120 120 120 120 
##$TP= (0..7)
150 150 150 150 150 150 150 150 
##$TP07= 0
##$TPNAME0= <>
##$TPNAME1= <>
##$TPNAME2= <>
##$TPNAME3= <>
##$TPNAME4= <>
##$TPNAME5= <>
##$TPNAME6= <>
##$TPNAME7= <>
##$TPOAL= (0..7)
0.5 0.5 0.5 0.5 0.5 0.5 0.5 0.5 
##$TPOFFS= (0..7)
0 0 0 0 0 0 0 0 
##$TUNHIN= 0
##$TUNHOUT= 0
##$TUNXOUT= 0
##$USERA1= <user>
##$USERA2= <user>
##$USERA3= <user>
##$USERA4= <user>
##$USERA5= <user>
##$V9= 5
##$VALIST= <valist>
##$VCLIST= <CCCCCCCCCCCCCCC>
##$VD= 0
##$VDLIST= <DDDDDDDDDDDDDDD>
##$VPLIST= <PPPPPPPPPPPPPPP>
##$VTLIST= <TTTTTTTTTTTTTTT>
##$WBST= 1024
##$WBSW= 4
##$XGAIN= (0..3)
0 0 0 0 
##$XL= 0
##$YL= 0
##$YMAX_a= 250381
##$YMIN_a= -324973
##$ZGOPTNS= <>
##$ZL1= 120
##$ZL2= 120
##$ZL3= 120
##$ZL4= 120
##$ABSF1= 10
##$ABSF2= 0
##$ABSG= 5
##$ABSL= 3
##$ALPHA= 0
##$AQORDER= 0
##$ASSFAC= 0
##$ASSFACI= 0
##$ASSFACX= 0
##$ASSWID= 0
##$AUNMP= <proc_1d>
##$AZFE= 0.1
##$AZFW= 0.1
##$BCFW= 1
##$BC_mod= 2
##$BYTORDP= 1
##$COROFFS= 0
##$CY= -3
##$DATMOD= 1
##$DC= 2
##$DFILT= <>
##$DTYPP= 0
##$F1P= 0
##$F2P= 0
##$FCOR= 0.5
##$FTSIZE= 0
##$FT_mod= 4
##$GAMMA= 1
##$GB= 0.15
##$INTBC= 1
##$INTSCL= 1
##$ISEN= 128
##$LB= 0.25
##$LEV0= 0
##$LPBIN= 0
##$MAXI= 10000
##$MC2= 0
##$MEAN= 0
##$ME_mod= 0
##$MI= 1.114404
##$NCOEF= 0
##$NC_proc= 0
##$NLEV= 6
##$NOISF1= 3.799351
##$NOISF2= 2.8
##$NSP= 1
##$NTH_PI= 0
##$NZP= 0
##$OFFSET= 14.38212
##$PC= 1
##$PHC0= -3705.663
##$PHC1= 13.59231
##$PH_mod= 1
##$PKNL= yes
##$PPARMOD= 0
##$PSCAL= 0
##$PSIGN= 0
##$REVERSE= no
##$SF= 200.129724274929
##$SI= 16384
##$SIGF1= 3
##$SIGF2= 2
##$SINO= 400
##$SIOLD= 16384
##$SREGLST= <1H.CDCl3>
##$SSB= 0
##$STSI= 0
##$STSR= 0
##$SW_p= 3205.1282051282
##$SYMM= 0
##$S_DEV= 0
##$TDeff= 0
##$TDoff= 0
##$TI= <>
##$TILT= no
##$TM1= 0
##$TM2= 0
##$TOPLEV= 0
##$USERP1= <user>
##$USERP2= <user>
##$USERP3= <user>
##$USERP4= <user>
##$USERP5= <user>
##$WDW= 1
##$XDIM= 8192
##$YMAX_p= 0
##$YMIN_p= 0
$$ End of Bruker specific parameters
$$ ---------------------------------
##NTUPLES= NMR FID
##VAR_NAME=  TIME,          FID/REAL,        FID/IMAG
##SYMBOL=    X,             R,               I
##VAR_TYPE=  INDEPENDENT,   DEPENDENT,       DEPENDENT
##VAR_FORM=  AFFN,          ASDF,            ASDF
##VAR_DIM=   8192,          8192,            8192
##UNITS=     SECONDS,       ARBITRARY UNITS, ARBITRARY UNITS
##FACTOR=    0.0002768,     1,               1
##FIRST=     0,             0,               0
##LAST=      2.2672688,     0,               0
##MIN=       0,             -324973,         0
##MAX=       2.2672688,     250381,          0
$$ Real data points
##PAGE= N=1
##DATA TABLE= (X++(R..R)), XYDATA
0@%%%%%%%%%%%%%%%%%mJ2j6J6j6J6j6J9k4K9l2L6m1M5n2N6o4P2p8Q6r4J06j17
40f1J30j44J58j72J87k05K24k48K74k99L29l63M00m44M95n56O27p09Q08r35J098
61E94j312J602k011K624l608N358q982J8951q9912k48277L41488M3571q5998K08025
75A82113j10922j73723M7348M6534R2090n5583p6925J18003j01340r7677J33532
86C450p259P1663M6788k20609K4295K8985q8750L30440O1378l90575O2464J09678
98C1948j26664J62861R1201j65984p4677J4156J04225l885r1721J41148l1944
109E0664k02059J08991K2419m1741K02604l9701j45145J0949j13044J12463K42343
120B08743j54687q7270N4002j25327O5211J54813n6467o6856o7561J4514P2189
$$ plain form
0 0 0 0 0 0 0 0 0 0 0 0 0 0 0 0 0 0 0 -4 8 -8 8 -8 8 -8 11 -13 16 -16 20 -21 24 -28 28 -36 36 -42 44 -50 56 -61
40 -61 69 -75 83 -89 98 -107 117 -131 143 -156 173 -190 210 -234 261 -295 332 -377 431 -504 594
61 594 -718 884 -1127 1497 -2111 3247 -5735 13216 -76696 -324973 16515 60086 -25912 182113
75 182113 71191 -102532 -55184 -8650 83440 27857 -49068 68935 -32405 -130082 3450
86 3450 -3809 67854 114642 -105967 -81672 -52687 -141437 189003 250381 -140194 -77730 31948
98 31948 -94716 68145 159346 -6638 -81315 -67159 37066 33181 -58540 82608 50664
109 50664 -151395 -42404 -19985 -61726 140878 101177 -43968 -33019 -146063 -33600 208743
120 208743 54056 -33214 20788 -104539 -39328 115485 59018 -7838 -75399 -60885 11304
131A1304p2704Q4322J14513j75161k0448N9283j23829J14534J55945q6611l1477
142B9671q5349o5253J68694L7693n2897J7395j29265l3136J36392J5173J1761
153E0879k0472r4626K6106j7078r102J47540j2880o7935M0797j08405l3909J49282
165E0197J8451m070k8400j31154L2803Q5885R518N4915p6670j20726N1975K4628
177c2648L6193Q5285n9791m4365p63o5368N7414Q0771j6919K7175n4734r4413
189h2163N6855M0994K8179M2898j05749p3818M5940J7506P6605M4248r5733m1087
201d5325j3859j0675R5306L8928l0265L509o2638l7084N8639K8979L1454l907
213E3062q5146k1593J4039K7121R0936j4957r7823j9356j8546K4086J01964J4620
$$ plain form
131 11304 -61400 22922 137435 -37726 -58174 1109 -122720 -8186 147759 61148 29671
142 29671 -55678 -120931 47763 85456 32559 49954 -79311 -112447 23945 39118 50879
153 50879 30407 -64219 -38113 -55191 -64293 83247 70367 2432 43229 -65176 -99085 50197
165 50197 68648 64578 36178 -94976 -62173 23712 33230 88145 11475 -109251 -57276 -32648
177 -32648 3545 88830 29039 -15326 -16089 -81457 -24043 56728 39809 66984 12250 -82163
189 -82163 -25308 15686 43865 86763 -18986 -92804 -46864 -29358 47247 91495 -4238 -45325
201 -45325 -59184 -69859 25447 64375 34110 37619 -25019 -62103 -3464 25515 56969 53062
213 53062 -32084 -53677 -39638 -12517 78419 63462 -34361 -53717 -72263 -48177 53787 68407
225F8407m0620l4142n3884J8070N8654J9388K3799l0411p0108Q48K4807L7754
237B2562M3038l7915n8041k9326j3754P1073P1636k5134l3416m2929m7366M6060
249c3512O9561J8813p928m6887m1408J0047L0741M6447J2324n3915m3207j4069
261e2993J4938O2942L5419k7786m6494n1036l184O0942M8992J4633k2026n9328
273b4981k6977K9433M3251L3506r930m9216l6729j327L8938N0130L835l9240m9183
286c8490l1510K4159O0763L7310o196m4037m8483n555L9322M9163K0589k7720
298B9315m6062k3969J4227M5401L4721j4437m7944m1908n887L8823N2654J8948
310E3882k9844n2370l1245J4536M8699M3926K817l8489m2445r461L0066M3828
$$ plain form
225 68407 27787 -6355 -60239 -42169 16485 35873 59672 29261 -40847 -39999 -15192 22562
237 22562 65600 27685 -30356 -59682 -73436 -2363 69273 44139 10723 -32206 -79572 -33512
249 -33512 36049 54862 46934 47 -41361 -31314 -573 45874 58198 4283 -38924 -52993
261 -52993 -38055 24887 60306 32520 -13974 -65010 -68194 -7252 41740 56373 34347 -24981
273 -24981 -51958 -22525 20726 54232 44302 -4914 -41643 -42970 -4032 46098 49933 10693 -38490
286 -38490 -70000 -45841 14922 52232 46036 1999 -46484 -52039 -12717 36446 57035 29315
298 29315 -16747 -40716 -26489 18912 53633 39196 -8748 -50656 -56543 -17720 34934 53882
310 53882 24038 -28332 -59577 -45041 3658 47584 50401 11912 -30533 -39994 -9928 33900
322C3900J8860k5958m7924k9098J4691M5323L7419l525m4287m8458j1838L3364
334b7531N0842K8329j6734m6345l2380Q158M0332M0051J564l5422l8916j3854
346d1906K6990M6911J8927k5102m6930l4497P056M3274M5548R291m0604m4932
358c5974j0704J7724M4511L8480j9049m3618k3473J710L4757L8746J102l2225
370A1987m6469j9524L2150M1784K3882p042m9051m0862M561L5201M9634J2006
382D8257l5902k9461k0918Q557N7086K3576k7175k6318l2786n282M2324L2746
394C4704J0358k6873n5484j3136J8598K9171M9813l444n1287k6359r499K8980
406a4458N5574K04k3696k8851l8180L0898N0374J826N35l3397n0736J3050K4368
$$ plain form
322 33900 52760 26802 -21122 -50220 -35529 9794 47213 43688 -599 -49057 -60895 -27531
334 -27531 23311 51640 34906 -11439 -43819 -35661 4671 44722 46286 10864 -28052 -41906
346 -41906 -14916 31995 50922 25820 -21110 -55607 -48551 -5277 40271 49562 8958 -35974
358 -35974 -46678 -28954 15557 54037 34988 -8630 -32103 -30393 4364 43110 44212 11987
370 11987 -34482 -54006 -21856 19928 43810 36768 -12283 -53145 -48584 -13383 36251 48257
382 48257 12355 -17106 -38024 -29467 27619 51195 24020 -2298 -35084 -40366 1958 34704
394 34704 45062 18189 -37295 -50431 -31833 -2662 47151 43707 -7580 -33939 -43438 -14458
406 -14458 41116 41320 17624 -11227 -49407 -18509 31865 33691 34226 829 -49907 -36857 -12489
419a2489K8211L6502l3108m3395r838j2489M3745N3859j8484k3890l4258k5867
431e1501N3748L6860l708m184n8236k7215M3893J6325K7578J1916o0048j5394
443b9966K008j4618O2190L0576l9387o953l4198j9956O0324K9423K585k2212p0282
456e0466J0131M6268P300M2311k3626p8432J4352R016R429N8457k3792k5083J1608
469G473n7538J3866P2748j7711N950k92p1127M384M6112L5155K4375o7748m1942
482d6295K5041j7847N7601N9344q3412k2847K0769l7315M4347L1568k7288K9069
494C2735l7495m9080N5470L276O503N2630n8150n8394J1798K6745O9598p299o0681
507a2344R054n2283k038J23218k8873o3675M8095m1529k1885N8834j1560J8342
$$ plain form
419 -12489 15722 52224 19116 -24279 -34117 -46606 -2861 50998 32514 8624 -25634 -51501
431 -51501 2247 39107 35399 31215 -27021 -54236 -10343 5982 33560 45476 -14572 -29966
443 -29966 -27958 -42576 19614 50190 10803 3850 -30348 -50304 10020 39443 42028 19816 -50466
456 -50466 -40335 5933 13233 55544 31918 -46514 -32162 -23146 -13717 44740 20948 -4135 7473
469 7473 -50065 -36199 36549 18838 24788 24496 -46631 -42247 3865 39020 63395 -4353 -46295
482 -46295 -21254 -39101 18500 77844 -5568 -28415 -7646 -44961 -614 30954 3666 32735
494 32735 -4760 -53840 1630 4906 11409 64039 5889 -52505 -40707 -13962 55636 48337 -12344
507 -12344 -3290 -55573 -57611 65607 36734 -26941 21154 -20375 -42260 16574 5014 23356
519B3356J0537n9647J2404n069j3563Q9040N14p1046j5969k9768M4444O8177l4329
532A9081P696l3899q4448R3921N4361p5118L9531K921p0051L5833J3818k493L5779
545C6932k6350l931j6650o3384P1431O6125m4660p33m7081m6049P8376K2721K520
558B9267J5381r7183O74Q7476m1680J2714M5233o8940o082K1448k1578L5668Q113
571B0511J844J2391q9200q070Q6758j1199K1390Q813j00453Q097N4106M934M7796
584E7718m2447o7783N1807q068q128O6397l4128k7486K2558m1698P361L0310O75
597G088M6506m0667p5496M3476R555J3848O7656o2398o2343L2285Q26M6073L0280
610E6689o6653m32R89l1108N7090J0185l1159L2986l2087l5320K8281p202M0508
$$ plain form
519 23356 33893 -25754 -13350 -18419 -31982 57058 57572 -13474 -29443 -59211 -14767 53410 19081
532 19081 26777 -7122 -91570 2351 56712 -18406 21125 24046 -46005 -10172 3646 1153 36932
545 36932 10582 6651 -9999 -73383 -1952 64173 19513 18780 -28301 -74350 4026 26747 29267
558 29267 44648 -52535 -51861 35615 -6065 6649 51882 -17058 -23140 -1692 -23270 12398 20511
571 20511 22355 34746 -54454 -62524 24234 13035 34425 43238 -57215 -49118 4988 9922 57718
584 57718 15271 -52512 -705 -8773 -16901 49496 15368 -12118 10440 -31258 -23897 6413 7088
597 7088 53594 12927 -62569 -19093 -9538 4310 71966 9568 -52775 -20490 -19664 26409 56689
610 56689 -9964 -10396 -9407 -40515 16575 26760 -4399 28587 -3500 -38820 -10539 -17741 22767
623B2767L3583p0220j4093N933j2681P6017J5254o7860l409j9972O609O9738j6093
636B5573k0791O992m9206J5119L6224k2706L2542N332n0624P954j1150L248O6819
649D5326j3644l7372n026l7835L4002O2746k3070j1208k3778m1947M5523K6884
661B0601j1648K1977l2273l1040K6752j0449J5895L7763l0102j0982q539l0675
673d2720M5412L5357j9035j858m0714k4756N0168J8417P176J739n5336o843K9004
686c989l870L0536P744m0725J53p410o711M2054O164j1101k944m2260k13M2314
700I742P978J4181j3105n1406L313K0749J5162L0725k0383l5387K570p650J7808
713e703L5565j3637j2633r713k5227J8155K6881N519Q809k8095l2669J3102J4487
$$ plain form
623 22767 56350 -13870 -27963 -22030 -34711 41306 56560 -11300 -14709 -34681 -28072 41666 25573
636 25573 4782 11774 -37432 -22313 13911 -8795 23747 29079 -21545 -13591 -24741 -21493 45326
649 45326 31682 -5690 -10716 -48551 -14549 48197 25127 13919 -9859 -51806 -6283 20601
661 20601 8953 30930 -1343 -32383 -5631 -16080 -185 37578 7476 -3506 -12045 -42720
673 -42720 2692 38049 19014 17156 -23558 -48314 1854 20271 27447 29186 -26150 -32993 -3989
686 -3989 -7859 22677 30421 -10304 -10151 -17561 -24272 17782 23946 12845 9901 -32359 -32572 9742
700 9742 17720 31901 18796 -32610 -29297 -8548 6614 37339 16956 -18431 -15861 -23511 -5703
713 -5703 29862 16225 3592 -6121 -31348 -13193 13688 19207 28016 -79 -32748 -19646 -5159
726e159K2324K0093l0927k7101k082K612L1420J9704j9377j3669j8790o658K9717
739B107J6594J359m703l0534j3225J7659J3890K1906K430l2088j7224j526J2877
752a0478L1648O229j9663j7638j7643Q545L0177J0981l685j6381k5428J29J9278
765c929J7717J3842j3808k7158q952L902J9650K4355l194k1747j8573p536J6781
778h650K4005Q149r145k3606j7121J0229K0577J5962L207k0359k2498l745J3574
791i421K2832J2407j2011k0849j5534J795K2943J9289p34j6139k1435p135J4014
804i978K2116J2216q808k3008j4918L782J8555K0795K465j7861k1439p386J2218
817a1251K1890J2638p496k0888j7227L004J9253J8246L662j5107k2219p400J1879
$$ plain form
726 -5159 17165 37258 6331 -20770 -22852 -20240 11180 30884 11507 -2162 -20952 -27610 2107
739 2107 18701 20060 15357 -15177 -28402 -10743 3147 25053 27483 -4605 -21829 -23355 -10478
752 -10478 21170 27399 7736 -9902 -27545 -19000 11177 22158 18473 2092 -23336 -23207 -3929
765 -3929 13788 27630 13822 -13336 -22288 -18386 1264 25619 22425 678 -17895 -25431 -8650
778 -8650 15355 23504 14359 -9247 -26368 -16139 4438 20400 23607 3248 -19250 -22995 -9421
791 -9421 13411 25818 13807 -7042 -22576 -20781 2162 21451 20717 4578 -16857 -23992 -9978
804 -9978 12138 24354 15546 -7462 -22380 -18598 -43 20752 23217 5356 -16083 -23469 -11251
817 -11251 10639 23277 15781 -5107 -22334 -19330 -77 18169 21831 6724 -15495 -22895 -11016
830a1016K0887J3411p046j9953j7417Q80J8786J9692L314j3760k0703j0346J0856
843a2415K0776J3142m848j9749j6960R65J6014J9715O248j5567j9404r472P540
856a4015K0996J5000n081j7685j8128k083J7577J7885O631j0183k2890j0333R931
869a2378J7441J5951l254j9774j4573l092J3472K2759M265j1922j5916j4817O263
882a5575K1709J1761L18j5500k2172L92J4050J5941J2452j2815k2412o936L794
895a4993J8890J7901p088j3476j3725j0587J8137J9094J510k312j8545j7058R189
908a3063J2920J6184P179k3328j6369N60L278K4919J3412j8290j3760j2344J198
921a7504K4373Q529j810m409k6055l678J9584M622J2488K127k5294r226M03R939
$$ plain form
830 -11016 9871 23282 16236 -3717 -21134 -20254 -1468 18224 21538 7778 -12925 -23271 -12415
843 -12415 8361 21503 16655 -3094 -20054 -19089 -3075 16640 22888 7321 -12083 -21555 -14015
856 -14015 6981 21981 16900 -785 -18913 -20996 -3419 14466 21097 10914 -11976 -22309 -12378
869 -12378 5063 21014 17760 -2014 -16587 -19679 -6207 16552 20817 8895 -7021 -21838 -15575
882 -15575 6134 17895 18213 2713 -19459 -19067 -5017 10924 23376 10561 -11851 -18787 -14993
895 -14993 3897 21798 14710 1234 -12491 -23078 -4941 14153 15663 13351 -5194 -22252 -13063
908 -13063 -143 16041 23220 -108 -16477 -15917 -12639 12280 25692 7402 -6358 -18702 -17504
921 -17504 6869 15398 13588 9179 -16876 -20554 -970 3652 16140 18267 -7027 -16253 -15850 -5911
935e911K7390k517j8607o350j8963J0100L4377j377r452j0359k0800J0283J5839
948C653M796J3473j7928k2441J2007l625O231K7720j0048j7482p301j3019K1745
961b219K1157o533K896k5521k3556L1871J5403k480P557k4983j3684J3035J013
974f044K0181N688k6636O578o334j8178L1380J3316j2058J335k5546q073K5161
987G70N716J7647n231m5369O729K0804l296K3851m905k9866M671l710P200K3416
1001A8427j5700K477N572l5758R401K5564o612J6592p398l4892O288O113J7608
1014G682K8294l3983k1666J4211j2334K1883K5254k8532m826j637j2078K2273
1026D541q37l052K3338k7945j8470K1043r727J7993K6326l3006j5259j445k346
$$ plain form
935 -5911 21479 18962 355 -5995 -24958 -14858 19519 18142 8690 -1669 -22469 -12186 3653
948 3653 8449 21922 3994 -18447 -6440 -10065 -3834 23886 13838 -3644 -10945 -23964 -2219
961 -2219 18938 12405 15301 -10220 -33776 -1905 13498 11018 18575 -6408 -20092 -7057 -6044
974 -6044 14137 19825 -6811 -233 -6567 -24745 6635 19951 7893 9228 -16318 -24391 770
987 770 6486 24133 18902 -26467 -19738 1066 -2230 21621 16716 -13150 -8479 -12189 -4989 18427
1001 18427 2727 5204 10776 -24982 -15581 9983 3371 19963 12565 -22327 -16039 -9926 7682
1014 7682 35976 1993 -19673 -5462 -17796 4087 29341 809 -4017 -5654 -17732 4541
1026 4541 3704 652 23990 -3955 -22425 -1382 -11109 6884 33210 204 -15055 -16500 -18846
1039a8846M0429L448k9345M329j9023j479M0653q910j0765P475k2615O062J0814
1052B227j2304K6487J680k8901R438j3231o158M5181k643k1922l152k5320J7280
1065a1338L4290j3313J421j2308k8780K8815J2088j2078J7901j5294j4478J5620
1077B546j6578Q755K6765j7674J561n319l2252K7502K5058j0565O379k6923k0470
1090c1215L3067N870M557P374l5983K98K0035j2444J8147O109k3508J2041r220
1103d872j5881K7657J967j923J0354l4191p232K7133K14J7037k937l9611O985
1116a5300J1986J980K5361j4936k3153J3134j0532N530K2011j5421M195M265k8018
1129a8898R265J2587k950K2189j3731k8984J0695M43J4252K4045k6728j4767N583
$$ plain form
1039 -18846 21583 25031 -4314 15 -19008 -20487 20166 11256 491 7966 -14649 -8587 2227
1052 2227 -10077 16410 18090 -10811 -1373 -14604 -20762 24419 21776 -146 -3298 -28618 -11338
1065 -11338 22952 9639 11060 -1248 -30028 -1213 10875 -1203 16698 1404 -13074 2546
1077 2546 -14032 -5277 21488 3814 5375 56 -32196 -4694 20364 9799 16178 -10745 -31215
1090 -31215 1852 7722 12279 19653 -16330 -16032 4003 -8441 9706 15815 -7693 4348 -4872
1103 -4872 -20753 6904 8871 6948 17302 -16889 -24121 3012 3226 20263 17326 -22285 -15300
1116 -15300 -3314 -1334 24027 9091 -14062 -928 -11460 -5930 16081 660 4855 9120 -18898
1129 -18898 -9633 2954 4 22193 8462 -20522 -9827 -9384 4868 28913 2185 -12582 -6999
1142f999r561K3233J4072k1501L145p624j1533K1014j157j223J5600k1316j0349
1155a4199J0688o629J9201J4115k4572o463n258k253L0839K291j6665Mj6815J987
1169a3729K4938m593l3O30k0442N274P168l464J8617k782j8116K323r177L996
1183i390K5832m264r004n617j7952J3074J9452l831K949j2581j6710J3593O064
1196A615K512J0240j3469r524L917o203J2005J3816r616l018r306j0660J7036
1209f55J0656l55Q20j8088q802J3750M985Q467J799j8102m371L450J328J4260
1223I142K310j0644k447q886n53J5772M307o4m229j5669j014J0209O256R174o158
1238G506j6040p88K432O914J2623m096j0584m598m925P792J1999j2j586q242j0882
$$ plain form
1142 -6999 -16560 6673 20745 -756 2389 -5235 -16768 4246 3089 1866 17466 -3850 -14199
1155 -14199 -3511 -10140 9061 23176 -1396 -7859 -13117 -15370 15469 17760 1095 1099 -15716 -13729
1169 -13729 11209 6616 6583 7213 -13229 -7955 -787 -4251 14366 11584 -6532 -4209 -13386 -9390
1183 -9390 16442 12178 3174 -2443 -20395 -7321 12131 8300 11249 -1332 -18042 -4449 1615
1196 1615 4127 14367 898 -8626 -4709 -10912 1093 14909 5293 2275 -7031 -17691 -655
1209 -655 10001 9646 10466 -7622 -16424 -2674 2311 10778 12577 -5525 -9896 -6446 -5118 9142
1223 9142 11452 808 -1639 -10525 -11078 4694 9001 8937 4708 -10961 -11975 -1766 4490 13664 7506
1238 7506 -8534 -9322 -6890 24 12647 8551 -2033 -6631 -11556 -3764 8235 8223 6637 -1605 -12487
1253a2487N297R037N544M284r148j1238j23L700J0629P189q035q404n131j253
1267a0139J1504Q756k187n791r373m264P472Q488N299j310j1374o572K035O152
1281a304R660K085q846p985l302M231J0857M612l741p894q744J186R419P305J983
1296I522n730j0091l453M780Q166O665k753q443o314q50P501R248P43o061q350
1311e420m826M362R199N863j678q590p246m08O516Q992K921n740q461m297L116
1326e697Q615O099j855p772o920j116O820Q349K337m308q940n480L572Q165O521
1341H390q12p144o749k283O020Q663K947n094p208n401K253Q789N884j118o414
1356G23q339j127O105P328M516m522q368m506J641O956P858j129o084o343k627
$$ plain form
1253 -12487 -7190 1847 7391 11675 2527 -8711 -8834 -5134 5495 12684 4649 -3755 -8886 -10139
1267 -10139 1365 10121 7934 2143 -7230 -11494 -4022 4466 9765 8455 -2919 -9491 -7456 -1304
1281 -1304 8356 10441 1595 -6390 -9692 -5461 5396 10008 6267 -1627 -10371 -9185 234 7539 9522
1296 9522 3792 -6299 -9752 -4972 3194 9859 7106 -1337 -7651 -8501 -1000 8248 8991 2930 -5420
1311 -5420 -10246 -5884 3315 9178 7500 -1090 -8336 -8744 -2228 6764 9685 3945 -4516 -8813 -5697
1326 -5697 2918 9017 7162 -610 -7530 -8646 -1826 6523 8860 4552 -4388 -9868 -6296 1869 8390
1341 8390 7578 434 -6315 -8598 -2578 6085 9032 3938 -3270 -8671 -6418 2371 8255 7137 723
1356 723 -7616 -8743 -2638 4690 9206 4684 -3684 -8190 -6549 407 8265 7136 1052 -5291 -7918
1371g918N072Q549K519l487p866n954L475N944O460K004q330p652K9K973P368
1386C186N755l959o658n225j18Q253N461o20k846q567l822O234O546M774k395
1401E999r598l474K76L792J1523k46r304j646l332j65R937M009l010n247o479
1416f965J782M659M263N961o028j1641Q89K830N447Q749n050o618k965n100R676
1431a11R036o110n87j562r796M640Q544J732k27o072m637j80m22J1641O012j2278
1447c77l581r81m259J2360O328o160j950q110j161J1788q90k76M193j0795m043
1462g914O700J487M883R13n112k972q986M924J6215n270l866J951j3608K625J4791
1477F761j563n28l472r734O187L168r18R048n801q893L919l493K566Q959j766
$$ plain form
1371 -7918 -2846 5703 8222 4735 -3131 -9085 -5610 334 6794 8798 468 -7184 -7155 -4182 3186
1386 3186 8941 4982 -1676 -6901 -7019 1234 6695 6075 3229 -5338 -9160 -2926 3620 8394 5999
1401 5999 -3599 -7073 -6797 -3005 8518 8272 -1032 -2678 -6010 -6175 3762 7771 4761 -486 -6965
1416 -6965 -5183 -524 3739 9700 3672 -7969 -7080 -4250 1197 9946 4896 -1722 -4687 -9787 -111
1431 -111 8925 2815 2228 666 -9130 -4490 4054 5786 5559 -513 -5150 -5330 -5752 5889 11901 -377
1447 -377 -3958 -4939 -9198 3162 9490 3330 1380 -6730 -7891 3897 3007 2731 6924 -3871 -7914
1462 -7914 -1214 273 5156 6069 957 -2015 -11001 -6077 10138 4868 1002 2953 -10655 -8030 6761
1477 6761 5198 4670 1198 -8536 -2349 819 -99 8949 3148 -5745 -1826 -5319 -2753 6206 4440
1492D440N55q272j0329J3459N103l593Q907j1529j2823J3645M348m76L984r606
1506b187k884L630l563R474K497r034M439m926p437J0151K579K348K968j5615
1520g560p10R412l530J1518J433j9910K715O466j392R605k816q600K817n564K998
1535c118Q794p190N346K252j4662L878M171j090J2450o016j2895N475l103N724
1549A6J4735j3357p107L973o016R381O799r049K561l345o202R574l774q9J1685
1564I785r981m995M501o739J0385R283j2646j497l436m108J6944J453r470K602
1578B081r289K64J2614n469J371L182j0098M094J514o581J1672Q27p966L359q674
1593g099L99J5732l519l237j222j3004P652J0803m410L583n852r442J0585p56
$$ plain form
1492 4440 4995 -3277 -13606 -147 4956 1363 10270 -1259 -14082 -437 3911 3435 7419 -2187
1506 -2187 -5071 -1441 -5004 4470 6967 -2067 2372 -2554 -9991 160 2739 5087 8055 -7560
1520 -7560 -8270 1142 -2388 9130 10563 -9347 -6632 -166 -1558 8047 5231 -3369 -552 -6116 -3118
1535 -3118 5676 -1514 3832 6084 -8578 -4700 -529 -1619 10831 4815 -8080 -2605 -5708 16
1549 16 14751 1394 -5713 -1740 -7756 1625 8424 -625 1936 -1409 -7611 1963 -1811 -1900 9785
1564 9785 -196 -5191 -690 -7429 2956 12239 -407 -1904 -5340 -9448 7496 8949 -521 2081
1578 2081 -7208 -6944 5670 201 1572 4754 -5344 -1250 264 -6317 5355 6182 -1784 1575 -7099
1593 -7099 -6700 9032 5513 2276 1054 -11950 -4298 6505 2095 5678 -174 -9616 969 213
1607B13k148Q931p601k130N049q565M615Q279n369L093n382r699J0103M871r51
1622C309N031j2427o018J0344q26M206K943j1396K032L173m698Q072J44o202N611
1637C298n614m627R392q24K959K093j2916j70N554k59Q850k227j1406L186l75
1652c086J230R052n564l815K898n495L406N793m664L811p79q878L579J201J290
1667b1Q197n588o986J674k732O187P173p197k379q01l304Q128K185m189K633m637
1683a657l665O034l65J456M145o827k213M30k117P544L440o286p68l581m68Q405
1699C507L25k255n11o144J713N441j090K953q71o823J187Q50j13O014q19l752
1715c88m71m048K421O168j315p24j943n472L521M479N97J658m595m001K350L26
$$ plain form
1607 213 -1935 6996 -605 -2735 2314 -6251 -1636 6643 1274 4367 -1015 -10714 -611 4260 3309
1622 3309 8340 -4087 -10105 239 -587 3619 6562 -4834 -2802 371 -4327 3745 3889 -2313 3298
1637 3298 -2316 -6943 2449 1625 4584 6677 -6239 -6409 -855 -1114 7736 5509 -5897 -2711 -3086
1652 -3086 -1856 7196 1632 -2183 715 -4780 -1374 4419 -245 3566 2787 -6091 -2512 -1311 -21
1667 -21 8176 2588 -4398 -2724 -5456 731 7904 707 -1672 -2473 -5777 2351 4536 347 2980 -1657
1683 -1657 -5322 712 347 1803 5948 -879 -3092 -2662 -4779 2765 6205 -81 -849 -4430 -4898 3507
1699 3507 3832 1577 1066 -5078 -3365 2076 986 3939 3068 -3755 -2568 -1718 -1831 4183 3364 -388
1715 -388 -859 -4907 -2486 3682 2367 1643 -300 -5772 -2251 2228 2825 4483 -112 -4113 -1763 -1437
1731a437K827L366l618k792j3k403L685L757j275j063l107k448M115K374J159
1746C127J39n136k243K456J808L071R15m329j658j116L52M508J174k188o44k993
1762b757n83L826J557O29j392m143j19J913K210L311j816l997j083m20K059M141
1778C336m30k356k031j823J536K886J110k08k347k835R23K226K022J692k771k624
1794a694r83Q66L284K245j478k383k190r32K581K916J84j440k721j195J371K272
1810G03J964l76l065j631j01J976K870Q85j551l081j492P25L081J876l59k138
1826B86k712n40J906K465J442j646k657j357Q57K763K237n85k399k002n35J782
1842f95K459J019j031k496j965J097J858J338L33j621k612K5J624K134J101j010
$$ plain form
1731 -1437 1390 4756 1138 -1654 -1667 -4070 -385 3372 2097 1034 -2073 -4521 -406 1968 3127
1746 3127 3266 -1870 -4113 -1657 151 3222 4137 -192 -1850 -2966 -2614 1894 3068 880 236 -2757
1762 -2757 -3340 486 2043 2672 1280 -2863 -2982 -1069 1141 4452 2636 -1361 -2444 -2864 -805 3336
1778 3336 2906 550 -1481 -3304 -1768 1118 2228 2020 -327 -3162 -2239 -13 2009 3701 930 -1694
1794 -1694 -2677 -1811 1473 3718 2240 -143 -2333 -3265 -684 2232 2416 976 -1745 -2940 -1569 703
1810 703 2667 2291 -774 -2405 -2506 -530 2340 3225 1674 -1407 -2899 -2174 907 2783 2424 286
1826 286 -2426 -2966 -1060 1405 2847 1201 -1456 -2813 -1956 807 3044 2459 60 -1942 -2477 -695
1842 -695 1764 2783 1752 -744 -2709 -1612 246 1584 1917 296 -2316 -2291 -667 1467 2568 1558
1858A558k627j278L70K507K169j51k025k220q58J327J916J560p08l019q24R45
1874a358Q00K201J113k698k118J03R65K087J254j35k534k292Q02K259Q37R43j407
1891H22k687J82O98J449K196k001k037L66j099J304L427l20k050j216j143P72
1907a337J974J744K64l447j457J436J04J553J634k733j326K56m46K481J698j908
1923D90K17j988j742L489J568k69o14j799j739O78K197K537j538l388J423j152
1939a630k27M519r00k823O02j302L62K744l07O24l23l568O95J513L04K282r16
1956A649k887n90k59K915K039l047j26J82l378L484K891k983Q38m08k499J658
1972e21P06O50J955k682j185O17j736L003K173k965m87j641l43M763p07j529J880
$$ plain form
1858 1558 -1069 -2347 -1977 530 2699 2548 523 -1697 -2555 -1228 688 2248 1540 -1479 -2303 -1358
1874 -1358 -558 1643 2756 58 -2060 -1957 -992 1095 2349 2214 -320 -2612 -1810 449 1286 2229 822
1891 822 -1865 -1683 -985 464 2660 659 -1378 -1012 -2111 -807 2620 2300 250 -966 -2109 -1337
1907 -1337 637 2381 2645 -802 -2259 -823 -719 834 2468 -265 -1591 -1335 -1781 700 2398 490
1923 490 707 -1281 -3023 466 2034 1765 1151 -648 -2387 -1709 488 3025 1487 -1901 -478 -1630
1939 -1630 -1857 2662 1762 -1061 -459 -1761 -1399 1345 1038 1662 1339 -2229 -1534 -21 283 2565 1649
1956 1649 -1238 -1828 -2087 828 2867 -180 -306 -124 -3502 -18 2873 -110 728 320 -2179 -521
1972 -521 185 835 2790 108 -1077 -460 -2196 807 2980 15 -472 -2113 -2456 2307 1600 71 1951
1989A951m615J25M479j726J32K106l281j78N44j284L427j91j646J051l490K37
2005b359M567j237r3p02l704K634K399j492K380j919l713M064l24j683L572k265
2021A25o57J428k996J553K376j882J647j419m148L907J347n32J993m198j617L862
2037G89j141J581J259m458J479J617k980K667J15j985L018k602j782L165j343
2052f01J728J633n167M48J842q48M194r21n054K438q65K07L983l112j033K195
2068A067k460J017J745l264L110L98m069K224n30l28M679k763k931J744k037L027
2084F29L044m324kP11k626M232o39k477K564j582j055K781k134M48L106l425J63
2101e86M24k360L746J473k885R41k510p19M825j157j150P06k955J577K524k912
$$ plain form
1989 1951 -2664 -2539 1940 214 346 2452 -829 -1007 -463 -1747 1680 1489 -157 894 -2596 -2359
2005 -2359 2208 971 878 176 -3528 -894 1505 13 2393 474 -3239 825 501 -1182 2390 125
2021 125 -532 896 -2100 -547 1829 -53 1594 175 -3973 -66 1281 749 2742 -1456 -3073 789
2037 789 -352 1229 2488 -1970 -491 1126 -1854 813 928 -1057 1961 -641 -2423 742 -601
2052 -601 1127 2760 -2407 -1959 -117 -965 3229 2308 -2746 -308 -1173 -966 3017 -95 -1128 1067
2068 1067 -1393 -376 1369 -1895 1215 1613 -2456 -232 -762 -1090 3589 826 -2105 -361 -2398 629
2084 629 3673 -651 -653 58 -2568 1664 1025 -1452 1112 -470 -1525 1256 -878 -430 2676 -749 -586
2101 -586 -162 -2522 1224 2697 -188 753 -1757 -2476 2349 1192 42 748 -2207 -630 1894 -1018
2117a018J474K76k509K417n72j958L622n97j391J246l350J017L261j454O05o82
2133C87l206K749J256j295J301j657j638K942q84K80J367k521J165P45l064J847
2149b26J442j409J850j991j812K455n5M86J172l458k87K200o01J467o6k518Q35
2166e16M37o46K379j339p39J869k478M4J823j268J302M30k351K48Q49k95J971
2183A720j233j913J275r14P68J875j635m52O99j463J357O33r40J461q79j561J375
2200A73n08q8K195j699r40L58m57J591P21j466l0m93l05J663O8q53Q12j237k25
2219g20J219n76P98N72j820J39K58o57J924q4j152O4j142L95J808p85K96l77j363
2238a203P54J325o76O50p04q65N27M00l36J153p11q09J67n37Q06Q90n69o8m46
$$ plain form
2117 -1018 456 732 -1777 640 68 -1890 1732 1135 -256 990 -2360 -1343 1918 464 1069 387
2133 387 -2819 -70 1186 -109 1192 -465 -2103 839 -45 235 1602 -919 246 991 -2073 -226
2149 -226 1216 -193 1657 -334 -2146 309 254 740 1912 -1546 -1833 367 -234 1233 1167 -1351 -516
2166 -516 -79 -725 1654 315 -424 1445 -1033 -989 834 -434 868 1298 -1053 -805 44 -251 1720
2183 1720 487 -1426 -151 -1065 -297 1578 -57 -509 190 -1273 84 717 -223 1238 359 -1202 173
2200 173 -335 -423 1772 73 -867 -509 -966 625 1346 -120 -150 -643 -948 715 783 -70 742 -495 -720
2219 -720 499 -77 721 1293 -527 -388 -130 -787 1137 1053 -99 -35 -1177 -782 1026 241 537 160 -1203
2238 -1203 -449 876 200 850 146 -719 -192 208 -128 1025 314 -495 -328 -865 -59 831 262 194 -252
2257b52o37P57L93O6M30p01r27J125l29L72N62q16l62Ol15J194k73J97m3r73r0
2278f16Q76J64J51k18n30n90P18K79L83J37j091N3L0K83P97n21m43n4m37M39O06
2299D16j52J70k54p21J32N63j31N58k16r67L79m1L34N23m28m97j91R2O11K61j60
2320B81j95l36m89O85K17J21J06m83k75k16M96M02L77l71m93k33L97L59K42j04
2340D88l71m28k48L73N67P6j78m31JJ27K43N59k67l19m27J01K85N0N47n51n47
2361c50m56O36J15M53jn95m03K33M23J17K68l31k08j09k94O95J39k85j93m18P0
2382d94P67J92n2m77n19J79L72K65L74m16o49l1K24J79O23K7n58N7r62Q54N24
2403D79k47L6p6j031P42K87k51N25n97k89k6k6O19O10p09m00K11k40M71N75m10
$$ plain form
2257 -252 -889 -132 261 327 757 56 -871 254 -75 297 859 43 -319 -313 -628 566 293 490 447 -526 -616
2278 -616 260 424 575 357 -173 -763 -45 234 617 754 -337 -284 -254 29 826 305 -138 -192 -629 -190 416
2299 416 264 434 180 -541 -409 154 23 581 365 -602 -223 -264 70 593 165 -332 -523 -431 180 441 281
2320 281 86 -250 -739 -54 163 284 390 -93 -368 -584 -88 314 691 320 -173 -406 -9 350 592 488
2340 488 117 -311 -559 -186 381 457 279 -152 -151 -24 219 778 511 192 -235 -134 151 201 748 197 -350
2361 -350 -806 -170 -55 398 397 -198 -601 -368 55 172 440 109 -99 -208 -502 193 332 47 -146 -564 -494
2382 -494 273 465 413 -64 -583 -404 -32 233 607 191 -458 -489 -265 -86 537 564 6 63 -899 -45 479
2403 479 232 268 192 -839 -97 190 -61 464 -133 -422 -448 -474 145 755 46 -354 -143 -383 88 663 253
2424B53n6o68J4M45M3j1P06q48k56L38qM69K69q33L8j69l60J062Ln13L53r26P9
2447e76Q12J65KK65j673O50N7l0J201n84q22O42l60r8P41j97J69k14j081P76M12
2468B57j87R06q56j367J039K58J26J143j212p94P04n03J013K38j089M73Jj035
2486h85J097j68Q4P08j416j71Q59m05R52K88j701K95R6R6J047m12j164R64p58
2505e94J27J248q48j6N93j168N75L98o62J399n63j207Q24o33M35J560r67r89M56
2524c2r32J219P39j252M94m83m32J041O2p85J247r70n09P04q90P85J154j433J46
2543a27j68r59J857J60q30M53j330K27J488o59K60L8j178M44N32q66J171M2p14
2562a59O81j098o1J437m83Q9J42j936Q79J245o65R43r89j072J064K66j14P43r72
$$ plain form
2424 253 197 -471 -457 -12 31 20 726 -122 -378 -40 -48 421 690 -143 -105 -274 -634 428 431 -82 271 -655 -576
2447 -576 236 401 403 668 -1005 -355 -298 -328 873 289 -533 109 -251 -349 392 195 364 150 -931 -155 257
2468 257 70 976 120 -1247 -208 50 176 1319 107 -687 17 -486 527 765 -324 149 150 -885
2486 -885 212 44 128 836 -580 -751 108 -297 655 943 -758 -463 -367 -271 776 364 -800 164 -594
2505 -594 -467 781 -67 -83 510 -658 -83 315 -347 1052 489 -718 106 -527 -92 1468 501 -488 -32
2524 -32 -964 255 994 -258 236 -247 -679 362 424 -361 886 -84 -593 111 -779 6 1160 -273 -127
2543 -127 -295 -1254 603 763 -67 386 -944 -717 771 112 372 410 -768 -324 208 -658 513 555 -159
2562 -159 522 -576 -637 800 317 406 548 -1388 -509 736 71 1014 25 -1047 17 283 169 912 -60
2581f0n79J060j078N52R32j286Q46l31j346J212N56r8Q38j212j011Q46J17O59
2599F17K71j754K44L98m88J525r7j003P31r45l10J361n99M70M56j639k6O45l2
2618a75J415m91j426M26l83N42J203p28n94O6p78O58J023r86N07j50j305J102
2636g4J40j72J021o54r43N40o99P07J563j338l98o6o22J349K98n89J87r66l12
2655a028J542m75K38N62j262j56K24n9J058N15j190k10p42j7J878j20m39q1j200
2674i62L90J005j09J27j39r83P65k73k4J037n99l75K09r30N26R46l68K38n25j125
2694a169P94O43J68K45r25o40N50J65N89O33j220l93Ok02J179K46l83J61r03m86
2714i42Q69J22M23K51j239l70O24K50R01j72j170k29L4J45J397l64j93k23j003
$$ plain form
2581 -60 -639 421 -657 -105 827 -459 387 56 -1290 -78 478 380 1218 6 -1005 -159 -42 617
2599 617 888 -866 -622 -224 -712 813 716 -287 444 -501 -811 550 -49 421 877 -762 -788 -143 -175
2618 -175 1240 749 -677 -251 -634 -92 1111 383 -211 -145 -923 -265 758 -228 279 129 -1176 -74
2636 -74 66 -106 915 261 -682 -142 -841 -134 1429 91 -307 -373 -995 354 652 63 250 -716 -1028
2655 -1028 514 39 277 839 -423 -579 -355 -414 644 1159 -31 -241 -983 -1000 878 758 319 238 -962
2674 -962 -572 433 324 451 312 -671 94 -179 -203 834 235 -140 69 -861 -335 611 243 481 -44 -1169
2694 -1169 -375 268 436 681 -244 -884 -334 -169 420 1053 -167 -560 -554 -756 423 669 286 447 -456 -942
2714 -942 -73 49 472 723 -516 -886 -262 -12 889 717 -453 -682 -648 -503 894 530 337 114 -889
2733h89K05O62N25l2k17j104L11K27O74M34l14p35l32J39Q29O87n91l02o98m20
2753i41Q07K91K11K95j009n70N02J50Q07L26j002l92k71M83M62O76k85p77m55
2772f92k72J205L44M8m84q28J77L90N12L23j71o78k14l88O17R54l45j21q56k61
2792g40M18Q10N59n29n57p97J49O92N02J11j75j106j85M80O31P51j40p87q68K26
2812e55J51Q81L37n02r07m8M46Q54p9J51r78l57RM46N23L05m22r99L4J37O43P94
2834H64l84n58o62L7O56O63L60o39p13l46K21R92L72n82n9o62MK23J000k4n87
2855A76q53l90O73P16M45j16n01q40M4M55Q08M61r28m63n09K55O71Q20l34n82
2875Hn01k35K86R03L15m44p03l93L21L54R67j16j112j17l07O58M93J72l52l19
$$ plain form
2733 -889 -684 -22 503 471 254 -850 -539 -312 362 796 482 -253 -585 -446 383 1070 479 177 -521 -941
2753 -941 -134 157 368 663 -346 -916 -414 -264 543 869 -133 -525 -796 -313 149 825 540 -237 -692
2772 -692 -964 241 585 633 149 -679 -502 -112 400 723 552 -126 -340 -728 -111 843 498 377 -479 -740
2792 -740 -322 488 1047 518 -39 -836 -687 5 507 618 443 -663 -848 -368 263 1014 874 87 -781 -555
2812 -555 -404 477 814 312 -595 -643 -197 657 578 729 -249 -606 -597 -151 372 677 255 -744 -710 -573 70 864
2834 864 480 -78 -740 -703 -47 616 976 337 -376 -722 -501 491 863 281 222 -440 -436 -213 787 763 176
2855 176 -677 -1067 -394 322 767 651 150 -690 -646 -191 617 1078 150 -313 -822 -567 104 924 590 8
2875 8 -493 -728 -442 461 776 332 -371 -764 -443 -89 878 762 -350 -467 -774 -116 377 549 197 -122
2895a22p41J00R13L14K16m18q95k78N41N23P93l36q54n41j05J021O59J01q30o06
2915e45l14M09R38M57m54o82p99M32M05O38M82q03p13l72N08Q80N16n51p17k88
2935e73l42J064O77l37N6q27p64J120K14N04J4j127m11JL06J204o2m79l60r29
2955a051M42J337O7l83k44j039J24R07J67P23o90j008j75J88N34J064n00l90o47
2974e74o61Q66J100j69l7p40r75Q36P42J38N05j072r27O50p3J091N88j166k79
2993a57l15o34J143Q57j31k10j401j85J333J97M20j95j494k99Q23L28J175k64
3011I91j065k70m77J88J601k03m83j63j269L97J038M0Q96o27j622M29K17N09J362
3030A489j223r58K47l37R63Q55n66m11m74p01J118J76R8J122j581p25Q04o31J192
$$ plain form
2895 -122 -863 -763 150 464 680 262 -633 -911 -370 153 946 610 -244 -785 -890 131 790 891 61 -545
2915 -545 -859 -450 488 945 491 -191 -990 -558 -153 485 967 164 -549 -921 -413 467 983 432 -285 -573
2935 -573 -915 149 826 489 545 -282 -1046 74 288 792 806 -321 -732 -731 -425 779 717 238 -122 -1051
2955 -1051 -609 728 795 412 168 -871 -747 160 327 1050 360 -648 -823 -635 -101 963 463 73 -574
2974 -574 -1235 -369 731 562 525 -215 -1190 -354 388 526 1031 -41 -968 -318 -391 700 1288 122 -157
2993 -157 -472 -1106 37 894 763 553 -848 -1033 300 497 917 722 -772 -1071 -248 80 1255 991
3011 991 -74 -344 -821 -633 968 765 282 119 -1150 -753 285 325 1221 594 -1028 -599 -382 127 1489
3030 1489 266 -692 -445 -782 181 1036 470 59 -415 -1116 2 178 276 1398 -183 -908 -104 -735 457
3049D57J073j611n98Qk92J570N96j120o1j043k31J842k38K23M8j374M4P56k39
3068a90J181j17j162K50n90j94J741M1r87l4j246N69J646j91l22k30j585J052
3086c68N69K56P01j177n82K84j51L83J199n17m47n78j134J498J012l80K38j257
3104d51q51J116J95O36P19j673k48N8j41J488M74j388L3l84q50J689M13n18L90
3123G07j596l32J279p5R88m34j461K07l1N81J290m71j138K55p08P65J127o53M58
3142G58o09j366O21O50J93J045j186j161N29j75J070J100j310p64K36l32J053
3159C52O59o39n4p63m68J013K22L17L68j333o35O27j56J401M04j452k79m53PJ460
3179E98K99n25l41j101J78J299J8J42k8j461K36N94K7J373p14p39m49m49O73J317
$$ plain form
3049 457 1530 -81 -679 -671 -963 607 1203 83 22 -1021 -1252 590 352 575 623 -751 -707 49 -190
3068 -190 991 874 -288 -38 -628 -822 919 960 -27 -61 -1307 -738 908 717 395 165 -1420 -368
3086 -368 201 457 1158 -19 -601 -317 -468 -85 1114 597 150 -428 -1562 -64 948 568 806 -451
3104 -451 -1302 -186 9 645 1364 -309 -557 -499 -640 848 1322 -66 -33 -417 -1267 422 835 317 707
3123 707 -889 -1221 58 -17 971 537 -924 -717 -748 -167 1123 652 -486 -231 -939 -174 953 300 758
3142 758 149 -1217 -596 54 247 1292 106 -1055 -526 -701 369 1469 159 -605 -369 -701 352
3159 352 1011 372 318 -445 -913 100 322 639 1007 -326 -961 -334 -490 911 1315 -137 -416 -869 -862 598
3179 598 897 372 31 -1070 -892 407 425 567 539 -922 -686 -92 -65 1308 594 -145 -594 -1043 -370 947
3199I47k56j79o21j070R25Q55j18K29p75j057P49K96M86N78p38o61j76q1Q27Q23
3219I83n91j81r04o74J238Q53O1k40j225l06R41Q8R04j12j300l07j78Q83N62J87
3239F82n56k10q12N35O81L22L65o81j074k44R31L67L17j63r89o9q4Q10N51r7p17
3260a35k09q36P53Q20L09j08p62p09K63P50M85k1k50j177p2N00P03O93p55m59
3280b17m13l22J075N45J84p03j023l15R24P25M04j93p67q50j7P24J109j45o33
3299I2p20j21L00P83M16L7j279l57k23R53P61J43o14o29m73L73Q32N52Q3r72p75
3320h38P8O08O81N8m9q84m07J10J042L12J39o54j060K32N19Q78K00n17j039l81
3340i72M83J004J25l1p87n51N1K94R67R8j92j071m16N69N89N96q2n85q14R1O21
$$ plain form
3199 947 691 512 -109 -1179 -254 601 483 712 -63 -1120 -371 -75 411 989 251 -410 -586 -667 160 983
3219 983 392 211 -693 -1367 -129 724 785 545 -680 -986 -45 43 947 835 -465 -772 -950 -67 495 682
3239 682 126 -84 -896 -361 320 642 1007 326 -748 -992 -61 306 623 460 -529 -598 -682 128 679 582 -135
3260 -135 -344 -1180 -427 393 702 594 -168 -877 -614 136 621 600 350 -827 -899 -399 304 997 242 -217
3280 -217 -630 -952 123 668 852 149 -874 -1189 -265 460 864 671 -96 -946 -963 -239 870 725 92
3299 92 -628 -749 -449 334 750 787 -492 -849 -1072 -119 642 785 171 -458 -931 -558 274 826 909 -63 -838
3320 -838 -760 -152 529 587 538 -346 -753 -643 399 711 850 196 -864 -632 -113 765 965 448 -591 -972
3340 -972 -489 515 640 609 -178 -729 -678 -384 583 681 489 -582 -998 -429 160 756 674 89 -725 -634 -13
3361a3O28L82m45q29m35j72J099L79R2p11o60J26K69Q48K72l29q47k47J0N64J027
3382A008m24p00l96j01N08N50K80J6r67o94L39N13P45J16n69o36k71L54Q12L50
3402H33n00m47m98J40P91O63j70o70q55R4L69N61Q97o84j002l83L09K00J035K42
3422I25j030j69p98N64J303j46l5n22r25J48R12O5L76l91q62k23K49N02J085n87
3442D41o21n62l32J155N72j5k50q72m33P92L92M49K68j040n48O9L37R75j0o59
3462A08k62m89j41J165K89j92k38q57j87J075J77J32q1p72m68L54K88R45j53q32
3482a39J4q86N17J440m76L2m99q17M47N73J26K85q16p54M79J90L71R99n75r10
3502c99J95p30Q25R95m06k43o91n70Q38P64j42K68j060n07N43L10P76j40r22j62
$$ plain form
3361 -13 615 997 552 -277 -712 -884 215 594 686 -25 -685 -559 -290 558 830 501 -346 -593 -583 -19 1008
3382 1008 584 -116 -512 -613 -105 445 725 741 -226 -920 -581 -68 677 793 224 -412 -683 -329 483 833
3402 833 333 -114 -612 -472 319 982 812 142 -713 -619 -250 311 1208 524 -478 -861 -552 -352 683 925
3422 925 -105 -274 -1072 -508 795 649 614 92 -833 -685 227 292 668 277 -585 -808 -559 -57 1028 441
3442 441 -180 -742 -1074 81 653 638 388 -484 -917 -125 267 716 984 -56 -604 -535 -198 777 767 108
3462 108 -154 -643 -784 381 670 478 240 -617 -804 271 448 580 499 -273 -741 -387 -99 846 693 -139
3482 -139 -125 -1011 -494 946 470 502 3 -814 -367 206 332 617 -199 -953 -474 -284 87 1086 511 -399
3502 -399 -204 -934 -109 886 480 237 -454 -1024 -186 578 436 704 -356 -863 -320 -10 766 626 -296 -458
3522d58j28k27J322J64n14K6q47k16J158M8K25k34j197J7Q93J73Q35m89j517M07
3542e59j85O09J010l82m56k15q81N72J049m19M29l82r34L19J77N03Q43r29p03
3561e34J23k23Q21J071j123l20n51m46J258O98n53L11p95l35L48K30K48R49j550
3580c73l07J50P4J309q0o68m16m13J12J173J15l62N1j374K97J079m27N98k96o59
3600d17M26k83j07J430n57q64K86o79N08J096n23Q2o33p88Q55L86K40J02l32j062
3620h34Q68k73L61Q28q69L9k44p64J021O79p06N04q47j061J225M34M45Pj460j15
3640g62M91m5Q05L94j252K66l28l43J378N8n88L8r62N2J097j73M34k29j034Q9
3660f14L11L37J093p85r05J41j71M06J181m34o53L72j391J022L11J1N65n50q32
$$ plain form
3522 -458 -586 -813 509 673 159 185 -662 -878 280 328 553 319 -878 -861 32 205 1040 551 -966 -559
3542 -559 -744 -135 875 493 37 -178 -1059 -487 562 143 572 190 -744 -425 -248 255 1098 169 -534
3561 -534 -411 -634 187 1258 135 -185 -736 -1182 76 774 221 532 -263 -598 -250 -20 228 1177 -373
3580 -373 -680 -530 -456 853 773 105 -311 -724 -612 561 676 314 365 -1009 -712 367 -60 538 242 -417
3600 -417 9 -274 -381 1049 492 -372 -86 -765 -257 839 316 398 -235 -1023 -168 218 458 560 228 -834
3620 -834 34 -239 122 950 81 120 -124 -888 133 812 106 610 -237 -1298 -73 361 806 813 -647 -762
3640 -762 -271 -316 489 883 -369 -103 -431 -774 604 662 74 112 -850 -798 299 126 560 331 -703 -614
3660 -614 -303 34 1127 342 -563 -422 -593 -187 994 560 -93 279 -1112 -90 221 232 797 247 -585
3679e85K31K10K15J085j234l51J8j90Q87P38j129J92o49k32J184O8k61J67q86
3698e22r2M78K36K35O62j123n00J15j21J162J78p25M1p35J76J045Q6j70m63o72
3718g09j3R66P9J62m13k11j44j45K80P72j23l20o42k11N64N47n7K11p48o93L31
3739e17P80O1M44p37p10M69Q1O07K61o03j57o60k58Q93M27j83J16q20m0L63O96
3760E13k3J05j070k29L17L20L07L85p08l59j74K66N99J93j68m40k66j09M56N43
3780D58l0m8q30k88M64K75O74rp17l96K71L59O61o53q4m19n40M75P56r0K98o22
3802c5n07J44M53K34M89o40k12n70K81M19L85q3p17k50k43P90M24j30N1n87o42
3823i46O79N00R5n6n33m32P5P93J32K57l15o90K5K02R4Q06j79p13m33J73K98L26
$$ plain form
3679 -585 -354 -144 71 1156 -78 -429 -411 -601 286 1024 -105 87 -562 -794 390 458 197 364 -522
3698 -522 -614 -136 100 335 997 -126 -626 -511 -632 530 708 -17 24 -711 -535 510 596 426 -37 -709
3718 -709 -722 244 323 485 72 -139 -283 -428 -148 624 501 181 -461 -672 -108 439 382 593 -155 -848 -517
3739 -517 263 324 768 31 -679 -210 -129 478 739 136 -21 -681 -939 -46 381 198 314 -506 -546 -183 513
3760 513 490 595 -475 -704 -387 -67 240 625 -83 -442 -616 -350 249 442 274 -166 -432 -541 -85 458
3780 458 428 380 -450 -738 -274 1 675 666 -51 -447 -176 183 844 191 107 -312 -852 -377 379 289 587 -35
3802 -35 -542 -398 55 289 778 138 -74 -644 -363 56 441 358 -359 -609 -852 -62 362 232 283 -304 -946
3823 -946 -267 233 328 272 -261 -693 -618 175 307 564 249 -441 -416 -214 -120 686 507 -206 -639 -466 -168 158
3845A58K03j35n42j06L05J07L49K1m10k89j00K45L64K46Q4p66j71L02J58N49o
3866E66o50l63M9O3O96J18k82l98l85K33M01L38L05n30p25M6K37L81N04k53n81
3887b30n63L48O19N47n07l32r1k78K42O86j3k78k73l10j18N97M54po95l52J83
3908c71J53L79N56j40p40k74k71R93M08l38j42j45q09M28N79K68p8o24l33K50
3928b51P9O71J77p08rk78j69P50J64j34k97n06j45P49J00L32l31p58J25K69J56
3949a4O32l78m78m9j57N89L41k62l14k0l15p4J043k26K4j20p08J02M03K43N96
3970H58n85l98l18j06P35M34l95m74J65m50O90M32l73K18n23n56M65M21J95O9
3990E04o64l7j51J16R73k1q35J5m69p1R42L34l88j75o82J24M78J85L34R7q12j65
$$ plain form
3845 158 361 226 -316 -422 -117 -10 339 360 -50 -339 -439 -194 170 416 500 -266 -437 -135 23 572 566
3866 566 -84 -447 -398 -335 361 479 197 -201 -586 -353 48 386 691 161 -564 -518 -281 100 604 351 -230
3887 -230 -793 -445 174 721 214 -118 -209 -487 -245 441 428 150 -123 -433 -551 46 500 493 -202 -554 -371
3908 -371 -218 161 717 577 -163 -437 -708 285 693 355 213 68 -741 -313 266 534 456 -168 -501 -251
3928 -251 -172 499 676 -32 -41 -319 -488 262 426 292 -5 -511 -656 93 193 525 194 -564 -439 -170 -14
3949 -14 618 240 -238 -287 -444 145 486 224 -90 -110 -425 -499 544 318 342 222 -486 -384 19 262 858
3970 858 273 -125 -443 -549 186 620 225 -249 -84 -534 156 588 215 433 -90 -646 -181 240 435 504
3990 504 -160 -197 -348 -232 741 720 -115 -100 -569 -640 302 636 248 73 -609 -485 -7 178 512 609 -203 -368
4012c68J60K24M54o1n44r3l62L79J076n65j30k03r11O92M81l5M40p48m50N37j11
4033a38K32O90p35pk60l63R50K66m62J78n82p03P65N24k12L44p26m05L42K34P70
4054G02l49o57K72l19j47J130l17J4Q3r26j4P33j11M09J35j405M63J89L33M37
4074F55m09o88K25j26O6J124o43j04J22j113P07N21Q8J48o29n44L06l5O04M47
4094G22m31n88J62l70M55N37l62j32n98OO88L86K2j05r79P0O72k05K82L98j023
4115c93j3K26j59O94L82r00J40l53j60O65L06j70j74n15j74O83j94M41K12j095
4135e51N14k31J21Q29o64j5m79Q1L74M83j93J83o52m06O09J38P6J73p24k51M52
4156a33k34N37N98r94J88j35j44M41L01j04m4o90j73R94M0Ok21n99k50N24J93
$$ plain form
4012 -368 -208 16 470 409 -135 -228 -590 -211 865 300 170 -33 -944 -252 229 194 634 -114 -564 -27 -138
4033 -138 94 784 49 42 -218 -581 369 635 173 351 -231 -934 -169 355 143 487 -239 -644 -302 -68 702
4054 702 353 -304 -32 -351 -498 632 315 329 412 -514 -528 205 94 503 638 -767 -304 -115 218 655
4074 655 246 -442 -217 -343 -277 847 204 100 222 -891 -184 337 425 573 -56 -600 -294 -329 275 722
4094 722 291 -297 -135 -505 -50 487 125 -7 -605 -599 89 475 497 392 -587 -517 155 -50 232 630 -393
4115 -393 -406 -180 -339 355 737 -163 -23 -376 -536 129 435 265 91 -424 -598 85 -109 332 544 -551
4135 -551 -37 -268 -147 682 18 3 -476 -395 -21 462 269 452 -200 -606 3 141 217 390 -334 -585 -133
4156 -133 -367 170 768 -226 -38 -173 -317 124 425 321 277 -413 -586 408 448 454 233 -366 -616 -92 101
4177A01K71p8o89J92o2J16Q27q6m68j70o49M03K54L24K14m48m64K06R2jQ10m25
4199B70o37N1k32N45N47l31l93j36n1K86J18K32k1n90l3J81J58O9N85q37l8k09
4221d66J17P26Q4m69J39p65N4R15j01J69k54m33j86O03o7K38J8p28L47n15L30
4242b44L76L04k33j59o51K69Q32j82l1m81l6j16K73P4M32j67p81L72j5K85M08
4263E29j11l58l65j80L85L94o9l14o1l07K60K59J90j13k63l76J24N02J48K10n53
4284f9n2k94k8O89j61M8p1m60R4Q0M36L31l99n73K63J14J02L90j92l71k28j92
4306e43L85L63j34k21Q0k02NK53M17k95o6k42k02L61J49M0Qn11KR5M08Q9r0k17
4330f8k31k7J77K81m4J3m33j44L61K34M28M8k74n18n7J87J42L22j64k38j83k69
$$ plain form
4177 101 372 294 -395 -203 -265 -149 678 592 124 -46 -695 -292 -38 286 500 52 -412 -206 -114 -115 695 270
4199 270 -367 -316 -548 -3 544 213 -180 -316 -367 -81 37 269 248 -342 -375 -194 -36 33 618 -219 -257 -466
4221 -466 -349 377 461 -8 131 -634 -580 335 234 403 149 -284 -470 133 66 304 322 -406 -59 -574 -244
4242 -244 132 436 203 44 -607 -338 494 312 281 -200 -236 -352 -79 -5 427 260 -521 -149 -164 121 529
4263 529 418 60 -305 -485 -100 294 225 -89 -150 -457 -197 62 252 139 -124 -500 -376 126 274 484 -69
4284 -69 -121 -415 -443 246 85 133 62 -398 -304 -224 212 543 144 -429 -166 -52 50 440 248 -123 -351 -543
4306 -543 -158 205 71 -150 -70 -272 -267 -14 403 108 42 -200 -402 -41 108 148 156 -355 -353 -258 150 239 149 -68
4330 -68 -299 -326 -149 132 88 101 -332 -476 -115 119 547 595 321 -197 -254 -67 75 397 233 -5 -188 -457
4352d57O22K1K06k77j33l96M01K02K21k6n06l14J75m4P16j15k43r3m41L50L46
4373B15K06l73j34l21L58k3J09M20o18j83K05M0J50N91m55l02K3k12O46j24K55
4394D73l68j9m92N18K56K69m33l81l47Q0K07O96k74j48k10k26K28N37o4n6j53
4415I3k71n9J33N14J4m16k13Q3R8K79R5n8k64k48k4J38K63k30K4j47J18n0J67
4438C9L31j50l75Q9L6j17K39K09l04m17J34k04O19RJ70o3l05j77J85K14J68q2
4460B48n63l9M83K8P0O4j61k75kjN92N4l72j93j86k03O81n3K26n13k29o1L71J18
4484H4K81j52n24K73j20K37K45o4k26j09j43M11k0R7Nq06J7M38P6K96R1j66m73
4507b52M9Q4M36j7k21j4o61K99N30Q5j7j1k89l50M47j30P6L42m81J98l87Q3Q17
$$ plain form
4352 -457 165 186 392 115 -18 -414 -13 189 410 384 -122 -436 -261 -305 411 296 53 -40 -481 -131 215
4373 215 421 48 -86 -407 -49 -72 37 457 -161 -344 -139 -99 51 642 187 -115 -92 -304 342 218 473
4394 473 105 86 -406 112 368 637 204 -177 -524 -444 -237 459 185 37 -173 -399 -171 366 302 246 93
4415 93 -178 -237 -104 410 424 8 -205 -122 -24 255 350 292 28 -220 -244 -106 157 -73 -49 -196 -78 -128 39
4438 39 370 220 -155 -66 -30 -147 92 301 -3 -420 -286 -490 129 138 308 245 -60 -237 -52 162 330 248
4460 248 -315 -354 129 157 227 291 130 -145 -147 -148 444 498 126 -67 -253 -456 225 172 398 -115 -344 -405 -34 84
4484 84 365 213 -311 -38 -158 79 324 260 34 -75 -218 193 173 270 275 -531 -514 -76 0 296 387 221 -252
4507 -252 -203 -119 317 300 79 65 -596 -297 233 318 301 290 1 -349 98 -32 44 386 -95 103 -284 -201 616
4530F16l21m38R2m25N67KJ87l00k61k23K28L91J17K75l93n96M25j53O2M50M8k02
4552A48l45k8K84L76l96J58l38l61P97J85j65j62l84J25J65j12K63m6m45K16l11
4573c76j71O72J08n7k24o52M61N51l05M94l48o02K14K98J64K10j95o34L00o8M16
4594B56K33m73M0k98k00L05M67k01K1q1k38n6K51j5K97l49k04O0K35m9L85j85
4616B01j53k96l28N09K86L5om98l80L26Q7L51J31k71k71K9J20N51M4l86j69j77
4638b65k17N11J27r7J39j93m13L18M4M83m91Rj07J3J0O09n8m21j44j80J74M90
4660C41L1j22l98j0Q9Q9J44j76J68p51N26k4L47L28l16j85n64J37O06Q6Qk98L5
4683I1o30O01J39m1R2o72J19K27j70P67l61p5K10n63M3M34j36o8J00m34J22L57
$$ plain form
4530 616 295 -143 -51 -476 91 93 280 -20 -281 -504 -276 115 232 507 114 -482 -57 -210 -148 302 350 148
4552 148 -197 -225 59 435 39 197 -141 -502 295 480 315 153 -231 -106 59 -53 210 164 -281 -65 -376
4573 -376 -547 125 233 176 -48 -700 -239 312 7 501 153 -449 -235 63 227 437 242 -392 -92 -160 256
4594 256 489 16 56 -242 -442 -137 330 129 150 69 -169 -225 26 11 308 -41 -245 -185 50 1 386 201
4616 201 48 -248 -576 -67 219 254 248 -250 -630 -304 -217 134 265 -6 -277 -248 -128 423 467 81 -88 -265
4638 -265 -482 29 156 59 198 5 -408 -90 -46 437 -54 -45 -152 -139 -129 480 422 1 -143 -323 -149 341
4660 341 372 250 -148 -158 -69 20 164 -12 156 -595 -69 -93 254 582 266 81 -483 -346 260 346 354 56 91
4683 91 -539 62 201 160 252 -420 -301 -74 -244 523 162 87 297 -266 -223 211 75 7 107 -327 -205 152
4705A52p0J75k71j59k7J88L71M0m93r6J27k46L26J81K44l72l52j37qO53K09l31
4727A04m0p04K18O46J8j95Nl11j74J38N53J50k54j06l33n9J79L14K86l73l17J51
4749a04r0J03K29L58l96l07K06o5J30J53j41k51k42J93L72K37n8j41o09M6J4L84
4771B1K79k73r1k97K66O9K42L42o25j50j01L28L42k23j2l44k08J70L10J13k13
4792e5j0q4k32R3N77k58Mr6k75K19PK35J69l85l58m0M32kL49l10r4j86M32k95
4816a63N33j9k09l25p4o3M54J43l55J30k99R3O9L03J5j99j62k78M59K26J43l01
4838A21l74nK9J50J93r0m6j7k32R4K6L87J26n21j25R5L20j23J83R7n84L7k0J44
4862a35R3O22p36k41p3P50J16l33K55l37k05r1P27j16l13k84j63K25K23P1K12
$$ plain form
4705 152 82 257 -14 -173 -200 -12 359 399 -94 -190 -63 -309 17 198 442 70 -282 -419 -427 226 435 104
4727 104 64 -640 -422 224 242 47 52 -259 -433 -295 258 408 154 48 -285 -344 -165 149 435 62 -255 -104
4749 -104 -194 -91 138 496 100 -207 -1 -66 64 217 76 -175 -417 -224 148 385 327 186 -423 -377 -363 21
4771 21 300 27 -64 -361 -95 -26 216 558 -67 -217 -318 10 352 129 117 -227 -435 -265 45 158 -55
4792 -55 -65 -149 -381 -288 289 31 35 -61 -336 -117 -110 125 294 -91 -449 -489 -57 -59 290 -20 -114 -300 132 -163
4816 -163 370 351 142 -183 -257 -320 134 277 -78 52 -247 -154 -85 218 233 34 -128 -406 53 279 422 121
4838 121 -253 -258 -229 -79 114 24 -22 -39 -271 -177 -151 236 362 -159 -284 -189 131 8 191 288 -296 -259 -279 -135
4862 -135 -42 580 -156 -397 -470 280 396 63 318 -19 -224 -315 412 296 -17 -301 -464 -239 -16 55 267
4883B67m14k1N3J37J35K31q7l93l58J14L44K30J40o33K20k4k27P00j80j5m72j82
4905d35k7M62J5M65l37j69k60O8O7L80R0n33Jo2K23J93M7n3j74j85L21j45K61
4928B13J76m48k54L7K58M31j75Qk26k85M30P7J68k20k37j98j42J87M56O1j28j73
4950A6J2j07L4M28k8j33l60k4J79j23M86m32l17J05K11j16K65L71n90J4R2O1J95
4973B39K04j04k19l52J91n8M03J12j58l76l10L69q6K17l5j52j99K40L54k89L17
4994C08k25l73N7M1M33J14j33k41k24l7K44K32k0k03j48j75J84J68j01J84j9k30
5016a64R3J18J87n5k09J00k50k44K30M77O8l17j12K6j73L82K77p2p05J42PL83
5038A89n6qk05j03k19M27L37j21r6m67j15M20P4J46j69l57J35K10k50J40K72q
$$ plain form
4883 267 -147 -168 -115 22 157 388 301 -92 -450 -336 8 238 378 -255 -35 -59 -286 414 234 219 -253 -435
4905 -435 -462 0 15 480 143 -26 -286 -218 -151 229 319 -214 -213 -275 -52 141 188 135 -39 -224 97 -48 213
4928 213 389 -59 -313 -276 -18 413 238 246 20 -265 165 242 410 190 -47 -245 -387 -200 256 317 189 16
4950 16 28 -79 -45 383 355 222 -138 -162 17 -106 380 -52 -369 -264 -53 -169 96 467 -123 -109 -17 44 239
4973 239 443 339 120 -232 -41 -99 304 416 258 -118 -428 -59 -145 72 37 -115 -314 -74 280 -9 308
4994 308 83 -290 -233 -192 241 355 222 -19 -243 -280 -36 196 176 -27 -175 -350 -166 2 -99 85 66 -164
5016 -164 -71 47 234 179 -30 70 -180 -424 -194 283 351 34 -78 -52 -225 157 434 362 -343 -201 -194 189
5038 189 133 125 -80 -183 -402 25 362 241 145 -322 -437 -17 57 203 34 -323 -188 22 -228 -88 184 176
5060A76l51j61N67q6K8k32K91l68n18O70j24M35j59r7k88K18k71N11j15m33P3
5081b34K42J90j99M64l49k47l52J62M44K20j47l95p0M9j88K16L48K46o93K90K8
5102B5l8L05j40k56l0r7n1J72K54M09o12l68K27j2J94M40m84j05j3j6qL67l94
5125b31K35Q5m64M90N7p9P8l95J66L4j46L41k50j40k62J61N54m0j46R2n31k9l
5148d23K38L15j07K21n15J62k62M18K38j31l90J11K20lo6L3K74m65Q5J17q8L04
5170B86j15k18m8J26o3RN2k29j43J95R0J10J49O0l58j48N6K54K91l23R6m39K47
5193f3O6o0R7O5Q3k99r3J87L12l87J33j54k07Q2K56L18J29p92J38K00k17O96m57
5216C3j5Q0k40j34K75L22J43q61K00P9J1M05k1k10j00k71J77J26J64P2m19kJ13
$$ plain form
5060 176 -175 -336 231 145 173 -59 232 -136 -654 16 -108 327 168 71 -217 1 -270 241 126 -307 -234
5081 -234 8 198 -1 463 114 -133 -485 -323 121 341 194 -201 -271 -222 -410 -194 154 400 -293 -3 25
5102 25 -13 292 152 -104 -134 -231 -282 -110 144 553 -59 -427 -200 -212 -18 422 -62 -167 -180 -196 -204 163 -231
5125 -231 4 89 -375 115 172 93 171 -224 -58 -24 -170 171 -79 -219 -481 -320 234 194 48 140 -391 -420 -423
5148 -423 -185 130 23 244 -271 -109 -371 47 285 154 -236 -125 95 92 26 59 333 -132 -47 70 -18 286
5170 286 171 -47 -95 31 -32 -23 29 -200 -343 -148 -58 52 201 261 -97 -245 -189 65 356 33 129 -310 -63
5193 -63 3 -57 40 105 188 -111 -204 -17 295 -92 41 -113 -320 -238 18 336 465 -327 -189 11 -206 490 33
5216 33 18 98 -142 -276 -1 321 464 -397 -197 -118 -107 298 277 67 -33 -304 -127 -1 163 235 -184 -186 -73
5239g3J96K87l16O5l45k09M89j64K40R2k24j52q6R3L46k73L25n96j86M26o2M15
5261B88k71J95m65j98N29J29o7J14n68K87j08M19R6M9m0o63J85n9L32q2K50l96
5283d4n3q2n0M83p4j45LQ4j91L38j13R2l03j29m1K57K97k74j92R0l17K61K52o9
5307H0J0j90k10K69k78K80J02Q3k41l71M41q8O12l98k95j10K05J20m3J85l78K45
5329C0j72K77j90K63r6r8m73M48J4J19R2j5l58j6K52r4J07j55J43l37k1M28j77
5352b9K22j05j74k71K19K03J26j50k31l0n6K77n3J58k84K45k42L10J0L56n50j04
5374a53K34k66K04O9q1J99m61k3J64J81J58k84K17j66r6J1L50q8K8J35o21J76
5396a13Q8N40k07l84j24R1N24l37J57j96k00m9L7R8K51M7o2j48k03K19O0J68j68
$$ plain form
5239 -73 123 410 94 159 -186 -395 94 -70 170 262 38 -114 -200 -107 239 -34 291 -305 -491 -65 -127 288
5261 288 17 212 -253 -451 78 207 140 254 -314 -27 -135 284 380 429 389 -274 -89 -148 184 102 352 -44
5283 -44 -97 -179 -229 254 180 35 38 122 -69 269 156 248 -55 -184 -225 32 329 55 -137 -47 -364 -103 149 80
5307 80 90 -100 -310 -41 -319 -39 63 146 -95 -466 -25 -113 499 101 -194 -304 -99 21 -22 163 -215 30
5329 30 -142 135 -55 208 112 14 -459 -11 3 122 214 199 -159 -175 77 -17 90 -65 78 -259 -280 148 -29
5352 -29 193 88 -86 -357 -138 65 191 41 -190 -220 -276 1 -52 106 -178 67 -175 135 145 501 -49 -153
5374 -153 81 -185 19 88 7 206 -255 -278 -114 67 225 -59 158 -8 -104 -93 257 169 197 332 -289 -113
5396 -113 -25 515 308 -76 -200 -109 415 78 235 39 -161 -210 -173 -75 176 223 161 13 -190 29 89 257 89
5419H9k56j49Q0K91k80M78N1m77j52J60K08Q0j71l46K14q1L08J83R5k55M7k25
5441a08K75j26J40k51J96l65K60k2K4oJ9k32M7L3J73k3L15m98m97O11p7M93k34
5464A47k31j19J70j02N5J03K5j17j68L9k3M18o5j92j0M5j76K19J82j72K5j49L6
5487f0j19J69K5j40j74M14m72L84L42q5k56L6N3k81N38k25k1j49j99J38j69K34
5509a7N5j32N5r3K4K66j83J20Mk15j2K7K03K42l01j33J19l6rJ1L50p5l82K01L7
5534A26K8p7L0j41k56K71j95L20N9k43p3K05j28J59J8j06j68q6Q4J62J73r7j18
5557e3m9K25l15L72m1j84k23M4K00J04mj63O3J0j01o0J98j35K43j08j08L50l42
5580g7jN48o99J70J7Q1J32m8r0O9l78J0L04N2L5l04L22j06j90J74j18M15j83k16
$$ plain form
5419 89 -167 -316 -236 55 -225 253 304 -173 -325 -165 43 123 -48 -394 -180 -261 47 230 325 70 117 -108
5441 -108 167 41 181 -70 126 -239 21 -1 23 17 36 -196 -149 -116 57 34 349 -149 -646 -35 -112 381 147
5464 147 -84 -203 -33 -135 -80 23 48 -69 -237 -198 -221 197 132 -60 -70 -25 -201 18 200 28 53 -96 -60
5487 -60 -179 -10 15 -125 -299 115 -357 27 369 284 28 64 117 -164 374 149 128 -21 -220 -82 -251 -17
5509 -17 38 -94 -39 -132 -108 158 -25 95 99 -116 -128 -101 102 344 43 -90 29 -7 -16 -5 345 270 -112 89 126
5534 126 154 77 107 -34 -290 -19 -214 106 165 -78 -151 54 -74 85 103 -3 -171 -257 -173 -11 162 65 -53
5557 -53 -102 123 -192 180 139 -45 -268 -224 -24 80 76 -87 -24 -14 -115 -175 23 -112 131 23 -85 265 -77
5580 -77 -78 470 -229 -59 -42 39 171 123 33 102 -276 -266 38 90 125 -179 143 37 -153 21 -97 318 135 -81
5604h1j0j5L70j30j70k03O8J93K07j93m0P7j92K63K70n31K44Q0m94L15j57J04
5626b5K47n42L80j41n1K70M6l1k11J91j79j76K02J14L7J2k55j57N35j6o7j74O3
5649G2l26L14M0N3Kk69j73ML44n9J23K6j09J1j06J62J78J04m57p9R2J31M1Rj39
5674a1Qj26Q3L2o8K52m47K82m1K37N9K8j55o5j22j29P6J96N6n9j84J58R4j03q9
5699c8L00k15j27m4J53R9j61k32K99J8j27L25k4j99r3j63KL16ok2m4j60m8L51
5723A60j68K52j3k53j49j08L39j08L33k0n00j47M61j23O6K2l52N66n91L38J43
5744A48J53j90n0j79J60pl4J19k8l63O3M05k05K80L4o81J33K12J9J41J59m57L3
5767a35K72j40l7k2L29n34K25k28M0L42P5N9l28q1K40J50j9j48k37j5j21L81K29
$$ plain form
5604 -81 -91 -106 264 134 -36 -239 -171 22 229 36 -4 73 -119 144 414 -117 127 207 -287 28 -129 -25
5626 -25 222 -320 60 -81 -132 138 184 153 -58 133 -46 -222 -20 94 131 143 -112 -269 266 250 183 9 72
5649 72 -254 60 100 153 155 -114 -287 -283 61 2 125 151 42 53 -53 109 287 391 -66 -145 -53 78 119 128 -11
5674 -11 -3 -129 -46 -14 -82 170 -277 5 -36 201 260 288 133 68 -54 -183 -107 89 145 86 -98 60 154 51 -38
5699 -38 262 47 -80 -124 29 128 -33 -265 34 52 -75 250 226 27 -66 -229 -227 89 83 61 17 -143 -191 160
5723 160 -8 244 231 -22 -171 -279 60 -48 285 265 -235 -382 79 -44 22 44 -308 258 -333 5 148
5744 148 301 111 61 -118 42 35 1 120 92 -271 -208 197 -8 272 306 -375 -242 -30 -11 130 289 -168 -135
5767 -135 137 -3 -40 -62 267 -267 -42 -270 -230 112 187 246 -82 -163 77 227 208 60 -177 -192 -313 68 297
5790B97j23p7jn58K98L34P5l13K1l81K36Q0L64j62r0M7K27j43j78K6R0n6j12N
5814i4K38J33k23o5Q5j98K3N5k5K78k78j38K00O3J25n6n8k85R3J44Q8M2j43J32
5838A36j17j36M53j48l4j91R1l57J24M71k90J92l90L01j10J72j92J90l42k3k01
5859d01J33M35K06k86k47r4rJ4M14LJ32n84J07%J84j12j1J65j7m0j24K22L3k29
5883a06k5O8m6LK47J69l63p6k46K57K48o5J01j65l08J16J42J63j86J51k74K51
5905E6K54j08m9j87K58o26J98J98K02L4M6m47j56L46J34k4j07J89m36K79m0K56
5927B70j47J20m06K6J37J43J12m30L39k82J06L2oN67m76k01l6q4K14J8j47Q6q4
5950a29L8K26Q5k15K6k45r1J65J73l3K46k71L1K4N0m5R9k62K76m25oJ81L17m31
$$ plain form
5790 297 174 97 96 -462 -164 170 245 -68 -47 -428 -192 -112 252 90 0 47 274 131 -47 -21 69 13 -99 -94
5814 -94 144 277 54 -11 74 -124 -101 -46 -71 207 -71 -209 -9 54 179 123 65 -220 -127 17 105 147 4 136
5838 136 19 -117 336 188 154 -37 54 -303 -179 292 2 194 -196 105 -5 167 -25 165 -177 -200 -401
5859 -401 -268 167 373 87 -160 -254 -263 -249 165 168 300 -284 -177 -177 7 -105 -116 49 32 -8 -132 90 123 -106
5883 -106 -131 -63 -109 -106 141 310 -53 -129 -375 -118 130 65 166 1 -307 -191 -49 114 -72 79 -195 56
5905 56 310 202 153 -34 224 -402 -204 -6 196 230 276 -171 -327 19 153 129 22 211 -225 54 14 270
5927 270 123 243 -163 -137 0 143 255 -175 164 -118 -12 20 14 581 105 -96 -132 -216 -2 16 -131 -45 -129
5950 -129 -91 135 220 5 31 -214 -305 -140 33 0 246 -25 6 30 80 35 134 -128 148 -277 -283 -102 215 -216
5974b16J44j37Q7l0K96j07l6r5L8l12J83K43m4j55o3p4K06P8J05k86J67l69N27
5997A50j92K17j36K11m19K05R6j76K02j62O1l04M40l29L34J10j46m57L00k88J35
6018a48L21k39j19j4j03K13P9L37j73k74j90K38j3L62m24J39K07l53j56L46m1
6039eJ36k20j92P9L10p7K30j3j63l71K79lK38p5o07N40k07L60j10J35k44J17m63
6062c26L83j70K09J60m03p7K99o6P9J11k64J8j25L08J71o8k85M20o09j18K47J66
6084F0L38m09q1p4K42Q5L8n4j67j30K13k91O52j73r4j41j03k37N53j00j95J24
6106E6l49M64o4J02j30k03l6K6Q0M5j34N2J37j32k3p2K90j09m2O3k81K88q3P0
6130A5M6k17J57j05L42k50K47l88K11l31K74K53Kl86m7r8R1J40O7L36j13m27j13
$$ plain form
5974 -216 -72 -209 -122 -152 144 37 1 -94 -56 -368 -185 58 14 -141 -204 -278 -72 6 111 -175 -8 -377 150
5997 150 -42 175 39 250 -169 36 132 -44 158 -4 57 -247 193 -136 198 308 162 -295 5 -283 -148
6018 -148 173 -66 -185 -199 -302 -89 -10 327 154 -120 -310 -72 -85 277 -147 -8 199 -154 -310 36 -5
6039 -5 131 -89 -281 -202 108 31 261 248 85 -286 -7 -10 228 153 -454 86 -121 239 129 264 20 137 -326
6062 -326 57 -113 96 256 -147 -224 75 9 88 199 -65 -47 -172 136 307 239 -46 374 -235 -353 -106 60
6084 60 398 -11 -92 -166 76 161 199 145 -22 -152 61 -230 422 249 155 14 -89 -326 227 127 -68 56
6106 56 -293 171 107 209 79 -124 -160 -134 -54 -9 -143 -91 46 -86 -109 -181 109 0 -42 21 -260 28 -55 15
6130 15 61 -156 1 -104 238 -12 235 -153 58 -273 1 254 256 -130 -177 -275 -184 -44 23 359 246 -181 -294
6153b94J23M45k92N7j1n9J90m26J82K28N9k13j44R1O3J12l9K3j74%R2J87M8m26
6177a78O0l59L64J0K8J73k0k86r9J22L06o6K6j55k18M37k00Q2K56j85l59N0J79
6200c2q9K75j3j90j48N0K19r8J74j5j70j23J81j91J51K20k09o0k17K85o6J17p7
6223b6j03L4L6J25L4K03l32L9k23P4K66K22j26q5j34J1M6j38J60l02J0J04J20
6246A5rJ3n9j67N6J68N6l3k1K31k01j20QO4k8O1m7j02J9L52k76J54o9K4j35J79
6272A33J14j70k43L89k08p8j33M91j02k57k88L59j85L26L12k59l8o18N82j14L40
6293C53k76n3N3j85k26L43J38J42N2m30l31K76J17L06l33J90l21L23J24j22O1
6314B01j15n0N4k30K47j7p3m7m8M6J71k0j68K45l85j33L19J42n8j0K1k52J81J06
$$ plain form
6153 -294 -171 274 -18 39 28 -31 159 -267 -85 143 202 -11 -155 -64 -1 111 72 95 -79 -79 13 200 248 -178
6177 -178 -118 -477 -113 -103 -75 98 78 -208 -307 -185 121 55 81 -74 -292 145 -55 27 283 98 -261 -211 -32
6200 -32 -121 154 141 -49 -197 -147 72 -26 148 133 -37 -160 21 -170 -19 201 -8 -68 -285 0 -66 51 -26
6223 -26 -129 -95 -59 66 100 303 -29 10 -213 -139 127 349 223 138 4 15 61 -77 83 -219 -209 -105 15
6246 15 6 19 -40 -207 -151 17 73 40 19 250 49 -71 -63 1 -27 34 -13 -115 -96 256 -20 134 65 89 -46 133
6272 133 247 77 -166 223 15 -63 -196 295 193 -64 -352 7 -178 148 460 201 163 -455 127 13 353
6293 353 77 24 77 -108 -334 9 147 289 341 -89 -420 -144 -27 279 -54 136 -185 138 262 140 201
6314 201 86 36 90 -140 107 90 17 -30 -78 -32 139 119 -49 196 -189 -322 -3 139 81 71 92 -160 21 127
6338A27O3q4k21r2K81l89N21J23k98l45p8P4L11K71J6k58j55J43olK0J70l10j32
6362b51O4K23J70j77o9J88l15K04K91k38P3j39k05J90Jm1J05m9m4o5n8K84J64
6385C06j34j9l25j30L80J99M8k20k24J73kJ45N6j48o8k27L5J33j86N38l08k34
6407b12K5J87L6O2R7k09j65J89l8K4Q9m13L14K4J0j44J82j02r8n3J49J03r2k0
6431e5R0L0m07P0N4O6N8K86j23m17K39L55j47O5K9l10Q4k1j2k9J1J15l69J78L84
6456B24r9J12l65J87l0N1O5j20q6J28j38j68L01mm9j81K70j99K96P5o8k03M2k62
6480b21L6kN51j71j71k80J98N8K33O9m19J84l99N18j91R9J53j69l5l48L41p3K24
6503A85K2l39O8J3K20n7k15K41j79J14j43L07j04q2k0l61K07J06J47N3l7l96M29
$$ plain form
6338 127 190 106 -115 -207 74 -315 206 329 31 -314 -392 -318 -7 264 280 22 -133 10 4 1 21 191 -119 -251
6362 -251 -187 36 206 29 -40 148 -167 37 328 90 163 24 -181 9 10 -31 74 25 -19 -84 -142 142 306
6385 306 172 153 -172 -302 78 277 325 105 -119 54 52 197 253 105 37 -190 -155 -22 -208 330 22 -212
6407 -212 -187 0 36 98 195 -14 -179 10 -28 -4 85 -328 -14 10 20 -124 58 -44 -142 -195 -46 57 -35 -55
6431 -55 35 65 -342 -272 -218 -152 -94 192 69 -348 -109 246 99 164 193 -117 -33 -54 -66 -95 -84 31 -338 -160 224
6456 224 125 237 -128 59 29 80 145 25 -61 67 -71 -239 62 58 9 -172 98 -101 195 270 202 -1 41 -221
6480 -221 -185 -187 364 193 22 -258 -60 -2 231 300 -119 65 -334 184 -7 92 245 76 41 -307 34 -39 185
6503 185 207 -132 -64 -51 169 112 -103 138 -41 73 -70 237 133 51 31 -330 -123 -17 130 183 146 -250 179
6526A79l97J49Q2pj66n7L1K35q2j66J07J46j31k2L40k31m7l82M77k39K65J38j46
6549G6j24LM6J9nR0J9l86K05N8K56K4Q7l00k46K31j45L28mj97q2%J09M1q0J00
6575A23L9k98K82k37M7M5K33r2k80j02k6K50m8Q0j6k1j61L25j52J03q0j19l02
6598d07L77O2J05k20O0k17j99N34l8o0J73k49J09Q8L3p0l5m20L9J54j76P18l17
6621D4O5j80j1R3QJ04k07j3r0J73j01J0J68o9J1l93N39L2k1j68O1k4j62N4J38
6646F1L0j43J4k90J84K69K45k91k6m19K23R3J06k3j52J82j1j26K03J04m22J74
6668a5r9k3K25M7q6j49j44J05M28l03P2J98l22K82l53J02M13l54k9J79l57L49
6690A66k89L89j62j28k96M17J63O0K4j29k49l43L44M5j53K70j55M8j0j32J14K7
$$ plain form
6526 179 -218 -69 13 6 -160 -217 -186 49 -33 -199 -92 54 -77 -99 241 10 -37 -419 58 -181 84 222 76
6549 76 -48 -45 1 20 15 105 124 -262 -57 1 257 281 368 68 -178 53 -92 236 232 35 -47 -47 62 103 23 123
6575 123 162 -136 146 -91 -44 1 234 142 -138 -240 -266 -16 -64 16 0 -21 -182 143 -9 94 14 -105 -407
6598 -407 -30 32 137 -83 -23 -240 -439 95 57 -3 170 -79 30 118 151 81 46 -374 -335 -181 -357 361 44
6621 44 109 -71 -82 11 19 123 -84 -97 -187 -14 -115 -105 63 -6 5 -388 151 183 162 -6 55 31 -131 -77 61
6646 61 91 -52 -38 -328 -144 125 370 79 53 -366 -143 -50 56 33 -119 63 52 -74 129 233 -189 -15
6668 -15 -114 -137 88 135 49 -100 -244 -139 289 -14 58 256 -66 216 -137 -35 378 24 -5 174 -183 166
6690 166 -123 266 104 -24 -320 97 260 320 344 215 -34 -377 -33 12 -141 129 -26 22 12 -120 -6 21
6712B1N9q5l03J71M47j17j94lp8J15J26K7J10j03j72J80k29K7K38j53K28l60j12
6735a60j14L90l03L61k96O9K9M8J44k5j11m3Rj56K44K29m20J0l20L39K63k13J83
6758A57l27N4L9L36j23k49J32j58K9J47l9J33K46n50K98k72J05L7P8L32j26l87
6780a08N2L86j88k9l9k06r7J21L55n1l12J19j46k96O03j44J09P8l24o4J20j74
6802b35K15J52k64J8P7j08J49J06m3J31l79PJ96K0P2l72R1J1J37J71n3o0q5q3
6826a29J23k2K08J0m37R8N3J38o9J22k87O0j55J27K65P0j60K53l46j16K60j89
6848a23J78k9k50J29K52Kj63k73K42k5k20K82J3M96l36j72M5j81o7M43o9p0J03
6871B07j63N0j70K6L05n35L34J06l85J84J30J53m40k6J77K17k4k15N7k12K80l35
$$ plain form
6712 21 80 -5 -308 -137 310 193 -1 -4 -82 33 159 186 296 193 21 201 -28 -1 237 84 312 -48 -160
6735 -160 -274 116 -187 174 -122 -53 -24 24 168 143 32 -11 -2 -158 86 315 -105 -95 -415 -76 187 -26 157
6758 157 -170 -116 -77 259 136 -113 19 -139 -110 37 -2 131 377 -173 125 -147 -42 -5 73 405 279 -108
6780 -108 -56 330 142 113 74 -132 -229 -108 247 196 -116 3 -143 -439 164 20 129 207 -117 -181 -61 -235
6802 -235 -20 132 -132 -114 -37 -145 4 110 67 198 -181 -174 22 42 114 -258 -167 -156 -19 152 99 39 -46 -129
6826 -129 -6 -28 180 190 -247 -149 -96 42 -27 95 -192 -132 -287 -160 105 175 15 268 -78 -194 66 -123
6848 -123 55 26 -224 -95 157 159 -4 -277 -35 -60 -280 2 15 511 175 3 48 -133 -200 243 174 104 207
6871 207 44 94 -76 -50 255 -280 54 160 -225 -41 89 242 -198 -224 -47 170 146 -69 -12 -224 56 -279
6893b79K00r1L56l66J12K55m4l4K03k52k89K29Q1k07J83k27j5q2K04J72j26k0
6915c7j4J03m91P97m98Q4K23k89j5L81k93K88m47Q9j68K34J19j31J17k42L56j04
6937F2j74J30J24O1n5l63L03j81L63k21J00j28j19j2Q0j23J15M56l72j91K36l49
6959b58M87j36l98J18J24J8L60k87j5k26m6K91L12j50l46Q3n4j42J73J04q5Q2
6981Io7j57J63O7K02k40Rk2J27l46L74k72J6R7K04l27K09J65j58l44J51K00k37
7004a77O3L21j92J74m19J52J39M6n0J68m16R7P6k16L64p2J58k74j04J68MK0Q2
7027A12k68J56j9j09L30k74P7k75K77K41j7j97k43PL21ok62J18pK31l84j0K28
7050B7M9j14M11m84J11J78N9Jk95O4j88J32M3o6J16k04K77j99J06Q9J27k05N5
$$ plain form
6893 -279 -79 -170 186 -180 -68 187 143 109 312 60 -229 0 81 -126 57 -170 -185 -267 -63 109 -17 -37
6915 -37 -51 52 -439 358 -140 -56 167 -122 -137 244 -49 239 -208 -119 -287 -53 66 -65 52 -190 166 62
6937 62 -112 18 142 203 148 -215 88 -93 270 49 149 21 -98 -110 -30 -153 -38 418 46 -145 91 -258
6959 -258 229 93 -305 -187 -63 -45 315 28 13 -213 -259 32 344 194 -152 -69 -123 -265 -92 12 -73 9
6981 9 -58 -215 -52 15 217 -23 -14 -36 91 -255 119 -153 -137 -40 164 -163 46 211 53 -291 -140 60 -177
7004 -177 -114 207 15 189 -230 -78 61 107 57 225 -191 -94 -18 -234 130 58 216 -58 -162 6 10 30 112
7027 112 -156 0 -19 -128 202 -72 5 -270 7 248 231 34 -209 -202 119 113 -149 -31 -38 193 -191 -201 27
7050 27 76 -38 373 -111 0 178 237 238 -57 7 -181 -49 -6 -72 44 -160 117 -82 24 113 240 35 90
7073I0j07j90J55J09J28n4j06j55J48L4P6p5R7j61j18K0K17O3k68J15o4L92j82
7096A64j97L75m63J67r2K37k45J43o5j3l48M29j50J38K03m36K46j51m1K01J34
7117B36n1k59J4j30J57r1J55j48L3Q4j79L38l02M6L8J01K42k86M0p9J34K8m11
7140b90J83N8L88l90J78l02P7Q2ql3K01k42o9O5O8P8M5j67p1J60q7M8nj75L75
7165A67j67L48j76l82K65l2l19M12j52R4j70J11O9J6l00M49j04l47J92Pj41M6
7187a14J78r7L9k2o9l4K41K18o00J45k54J94L80m31M79l12Q6j64l7K85n3j62J41
7210C7j64J36j1K50k70L38j14n73O10j33K1j16j57R9o4P1O9J86K0l30M6OK1J97
7234A75m10j7N3M17R8j09j89L5j13q5N0R7j12l1L30L2k82J07L15l17l69N88k02
$$ plain form
7073 90 -17 -207 -52 57 185 131 25 -130 18 52 128 53 150 -11 -129 -109 108 171 -97 18 -46 346 164
7096 164 -33 342 -121 46 -46 191 -54 89 24 11 -337 92 -58 80 283 -153 93 -58 -99 102 236
7117 236 185 -74 -60 -190 -33 -124 31 -117 -84 0 -179 159 -143 -97 -59 42 284 -2 38 -41 93 121 -290
7140 -290 -107 -49 339 -51 127 -175 -98 -16 -24 -57 144 -98 -167 -102 -34 44 89 -78 -149 11 -76 -28 -33 -208 167
7165 167 0 348 172 -210 55 23 -296 116 -36 58 -112 -1 68 84 -216 233 129 -218 -26 -19 -160 -114
7187 -114 64 -33 6 -16 -85 -119 122 340 -260 -115 -369 -175 205 -226 253 -59 27 -137 -174 111 58 -104 37
7210 37 -127 9 -2 248 -22 316 202 -371 239 106 127 11 -146 -47 -111 -40 29 215 235 -95 -49 -43 -22 175
7234 175 -235 -252 -199 218 316 207 18 53 -60 -145 -95 2 -110 -141 189 221 -61 46 361 44 -325 263 61
7257F1m3q9r3P6K54m15J86M60o47K26L9nj26J53j85o6K96r6k7J38k29K73%m20
7281b79M05k34J2mk3K93k78M7oJ36J6k8K13p5l02K12j58K23k34j37K67j23q3J54
7305A4R2j38j75M2K88k34M24m04J01K72l35O9k08N54q1j95J53k79Q1K8N5j30J52
7328A46j28l17K57P0L37l40N2o3J76j12j54K13j49L9Q6k52m1J23k03K82j10R8
7350A0L17j7k74n8l30M61j88O9M8K26k79o3J79k04o2K76q7M6j67J02J97q8l9k26
7374a51j7K72o8O0p3k79M92j47j26p3K10O8j17K6k64R6j18K07j14jK30K03l66
7397e0N8J8j29j47L06p9J09j63m8K15j23q4L0K48k38m3mJ30K5k4j09K22k75K46
7421I1l61N13j84P5l55K22j79K86J61k24m1n4j1o9J91n1J64Qm87K52J05J29k23
$$ plain form
7257 61 18 -71 -164 -88 166 -249 -63 397 -250 -24 15 10 -116 37 -148 -214 82 -14 -41 97 -132 141 141 -279
7281 -279 126 -108 -96 -100 -123 170 -108 -61 -67 69 85 57 270 195 -107 105 -53 170 -64 -201 66 -57 -140 14
7305 14 106 -32 -207 -165 123 -111 313 -91 10 282 -53 16 -192 362 281 86 239 -40 41 69 124 -6 146
7328 146 18 -299 -42 28 365 25 77 14 190 78 -76 137 -12 27 113 -139 -180 -57 -260 22 -88 10
7350 10 327 310 36 -22 -352 109 -79 -10 38 264 -15 -78 101 -103 -165 111 24 70 -97 5 202 114 75 -151
7374 -151 -168 104 36 96 23 -256 236 89 -37 -110 100 168 51 77 -187 -91 -209 -2 -116 -117 113 316 -50
7397 -50 8 26 -103 -250 56 -23 86 -77 -125 90 -33 -117 -87 161 -77 -120 -124 6 31 7 -102 120 -155 91
7421 91 -270 243 59 134 -221 1 -178 108 269 45 4 -50 -61 -130 61 10 174 182 -305 -53 52 181 -42
7444d2N3j03j65N01J29l26j43L75m22Q2OR7N3l89K05R6Q9l2k16K60m70M94J37
7467B69l01L57k48k76N5j7J42L8j21m0L20l81K27l07M61jj58P0l40j81L74L19
7489B61j11k09J35m80M23J43J90m14n1M8N1J89k5k83R0k0j16J33J32O5k18j08
7511a75J24K23j17l78N84m19J45k36L49R4q8j4l8r2M7o2J13j4J11k06R6n8j1K26
7535B04k32j42J09j21J87k30L64k16k31M71k87J37q7J83k04J1l3R7M9nL21j43
7557B02k69k34K95J58k30J43r7j73J35K36O1j88J00k92o4k7J03J58j18qK66j30
7579B7jJ12k0k27R4o0M7L63m30K17m35R5K67J34j54q0l1M3J34j77R7J20l37J98
7603dk7J6L9j50J91L4J12j37J24qj03q8m3J52k4%M1n8k83L8J84P9P2j57m29M15
$$ plain form
7444 -42 11 -92 -257 244 373 47 -96 279 -143 -61 -55 42 95 -294 -89 7 96 64 -152 108 -362 132 269
7467 269 -32 325 77 -199 -144 -161 -19 19 -102 -142 178 -203 24 -283 178 177 19 89 -251 -432 -58 261
7489 261 150 -59 76 -404 19 162 352 -62 -113 -65 -14 175 150 -133 -43 -63 -179 -46 86 151 -67 -175
7511 -175 -51 172 55 -323 261 -158 -13 -249 100 194 106 92 54 -38 9 -53 60 46 157 -49 47 -11 -22 204
7535 204 -28 -170 -61 -182 5 -225 139 -77 -308 163 -124 13 -74 109 -95 -84 -117 -20 29 24 345 202
7557 202 -67 -301 -6 152 -78 65 -32 -205 -70 166 227 39 139 -153 -217 -244 -141 17 -101 -109 157 27
7579 27 26 138 118 -109 -15 -75 -28 335 -95 122 -313 -218 49 183 29 -51 -82 -39 95 -82 15 135 -202 -4
7603 -4 -31 -15 24 -126 65 99 211 74 198 190 87 -1 -44 108 84 84 125 67 -216 -178 6 85 157 0 -429 -14
7629a4%l02L89j76K74k2n8j41j54K27O2M2l68K34P8k14J23N5j19J98m42N31j92
7652A1R2J8m25M30nj24J2j34J55j41P1j2O0J9L8j38J29M9j20m8KK07k53r2M20
7677B21q9L9k01J04J81o85M68m0j0O7j75J65J1j84K31m9j68l8P1K63k18l1k5L40
7701B48m09m9M44l20J46n0J48q1l5o1R2K3l01R8N3n4q4M35l00J66J1R9k91q9J98
7726C7J34k96oJ00j10J42J06k65K63j54J88K4j06j01r4K12j26J4R1n3M6r9L98
7749C45j88j59n6J2j95L39J25j89O4k91K48j35L63m67J52J68n06L97q5J10rJ13
7771A56m12M11j89JK8Oj20J21j24K0N02k81N4k27J32j44o4L19J78m84jK20j13
7794a1N9o2j2l14Q4K13j86L43m04L97j65k9kl0J91j55N4l29L23j46K97l08K4m4
$$ plain form
7629 -14 -14 -316 73 -103 171 149 91 -50 -204 23 85 127 -241 -7 71 -143 -20 35 -84 114 -328 203 11
7652 11 103 121 -304 126 121 -3 9 -125 30 -111 -40 -52 8 27 65 -73 56 105 -15 -63 -61 146 -107 -199 221
7677 221 132 171 -30 74 255 -430 38 -2 -12 55 -120 45 56 -128 103 54 -114 -152 -81 182 -36 -67 -92 248
7701 248 -161 -210 234 -86 60 10 158 77 42 -19 73 96 -205 -107 -54 -108 -192 243 -57 109 120 219 -72 -161 37
7726 37 171 -125 -131 -31 -141 1 107 -158 105 -49 139 163 57 -44 -138 74 -52 -38 53 0 46 -53 345
7749 345 157 -2 -58 -46 -241 98 223 34 98 -193 55 -80 283 -184 -32 136 -370 27 -58 52 43 156
7771 156 -256 155 -34 -33 -5 1 -119 2 -122 -102 400 119 173 -54 78 -66 -130 189 367 -117 -118 102 -11
7794 -11 48 -14 -26 -340 -256 -43 -229 114 -290 107 -58 -87 -89 -119 72 -83 -29 -358 -35 -181 116 -192 -168 -212
7818b12K98J2j38J33j26j84L1M2L45Pj39k92L04j30J16J05k89J50P5j39J95j72
7840hJ02K5j68j8K02k40J25J94j75J8p1k40J30K55j92p8N3j16M7L48j00m7j17
7863g1j37J25q6k7K66m2n8j36J64j6k5R6k6O8p4O9J2J4lJ8k93q1M64l55O9N7N7
7890D9j65r8M68l75J51L45n28q9N4K80k7l26K49l2J47OJ95l40j20J33k60J94J10
7913B1J0j73J44L3qk44L24L33p13K18K33k04j05L69k65J1O7m11M72l14J6n2L42
7936A04O8k59N5o7M9l4lr8J54J36j89K72l77R7L5L55j79j46o7RL8O5K49n35o7
7961c35K63N2K1PJ33l19K04lj5l26M23k68K44j68j27N22k56j02j47K24j28M6K22
7984A67j16J9J92k97k6J00K7J81k44QN4j99J08J76J23j86j14k9J62l6k35J80k12
$$ plain form
7818 -212 86 98 -40 93 -33 -217 -186 -144 201 208 69 -223 81 -49 67 172 -117 33 108 -31 164 -8
7840 -8 94 119 -49 -67 135 -105 20 214 39 57 -14 -254 -124 131 -61 -139 -86 -202 -155 193 93 46 -71
7863 -71 -208 -83 -169 -196 70 28 -30 -166 -2 -18 -43 53 27 95 21 90 102 116 113 131 -162 -243 221 -134 -65 -8 49
7890 49 -116 -214 254 -121 30 375 -153 -242 -188 92 65 -261 -12 -44 103 109 304 -36 -156 -23 -283 -89 21
7913 21 31 -142 2 35 27 -217 107 440 -273 -55 178 -26 -131 238 -27 -16 51 -360 112 -202 -186 -238 104
7936 104 172 -87 -32 -99 -50 -84 -87 -185 -31 105 -84 188 -189 -92 -57 298 119 -27 -94 -85 -47 18 267 -268 -335
7961 -335 -72 -20 1 8 141 -178 26 23 8 -318 105 -163 81 -87 -214 308 52 -50 -197 27 -101 -55 167
7984 167 51 70 262 -35 -61 39 66 247 3 11 65 -134 -26 150 273 87 -27 -56 106 70 -165 15 -197
8007a97J67N2l4J86j17k60P9J41j75Q7j12J71J12k2L5K4K1j63O6o4l22Q2M31k36
8031d8J14M6j94K29n8J67k32Q1k51J02J2N4l4J4l3J7m21L64PK67J3j89j33rK22
8056A07j68L07m31K60l27K75J32N2q5q2K62n97K14M3Q2k17J10M2l01K21K83r5
8078H7k24J87j14l8O8P7j04P4n4p2M3J47j06M0j92KL17k37P3J10N7P7m70L68L6
8103A52j16r9k3L2k19K17j47K73m6p0O1o1L26j85q5m8J79j80J35j22K17l02j53
8126b64J45p2K94o7K5j60q0M2K31K39j84N5k15k1k8Q3Q5l49OK79l1%r5J16k56
8151b22L25j46m32O41l31j48K21KJ65L4J05o1l10j16L10l4M5J0j02q9J60M2k79
8174b10L91l26J65k83k1L58K26m97r2J22j7N35m27J58j91R1j21
$$ plain form
8007 -197 -30 22 -12 174 57 -203 -124 17 -158 -71 -183 -12 100 78 113 137 158 -5 61 -3 -325 -243 188 -48
8031 -48 66 112 -82 147 89 256 24 105 -146 -44 -32 22 -12 2 -31 -14 -435 -71 -64 203 216 27 -106 -115 107
8056 107 -61 246 -185 75 -252 23 155 207 122 40 302 -295 -81 -38 44 -173 -63 -21 -322 -101 182 87
8078 87 -137 50 -64 -102 -34 43 -61 13 -41 -113 -70 77 -29 11 -181 -179 138 -99 -26 84 141 218 -252 116 152
8103 152 36 -63 -86 -54 -273 -56 -203 70 24 -46 15 -46 280 95 10 -38 141 -39 96 -26 191 -111 -264
8126 -264 -119 -191 103 36 61 -99 -179 -137 94 333 149 204 -11 -32 -60 23 108 -241 -235 44 13 13 -82 34 -222
8151 -222 103 -43 -475 166 -165 -313 -92 -90 75 109 214 153 -157 -273 37 3 48 58 -44 -133 27 69 -210
8174 -210 181 -145 20 -263 -284 74 300 -197 -289 -167 -184 351 -76 82 -109 -18 -139
8191a39
$$ Imaginary data points
##PAGE= N=2
##DATA TABLE= (X++(I..I)), XYDATA
0@%%%%%%%%%jRj6J6j6K4l2M0m9N7p2Q8j05J28j52J78k10K42k81L27l75M30m89
32b59N56o33P14q05R07j017J138j270J415j573J745j936K144k368K613k883L178
49A666l502L859m249M682n165N702o304O986p768Q671r726J0979j2501J4390j6805
64i085K0026k4554L1425m3226O8945k25235J33090K70258k74275J49298o2248
75C4419j95245R5677J22352K1939j8356j21883R9967j8594j19792J40627M7120
86H8231o0952M0871j87968k0700J63036o2804J58162R5066m14405L761K78645
97H0943j02279N6320J22348j96496o9836Q9902Q8408J5844j14531O0296L2712
108F3631k03548Q2385J33095r2805J05534r596k16897M4302K3658N2796K18093
$$ plain form
0 0 0 0 0 0 0 0 0 0 0 -1 8 -8 8 -8 16 -16 24 -25 32 -40 48 -57 71 -81 97 -113 129 -152 175 -200 230 -259
32 -259 297 -336 378 -427 480 -537 601 -669 746 -827 918 -1018 1126 -1242 1371 -1512 1666
49 1666 -1836 2023 -2226 2456 -2709 2993 -3311 3675 -4093 4578 -5148 5831 -6670 7720 -9085
64 -9085 10941 -13613 17812 -25414 43531 -181704 -48614 221644 -52631 96667 34419
75 34419 -160826 -65149 57203 79142 60786 -61097 38870 20276 -99516 41111 88231
86 88231 27279 68150 -119818 -140518 22518 -40286 117876 212942 -201463 -197702 80943
97 80943 -21336 34984 157332 -39164 -109000 -19098 69310 85154 -29377 30919 63631
108 63631 -139917 -57532 75563 -17242 88292 78696 -138201 -93899 -70241 -17445 200648
119B00648j47172j87198J22918k8362J8049J67115q1858j16019o738K3664R1729
130E6776l9205q853J01512j57535q7220J38690n7375M0927J64086j27338j00052
141g5587Q862k6796J55419O8234j29893m342m6532l1901J59083K1347p3351j9587
153D956q0645K1054N4376k2872R7699k015j35231L0410k2133l8215J60160K8298
165I5842q5834j6781p6980L6702J32908j9338j8774m9179j11376P5188Q3961j1854
177C4485L8909o4508q6148L4508j3627L9103R4637m5532k9762j8765p0947P1832
189a5815Q2687j9183M758p8132p0023R1628N0386J4840J5070j09900n5790M6486
201d2988J5125O8830L2873p6992k1323k0169k2912P9278M1183j4243j3845o9422
$$ plain form
119 200648 53476 -133722 -10804 -39166 -21117 145998 64140 -51879 -58617 -34953 56776
130 56776 17571 8718 110230 -47305 -134525 4165 -53210 -12283 151803 24465 -75587
141 -75587 -66725 -93521 61898 130132 239 -4103 -50635 -82536 76547 97894 24543 4956
153 4956 -75689 -54635 -259 -23131 74568 72553 -62678 -32268 -54401 -92616 67544 95842
165 95842 10008 -6773 -83753 -47051 85857 66519 47745 -1434 -112810 -37622 46339 34485
177 34485 73394 8886 -77262 -42754 -56381 -17278 77359 31827 2065 -16700 -87647 -15815
189 -15815 66872 47689 52447 -25685 -95708 -4080 46306 61146 76216 -33684 -89474 -42988
201 -42988 -27863 40967 73840 -3152 -24475 -44644 -67556 11722 52905 38662 24817 -44605
213d4605q880O3884K5991M1838k6902j15413n552M4202K5133P3089q729q8565
225b4509k9999j2024L1551P3829M174j8151k7052n4734K2381N8659K1917J2148
237E8190m6946o2800O631K6183N7315M9031o1078o7640j5123r992N5485P0743
249E9999j4935m2386l9286k0896L8264M6294K2771q453n8316l2466K5416L4924
261A0930M5656Q938n9644n2515j6570K4530O7119L1400k8337m3539m5844k242
273f0118N5114M3821O194k8179m7859j3502L0623M6147L0721k2821n6077l3456
285d9392L308M3133N4626N678m3235n1987k7926K2560N4135L4722q104m3923l8343
298d4748L941L8961M3167J2930l5451m9219j6499K5441M9064L3320j5334n2953
$$ plain form
213 -44605 -53485 10399 36390 78228 51326 -64087 -69639 -25437 -304 72785 64056 -24509
225 -24509 -54508 -66532 -34981 38848 43022 24871 -2181 -56915 -34534 24125 46042 58190
237 58190 11244 -51556 -44925 -18742 38573 87604 26526 -41114 -56237 -66229 -10744 59999
249 59999 45064 2678 -36608 -57504 -19240 27054 49825 41372 -16944 -49410 -23994 10930
261 10930 56586 65524 5880 -46635 -63205 -38675 28444 59844 31507 -12032 -57876 -60118
273 -60118 -5004 38817 45011 16832 -31027 -44529 -13906 32241 62962 40141 -15936 -49392
285 -49392 -46084 -2951 51675 57353 14118 -37869 -65795 -43235 10900 45622 37518 -6405 -44748
298 -44748 -40807 -1846 41321 54251 18800 -30419 -46918 -21477 27587 60907 45573 -7380
310g380m6897l240L9890M8170J8436k7163m9185k6489J8537M5239L4407m998l9869
323e42l7599l96L8843M4804J2722l2016n1946k9464J7689M8959L6964m063m2489
336A466m6562j0394L2724M5053K1589k0751m3060k2746J5525M1388L7118n037
348D6313m4190m0401o263L2344M6824K1131k2955n4265l5701J5388L8478L4203
360C0906J2826l6931m7331j976K8327L7181K3985j9872m1479k6914Q527M7575
372A4824L7255o823l1939m7124k2905L1611M4624K6694j3290n1897k7177J0069
384c6078K4154M7257J0912m7960k8074k895J4402M7942K2416k1391l5751m1572
396d6638O763M4887K5083J7092k1858o2865j3753K3565L2307M0969j6244m6752
$$ plain form
310 -7380 -54277 -57517 -17627 30543 48979 21816 -27369 -53858 -35321 9918 44325 39327 -542
323 -542 -38141 -38537 306 45110 57832 25816 -26130 -55594 -37905 11054 48018 43955 1466
336 1466 -45096 -55490 -22766 22287 43876 23125 -19935 -42681 -27156 14232 51350 46313
348 46313 2123 -38278 -44541 -12197 34627 55758 32803 -21462 -57163 -41775 -3297 30906
360 30906 43732 6801 -40530 -42506 -14179 23002 46987 27115 -14364 -41278 -32751 14824
372 14824 52079 45256 13317 -33807 -56712 -25101 19523 46217 32927 -18970 -46147 -36078
384 -36078 -11924 35333 46245 -1715 -29789 -32684 -18282 29660 52076 30685 -5066 -46638
396 -46638 -39875 5012 30095 47187 25329 -37536 -51289 -27724 4583 45552 29308 -17444
408a7444j4862p270L6238N5178j6364k9432k1282l2246K9244M6793P556O092l9253
421B948n2123J3541J8335L1843L9818l8147m6211p538j882N3709L9636l4673k2209
434b953l1112j4380O3283K7098j0322k044n6146j9746L7766P52L6114K6125o3754
447i319k2746L011q406N9443K8076l6256k5191m2334J8117P2952j185k715j7127
460A6320p4169K1401N2166l445L2375k0460n6697K0425j9221J149P8467j9514
472B8797l9035J0468m6902Q946P1079J2406r108n7267m3754N7052J6910J6718
484B6310M6959q3390n1430N8682j2439J7658M4609m7527k484n408m7862N8420
496B098L2772k9981K9536m0706o1924M7773M4841L3629j3679q2475O926R033j0044
$$ plain form
408 -17444 -32306 -39576 -3338 51840 35476 6044 -15238 -47484 -18240 28553 36109 42201 2948
421 2948 -49175 -35634 -17299 14544 54362 16215 -29996 -37534 -39416 14293 53929 19256 -2953
434 -2953 -34065 -48445 14838 41936 31614 29570 -26576 -46322 -8556 -7804 28310 54435 -9319
447 -9319 -32065 -29054 -37460 21983 50059 13803 -11388 -53722 -35605 37347 36162 33447 16320
460 16320 -57849 -36448 15718 12273 44648 24188 -32509 -12084 -31305 -30156 48311 28797
472 28797 -10238 230 -46672 -37726 33353 45759 36651 -20616 -64370 -7318 9592 26310
484 26310 73269 -10121 -61551 -2869 -15308 2350 46959 -568 -3052 -8460 -56322 2098
496 2098 34870 4889 34425 -6281 -68205 -20432 24409 58038 44359 -38116 -31190 -22157 -32201
509c2201J01826j3121j08835M2900O400m0321O5750K992k4746J6386n0270K516
521c0724L9522j6322N4510O450r5868l756K2200L1711O3864m8335m1263M245n6210
534f9976O9783Q3495r5821o830M0655o7445K6092M8976k3994J9331j7892k9525
546b3151J3359l1942M9746P6352p1108l8263p21l1477P6311M0977m9107j37n7822
559d6983j4562J08429k2611m0289N1648n3787k7094N5978j2434J5625J8932k9721
571C131M491m9091j4418J04125k674m0084J3108p5157O40R1963o623q92k3009
584E510p2729N4657L6844l3984M8066j7642n7631L5180j1343n654M9076j0096
596B0254N555k1075p3969N0015N1049k0311L5104m5252p6480N8081L2860Q166
$$ plain form
509 -32201 69625 56504 -52331 -9431 -3031 -43352 22398 25390 644 17030 -33240 -30724
521 -30724 8798 -7524 46986 53436 -42432 -46188 -23988 7723 71587 23252 -18011 -13766 -69976
534 -69976 -193 83302 -12519 -19349 21306 -46139 -20047 28929 4935 24266 6374 -23151
546 -23151 -9792 -41734 8012 84364 13256 -25007 -25728 -57205 19106 60083 10976 10839 -46983
559 -46983 -61545 46884 24273 -16016 35632 -18155 -45249 10729 -1705 13920 32852 3131
571 3131 7622 -41469 -55887 48238 45564 5480 18588 -56569 -55929 36034 29411 28519 5510
584 5510 -67219 -12562 24282 -9702 38364 20722 -36909 -1729 -13072 -18726 30350 20254
596 20254 25809 4734 -69235 -19220 31829 11518 46622 1370 -75110 -17029 15831 23997
608B3997K3668o8204j9879M1073j9768L6710K7119n4544J3023l584m1688M0870
620a207J6394L259K5148o6995k8390M7605j908M1287J7957q6174q375K7751L058
633a0590N7363j2131n5245J4589j9508M357N4497k2518k413J4995n3385L187K5991
646h11m976M6631j1166o3259Q672q03K1923O1358l4761m2599R79k1446M2183M3236
660D5161l4367j555j3785l5059L6915J2983o639K9772l0634l0563J5578j1442
672b3635L2321L9087m0275k0792j1410j4837N5683K5747k6279p859l8196p232
684c7677N0985K210J914P280m5394m517K0035m903L1610P421l4145m675j7765
697b7621J781N1727M095j7169j1339l9972J0496M3338O187P743k1227m1388J3574
$$ plain form
608 23997 47665 -20539 -40418 655 -19113 17597 44716 -9828 3195 -389 -42077 -1207
620 -1207 15187 18446 43594 -23401 -51791 -4186 -6094 35193 53150 -33024 -41399 -13648 -10590
633 -10590 46773 34642 -20603 -6014 -25522 -21165 33332 10814 8401 23396 -29989 -26802 -811
646 -811 -5787 40844 29678 -33581 -24909 -25712 -3789 57569 22808 -19791 -18812 -40258 1925 45161
660 45161 10794 9239 -4546 -39605 -2690 10293 3654 33426 2792 -27771 -12193 -23635
672 -23635 8686 47773 7498 -13294 -24704 -39541 16142 41889 15610 7751 -30445 -37677
684 -37677 13308 15518 17432 24712 -20682 -25199 -5164 -10067 21543 28964 -5181 -9856 -27621
697 -27621 -25840 25887 29982 12813 1474 -38498 -28002 15336 21523 29266 8039 -33349 -19775
710a9775J6145R018K7089j9578k9550K459q565J8234L2357r237j0872j9478k5126
723c6879K5621K9113M917L689l2395k8466J7472J6934K0413J1120l1520j9982
735a9963K45L600K9433J4911j8229j2772j9358n038K9953J6928K502p216l2907
748a7911j1383J8751J7653K0392m036l1324j4279P73J5427K9332R42j9913j6738
761a2314j4084J0528K7759J0224k960j9328k5031L131J9312J7762J2512j4331
773A3180k8022r119Q126K1564J9414n938k0135j9166n248K0809K2883L813j0725
786A1436k2332j5663J0563K1881J6980j056k1137k0284k604J4073K3200J0521
798B5578j3874k1559j3227N467K1747J7695j395j9049k1088l793J6723K0716R952
$$ plain form
710 -19775 -3630 5388 32477 12899 -16651 -14192 -22757 -4523 27834 18597 7725 -11753 -36879
723 -36879 -11258 17855 22772 26461 -5934 -34400 -16928 6 20419 31539 19 -19963
735 -19963 -19718 -16118 13315 28226 9997 -2775 -22133 -27171 2782 19710 22212 14996 -17911
748 -17911 -29294 -10543 7110 27502 23466 -7858 -22137 -21364 -5937 23395 24337 4424 -12314
761 -12314 -26398 -15870 11889 22113 19153 -175 -25206 -22075 -2763 14999 27511 13180
773 13180 -14842 -23961 -15835 5729 25143 19205 -930 -20096 -25344 -4535 18348 22161 11436
786 11436 -10896 -26559 -15996 5885 22865 21809 672 -19612 -22216 -8143 15057 25578
798 25578 11704 -9855 -23082 -17615 4132 21827 20432 1383 -19705 -23498 -6775 13941 23893
811B3893r934k3320j4249O167K0658J7741L49j8123j9986o304J4462K1871R437
824B2662r435k0328j5722M712K0772J7501M99j6414k0816o105J2992K1624J1598
837B3540r069k0432j5080K205J9054J9143J370j5591k0018p727J2682J9983J1532
850B1592n950k1441j5615L404J6887J8394N197j6787j9241q007R455K2088J1889
863B1865o747j7381j7522l81K0078J6455L632j2116k1804p834J1062J7160J5449
876B1916n625k0840j2257j620J3306K2158L538j3150j6420j4216R960K2086R495
889A8331j154j7260k1336L720J5259J5265R871j5813j9243m268J911J9561J7649
902B2493r620j3063j2577r085J7113J8461L991l584k3776j4540J4462J1863J5137
$$ plain form
811 23893 13959 -9361 -23610 -17443 3215 20956 21305 3182 -16804 -23108 -8646 13225 22662
824 22662 13227 -7101 -22823 -18111 2661 20162 20661 4247 -16569 -22674 -9682 11942 23540
837 23540 14471 -5961 -21041 -18836 218 19361 20731 5140 -14878 -22605 -9923 10060 21592
850 21592 15642 -5799 -21414 -18010 -1123 17271 22468 5681 -13560 -21567 -12112 9976 21865
863 21865 15118 -2263 -19785 -20166 -88 16367 19999 7883 -13921 -21755 -10693 6467 21916
876 21916 16291 -4549 -16806 -18426 -5120 17038 20576 7426 -8994 -23210 -13250 8836 18331
889 18331 17177 -83 -21419 -17699 -2440 12825 22696 6883 -12360 -16628 -14717 4844 22493
902 22493 12873 -190 -12767 -21852 -4739 13722 17713 14129 -9647 -24187 -9725 2138 17275
915A7275N690k6193j5949L279Q333K2855N448j6780p569j4752J02K8177M928m249
929A0595j565k3924n960J6452J0120J6655p216k8627j763O53R129L2070p003k5947
943f331m658q720J2829K3341m047j709j2663k2835J7895J1864k757J8745j1007
956I947k7075K560K006J7585K1857j8517j1600j0305j5538L3903K3185k0333l476
969D199j4612j3685K4574P474M418M431k8878j133J2581j3741K3655J7658k7264
982c23n767q553o369L2285P789o547m718l7209O041L9164n884L120q58l4124P189
997a4764J5204O09J8377j3199j4326J1854k1780K623L7216j1004m866r54l1931
1010b6941J0712K4702M279J4496k9509l0731K7743N624N184K3183l0437j7345
$$ plain form
915 17275 22965 -3228 -19177 -15898 -7565 15290 20738 3958 -3611 -18363 -18261 9916 14844 10595
929 10595 9030 -14894 -20854 -4402 5718 22373 15157 -13470 -15233 -14580 -5451 26619 19616 -6331
943 -6331 -10989 -19709 -6880 16461 12414 10705 -1958 -24793 -6898 4966 2209 20954 9947
956 9947 -17128 -14568 -12562 5023 26880 8363 -3237 -13542 -29080 4823 28008 7675 4199
969 4199 -10413 -24098 476 7950 12368 16799 -12079 -13212 -631 -14372 9283 26941 -323
982 -323 -6090 -14643 -21012 11273 19062 12515 7797 -29412 -23371 15793 9909 13029 12171 -21953 -14764
997 -14764 440 1049 19426 6227 -8099 3755 -18025 -15402 21814 10810 5944 4990 -26941
1010 -26941 -16229 8473 12752 27248 -2261 -32992 -5249 375 5559 28742 -1695 -19040
1022a9040J5264o356J5958R251j7405J3449j4128k5149L0015N742l057K2054l1898
1035e300k3191K0303M949K4918N300m2205P55N999m421L6184l871l0647J0560
1048f67r572j559K3179j1453Q505R100l4845M762J1123r548L4374J019l9502J250
1062a3834k805J1097L6560j8620j9476J532j9652K4259K5509k4076M189l091k1359
1075a9767J9772L16m752K6728j7396j5974Q881j9633J9447L3714k4259r216q938
1088a1077j7740L6680J5476j7865L094k5112o356L4014p089L15J1544k7186L463
1101g839R191j6726K4015J0095j9916O213j9274j0505L7721K799o173o53l4530
1114b5582O193L0781m522R581r085l0228J6987O742m515K1217j3039j1747J2233
$$ plain form
1022 -19040 -3776 -10132 5826 15077 -2328 11121 -3007 -28156 1859 7601 4544 26598 -5300
1035 -5300 -28491 -8188 -3239 21679 26979 -15226 -14471 -8472 -12893 23291 19420 -11227 -667
1048 -667 -10239 -11798 11381 -72 8433 17533 -17312 -12550 -1427 -10975 23399 24418 -15084 -13834
1062 -13834 -16639 -5542 31018 12398 -7078 -5546 -25198 -939 24570 494 4683 1592 -19767
1075 -19767 5 321 -4431 22297 4901 -11073 -2192 -21825 -2378 31336 7077 -2139 -11077
1088 -11077 -28817 7863 23339 5474 8568 -16544 -22900 11114 4025 4340 15884 -11302 -7839
1101 -7839 1352 -15374 8641 18736 -1180 5033 -14241 -24746 12975 15774 9601 8948 -25582
1114 -25582 -19389 11392 6870 16451 7366 -22862 -5875 867 -3648 17569 4530 -7217 5016
1127E016k0066M024K5618r061N478n925l0754J5528J6881J271J5018k4381k3597
1140b4950J9638K009J0684J5853k7369o611P946j0037J8855P059j4329R906j2543
1153c889j5683K0250K221M700J2410k7089j1606J2431J104K1768L380k8625q82
1166i510q63O21K6412m321j4858L676j3533K715J7633n304O497L92k2657L488
1180i612N664R12K1375o214k0648k19n970J1619K2908j0769r186n003j2641J5737
1194b047J3830o648L509j0477j2841J1148K418N187J1770j3765j0346R39n182
1207a2505J6236J2856j0968n232j0403o212J9403Q007l383j005j6524l543J2577
1220f96L419P124P79j5769k836Q69P96J5427K982j0271m535r739K245J6039L882
$$ plain form
1127 5016 -15050 -11026 14592 5531 11009 5084 -25670 -10142 6739 8010 23028 -1353 -24950
1140 -24950 -5312 -3303 7381 23234 -4135 -10746 -2800 -12837 6018 13077 -1252 8654 -3889
1153 -3889 -19572 678 2899 7599 20009 -7080 -18686 -6255 -5151 16617 19997 -8628 -9510
1166 -9510 -10373 -9752 16660 12339 -2519 1157 -12376 -9661 7972 2668 9165 9557 -13100 -9612
1180 -9612 -3948 -3036 18339 12125 -8523 -8742 -14712 -3093 19815 9046 -140 -5143 -17784 -2047
1194 -2047 11783 5135 8644 -1833 -14674 -3526 -1108 4079 15849 2084 -8262 -7323 -12505
1207 -12505 3731 16587 5619 387 -10016 -16228 3175 11182 7799 6794 -9730 -13273 -696
1220 -696 2723 9847 10626 -5143 -7979 -7110 -6314 9113 12095 1824 -2711 -12450 -10205 5834 9716
1235I716o50o797j5445L121J1031M771O903p338j4080p01L802P320J0441m849
1249G245q353n310n864Q527J2087L02k062r588r561N548R185O772K164j1489r335
1264i732J751M385J0124N967q460q882m586P95J0323P704j170o267j0048k608
1278a0704P546Q022M778k629j0883o105K975P565R042J30r075p454l408N740J1010
1293F550L618m480q067p487J238Q698P725J006o514r362j858M633Q823N912m191
1308F244r153n833Q84P764Q725P82p160q586l523M789Q678N627k166q804p213
1323h945J348O650P831K330o338q815l108M260Q604N805k904p976o945n04P577
1338a130Q138J748n545q339m089L832P612O268j700q336o015J49N974Q432K077
$$ plain form
1235 9716 9066 2269 -13176 -10055 976 5747 12650 5312 -8768 -9469 -5667 1653 12094 7245
1249 7245 -1108 -6418 -12282 -3755 8332 8634 6572 -3016 -12577 -7029 2156 8928 11092 -397 -9732
1264 -9732 -7981 -3596 6528 12495 4035 -4847 -9433 -8638 1685 9389 8219 1952 -8096 -10704
1278 -10704 -3158 4864 9642 7013 -3870 -9975 -7000 565 9607 9737 662 -6792 -10200 -4460 6550
1293 6550 10168 5688 -2379 -9866 -8628 70 7795 8801 2287 -7075 -8933 -4300 4523 10435 6244
1308 6244 -2909 -8742 -7858 -94 8631 9413 2253 -6333 -9856 -5067 3611 9238 7072 -1732 -8945
1323 -8945 -7597 -947 6884 9214 2876 -5939 -9047 -4787 3817 9622 6718 -1258 -8203 -8707 -1130
1338 -1130 7008 8756 3211 -5128 -9217 -5385 2227 8495 6795 -1541 -7556 -7407 -1433 6999 9076
1353I076o014p771m116L030R043N008j036p493p558l25O012P130L879n001q314
1368d450l203J970P272P010j669o957o519j907P344P102K076k846q672o347M984
1383d812O561M406J530o991p455k24L349Q155L898n422n137m770n52R445O420
1398H401j276n412q768r95O439M412O139k538j2028j777L583J445P967K599p847
1413C44m955k629L942P996J306J01n633j0679M029Q371L102L543o477r570J060
1428f149J141P237Q646q816o193K541n539M415J0555j986m260n084l357M472K754
1443C77O795L441j3907n993O385p18Q425O152j1432m399j324l35J2450P84p453
1458g52L199o769m214J0545L320j117L10p553j954j134L813J4864n599j2381L688
$$ plain form
1353 9076 3062 -4709 -8825 -5795 3248 8256 7220 -273 -7831 -8156 -2144 4986 8865 3864 -4450
1368 -4450 -7653 -5683 1589 8599 6930 -27 -6546 -8453 -1109 5993 8069 5223 -3449 -9796 -4812
1383 -4812 1749 6155 7685 694 -6761 -6985 -3636 4519 8417 2995 -2142 -6912 -7464 1981 8401
1398 8401 7125 1713 -7055 -8050 -1611 2801 8940 6402 -5626 -7403 -3820 -2375 5592 8191 344
1413 344 -4611 -7240 -3298 4698 6004 6105 472 -10207 -6178 2193 5295 8838 2361 -7209 -6149
1428 -6149 -5008 2229 10875 2059 -4134 -1593 -7132 -2717 7838 5852 1592 -3492 -6849 -2377 377
1443 377 7172 10613 -3294 -9287 -2902 -3620 4805 10957 -475 -4874 -6198 -6533 5917 6701 -752
1458 -752 2447 -4322 -8536 2009 5329 4212 4522 -3031 -4985 -6119 -2306 12558 6959 -5422 -1734
1473a734n506L88J6796k792q714p19n663N356Q285m173L749l090j0760N940L150
1488E13p04P874l410n841k844o632J2351R582j0033J645m118j3138J5064J0105
1502A0414q456O72n920m797R061l59L310L942j0878N21J652o816J0071N297n665
1517B049J366j1057k597J4930j372R09L191j8438J147J5411k985K906o54j1986
1531g180L893J537r0R332n779k817N364j1958J268J1301l600M807k279j5514P354
1546d361O022l29J0495j0701j3001J0036Q72K770Q765j1366k630L063o191Q558
1560B002J947o064Q655n977r824R142j456L430R551j4130n865O258j985J1992
1574G676L471j5524J217p67j981J3516k928o719N250q231O35Q000o438N668L950
$$ plain form
1473 -1734 -7240 -6852 9944 7152 -1562 -2281 -7944 -2588 5697 1524 5273 2183 -8577 -2637 513
1488 513 -191 7683 4273 -1568 -4412 -11044 1307 10889 856 2501 -1617 -14755 309 10414
1502 10414 1958 2630 -3290 -8087 974 615 3925 7867 -3011 -2490 -838 -7654 2417 7714 2049
1517 2049 3415 -7642 -10239 4691 3319 4228 7419 -11019 -9872 5539 2554 5460 4806 -7180
1531 -7180 -3287 -1750 -1840 7492 1713 -1104 4260 -7698 -6430 4871 1271 6078 3799 -11715 -4361
1546 -4361 1661 1332 11827 1126 -11875 -1839 -967 1803 10568 -798 -3428 -365 -6556 2002
1560 2002 3949 -2115 6540 563 -9261 -119 -1575 1855 11406 -2724 -8589 -2331 -4316 7676
1574 7676 11147 -4377 -3160 -3927 -5908 7608 4680 -2039 3211 -5020 -4385 3615 -2823 2845 6795
1589F795j1689K356j72k129J4475k365j1131K029o748N415J4858q054l701m92
1603e53q750R472N246p132N715l491p101P898l723k95J0594o507l049N86q065
1618i155R877R055p358M80o634o849J3464K587l538K854j0057p17R166m761L578
1633A992L336r543L413K50n538R807J853m376K032r560j242J1167n97K278p30
1648D542j2696L208O766j984O636m531q288N613j403M99P277m753j560K338p547
1663e883L226O059j728M228m293r114M706K480K189O133q386n293M073j674N424
1678B147M150p735K09m19l556O857J802k420K768n511l874N017j34M234K929p964
1694a500k430J616p38P209R54o600m78k379J285P257j399j545K43n919J198M596
$$ plain form
1589 6795 -4894 -2538 -2710 -4839 9636 7271 -3860 -1831 -8579 -3164 11694 3640 -61 -553
1603 -553 -9303 169 5415 -1717 3998 507 -6594 1304 -2419 -2714 7880 1373 -1676 -1090 -9155
1618 -9155 722 9777 2419 2899 -3735 -10584 2880 5467 1929 4783 -5274 -5991 3175 -1586 1992
1633 1992 5328 -4215 -802 -552 -6090 3717 5570 1194 3226 -6334 -7576 3591 2994 5272 4542
1648 4542 -8154 -4946 1820 -164 6472 1941 -6347 -734 -2137 -1638 5639 886 -674 1664 -5883
1663 -5883 -2657 3402 1674 5902 1609 -7505 -2799 -319 1870 8003 -383 -5676 -1603 -3277 2147
1678 2147 6297 -1438 -1229 -1648 -5204 1653 3455 1035 3803 -1708 -5582 -565 -699 3535 6464 -1500
1694 -1500 -3930 -2314 -3052 4157 5111 -1489 -1967 -4346 -3061 4196 2797 1252 1495 -4424 -3226 1370
1710A370p17L550o83o335l7K24J790N867k060m353o38k532L522N468j847j388
1726A201k667m125M653L041J08K046l877m289K441L13J998L997l300k874j199
1741b533j289M580K771k127q12l930j050M516K321N93m89m664j294K122J225L330
1757C270L62m075j235r88L99M163J134j729k022k742O52L473J693Q03k509m331
1773c682N72K499J729K706j142l679j332L31J829K955l10k049k407j392J962L011
1789A601P29m92k811k429Q89K911K121J093k658k592p98O81L166K083j351k750
1805f07j628l42K152K489K06j709k735q02J541K254J861k72k956k124K61J934
1821d77K829R90k015k551j406J037K634J491r43j927j953l38K288K514J50j493
$$ plain form
1710 1370 653 4203 3520 -2815 -2852 -2628 -838 5029 2969 -1384 -2022 -4554 -1032 4436 2589 1201
1726 1201 -1466 -5591 -938 2103 2211 4257 380 -3909 -1468 -1155 843 4840 1540 -1334 -2533
1741 -2533 -3822 758 3529 1402 590 -3340 -4390 126 2447 3040 2551 -2113 -3407 -1285 -60 3270
1757 3270 3632 -443 -1678 -2666 -2267 1896 3030 1301 -721 -3463 -2811 662 2355 3158 649 -3682
1773 -3682 -3110 -611 1118 3824 2682 -997 -2329 -1998 -169 2786 2476 427 -1980 -3372 -1410 1601
1789 1601 2330 1838 -973 -3402 -2513 398 2519 3612 954 -1638 -2436 -1755 1411 3494 2143 -607
1805 -607 -2235 -2577 -425 2064 2270 561 -2174 -2976 -1435 819 2680 2408 -548 -2672 -2411 -477
1821 -477 2352 3342 1327 -1224 -2630 -1593 1041 2532 1589 -338 -2291 -2629 -341 2173 2323 830
1837H30k732q47P59K567K222o02k187j782q05J937K621L69j237k074j390O98K268
1854F15J524l58j838k526l9J890K348J138j557k283j441P29K364J488J8j410k862
1871b200p7K028J520L50J59l051j677J434J935J542P1j813j879j217J780L169
1887B074K38j091j175k411Q75K031N97J234k046k705Q23P73P86L081j345l237
1903a498r73Q38J283K194P40j274l098r45K947N56L52J303k952j658J655M43J168
1920A081J079k807n07k77j043L251K171k122q80j594o22J731K024J297j767l488
1936b473J400J484j116L145k03m418O80O37k82L044n57j372j08k370N14L487m74
1953A018O85l03l390J28J621J537J453l190j613K047j859K098L016l306j362J119
$$ plain form
1837 830 -1902 -2749 -1990 577 2799 2197 10 -1772 -2577 -640 1981 2350 1113 -961 -2351 -1653 615
1854 615 2139 1781 -57 -2583 -2622 -732 1616 2754 1197 -1086 -2527 -1798 566 2054 2072 662 -2200
1871 -2200 -2277 -249 1271 1621 1780 -1271 -2948 -1514 421 1963 2034 221 -1658 -2875 -1095 2074
1887 2074 2312 1221 46 -2365 -1490 541 1138 2372 326 -2379 -1556 -783 3 3084 1739 -1498
1903 -1498 -2471 -1633 -350 1844 2584 1310 -1788 -2733 214 770 1122 2425 -527 -2185 -530 -87 1081
1920 1081 2160 -647 -1154 -1431 -2474 777 2948 826 -54 -1648 -2270 -539 1485 2782 1015 -2473
1936 -2473 -1073 411 -705 2440 2237 -2181 -1501 -864 -1146 1898 1341 -31 -139 -2509 -1995 1492 1018
1953 1018 1703 1400 -1990 -1862 -241 1296 2749 -441 -2054 -7 -1866 232 3248 -58 -1420 -301
$$ [...]
8191a
##END NTUPLES=NMR FID
##END=
