##TITLE=1H_DE-126H2
 200.13MHz,D2O.
 8 sc
 
 13.2.2026
##JCAMPDX= 6.0         $$ Bruker NMR JCAMP-DX V2.0
##DATA TYPE= NMR FID
##DATA CLASS= NTUPLES
##ORIGIN= UXNMR, Bruker Analytische Messtechnik GmbH
##OWNER= pz
$$ XWIN-NMR		Version 3.5
$$ Fri Feb 13 15:17:41 2026 Russian Standard Time (UT+4h)  she@DPX200
##.OBSERVE FREQUENCY= 200.1313
##.OBSERVE NUCLEUS= ^1H
##.DELAY= (6, 6)
##.ACQUISITION MODE= SIMULTANEOUS
##.ACQUISITION SCHEME= undefined
##.AVERAGES= 8
##.DIGITISER RES= 18
##SPECTROMETER/DATA SYSTEM= spect
##.PULSE SEQUENCE= zg30
##.SOLVENT NAME= D2O
##.SHIFT REFERENCE= (INTERNAL, D2O, 0, 14.3821)
##AUDIT TRAIL= $$ (NUMBER, WHEN, WHO, WHERE, WHAT)
$$ ##TITLE= Audit trail, XWIN-NMR		Version 3.5
$$ ##JCAMPDX= 5.01
$$ ##ORIGIN= Bruker BioSpin GmbH
$$ ##OWNER= she
$$ F:/spectra/data/she/nmr/H-C/1/audita.txt
$$ ##AUDIT TRAIL=  $$ (NUMBER, WHEN, WHO, WHERE, WHAT)
(   1,<2026-02-13 15:15:31.39 +0400>,<she>,<DPX200>,
      <created by zg, POWCHK disabled, PULCHK disabled
       configuration hash MD5:
       00 E9 B6 7A A2 85 ED C7 34 08 36 98 17 FE 4E 26
       data hash MD5: 16K
       68 BC 40 0A 3E F4 72 AB 74 0B 87 88 14 47 E4 83>)
$$ ##END=
$$ 
$$ hash MD5
$$ 13 6A F9 70 6F F2 BF 53 05 A9 9F 20 DA 15 96 53
##$RELAX= 
##$RELAX= 
##$RELAX= 
##$RELAX= 
##$RELAX= 
##$RELAX= 
$$ Bruker specific parameters
$$ --------------------------
##$DU= <F:/spectra>
##$EXPNO= 1
##$NAME= <H-C>
##$PROCNO= 1
##$TYPE= <nmr>
##$USER= <she>
##$AMP= (0..31)
100 100 100 100 100 100 100 100 100 100 100 100 100 100 100 100 100 100 
100 100 100 100 100 100 100 100 100 100 100 100 100 100 
##$AQSEQ= 0
##$AQ_mod= 1
##$AUNM= <au_zg>
##$AUTOPOS= <>
##$BF1= 200.13
##$BF2= 200.13
##$BF3= 200.13
##$BF4= 200.13
##$BF5= 200.13
##$BF6= 200.13
##$BF7= 200.13
##$BF8= 200.13
##$BYTORDA= 1
##$CFDGTYP= 0
##$CFRGTYP= 5
##$CHEMSTR= <none>
##$CNST= (0..31)
1 1 145 1 1 1 1 1 1 1 1 1 1 1 1 1 1 1 1 1 1 1 1 1 1 1 1 1 1 1 1 1 
##$CPDPRG= <>
##$CPDPRG1= <>
##$CPDPRG2= <>
##$CPDPRG3= <>
##$CPDPRG4= <mlev>
##$CPDPRG5= <mlev>
##$CPDPRG6= <mlev>
##$CPDPRG7= <mlev>
##$CPDPRG8= <mlev>
##$CPDPRGB= <>
##$CPDPRGT= <>
##$D= (0..31)
0 0.7 0 0 0 0 0 0 0 0 0 0.03 0 0 0 0 0 0 0 0 0 0 0 0 0 0 0 0 0 0 0 0 
##$DATE= 1770981330
##$DBL= (0..7)
120 120 120 120 120 120 120 120 
##$DBP= (0..7)
150 150 150 150 150 150 150 150 
##$DBP07= 0
##$DBPNAM0= <>
##$DBPNAM1= <>
##$DBPNAM2= <>
##$DBPNAM3= <>
##$DBPNAM4= <>
##$DBPNAM5= <>
##$DBPNAM6= <>
##$DBPNAM7= <>
##$DBPOAL= (0..7)
0.5 0.5 0.5 0.5 0.5 0.5 0.5 0.5 
##$DBPOFFS= (0..7)
0 0 0 0 0 0 0 0 
##$DE= 6
##$DECBNUC= <off>
##$DECIM= 32
##$DECNUC= <off>
##$DECSTAT= 4
##$DIGMOD= 1
##$DIGTYP= 9
##$DL= (0..7)
0 120 120 120 120 120 120 120 
##$DP= (0..7)
150 150 150 150 150 150 150 150 
##$DP07= 0
##$DPNAME0= <>
##$DPNAME1= <>
##$DPNAME2= <>
##$DPNAME3= <>
##$DPNAME4= <>
##$DPNAME5= <>
##$DPNAME6= <>
##$DPNAME7= <>
##$DPOAL= (0..7)
0.5 0.5 0.5 0.5 0.5 0.5 0.5 0.5 
##$DPOFFS= (0..7)
0 0 0 0 0 0 0 0 
##$DQDMODE= 0
##$DR= 18
##$DS= 0
##$DSLIST= <SSSSSSSSSSSSSSS>
##$DSPFIRM= 0
$$ [...]
##$SUBNAM0= <"">
##$SUBNAM1= <"">
##$SUBNAM2= <"">
##$SUBNAM3= <"">
##$SUBNAM4= <"">
##$SUBNAM5= <"">
##$SUBNAM6= <"">
##$SUBNAM7= <"">
##$SUBNAM8= <"">
##$SUBNAM9= <"">
##$SW= 18.0517328524113
##$SWIBOX= (0..15)
0 0 2 0 0 0 0 0 0 0 0 0 0 0 0 0 
##$SW_h= 3612.71676300578
##$TD= 16384
##$TD0= 1
##$TE= 0
##$TE2= 300
##$TE3= 300
##$TEG= 300
##$TL= (0..7)
0 120 120 120 120 120 120 120 
##$TP= (0..7)
150 150 150 150 150 150 150 150 
##$TP07= 0
##$TPNAME0= <>
##$TPNAME1= <>
##$TPNAME2= <>
##$TPNAME3= <>
##$TPNAME4= <>
##$TPNAME5= <>
##$TPNAME6= <>
##$TPNAME7= <>
##$TPOAL= (0..7)
0.5 0.5 0.5 0.5 0.5 0.5 0.5 0.5 
##$TPOFFS= (0..7)
0 0 0 0 0 0 0 0 
##$TUNHIN= 0
##$TUNHOUT= 0
##$TUNXOUT= 0
##$USERA1= <user>
##$USERA2= <user>
##$USERA3= <user>
##$USERA4= <user>
##$USERA5= <user>
##$V9= 5
##$VALIST= <valist>
##$VCLIST= <CCCCCCCCCCCCCCC>
##$VD= 0
##$VDLIST= <DDDDDDDDDDDDDDD>
##$VPLIST= <PPPPPPPPPPPPPPP>
##$VTLIST= <TTTTTTTTTTTTTTT>
##$WBST= 1024
##$WBSW= 4
##$XGAIN= (0..3)
0 0 0 0 
##$XL= 0
##$YL= 0
##$YMAX_a= 210532
##$YMIN_a= -191281
##$ZGOPTNS= <>
##$ZL1= 120
##$ZL2= 120
##$ZL3= 120
##$ZL4= 120
##$ABSF1= 10
##$ABSF2= 0
##$ABSG= 5
##$ABSL= 3
##$ALPHA= 0
##$AQORDER= 0
##$ASSFAC= 0
##$ASSFACI= 0
##$ASSFACX= 0
##$ASSWID= 0
##$AUNMP= <proc_1d>
##$AZFE= 0.1
##$AZFW= 0.1
##$BCFW= 1
##$BC_mod= 2
##$BYTORDP= 1
##$COROFFS= 0
##$CY= -3
##$DATMOD= 1
##$DC= 2
##$DFILT= <>
##$DTYPP= 0
##$F1P= 0
##$F2P= 0
##$FCOR= 0.5
##$FTSIZE= 0
##$FT_mod= 4
##$GAMMA= 1
##$GB= 0.15
##$INTBC= 1
##$INTSCL= 1
##$ISEN= 128
##$LB= 0.25
##$LEV0= 0
##$LPBIN= 0
##$MAXI= 10000
##$MC2= 0
##$MEAN= 0
##$ME_mod= 0
##$MI= 1.114404
##$NCOEF= 0
##$NC_proc= 0
##$NLEV= 6
##$NOISF1= 3.799351
##$NOISF2= 2.8
##$NSP= 1
##$NTH_PI= 0
##$NZP= 0
##$OFFSET= 14.38212
##$PC= 1
##$PHC0= -3703.969
##$PHC1= 10.99232
##$PH_mod= 1
##$PKNL= yes
##$PPARMOD= 0
##$PSCAL= 0
##$PSIGN= 0
##$REVERSE= no
##$SF= 200.129724274929
##$SI= 16384
##$SIGF1= 3
##$SIGF2= 2
##$SINO= 400
##$SIOLD= 16384
##$SREGLST= <1H.CDCl3>
##$SSB= 0
##$STSI= 0
##$STSR= 0
##$SW_p= 3205.1282051282
##$SYMM= 0
##$S_DEV= 0
##$TDeff= 0
##$TDoff= 0
##$TI= <>
##$TILT= no
##$TM1= 0
##$TM2= 0
##$TOPLEV= 0
##$USERP1= <user>
##$USERP2= <user>
##$USERP3= <user>
##$USERP4= <user>
##$USERP5= <user>
##$WDW= 1
##$XDIM= 8192
##$YMAX_p= 0
##$YMIN_p= 0
$$ End of Bruker specific parameters
$$ ---------------------------------
##NTUPLES= NMR FID
##VAR_NAME=  TIME,          FID/REAL,        FID/IMAG
##SYMBOL=    X,             R,               I
##VAR_TYPE=  INDEPENDENT,   DEPENDENT,       DEPENDENT
##VAR_FORM=  AFFN,          ASDF,            ASDF
##VAR_DIM=   8192,          8192,            8192
##UNITS=     SECONDS,       ARBITRARY UNITS, ARBITRARY UNITS
##FACTOR=    0.0002768,     1,               1
##FIRST=     0,             0,               0
##LAST=      2.2672688,     0,               0
##MIN=       0,             -191281,         0
##MAX=       2.2672688,     210532,          0
$$ Real data points
##PAGE= N=1
##DATA TABLE= (X++(R..R)), XYDATA
0@%%%%%%%%%%%%%%%%%%%%%lQj3J6j6J6j6J7k0K4k7L0l5M0m3M7n4O2o8P5q4R1j01
44e4J11j22J36j49J64j79J98k21K42k67K98l30L69m15M65n29O10p10Q43j027J288
65G21j699K414l882Q015m0212j56638O5769J18011m4226m9038J27529J42698l8301
78A31161j18572l3151J214n1315l7980M1308O4218N1950O4582K6337p9898r3941
90c4087j078J741r2729m4803J35636J49776k4490p4714N0165N6051j11010j53630
102a43172J3773J13445K5516k8238N7021R3070j3184r5801o6138k8718k7831K047
114i8210M5732M7289M4766O3469K8112o9495r4074j6929J5392m0857l1886Q2341
126b4350J22247J4886o6442j7409J3157o1728j01224j3464P5078O1935K5239L6712
$$ y = [0, 0, 0, 0, 0, 0, 0, 0, 0, 0, 0, 0, 0, 0, 0, 0, 0, 0, 0, 0, 0, 0, -3, 5, -8, 8, -8, 8, -8, 9, -11, 13, -14, 16, -19, 21, -22, 25, -29, 33, -35, 40, -44, 47, -54, 57, -65, 71, -78, 86, -93, 105, -116, 126, -141, 157, -173, 196, -219, 246, -283, 327, -383, 460, -567, 721, -978, 1436, -2446, 5569, -34643, -191281, -125512, -7501, -51727, -100765, 26764, 169462, 131161, 12589, -20562, -19348, -70663, -108643, -67335, -3117, 48833, 113415, 139752, 59854, -34087, -35165, -33424, -126153, -170956, -35320, 114456, 89966, 15252, 65417, 121468, 10458, -143172, -129399, -15954, 9562, -18676, 38345, 131415, 118231, 22430, -43708, -72426, -100257, -98210, -52478, -5189, 39577, 103046, 131158, 61663, -32411, -49340, -33948, -74805, -106691, -24350, 97897, 112783, 46341, 28932, 42089, -19639, -120863, -134327, -59249, 2686, 27925, 64637]
138F4637L9471p575n6198o5296m8487j9099K1251M7819M2289L2979L4298P528
150I3617n6368q2771l8197M928L251J2168O2530Q2832L1900k7290m0124l7112
162I364m8420m8819j0333L9124N8948M8403K8260L644k6218m9933n4063l9531
174h9574o662L3747N6851N3478L8007J5219k0493n3074o1133m4237j5915J6640
186g7146M5032N4961M3740J8912j3828m3008n6149m5872j7139J5950M1992N6231
198B3676N1598K4797j1606m0053n6917n6617l1138Q415L5924M6586N1964L9923
210H6552P87m0851n3534m1759k8042q940K6889O1504N9912K7964k566k3473m7097
223A7346o2223m5448o658K5757M6553N5516M3842J1750j9251m0786n2782m7738
$$ y = [64637, 104108, 96533, 40335, -24961, -73448, -92547, -71296, -23477, 18812, 51791, 86089, 93617, 37249, -45522, -83719, -78791, -75540, -63372, -842, 81990, 113890, 86600, 46476, 9364, -39056, -87875, -98208, -59084, -136, 48267, 76527, 80171, 53953, 4020, -50043, -89574, -96236, -62489, -5638, 47840, 85847, 101066, 80573, 27499, -33634, -77871, -93786, -77146, -32114, 22847, 66587, 85499, 71671, 28663, -27486, -73358, -90497, -74547, -32555, 23676, 75274, 100071, 88465, 48412, -8505, -65122, -96260, -87845, -51921, -5335, 46629, 86552, 87339, 46488, -7046, -48805, -76847, -85787, -58898, 2606, 62518, 90482, 87916, 64443, 17346, -44877, -90325, -96983, -71226, -24673, 30843, 74685, 86435, 67184, 26398, -26384, -74122]
235g4122j5062K5805M6988M6288M0062K5368j1547n3307o3372m0130j5692L853
247h4868L4036O1216N5917K1856j1052l2812m7769m9630k9605N775L5908N0849
259I821M8317K8116l900l5339n1132n0564l5094l497L3375N3174N0651L3903J0093
272H7924k2521m9191n3694l4830o463K1607M2639N0683L9071Q940k3894m5250
284A5021n0847m0337j5178J8726M5206N3546M2873J8337j1837l8580n1393m5075
296e9538j9962J0885L5321M6674M3717K2435r350l6790m9215m3798k3991M605
308g9007L4020N0718M8796K8073j185k8379m6979m7730l1269l237K4536M3795
320g848M6190L0420L616k3139m2723m6846l2843o182K3311M3021M8113L6456J1598
$$ y = [-74122, -89184, -63379, -16391, 29897, 69959, 95327, 83780, 30473, -32899, -73029, -88721, -84868, -50832, 10384, 66301, 88157, 77105, 44293, -3476, -53106, -82711, -76936, -41028, 9821, 58138, 86254, 82354, 47015, -4117, -54681, -89775, -93272, -59897, -6723, 43928, 77831, 87924, 65403, 16212, -37482, -72312, -78775, -57168, -14529, 36154, 75225, 84165, 60271, 15021, -35826, -76163, -91341, -72615, -27409, 26137, 69010, 87347, 75510, 36930, -14463, -59538, -79500, -68615, -33294, 13380, 57097, 79532, 70182, 33392, -15823, -59621, -83612, -79007, -44987, 5731, 54527, 82600, 81415, 53036, 6057, -41673, -72942, -76179, -51643, -7848, 38342, 68762, 72378, 49239, 6516, -40330, -73173, -79355, -56044, -13023, 35090, 71546, 83144]
333H3144j7522m1272m8316l7650j4553J2040L5319M6429L8529J4978j2583l2782
345B5761m2885l9691j9669J1580L6605M4959L7514K2415k465l1022m9288m3291
357d9477k1645J987K3352M0301M4031K8135m58k5233l9348l9358k5972l223K1565
370d5343L9568M4755L1193L427k3363l6556l9896l5032j5845J6243M1873M2460
382B3484K7316J1951n601l0616m5754l6622r478J4724K9059L7180L5950J9919
394G1512p907l3331m3777l6539j7473L700K3683L8017M2209K6241k846k7662l5121
407G06l2212k5010n848K1642M0928L8545K1726J364j8319l4723m0547l0951p216
420f9915J8645L6086L8952K9089J1006r935l0930m0941l2132r793J1339K6968
$$ y = [83144, 65622, 24350, -23966, -61616, -76169, -64129, -28810, 17619, 56148, 71126, 58543, 25761, -17124, -56815, -76484, -64904, -28299, 16660, 54174, 76589, 74124, 43102, -6186, -49477, -71122, -69135, -45783, -5482, 38549, 66684, 66226, 40993, 1645, -37713, -63685, -66908, -45343, -5775, 38980, 70173, 73600, 50237, 13681, -26215, -61247, -77092, -60849, -18976, 23484, 50800, 62751, 57150, 26534, -19220, -55842, -65320, -50596, -21537, 15643, 51593, 71512, 63605, 30274, -13503, -50042, -67515, -63815, -40132, -2115, 40094, 66335, 63489, 35827, 706, -31506, -56516, -62364, -40722, 206, 38751, 60477, 61841, 43522, 8799, -31748, -62699, -69915, -51270, -15184, 23768, 52857, 63863, 53928, 22998, -17943, -50075, -59868, -48529, -21561]
432b1561L7394L3752J3465j1671k7740l5968l6893j9564R260L0700L4247L2358
444C7779K5034L174k7685m1836l2271j6455m052J5821L7378L9345K0773K26j8576
457C8655l5877l8369k1162k309J0636L0226M8525L5338l529k3498j8803k5343
469e510m2798k6729K3231M6668K5758J1681K0620Q259l3665n2798k8902k394P263
482d9316K0413L7334L5881J8048m25k2611m6107m0994p205J1780M966J7818N3021
495C2603M4537j7146m8314j7811l348l5656l6035K7283O6789L3677l556M407P781
508E5211k7644n5571l4747J012J8170K8005L5113K3898O638J161j7391n2283m9201
521f7629O002L6395J1129L199M5977N3302j6116o7770l4483P094j4782l3715J4550
$$ y = [-21561, 15833, 49585, 63050, 51379, 23639, -12329, -49222, -68786, -59526, -28826, 5421, 37779, 62813, 65987, 38302, -3534, -35805, -52260, -56312, -40491, -3113, 36232, 57005, 57231, 38655, 2778, -35591, -56753, -59062, -48426, -18200, 30325, 65663, 62134, 38636, 19833, -5510, -48308, -75037, -51806, -5138, 20620, 32301, 52921, 61180, 27515, -25283, -54185, -56579, -49316, -28903, 8431, 44312, 62360, 61935, 39324, -6783, -47777, -54982, -43202, -38236, -20418, 32603, 77140, 59994, 11680, -6131, -9479, -45135, -81170, -53887, 12902, 46579, 43023, 47430, 55211, 27567, -28004, -62751, -61739, -43569, -15564, 19549, 43447, 50085, 51246, 33855, -18428, -67629, -61627, -25232, -14103, -10904, 35073, 88375, 72259, 4489, -29994, -22900, -37682, -71397, -56847]
534e6847O7998M6981m974j5160n865k1229m0909k9864j996K4271M2490L8921J0271
547E4088r832n589j3256m9009n3276L396M9854K8213k94K4833M5836n387o5105
560D472m9277K500P552j0954J0478M9872M7171N369k5490k9553k6094k4703j7584
573e6241k958K2135M7495M4695O749k3471j6911j0683l5205m5132N64M9166M0965
586B1168Q199Q485J9454o661m9178n0451j2556J4199J5562J9392L4017L3997R573
599F5200k1292l8414l5829j7000n26O670J9332M0398L9652M911k7877k9576j9517
612a3868k4286k4342M316L9562M4223K0579L259k177j6804l6618l7886j5368J0591
625d8819K6616L0837K6236J6082J073k0478l7914l4920j4363O764J9602K7148
$$ y = [-56847, 11151, 58132, 53158, 37998, 32133, 10904, -30005, -59869, -61865, -37594, 4896, 43817, 54088, 44256, 38667, 25411, -23598, -76874, -73478, -23624, 4589, 4295, 29128, 74964, 69577, 4472, -44805, -42305, -34753, -45707, -35229, 14643, 61814, 67183, 41693, 12140, -13954, -38657, -56241, -59199, -37064, 10431, 55126, 61875, 38404, 21493, 10810, -24395, -69527, -68963, -19797, 21168, 29367, 37852, 57306, 50645, 1467, -48984, -61540, -47341, -31779, -12387, 21630, 55627, 65200, 43908, 5494, -30335, -47335, -47861, -41191, -21859, 18539, 58191, 63102, 35225, 5649, -13868, -38154, -62496, -58180, -18618, 25605, 46184, 49443, 47266, 30462, -6156, -44042, -59410, -48819, -22203, 8634, 34870, 50952, 52025, 31547, -6367, -41287, -55650, -48886, -29284, -2136]
637b136L2622K5812K615k4439l4423k8229j8980o668J3708L1981L5090K2229L715
650E2897j5593k8614l1096k4610q244J3250L0168L3234K5093Q484j0340k6885
662A7744l3254k7485j1246Q532K4796L2259K8846J2641q167k3027k9576k9337
674c7274j6789N960K4508L1167K7403J6538q91k0427l2274l1480j7724J194J8073
687c2016K9561K9934K0329K912j6052k9918l2067j9092j833J2897K5570L2689
699B2914K5749M096j6138k6576k8436k4068j0646R864K7932L2461K3444Q237p164
712D1669k2049l1312k7061j1412P107K3007L0794K5664J2639l808k0860l1054
724f676k8499j4552L450J9146K8806K8084J8055N45j8789k8849k7430j8184k379
$$ y = [-2136, 30486, 56298, 58913, 34474, 51, -28178, -47158, -53826, -40118, -8137, 26953, 49182, 52897, 37304, 8690, -22406, -47016, -55260, -42010, -11842, 21392, 46485, 54969, 44629, 17744, -15510, -42995, -54241, -45709, -20913, 11346, 40192, 52833, 44666, 21639, -7937, -37274, -54063, -48103, -23595, 7572, 34975, 51513, 50622, 30195, -2079, -33559, -51283, -50089, -32016, -2455, 27479, 47808, 50720, 34668, 4750, -27317, -46409, -48242, -35345, -9775, 22914, 48663, 52759, 36621, 10045, -18391, -42459, -53105, -43241, -15309, 17152, 40596, 48833, 41669, 19620, -11692, -38753, -50165, -43058, -20051, 10743, 36407, 49046, 45238, 24378, -6676, -35175, -49727, -46277, -27131, 1675, 29759, 47814, 48359, 29570, 721, -26709, -44893, -47272]
737d7272J5598K7932K8658J9757L117j4652k6151k9242k1488n783J3268K5614
749a0644K8716K2880Q591j0730k5265k8964k2563r352P677K2555K9287K5473R591
762D7252p773k0676k7107k6399j4205N558K1660K8083K5506J4027j841j7774k7713
775a402k8179j6318K092J7245K5561K6302J8034K196j5001k7685k7999j6880k261
788d4295J1727K4528K9313K1364L999j3125k3822k6679k1136q567R527K4160K8801
801A5795K1570O940p353k0700k7502k4347j0724P282K1425K6826K2998J2797l089
814D1918j9648k8580k4748j2714K511J6971K6160K6217J5627j321j6785k5742
826a34k4599j7035j895J5101K6121K6049J7364K686j3140k3652k6925k0081m732
$$ y = [-47272, -31674, -3742, 24916, 44673, 47790, 33138, 6987, -22255, -43743, -49526, -36258, -10644, 18072, 40952, 49543, 38813, 13548, -15416, -37979, -47331, -39654, -17099, 12188, 37661, 47252, 39479, 18803, -8304, -34703, -48908, -43350, -21690, 6393, 31899, 45926, 44085, 26311, -1402, -29581, -45899, -43807, -26562, -1001, 25301, 43335, 45531, 30530, 2845, -25154, -42034, -44295, -32568, -8040, 21273, 42637, 46636, 33511, 9689, -16990, -38126, -46693, -37166, -13006, 15795, 37365, 44305, 36952, 16252, -11250, -35597, -46321, -39039, -17614, 9212, 32210, 45007, 41918, 22270, -6310, -31058, -43772, -41261, -24290, 1870, 28087, 43714, 42393, 25608, -134, -24733, -41768, -43663, -28562, -2441, 23608, 40972, 43658, 30518, 6866, -20059, -40140, -44872]
839d4872J2504K3619K5343K0172P708r399k3191k7174k0872o666P740J9473K6685
852A1070K3634J0403q191k0807k4836k1973j2177K599J9017K8163K3984J0601
864D1487k802j5585k4883k5679j5633K500J7209K4066K3679J5699J852j4411k4839
877B660k5978j6589j559J2848K2436K4966J9395N216j1575k4385k5544j7717n443
890d1269Q001K0759K7209K1510O300r368j9843k4084k1670j0356O620J9995K5612
903I416K1598J0512m221j8690k4535k2118j2770K219J6966K5855K3183J2021j503
916C7933j4474k2731k4789j6468J42J6012K3420K2069J5290M126j0936k4155k6680
929b1241j6372j174J1172J8771K3530K0505P670j1061k3584k4244j5851n899M540
$$ y = [-44872, -32368, -8749, 16594, 36766, 44474, 35075, 11884, -15290, -36162, -42828, -35088, -15615, 11070, 34704, 45107, 36916, 16109, -8727, -30700, -42877, -40278, -21261, 6902, 30886, 41487, 38685, 23100, -1783, -27462, -43095, -40595, -23386, 680, 24359, 40058, 41910, 27499, 2660, -23318, -39907, -41466, -28618, -6182, 18784, 38179, 43395, 31820, 7435, -18109, -35826, -41269, -33268, -12509, 14700, 36210, 42510, 33142, 13299, -10785, -32455, -42811, -36191, -16196, 9416, 31014, 41526, 37305, 18615, -5920, -28038, -40808, -38589, -21623, 4232, 27415, 39436, 37933, 23459, 728, -24061, -40529, -40387, -24375, -955, 21114, 36404, 40530, 29594, 5439, -21241, -37613, -38787, -27615, -8844, 14686, 35191, 42861, 31800, 8216, -16028, -31879, -37778, -33238]
942c3238J7262K6817K4646O967j1394j8953j8824j8807j5780R92K2288K9905J7833
955B9714M748j507r498k2456k9167j5669P131K0133J9331J5914J5497P294j2547
968B8918k9010k7071j0038M801R323J3556K3952K5013N426j9237k6255j6256r892
981b6770r202JK2029L3539J9929l851j2570j0978j5954k4629j7054Q239K8561
994h710K4746J0232M076K697q412k8341l1298q185J4650J7740J1420J5939K1254
1007C7808O251k1029l2757j8276j856P54K649J7341L0496K1902m246k1479j9056
1020a498j1590j3174j3411M529K8655L1597J0835o875o961p359k1064k8893j1288
1033d6497J8231K6455J4823Q390J1652M194j8067l2208k1812m28J0446J1301J4107
$$ y = [-33238, -15976, 10841, 35487, 42454, 31060, 12107, -6717, -25524, -41304, -40312, -18024, 11881, 29714, 34462, 32955, 23457, 1001, -28166, -43835, -36704, -16571, 2760, 18674, 34171, 41465, 28918, -92, -27163, -37201, -32400, -23077, -9521, 14431, 39444, 44870, 25633, -622, -16878, -26770, -35972, -35971, -13942, 19597, 39526, 35675, 23105, 12127, -3827, -28456, -45510, -37271, -8710, 16036, 26268, 30344, 33041, 24629, -3712, -35010, -43195, -28545, -10805, 615, 16554, 37808, 44059, 23030, -9727, -28003, -29859, -29105, -26456, -9115, 21381, 43283, 39037, 17558, -1498, -13088, -26262, -39673, -35144, -6489, 25108, 35943, 29068, 22107, 14748, -6316, -35209, -46497, -28266, -1811, 13012, 21402, 33054, 37248, 19181, -13027, -34839, -35267, -24821, -13520, 587]
1046E87K1590J8557k022k3716k6088j3354l857k842N265K2749L0667J3792j0201
1059C1127j7155j2111j4366j9984r113J5634K8738J9374O658J190l999j5662k6051
1072a5720k0504j819J5021J8733J5820J4599R400l014k0600k7380j5675j032P129
1085b5042J0986J8893K2427J1577q271k0157j9152j3819r340j207J3422K5151
1097E468K1042P223m036j2012j7699j9947j3942n82J4207K2002J8373J0225J612
1110C1934q926j9323k2099j4289l78J0882J7713J8892J4978N502q741j9395k0397
1123a3647j4798m525O604J6581K0262J6598O574o359j6383j9694j6714p751N026
1136b8226J5219J9766J7343R425l461j4795j9745j8255r458J873J2379J9590J9159
$$ y = [587, 22177, 40734, 38712, 14996, -11092, -24446, -28303, -31145, -25880, -3131, 27536, 41328, 31127, 13972, 1861, -12505, -32489, -41602, -25968, 2770, 22144, 28802, 29992, 25993, 10331, -15720, -36224, -38043, -23022, -4289, 11531, 26130, 35530, 32516, 11916, -15464, -31139, -32171, -25042, -14056, 4837, 27264, 38841, 30570, 10413, -8739, -22558, -31898, -33105, -19683, 5468, 26510, 33733, 29697, 17685, -14, -19961, -33903, -34485, -20278, 1724, 20097, 30322, 31934, 23008, 3685, -18414, -32703, -33081, -22199, -4486, 14406, 29384, 34886, 26145, 6750, -13647, -28445, -32970, -26366, -9785, 10477, 27075, 33649, 27290, 10907, -8787, -25501, -33252, -28226, -13007, 6759, 24102, 33527, 30066, 15271, -4474, -22729, -32187, -30314, -17935, 1655, 20814]
1149B0814J1055j528j2020j7946j8522j2311p81J0632J8699J9768J2322J028r445
1162B1765j6343j9642j5119l453R486J7392J8356J3633N151n197j6903k0838j4622
1175b6334m135N493J3860J9573J6626P283n647j4672j8845j5916q350K402J3418
1188a5244J9053J7574R200j780j2915j7301j7164j0828l51J1662J8735J7686J0267
1201B8594O77r393j7415j8789j2446k029R612J6393J8192J3627L769p714j6447
1214F631j7618j4485m774O929J4969J8353J4262N920n449j4882j8232j5415o983
1227c0774M735J3443J7827J6692Q717l319j2908j7614j6310r257J197J1558J7417
1240A404J7122J0124j325j0424j6528j7713j0953o84R584J6828J8311J1980J386
$$ y = [20814, 31869, 30341, 18321, 375, -18147, -30458, -31239, -20607, -1908, 17860, 30182, 31210, 21765, 5422, -14220, -29339, -32792, -23306, -5914, 12442, 26075, 31226, 26029, 9126, -11712, -26334, -30469, -24976, -11116, 8457, 25083, 32366, 26719, 12047, -6798, -22714, -31064, -28662, -15244, 3809, 21383, 30583, 28803, 15888, -1413, -18577, -29405, -29756, -18094, 641, 18327, 28594, 29271, 19878, 2463, -16326, -28772, -30801, -21189, -4796, 13396, 27023, 30792, 23078, 6631, -10987, -25472, -30246, -23317, -8348, 10005, 24267, 30187, 24738, 9856, -8376, -23791, -30774, -26039, -12596, 5231, 21923, 30640, 27321, 14413, -3201, -19511, -28768, -27571, -16013, 1404, 18526, 28650, 27325, 16901, 373, -17340, -28293, -28977, -19393, -2565, 15746, 27726, 29112]
1253B9112q137j5322j8249j3821k774P845J5163J6743J3481M713n291j5821j8240
1266a0598j3369m301M065J3389J8485J5497O739m265j3174j7644j5187q574K493
1279b6444J2024J7358J5981Q458j218j1238j6607j6231j0164O46J0834J7138J6036
1292A6573J0662J361r226j6696j7176j1600k219Q057J4914J6979J3524L309q206
1305B0256j4785j5850j2690n543N985J5182J7524J3223N167m895j2811j7308j6139
1318b2684o741N051J2560J6304J4677Q389k338j1678j6934j5492p334J663J0110
1331a4447J5857J6483J0217j211j0995j6472j5550j0057j552Q201J6667J7581
1343A4722J0563J073p376j4253j6021j2750l076P380J4975J6505J1386L743n159
$$ y = [29112, 20975, 5653, -12596, -26417, -29191, -21346, -6183, 10560, 24041, 28754, 23463, 7642, -10598, -23967, -28268, -24203, -10814, 7671, 23168, 29907, 25642, 12468, -5176, -20363, -28937, -26444, -14420, 2938, 18919, 27377, 26159, 14921, -1686, -17917, -28081, -27435, -16601, 537, 16573, 27235, 28596, 19370, 2674, -14502, -26102, -28321, -20264, -5350, 11629, 25153, 28462, 20256, 5471, -10379, -23069, -28612, -22627, -7445, 10079, 23302, 28469, 23574, 10763, -6545, -22684, -29425, -24374, -11814, 4490, 19167, 27556, 25218, 13540, -3394, -18886, -26220, -24557, -14447, 1410, 17893, 28110, 26899, 15904, -568, -16118, -26175, -27727, -19526, -2859, 14722, 25285, 26358, 18982, 4729, -11292, -24042, -27118, -19738, -4763, 11742, 23128, 26871, 21712]
1356B1712j4065j7516j3863m453N852J2701J5851J4494P309l863j3247j6160j3309
1369a8557p442K006J1831J6479J4146P091n89j1147j6972j5189p519M56R229J5746
1383d31J6291J0309M0r344j4143j5713j1068j339P981J3568J5378J2547K059r047
1397A7088j3819j3333j2002o274O038J7038J6798R311L935k363j0900j8551j4901
1410b1935l543N789J0042J3431J4272P130l129j0976j5973j4897n765M739R133
1423a1682J1713J5401J2814j119j4832j5926q752p423o461N983J9876J7831M525
1436B1948k708m021r568j7111j3606l75R678J3350J4265R502K440m592j0403j6418
1450g619j6391l117J1061J1547O666J1066J3598r17k0065j8335l743l07l981M649
$$ y = [21712, 7647, -9869, -23732, -28185, -22333, -9632, 6219, 20713, 28022, 24159, 10912, -5248, -18557, -25999, -23993, -12162, 4317, 18463, 25554, 24965, 13818, -3154, -18343, -25862, -25406, -16177, -431, 15860, 26169, 26209, 16865, 2722, -12991, -24059, -25398, -17417, -3849, 11529, 24076, 26135, 17088, 3269, -10064, -22066, -28340, -22302, -5264, 11534, 20845, 24780, 22417, 11517, -7034, -21935, -25478, -19689, -9647, 3784, 18056, 25186, 22057, 11081, -4892, -19789, -25554, -20815, -11682, 31, 15432, 28246, 27127, 12295, -3631, -12383, -19806, -26267, -20284, -408, 17423, 21948, 19240, 15219, 5651, -11460, -25066, -25441, -15763, -2413, 11852, 21354, 23794, 19202, 8799, -7619, -24010, -27127, -16066, -4519, 2147, 13213, 26811, 25894, 5829, -12506, -16249, -16556, -20537, -15888]
1464a5888J9919J9212K585q042q051r814j3362j0729P5R443J5004J4978P362m024
1478A8668p471o384j2709j6221l333J6212J6682M397L791R897M37j9454k2289
1491a7777m461N424J328L915J5634J7529L843r266j1309j0571r334n089K449P914
1505i771J3711J5500N656q323j2083o821q006j3388m009J5617J9876O702j78M070
1519A8553Q4j4645k0377o547O342P062O850J1308J0965L133q093j3413j3420q016
1533b0214M88N500P812J1886J4068N904q775j4243q578n616p307j964J1979J8010
1547H950R242j198k655m590j1960j4648p097N268J0650J1240J0100O457O38o882
1561A3515j3081j3646o972J717P703R374J0096R139L214p973j3759j1057n560
$$ y = [-15888, 4031, 23243, 25828, 17786, 9735, -79, -13441, -24170, -24095, -14652, 352, 15330, 22692, 18668, 11197, 4813, -7896, -24117, -27450, -11238, 5444, 9841, 13632, 23529, 23966, 4512, -17777, -22238, -16814, -15486, -11571, 4063, 21592, 25435, 16169, 4860, -5711, -15045, -20134, -17685, -9771, 3940, 19440, 25096, 16773, 4690, -2131, -10137, -23525, -27534, -11917, 7959, 14661, 14483, 18553, 18637, 3992, -16385, -22932, -16590, -9528, -2678, 8630, 19595, 22728, 14635, 1222, -12198, -20214, -19726, -14226, -6414, 5472, 19540, 25444, 16669, 2426, -6152, -11768, -19075, -21039, -9060, 8950, 18192, 16994, 14339, 9749, -2211, -16859, -23956, -18688, -8038, 3202, 13302, 19759, 20397, 13515, 434, -13212, -20184, -18467, -10764, -1390, 8706, 17845, 21059, 13086, -673, -11730, -17290]
1574a7290j574L385J0698J4705J0023J552n908j0095j1503r936m822L143J0761
1587f861J2707R279L615k807q418j1748j1517m750L352R446J1608J0668O326j426
1601A9474q237j2325j1627p209L4P798J1372J0927P658J390o685j1885j1718o825
1615a7858q64N348J1103J3007Q645R49n399j0023j2927j0231k508M697R277J1878
1629E094J0584M905n052r385j1057r435m900K177J0275J2527R581M563j624q405
1643I848j3235j1593n700J699P293J1688J1997P238l79p176j0714j1756p067n41
1657a8398O899J1112J0897Q264J282o515j1801j1909q061k407M982J0671J2530
1670G546R625L020m299r727j1662r997l995M118R606J1715R155M852k988j0470
$$ y = [-17290, -18864, -15479, -4781, 9924, 19947, 21499, 15591, 5496, -6007, -15943, -20765, -17622, -6861, 5846, 15125, 18740, 15933, 7515, -4233, -15750, -20500, -17148, -7702, 3906, 14574, 20900, 19474, 11237, -1088, -12715, -19924, -19890, -12092, -720, 10207, 17865, 19255, 12570, 685, -11033, -17858, -18722, -13374, -2271, 10736, 19381, 20330, 14931, 4908, -8019, -18250, -20758, -16061, -6784, 5094, 15678, 20583, 15531, 6146, -4911, -14346, -19246, -17069, -6794, 5733, 15314, 19877, 18253, 9848, -3387, -14980, -20680, -18981, -11688, 0, 11997, 19235, 18856, 11680, 966, -10790, -17857, -18398, -11499, -387, 10510, 18774, 20056, 13541, 1740, -10169, -18230, -20637, -15655, -4984, 7546, 17171, 20191, 15892, 6165, -5497, -15494, -19489, -15371, -5765, 5950, 15105, 19957, 16969, 6499]
1684F499j2360r806m666J707Q624J2606J1908N679k138p119j1100j1503p240R28
1698a7981P669J0977J0268O989L57o977j1722j0772p758r34O911J1495J1486P822
1712A7830K293m099j1301j3257p989j348M155Q028J1922J0630K043n585r109j0562
1726f349q626n148L469J0399J2472R104M365j858q678j2037j0299n557J213Q164
1740i366J1388R977M677o15o085j1535j1631n236J672P379R572J0529Q086J183
1754A9995p690j1447j0047o903k664M957J0495J1522P178J744m749r049j0291
1767f949q541k383M797R610J0611Q699K894l495q915j0958j0093l927L059Q231
1781g360R694R291N631j691q152j0375q854l914R46O499J0362J0665N150k043
$$ y = [6499, -5861, -15667, -20333, -18626, -10002, 2604, 14512, 20191, 18053, 10934, -166, -11669, -18909, -17981, -10312, 665, 10933, 17922, 18279, 11302, -420, -11192, -18950, -19884, -12973, -1478, 10008, 17830, 20123, 16024, 4723, -8534, -16523, -17871, -13716, -5688, 6234, 16864, 18907, 13322, 4213, -6349, -14975, -20123, -16654, -6255, 6217, 15321, 19686, 17828, 9150, -2887, -13186, -18743, -17530, -9366, 2022, 11999, 16676, 16061, 9976, -1559, -13190, -18426, -16754, -9375, 197, 10726, 18812, 19995, 12305, 858, -9189, -16092, -18756, -13799, -3304, 8218, 15396, 17140, 12391, 3342, -6949, -15490, -17873, -13076, -3466, 7145, 15844, 18738, 15243, 6328, -4630, -14723, -18650, -15591, -7360, 2334, 11625, 17256, 15565, 7413, -2962, -11816, -15730, -14784, -8285, 2077, 12742, 17892, 15849]
1795A5849o785r373j0124p318qO384J0197R382O653J291m349q989j0397p047q19
1810a5453M553Q559R734P457K111m093q836j0983p692k008K451P525J0743R065
1824A3133L287k726o800r273q564m424J364P326R783Q113M153j440o322r281r214
1839a0885n434M06O693R267Q667N913J485n193r072q853o189r31L682Q391Q808
1854F755O626R52l929p791r187p493k136M154P674Q948Q339L367l017p384q260
1869b382q032m347J632P206Q322P130M619j130o461r298p461l536l82M695J0297
1884H72J0217L805j660l505o576j0364p531J62N786P127O908O259K712m099q430
1899A683q361n490k335L542Q383Q209O040L681j198q905j0830n789o92k87L144
$$ y = [15849, 9064, -309, -10433, -17751, -17759, -11375, -1178, 8204, 14857, 16148, 11799, 2810, -7587, -14634, -15453, -10900, -2341, 7393, 14850, 16961, 12868, 4032, -6951, -14643, -16651, -14200, -6675, 4068, 13133, 16420, 13694, 6894, -2379, -10943, -15367, -14003, -6677, 3106, 11219, 15372, 13932, 7610, -1671, -10885, -16319, -15913, -9220, 47, 8714, 14627, 16112, 10919, 1847, -7006, -13195, -14126, -10444, -2053, 6755, 13381, 14333, 10404, 2613, -6574, -14067, -16203, -12049, -4375, 4573, 12912, 16279, 13262, 5878, -2382, -10414, -14761, -13129, -5923, 2399, 9529, 14148, 13018, 6557, -2741, -10202, -13738, -14120, -9425, 872, 11089, 14894, 13234, 9729, 3153, -7211, -14742, -14580, -8794, -1667, 5241, 11500, 14212, 10113, 1683, -6678, -12168, -14503, -10961, -2578, 5631, 11671, 15352, 14154, 5249, -5581, -11370, -12062, -12349, -9205]
1914i205J0518J1002K147m674m783m751q218p841J647Q658Q636N651M923R13n518
1929I105q802q136o167j583N628R592O883L465L177o05r485j2052m330K938K263
1944h109K615R182J1236K147p756p630m485o533o689J404Q814R714O335L247j325
1959A2167o129p517p253m841j53O878J1136O375Q95J85j407r223j2645n429M876
1974a2085N408L709P714R386K621p340r613o036m085k795K412Q262Q918O331J514
1989A4321m087q396p768n116l211N37Q039J1744O801j12k296l086p844j0371m736
2004a5581L943P836O101N220N826M56o902r484q025l121M69N367Q182P686O291
2019A4264O43n499r246p939l853q52K129P370J0283O192o47m811o017p219p172
$$ y = [-9205, 1313, 12315, 14462, 9788, 5005, 254, -7964, -15805, -14158, -5500, 3136, 8787, 13710, 14623, 9105, 303, -7833, -14000, -15583, -9955, -363, 6520, 9985, 13162, 12557, 3072, -8980, -13310, -10372, -8109, -5494, 3688, 14924, 17071, 9315, 1685, -2800, -9333, -16022, -14618, -5804, 3910, 10245, 13492, 12167, 6038, -1479, -8732, -13573, -13726, -6848, 4288, 10663, 11558, 11743, 10336, 1113, -11532, -16961, -12085, -6677, -2968, 4746, 14132, 16753, 9413, -200, -6236, -10321, -13116, -10704, -2442, 6476, 12807, 14321, 10234, 1838, -5930, -11046, -14257, -13720, -5681, 6063, 12864, 12752, 10456, 7370, -474, -10845, -15581, -11638, -3802, 2299, 7519, 13345, 13801, 6899, -2585, -10610, -13731, -13262, -7895, 287, 7973, 14264, 14907, 9408, 162, -7777, -11630, -12482, -10353, -2983, 7300, 13492, 12845, 8034, 2017, -5202, -12374]
2034a2374k863M101Q758Q503N533K307k020o719q872p767k799K503P025P889O478
2049I683L204j032n959r298p182k909J882N174P947Q227M648q69n852q133p674
2064h143m869k46M293Q098Q158M924O61m738p176p707n780o37M230P863P666N575
2080A2172J928l882p006q686o283k195K990O821Q114O395K474k006o389p742p122
2095a0417k625K409N861P964O931L535k024n782p572p725l928J064M902P840P291
2110G724M936p42m468p486p274m576J2M364P563O875M697J012l862p340q361m630
2126a1556j126K754O753Q212O097J448l118n777p310o217k271K218O612P071O242
2141A0032K523k557o034p061o097l980J434O535Q208N363K729O04m233q071p642
$$ y = [-12374, -15237, -11136, -2378, 6125, 11658, 13965, 11945, 5226, -3646, -11413, -14212, -11709, -4684, 3205, 9683, 12887, 11855, 5896, -3402, -10584, -13493, -11611, -6437, 1510, 9737, 14385, 13516, 7664, -469, -8143, -13012, -13258, -8965, -867, 7291, 12215, 12876, 8138, 962, -6745, -12525, -13162, -8932, -1069, 6597, 12172, 14100, 10218, 3212, -5474, -11757, -13952, -10962, -4141, 3973, 10368, 12842, 10836, 4447, -3295, -10417, -13042, -10633, -4772, 3192, 10123, 13658, 11634, 5852, -1720, -9445, -13373, -12309, -7407, 433, 7724, 12660, 11918, 7450, -36, -7310, -11886, -11874, -7510, 53, 6928, 11625, 12637, 8775, 1435, -6926, -11556, -12682, -9928, -3175, 5037, 11134, 12582, 9464, 3687, -3623, -9840, -12111, -9893, -3281, 3790, 10032, 12555, 9998, 3964, -3097, -9194, -13174, -11740, -5205, 3003, 8366, 11095, 11699, 7466, -605, -8247]
2156h247l332J417L826N619P572N032o52m745o530o651m466r54L872O693P265
2171E719N542J063l432o832o202m546l219J828P081P956M111J031j274m140p546
2186b860p343k066K961N479N553O078M264j022n567o823o562l001O41M391N944
2201F7O013M791K63n249o990n445k950j029K273P284P995L926n29l133m633o734
2217d080o011j547L368O221N889M541K064j648n378o857n676k098K641N195N843
2232B467N658L594j194n740p284n073k384L68L360O492O967L153q88m295n137
2247F4n641m359m70L840O811O276L180M84k712n733p098m956o20L280N527N893
2263C766M752J894j568n878o833m675j252J679M407O531N808K487k464n075o019
$$ y = [-8247, -11579, -10162, -6336, -717, 6855, 11887, 11235, 6490, -40, -6691, -11157, -12111, -8239, -1546, 5719, 11261, 12324, 8892, 2060, -4142, -8688, -11907, -10079, -2998, 4958, 9069, 10100, 8826, 4686, -2860, -10203, -12269, -9308, -3829, 1724, 7802, 12066, 11044, 5477, -1346, -7908, -10909, -10268, -5877, 67, 6080, 10871, 11134, 5885, -1105, -6550, -9500, -10529, -8256, -972, 7023, 10949, 10420, 7287, 2654, -4080, -10091, -11638, -8270, -2049, 3840, 8381, 10445, 8797, 3419, -3438, -9114, -11212, -8571, -3376, 2467, 8125, 11719, 10525, 4785, -2499, -7572, -9956, -9588, -6228, 264, 7231, 10384, 9496, 5201, 64, -5577, -9936, -10406, -6566, 245, 6521, 9701, 10185, 7473, 1740, -5358, -10314, -10934, -7654, -2127, 3766, 8518, 10412, 8844, 2966, -3867, -8542, -9794, -8115, -3708, 2823, 8631, 11118, 8654, 3579, -2440]
2278b440n212k987P22M617O607N945K704n44l924n456o471l828R7M381O104N543
2294E858L582R27l784o177o265m027m97L250N428O120N207J038k870n338o140
2309c688m772j671J989N372O070M989K268k201m962o284n285k617J479M951O417
2324B055N610K601q45l946o752n676k558L20L690N641O326K996q1l811m987o644
2340f061l897L4L527N493N918M420Q06k829n745o119m210j186K295N038O395M820
2356H699J178j562n353o470m764j514J493M080O557O017K382k376m385n117n442
2371f577l745L44N252O537M403K513O80l391o508n962l155L83L315N825N689L551
2387I154P76l108n805o750l694k9K905M171N809N726J654l901n799m305m046k740
$$ y = [-2440, -7652, -10639, -9917, -5300, 1307, 7252, 9956, 9412, 5488, 32, -6439, -10267, -10170, -5789, 315, 5858, 9440, 10367, 6583, 406, -5859, -9886, -10383, -7133, -1705, 4415, 9622, 10660, 7790, 2452, -3688, -8460, -10131, -8142, -2770, 3300, 8289, 10557, 8356, 3394, -2890, -8175, -10792, -9313, -4362, 2055, 7665, 10266, 9421, 5475, -1277, -6953, -9511, -9191, -5501, 140, 6466, 9462, 9381, 5570, 583, -6061, -9958, -9924, -6397, -904, 5014, 9434, 10240, 7411, 1666, -4453, -8663, -9849, -7554, -2516, 3879, 8699, 9877, 8315, 2962, -3508, -8272, -9786, -8293, -4213, 2344, 8361, 10743, 8367, 3982, -1135, -6577, -10322, -9978, -4726, 1811, 6214, 8727, 9407, 6016, -492, -6454, -9609, -9226, -5911, -86, 5603, 9154, 9930, 6822, 1017, -5733, -9427, -9456, -6551, -2380, 3429, 9155, 10809, 6908, 1109, -3196, -7242, -9982]
2403i982J213O056P117L980P96j545l607n712n994k809J778M464O076M837K390
2418I058n30k980n874o754k943J886L823M725M190M753J295m811o890m685k415
2433h152p88J588N593O731M303k59l107m219n126m453j844K313N663N810M277
2448H330K68j505l831n595n611k523K797M990M889L839K700M70m529o961m975
2463g247j304R88K619N422N180M242j257l946n418m862k714n17K905N084O421
2478E596L600l71l257m383m537m526j829K922N737M930L314J313j129m699o172
2493c491m664r07K216M451N038M198K574j101m927n786m607j617J104L172N179
2508H32N334K708r30l964m884m503k729l70L307N497N528K741l90l085m292n246
$$ y = [-9982, -8769, -2713, 4404, 8384, 9180, 7635, 4028, -1684, -7678, -10487, -8709, -4245, 1831, 6668, 9058, 8528, 5548, -326, -7080, -10023, -8137, -4314, 411, 4601, 9354, 10649, 5838, -1052, -5737, -8152, -8940, -7352, -1759, 4972, 9275, 9016, 5909, 1690, -3436, -7889, -9733, -7420, -1757, 4053, 8330, 8598, 7093, 3262, -2333, -7944, -10467, -7670, -2680, 2209, 6048, 8748, 9218, 4689, -2272, -7247, -8551, -7563, -4944, 478, 5658, 9900, 8643, 4697, -721, -5583, -8297, -8814, -5909, -825, 5596, 9196, 8825, 5568, 1185, -3352, -7878, -9707, -6785, -1048, 3882, 7196, 8509, 7380, 2681, -3491, -8155, -9062, -6846, -2395, 2643, 6841, 9415, 8314, 3387, -2399, -7006, -8623, -7519, -4347, 832, 6166, 8874, 7944, 3980, -904, -5407, -8136, -8506, -5199, 298, 5826, 8567, 8177, 5092, 800, -4446]
2524d446l906m82L042M843N087L189R04j703m814n482m024r27K365M304M880M401
2540G231J609j695m418n434m210j506J080L574N523M528K214p50m176m740m835
2555f005k290K51L593N245M491L003k66l021m883n333k763j61K614N034M631L543
2571G683M97k583m246m870l828r04K402M072N151L941J012k054l820m947l968
2586f462k162J753M306N044L989J407p94l419n276m852j779J041L374M712M722
2601E604K717o32l296n080m487k735J54K902M567M856L324j3k995m498m355l250
2617g217n91J699M959N362K961N07j998l532n178l851j202J504M704M736L300
2632F163J540o37l998n262m139j638J588L185M425L988K640j83m223m522l922
$$ y = [-4446, -8352, -8834, -5792, -949, 4138, 7327, 8231, 6528, 1714, -3768, -7792, -8719, -6354, -2050, 2830, 7231, 8840, 7145, 2727, -2707, -6917, -8423, -7343, -3769, 1754, 6282, 8496, 7746, 3570, -1170, -6005, -8295, -8044, -4451, 794, 5285, 8288, 8022, 5001, 118, -5215, -7978, -8139, -5525, -491, 4140, 7683, 8180, 5597, 1351, -3519, -7347, -8251, -5849, -1777, 3374, 7315, 8327, 6273, 2453, -2494, -6462, -8624, -6871, -2565, 2479, 6468, 7875, 7081, 3662, -1614, -6466, -8245, -7204, -3830, 882, 5604, 8321, 7689, 4393, -687, -5174, -7909, -7755, -4853, -286, 4570, 7894, 7881, 4886, 388, -3967, -7217, -7808, -6109, -1150, 4212, 7173, 7680, 5682, 2150, -3028, -6879, -8081, -6577, -1873, 2863, 6163, 7703, 7066, 3068, -2194, -6333, -7971, -6383, -3198, 1227, 5215, 7855, 7672, 3449, -1073, -4995]
2647d995k618J81K753M861M823K919o47l028m139m093l273n60K425N081M504K957
2663G151K11j728m069m947l884q83K568M546L722L357J590j050l841n666l280
2678f203j248J529K760M445M774K180j502l970m439l259k244J27L047M873M582
2693E452K337j098k892l877m158l436l0L529M630L858K513N80k186m474m580l384
2709g216j51K503L448M320L679J292j990m269m848k863j007J022L471M774M093
2724F258J675j752l769m528l261k109N12L740M794M162J571p48k737m255m522
2739d969k461O25L150M079L900K521L79k217m919m347k683j23K390M012L992L362
2755F691J008k523l974m066k976j399J569L688M670L435J099j191m177l959l759
$$ y = [-4995, -7613, -7432, -4679, 182, 5005, 7924, 7277, 4249, 110, -3983, -7256, -7816, -5391, -310, 4194, 7151, 7362, 5634, 1565, -3382, -7266, -8149, -5581, -1035, 2687, 6044, 7634, 6584, 2743, -2923, -6203, -7451, -5922, -3162, 1283, 6057, 8237, 6735, 2765, -1674, -4933, -7177, -7050, -4003, 870, 5452, 7789, 6691, 3799, -78, -4236, -7672, -7702, -4173, 457, 4315, 6828, 7408, 5222, 748, -3832, -7216, -7367, -4864, -1416, 2904, 6583, 7875, 5885, 1616, -3232, -6095, -7102, -6080, -2609, 2165, 6258, 7933, 6181, 2412, -2116, -5377, -7486, -6974, -3234, 1560, 5722, 7293, 6545, 3808, -447, -4969, -7430, -6805, -3655, 424, 4324, 6845, 7224, 5007, 88, -4259, -6942, -7065, -4675, -663, 3329, 6691, 7699, 5176, 1202, -2864, -5840, -7239, -5670, -1982, 2688, 6123, 7222, 6031, 1854, -2105, -5864]
2770e864j483J366L499M471L546J756p48l267m760l784j860R41K726L910L912
2785D361K745k65k658m251m381k292L0K371L747M707K851p8k194l806m299l045
2801f457o36K024L859M410K882R85j667l412m322l524j435J513L578M266L444
2816E508J360r11l317l787m031j877P74L422M031L723J684m4k883m059m091k053
2832f551K72K574L945L601K597L77k578m038l775k646l37J502M124M343K820N88
2848F818k086l469l877l094j223J457L700M137L204Q39j052l078m148l620j697
2863g189J375L617L662L596J264m22k653m276m083j728J001K837K982M103K641
2878F727k69k700m024l380k212j81J804L819L895K740M6k095l293l597k668j208
$$ y = [-5864, -7347, -5981, -2482, 1989, 5535, 7291, 6543, 3276, -1484, -5268, -7128, -6187, -3461, 449, 4361, 7106, 6841, 4183, -68, -4449, -6741, -6711, -4340, -593, 4114, 6965, 6887, 4693, 887, -3412, -6457, -7093, -5069, -1210, 3200, 6082, 7067, 5400, 1988, -2334, -5858, -7293, -5780, -2202, 2064, 5508, 6868, 5957, 2640, -1147, -5178, -7055, -6281, -2859, 1172, 4895, 6579, 6535, 3652, -407, -4498, -6551, -6279, -3705, 240, 3841, 6438, 6815, 4237, 199, -3576, -6222, -6559, -5057, -933, 3410, 6230, 6818, 4732, 1263, -2614, -5708, -6931, -5474, -1774, 2363, 5567, 6406, 5354, 2276, -1872, -5492, -7189, -5814, -2197, 1465, 5061, 6325, 5903, 3250, -1026, -5109, -6837, -5836, -2999, -17, 4086, 6727, 6458, 3758, -266, -3646, -5858, -6039, -4235, -416, 3479, 6219, 6265, 4170, 877, -2720, -5388, -6596]
2894f596J842L685M011K383O43q88k802m330l549r97J741K839L594L075J938o91
2910E898l368m115l434j164Q02K217L530L664K723p51k995l837k874j991n13J875
2926d333M420M207J656j56j921k921m130k854p58K590L573L412K068J278j398
2941D733l063m035l040j146J783L161L152L143J550r87l135l919k702j368N58
2956e315K207M019L817J595r76k864k956l364k248L47K451L736L596J797l37j671
2972C834l485l515k971j57K355L690L475K016Q39j469l324m057k768r8J140K909
2988a586L761K828J098j283l159l560l119r74R39K813L662L204J357n79k834l697
3004a129k865j749J24K490L492L522J694o3j913l616l737k147L31J989L421L415
$$ y = [-6596, -4754, -1069, 2942, 5325, 5968, 5080, 2278, -2052, -5601, -6598, -4857, -2018, 1576, 4651, 6589, 5898, 2530, -1585, -5019, -6183, -5381, -3164, 366, 4030, 6753, 6002, 3007, -830, -3704, -5695, -6208, -4333, 87, 4294, 5950, 5794, 3873, 952, -3178, -6032, -6790, -4200, -627, 2785, 4853, 6131, 4733, 1670, -2365, -5405, -6551, -4768, -1607, 1545, 4688, 6238, 5251, 2116, -1803, -4505, -5873, -5315, -3108, 911, 4728, 6323, 5347, 2483, -473, -3837, -6085, -5738, -3287, 449, 4045, 5842, 5505, 3834, 349, -3166, -6137, -6294, -3939, -249, 3226, 5242, 6081, 4612, 1288, -2769, -5537, -5635, -4495, -1586, 2175, 5003, 6101, 4818, 1659, -1901, -5020, -5994, -5055, -2242, 1420, 4624, 5981, 5402, 2568, -1129, -3994, -5743, -5619, -3129, 363, 3885, 5579, 5516, 3603, -13, -3750, -5897, -5566, -3577, -156, 3259]
3020C259K274L43j740l480l376k533o49J725K903L778K538P94j612k799l526k933
3036e034j045J258L095L378K839J535j178k606l673k951j477N03K512L724L092
3051C972J494N2k410l616l296j437O6K069L052L716J733j59j671l182l395k492
3067e504m24K128K934L346K402N23r52l522l259k215j226J543K929L424K618J086
3083E831q13l051l829k852p94P96K417L018L385J839o75k933l199k630j830k47
3099e567K632L649K984J799n02j832l104l314k005m13J994L345L441J808M55j334
3115D036k964l682k986J43J441K978L019K844J017j461l338l181k379j174Q75
3130d812L022L453K638J609r58k954l247k662j331J72K270L992L096J316j029
$$ y = [3259, 5533, 5876, 4136, 656, -2720, -5253, -5902, -4177, -1274, 2504, 5042, 5836, 4224, 1425, -2101, -5034, -6079, -4821, -1726, 1652, 4491, 6026, 4848, 2242, -1431, -4382, -5859, -5356, -2844, 880, 3972, 5466, 5518, 3108, -508, -3804, -5241, -5175, -3106, -54, 3662, 5395, 5236, 3565, 383, -3012, -5504, -5928, -3800, -866, 2480, 4882, 5405, 4453, 931, -2328, -4543, -5769, -4226, -1297, 2127, 4745, 5831, 5018, 1967, -1862, -4714, -5508, -4712, -2295, 723, 4108, 5947, 5272, 2339, -860, -3490, -5320, -5567, -2935, 714, 3698, 5497, 4995, 3163, 59, -3255, -5260, -5673, -3679, -334, 3107, 4915, 5370, 4036, 1072, -2610, -5596, -5453, -4012, -1034, 1985, 4829, 5846, 4385, 1047, -2134, -4513, -5687, -4812, -1790, 1663, 4301, 5910, 4952, 1998, -1249, -3911, -5242, -5070, -2800, 1192, 4288, 5604, 4575]
3145D575j667l040l383k335L07K778L076K638K120M72j815l221l396k271k68J834
3161c596K874L175K323P12j700l052l083k135l79P90K561L430L247J64j530k125
3177A676k795k984j598R87K845L202K321J329l97k277l264k855j824J266J839
3192b529L161K732J712J39k311l226l034j394j6J450K654L464K279L28k132k846
3208D31k854k026o40J045L100L330K077N27j104k557l494k152j109J306K470K954
3224A304K673J140m63k410l410l010o83O31K227K750K699J459m20j994k994k953
3240c454j282Q0J629L208L151J386N4j837k690k632k253j91J343L304K636J516
3256C968O01j180k627l001j758r71J181K636L012K023J059q91k460k568k835r68
$$ y = [4575, 2908, -132, -3515, -5850, -5543, -2765, 311, 2949, 5069, 5541, 3726, 505, -2891, -5162, -5430, -3596, -722, 2453, 4776, 5488, 3788, 736, -2347, -4482, -4861, -4071, -1510, 1920, 5167, 5331, 3801, 1676, -1119, -4103, -5701, -4714, -1869, 1333, 3654, 4983, 4586, 2309, -955, -3810, -5634, -4368, -2529, 632, 3364, 5076, 5215, 2904, -322, -3356, -4750, -4766, -3316, -662, 2802, 5081, 5409, 3277, 431, -2423, -4449, -5089, -4044, -944, 2386, 4463, 4990, 3886, 1329, -2165, -4317, -5426, -4120, -1650, 1304, 3977, 5117, 4654, 2244, -1166, -4176, -4859, -4228, -2001, 749, 3448, 4907, 4487, 2493, -501, -3454, -4736, -4656, -3027, 181, 3332, 4718, 4772, 2935, 245, -2387, -4640, -4831, -3488, -184, 2452, 3968, 4569, 3389, 762, -2239, -3997, -4968, -3787, -1151, 1861, 3884, 4943, 4052, 1592, -976, -3811, -4779]
3272d779N96K488K737K401J285n43k206l077k088j440J50J921K919K791J337j90
3288D302j092l184l119j192J00J211K397L094J713M31j678k357k758k142n48J413
3304c409K751K616K022R37j094k469k670k744q20R59K333K859K108J045l53j944
3320B127k893k677j053Q07J512K371L040J561n29k100k518k287j594m29J721K890
3336e1K594J379L61j293k768k380j845l14J139K607K765K003Q6j063j669l037
3352a486l020m62J588K162K228K298J470j111k333k604j965j111K57J941L037
3367H89K177J818j020j564l003k194j649K80J373K799L037J663n96j506j989k930
3383b415j955j76J837K399K521J441Q53q95l072k726j546q90J196K211K821K127
$$ y = [-4779, -4183, -1695, 1042, 3443, 4728, 4185, 1979, -1098, -3186, -4626, -4476, -2555, 364, 3155, 4492, 4302, 3210, 26, -3093, -4285, -4185, -2974, -577, 2517, 4230, 4661, 2983, 626, -2132, -4274, -4822, -3409, -658, 1958, 3980, 4917, 3823, 1354, -1316, -4060, -4880, -3921, -1588, 1271, 3379, 4424, 4071, 2127, -766, -3443, -4496, -3689, -2177, 194, 3234, 4795, 4266, 2166, -352, -2639, -4233, -4662, -2941, -51, 2543, 3922, 4283, 2990, 222, -2158, -4003, -4317, -3178, -571, 2194, 4197, 4283, 3220, 1551, -1486, -4506, -4968, -3380, -1218, 1010, 3308, 4778, 3667, 1334, -1270, -3235, -4346, -4089, -2148, 889, 3066, 4884, 3864, 2300, -703, -2897, -4546, -4266, -2893, -94, 2943, 4606, 4010, 2504, 515, -2415, -4370, -4546, -2709, -310, 2211, 3652, 4505, 3610, 538, -2188, -3734, -4624, -3428, -1217, 1604, 3731]
3399C731R77n91k609k672k208q01O84J416K680L058J159j204k005k363k282j705
3415d735L29K062L088K341R90J6j242k763k714j631j79J873K740K273J461L44
3431D253j268k398l154j693k5J414J796K866K239J010j680k464k076k336j007
3446d523R93K074K860K218M96o75k156k453k039j546P31J968L230K320R65l66
3462D097j711k648k631j717P65J346K496K665J477L45j767k512k612j862K81J414
3478b574K107K618J931J32r96k564k622k103k35Q74K350K608J776Q35q66j931
3494A340k808k090p06O20K025K792K429R13o45j893k582k522j128J81J939K620
3510D85K003J808l86j816k402k173j238n39J876K732K133J247K24j175k473k660
$$ y = [3731, 4708, 4117, 1508, -1164, -3372, -4173, -3489, -2073, 607, 3665, 4824, 3620, 1615, -748, -3030, -4735, -4406, -2344, 744, 3085, 4075, 4091, 2849, 86, -2628, -4259, -4438, -2565, 175, 2448, 3909, 4253, 2985, 587, -2567, -4260, -4285, -2871, -1075, 1791, 4030, 5040, 3360, 896, -1180, -3516, -4523, -3530, -1456, 1404, 3622, 4118, 3443, 1287, -1166, -3205, -4751, -4020, -2052, 1178, 3498, 4463, 4097, 2386, -262, -2893, -4610, -3845, -2499, -3, 2662, 4139, 4484, 2717, 205, -2407, -4269, -3988, -2574, -467, 2151, 4082, 4214, 3218, 654, -1968, -4071, -4306, -3432, -1082, 1526, 3302, 4137, 3271, 1340, -1468, -3558, -4264, -3644, -1619, 1173, 3602, 4515, 3870, 1977, -605, -3127, -4255, -4074, -2135, 485, 2488, 4296, 3910, 2094, -308, -2481, -3719, -4258, -2382, 350, 2483, 3730, 3954, 2779, 306, -2354]
3526b354j574j6R44K290K730J975j54r85j913k689j976k06Q98K177K057J827J280
3543D311j060k183k123k024j002M16J950K750K265L55k75j120k623k622r81M67
3559c499J698K050K374J272j32j587k082k475j660N4J877J703K228J704O10j054
3575C081k413k603j109p58O05K129K954J781j45r84j342k325k222p77Q94J922
3591a312K694J669R22q96j557k293j933j183L23J847K169J830R74N47j517k843
3607e59k119q30K1J124J951K678J499j59j119k109k017j729k48R36K009K008K196
3624C533K51j391j773j953j566p68N92K149K306J101J101j9k026k587j931p33
3640c714Q38R91K316J920J110r3j887j989j949r51J96J118K170K087J613m66j148
$$ y = [-2354, -3928, -3944, -3000, -710, 2020, 3995, 3841, 2856, 943, -1746, -3722, -3928, -3030, -853, 1204, 3031, 4311, 3251, 1068, -1055, -3079, -4081, -3665, -1715, 1035, 3300, 3655, 3380, 2260, -363, -2985, -3966, -3499, -1801, 249, 2623, 3895, 3763, 2176, 94, -2381, -4041, -3987, -2110, -407, 1821, 3525, 4135, 3081, 668, -1935, -3044, -3802, -3197, -1068, 1886, 3667, 3522, 2538, 1196, -1129, -3351, -4128, -3234, -1312, 1382, 3051, 3973, 3077, 1520, -773, -2706, -3889, -3566, -1719, 450, 2280, 3254, 3801, 2284, -559, -2678, -3508, -3487, -2363, -412, 2266, 3765, 3606, 2487, 378, -1639, -3368, -3616, -2680, -671, 1337, 3533, 3784, 2393, 620, -1333, -2899, -3667, -3075, -926, 1380, 2481, 3582, 3563, 1537, -1050, -2981, -3714, -2876, -1885, 431, 2351, 3461, 3368, 1481, -508, -2457, -3408, -3212, -2094, 76, 2163, 3776, 3310, 2162]
3657B162j937k126j189m94Q06K055K273J685J10p94j600k171j751p57J069K047
3673f12J781J579O76m75j602k362j773o97L03J606K203J958J095m31j694k016
3689d61j671j194O5J336J955K316J182k71j037k119k111j307j30J042K114K057
3705A766J262J66m71k218k057j571l61J022J677J948J746Q02q19k185j707k177
3721c177m76N82J721K100J929O46j56j630k448j515j004K17J442K386K009P86
3737C412m28j253j435k396j308j02J480K169J805J814Kj623j906k024j359l72
3753c524J054K009K074J475K72o10k072k168j555n44P96J518K535J863L51o62
3769B812j449k316j786p97N97J746J730J946R23j81j900k102j615j098K46J253
$$ y = [2162, 225, -1901, -3090, -3584, -2778, -723, 1550, 3235, 3345, 2551, 951, -1220, -2971, -3728, -2659, -612, 1169, 2748, 3424, 2949, 1347, -1015, -2788, -3485, -3182, -1576, 627, 2585, 3680, 3249, 1555, -461, -2132, -3326, -3261, -1925, 30, 2346, 3528, 3257, 2220, 101, -2010, -3317, -3447, -2405, -291, 1766, 3028, 3194, 2723, 505, -1552, -3123, -3484, -2462, -785, 1163, 2909, 3711, 2892, 707, -1000, -3177, -3653, -3071, -1350, 750, 2679, 3325, 3169, 1539, -909, -2424, -3428, -3211, -1769, 617, 2626, 3412, 2984, 1731, 296, -2100, -3408, -3510, -2030, 139, 1944, 3758, 3760, 2137, 231, -1793, -3152, -3524, -2470, -461, 1613, 3088, 3360, 2750, 678, -1490, -3045, -3589, -2793, -1275, 1260, 3123, 3474, 2812, 1363, -953, -2739, -3536, -2939, -1193, 537, 2483, 3406, 3225, 1325, -777, -2392, -3490, -3244, -1991]
3785a991K028K466Q34l15r16k094k130j099J45P22J872K084J772j09j041j720
3801E08j998j747l51J467J763J440J722P20p32j946k251j282m66K70J529K190
3817H36J711P14o88j197j754k180p36K84J778J750J984R74l59j410j959j648j238
3834c138k15J391J991J985Q79L15q02k328k218q60J07N81J784K081J702J91o11
3851B835k203k036j498j87O42J369K327J504Q69j224j299j947j399r15P5J683
3867a404K372J534O73l49j127k192j908r20N23J278J985J433J207j61j322j564
3883E8k008r45j69Q89K172J686J262N76j349k038j721j222p4N86J537K274J416
3900B930J88p36j425j831j775m41N88J419K007J531N33m43j212j824j897q85O02
$$ y = [-1991, 37, 2503, 3337, 3022, 2106, 12, -2118, -3217, -3072, -2350, -478, 1606, 3378, 3269, 2228, 508, -1490, -3237, -3588, -2121, -358, 1082, 2804, 3524, 2792, 846, -1405, -2687, -3153, -2883, -1354, 836, 2547, 3261, 2573, 1376, -378, -2558, -3294, -3010, -1232, 518, 2502, 3476, 3117, 1707, -252, -1900, -3138, -3353, -1962, 29, 2014, 2893, 3208, 2406, 78, -2140, -3000, -2893, -2312, -528, 1553, 3255, 3446, 2835, 632, -1404, -2902, -3089, -2447, -1078, 1249, 2753, 3622, 2398, 1099, -848, -2247, -3162, -3087, -1404, 968, 2502, 3175, 2826, 1699, -493, -2401, -3321, -2798, -1520, 465, 1898, 3105, 2944, 1622, 58, -1950, -2895, -3064, -2175, -3, 1683, 2945, 3521, 2172, 134, -1587, -2809, -2883, -2297, -760, 1514, 2930, 3118, 2382, 957, -874, -2649, -3090, -2502, -1083, 924, 2455, 2988, 2545, 1333, -491, -2388, -3273, -2671]
3917b671J165K139J411J101J07j706j958j510r26n2Q68J948J978Q74K95j266j742
3934E5j390j460j85Q98J609K019J048J00o64j387j592j909l02R41J375J849J482
3951B487N87o16j601j598j656n58N10J118J974J883P36p48j311j624j587j084
3967c088N20O99J960J974P69j14p89j953j580j109K8J051J319J965J236Q8j004
3984A972j461j638j400n86R10J430J881J150O84o35j464j962j260l69L70J194
4000a184J959J607O47p26j266j541j668o10j10J496J542J353J280O7j230j986
4016c70j291r78J25Q65J664J562P63K45o95j632j995r93N3K65J820J811J492J3
4034B724r51j139j648j294p13P43J510J442J257P84j89j613j737j293p00K23J305
$$ y = [-2671, -1506, 633, 2044, 3145, 3252, 1546, -412, -1922, -2848, -2900, -2032, -84, 1894, 2768, 3063, 1797, 55, -1335, -2795, -2980, -2082, -473, 1546, 2594, 2694, 2030, 643, -949, -2858, -3160, -2219, -844, 1005, 2487, 3074, 2458, 857, -741, -2397, -2955, -2445, -1327, 647, 2530, 3266, 2518, 1207, -417, -2004, -3088, -2568, -1869, 91, 2065, 2834, 2720, 1931, -22, -1602, -2711, -2683, -1632, -313, 1652, 2888, 2976, 1972, 511, -1127, -2527, -3113, -2203, -773, 1108, 2258, 2942, 2307, 843, -1119, -2379, -2748, -2378, -1184, 775, 2382, 3029, 2303, 1037, -504, -2172, -2782, -2892, -1396, 146, 1499, 2779, 2846, 1616, -370, -1661, -2639, -2514, -1649, 15, 1577, 2340, 2585, 1890, 258, -1737, -2730, -2677, -2412, -592, 1219, 2711, 2724, 1773, 634, -1014, -2308, -3021, -2278, -768, 674, 1931, 2715, 2526, 913, -824, -2117, -2817, -2594, -1289]
4051a289J541J911N48k03j038j937j635o48N27N32J708J719Q22L70j531j182j413
4068a198j476k00J069J650J622R74L77p85j597j562j540j85R54J336J630J289
4084B358M05j70j735j587j415n54M79J107J518J639R01l86j394j739j400j023
4100b996L69J285J839J279R16k27p72j347j808j083k5P48J716J786Q66J28q39
4117A835j544j411j661K8R38J214J760J419J71r06j132j904j264o3L72J183J778
4134H13J486M71l88j507j626j449n83L08J058J879J130J224j15j453j513j440
4150a705j012l8J247J409J678P89k6o04j474k073q09J29Q32J232J740J140J26
4167B581p76j242j483j382k26K96J568J564J570K74n64j320j581j409o29M87J433
$$ y = [-1289, 252, 2163, 2711, 2508, 1470, -467, -2102, -2750, -2223, -1691, 17, 1736, 2558, 2928, 1397, 215, -1198, -2674, -2874, -1805, -155, 1467, 2441, 2818, 2033, 436, -1126, -2666, -2851, -1897, -561, 1069, 2358, 2763, 2593, 858, -729, -2144, -2698, -2219, -1112, 406, 2045, 2946, 2560, 1166, -573, -1973, -2996, -2627, -1342, 497, 1776, 2692, 2465, 1693, 346, -1462, -2545, -2570, -1822, -106, 1680, 2546, 2674, 1835, 291, -1120, -2781, -2753, -1815, -601, 1159, 2578, 2749, 1843, 711, -1193, -2457, -2520, -2148, -965, 813, 2299, 2770, 2382, 875, -751, -2200, -2783, -2475, -1417, 462, 1592, 2816, 2701, 1248, -265, -1705, -2717, -2755, -1508, -99, 1579, 2368, 2342, 1738, 264, -1809, -2618, -2489, -1657, -425, 1315, 2455, 2581, 1805, 563, -920, -2302, -2528, -2232, -664, 900, 2470, 2744, 2180, 860, -721, -2130, -2759, -2272, -839]
4184h39J454J500M72k82j107j536j327q31pJ265J433J287J244k86p82j747j376
4201a465j060N2P24J439J700J268j75q43j369j468j135k70Q69J437J349J018O37
4218B708q22j317j523j345m54P72J583J220J244M98m04j393j314j541o02N11J027
4235a152J760J256Q24m10j119j225j772q99O10Q76J192J880N21K64q94j602j639
4252a529p36j08R43J369J350N90O87r54j181j496j192k04M21J581J324J276L61
4269B502o80j151j546j098m83K34J394J664R22O26j81r71j632j505l66J63Q67
4286a241J639Q54R50K04r45j820j178p46j44Q05J643J371J258L9r44j538j421
4303a214q82l59J011Q79J520J131L20p21r90j532j035o48M99J366J463J019M61
$$ y = [-839, 615, 2115, 2587, 2305, 1198, -338, -1665, -2496, -2503, -1238, 195, 1482, 2726, 2440, 1658, -89, -1465, -2525, -2473, -1749, -310, 1390, 2658, 2483, 1640, 271, -1197, -2332, -2602, -1733, -296, 1053, 2071, 2708, 1886, 569, -954, -2299, -2753, -1981, -398, 822, 2066, 2564, 2160, 767, -547, -2088, -2690, -2179, -1152, 608, 1864, 2688, 2278, 1159, -66, -1838, -2737, -2127, -1251, -59, 1821, 2342, 2606, 1712, 110, -1529, -2265, -2373, -1430, -61, 1289, 1879, 2566, 1612, 431, -1065, -2257, -2461, -2040, -459, 865, 2141, 2502, 1822, 671, -875, -1973, -2456, -2222, -828, 836, 1758, 2384, 2203, 1232, -400, -1905, -2271, -2108, -1241, 398, 1252, 2202, 2406, 1461, -359, -1537, -2283, -2427, -1622, 21, 1392, 2650, 2689, 1745, 207, -1214, -2096, -2455, -1444, -565, 955, 2086, 2406, 1685, 695, -837, -1872, -2520, -2021, -655, 808, 1827, 2288]
4320B288l13j215j115j605n05N91P50J221J316P47M6r99j467j195q16J40P59J543
4338A71J362O38J39p70j636j216r11j02N36J365J640Q91M77j013j155j330j044
4355a958n11O20J600R59J470J32k19j498j192j250p26N02J384J115J377Q52m90
4372B167j182j469j106o42L26P33J105J753P06r2j001j316j537o10J6O11J488
4389e0J431R27O5q61j060j130j308o7K92J132J697Q78L65p08j011j423j170l89
4407b390N68Q03J630Q97Q80k78j293j220j075p15j68J459J032J506R77n21j088
4424A004j228j288o08rR14J060J263R08J23n49j579j185p84k33O98J213J414Q14
4442A948J17o05r53j554q74l59N58J345J046J129M33m55j132j567p02q85O77J210
$$ y = [2288, 1975, 760, -355, -1960, -2465, -1874, -1124, 97, 1413, 2160, 2206, 1207, -260, -1455, -2271, -2131, -1372, 171, 1533, 2171, 2310, 1540, -96, -1312, -2223, -2325, -1789, -424, 1216, 2107, 2584, 1571, 416, -914, -1958, -2469, -1849, -249, 710, 2180, 2312, 2093, 595, -597, -1847, -2573, -2071, -687, 428, 1805, 2657, 2167, 985, -484, -1590, -2232, -1906, -1173, -68, 1685, 2391, 2299, 1298, -18, -1555, -2165, -2149, -1538, -50, 1381, 2308, 2373, 1512, 452, -678, -1986, -2053, -1761, -629, 1068, 1946, 2311, 1603, 592, -831, -2001, -2390, -1822, -1019, 611, 1508, 2388, 2110, 817, -403, -1478, -2193, -2361, -902, 130, 1636, 2613, 2092, 1004, -224, -1512, -2120, -2129, -1215, -155, 1108, 2016, 2139, 1590, 11, -1174, -1958, -2191, -1493, -280, 1134, 1948, 2065, 1460, 507, -1047, -1921, -2280, -1722, -377, 669, 1798, 2231, 1776, 644, -923, -1625, -2510, -1833, -623]
4460f23J042J417M50J8j517j447p62r84L00P86J230J578M93K6j050j015j199q11
4478b068KO16J732J082J024j30q26r75j477j007k41N59J202J434J074N18j055
4495A464p25j488j061j17M2J252J323J186J48j78p02j680j428j83M25J011J315
4512F04R46N37p8p73j315j250o71o8Q01J366J061J169n57l53j205j300j115J59
4530b042O14J157J363R04L2n60r44j086j242l63O37R60J193J245K17m11p88j498
4548f12j124l08L04Q18J406J451n7O0q24j609r33p86J49Q57J537R34O64k04n05
4567A218j455j200p89J59Q38R28J531M89N83r93r04j524n96l61O18J145J216R39
4585A842K86p33p47j220j103o46K98J218J616P85K64R7r73j359r48o13M30P95
$$ y = [-623, 419, 1836, 2286, 2304, 787, -660, -1422, -2406, -2106, -1320, -90, 1488, 1981, 2007, 957, -58, -1257, -2068, -2066, -1450, 282, 1364, 2388, 2258, 1432, 457, -1020, -2027, -2268, -1709, -507, 927, 2001, 2519, 1464, 739, -749, -1810, -1927, -1885, -633, 690, 1876, 2024, 1846, 1144, -536, -1964, -2147, -1722, -711, 604, 1550, 2087, 2009, 1236, -79, -1329, -2000, -2068, -1267, 99, 1160, 2329, 1772, 1419, 214, -1086, -2201, -2042, -1428, -271, 1092, 1996, 2028, 1468, 524, -562, -1804, -2167, -1530, -570, 623, 1868, 2085, 1674, 886, -612, -1736, -2044, -1740, -922, 484, 1935, 1878, 1938, 1114, -495, -1428, -2214, -2065, -1208, 329, 1263, 1927, 1723, 1218, -237, -1437, -2226, -2067, -1229, -301, 1230, 1719, 2302, 1309, 405, -1119, -1715, -2076, -1458, -313, 903, 1842, 2128, 1395, 648, -572, -1675, -2321, -2023, -805, 811, 1596, 1860, 1957, 984, -375, -1323, -1936, -1506, -711]
4603g11R48J104O06m3p69j278r85j045N63P14O01J578Q65r0o46j226j099j216
4621b129J06Q18J182J205J006l06m01r99j300q05n53M64J232J344O87N34o89o18
4639G78j338j139k34J40J027R95J014O00k22m80j487j047o11K08Q79J121J068
4656A272O29k20r93o72j300n35j77O36J297J215Q74k20o56r85r96j269P0P09Q59
4675d62J287P26L06l25j098j144r93n26R05N66J402Q50M04Rj269j147p87o28L66
4694a558M74J444R49P39l32p09j203q88o09k14O56J232R55R16j86l95q18j598
4712a145q36J66M06J041J283J037p9p45o83j528q26K71M50P77J076J133L17o49
4730A466p10r67j400j91R2Q88R82J220M18k18r41q61j004n37K22P52J014R69Q75
$$ y = [-711, 237, 1341, 1947, 1904, 1135, -143, -1128, -2173, -1610, -896, -295, 1283, 2148, 2058, 1412, 186, -913, -2129, -2023, -1205, -23, 1182, 2188, 1882, 1481, 482, -818, -1623, -2176, -1712, -480, 864, 1551, 2085, 1396, 778, -560, -1699, -1933, -1793, -766, 229, 1243, 1843, 1621, 1141, -346, -1393, -2004, -1796, -917, 204, 1272, 1901, 1681, 688, 16, -1284, -1819, -1996, -1360, -63, 1152, 2026, 1806, 1150, 165, -831, -2100, -2030, -1321, -462, 825, 1551, 1857, 1532, 434, -710, -1703, -2229, -1324, -758, 644, 1494, 1898, 1907, 638, -509, -1296, -1924, -1558, -1084, 360, 1309, 2048, 1716, 1007, -196, -1084, -1693, -1907, -1251, -19, 936, 1852, 1666, 1271, 453, -1145, -1981, -1815, -1409, -368, 915, 1952, 1873, 1128, 445, -1083, -1909, -1638, -1188, -411, 665, 1798, 2115, 1466, 756, -211, -1611, -1802, -1710, -822, 160, 1380, 1798, 1580, 639, -222, -1226, -1763, -1541, -789, 225, 1194, 2069]
4749B069l14p99q90j293n62J15O10J147J033N79J2n80j128r42p31m59O68J355
4767a10P37J145l1m16q94j431p73oN44P41J265N16N11l79p74j076j200l92K44
4786a779O46J327R84N98J6q49j139j043l81k25P98J452J066L27k29k71j281r05
4804h88q85J31N23Q11J296M62O88p23j116j140j001k03O85R95Q87J101J60j58
4822A625j069j175q73k76J24Q03J319J049J86k16r01p69j003o69K60L63J442J005
4840A225N96J85r95j167o17q99j70Q92R11J001N88J00k68j538p30p10k23M75J208
4859a36N34R46L01l00j132j036q02k19M15Q74Q65J337k53K23r32j058j043o05
4877b021P01N29J335O53O26l65o49j166r99m90J30N75J181Q91R26l19m90r69j142
$$ y = [2069, 1755, 956, 66, -1227, -1789, -1674, -1064, 83, 1116, 1695, 1707, 1127, -1, -943, -1674, -2133, -1465, -110, 627, 1772, 1741, 1325, 431, -1000, -1773, -1779, -1235, -494, 771, 1287, 1798, 1419, 645, -431, -1631, -2023, -1779, -1133, 194, 1178, 1776, 1792, 943, -196, -1239, -1620, -1845, -1047, 405, 1471, 1798, 1569, 1298, 17, -888, -1773, -1642, -1119, -308, 988, 1450, 2138, 1415, 299, -841, -1842, -2045, -1360, -365, 522, 1623, 1783, 1625, 556, -619, -1492, -1768, -1644, -841, 478, 1527, 1713, 1497, 596, -173, -1176, -1845, -1585, -1222, 220, 1225, 1821, 2006, 1011, -156, -773, -1672, -1842, -950, -39, 962, 1550, 1650, 1382, -156, -886, -1596, -1819, -1344, -136, 398, 1344, 1645, 1345, 213, -823, -1625, -1844, -1429, -555, 310, 1647, 1394, 1617, 685, -373, -1416, -2021, -1320, -791, 544, 1197, 1823, 1458, 809, -357, -1356, -1846, -1716, -1141, 40, 931, 1857, 1538, 1048, 79, -1063]
4896a063k47l15N50R86R59Q20P0m92j171p90r17k68K19J176R43R75Q4l88n58j248
4916f75o26m30N15M60J174J037M13k60j017r48p69m81J75P45P72J158K47J93o91
4935I92j221p65o23K43L38J276O33N00M29o10r55j334n88L7L17J031J066O64J00
4954A530l08r29j044o64l21M95O73J055J073j35j81m10j292p98k53j26J020R84
4972C69R90M6K44q99j024o98o05KP02R09J089L02Q8j8j619j080k09p7M12R14J097
4993I35M90K11n94j036p44n72m34O34P72J127P03Ll41n40o41j547m10P04Q25Q21
5013C66P65N39m94l80j012r44k20j2M60Q30J588J81k33l96q06j249m26RO54R40
5033A60J179o3L94n98j146m91q36l57O95Q13Q47M72N56k90j211r11p98l5K31P63
$$ y = [-1063, -1310, -1625, -1075, -89, 870, 1690, 1760, 1268, 97, -693, -1610, -1878, -1659, -483, 460, 1435, 1519, 1131, 573, -675, -1301, -1731, -1216, -756, 418, 1455, 1868, 1608, 591, -357, -1126, -1607, -1432, -687, 85, 1243, 1490, 1683, 992, -229, -994, -1617, -1374, -1036, 240, 873, 1373, 1802, 1192, 237, -1097, -1685, -1648, -1331, -300, 766, 1430, 1530, 1222, 293, -751, -1415, -1736, -1241, -568, 487, 1560, 1425, 1244, 834, -458, -1256, -1509, -1635, -615, 369, 1359, 1405, 1649, 750, -274, -972, -1577, -1575, -873, 36, 1125, 1427, 1515, 1497, -122, -1202, -1411, -1488, -1076, -162, 935, 1425, 1636, 1042, 6, -738, -1310, -1744, -1110, -338, 789, 1492, 1495, 1154, 614, -27, -1574, -1984, -1280, -455, 366, 1131, 1670, 1176, 796, -216, -1160, -1380, -1392, -932, -102, 1486, 1667, 1434, 1038, 232, -1017, -1443, -1434, -780, 160, 1339, 1276, 1670, 1072, -74, -565, -1401, -1758, -1063, -250, 597, 1069, 1625, 1335, 124, -787, -1585, -1620, -1389, -626]
5053f26J150P70J73k04q07j005m48k08n6M55R96Q89P35l37o26j126n08o84l78
5072a845Q56J030R96K77M28r92q85n57o20l89K71J303R38L09L42n27n93j123p46
5091a527j79O61N70J150O63L84k97j037r04n80o30O53L64J035J067Oj08o58j177
5110e44m77p58J84J046J021M46P87q4p86p99o94p00k32J044K92Q91Q38Q8o47n30
5130C86q07j064k52R63N48P89Q70k7j73j007p31r22l23N51Q06Q98P64L83m46n38
5150F68j061n46n60K49O34R66N81N03M2p39j067p72o49N12K79J063Q41O29q5p60
5170G28n99q54o40l28P77P35J207L70L99q56n87j052q94RJ48J062Q65J023J38
5189A651l36o51j308o22l08L63P07P23R45L76k67q41p50r80k20p1Q98R00J060
$$ y = [-626, 524, 1294, 1467, 1263, 456, -549, -997, -1205, -1261, -806, 190, 1079, 1814, 1477, 851, -275, -783, -1467, -1845, -989, 41, 1037, 1314, 1742, 750, -135, -692, -1312, -1701, -1430, -127, 811, 1120, 1462, 935, 342, -781, -1527, -1706, -1045, -475, 675, 1338, 1722, 1425, 388, -516, -1096, -1726, -1073, -709, 326, 1393, 1399, 1291, 633, -544, -1021, -1779, -1595, -549, 472, 918, 1705, 1621, 835, 36, -658, -1358, -1590, -546, -254, 637, 1475, 1563, 916, 386, -421, -1485, -1737, -774, -226, 563, 1433, 1406, 1233, 226, -505, -1427, -1750, -1199, -393, 505, 1269, 1652, 1206, 668, -393, -939, -1499, -1250, -616, 350, 931, 1434, 1476, 737, -330, -1102, -1751, -1239, -960, 103, 944, 1573, 1488, 728, 129, -725, -1365, -1693, -916, -181, 1026, 1396, 1795, 939, 352, -700, -1594, -1585, -1437, -375, 490, 1513, 1651, 1315, 664, -644, -1266, -1574, -1211, -504, 219, 1164, 1540, 1273, 432, -318, -1298, -1518, -1589, -691, 209, 1269]
5208A269L94l06m39r33p85m06k87N27J057Q18M27j80l06q27r06m72J08J17R34
5227a96R29P07J13m64q14q80o90K6K56L99J085Q34M93l72q01j016o48j55L5N69
5247e90Q10R52K39l53l65p12r69m64L7Q36O56N98Q41j57n90q17p54l82j89N26
5267h47N84R81K83J92L5r68j041n51j57M11P06R60P47J34j43q91p94o85m45K87
5287a202P76Q44O31L06p9o07j257m48o36M12N24R41P71K29Om27p88q66n21K18
5307a173M27O83J174K33j03m72p31o65p63j30O61Q19O93Q03q4l49j056o46l73
5326a052l24L67N73P96P38L56l32n83j006o63l2j32J011N32P76M23k17n58o77
5345dj249j20J00N29J075Q11K2Jm25q02p20n49P2N20P22N64R66j21o48l05j620
$$ y = [1269, 1663, 1357, 918, -15, -800, -1206, -1493, -966, 91, 909, 1336, 1156, 850, 23, -883, -1355, -1247, -1130, -196, 733, 1440, 1553, 1089, 275, -605, -1295, -1269, -1013, -614, 471, 1305, 1798, 1426, 625, -391, -1039, -1194, -1159, -590, 220, 1172, 1411, 1058, 693, -19, -988, -1452, -1415, -579, 77, 675, 1516, 1359, 769, -48, -802, -1184, -1373, -847, -263, 718, 1001, 1193, 1228, 260, -781, -1332, -1489, -1078, -372, 588, 1335, 1469, 1326, 435, -359, -1044, -1489, -1202, -426, 418, 1049, 1355, 1276, 669, -588, -1036, -1672, -1260, -736, 205, 976, 1205, 1211, 784, -4, -870, -1391, -1173, -746, -63, 1111, 1344, 1241, 769, 38, -627, -1390, -1520, -859, -40, 653, 1456, 1372, 1023, -33, -679, -1052, -1376, -1009, -436, 360, 1098, 1454, 1122, 539, -467, -1130, -1162, -1294, -283, 249, 1025, 1448, 1231, 673, -4, -1253, -1373, -1273, -744, 331, 1142, 1164, 1165, 740, -62, -782, -1331, -1259, -739, -17, 547, 1513, 1392, 744, 439, -1181]
5366a181J22l25M97P47N07Q04K78m35q31o92o02l71N47L46J087M87L58k19q09
5385C15k22j322M0j06R92O54N87M69m12n00p02n85m67J46K28R37M69P96j62l79
5405G76n62j070k59l20N55Q38P65P86m60m6p96p74m82k38M09P75N72Q81o2m37
5425H51l10j021n17j29J6Q45M55Q07M62l90n21p49o38m36Q4O38P78N89N23K20
5445A557q89p90p36l57M2K52P98P82N34L26o31r29m02n17m36P49L68R73L89K77
5465A360k60o87r98m21m47M68O14Q28M81K39j02m86q11q12k22J44O62O88N66N99
5485A403l18o78o56p39k75J13N34O09P42N91K51p47p81j074k15K16L8Q30Q20O40
5505A304j85k63p03q10m37j62K11P13Q19O27J92m08o53p20p10k07J89Q32N30Q07
$$ y = [-1181, -1059, -1384, -887, -140, 367, 1171, 1449, 1014, 183, -509, -1111, -1482, -935, -589, 498, 985, 1343, 1124, 315, 93, -1229, -1189, -1295, -303, 351, 938, 1407, 995, 495, -207, -792, -1259, -1113, -885, 52, 521, 1317, 1155, 776, 214, -856, -1115, -1435, -880, -42, 723, 1509, 1049, 1003, 207, -567, -1049, -1287, -878, -103, 469, 1350, 1288, 851, 541, -480, -997, -1126, -1110, -265, 190, 997, 1459, 1069, 548, -201, -839, -1275, -1191, -553, 225, 814, 1337, 1557, 668, -122, -858, -1215, -1173, -921, -123, 659, 1193, 1519, 888, -41, -443, -960, -1396, -647, -279, 694, 1083, 1360, 1100, 413, -585, -1006, -1453, -985, -371, 457, 938, 1177, 1075, 589, -222, -1034, -1256, -1112, -450, 238, 804, 1403, 1085, 407, -249, -988, -1263, -1150, -616, -7, 735, 1326, 1577, 830, 49, -1025, -1240, -1024, -986, -156, 664, 1304, 1119, 856, 153, -657, -1094, -1256, -1045, -332, 487, 1114, 1306, 898, 245, -475, -1185, -1392, -1203, -371, 159, 966]
5525I66L79n8m83j239n97m18M28K50P56Q95N64l29k80r24o81m13J01M4Q48J150
5545I59K91Q4l20q40r45k10l06M68O00P29Q91j48r5o79j282l48k15P58L87Q80
5565F59L02J95J58p44j005q44k03J19Q04P30Q35K55k99l81p84n61k16n0K47P46
5585c7J028K70m1m80q82n84m06J1M25Q06O96M33K38p24m01r22p62r7L79J113N37
5606F00M67L37p37n10n94l84l58L96M68P51L44O89m90n61p39o65l02M63K68L66
5626a91J016L65k21k94p37o74n24J18M11N84J102J77j07%r02m90o45j75L86N67
5646b34J096j01L18K0r70p47m37k75L10R50P00L60J23k34n49p22n05m76M46N92
5666c35O56O64L38k21n01r69n01m13n3Q90M95P69K97J22m33n75q92k46l08M87
$$ y = [966, 1345, 1287, 804, -435, -1032, -1450, -1022, -772, -16, 879, 1443, 1114, 834, -90, -771, -1184, -1083, -1039, -191, 959, 1250, 1334, 1014, 174, -771, -981, -1287, -819, -219, 510, 1401, 1253, 1158, 479, -803, -1151, -1366, -608, -221, 659, 961, 1156, 1314, 570, -435, -1279, -1482, -1363, -559, 171, 1006, 1261, 962, 581, -203, -764, -980, -1030, -783, -37, 991, 1261, 1220, 740, -142, -726, -1132, -1121, -696, 110, 806, 1239, 1477, 753, 352, -570, -1332, -1429, -1050, 63, 600, 1067, 1404, 667, 157, -437, -821, -1179, -783, -315, 436, 780, 1469, 979, 418, -321, -986, -1288, -825, -557, -191, 825, 1190, 969, 675, -62, -736, -1260, -1142, -731, -147, 955, 1132, 1025, 1025, 123, -367, -1012, -1187, -801, -234, 862, 761, 1079, 1099, 129, -618, -1055, -1330, -1020, -70, 630, 990, 1113, 879, 330, -392, -897, -1373, -927, -335, 321, 985, 1323, 1102, 601, -368, -869, -1282, -1335, -445, 50, 819, 1116, 1238, 805, 230, -662, -908, -1216, -729]
5686g29O91L40R37J91o45o62o37o51r0P10L21P77N51J51m08o23r25k09o3j42R73
5707a42P66L19J18p7p88n08m87n92K22M55Q76N48O40l83k2j097q53m17K53M69
5727g00N02R26K97J94n13p32p80j59r5J67P40P75K75K56o07l46q30k00k27K45
5747h12O00N91N49L91l64n76q70l82l16L05L50P59O39J36J22r48n04m16m01Q0
5767a067N46N33P73J06Q5j66q27n31o02K73J64O52J026K41k88j51n20n85n53Q3
5787h08R8N50R89j3pJ52q04n29p76N2N62K47N70O04L34l96o02n68m34m32J49N34
5809e28P47N80M05k07l90p25l67n72J84J48P31P61J35k6l73l00r53j32m23Q61
5829d44L66Q51R8K10l70n58p23k54k99J96P88N00N28L87l30p56n69m84j04jO00
$$ y = [-729, -38, 302, 1239, 1430, 785, 123, -514, -1165, -1255, -545, -224, 553, 1104, 1255, 847, 224, -701, -910, -973, -1115, -142, 624, 943, 1061, 984, 196, -312, -799, -1391, -1169, -714, 162, 710, 1350, 967, 945, -152, -1005, -1422, -1169, -700, -198, 728, 1025, 1219, 706, -26, -806, -965, -1060, -893, -153, 622, 897, 1153, 546, 200, -630, -830, -1057, -812, -212, 379, 928, 1319, 955, 379, -491, -873, -1189, -884, -534, 225, 864, 1000, 1122, 174, -330, -746, -1147, -1067, -521, 12, 785, 891, 976, 810, -17, -548, -1150, -877, -713, -61, 965, 1206, 918, 767, 247, -338, -891, -808, -710, -160, 829, 816, 809, 961, 157, -372, -1148, -1096, -534, -287, 283, 887, 1221, 825, 223, -345, -779, -1211, -1062, -528, 219, 799, 1204, 997, 607, -118, -485, -1057, -873, -725, 6, 767, 902, 876, 503, 203, -750, -882, -1305, -444, -78, 773, 871, 1081, 711, 153, -570, -824, -1123, -927, -139, 361, 889, 1276, 946, 190, -379, -863, -967, -968, -368]
5850c68L87P98K45q4p12m99n24l99L76J36O64Q60J03j67l38o66l30m44Q3L51M58
5871g0O52M40Qm19m92n03n48j59L76M45P47M27K84m14m90o30n58m9L17M72P36
5892E72N02j50k10m51o74l93n8J2M73M27O08L72j57k91l88j160M7P4K86Q97M40
5913G78L77j66m38l89o74l56J4J40O55P93L45qm33p87m98j1m49N63N54L46L92
5934G48J10J50n78q77m44J03J0N15J019J13K23l04l18q81m80k67L67L85P06N03
5954H03J88j96o28m68n5m68k9J36M86O99L42K26p50n51l33k74J38O9O77N66J48
5975G26K39k12n74p02l62j65N19K61N44N11K48j87p22m82o14K7N8M15Q54L38j2
5996G08J10k88q96k54l53N9K26N02O78K54K27l79o63n23m53J45M38L96P27L31
$$ y = [-368, 19, 817, 1062, 978, 266, -233, -757, -1156, -780, -644, 20, 880, 983, 816, 478, -188, -518, -962, -879, -528, -70, 582, 1022, 1030, 611, 119, -384, -932, -1091, -715, -270, 477, 904, 1188, 774, 284, -346, -904, -953, -636, -164, 572, 1074, 924, 714, 263, -411, -804, -862, -850, -377, 50, 658, 1030, 873, 582, 194, -966, -919, -845, -559, 338, 778, 1155, 989, 551, 162, -512, -868, -854, -714, -59, 734, 1079, 1071, 638, -149, -647, -658, -1107, -544, 10, 356, 748, 858, 1008, 430, -447, -891, -788, -778, -263, 756, 869, 1092, 788, 470, -411, -891, -1158, -791, -406, 300, 803, 991, 795, 167, -301, -356, -824, -853, -717, -231, 468, 810, 1036, 286, -265, -598, -872, -734, -665, 12, 578, 726, 965, 753, 179, -523, -885, -1050, -531, -270, 274, 785, 1033, 846, 124, -358, -972, -945, -887, -472, 382, 720, 708, 818, 530, -366, -620, -973, -914, -688, -186, 492, 746, 973, 594, -69, -592, -1045, -900, -462, -66, 661, 992]
6016I92l10j46q70k37r2l15M34N58N95L53k33j34m46l38p19j65K92M60N87L62
6036F28L00l01m95n12m56l34M06N34K51O08K64K2l67p30j34n46j15O11K22L98
6056B54O23J19n56m28m82l88j31K55N91O70K90p0j22l49n24o49L02n4M85N60L60
6077G56K84l95m76l64o33j35L81J79O96K69P19n93m4o55q23k7J75M18L47O69L6
6098G84n5l78l92p90m12M70K50L21N45O53l05P8q54n13pk45K38M41Q25oL57m31
6120E74k41l81p59O4K48rR14K48L32k17q65j19l71l16K76M11L17O40J40j54l79
6141C53m42m49j34j82P90J62O57L74m96j16m63n39j94j3L03P22k64P22N5l87k4
6162D35j032rp6o5O54M11J53R52q33l21o03l69PK10J42P33K15K52j21n10m48n98
$$ y = [992, 682, 536, -334, -571, -663, -978, -544, 14, 609, 962, 729, 595, 149, -189, -908, -1073, -781, -321, 266, 628, 928, 627, 132, -380, -836, -1170, -764, -230, 21, 629, 893, 915, 548, -182, -316, -862, -977, -366, -144, 254, 877, 996, 440, 12, -470, -858, -989, -734, -143, 527, 817, 747, 625, 276, -248, -897, -595, -649, -164, 396, 756, 1040, 645, 169, -195, -828, -963, -582, -403, 293, 562, 1281, 688, 644, -11, -834, -861, -686, -268, 79, 748, 784, 729, 351, -41, -831, -1243, -773, -523, -202, 343, 996, 691, 769, -85, -598, -605, -850, -612, -171, 654, 648, 1005, 574, 333, -48, -807, -743, -495, -504, 410, 658, 990, 773, -92, -211, -582, -898, -622, -211, 106, 746, 886, 732, 353, -89, -538, -672, -854, -64, 98, 755, 1129, 633, 517, 54, -485, -679, -692, -389, 333, 69, 791, 846, 459, 435, -597, -606, -682, -747, -93, 318, 471, 1423, 590, 269, -334, -703, -696, -486, -344, 389, 604, 856, 735, 225, -223, -821]
6184h21p4K31L97M05L28J71J55m99l19m11k11k99K95P60K88K93J11k56l86n93
6204d35k41j0J3O05K58N33K1j58m85n27l39j16J98N65L67M36O6j56l12n42n01
6225g60J96j29M29M36L42K89M0l30p42k75m39L70K92L16P67j04K44k31q46l97
6245e32l56L46J7M40N55N17K9l97n90l11m82k20O28K36Q49j05K7Q8p44j84p44
6266i33J97J96M63J22M94M69j95p37m64j55k74J39O6Q72N25J2j20j29m78o17l4
6287e81j6P7L61P37L14p3k49p10m52r5O8K69M84L51M39j69k04n66p62j64N9K12
6309f70Q01J86J28M20j31p56l39j31o19N15M32K23P13j35N8l11p83k32k26K00
6329f57K85P58J30L60l12l4o96n35J17n7K6O19N77K63p8l79m41l45l65N3K81L33
$$ y = [-821, -895, -664, -267, 138, 466, 637, 792, 293, -26, -437, -648, -947, -652, 108, 396, 689, 800, 544, 158, -435, -676, -686, -673, -68, 190, 723, 744, 586, 101, -426, -765, -881, -683, -118, 249, 685, 751, 595, 283, -259, -760, -564, -693, -264, 172, 514, 803, 843, 513, -229, -504, -943, -573, -281, 35, 802, 698, 942, 711, -135, -532, -888, -542, -525, -85, 470, 987, 1016, 619, 29, -282, -764, -984, -356, -120, 729, 624, 651, 739, -5, -189, -933, -736, -540, -77, 45, 539, 1008, 813, 76, -388, -543, -817, -678, -612, 260, 785, 797, 677, 548, 70, -547, -581, -597, -520, -159, 578, 892, 819, 570, -140, -592, -687, -619, -350, 134, 485, 924, 755, 551, -15, -777, -941, -882, -670, 131, 317, 445, 865, 734, -22, -361, -492, -1111, -596, -164, 59, 772, 637, 695, 384, -399, -631, -857, -657, -372, 386, 516, 876, 564, 530, -166, -701, -584, -641, -615, 4, 581, 844, 766, 387, -54, -399, -764, -711, -430, -97]
6351i7M64J88K26n7p37m11k63j46M67J99L83L50L26o64k98o8n62l8J94Q0O40K74
6373D50L51k09n25r1k52n32M24K5Q14k2L95k76l94k37q13L59r1m7J018J8K18K3
6395F06k98j21j094J15K3K23N47O53L6N2k82l11l33l70k42K57R2P11N37mP2m54
6417D15o94r3p6rM58P8M31K21m2k94l04n05l17l50P35K89M42q1L75k92o57j11
6439c81l40N5K71L09M91L82m45k12p9l75k17J2k41M55M64L33J17l52p8m81k15
6460e27k17J38L50M15N14K74l22l96o17k24j85K95p9Q32J55R2M8q3k92p73kp9
6482f83K09K76M22L73J02l15l09m17k53QK32L50K54J31M37n06k52m66k24K58o5
6503d38K70K07M26L27k05n02l69j87j2l70J046J56K28N1l65J06m45j15k11k5J98
$$ y = [-97, 367, 555, 781, 724, -13, -424, -687, -833, -366, -167, 216, 566, 892, 228, -70, -138, -700, -738, -544, -464, 176, 450, 801, 592, 67, -24, -276, -808, -384, -359, 455, 433, 828, 552, 158, -79, -892, -533, -624, -671, 347, 365, 583, 606, 308, 187, -907, -792, -769, -546, 1, 654, 690, 742, 460, 149, -184, -554, -796, -539, -447, 264, 801, 797, 869, 415, -279, -372, -448, -457, 1, 79, 510, 731, 689, 395, 91, -414, -731, -1081, -346, -57, 385, 304, 679, 387, -270, -381, -721, -666, -395, -86, 405, 787, 342, 130, 51, -324, -541, -529, -770, -315, 149, 482, 599, 247, 169, -312, -527, -744, -606, -256, 159, 673, 947, 625, 229, -388, -612, -797, -502, -581, 251, 406, 498, 546, 463, 171, -602, -604, -683, -474, -198, 224, 597, 699, 384, 75, -342, -595, -587, -355, -5, 249, 380, 817, 311, 59, -407, -631, -373, -438, -168, 39, 465, 792, 587, 85, -284, -471, -483, -853, 193, 349, 577, 628, 263, 369, -76, -191, -402, -427, -229]
6524b29M43k01O81L8m80k88l29l20K1M19L06J84M62q9l47k73o28J07k80L26L95
6545h2N05J7J66nl03o21l19J26K3J14N97J67J57Q3l89n66J18k58j05J54O63l4
6567B08N04j78l88m21o9k77J74J96K45L65K03J05m66k34n01L4r8R7M23M02n1L63
6589F36j97k53k38o99M06o8M76o4M95j30K77m11m98o5l63K52L54L06J39J50J85
6610F90o69l14j47Ll4K09K48N23R8j5l00m49k68k08M16o1N36R7L34j72j06l70
6632D1l39l07j24N31K65L22Q4J34j84l06p6n52j28J50L73N20J59K2j45k94k42
6653i6o94k8K89P08J42K74O9n8l30l79k3n22Q6K78M17L02L9J90m41j88n06Rk95
6676g57N35K86M9O03j67j57m25k90j80r2K6M37P26J41j19k58q7m76l00J45k16
$$ y = [-229, 214, 13, 694, 732, 252, -36, -365, -685, -664, -245, 61, 245, 707, 618, 271, -2, -630, -523, -803, -477, -82, 423, 440, 606, 601, 298, -323, -642, -516, -493, -379, 218, 385, 542, 625, 236, -330, -212, -470, -575, -421, 242, 208, 712, 534, 146, -275, -344, -621, -447, -251, -6, 359, 562, 667, 201, -33, -534, -500, -598, -501, -78, 324, 273, 636, 439, 186, -52, -751, -345, -413, 63, -1, 494, 364, 641, 230, -268, -333, -696, -444, -90, 216, 355, 505, 690, 21, -293, -440, -437, -471, -262, -14, 509, 607, 592, 292, -157, -425, -633, -217, -278, 258, 355, 689, 517, 411, 41, -298, -605, -729, -198, 67, 389, 473, 607, 423, 117, 41, -511, -639, -489, -116, 404, 563, 585, 440, 146, -96, -790, -818, -529, 179, 321, 595, 664, 606, 276, -103, -126, -648, -562, -284, 133, 435, 474, 664, 223, 35, -471, -462, -757, -222, 64, 113, 716, 549, 392, -33, -323, -503, -595, -569, -132, 594, 735, 616, 358, 271, -205, -505, -360, -576]
6697e76M67M89j72R2K56n61R2n78k26J92K50O19K87M1j67k85j18m57K6l9P5K35
6719e8P60j25j68N9l31n36l04N42j44K22K71K51J17p1m79l13l94K1O57pK31J57
6741C58K5p6k17o81K40l2n6L02M76L13k35M8m20m04j6k49J16M78L33m2K74O0m18
6764A77k01m67k7M8J94M16Q4P0j51J72n34L8l32L5K48J6Q23j2O8l48l6o13J17
6787b15m63K69J28N23M54l15m1j10n13l4o4k4J33M75L36N9no04j2l15j69j08L36
6810b79L10L34R2K74m97k69k80q9o4J99L95J93L49j50j74p00j70k45R4L53P1K87
6832C4N08K36n68k45l02j02L14l60L27M22J36O2n4k08o49P0l69L67K59L08M96
6853F82l38J07J4m73p0k50j05J54K45K44k3M21l01m25J70q75L37J23N91J08RJ43
$$ y = [-576, -109, 380, 208, 300, 556, -5, 87, -491, -717, -525, -275, 344, 631, 672, 505, 220, 102, -355, -329, -368, -293, -58, 702, 577, 409, 468, 137, -399, -703, -161, -305, -83, 188, 439, 556, 485, 6, -307, -701, -680, -23, -30, 201, 358, 383, 307, 90, -591, -351, -383, -439, -137, 339, 652, 417, 465, 45, -359, -375, -624, -508, -30, 303, 261, 535, 595, 177, -24, -491, -518, -470, -276, 140, 224, 294, 143, 315, -219, -181, -513, -478, -230, -214, 609, 597, 665, 317, 281, -332, -215, -678, -409, -281, 242, 696, 381, 340, 230, -283, -317, -381, -405, -272, 203, 539, 598, 593, -11, -23, -338, -507, -615, -279, 31, 365, 457, 731, 234, -35, -315, -404, -468, -269, 126, 319, 668, 518, 344, -356, -526, -771, -677, -324, -253, 34, 542, 778, 210, -35, -337, -439, -125, -485, -158, 264, 400, 462, 408, 200, -449, -379, -748, -381, -122, 186, 682, 344, 451, 465, -8, -78, -328, -433, -279, -34, 210, 187, 608, 307, -118, 52, -823, -486, -363, 228, 336, 345, 488]
6875D88k96j1n83J9j28J52K60L38N1J78Qj25n43j70k0N6P9K41N63j12j20m9m60
6898a84o4k62K75O2j02N91m2K79l19l19j25j79P8J15M71j8J45N8j65o25K55o16
6920f91L08p0L77K84J92L0l69j9j68k72O8n3K70M73L15k23j76r6j05o65Q6K48
6942b56M00J59m2L09k23M3m96j22k25n0M53J28J19L18l51J15k81k72k68kJ73L79
6964HN8l6L50j67l05M7k83j38R3N28l9O4L39k24K2m08l56J07j89L56N15k4k0K21
6988E19o01j48j85k13K22L65K59L49j18j10j2k85k74j25O9J06L48J08L3N1l00
7009E8p7j28M0m75K15L66N9K32NL33q23l87K51M6n7L16J38K97J62l05l83k00j34
7032d51J29K02Q6L98m2R4o9j62j34k29k3j57J1N28l3J05P1l02j39m65K00o2J80
$$ y = [488, 192, 181, -402, -383, -511, -359, -99, 239, 290, 468, 476, 351, -192, -362, -382, -326, -247, -6, 557, 445, 325, 276, -184, -248, -510, -235, -173, -275, 316, 274, 553, 234, -85, -210, -389, -311, -196, 275, 257, 402, 460, 295, -330, -75, -691, -383, -453, -76, 208, 400, 430, 61, 42, -126, -398, -330, -383, -113, 360, 675, 452, 276, 180, 75, -590, -504, -256, 144, 303, 261, 570, 347, 390, -106, -228, -453, -503, -50, 78, 197, 515, 164, 279, -2, -274, -542, -544, -371, 8, 66, 30, 380, 213, -92, -45, -328, -466, -373, 155, 116, 180, 519, 295, 317, -91, -447, -340, -529, -173, 342, 318, 298, 519, -82, -230, -415, -628, -406, -41, 218, 567, 449, 339, 327, 42, -232, -357, -288, -182, 166, 274, 307, 358, 58, -19, -147, -107, -582, -367, -1, 58, 290, 295, 628, -195, -582, -331, -285, -342, -26, 112, 409, 571, 266, -117, -317, -451, -322, -120, -34, 364, 322, 416, 347, 185, 51, -178, -201, -358, -347, 181, 148, 253, 324, 22, -117, -582, -382, -444, -264]
7055b64L98J79L35l26m0k34n44l8r7J47L33J75K37n5o8j33k46j06q2K10Q7L57
7077B25pQ0j95M6k10o4k81R7J4L93M49j65o0j56q0k23l54K86K19J4M46l37J92
7100C29j83j82l68m60L22J60K91J93M85l7k01j98m93N9k52L89J15L07K32r4q7
7121C27j61l67j7j33Q7J39M92J53n7k70j70j95k29j98L67J02L59k3r7K11l61l9
7143h0l14o9j04J93N79J57l9n8k87j39j34j43j0L62k3J59M08l26rj79R8m49J45
7166b62K34k23M07J54l6k04qj86m83M74l34J69N84N5r1J92j99m90j38K3J8L15
7188b9K93n5R4L79l28l71m30J2J90J57Q6K64J41j16J97p38j60K43j0J6r5L66K62
7211C68j74J4O8n35p1k3L63q0J49L32J30j43m81p7mK15LK4J24j14M20k57p9k34
$$ y = [-264, 134, 313, 648, 322, 282, 48, -496, -534, -631, -484, -151, 24, 261, 206, 138, 5, -241, -347, -429, -219, -132, 225, 218, 298, 103, 149, -61, -125, -406, -309, -295, 98, 547, 382, 322, 166, 86, -137, -491, -205, 14, 28, 474, 137, 329, 146, -36, -404, -864, -542, -382, -91, 102, 587, 550, 349, 151, -342, -283, -535, -146, -31, 276, 508, 414, 327, 166, -201, -218, -351, -264, -125, 367, 520, 463, 193, 23, -172, -401, -599, -232, -130, 229, 206, 109, 320, -41, -80, -394, -463, -567, -374, 205, 362, 323, 265, -22, -161, -295, -438, -448, -86, -109, 50, 458, 132, 123, -56, 42, -407, -262, -28, -251, 156, 310, 274, 70, 62, -124, -607, -133, -467, -298, 286, 341, 250, 442, 243, -247, -385, -362, -344, -29, 264, 209, 303, 682, 354, -17, -447, -435, -245, -88, -2, 262, 403, 287, 484, -254, -414, -171, -181, -165, -260, 106, 368, 194, 208, 276, -259, -330, -353, 10, -70, 79, 411, 541, 398, -83, -160, -164, 51, 54, 78, 202, 88, 508, 251, 172, -62]
7235f2j89O0k22K68O29q6K21k37j73n17Q1qp9K60k6J79r4J28%j77lk70J11p2M45
7260A67k4J0L55l91k93l0j05L35j43K52j08l5K84j07k69K6l29j14O14k11P0K65
7282B19L12J4l87m2m43r5K28K71k9J09K37k54k5j67k81j3K03J76j96N35k2K57
7304F07n14o0m00K04k68M15rJ1K31k16K92k80j13j23k69L5L08J60K38R3P5l95
7326B2j43j46k3J11P1N28j9O3k40k54l6r8k15K8K58K51j56M01m07j39J16j52r9
7349b78O0M1K56J84J18J16m64l6k06k48J58O2N11l59M07o6o4P8n36r6J58OK09
7372A1j00M03k2J72k21l97n9k55L50jK13r6L42n1j4k40k20k30O4J86K33L66k82
7395A52J03j23m65L25m24J84J08J86K40L74l45m43J73l33K50k82L66j52K98j50
$$ y = [-62, -251, -191, -413, -145, 484, 398, 619, 382, 209, -308, -227, -235, -314, -54, -80, 99, 5, 133, 133, -44, -47, -317, -206, -278, 167, 143, 153, 508, 117, -176, -206, -311, 24, -119, 133, 25, -10, 274, 167, -102, -76, -405, -519, 95, -116, -46, 219, 531, 545, 158, 116, -327, -422, -194, 77, 48, 157, 394, 140, 115, -52, -333, -346, -143, 33, -163, 372, 350, 607, 93, 33, -367, -163, -431, -16, -25, -14, 217, 1, 293, 13, -100, -223, -492, -457, -149, 11, 249, 342, 417, 22, -121, -267, -290, -179, -108, 420, 401, 464, 224, -30, -66, -164, -379, -351, -93, 158, 2, 403, -4, -143, -27, -179, -278, -218, -177, 79, 263, 381, 497, 33, -3, -209, -457, -299, -237, 274, -85, 322, 256, 192, 270, -266, -362, -204, -198, 11, -89, 314, 292, 464, 243, -154, -213, -468, -118, -119, 94, -2, 340, 289, 275, 35, -185, -415, -351, -165, 68, 434, 152, 255, 132, -333, -8, -432, -248, -140, 46, 286, 660, 315, -128, 45, -288, -38, -320, 46, -106, 192, 42]
7415D2K46J56j41l07l08j48J83K21J32K20p5J9l37Q6j30j45L6J84J59PJ38J83
7437D21j93j64l08J1P0R1K21L7J87j49N3j95j17l37K29JQ7L23k00J23J12l25l0
7460e2j11J2J59k81N48Q3j10J0Jm9n02j99K38K28J64O2J39l68J03J26l55k00J08
7483b46J38L37k78M57j27j97r6q1l5k66K15K30K1K99j73k68P8l16K04j43k2N05
7505B36j05J80L40m24p5l84J4J85J05j67K25L39k12R6j93q1k48J36K8j87K63J83
7527B54J15l2j98k08k19J35k02L41O8J61K06k47J30m67J82l32k5j17M08K18M2
7548B13R3j26l87N7n09M93k54N01K58l24N07l96Pk08j28J0r6J46M37J1J38j1k41
7571A91k42j55J6Q5J14J26J48l3r5K5n38J32m6J71L48k24J31K09N3l08j62j0m43
$$ y = [42, 288, 444, 303, -4, -312, -460, -277, -56, 76, 296, 221, 240, -97, -11, -141, -286, -250, -66, 93, 100, 238, 421, 228, 64, -244, -233, -163, -72, 149, 186, 373, 224, 277, 82, -35, -372, -143, -142, -55, 268, 68, 191, 303, -22, -52, -163, -151, 8, -273, 275, 358, 248, 258, 259, 210, -292, -491, -253, -25, 139, 201, 340, -28, 75, 201, -154, -354, -246, -108, 229, -49, 408, 281, 84, -12, -93, -128, -394, -179, 51, 72, 371, 198, -70, 8, -308, -104, -247, -269, 236, 131, 311, 651, 227, 152, -232, -218, -33, 72, -95, 130, 469, 257, 353, 160, 79, -169, -33, -5, -192, 71, 254, 369, 337, 139, -69, -288, -153, -355, -14, 54, 215, 421, 174, 304, -163, 19, -313, -338, -455, -47, 171, 213, 306, 180, -207, -150, -659, -166, -420, 81, 339, 15, 522, 126, 133, -75, -203, -193, -289, -143, 294, 305, 443, 432, 191, -51, -206, -190, -105, 9, 135, 283, 250, 155, 180, -358, -226, -272, -101, 247, 23, 154, 363, 416, 108, -54, -64, -507]
7594e07L88k48M10k06M28K22k99l07J7l92J47R5M0K23L31N7m54K17l03m1j55L64
7616B7m1J64L15k76L6m45K76k86K1j46K37J51J60j4j24K35m45J43r9j59J94J79
7638A03Q4j22L72l29j71j21j2J40m1Q1R6K06pN5j96l24l4Q1K03j8l06O48m1l46
7662AM8k26j36q3L19j7L06j13J30j93K61l09l86K53j91L83J25k31L80J96n36r8
7684a17q3j35J0M08K54p4Kqk94K16m10K42r9k26K59K51R4r1oRl79k1J38n0J31
7709B1l19O76k7k4l15r3q7j49pL66j23M53j64j84K36n52J63o3P2j3P5l4M90J06
7733E04k54m78O4k9j23J71L00k18L52o1j21j12m7j75j79L40L9K22j39J45l7j09
7755E5k9m10K72k40J11L12PJ80q7j64j07Pj16J26l2L42J60j13r6J46m03k02N3
$$ y = [-507, -119, -367, 43, -163, 265, 487, 188, -119, -102, -494, -347, -252, -212, 11, 342, 399, -55, 162, -141, -182, -337, 27, -14, 150, 465, 189, 225, -220, 56, -230, -209, -355, -118, 33, 193, 179, 55, 290, -155, -12, -111, -270, -76, 103, 187, 65, 437, 108, -63, -184, -196, -56, -97, -16, 80, 286, 279, 334, 138, -186, -220, -139, 64, 46, -260, 388, 347, 1, 49, -177, -313, -396, -77, -94, 212, 99, 229, 36, 297, -12, -398, -145, -336, 47, 172, -59, 321, 517, -19, -117, -200, -335, -325, 83, 337, 263, 265, 257, -37, 179, -231, 11, -88, -314, -55, 196, 290, 199, 193, 202, -177, -198, -60, -110, 21, -298, 378, 351, 327, 12, -81, -168, -317, -324, 42, -81, 372, 208, 24, 260, -292, -129, -192, -120, -133, -58, -92, 398, 504, 250, -228, -164, -193, -316, -145, 155, -63, 289, 228, 107, -5, -52, -227, -406, -66, -27, 195, 56, 201, 164, 55, 26, -384, -112, -352, -241, 71, 78, 258, 171, 7, -100, -93, -209, -83, -115, 227, 387, 274, 178, 324, -79, -281, -228]
7778b28k1j01M04K25k66Q2j79K87m45P1j39L46J19R9j59O9J88l48kj37k76K4M16
7801B9K83J3M8j29l01O4m31K02r2K84qk2M81j82k70k20J79k79M55l30P1M06k51
7824@J71J26k51j81k79J51J66K40J37n5k06j25K60m05o7K10J16n5L07N5k31K09
7846B93j68l41K8o7J57L6J0J40P3L4M3j76n15m0L33L32K5k74M81j61j35o5k64
7869b21J22l86N19J77J02k14M35n14k43K27o0l57J85L18M4L15l30k6N8k16m41
7890e06Q5K57J23M41j29K3q9k60K5l76K54M2K16J24O5l9k95K15p9m31M2O4K72
7913D4J55j70M33j93k02l32k69O58l97J32K12m8K25J48m14j05M0n6J07q3K52j85
7935d8L75j72k05J15k41Q2j72J59R9Q9M3j0K21o4k12j98J13J92j39J68j68J75
$$ y = [-228, -249, -350, 54, 279, 13, 95, -84, 203, -242, -171, -310, 36, 155, 254, 95, 164, 352, 4, 2, -135, -411, -387, 29, 312, 325, 373, 244, -57, 7, -424, -222, -314, -30, -38, -60, 421, 239, -31, -251, -72, -351, 104, -226, -155, 251, 0, 171, 297, 46, -135, -414, -263, -97, 143, 280, 225, 19, -106, 154, -251, -318, -108, 8, -47, 260, 315, 84, 293, 125, -216, -188, -255, -98, -62, -52, 88, 161, 195, 238, 62, -453, -493, -160, 172, 197, -77, 404, 243, 108, 43, -221, -99, -485, 34, 211, 313, 99, 534, 20, -223, 4, -56, -413, -228, 90, 134, 449, 119, 93, 151, -65, -506, -421, -164, -41, 400, 271, 294, 205, -55, -30, -406, -152, -110, 106, 230, 295, 256, -39, 176, 97, -334, -292, -228, 44, 199, 29, 462, 269, 67, -265, -534, 124, -273, -141, 71, 23, 248, 396, -18, -123, -83, -139, -32, -115, 137, -48, 327, 155, -50, 65, -176, -94, -266, -107, -8, 81, 124, 114, 335, 271, 59, -139, -26, 166, 27, 195, 27, 202]
7957B02k2j38k8J09m07Q1J45RK63k8R0Rm03P6rj78K69j73L83k7J17j93j53k36
7981b42k20J45lJ99M07K66j66k53j16J1p4o48M38rK80K92k05j21K60j59k86k17
8003d21L62n0N5J12R5k53o8K11j04j00j63J40L54P6N5j96o1j88l8k60j6K44J76
8026c8J32K19k09j62j37M7L7j15K58J69k01K19j29j67P4l5k90L40k08q2J57J56
8048C5o9M74n27j02n6n5L18J4J05j04J41j18p5j84j29m8K74p6m3N09J54n23K05
8071A20k39M2n6n6l39Q08o8J29Q1j62k06k99L5L6n1L6K18L83m4l54J32l13j4R5
8095h6K66l19L92j12K0J29j63k09R0l20K04P2J27J60J6M6Rn97J39L6l56M58J03
8118A05J3L3J68j84k86N6k43kJ21K34M9L18q4j66j53K1l71L35KK0M0L67m58P1
$$ y = [202, 180, 42, 14, 123, -284, -203, -58, -49, 214, 186, 276, 285, -118, -42, -51, -229, 40, -133, 250, 223, 340, 147, -6, -242, -462, -317, -320, -121, 286, 552, 386, 133, 17, 28, -46, -694, -256, -265, 15, 307, 102, -19, 241, 82, -204, -421, -59, -109, -54, 58, 153, -100, -168, 43, -61, -161, -324, -184, 170, 246, 301, 105, 44, -144, -182, -442, -458, -214, -38, 94, 313, 104, -58, -195, -148, -111, -226, 32, 201, 0, 219, 90, -77, -3, -38, -328, 12, -196, -278, -121, 35, -34, 440, -87, -189, -245, -300, 18, 32, 137, 33, 174, 56, -19, -203, -332, -380, -106, -182, -225, 284, 438, -85, 120, -119, -77, -133, -189, -528, 280, 212, 341, 422, 260, 54, -245, -210, -174, -225, -189, 29, 412, 368, 14, 146, -167, -181, -86, 180, -139, 253, 141, 161, 290, 127, -82, 8, -312, -108, -36, 91, 251, 267, 313, 322, -275, -136, -100, -456, 2, 105, 118, 151, 319, 135, -151, -95, -338, -340, -219, 15, 64, 382, 298, 132, -21, 0, -371, -36, -34, -14, 26, 393, -65, 6]
8142Fj23j01O8L4j63O3L60K63k68J99j86l98J64j50O0J48j50M06m1J03j54k03
8164f3K31n76K72q5K94q5K4J81J04l18j63r5q1Q3L89Q2j59J53mr2l18P3J07J08
8188F2r2jL94
$$ y = [6, -117, -218, -150, -116, -279, -216, 144, 407, 139, 338, 152, -246, -82, -232, -172, -24, -174, 232, 191, 294, 140, -63, 168, -408, -136, -221, 73, -12, 12, 193, 297, -21, -184, -279, -360, -277, 112, 194, 35, 188, 184, 92, -226, -153, -46, 62, -30, -31, 363]
8191C63
$$ Imaginary data points
##PAGE= N=2
##DATA TABLE= (X++(I..I)), XYDATA
0@%%%%%%%%%%%qJ6j6J6j6K3l1L2m0M8n6P1q3R6j12J32j53J76k02K29k63L01l41
34a81L85m33M87n46O11o82P59q47R41j041J152j273J408j553J709j882K072k284
52a198K519k778L067l391L760m183M671n244N926o754P786r117J0907j3449J7377
67I899k4318M0231j46682k4679K25711l5997k9210Q8866R8247j23172j64585l9728
79a25417N0718m291J4980Q0614Q8431J7456o851m8688j12153r8855K4756N3661
91f5639j5006J7739J55543J17895q2144j39085N50K8557j01519j04887Q5630J69033
103F6667M0901n2268J2949L6478p1147j30342m8446L4172M3548N2738P4175M7438
115A06863L189r547m2019j03506q6428K1495P0241J7600Q503Q4509Q2606n0090
$$ y = [0, 0, 0, 0, 0, 0, 0, 0, 0, 0, 0, 0, -8, 8, -8, 8, -8, 15, -16, 16, -24, 24, -32, 39, -44, 52, -60, 72, -81, 95, -107, 122, -141, 160, -181, 204, -229, 258, -288, 323, -359, 400, -447, 494, -547, 605, -668, 740, -813, 896, -986, 1086, -1198, 1321, -1457, 1610, -1781, 1979, -2204, 2467, -2777, 3149, -3605, 4181, -4936, 5971, -7478, 9899, -14419, 25812, -120870, -145549, 80162, 44165, 14955, 103821, 202068, 78896, -85689, -125417, -74699, -78990, -64010, 16604, 105035, 122491, 115640, 66952, -45201, -144056, -119300, -65639, -80645, -62906, 92637, 210532, 128388, -10697, -10147, 18410, -83109, -187996, -102366, 66667, 107568, 55300, 68249, 104727, 33580, -96762, -145208, -111036, -67488, -14750, 59425, 106863, 110052, 100505, 58486, -45020, -131448, -109953, -39712, -22112, -13609, 70900, 153506, 103416]
127A03416j25323m9401J6931k6314m2351N4846J23699O4791j5961k4970k0808
138E8555n5052p5471m0690J1289M7437O5204N8073K0545j5491k6698m1984p0097
150f4380n5138J7563O8256N1695K9721M3228L0206l6581q5238o3713k0484k643
162h7508J0897M5275O8831M9639L773l0913m7221n0779m0006j2290K1126M9513
174a9663O1881M7710J0277k4145m3847n5032n2605k5320J4709M4335N4451M7686
186F0437K4365q716l6691n0294m6632k5845P721L8746N2946M6617K5842k986l4384
199E1126n4892n1910l1625m182K8282N2880N2604K9546O525j5354m3570n7192
211c7762l6317J589K4649L4154M4073M5206J5108k8745m9899m4511l4277k1703
$$ y = [103416, -21907, -71308, -54377, -80691, -123042, -68196, 55503, 120294, 104333, 79363, 58555, 3503, -71968, -112658, -101369, -53932, 11272, 69345, 89890, 74399, 47701, 5717, -64380, -119518, -101955, -33699, 17996, 47717, 90945, 121151, 84570, -668, -64381, -84865, -87508, -76611, -31336, 37495, 87134, 90907, 59994, 12773, -38006, -78012, -90302, -69176, -19663, 42218, 89928, 100205, 76060, 32213, -22819, -75424, -100744, -86035, -41700, 12751, 60437, 84802, 76086, 39395, -10899, -57531, -83376, -75655, -36909, 16037, 62654, 88496, 85510, 51126, -3766, -55676, -87301, -91483, -63201, -10321, 42283, 71829, 78354, 63000, 19430, -37762, -74079, -72490, -47841, -13687, 30386, 75592, 90700, 61955, 12056, -32455, -66732, -88435]
223h8435R326M4435N4781M0164J9437o910l5227m7503l8344k1510J104L1405N1830
236A4553M3289J4915q933k3387m2134n3756l3078R439L5396L8219M0456L8360
248G3339J2069k7828m7268m1826k7998j0181J5479M0177M5846L1600P594j8170
260E2833l9368m6138l4746j0605J3990L6395M9922M1980J4995j2104l0689m2946
272f481m3004k3410P497L2332M0630L6908K1982k581k9427m5012m0417k1781K698
285g0066K6370M4183M5583K9075J732k4112m0817m4149l2640q642J9491L9266
297a4726M2108K9734R961j5537l7407m4202l2578q953J6124L6254M4928L8100
309F3806J5505j3021l5718m4966l9454k0581O665L0593M3535L9248K1392m287
$$ y = [-88435, -79109, -34674, 20107, 60271, 79708, 72798, 37571, -9932, -48276, -69786, -68682, -37277, 14553, 57842, 72757, 63824, 40437, -1697, -55453, -88531, -79092, -43696, -5477, 34979, 73339, 85408, 57580, 10312, -31514, -59512, -69693, -54214, -14037, 31809, 63409, 71003, 52833, 13465, -32673, -67419, -78024, -64034, -27639, 22283, 64263, 79258, 67154, 36465, -6481, -49485, -72895, -65398, -33066, 7564, 44472, 66454, 63873, 34446, -10566, -50983, -72764, -70066, -43696, 487, 46070, 75145, 76877, 52765, 11948, -32201, -64841, -73483, -53992, -14726, 27382, 57116, 67077, 51540, 14133, -30069, -62647, -71600, -55476, -19222, 25706, 63806, 79311, 66290, 30572, -14394, -53848, -74429, -67764, -37171, 6364, 45612, 67004, 62717]
321F2717k8877m1187l8868k2396L196K8353M3383M2241K5173j38k5629m2828m5267
334d0127l0656m679K1444L9560M3200L3047R041j9442l8469m1362k9773j0518
346f8734J5217L8887M6578L3115Q683j4874l3602m6609m1883j7016J5235L4649
358c0354M1592L7683K2939n184l2570m4540l7559j8757N630K8244M1674M0237
370D9035K4116l026l1675m6221m0233k2789k483K0823M4474M9581K9024j649k1914
383D7063l3236m1229l5930q970K4424M1578L9619K7241R116j5093l9208m7356
395c1981l5825r543J8684L6789M2311L6139J8933q472l6966m7965l5116j2520
407f5532P426K6483M2786M2303J8365j1715l2140m0920l7399k2618L037K9835
$$ y = [62717, 33840, -7347, -46215, -68611, -65415, -37062, 6321, 48562, 73735, 73597, 47968, 5140, -40127, -70783, -75462, -54018, -14458, 28742, 61789, 70830, 51388, 12919, -28443, -58216, -68734, -53517, -14630, 31948, 65063, 73746, 58872, 25270, -21339, -63222, -80238, -65003, -30354, 11238, 48921, 71860, 66676, 34106, -10434, -47993, -66750, -61120, -32876, 8798, 49035, 73151, 70125, 38450, -7771, -48004, -70793, -73276, -52453, -7979, 41602, 70626, 68977, 47063, 13827, -27402, -63332, -72302, -47878, -6300, 33319, 60560, 69676, 54583, 15375, -31981, -67806, -77349, -58665, -21876, 20435, 56574, 75507, 67035, 30069, -17896, -53012, -65532, -58106, -31623, 11163, 53466, 71831, 60116, 27976, -12944, -50343, -72961, -69924, -40089]
419d0089M5273M3229K3882k851k5593l8813m1741k9486l136K5785M0393L7712
431C4565K6531N917k1680m1192m1083k6666p821J8076M1854M6505K8666N337j1613
444E7396l2095m7442l9692q709J8874K9702L5905L7198J8410j3639l5241l9721
456a9054l4418j6993J3052L3690L6349L4245K7353j635m0124m9689k5992j0784
468e4000j0524J1964N1830N4772J1736j8964j4581j9357m5187m0801L194L7360
480c2558L6209K9773K6589Q215j9954l6092l9846l5958j1496K8291M3303K3946
492B0422J5863K8049N958n1248o4003j3069J9014j533p62M9143O5522P587m1999
505C8944k9834j2200l0952l8111J044M1546M4688K8312J5576n523k6246k7401
$$ y = [-40089, 5184, 48413, 72295, 69444, 43851, 5038, -36703, -66189, -69325, -43540, -3147, 34565, 61096, 67013, 45333, 4141, -36942, -63608, -71429, -53353, -11499, 35006, 63672, 69009, 57396, 25301, -22141, -61833, -70542, -51668, -21966, 13939, 51137, 69547, 55908, 20667, -19054, -53472, -70465, -57413, -23723, 12626, 46871, 74224, 72589, 32465, -17224, -43216, -54000, -64524, -52560, -730, 54042, 65778, 46814, 32233, 12876, -32311, -73112, -69918, -32558, 3651, 33424, 60013, 68228, 48274, 12182, -27664, -63622, -75118, -46827, -3524, 20422, 36285, 64334, 70292, 19044, -44959, -58028, -39014, -40547, -41309, 7834, 73356, 80943, 38944, 9110, -3090, -34042, -72153, -71109, -29563, 15125, 43437, 59013, 53490, 27244, -157]
517a57k6548l4401j3245M1109N9538J6917q924J5533J3932m7576p6315j8624L7854
530d0907K0353n391L0193O1610J7338m4762m5778j5256j2778j9686L330L3225
542a8509M2274L2743R296k3231l8379k2645j3524k5940j4342L9916O7024K4608
554E9291k0351o244J2160k9197o8230k7846L7393L9273O722J3784L6376J5865
566F8996l2750n0748l0495p130M371J3927K4443L3739L3433J1419k8783m6824
578f402k4951k544j0315j0673L0000O0405K9086j9238k2716n640k0978m4072k4409
591g2447K3842M3823K8114J3067J3199L437k2758m0825l5773j2204J3907K6876
603a7742K4313K0636K2950Q144k7043m6301k8451k063M232O203K6966M4079K7505
$$ y = [-157, -26705, -61106, -74351, -33242, 26296, 43213, 34289, 49822, 63754, 16178, -60137, -78761, -40907, -20554, -25945, 4248, 65858, 83196, 38434, -7344, -22600, -35378, -55064, -51734, -18509, 23765, 56508, 65804, 42573, 4194, -18451, -31975, -57915, -72257, -32341, 34683, 59291, 38940, 32696, 44856, 15659, -52571, -80417, -43024, -3751, 2971, 16755, 53131, 68996, 36246, -14502, -44997, -52127, -47756, -33829, -9386, 24353, 57786, 69205, 40422, -6402, -31353, -33897, -44212, -54885, -24885, 35520, 64606, 45368, 22652, 17012, -3966, -48038, -72447, -48605, -4782, 23332, 36399, 49598, 53035, 30277, -10548, -46321, -58525, -44618, -17742, 6571, 27207, 50157, 58301, 31258, -15043, -43494, -45557, -41325, -35122, -8156, 35923, 63428]
616F3428r813k8274k3685k2228k5660j1982J7050L5873L3104J8799J668j2563
628C5717k3916l0463k8365j0055J6715L2221K9350K0282J0322m884k5360l8209
640a6645k8884p273J0831J9894K8941L0480J6314p029k4073l0946k7379j4296
652e0065L622J9899L1010L0849J7052k991k0400k9595l0215j9458q52J7364K9632
665d148L0516K0508M092j5769k9241l0217j9350n950J1490K8509L3343K2433M153
678E0369j1965k4654l1927k5955r186J0691K5906L1221K4951J0994o596k3079
690B0770l0536k7598j3862P130K3766K8722K4733J6789j374k2713l3221k7244
702c4638j3459J304J6623K8849L1577J9769j230j8859k6612k8138k0805l685J5805
$$ y = [63428, 53615, 25341, 1656, -20572, -46232, -58214, -41164, -5291, 27813, 46612, 48280, 35717, 11801, -18662, -47027, -57082, -40367, -8146, 21204, 41486, 51808, 46924, 21564, -16645, -45529, -52802, -41971, -22077, 6864, 37344, 53658, 46629, 22556, -8390, -35769, -50065, -46443, -26544, 4466, 35315, 52367, 49376, 28976, -619, -30834, -50292, -51144, -33780, -4148, 26368, 46876, 50968, 35199, 5958, -24259, -43609, -49559, -38069, -9560, 23783, 46216, 50369, 38404, 13750, -18177, -44132, -53318, -42627, -16721, 14500, 39451, 50445, 43849, 20770, -9766, -37364, -51226, -44096, -20330, 8392, 33125, 49914, 48540, 25827, -7394, -34638, -48097, -46793, -30170, -1321, 30256, 50025, 48795, 29936, 3324, -24814, -45619, -49304, -33499]
715c3499K8156K9589K0910L625j4246k5715k9767k3248p002J2859K6450K9761
727A7873K3223Q760q809k3910l1345k5298r423Q016K2182K9327K6396J1977o298
740D2671k1812k9753k6006j3776L981K0061K9883K7868J4600j649j7708k9019
752f59k9121j6642N19J6561K6714K8301J9446K465j6442k7793k7602j8467n021
765d7741J2427K7183L0364K0846M904j1998k4406k8390k2802r362R728K5483K9128
778A5364K2032Q559o729k1565k9050k5757j1028Q200K1750K6567K4375J4531l017
791D4232k1615k9216k5516j3068K544J6915K6616K7741J7093j418j8141k5884
803B83k5438j7401l011J5248K6954K8215J7653J931j2823k3795k8116k1812m543
$$ y = [-33499, -5343, 24246, 45156, 48781, 34535, 8820, -20947, -44195, -51197, -38338, -11888, 17873, 41096, 49856, 41047, 17137, -14208, -39506, -48929, -40913, -18731, 10596, 36992, 48969, 42671, 20859, -8894, -34900, -48676, -44695, -24634, 5249, 33117, 47717, 46068, 28360, -659, -29780, -46422, -45903, -29342, -2628, 25673, 45119, 47584, 31142, 3349, -24253, -42720, -47741, -35314, -8131, 22233, 43079, 47983, 35985, 11579, -16811, -39613, -48975, -39247, -13764, 15364, 37396, 45955, 39226, 17661, -11389, -37146, -48174, -39974, -18224, 8343, 32718, 47249, 44232, 22617, -6599, -32115, -45183, -42639, -25724, 892, 28633, 45726, 44308, 26167, 283, -25155, -42556, -45567, -30319, -3365, 24850, 42503, 44434, 31611, 7816, -20300, -42112, -46655]
816d6655J3309K3903K6678K1014P370r277k3316k8742k1083p531P963K0475K7696
829A1804K3946J0033p314k0934k6692k3582j1959L845J9540K7814K4650J1907
841D3058k688j6534k6062k6063j5280J718J7317K5358K4333J5958K432j4597k7016
854A934k6840j5703j264J1947K2921K6703K0665M079j3639k3392k4041j9196p926
867d3752Q712K3844K7510J9574O554p965j9983k5996k2634j0196P603K0630K5844
880I745K1650J0511l911j7362k6843k4317j2380N041J7243K3445K3451J5378l19
893D1332j7500k5754k3469j3939p90J3540K4028K5478J6685J450j3049k2864k5032
906a9884j7639l566J0953K1571K5360J9743N491j0833k1676k3532j8983q248O303
$$ y = [-46655, -33346, -9443, 17235, 38249, 45619, 36342, 13026, -15716, -36799, -44330, -36367, -15892, 11804, 35750, 45783, 38469, 17535, -9157, -32739, -44698, -40853, -21313, 6501, 31151, 43058, 40370, 23836, -2226, -28289, -43569, -41851, -24534, 824, 25157, 41115, 43547, 28950, 1934, -24906, -40609, -41873, -29926, -7005, 19698, 40363, 44442, 30803, 7411, -16630, -35826, -43752, -35040, -11196, 16314, 35888, 42442, 34477, 14494, -11502, -34136, -44332, -36729, -16099, 9745, 31395, 41906, 37995, 20633, -6210, -30527, -42907, -37866, -20623, 2822, 26273, 41651, 41332, 23832, -1922, -25391, -39330, -40120, -26580, -2552, 22926, 39611, 41061, 28012, 5148, -19884, -37523, -41089, -30136, -8565, 16795, 36538, 42029, 31196, 9520, -14012, -32995, -41243, -34940]
919c4940K1156K7147K0206O679o722j6953k3762k3585j1953O003K0411K3911J9559
932B7157J0997n46j4836k6220k5255j2214M807J6001J9921K1410J6981M084j6090
945B6197k7843k2763j0079p00O581J9259K9092K1586r68j7130j8430j7247j7922
958c0367j2313P583K6690K8299J3908O16m942j3020k3938k6569j0841J2372K3802
971h720J9687J2691J1454L881j6281l2343k4986k760R847R923J4737K4352K2194
984D3676j556k5048k5839j3035p470o669N196K5803L2537J4337q264j6188j2509
997D971j5403k2431j3017J5034L1325K2436N544J086J081j2981l0779k7371j277
1010d1782J8940J7546J1702J6093J7192J91k4949l1518j5636J519N012N497J8415
$$ y = [-34940, -13784, 13363, 33569, 40248, 33526, 16573, -7189, -30774, -42727, -36724, -16313, 7598, 27157, 38154, 37608, 22772, -3448, -28703, -40917, -36110, -20109, -188, 21222, 38203, 42287, 26197, -1646, -24409, -34488, -35188, -28607, -9348, 19744, 41330, 40362, 23232, 4802, -12445, -30367, -42680, -35097, -8407, 19892, 33800, 34416, 29474, 16454, -7484, -34053, -44894, -32522, -8720, 10967, 23658, 35112, 38993, 22712, -9631, -34617, -37377, -27530, -17607, -2870, 21482, 43676, 42120, 17072, -8767, -21802, -29272, -35941, -30745, -4942, 27595, 41932, 33668, 17480, 4971, -10432, -32863, -45880, -30846, 479, 22915, 28459, 29545, 30626, 17645, -13134, -40505, -41782, -22842, -5296, 6406, 22499, 39691, 39882, 14933, -16585, -32221, -30702, -25690, -20193, -1778]
1023a778K9369J8257j0814k5882j7590q827j2230j0205J0966L2831K7487L750
1035C5334q686p430j0906k3375k4347k695K0897K4770J4802Q040O712k023k0416
1048A0677l0286j8592L095J4945J3528J3376J9944J5465p685k7942k4264q561
1060b6300k067j844J0012K7142K6147N897j2467j6614j3898j6443j5336j499J8666
1073a8604K6903J8220N238k724q568j7611k3772j7309K215J8741J9755J4400J1565
$$ y = [-1778, 27591, 45848, 35034, 9152, -8438, -17265, -29495, -39700, -28734, 4097, 31584, 35334, 26648, 19218, 8312, -15063, -39410, -42105, -21208, 3562, 18364, 26404, 33116, 31093, 10677, -19609, -38201, -35106, -20161, -6633, 6743, 26687, 42152, 34467, 6525, -17739, -26300, -28367, -30211, -20199, 6943, 33090, 38987, 26520, 9906, -3992, -20435, -35771, -37270, -18604, 8299, 26519, 31757, 29033, 20465, 2854, -20918, -38227, -36012, -17271, 2484, 16884, 28449]
$$ [...]
8191A79
##END NTUPLES=NMR FID
##END=
