##TITLE=1H_DE-125H_oil
 200.13MHz,D2O.
 8 sc
 
 9.2.2026
##JCAMPDX= 6.0         $$ Bruker NMR JCAMP-DX V2.0
##DATA TYPE= NMR FID
##DATA CLASS= NTUPLES
##ORIGIN= UXNMR, Bruker Analytische Messtechnik GmbH
##OWNER= pz
$$ XWIN-NMR		Version 3.5
$$ Mon Feb  9 14:13:45 2026 Russian Standard Time (UT+4h)  she@DPX200
##.OBSERVE FREQUENCY= 200.1313
##.OBSERVE NUCLEUS= ^1H
##.DELAY= (6, 6)
##.ACQUISITION MODE= SIMULTANEOUS
##.ACQUISITION SCHEME= undefined
##.AVERAGES= 8
##.DIGITISER RES= 18
##SPECTROMETER/DATA SYSTEM= spect
##.PULSE SEQUENCE= zg30
##.SOLVENT NAME= D2O
##.SHIFT REFERENCE= (INTERNAL, D2O, 0, 14.3821)
##AUDIT TRAIL= $$ (NUMBER, WHEN, WHO, WHERE, WHAT)
$$ ##TITLE= Audit trail, XWIN-NMR		Version 3.5
$$ ##JCAMPDX= 5.01
$$ ##ORIGIN= Bruker BioSpin GmbH
$$ ##OWNER= she
$$ F:/spectra/data/she/nmr/H-C/1/audita.txt
$$ ##AUDIT TRAIL=  $$ (NUMBER, WHEN, WHO, WHERE, WHAT)
(   1,<2026-02-09 14:11:28.90 +0400>,<she>,<DPX200>,
      <created by zg, POWCHK disabled, PULCHK disabled
       configuration hash MD5:
       00 E9 B6 7A A2 85 ED C7 34 08 36 98 17 FE 4E 26
       data hash MD5: 16K
       A0 4E 6E 84 79 44 3F B4 9D FC FF C0 1A CE 3A CD>)
$$ ##END=
$$ 
$$ hash MD5
$$ F6 26 25 22 90 E7 1D D9 61 83 5A DF B3 81 31 B1
##$RELAX= 
##$RELAX= 
##$RELAX= 
##$RELAX= 
##$RELAX= 
##$RELAX= 
$$ Bruker specific parameters
$$ --------------------------
##$DU= <F:/spectra>
##$EXPNO= 1
##$NAME= <H-C>
##$PROCNO= 1
##$TYPE= <nmr>
##$USER= <she>
##$AMP= (0..31)
100 100 100 100 100 100 100 100 100 100 100 100 100 100 100 100 100 100 
100 100 100 100 100 100 100 100 100 100 100 100 100 100 
##$AQSEQ= 0
##$AQ_mod= 1
##$AUNM= <au_zg>
##$AUTOPOS= <>
##$BF1= 200.13
##$BF2= 200.13
##$BF3= 200.13
##$BF4= 200.13
##$BF5= 200.13
##$BF6= 200.13
##$BF7= 200.13
##$BF8= 200.13
##$BYTORDA= 1
##$CFDGTYP= 0
##$CFRGTYP= 5
##$CHEMSTR= <none>
##$CNST= (0..31)
1 1 145 1 1 1 1 1 1 1 1 1 1 1 1 1 1 1 1 1 1 1 1 1 1 1 1 1 1 1 1 1 
##$CPDPRG= <>
##$CPDPRG1= <>
##$CPDPRG2= <>
##$CPDPRG3= <>
##$CPDPRG4= <mlev>
##$CPDPRG5= <mlev>
##$CPDPRG6= <mlev>
##$CPDPRG7= <mlev>
##$CPDPRG8= <mlev>
##$CPDPRGB= <>
##$CPDPRGT= <>
##$D= (0..31)
0 0.7 0 0 0 0 0 0 0 0 0 0.03 0 0 0 0 0 0 0 0 0 0 0 0 0 0 0 0 0 0 0 0 
##$DATE= 1770631888
##$DBL= (0..7)
120 120 120 120 120 120 120 120 
##$DBP= (0..7)
150 150 150 150 150 150 150 150 
##$DBP07= 0
##$DBPNAM0= <>
##$DBPNAM1= <>
##$DBPNAM2= <>
##$DBPNAM3= <>
##$DBPNAM4= <>
##$DBPNAM5= <>
##$DBPNAM6= <>
##$DBPNAM7= <>
##$DBPOAL= (0..7)
0.5 0.5 0.5 0.5 0.5 0.5 0.5 0.5 
##$DBPOFFS= (0..7)
0 0 0 0 0 0 0 0 
##$DE= 6
##$DECBNUC= <off>
##$DECIM= 32
##$DECNUC= <off>
##$DECSTAT= 4
##$DIGMOD= 1
##$DIGTYP= 9
##$DL= (0..7)
0 120 120 120 120 120 120 120 
##$DP= (0..7)
150 150 150 150 150 150 150 150 
##$DP07= 0
##$DPNAME0= <>
##$DPNAME1= <>
##$DPNAME2= <>
##$DPNAME3= <>
##$DPNAME4= <>
##$DPNAME5= <>
##$DPNAME6= <>
##$DPNAME7= <>
##$DPOAL= (0..7)
0.5 0.5 0.5 0.5 0.5 0.5 0.5 0.5 
##$DPOFFS= (0..7)
0 0 0 0 0 0 0 0 
##$DQDMODE= 0
##$DR= 18
##$DS= 0
##$DSLIST= <SSSSSSSSSSSSSSS>
##$DSPFIRM= 0
$$ [...]
##$SUBNAM0= <"">
##$SUBNAM1= <"">
##$SUBNAM2= <"">
##$SUBNAM3= <"">
##$SUBNAM4= <"">
##$SUBNAM5= <"">
##$SUBNAM6= <"">
##$SUBNAM7= <"">
##$SUBNAM8= <"">
##$SUBNAM9= <"">
##$SW= 18.0517328524113
##$SWIBOX= (0..15)
0 0 2 0 0 0 0 0 0 0 0 0 0 0 0 0 
##$SW_h= 3612.71676300578
##$TD= 16384
##$TD0= 1
##$TE= 0
##$TE2= 300
##$TE3= 300
##$TEG= 300
##$TL= (0..7)
0 120 120 120 120 120 120 120 
##$TP= (0..7)
150 150 150 150 150 150 150 150 
##$TP07= 0
##$TPNAME0= <>
##$TPNAME1= <>
##$TPNAME2= <>
##$TPNAME3= <>
##$TPNAME4= <>
##$TPNAME5= <>
##$TPNAME6= <>
##$TPNAME7= <>
##$TPOAL= (0..7)
0.5 0.5 0.5 0.5 0.5 0.5 0.5 0.5 
##$TPOFFS= (0..7)
0 0 0 0 0 0 0 0 
##$TUNHIN= 0
##$TUNHOUT= 0
##$TUNXOUT= 0
##$USERA1= <user>
##$USERA2= <user>
##$USERA3= <user>
##$USERA4= <user>
##$USERA5= <user>
##$V9= 5
##$VALIST= <valist>
##$VCLIST= <CCCCCCCCCCCCCCC>
##$VD= 0
##$VDLIST= <DDDDDDDDDDDDDDD>
##$VPLIST= <PPPPPPPPPPPPPPP>
##$VTLIST= <TTTTTTTTTTTTTTT>
##$WBST= 1024
##$WBSW= 4
##$XGAIN= (0..3)
0 0 0 0 
##$XL= 0
##$YL= 0
##$YMAX_a= 155104
##$YMIN_a= -151531
##$ZGOPTNS= <>
##$ZL1= 120
##$ZL2= 120
##$ZL3= 120
##$ZL4= 120
##$ABSF1= 10
##$ABSF2= 0
##$ABSG= 5
##$ABSL= 3
##$ALPHA= 0
##$AQORDER= 0
##$ASSFAC= 0
##$ASSFACI= 0
##$ASSFACX= 0
##$ASSWID= 0
##$AUNMP= <proc_1d>
##$AZFE= 0.1
##$AZFW= 0.1
##$BCFW= 1
##$BC_mod= 2
##$BYTORDP= 1
##$COROFFS= 0
##$CY= -3
##$DATMOD= 1
##$DC= 2
##$DFILT= <>
##$DTYPP= 0
##$F1P= 0
##$F2P= 0
##$FCOR= 0.5
##$FTSIZE= 0
##$FT_mod= 4
##$GAMMA= 1
##$GB= 0.15
##$INTBC= 1
##$INTSCL= 1
##$ISEN= 128
##$LB= 0.25
##$LEV0= 0
##$LPBIN= 0
##$MAXI= 10000
##$MC2= 0
##$MEAN= 0
##$ME_mod= 0
##$MI= 1.114404
##$NCOEF= 0
##$NC_proc= 0
##$NLEV= 6
##$NOISF1= 3.799351
##$NOISF2= 2.8
##$NSP= 1
##$NTH_PI= 0
##$NZP= 0
##$OFFSET= 14.38212
##$PC= 1
##$PHC0= -3707.362
##$PHC1= 14.19231
##$PH_mod= 1
##$PKNL= yes
##$PPARMOD= 0
##$PSCAL= 0
##$PSIGN= 0
##$REVERSE= no
##$SF= 200.129724274929
##$SI= 16384
##$SIGF1= 3
##$SIGF2= 2
##$SINO= 400
##$SIOLD= 16384
##$SREGLST= <1H.CDCl3>
##$SSB= 0
##$STSI= 0
##$STSR= 0
##$SW_p= 3205.1282051282
##$SYMM= 0
##$S_DEV= 0
##$TDeff= 0
##$TDoff= 0
##$TI= <>
##$TILT= no
##$TM1= 0
##$TM2= 0
##$TOPLEV= 0
##$USERP1= <user>
##$USERP2= <user>
##$USERP3= <user>
##$USERP4= <user>
##$USERP5= <user>
##$WDW= 1
##$XDIM= 8192
##$YMAX_p= 0
##$YMIN_p= 0
$$ End of Bruker specific parameters
$$ ---------------------------------
##NTUPLES= NMR FID
##VAR_NAME=  TIME,          FID/REAL,        FID/IMAG
##SYMBOL=    X,             R,               I
##VAR_TYPE=  INDEPENDENT,   DEPENDENT,       DEPENDENT
##VAR_FORM=  AFFN,          ASDF,            ASDF
##VAR_DIM=   8192,          8192,            8192
##UNITS=     SECONDS,       ARBITRARY UNITS, ARBITRARY UNITS
##FACTOR=    0.0002768,     1,               1
##FIRST=     0,             0,               0
##LAST=      2.2672688,     0,               0
##MIN=       0,             -151531,         0
##MAX=       2.2672688,     155104,          0
$$ Real data points
##PAGE= N=1
##DATA TABLE= (X++(R..R)), XYDATA
0 0 0 0 0 0 0 0 0 0 0 0 0 0 0 0 0 0 0 0 0 0 0 0 2 -8 8 -8 8 -8 8 -8 12 -13 16 -16 19 -21 24 -27 29 -33 37 -40 45 -48
44 -48 55 -59 65 -73 80 -87 96 -106 118 -129 144 -161 179 -201 229 -261 300 -350 417 -510 645
65 645 -864 1246 -2080 4622 -28364 -151531 -120386 -50244 -63220 -53240 64650 155104 114966
78 114966 33306 -1062 -37126 -102899 -125883 -69868 2816 53963 100718 123187 79742 1390
90 1390 -50173 -82936 -117104 -102612 -19334 58270 81616 91010 96440 45398 -50078 -101236 -88074
103 -88074 -67435 -47269 16283 99599 122028 72887 20295 -11195 -58732 -114365 -111811 -41754
115 -41754 30912 67940 86368 89710 57674 -5282 -66990 -100006 -91043 -43445 12628 54347
127 54347 84398 97950 68051 -4093 -70186 -91281 -81257 -61719 -21505 45558 98305 95372
139 95372 53036 10267 -30022 -77365 -100433 -68891 -6682 43332 72622 88109 75625 23978
151 23978 -41442 -81891 -87543 -69138 -31851 21614 72774 93805 75187 30054 -21297 -63786
163 -63786 -83863 -74184 -37401 16520 67025 89189 72460 33503 -9934 -54693 -89089 -87379
175 -87379 -43539 13709 54257 75310 79846 55168 355 -54361 -78867 -71881 -47300 -7914
187 -7914 42723 80801 81900 49032 4145 -39624 -73685 -83430 -58848 -11164 37496 71221 78817
200 78817 59008 18870 -28355 -66370 -79290 -59667 -18045 27667 61814 75914 63258 24177
212 24177 -25656 -63842 -75826 -62463 -29875 15351 58358 78496 65974 30935 -11638 -50347
224 -50347 -72429 -67078 -34778 10492 49931 69480 64384 37176 -4463 -46976 -71978 -68514 -39480
237 -39480 500 40649 67761 70161 45327 3570 -36753 -62709 -66617 -46650 -8392 33406
249 33406 61285 66034 47365 10538 -30751 -60075 -66904 -50572 -15528 26427 57666 66108 52321
262 52321 20900 -18985 -53341 -66333 -52626 -21626 15529 48135 64878 54942 22999 -15144
274 -15144 -46165 -62304 -57677 -29211 11041 44713 60797 57538 34193 -4274 -40943 -59669
286 -59669 -55910 -34483 -115 36042 58209 56749 35032 1965 -32924 -56711 -59347 -38945 -4832
299 -4832 29631 54210 60182 42435 9427 -25575 -50989 -58032 -44085 -12987 22199 48098 56842
312 56842 44860 15270 -19837 -46841 -56972 -46446 -19122 16399 45834 57007 47836 22931
324 22931 -10925 -41716 -56033 -48970 -25050 6828 37285 54497 50223 26229 -5909 -34757
336 -34757 -52491 -51587 -29864 3513 33826 51211 51859 34337 2160 -30513 -50422 -51077 -35347
349 -35347 -6686 26370 48596 51140 34842 7643 -22581 -46432 -52784 -37711 -9130 21082
361 21082 44376 52737 41586 13615 -18526 -42175 -51069 -42320 -17801 13919 40255 49975 41299
374 41299 19130 -10456 -37814 -51003 -43558 -19904 9400 35086 49303 45756 24368 -6107
386 -6107 -33707 -48055 -45592 -27175 1689 29868 46806 45708 27821 -157 -27399 -44944 -45741
399 -45741 -29924 -2624 26092 44741 45886 31236 6468 -22028 -43604 -47769 -33298 -7725
411 -7725 18772 39507 46796 35818 10463 -18333 -38372 -44240 -35771 -14305 14821 38395 45941
424 45941 36494 15017 -11520 -34599 -45588 -39212 -18044 9470 33321 43478 37818 20212 -5131
437 -5131 -30278 -44555 -39197 -19471 4508 26458 41960 42520 23999 -4087 -27289 -38435 -39338
450 -39338 -27741 -2632 25223 40594 38729 25449 5152 -19570 -38682 -41951 -27509 -4195
462 -4195 19016 36094 40324 29757 8081 -16641 -35972 -41092 -30325 -9063 13233 31749 40761
475 40761 34139 11306 -14297 -30312 -36215 -33000 -17134 10090 33139 38844 30174 16169 -4114
488 -4114 -27969 -41512 -35172 -15534 6072 23890 35987 36217 20800 -3362 -24431 -35439 -33920
501 -33920 -20886 -379 20872 35582 37213 22770 -583 -20285 -31366 -34867 -27568 -5408 20848
514 20848 34638 32475 23810 9542 -13281 -34199 -37770 -23733 -5072 11394 26987 37074 30039
527 30039 8055 -13700 -26972 -33174 -29805 -13131 9408 27302 34887 30010 13727 -7720 -24645
540 -24645 -32316 -30329 -16909 5279 25751 33277 27755 16091 -178 -21023 -36150 -32409 -14778
553 -14778 2279 16124 30043 35339 21626 -2402 -19305 -27228 -30239 -24277 -4879 18723 31664
566 31664 29894 20148 5922 -13194 -29517 -33662 -22524 -5087 12556 26438 31611 24496 8874
579 8874 -10130 -26664 -32732 -24360 -8448 7588 22616 31978 28308 10821 -9715 -23394 -28129
592 -28129 -26594 -15702 5086 24626 30979 25085 13831 -1352 -19540 -31461 -28270 -14059 2519
605 2519 17292 27998 29106 17650 -668 -18047 -27722 -28133 -18378 -1917 15866 27409 29103
618 29103 19925 2665 -14886 -25483 -27616 -21561 -6553 13520 26747 27046 19336 7557 -8876
631 -8876 -24945 -30395 -21307 -5958 8386 21138 28173 24841 9311 -9259 -21915 -26714 -23347
644 -23347 -11559 6068 21371 27108 23281 11312 -4117 -18904 -26588 -24754 -13679 2830 18335
657 18335 26295 24350 14406 -151 -15477 -26107 -25687 -14416 148 13782 23737 26013 17345 1275
671 1275 -14268 -23294 -24616 -17953 -4078 12732 23953 24573 17570 5186 -9777 -22208 -25436 -18773
685 -18773 -5863 8920 20562 25164 20183 7274 -8007 -20166 -24537 -20250 -8438 6177 18577
698 18577 24334 21696 9959 -5397 -17546 -23124 -21446 -11830 3020 16990 23948 21051 11720 -1381
712 -1381 -14935 -23327 -22615 -12801 683 13712 21992 22761 14421 435 -12644 -21223 -22160 -15311 -2355
727 -2355 11602 20629 22074 15734 3773 -9958 -19980 -22365 -16490 -4666 8704 19148 22179
740 22179 17297 6126 -7324 -18088 -22217 -18047 -6823 6235 16757 21948 18671 8143 -5075
753 -5075 -16220 -21392 -18768 -9284 3488 15091 21163 19332 10453 -2249 -13966 -20389 -19548 -11421
767 -11421 1087 12739 19961 19599 12231 337 -11739 -19476 -19692 -12809 -1539 10540 19066 19988
781 19988 13718 2428 -9087 -17615 -20138 -14662 -3559 8310 17223 19644 15170 5048 -7019
794 -7019 -16530 -19793 -15565 -6086 5816 15927 19543 15851 6442 -4920 -14560 -19212 -16631 -7810
808 -7810 3587 13509 18698 17207 9102 -2441 -13057 -18362 -17241 -9965 1316 11903 18111 17459
822 17459 10685 -176 -11106 -17732 -17677 -11423 -695 9822 16696 17582 12090 1946 -8588 -16082
836 -16082 -17796 -12503 -2857 7590 15566 17519 13462 4056 -6378 -14913 -17490 -13751 -5070 5197
850 5197 13776 17585 14292 5765 -4523 -13208 -17196 -14683 -7101 3922 12564 16682 14933 7730 -2532
865 -2532 -11858 -16687 -15088 -8268 1045 10636 16067 15580 9130 -683 -9980 -15364 -15534 -9952 -416 9221
881 9221 15034 15438 10329 1272 -8120 -14609 -15870 -10872 -2246 7221 13960 15466 11429 3668 -6116
896 -6116 -13698 -15654 -11567 -3768 4934 12446 15767 12583 4699 -4603 -11863 -15106 -12993 -5936 3623
911 3623 11387 14795 13170 6427 -2257 -10621 -14745 -13481 -7198 1697 9828 14224 13724 7999 -739
926 -739 -9471 -14112 -13413 -8078 -309 7785 13940 14340 8633 484 -7092 -12621 -14061 -10233 -1688 7090
942 7090 12495 13266 10246 2991 -5546 -12157 -14003 -10686 -3108 4798 11484 13848 10904 4448 -4403
957 -4403 -11117 -13477 -11078 -4823 3068 10005 13587 11789 5084 -2774 -9079 -13106 -12200 -6686 2024
972 2024 8891 12259 11704 7154 -565 -8373 -12901 -11930 -6723 -316 7056 12129 12634 7825 169 -6551
988 -6551 -11207 -12259 -8558 -1332 5960 11396 12044 8604 1783 -4930 -10368 -12107 -9424 -2781 5013
1003 5013 9944 11638 9335 4056 -3692 -10145 -12096 -9334 -3983 2665 9101 12251 10182 4322 -2561
1018 -2561 -8216 -11236 -10478 -5340 1959 8042 11003 10269 5925 -635 -7369 -11132 -10619 -6363 120 7062
1034 7062 10729 10217 6810 903 -6191 -10699 -10342 -6932 -1419 4816 10079 11254 7492 1321 -4581
1049 -4581 -9035 -10939 -8255 -2079 4722 9007 10103 8679 3551 -3710 -9142 -10409 -8503 -3460 2824
1064 2824 8157 10212 8627 4233 -2266 -7827 -10189 -8906 -4651 1208 6932 10268 9414 4996 -1367
1079 -1367 -6178 -9202 -9911 -6096 757 6290 8952 9180 6609 622 -6046 -9384 -9232 -6084 -1200 4854
1095 4854 8892 9922 6668 1508 -4214 -8499 -9717 -7386 -1969 3510 8081 9362 7857 2377 -2951
1110 -2951 -7369 -9487 -7877 -3129 3032 7125 8770 7558 3988 -1876 -6788 -9188 -7685 -4006 1195
1125 1195 6423 9297 8519 4241 -702 -5734 -8457 -8669 -5050 623 5554 8339 8347 5387 190 -4723
1141 -4723 -8321 -8770 -5398 -984 4445 7799 8472 6084 1575 -3788 -7904 -8322 -6313 -1940 2956 7375
1157 7375 8829 6358 1996 -2924 -6843 -8586 -7109 -2660 2563 6643 8151 7090 3235 -1698 -6059
1172 -6059 -7894 -6857 -3623 1205 5784 8373 7296 4163 -918 -5428 -7784 -7549 -4147 376 4800
1187 4800 7546 7912 4523 72 -4170 -7267 -7654 -4811 -635 4094 7159 7518 5150 1238 -3468 -6900
1203 -6900 -7665 -5496 -1956 2798 6434 7747 5676 2098 -2467 -6188 -7472 -6221 -2380 2113 5714
1218 5714 7254 6390 2851 -1724 -5436 -7272 -6620 -3386 1060 5289 7012 6522 3493 -633 -4779 -6883
1234 -6883 -6768 -4042 -42 4498 6760 6790 4367 208 -3577 -6680 -6694 -4752 -660 3384 6252 6607
1250 6607 4768 1087 -3159 -6112 -6641 -4939 -1664 2622 5637 6865 5330 1811 -2207 -5546 -6552
1265 -6552 -5456 -1934 1885 5305 6547 5778 2569 -1768 -4813 -6636 -5712 -3044 980 4659 6818
1280 6818 5964 3501 -487 -4082 -6274 -6099 -3543 105 3891 5988 6132 3885 352 -3147 -5715 -6049
1296 -6049 -4253 -572 3018 5646 6098 4476 951 -2860 -5590 -6133 -4589 -1267 2179 4987 6338
1311 6338 4869 1891 -1954 -4720 -5901 -4921 -1959 1534 4489 5965 4753 2204 -1425 -4170 -5949
1326 -5949 -5340 -2486 621 4061 5590 5527 3034 -520 -3596 -5364 -5511 -3452 243 3584 5301 5541
1342 5541 3448 470 -3320 -5165 -5632 -4041 -403 2575 4873 5489 4018 873 -2580 -4699 -5770
1357 -5770 -4006 -1183 1683 4554 5411 4060 1283 -1558 -4097 -5520 -4599 -1908 1685 4002 5325
1372 5325 4194 2095 -990 -3840 -5136 -4783 -2034 833 3514 5092 4607 2596 -393 -3172 -4979
1387 -4979 -4454 -2582 108 3146 4696 4883 3128 303 -2457 -4359 -4726 -3161 -475 2146 4360 4821
1403 4821 3465 754 -2170 -4327 -5003 -3591 -929 1571 3990 4790 3606 1389 -1505 -3902 -4921
1418 -4921 -4049 -1780 905 3616 4424 3930 1855 -937 -3123 -4375 -4157 -2097 905 3003 4386 4227
1434 4227 2583 -110 -2873 -4341 -4102 -2619 95 2630 4276 4296 2833 114 -2278 -4114 -4270 -3140
1450 -3140 -522 2122 3974 4306 3198 884 -1703 -3739 -4682 -3368 -1215 1426 3628 4477 3208 1359
1466 1359 -1296 -3531 -3992 -3391 -1575 1106 3317 4173 3821 1777 -590 -2789 -4142 -3646 -1856 277
1482 277 2890 3988 3536 2137 -143 -2322 -3739 -3938 -2265 94 2083 3313 3927 2873 245 -1914
1498 -1914 -3835 -3789 -2750 -850 1600 3328 3750 2765 736 -1532 -3269 -3941 -3199 -912 957 3028
1514 3028 3855 3197 1155 -1083 -2886 -3809 -3084 -1411 886 2812 3769 3294 1630 -750 -2821 -3544 -3245
1531 -3245 -1831 390 2597 3545 3330 2162 -184 -2087 -3474 -3781 -2167 -20 1544 3192 3688 2177
1547 2177 167 -1731 -3185 -3586 -2453 -523 1467 3132 3448 2452 860 -1179 -2632 -3607 -2800 -930
1563 -930 1057 2599 3356 2871 1142 -711 -2391 -3418 -2797 -1216 700 2481 3173 3013 1513 -477
1579 -477 -2452 -3168 -3087 -1898 238 2052 2958 2972 1947 177 -1956 -3043 -3001 -1894 -557 1390 3041
1596 3041 3061 2365 478 -1683 -3074 -3188 -2148 -774 1385 2912 3108 2658 873 -1125 -2327 -3184 -2388
1613 -2388 -838 905 2558 3169 2579 1267 -752 -2182 -2966 -2721 -1309 305 2059 3127 2900 1630
1629 1630 -197 -1967 -3149 -2840 -1414 81 1891 2931 2832 1805 -76 -1473 -2812 -2766 -2029 -473
1645 -473 1502 2399 3041 2178 639 -1339 -2355 -2772 -1877 -753 1235 2316 2729 2200 496 -913 -2519
1662 -2519 -2781 -2499 -884 480 2060 2673 2142 1033 -378 -1836 -2858 -2260 -1025 449 2096 2719
1678 2719 2621 1328 -539 -1502 -2494 -2386 -1560 -20 1397 2410 2885 1620 116 -1537 -2460 -2668 -2051
1695 -2051 -258 1324 2460 2717 2122 809 -963 -2499 -2522 -1914 -585 811 2272 2636 2135 1003 -493
1712 -493 -2045 -2615 -2315 -761 718 1716 2450 2262 1270 -233 -2150 -2483 -2424 -1254 282 1671 2289 2152
1730 2152 1045 -220 -1454 -2341 -2109 -1460 163 1216 2361 2308 1666 8 -1187 -2415 -2385 -1474 -229
1747 -229 1004 2244 2440 1725 906 -1150 -2175 -2464 -2050 -662 712 1730 2461 1838 717 -689 -1950
1764 -1950 -2455 -2182 -1191 297 1660 2359 1980 714 -524 -1719 -2354 -2221 -1183 198 1358 2136 2067
1781 2067 1037 194 -1362 -2097 -1973 -1265 -258 1056 2263 2142 1392 263 -925 -1919 -2190 -1478 -218
1798 -218 796 1867 2231 1609 431 -632 -1789 -2247 -1554 -549 812 1585 1985 1605 1165 -613 -1645
1815 -1645 -2020 -1666 -583 318 1390 1933 1646 922 -241 -1250 -1915 -2371 -1078 282 1488 2072 2026 1304
1833 1304 -72 -1105 -1895 -1900 -1103 -151 1109 1618 1960 1410 60 -1086 -1796 -1972 -1530 -456 687 1758
1851 1758 2150 1426 362 -793 -1582 -2246 -1602 -635 810 1650 2090 1607 874 -372 -1397 -1872 -1504 -767
1869 -767 210 1467 1713 1941 976 -262 -1397 -1882 -1734 -1041 117 1173 1858 1730 943 147 -1270 -1750
1887 -1750 -1687 -1223 -154 1186 1554 1741 1033 135 -982 -1671 -1922 -1274 -123 685 1630 2086 1338 567 -613
1906 -613 -1376 -1817 -1681 -276 610 1374 1984 1655 550 -271 -1131 -1832 -1511 -703 380 1262 1734 1739 924 -252
1926 -252 -1148 -1989 -1996 -1093 -44 1117 1763 1388 1160 98 -900 -1858 -1745 -1013 -127 917 1591 1947 1054
1945 1054 382 -862 -1782 -1703 -1165 -265 763 1491 1626 1421 288 -641 -1424 -1634 -1255 -671 253 1248 1538
1964 1538 1374 963 -658 -1324 -1721 -1807 -990 540 1195 1808 1446 929 78 -1116 -1516 -1460 -846 -50 945
1983 945 1451 1615 882 233 -934 -1394 -1516 -973 -141 882 1238 1481 1283 191 -625 -1687 -1489 -1223 -365
2002 -365 547 1284 1490 1104 677 -376 -1330 -1868 -1021 -433 562 1122 1427 1526 483 -260 -946 -1491 -1472 -765
2022 -765 13 1419 1425 1275 984 -315 -1100 -1358 -1493 -835 -104 854 1285 1722 1072 154 -468 -1282 -1614 -1102
2042 -1102 -186 586 1566 1713 1097 306 -586 -1237 -1371 -1100 -619 690 1300 1543 1289 473 -234 -1304 -1565
2061 -1565 -1104 -320 89 1038 1328 1271 583 -245 -1113 -1201 -1312 -410 310 937 1622 1378 641 140 -832 -1201
2081 -1201 -1106 -1257 -255 938 1415 1166 1247 -10 -831 -1459 -1265 -1069 -236 635 1365 1347 941 -84 -863
2100 -863 -1064 -1450 -988 -430 295 937 1597 1060 513 -558 -960 -1252 -1245 -535 287 888 1417 1070 252 -56
2120 -56 -1073 -1335 -1224 -646 -48 858 1321 1437 760 124 -657 -1246 -1223 -984 -107 1127 1239 1093 1083 288
2140 288 -497 -1025 -1449 -1000 -106 543 1315 1244 1189 444 -399 -1004 -1322 -1205 -444 367 713 1469 1207 571 -417
2161 -417 -1196 -1168 -1086 -492 236 731 1311 1227 469 -86 -895 -1164 -1145 -942 192 655 1306 1097 843 1 -741
2182 -741 -1133 -1259 -730 -33 581 1244 1258 799 425 -722 -993 -1424 -998 -53 559 1098 1189 883 51 -577
2202 -577 -907 -1160 -925 -356 328 956 1273 970 338 -203 -779 -1489 -1059 -675 312 917 1205 1176 556 -78
2222 -78 -543 -1113 -1215 -591 63 776 1000 1148 642 335 -578 -1272 -1216 -777 -204 601 895 1092 455 163 -472
2243 -472 -1016 -984 -1053 -336 274 1039 1294 868 204 -421 -771 -1087 -898 -365 373 831 959 925 613 -385 -591
2264 -591 -1142 -848 -439 429 684 873 750 248 -202 -855 -1055 -1019 -426 -229 537 1440 886 655 316 -589
2284 -589 -894 -1151 -728 -111 552 894 807 827 287 -604 -748 -1240 -587 -403 437 1102 1057 916 438 -13 -931
2305 -931 -953 -1060 -180 375 968 1023 1010 384 -249 -872 -978 -1021 -545 394 810 729 962 477 -140 -904 -850 -676
2327 -676 -226 -4 716 1071 958 831 7 -643 -1000 -695 -504 -66 416 672 875 737 104 -522 -749 -929
2347 -929 -518 -122 396 1031 1134 572 411 -465 -817 -838 -671 -143 178 542 1044 726 480 -247 -564 -936
2367 -936 -874 -515 -57 397 779 849 426 -50 -447 -741 -859 -745 -200 761 811 895 581 76 -513 -965 -910 -692
2389 -692 -173 639 720 774 366 157 -309 -601 -803 -773 -251 383 1059 1082 602 219 -458 -733 -845 -578 -287
2410 -287 308 613 820 711 625 -287 -616 -914 -853 -328 -9 499 900 753 563 193 -663 -687 -841 -410 -26
2431 -26 233 695 661 546 237 -356 -951 -802 -752 -400 96 721 878 823 432 -486 -713 -687 -769 -164 385 610
2453 610 992 901 178 -211 -540 -756 -494 -189 412 540 809 906 373 -210 -536 -960 -558 -548 -56 606 1122
2474 1122 860 471 -159 -600 -1044 -779 -586 131 439 539 1096 521 -72 -395 -465 -932 -779 -37 346 593
2494 593 853 481 340 -425 -518 -805 -575 -388 101 393 760 556 269 -297 -652 -1040 -496 -182 388 538
2514 538 530 798 254 -407 -429 -691 -924 -594 104 453 607 545 481 -38 -870 -368 -920 -685 79 339 694 633
2536 633 654 136 -389 -745 -851 -313 -218 264 582 467 477 131 -369 -799 -845 -669 -108 190 468 785 641
2557 641 377 -278 -332 -640 -697 -96 243 570 1077 726 358 -13 -599 -790 -487 -650 44 652 774 829 314
2578 314 73 -391 -621 -812 -610 -1 270 819 888 361 110 -633 -647 -988 -614 -63 200 771 464 699 162
2599 162 -29 -673 -482 -492 -149 231 722 820 571 219 -56 -581 -726 -571 -306 199 266 994 785 304 -335
2620 -335 -517 -571 -528 -334 -152 257 719 576 388 167 -468 -556 -687 -576 -7 200 901 520 536 -33 -486
2641 -486 -793 -759 -440 -206 370 677 584 248 -27 -539 -699 -596 -400 -91 164 448 619 634 79 -363 -427
2662 -427 -761 -628 -9 49 465 667 483 315 -115 -332 -459 -765 -450 -161 397 470 596 558 -152 -111 -646
2683 -646 -420 -285 -39 302 536 607 577 180 -511 -376 -655 -671 137 406 533 540 548 196 -172 -619 -500 -368
2705 -368 -456 100 697 606 445 260 -114 -40 -507 -548 -392 -88 451 664 714 225 187 -157 -584 -482 -137 11
2727 11 236 558 351 381 -112 -470 -641 -630 -330 1 348 667 523 299 108 -312 -257 -584 -86 23 175
2748 175 490 667 424 -51 138 -515 -547 -366 -143 -198 397 525 568 -133 -78 -486 -432 -564 -64 -77 413 642
2770 642 321 525 108 -423 -391 -601 -320 193 403 504 412 300 -15 -237 -314 -642 -682 -66 223 663 575 261
2792 261 -71 -82 -419 -583 -504 -284 86 562 435 613 226 110 -247 -325 -689 -321 230 399 554 576 267
2813 267 -422 -414 -622 -605 -22 -66 572 637 370 86 80 -200 -530 -486 -158 134 259 485 405 267 -7 -228 -325
2836 -325 -400 -401 -125 434 491 340 423 -78 -248 -615 -271 -557 -33 57 288 573 208 129 -18 -411 -326 -318 -139
2859 -139 140 328 520 188 120 -154 -578 -438 -465 -403 66 477 489 254 185 -183 -249 -536 -592 -435 38 303
2881 303 460 454 198 115 -244 -489 -467 -428 234 149 484 594 234 40 -305 -402 -430 -684 -65 216 391 789 401
2904 401 167 -123 -387 -846 -112 -126 95 334 431 506 218 -167 -544 -575 -522 -191 196 508 660 737 75 10
2926 10 -282 -465 -223 -220 179 437 375 218 243 -177 -151 -420 -141 -334 -175 312 612 654 60 -93 -380 -378 -464
2949 -464 -415 -56 344 580 416 39 176 -122 -367 -337 -398 -88 57 385 391 192 -12 -41 -106 -600 -281 -479
2971 -479 403 156 483 198 70 197 -372 -511 -486 66 -1 200 384 398 44 110 -160 -178 -271 -206 155 261
2993 261 330 313 172 -290 -233 -619 -261 -291 -50 179 336 341 152 187 -172 -452 -668 -169 -390 -50 438 257
3015 257 -2 87 -62 -130 -276 -152 -230 225 169 409 385 120 -218 -116 -545 -250 -207 104 14 275 111 125 66
3038 66 -192 -316 -442 16 363 109 333 412 151 120 -164 -455 -188 -490 -31 187 234 612 270 43 -195
3059 -195 -75 -473 -503 -188 44 584 437 408 -37 -430 -198 -322 -401 -444 9 385 379 266 123 -36 -247 -508
3081 -508 -366 -408 111 279 380 483 119 89 -244 -498 -550 -270 -78 -10 412 301 351 111 -169 -378 -14 -147
3103 -147 -193 155 253 679 259 35 9 -547 -357 -260 -251 34 104 398 -7 8 -186 -194 -248 -398 -434 -37 270 469
3127 469 193 -52 -56 -172 -375 -427 -76 34 166 372 98 2 -15 -315 -441 -260 -261 124 369 302 404 157 72
3150 72 -203 -351 -554 -490 37 176 428 391 182 173 -276 -68 -292 -172 -156 213 178 27 190 150 -98 -134 -102
3173 -102 -160 -218 75 367 506 307 -185 -124 -372 -237 -137 -177 487 478 391 457 -119 122 -194 -79 -369 -43 -8
3196 -8 250 526 261 287 16 -444 -183 -293 -223 -84 17 212 264 389 112 -207 -136 -36 -214 -328 121 325
3218 325 434 107 -84 53 -274 -211 -207 -152 -89 265 332 227 -135 -14 26 -302 -98 -70 48 406 68 486 168
3241 168 -38 -442 -563 -260 -43 84 233 446 327 398 -180 -62 -176 -641 -178 -368 213 465 313 326 -30
3262 -30 22 -443 -396 -188 83 203 159 138 342 180 139 -258 -108 -434 -429 13 230 556 325 -3 -167 -239 -486
3285 -486 -379 -132 215 155 -82 75 106 -202 -188 -474 -192 -199 10 269 358 171 169 -214 -294 -180 -223 -234 -167 284
3309 284 71 682 277 5 -279 -383 -47 -294 -353 23 49 155 235 14 -307 -468 -201 -224 -14 -74 192 164
3331 164 134 168 -87 -442 -427 -447 107 91 547 26 27 -30 66 23 -376 -299 -239 92 93 321 336 17 -238 205 -357
3356 -357 37 -115 8 211 116 265 58 -70 -16 -423 -280 -183 -279 90 66 480 49 180 63 -285 -197 -167
3378 -167 -7 -77 45 494 -41 67 108 -184 -376 -248 -226 -23 397 342 313 276 29 -260 -227 -178 -216 -126 398
3401 398 332 343 136 51 24 -405 -148 266 -196 81 152 191 270 73 -86 -336 -306 -226 -75 215 233 158 263 197
3425 197 34 -389 -186 -1 -33 -83 136 63 19 38 -6 -162 -360 -302 -27 259 147 243 94 254 -92 123 -473
3448 -473 3 -213 -339 38 -85 282 343 -98 -176 -507 -224 -131 -69 90 90 153 -97 69 -381 -164 15 -369
3470 -369 -56 -58 270 317 -146 -10 -108 -112 -199 38 -146 164 -61 93 286 143 -194 -260 -72 -160 -27 107 140
3493 140 193 185 -156 237 -197 -347 -109 96 57 424 325 -6 254 126 3 -227 -75 -247 -100 114 253 273
3515 273 185 324 -267 -170 -255 -212 68 32 69 170 175 -310 -54 -383 -488 -99 -78 -41 90 247 -135 0 -119
3538 -119 -217 -150 -192 -308 151 94 190 122 56 -95 -237 -234 -106 -79 66 209 61 356 94 -37 -400 -73 -68 -13
3562 -13 11 385 -24 233 -25 -253 -17 -72 -152 106 121 38 329 -13 181 77 -139 -359 -46 189 -79 133
3584 133 158 104 211 -152 138 86 -32 -391 -42 95 -34 212 365 145 -94 -253 -176 -193 -180 232 -21 -65
3606 -65 170 184 101 33 -209 -359 64 -94 330 168 -15 142 57 -66 -301 -83 -355 -182 82 455 394 106
3628 106 147 -287 -199 -107 -222 -138 -25 295 136 68 53 -18 -237 55 -122 -116 48 213 77 132 77 31 -245 -140
3652 -140 63 -209 -11 151 397 220 -68 -66 180 -133 -112 32 -129 123 301 18 114 138 46 -135 -118 -150 -139
3675 -139 7 148 229 113 -86 53 -227 -200 -168 162 -13 10 193 125 8 49 -50 -200 5 -232 319 186
3697 186 -26 334 276 -20 -112 -93 -359 82 -107 152 -37 196 -264 232 -135 -558 -212 -62 19 -39 155 20
3719 20 332 -130 -218 -471 -68 -363 -138 301 439 106 -60 116 -245 -345 -138 202 -30 -173 271 -138 79
3740 79 97 -23 98 -1 -4 -44 94 291 188 184 -27 -110 56 -143 -234 -170 -131 -132 231 134 292 4 -175 -73 -138
3765 -138 -357 -69 290 168 -28 89 42 257 -25 -218 -27 209 -39 288 11 96 20 -142 -271 -164 18
3786 18 5 134 58 291 -110 55 -319 -56 -39 -231 -195 390 45 142 396 -223 -183 -472 -162 -139 40 32 243
3809 243 229 329 150 -18 -239 -90 78 -169 132 62 165 261 -14 -1 -321 -204 -18 -236 197 62 270
3830 270 114 87 49 -235 -389 -217 -246 -2 -51 -48 445 101 125 -159 -140 -47 -230 -45 -102 42 -18 -138 402 30
3854 30 87 -91 -263 -29 104 55 176 23 -60 15 -96 -192 -72 -99 36 -156 24 105 155 -258 65 -219 -185
3877 -185 -180 -143 -313 117 168 99 -11 -29 -176 128 131 271 9 -8 355 94 -219 -255 -10 -194 2 -137 38
3900 38 67 388 120 84 135 -226 -309 -472 -160 -12 55 -9 -121 325 -122 -168 -136 -291 -144 3 -11 281 259 137
3924 137 2 -51 -152 30 -257 -119 140 320 267 102 274 -200 -202 -198 -64 75 8 -90 95 -53 -163 140 221
3947 221 -395 -48 -115 -95 381 112 164 -218 -72 -196 -164 -88 133 -202 -26 55 231 260 25 -131 -294 30
3969 30 -276 210 149 -29 129 219 -215 -380 -118 -48 -43 211 -93 -57 -18 107 -78 -73 -42 -284 -240 -76 189 -57
3993 -57 142 310 -57 -283 201 -67 -207 93 -9 167 348 116 -18 209 -188 -41 -65 -94 -12 84 323 78
4015 78 102 118 -286 40 -92 -145 79 221 136 382 141 337 -108 -267 -154 -180 -28 72 -22 -29 280 83 -224
4038 -224 138 -239 72 -73 216 44 305 285 280 -115 48 -348 -80 7 11 56 84 -26 75 -333 65 -274 154
4061 154 151 -61 -78 297 397 96 -173 -19 111 62 259 204 72 60 210 222 -113 -200 -196 -218 -35 141 22 161
4085 161 86 208 -425 -63 -21 -87 -24 112 174 -8 235 -157 -233 -215 340 -27 55 -284 147 323 -36 66 162
4108 162 113 -141 -73 -66 87 315 -87 185 150 75 -5 -148 -99 14 -169 -36 -76 123 55 -28 -60 -105 -243 -230 -358
4133 -358 -101 -170 110 43 -7 191 -281 -43 80 27 8 -21 73 -12 181 -295 7 9 -40 -71 -195 155 -135 76
4157 76 164 -159 -20 -314 -100 -1 -143 156 -102 259 60 310 -16 19 -143 71 284 137 160 80 -194 182
4179 182 -239 -470 -193 172 464 2 54 371 183 159 -229 -222 -126 -1 -238 11 145 81 53 145 -156 -105 -111 -4
4203 -4 -157 -15 126 -55 -80 111 38 56 35 -96 -9 3 -14 222 102 207 -10 46 -286 -4 -133 -223 123 -1
4227 -1 246 -147 -270 67 -455 -82 -172 -102 229 17 -63 271 262 240 -162 -274 119 -147 217 45 325 255 229
4250 229 142 -31 -178 -317 62 -234 -114 179 114 -120 -82 -65 -81 -341 -154 -139 30 89 182 137 204 -121 -226
4273 -226 -69 55 -4 -209 155 -76 -192 216 -392 60 267 162 283 64 72 205 -107 230 -18 45 44 -224
4295 -224 62 -81 259 -189 -266 110 -39 -57 50 -93 -38 108 -107 157 -115 -123 -87 -79 203 -40 28 -83 387
4318 387 84 189 208 -241 -44 -290 -8 -41 129 92 -83 227 -149 53 200 -223 25 -107 229 184 248 183
4340 183 -10 -26 -105 -56 -173 -56 147 -57 -7 75 -80 90 -191 190 -30 150 214 -101 312 218 -186 -27
4362 -27 -220 -60 -225 -72 263 28 212 -149 369 120 -212 -161 -457 -104 -362 149 -124 213 319 -167 -160
4383 -160 -163 48 153 -158 145 89 -186 42 310 357 -151 -153 -255 89 199 221 85 97 -167 152 -126 -126 -79 -222
4407 -222 -295 46 78 42 175 -6 110 -106 -66 -159 178 54 75 120 113 76 246 -122 -37 -195 132 -492 -80 -94
4431 -94 194 -91 32 -58 -388 193 38 -131 29 119 229 -147 58 11 -145 -205 -115 -159 -57 -115 260 -292 -148
4454 -148 -116 133 -112 -170 -31 -345 -9 -48 -282 138 36 -215 112 22 -113 -73 118 228 -236 55 220 -313
4476 -313 -72 3 -64 -80 58 -7 57 -34 -119 -103 -142 81 -74 -209 -281 -47 -158 188 131 -24 -44 -116 -96 -61 116
4501 116 165 -73 92 146 -20 -29 -194 -26 175 31 131 178 -77 -248 -132 -7 -144 11 -217 22 96 37
4523 37 144 173 -96 25 -171 70 -83 -1 176 -29 -275 161 -24 -124 -166 -84 -216 214 -32 -142 -124 69
4545 69 -180 -71 156 -220 153 -87 140 136 269 -20 228 -14 57 126 -88 -292 3 161 92 139 378 -79
4567 -79 61 -344 120 103 -28 116 90 304 -432 -279 -33 -115 162 -190 83 137 -81 118 -94 192 -147 28
4589 28 155 -132 2 -299 193 137 191 107 -211 -33 -55 -178 -129 97 -22 -2 98 -109 119 -233 168 -161
4611 -161 39 208 252 188 6 -128 -149 -89 -31 -247 -300 -55 -19 167 -123 -214 260 -289 107 223 123 -47 -21
4634 -21 -286 39 183 329 160 78 -252 -106 262 -142 69 -110 196 53 -24 136 -151 -71 -27 -67 227 -26
4656 -26 308 337 17 -103 -83 63 219 167 -242 238 95 280 -31 -188 -89 75 -173 -76 24 -73 -84 -219 177
4679 177 -190 -130 -137 47 105 -89 23 -63 39 -5 228 -162 84 -60 -170 -98 21 120 -55 -17 -131 -117 -20 -153
4703 -153 40 308 -153 50 32 143 -145 196 332 -139 -10 37 17 -144 154 233 38 -63 224 -13 -69 73
4725 73 152 -10 195 -182 -386 -321 -258 126 -183 -102 -63 -185 -259 -13 -181 13 169 -137 -66 90 38 213 9
4748 9 194 -147 -110 -5 283 193 46 25 179 -94 204 131 -11 -34 -125 -75 -161 -177 189 -148 40 -32 -36 -77 -65
4773 -65 -173 -16 138 -84 6 -10 440 100 -87 51 99 -260 246 69 318 23 -157 -77 -235 -52 23 -27
4795 -27 -81 58 149 -214 5 -147 -123 -78 -49 -173 -128 141 -136 -241 186 -89 -8 -372 19 -108 -129 -82 -259
4818 -259 83 120 138 171 -65 -168 -116 -109 -28 175 220 -8 -73 165 -375 -29 -73 -47 22 96 121 -186 110 -240 -154
4843 -154 -95 -241 369 8 -72 -56 38 102 7 413 -222 -3 180 -186 -174 4 165 238 8 236 -119 127 18
4866 18 -191 -30 -67 184 9 -299 249 97 73 117 -82 114 -33 18 102 158 -3 -103 -26 -274 -198 50 -97
4889 -97 -240 94 324 137 39 -8 102 100 105 -136 143 -165 161 -91 -236 -259 -228 -33 -24 -79 -32 13 120 20 -8
4914 -8 166 -148 259 -155 127 32 -168 -208 -173 -100 -359 115 -236 -338 131 -86 -9 128 -36 -11 94 -225 -188
4937 -188 21 -31 109 134 -65 -135 -15 -75 -137 316 38 -116 23 -88 146 -162 39 -41 54 -157 -42 -77 -150
4960 -150 106 2 85 237 -134 -111 8 -322 85 -67 70 202 -57 83 121 295 261 -74 34 20 106 9
4982 9 239 89 164 47 -202 -76 77 -67 68 92 -141 101 -62 -34 73 -61 141 -117 -126 45 35 63 40
5005 40 235 -124 91 -216 -28 -94 134 -70 -227 -137 117 -125 -4 68 49 63 18 -8 106 -59 -29 15 -327
5028 -327 -438 18 169 129 79 180 -230 -76 -18 -14 28 -40 143 -58 -154 -275 142 159 13 -238 -34 129 -126
5051 -126 391 -106 235 181 22 -225 161 -166 -232 346 29 -313 -63 9 -47 196 -100 -157 57 -51 -159 206
5073 206 -113 4 90 -46 -62 -289 -276 19 -171 -89 5 -41 -59 -39 208 22 -145 -38 -102 144 27 -116 -368
5096 -368 96 -133 -226 176 276 25 87 -27 -62 -94 167 16 0 -81 -186 45 -94 -149 -136 111 236 -56 36
5119 36 -104 -134 -128 190 -208 103 -89 209 -199 -68 288 -1 11 -50 48 -396 61 2 -114 25 -79 -106 -44
5142 -44 115 -197 338 188 -79 229 -148 116 -80 -93 -5 -373 -37 -128 -98 -117 28 162 -31 -198 -59 87
5164 87 -100 95 121 406 -17 -148 110 -62 -184 -111 61 -153 81 93 -255 -65 169 -198 84 98 -110 -37
5186 -37 -77 -26 116 -415 -37 -148 -116 243 -171 68 -230 45 134 192 -20 175 -104 -196 -225 88 6 53 -111
5209 -111 19 160 -6 414 -244 117 21 313 4 66 142 123 146 46 57 204 -91 -78 51 -26 -33 207 -165
5232 -165 -273 92 19 -169 18 224 -67 172 -50 -193 -56 -172 -61 205 -37 -26 -178 229 -82 -135 -178
5253 -178 130 89 -17 -151 -224 167 -18 166 -150 -36 165 -127 77 -90 263 42 -171 -4 112 -281 -311
5274 -311 -244 -68 7 -147 -19 228 -29 -64 282 -303 -121 -21 154 155 -160 -205 142 55 -32 295 66 -222 -61
5297 -61 -280 -105 148 -128 56 178 -119 -162 72 155 -156 96 -56 201 88 -254 -42 46 -52 -18 -170 77
5319 77 133 55 -49 -63 88 38 -85 -84 181 -51 95 26 188 -223 -185 78 245 -32 -112 -29 -85 153 207 300 61
5344 61 -17 26 -88 -100 67 -141 111 -48 231 18 -29 222 164 303 82 71 -138 192 -50 17 -249 -110 -81
5367 -81 57 74 -101 107 14 200 190 -131 -292 -195 -101 45 70 -84 -1 77 -96 -104 15 -47 -16 -105 -87 -237 -125
5392 -125 -86 30 -178 -70 -61 -196 130 -16 132 226 239 88 -13 -24 -154 -62 -64 78 199 263 -123 14 117
5415 117 -38 -76 -312 3 -334 107 -1 68 -25 123 -249 110 91 -181 -42 -158 157 289 36 -370 -177
5436 -177 210 295 25 110 44 242 -85 -98 103 130 108 -5 6 -160 -223 -219 -21 -98 61 -72 72 24 -57 -117 96
5461 96 -153 108 214 -95 127 144 -39 175 106 126 36 127 172 -74 29 23 -115 -164 142 -75 -30 51 27 -244
5485 -244 -61 -189 -2 27 -399 -348 -139 114 -12 -36 135 -121 -44 184 -61 7 200 130 117 144 -99 -252 -44
5508 -44 -81 -133 -98 184 156 -221 349 -52 -199 -5 -43 57 60 -139 142 80 -246 -52 -14 -49 -176 -52 -186 142
5532 142 -5 -74 13 -212 -169 -116 -153 -37 -237 140 197 233 -35 -69 22 -154 241 -126 -102 -91 -155 70 399 -127
5556 -127 19 159 61 30 99 -107 20 -41 31 320 -331 30 -113 -225 -268 172 -52 -49 -23 -83 -168 220 -75 133
5580 133 5 -91 -40 -117 125 40 57 16 -217 -130 143 186 -43 171 77 -168 -3 36 -6 -102 -183 58 -258 4
5604 4 27 -23 -6 174 -114 -373 -7 -169 267 -88 145 68 80 10 105 -119 14 80 133 -146 -169 32 133 257
5628 257 -1 -85 -121 -49 219 -70 22 62 -259 9 72 -281 -108 -95 -207 -296 2 -1 -134 -270 -128 98 34 -244
5652 -244 -44 -61 -133 -116 93 -119 -87 -87 -201 96 -169 -35 0 89 -54 -145 359 159 63 -186 -7 113 -243
5675 -243 205 84 -77 234 58 26 22 99 -50 208 -92 126 158 53 36 -54 -233 -261 146 -96 85 -288 -88
5698 -88 -183 75 -328 68 -41 23 -48 23 -72 205 346 60 -168 -98 -176 -57 -206 101 59 252 246 13 -295 -153
5722 -153 105 82 312 -136 -177 -199 138 346 -3 -173 100 -106 -115 126 169 -36 117 -140 -31 38 29 -239 129
5745 129 167 306 57 -238 -195 -217 1 318 -162 30 -106 -347 200 150 83 -90 56 -53 -81 -8 191 -71
5767 -71 -26 125 32 -121 -78 256 -138 193 78 -108 225 53 -52 40 230 92 -166 144 -34 30 -163 197
5789 197 216 -19 169 115 134 -130 46 -31 204 -16 -148 -121 -144 78 -21 96 146 -95 -5 212 128 -64 156
5812 156 -188 12 -69 58 43 -188 -113 214 -221 80 93 -34 -88 -37 59 68 77 212 -154 -81 198 -56 79 -196
5836 -196 150 134 62 72 -176 33 168 131 -33 1 65 122 -66 133 11 -152 -209 -85 124 226 -48 -193 -248
5859 -248 1 111 189 -197 -69 38 37 179 -220 57 161 187 302 68 -27 -230 39 -67 -218 -21 283 -15
5881 -15 114 176 -62 -183 154 -61 -9 289 163 258 -40 40 -229 126 283 -113 -70 -127 -72 -87 0 -210 201
5904 201 150 -42 -30 -28 173 225 -5 -141 -253 -87 -138 216 10 79 -37 -206 73 26 148 255 10 -85 -55
5927 -55 -184 269 -71 92 143 59 55 389 -188 169 119 70 -39 -165 -69 150 98 -62 131 246 60 -25 -26 166
5951 166 -139 173 15 109 178 178 46 -109 -115 131 134 36 121 31 64 173 63 -78 -32 75 -200 -261 -119 75 164
5976 164 -88 -192 111 -398 90 -86 -325 -216 89 176 58 -83 -61 85 -100 -131 36 160 252 27 106 -414
5998 -414 -399 -88 -115 -285 -69 49 -30 -101 -78 -19 -23 107 121 -86 -125 72 58 -238 192 36 -94 17 -66 -227
6022 -227 178 127 188 76 -341 -282 -110 154 -41 95 47 -78 7 28 -114 40 1 -218 -36 -53 108 245 47
6045 47 -24 146 -57 -136 -44 80 203 87 -14 160 200 14 368 123 -280 -32 -41 -224 326 192 -114 -111 412
6068 412 -70 -96 140 -224 -19 52 -54 41 72 140 216 -3 119 -36 -169 -8 77 -22 83 -93 37 -110 82
6091 82 -120 -69 -39 40 -1 -223 77 -94 -173 74 258 244 154 135 81 -6 -137 -147 -84 155 79 -31 196 43 -15
6116 -15 -192 169 -180 225 20 -87 152 -85 -129 11 -272 34 -69 -168 -167 245 12 -18 92 99 127 -41 -139
6139 -139 -103 58 -118 93 -40 176 -239 -178 -72 -279 69 -380 -60 -260 -7 -87 -94 -19 -114 8 -39 -145 111
6162 111 -107 -14 188 26 78 115 -178 -90 70 -195 -145 81 -204 -50 13 -151 -139 265 393 -162 -46 77
6184 77 80 153 -17 -28 121 30 -1 -203 22 -252 -166 -70 132 295 92 70 -288 -17 -146 -1 -174 177 -170
6207 -170 141 -33 91 288 201 -78 375 -135 10 102 113 148 72 -34 -28 252 -103 16 158 -108 36 -129
6229 -129 62 -165 84 -145 261 237 207 163 -79 246 -64 88 21 -268 -18 198 32 210 -75 -174 -9 73
6251 73 -90 -328 -86 -129 -199 137 -140 -243 -48 183 -107 173 -44 50 51 48 320 -12 -29 235 115 54 51 -20
6275 -20 21 -36 -77 119 -75 -102 -128 -37 -13 -96 -5 -225 -25 221 -10 141 -187 204 39 -78 225 -19 65 -38
6299 -38 214 37 -196 63 71 83 -133 -127 209 151 -28 100 46 44 14 63 12 124 141 -208 -124 211 -30 13 -105
6324 -105 14 113 55 -38 103 -123 165 91 5 -129 -162 259 69 13 112 64 -260 203 57 115 -119 -62 -275 -106
6348 -106 -30 16 -310 107 44 -155 138 53 -70 143 269 244 59 -108 178 -98 -14 117 -88 27 45 -281
6370 -281 -69 -224 -121 44 104 205 -151 -110 -73 301 204 -163 116 20 -398 253 15 -75 -89 -171 87 -52 18
6393 18 194 -266 93 -131 -359 -165 -122 303 -40 -298 -28 -151 -199 -282 221 -181 193 -67 208 -185 -245 185
6415 185 -228 -117 168 34 26 99 99 -18 -133 -215 105 -394 -200 -76 -165 -249 -122 270 -150 -5 -195 166 -207
6438 -207 172 87 110 -46 -68 308 135 -172 -32 -113 344 -56 -119 102 -55 -236 -159 -126 5 284 12 -151
6460 -151 33 -70 -312 175 291 12 -356 110 3 -104 146 -93 177 196 287 -36 157 -144 -109 -101 69 -186
6482 -186 135 186 -69 -9 245 -8 -4 -180 -136 186 61 219 -123 -231 37 40 -25 176 219 -115 71 16 55 -233
6506 -233 -92 24 -100 113 -29 23 44 127 -211 16 -3 -110 140 -167 -180 18 -58 102 45 36 -180 -27 41
6529 41 34 -253 -21 0 227 -127 71 170 -285 -126 62 -110 -201 -220 -58 -159 -125 -81 46 -52 -175 -443 -107
6552 -107 -179 68 59 -32 -118 -60 -107 -79 92 68 -145 -304 37 80 51 182 145 35 142 -148 77 0 97 -102 -187
6577 -187 -17 158 154 -50 -51 -129 -41 106 -213 -278 72 -206 266 41 180 27 -34 234 -138 -78 108 -20 101
6600 101 261 131 36 210 -113 -122 -102 -121 -112 -2 -12 -52 143 109 168 46 -141 -137 -131 -74 -132 -93 105 154 -112 226
6626 226 111 65 190 81 -188 53 -102 130 -54 72 -62 5 129 -180 39 -19 116 22 281 -95 -147 8
6648 8 127 -88 -28 113 60 312 -20 18 -94 79 -35 -281 -101 90 45 161 -61 96 160 9 1 -196 -26
6671 -26 250 69 12 22 10 3 -112 -68 -68 -48 -82 -177 -212 -48 -15 -204 266 -34 -194 -63 -131 97 -186 -128 36
6696 36 -170 -5 -171 -430 105 64 235 108 299 118 -63 -127 -15 -23 47 -6 151 -256 23 5 -337 259 -7
6719 -7 -121 -51 120 -55 68 -117 -264 185 219 -156 -153 -13 -204 170 33 117 66 -134 107 167 162 -221 320 -73
6743 -73 -89 6 265 64 49 248 4 -283 -74 -17 96 -130 30 36 59 -107 266 191 203 100 89 1 39 -212
6767 -212 157 -116 -101 -216 194 -44 75 224 8 8 56 45 -4 66 -244 -50 -114 170 -77 -11 32 -57 -216 -7
6791 -7 -264 52 266 -12 -199 -208 254 -12 -63 -116 -31 -125 -153 299 -72 -150 23 59 166 -40 -21 -206 236 -56
6815 -56 -141 -6 -294 167 181 85 -84 242 69 15 -134 -231 -169 -75 77 -20 202 164 -144 -235 -360 191 70 -61
6839 -61 61 344 33 57 -51 -215 -302 -29 -154 -168 132 -244 65 101 149 -254 139 -158 -102 130 -62 -151 -186
6862 -186 -139 169 -138 160 -28 -137 126 -116 -69 121 -177 -31 -128 163 -44 178 -67 157 120 -50 399
6883 399 -142 -154 320 -164 12 46 -40 -147 98 26 110 25 -60 229 184 140 -21 -95 -92 -79 2 43 110 -107 76
6908 76 79 40 99 -208 -173 -192 -108 -82 119 110 -40 117 -54 -45 227 -133 -159 208 156 3 33 109 -145 98 -173 -103
6934 -103 -249 -292 182 -157 -288 147 427 141 -310 -68 -123 -20 -45 -187 -152 -60 -19 290 53 -122 -223 -49
6956 -49 114 -12 -78 -40 74 178 -73 231 25 -309 57 -146 27 -139 9 -32 74 109 66 -211 -28 228
6978 228 -59 385 -78 160 296 130 164 20 -125 131 -136 -108 -179 249 21 19 -140 -16 15 -35 173 38
7000 38 -113 -100 -54 39 -73 -331 103 -8 -43 -149 -57 20 58 -12 94 -39 -377 169 -122 -180 -63 -33 56 -348
7024 -348 24 265 106 119 -117 -155 62 29 -235 17 -62 100 30 62 126 -228 28 205 240 -18 -274 91 -26
7047 -26 -21 -213 -48 -36 -91 96 196 49 286 -206 -3 -247 239 94 39 91 -25 -36 202 76 -41 176 108
7070 108 204 144 -131 -301 -208 153 -118 84 156 51 27 139 124 213 551 151 -89 147 67 222 -148 -45 97
7093 97 -38 -127 201 138 -315 -206 -160 97 -49 184 22 23 -68 99 36 -50 -130 -45 -432 -256 61 -221 -10 211
7117 211 -147 -279 -346 -40 -308 171 -83 -211 71 -45 -171 -227 -39 63 96 -135 46 -238 -59 33 -55 -354
7139 -354 -62 54 -41 111 50 14 -14 205 -38 -118 -21 96 79 -29 52 -164 268 12 173 16 128 47 83
7162 83 -37 23 19 -102 285 -44 -40 -5 90 -56 -197 -32 25 -274 -93 -208 92 -162 0 -14 -177 -311 -294 170
7186 170 129 41 -388 -185 -22 -78 -279 117 8 -112 191 -122 -9 77 -110 153 39 -94 -309 8 -90 53
7208 53 126 49 -115 243 198 -39 60 85 -165 -67 94 74 -62 -114 -109 -50 -80 -76 179 -73 375 -66 -6 118 90 -47
7234 -47 288 106 205 124 123 103 -4 -123 39 73 100 56 -4 105 -81 -2 -133 35 -57 -132 47 138 -54 69 -20
7259 -20 69 211 102 -167 -241 61 -182 -82 -92 15 128 38 -227 -195 114 94 58 90 223 134 -158 117 26 145
7283 145 -61 -35 -85 145 90 -103 46 12 -52 43 -51 -12 -80 -125 -186 -69 95 96 -64 21 141 -264 111 -246 153
7308 153 -114 129 53 181 -95 24 -112 7 171 -161 -109 92 -225 -74 -82 -65 -161 132 -87 154 70 -105
7330 -105 68 -104 -121 -98 -153 311 -133 -147 185 149 -160 -77 6 151 32 -10 -209 108 -119 -186 -130 -137 -24 -111
7354 -111 -227 -163 15 -123 51 36 -106 -35 32 -163 57 126 47 -43 -191 -74 40 56 -50 -261 35 -257 -197
7377 -197 -44 -85 -27 181 -207 -13 -249 -70 68 201 21 153 145 -117 171 165 -34 32 -132 -233 -34 143
7399 143 151 -70 258 150 179 22 -199 141 -38 124 382 73 -1 37 -57 -147 -23 -146 -104 -11 42 -288 -73
7422 -73 81 -95 -71 382 79 52 106 -134 69 -34 -61 -84 -117 -92 -25 9 135 207 266 -174 42 237 28 75
7446 75 -125 -64 -120 31 84 -45 -54 -59 -189 52 -54 111 66 -88 2 293 -141 -71 66 -112 -238 140 -133 76
7470 76 -69 -174 -87 -31 -96 -138 -44 -20 173 25 -401 311 -78 -85 -113 -366 -67 -17 208 70 -160 3 -32 -91
7494 -91 -184 -50 237 92 -115 -90 89 350 -147 -224 -10 -1 -53 -231 -179 217 186 -165 -108 4 150 -14 -8 -36
7518 -36 194 -205 113 356 189 -160 -193 109 2 -83 46 24 -129 70 144 102 -101 285 145 -191 -17 89
7540 89 304 -85 -227 -209 -264 419 -112 -149 103 136 -104 -154 -58 -117 -62 -74 181 107 52 -362 107 53 -82 -172 8
7565 8 -202 -79 -31 61 -111 -152 -7 -138 69 4 77 84 275 -60 -117 -104 -293 -206 -63 188 -60 275 179 -80
7589 -80 -14 -36 -164 -90 -84 233 -45 3 -129 -34 176 -43 -217 -101 -258 -87 -291 -203 218 11 264 -146 -172
7612 -172 142 -254 60 108 -86 -59 -73 227 103 110 -64 252 -188 120 253 74 -101 92 60 12 85 -8 -54
7635 -54 -144 161 -261 -105 -113 -120 -132 76 -220 49 -24 -248 16 -227 -71 -257 -234 78 -87 9 87 -116 300 -117
7659 -117 -255 -103 -17 220 -19 20 -96 274 181 -167 -79 -97 80 119 -39 234 171 -403 -83 -153 166 -12 156
7682 156 53 182 7 -229 -104 -99 19 289 -170 141 -181 -8 -61 29 104 -42 -1 -88 -80 -52 -212 83 35 45
7706 45 -206 -158 202 -32 121 -105 13 244 88 -77 9 -252 250 103 72 -234 -65 4 -118 76 3 -256
7728 -256 -330 158 106 77 35 21 87 -93 -243 59 -195 -207 -26 34 157 150 -40 70 263 53 65 147 16 -21
7752 -21 -57 -370 -124 -59 23 183 223 278 307 56 201 -175 143 -52 -14 288 -125 168 -64 247 85 -259 162
7775 162 157 30 -150 -105 19 -165 -333 -143 87 50 0 14 43 98 -416 -40 -78 3 64 -230 -90 206 42 -36
7799 -36 -112 1 -107 -103 -79 99 -175 -16 -88 -206 -16 -141 259 -120 -309 -86 90 -162 41 27 139 -9
7821 -9 -84 -96 63 82 120 -162 75 -43 -59 -145 30 -9 -119 105 205 148 -152 -310 -35 141 -353 -5 -42 -238
7845 -238 -128 164 82 -94 -379 215 88 395 69 -232 175 131 -233 240 -298 -138 22 159 145 -16 -145
7866 -145 211 -53 -145 88 -121 249 68 -123 -506 -203 -145 28 -116 -57 -11 292 -66 166 61 154 117 -32
7888 -32 -60 -48 291 57 148 111 -112 130 118 59 47 -125 -84 230 -91 97 -82 269 -113 -13 -48 -93 -29 29
7912 29 156 -136 116 -162 27 59 14 -146 92 -12 119 -104 24 127 -118 -23 -18 43 -1 -31 61 133 47 83
7936 83 94 97 113 60 -80 181 -457 -308 -121 -47 -206 10 142 311 -70 153 234 59 -77 122 -58 -143 378
7959 378 -63 -53 206 0 -155 91 -242 -9 303 118 113 99 17 4 -193 -54 149 -210 -207 -51 -131 -116 -117 45
7983 45 -6 -177 78 -238 -116 22 -73 101 178 91 -125 -59 -22 31 109 169 132 -285 -49 56 -175 21 -66 -195
8007 -195 -102 307 -101 117 -51 -119 17 -106 29 -21 -66 -115 236 -71 -240 -218 -100 -2 -182 82 71 -46 133
8030 133 -57 -75 -11 -354 60 28 -95 52 -174 -94 21 17 92 -99 12 76 -189 320 -74 253 224 -220 -145
8053 -145 149 -7 -109 52 17 -165 -109 160 14 -97 -120 239 -67 82 120 121 -199 116 87 11 64 334 177
8076 177 -184 -149 19 -85 -190 130 90 -33 -84 120 142 78 -200 -36 -189 73 -6 234 12 18 168 -87 9
8099 9 -74 124 223 -189 14 38 72 -55 79 114 124 167 -145 5 38 82 -116 -53 -89 -19 219 120 75 226 -67
8124 -67 -31 241 147 164 -26 -133 224 -155 -20 -74 80 198 6 -85 -29 146 -71 73 154 -14 -36 19 -120
8147 -120 -200 -117 21 47 -144 -32 146 -78 97 75 -14 126 81 -26 -53 -103 274 211 -70 -24 4 -2 -130 -155 27
8172 27 -102 80 -12 -188 -6 32 -207 39 -75 37 -85 95 -192 -200 -55 19 295 115 -176
8191a76
$$ Imaginary data points
##PAGE= N=2
##DATA TABLE= (X++(I..I)), XYDATA
0 0 0 0 0 0 0 0 0 0 0 0 0 0 0 -8 8 -8 8 -8 16 -16 19 -24 30 -32 40 -48 56 -64 72 -81 95 -107 121 -137 156
35 156 -176 198 -220 247 -276 306 -341 378 -418 465 -512 565 -622 686 -756 831 -917 1013
53 1013 -1118 1232 -1366 1516 -1688 1891 -2125 2412 -2761 3203 -3777 4567 -5718 7567 -11020
68 -11020 19744 -93711 -119193 45467 40010 50843 116268 154704 41653 -73207 -103034 -86568
80 -86568 -96759 -60858 29929 108140 114906 96029 53915 -22925 -103863 -119415 -91923 -57686
92 -57686 -3025 85656 132081 99103 42610 4037 -54985 -120140 -118276 -43918 20875 52001
104 52001 88642 118259 78607 -15950 -81505 -88808 -86458 -81380 -28882 61952 115428 100805 58327
117 58327 16220 -35563 -86552 -104790 -77098 -17020 48688 89873 90530 65439 28365 -27278
129 -27278 -88855 -112709 -76163 -15943 30067 64556 95195 93587 38519 -33303 -72951 -80098
141 -80098 -75720 -48819 13482 75853 93317 71217 36587 -7120 -60446 -96546 -86741 -40421
153 -40421 11208 52927 81655 86533 56346 634 -52768 -81433 -79660 -51401 -5535 42116
165 42116 76838 84288 56744 3739 -46388 -72939 -77496 -62784 -20991 38528 80729 82426 56097
178 56097 20908 -21614 -66510 -86518 -64748 -18068 25723 56907 75247 69052 29170 -25055
190 -25055 -63642 -75815 -65620 -34303 13429 58838 79616 69531 36034 -8398 -49424 -72607
202 -72607 -70828 -42257 3975 48243 71142 67150 40736 885 -43025 -72449 -72769 -43687 -1485
215 -1485 38456 66392 74258 53175 9444 -35879 -64341 -69834 -52729 -15379 29093 62575 70563
228 70563 51414 14612 -25854 -57696 -70936 -57285 -20361 24526 57399 70037 59386 27009
240 27009 -16718 -54380 -69513 -58951 -28482 11212 47866 67294 60203 30322 -9759 -46204
252 -46204 -66504 -61926 -33444 6167 43753 66712 64661 37873 -1580 -38214 -62087 -65166 -42696
265 -42696 -2868 35697 58804 61603 43602 7070 -33882 -60062 -61812 -43216 -10451 28568
277 28568 59192 65371 46463 13443 -23491 -54255 -65478 -50627 -16607 20359 49621 62044
289 62044 51407 19599 -18546 -48135 -60380 -51831 -23083 15329 47556 61339 53795 27234
301 27234 -10191 -44295 -60742 -54819 -29766 5773 39296 57932 54474 31183 -2950 -36646
313 -36646 -57185 -55016 -32934 975 34424 56270 57069 36174 2216 -30635 -53258 -57535 -39842
326 -39842 -6681 27303 49627 55021 40928 10458 -24958 -49420 -54422 -40628 -12972 21197
338 21197 48327 56064 42333 14993 -16568 -44623 -56646 -45890 -18113 14163 40644 53697
350 53697 46977 20833 -12147 -38515 -51170 -46316 -24193 8837 37861 51577 46712 26369 -4551
363 -4551 -34674 -51960 -48535 -27669 797 29680 48938 49619 30764 672 -27808 -45584 -48099
376 -48099 -32960 -4089 26689 45667 47838 34032 7561 -22626 -44731 -49403 -36050 -10085
388 -10085 18427 41083 48660 37893 13211 -16504 -38975 -47001 -37903 -14935 13605 37323 47527
401 47527 39456 16479 -11428 -34716 -46218 -42037 -21315 8269 33715 44788 40653 23026 -3417
414 -3417 -30311 -45353 -41087 -22528 2456 26428 42756 43462 26343 -575 -26023 -41649 -42717
427 -42717 -28636 -3572 22742 40658 43523 29383 5119 -19307 -36905 -42720 -32389 -7704
439 -7704 19459 37152 40633 31794 12262 -15276 -37938 -43582 -31534 -11558 10350 32130 44145
452 44145 36616 13266 -11092 -29245 -39601 -36902 -18151 8569 30781 39833 35452 18378 -5075
465 -5075 -27644 -39895 -37865 -21295 3671 26345 37744 36492 23906 1622 -23915 -39548 -36850
478 -36850 -21332 -2488 18183 36461 41276 25177 461 -19169 -32316 -37803 -30376 -7040 20085
491 20085 34926 35966 27176 10233 -13092 -33342 -38683 -28449 -9390 12173 29823 36611 31049
504 31049 13813 -10645 -31205 -37699 -28974 -13623 5150 26329 40044 33973 13076 -7370 -22427
517 -22427 -33546 -35651 -20081 6466 26514 32382 30394 21313 921 -23858 -36373 -32111 -18644
530 -18644 -1598 18601 33972 34918 22280 2369 -18354 -32387 -33744 -22498 -4352 14790 30807
543 30807 36112 24501 3490 -14691 -26888 -33171 -28940 -9020 15831 29346 29643 25683 14001
556 14001 -8694 -30223 -34662 -24417 -10313 5160 23465 35588 30154 10945 -8558 -22282
568 -22282 -30467 -30339 -16334 5580 23613 31102 28556 16300 -2200 -20038 -30678 -30346 -18780
581 -18780 1237 20266 28634 28121 19827 3218 -17766 -31438 -29769 -17673 -2559 12931 27845
594 27845 33005 21937 1879 -14561 -24556 -29398 -24531 -6713 13593 26121 28133 22455 8862
607 8862 -9500 -25425 -30568 -23575 -8998 8703 23011 29510 24704 11165 -6686 -22522 -29284
620 -29284 -24334 -11669 3940 19389 29252 27327 12600 -4723 -17562 -25879 -27336 -16846 2286
633 2286 19430 26469 24504 16767 2015 -16262 -27926 -26934 -15989 -1450 13304 25250 27655
646 27655 18207 2417 -13057 -23784 -26556 -19031 -5008 11226 23390 27246 20455 5564 -10293
659 -10293 -21831 -26071 -21652 -7997 9273 21532 25286 21075 9825 -5959 -20698 -27040 -21228
672 -21228 -9009 4660 17926 26050 23510 10980 -4531 -16922 -24115 -23356 -13279 2459 16455
685 16455 24171 23317 13991 -289 -14793 -23790 -23368 -14606 -375 13841 22744 23737 15683 2494
699 2494 -12386 -22725 -23844 -15930 -3287 10047 21028 24470 17807 3923 -9898 -19623 -23441
712 -23441 -18615 -6479 8616 19793 23115 18627 7559 -6485 -18938 -23487 -19005 -8390 5187
725 5187 17743 23115 19791 9267 -3872 -15979 -22457 -20653 -10718 3098 15108 21815 20803 11735
739 11735 -1553 -13780 -21296 -21096 -12740 -125 12993 20674 20906 13572 1479 -11644 -20408 -21213
753 -21213 -14186 -2335 10611 19202 21233 15396 3659 -8982 -18626 -20983 -15638 -4707 7918
766 7918 17811 20844 16338 5679 -6793 -16644 -20564 -17080 -6952 5675 15633 20419 17736 8064
780 8064 -4614 -15368 -19934 -17677 -9202 2703 13845 19926 18008 9600 -1634 -12643 -19460 -18789
794 -18789 -10596 929 11865 18472 18870 11807 344 -11249 -18018 -18450 -12703 -2074 9509 17567
808 17567 18543 13043 2682 -8458 -16706 -19133 -13820 -3681 7335 15844 18902 14540 4615 -6580
822 -6580 -15222 -18505 -14947 -5714 5393 14571 18240 15157 6695 -4155 -13650 -18111 -15472 -7636 2698
837 2698 12603 17642 16025 8629 -2018 -11622 -17420 -16368 -9383 1024 11100 16848 16580 10026 126
852 126 -10030 -16112 -16523 -10710 -1289 8812 15927 16492 11488 1880 -8325 -15097 -16506 -12270 -2992
867 -2992 7238 14428 16536 12964 4324 -6204 -13813 -16565 -12735 -4866 4870 12833 16498 13525 5571
882 5571 -3790 -12012 -15925 -13845 -6772 2845 11528 15853 13957 7253 -1827 -10427 -15405 -14404 -8287
897 -8287 1602 10098 14593 14607 9039 6 -9221 -14574 -14496 -9197 -1080 7820 14490 15150 9780 1370
913 1370 -7018 -13487 -14707 -10648 -2694 6407 12796 14894 10865 3460 -5164 -12525 -14924 -11517 -3873
928 -3873 4712 11366 14176 12465 4918 -4110 -11361 -14193 -11980 -5684 2469 10744 14184 12426 5963
943 5963 -2020 -9109 -13397 -13053 -7079 1572 8990 13287 12648 7847 -225 -8289 -12985 -13050 -8353 -236
959 -236 7317 12191 12878 8919 1167 -6985 -11880 -12648 -9051 -2462 5840 12005 13224 9164 2637 -4885
975 -4885 -10641 -13082 -10245 -3103 4659 10166 12281 10599 4489 -3635 -10521 -12708 -10329 -4571 2815
990 2815 9106 12293 11188 5405 -2255 -8907 -11943 -10857 -6340 978 8305 12257 10919 6154 -493
1005 -493 -6833 -11392 -12082 -7034 282 6832 10581 11049 7921 977 -6535 -11120 -10829 -7729 -1963 5236
1021 5236 10799 11451 7984 2016 -4344 -9597 -11601 -8904 -2621 3935 9345 11283 8879 3082 -3266
1036 -3266 -8529 -11592 -9648 -3835 3149 7836 10548 9862 5169 -1962 -8242 -10669 -9280 -5065 903
1051 903 7412 10936 9858 4980 -588 -5961 -10185 -10587 -5982 263 6005 9957 10163 6417 633 -5503
1067 -5503 -9541 -10468 -6903 -1191 4854 8758 9856 7559 2055 -4405 -9014 -9921 -7449 -2927 3076
1082 3076 8757 10463 7399 2563 -2599 -7587 -10379 -8701 -3404 2702 7052 9251 8374 4599 -1907
1097 -1907 -7175 -9343 -8427 -4793 923 6264 9693 8943 5187 -374 -6145 -9567 -8634 -5407 -381 5266
1113 5266 9080 9024 5548 846 -4431 -8465 -9218 -6468 -441 4488 7898 9036 6937 1591 -4324 -7981
1129 -7981 -8752 -6684 -2710 3211 7570 9103 6999 2502 -2697 -6907 -8997 -7767 -2818 2391 6595
1144 6595 9145 7504 3275 -1484 -6367 -8616 -7892 -4050 1085 5804 8294 7936 4660 -664 -5515
1159 -5515 -8086 -7577 -5122 -197 5217 7955 8177 5137 556 -4219 -7414 -7956 -5584 -548 3765 7478
1175 7478 7849 6067 1303 -3466 -7017 -8066 -6001 -1997 2864 6865 8021 6392 2423 -2455 -6386
1190 -6386 -7796 -6624 -2727 2083 6115 7711 6754 3282 -1493 -5430 -7576 -6949 -3891 1012 4984
1205 4984 7248 7228 4051 -803 -4854 -7106 -6951 -4573 169 4531 7319 7458 4653 384 -3688 -6740
1221 -6740 -7038 -4930 -935 3541 6562 7297 5602 1401 -2758 -6092 -7215 -5433 -1736 2736 5897
1236 5897 7136 5817 2034 -2158 -5481 -6940 -5882 -2833 1478 5512 6929 5788 2711 -1227 -4851
1251 -4851 -6970 -6329 -3178 826 4406 6551 6265 3791 -363 -4267 -6513 -6139 -3683 42 3802 6164
1267 6164 6389 4184 189 -3599 -6281 -6315 -4399 -873 3165 5845 6229 4483 1563 -2731 -5781 -6551
1283 -6551 -4785 -1403 2301 5359 6467 5130 1930 -1734 -5278 -6015 -5214 -2732 1667 4677 6244
1298 6244 5375 2624 -860 -4363 -6212 -5359 -3035 779 4123 5951 5509 3394 -282 -3791 -5581 -5481
1314 -5481 -3539 -156 3298 5781 5991 3971 491 -2907 -5392 -5913 -3821 -887 2763 5201 5646 4207
1330 4207 948 -2477 -4984 -5800 -4304 -1411 2004 4686 5657 4603 1791 -1708 -4540 -5692 -4653
1345 -4653 -2135 1159 4355 5682 4670 2221 -675 -4029 -5163 -5061 -2757 696 3560 5259 5148
1360 5148 2871 -288 -3268 -5202 -5099 -2956 -296 2728 5035 5213 3196 285 -2421 -4760 -4987 -3594
1376 -3594 -929 2250 4661 5135 3832 881 -2373 -4360 -5501 -3870 -1103 1925 4241 5053 4390 1411
1392 1411 -1382 -3953 -4990 -3992 -2059 1038 3815 4996 4252 2122 -912 -3404 -4786 -4559 -2304 367
1408 367 3008 4835 4391 2615 -302 -2851 -4464 -4473 -2860 -138 2462 4284 4558 3218 772 -2418
1424 -2418 -4315 -4714 -3295 -817 2137 3985 4730 3442 1190 -1607 -3862 -4804 -3578 -1184 1502 3550
1440 3550 4495 3699 1583 -1205 -3480 -4198 -3796 -1726 1135 3422 4317 3941 1802 -532 -3162 -4172
1456 -4172 -4017 -2283 162 2731 4295 3728 2335 265 -2401 -3939 -4452 -2348 -68 1926 3762 4400
1472 4400 2821 370 -2186 -3653 -4142 -2699 -698 1446 3610 3984 3205 1163 -1385 -3202 -3981 -2997
1488 -2997 -1214 1390 3422 3933 3469 1332 -585 -3243 -4144 -3341 -1580 528 2944 3967 3626 1814
1504 1814 -272 -2516 -3837 -3573 -2096 94 2615 3586 3633 2324 -160 -2382 -3749 -3798 -2537 -425
1520 -425 1944 3044 3644 2519 298 -1674 -3255 -3497 -2637 -783 1353 3147 3511 2915 970 -1565
1536 -1565 -3055 -3699 -3196 -1394 1223 3006 3332 3075 1297 -936 -2684 -3589 -2844 -1670 527 2302
1552 2302 3512 2839 1578 -360 -2166 -3274 -3315 -1908 261 2056 3249 3225 1910 238 -1993 -3117
1568 -3117 -3164 -1959 -90 1911 3206 3116 2423 648 -1387 -2815 -3289 -2407 -516 1095 2990 3431 2728
1585 2728 986 -874 -2609 -3299 -3103 -1192 628 2198 3072 2927 1383 -797 -2270 -3368 -2834 -1509
1601 -1509 344 2174 2896 2841 1501 -372 -1999 -2793 -2850 -1423 42 1805 2915 2985 1712 88 -1552
1618 -1552 -2746 -3011 -2016 -196 1672 2442 2930 2210 657 -1217 -2833 -3071 -2244 -680 1033 2570 2983
1635 2983 2513 682 -772 -2069 -2909 -2488 -1072 729 2338 2930 2608 1262 -675 -1949 -2906 -2694 -1533
1652 -1533 481 2012 2898 2793 1696 -42 -1832 -2887 -2614 -1772 181 1945 2895 2597 1693 91 -1230
1669 -1230 -2462 -2803 -1756 -348 1084 2440 2637 2004 570 -1148 -2436 -2948 -1984 -730 752 1882
1685 1882 2578 2285 926 -651 -2042 -2461 -2103 -1017 357 1968 2768 2380 1350 -458 -1786 -2793
1701 -2793 -2184 -1323 302 1665 2399 2640 1579 -176 -1563 -2297 -2373 -1840 -203 1476 2107 2316 1746 299
1719 299 -1239 -2338 -2617 -1683 -284 759 1968 2789 1724 468 -1115 -2073 -2459 -1921 -805 767 1947
1736 1947 2313 2001 1052 -656 -1769 -2516 -1924 -1284 381 1894 2442 2221 1325 -245 -1536 -2329 -2000 -1515
1754 -1515 36 1314 2283 2289 1347 129 -1280 -2236 -2169 -1323 -229 1162 1975 2318 1494 246 -1120 -1788
1772 -1788 -2113 -1679 -263 800 1866 2354 1705 665 -677 -1685 -2329 -1704 -716 865 1796 2225 1698
1789 1698 796 -235 -1800 -2191 -2015 -1038 291 1550 1969 1798 1139 -433 -1506 -2154 -1914 -1287 -169
1806 -169 1247 2100 2090 1436 -21 -1166 -2107 -2079 -1457 -94 1332 1869 2272 1520 -209 -991 -1886 -1952 -1428
1825 -1428 -476 656 1820 1841 1454 628 -439 -1752 -2098 -1897 -731 354 1828 1992 1736 884 -335
1842 -335 -1688 -2153 -1828 -865 488 1340 1714 1997 996 -57 -1366 -2079 -1857 -974 50 1022 1852 1890
1860 1890 1311 45 -829 -1846 -1713 -1266 19 1146 1742 1937 1381 432 -1039 -1709 -2083 -1468 -317 723
1878 723 1579 1990 1579 588 -538 -1568 -2172 -1669 -594 329 1270 1932 1715 1067 -581 -1167 -1782 -1622 -796
1897 -796 79 1254 1711 1517 872 25 -1329 -1885 -1868 -1063 -22 950 1526 1373 818 182 -886 -1651 -1896
1916 -1896 -1140 -449 959 1834 1530 1492 502 -996 -1357 -1923 -1534 -333 854 1640 1727 1382 695 -564 -1505
1935 -1505 -1737 -1499 -828 498 1409 1750 1440 785 -310 -1030 -1709 -1660 -685 367 1393 1651 1288 826 136
1954 136 -911 -1438 -1507 -984 -11 1037 1601 1802 1001 371 -851 -1381 -1394 -1177 -495 904 1478 1474 1412 316
1974 316 -822 -1205 -1970 -1074 -628 571 1091 1563 1295 557 -76 -1316 -1367 -1526 -332 667 1148 1673 1308
1993 1308 632 -417 -1073 -1734 -1557 -830 196 1001 1605 1488 895 50 -941 -1546 -1470 -837 -38 948 1308
2012 1308 1555 939 -100 -902 -1274 -1629 -1007 -356 999 1351 1453 961 116 -596 -1567 -1756 -1168 -368 564
2031 564 1279 1583 1003 575 -388 -1206 -1231 -1147 -387 362 1318 1466 1248 544 -256 -1113 -1391 -1340 -497 164 697
2052 697 1620 1555 861 -91 -1027 -1486 -1496 -1031 -56 548 1214 1405 962 174 -964 -1411 -1530 -1032 -96 449
2072 449 1374 1544 1022 481 -319 -1218 -1217 -1131 -223 359 1378 1641 1058 529 -361 -974 -1798 -1043 -401 448 925
2093 925 1373 1358 791 -245 -1134 -1703 -1137 -487 -130 591 1379 1478 700 -8 -806 -1198 -1478 -691 -105 889
2113 889 1039 1229 1064 117 -533 -1259 -1327 -1090 -101 482 1563 1404 968 130 -305 -844 -1269 -1083 -274 459
2133 459 873 1045 994 501 -259 -912 -1264 -1437 -534 30 1002 1335 1010 667 -287 -867 -1427 -998 -630 173
2153 173 817 1269 1173 592 -93 -916 -1267 -1188 -911 -72 456 1254 1116 931 417 -495 -1212 -1398 -860 -264 353
2174 353 1108 1059 1052 176 -496 -1020 -1334 -1122 -466 405 1058 1264 1111 466 -111 -692 -841 -666 -544 149 983
2195 983 1352 1034 545 142 -771 -1168 -1287 -407 -163 582 1095 1062 771 -162 -615 -1020 -1193 -953 -48 424
2215 424 753 1365 925 -111 -451 -1115 -1045 -824 8 733 981 1162 782 340 -567 -772 -1248 -1125 -527 154
2235 154 865 1245 1164 498 -16 -800 -1311 -1053 -450 341 606 1003 896 518 -132 -488 -1091 -1080 -474 -23 561
2256 561 1151 1092 704 176 -609 -1020 -924 -671 40 542 846 932 769 175 -380 -572 -816 -882 -294 306 960
2277 960 1255 938 270 -550 -1009 -989 -976 -526 381 921 1004 975 395 -164 -692 -973 -946 -509 11 1037 877
2298 877 871 758 64 -771 -935 -719 -928 -39 383 1001 1155 935 66 -494 -1243 -860 -825 -336 535 721 1137
2319 1137 682 184 -607 -903 -1002 -642 129 356 905 951 843 357 -522 -872 -826 -864 -525 159 919 1069 801
2340 801 364 -261 -480 -825 -833 -443 -108 560 1097 791 724 -517 -734 -941 -855 -550 168 615 808 983 730
2361 730 106 -610 -902 -1166 -632 -204 423 1164 1005 946 147 -307 -936 -604 -826 -347 690 759 1019 558
2381 558 348 -189 -664 -817 -724 -508 236 754 778 985 517 -183 -706 -885 -787 -315 57 647 516 743 503
2402 503 -172 -639 -871 -902 -398 89 425 720 893 911 -63 -309 -699 -869 -338 -243 372 745 744 741 401 -147
2424 -147 -352 -800 -758 -261 334 788 818 757 500 -593 -587 -801 -732 -116 265 865 811 498 299 -138 -516 -864
2446 -864 -853 -374 -12 217 694 650 715 -48 -513 -680 -941 -358 -208 318 1050 727 668 -42 -473 -932 -651
2467 -651 -545 55 568 778 685 554 254 -430 -781 -545 -808 -225 274 566 1008 740 502 -101 -508 -750
2487 -750 -523 -484 120 498 600 656 471 101 -664 -566 -686 -392 132 712 670 734 542 -13 -471 -709 -526 -640
2509 -640 -44 508 545 766 527 74 -463 -799 -768 -670 -57 354 634 582 537 63 -97 -897 -499 -590 -339 266
2531 266 623 888 633 297 -181 -652 -681 -466 -644 440 523 689 634 452 -16 -374 -300 -709 -513 -6 450
2552 450 632 427 459 8 -213 -692 -588 -677 -163 466 786 802 402 -49 -219 -539 -756 -419 -91 262 825
2573 825 898 455 508 -194 -647 -732 -748 -57 451 546 673 818 518 -108 -667 -804 -868 -195 60 275 780 874
2595 874 232 -116 -382 -1036 -897 -285 130 326 655 779 414 135 -351 -907 -691 -280 -116 202 418 624
2615 624 563 -65 -148 -745 -621 -374 -179 234 485 692 687 106 -280 -462 -767 -469 -237 346 501 761 352
2636 352 401 51 -594 -743 -477 -182 321 593 588 654 229 -40 -504 -674 -591 -421 -244 490 99 414 519 184
2658 184 -516 -766 -706 -728 13 379 681 581 516 46 -437 -749 -696 -357 -247 278 731 822 664 39 158 -604
2680 -604 -686 -742 -271 253 364 716 631 74 -212 -497 -725 -719 -189 166 312 584 507 201 -46 -658 -851 -336
2702 -336 -270 367 425 380 746 172 -46 -665 -669 -902 -437 -165 139 731 568 436 -106 -184 -598 -672 -675 137 253
2725 253 641 696 456 241 -328 -557 -694 -488 -288 269 433 601 387 375 -367 -483 -458 -906 -330 -4 366
2746 366 574 440 241 -113 -454 -581 -376 -440 -183 570 566 757 265 57 -417 -639 -144 -293 -144 328 595
2767 595 506 523 292 -384 -706 -680 -398 -21 175 483 858 410 66 -141 -498 -555 -320 -177 249 610 840
2788 840 423 43 -82 -206 -516 -489 35 358 120 492 585 338 39 -255 -558 -657 -236 145 225 233 655 484
2810 484 -32 -404 -461 -392 -342 119 302 518 80 445 56 -358 -459 -675 -282 -220 391 204 338 567 97
2831 97 32 -531 -614 -464 -199 283 566 374 374 -13 -54 -326 -302 -325 -126 177 247 613 438 192 -256 -187 -325
2854 -325 -454 -326 80 293 743 418 373 -116 -383 -506 -475 -367 76 240 502 423 150 -249 -381 -380 -438 -301
2876 -301 -250 -96 449 462 314 46 -249 -369 -363 -361 -216 160 343 405 355 248 -167 -588 -506 -323 -125 -204 156
2899 156 439 657 365 122 -71 -455 -530 -187 320 333 131 489 385 -249 -374 -352 -216 -505 -45 220 338
2920 338 568 321 86 -262 -300 -582 -423 98 257 409 538 357 91 -128 -319 -505 -231 -311 148 366 537
2941 537 212 346 -256 -444 -582 -440 -212 241 395 400 299 312 -49 -520 -529 -415 -149 -22 76 194 281 355 -2
2964 -2 -350 -298 -423 -445 88 165 401 424 461 -41 -219 -198 -269 -230 -228 160 310 281 41 -166 175 -415 -275 -446
2988 -446 -197 305 112 341 430 198 -21 -101 -401 -345 -130 -248 70 372 560 19 -212 -272 -208 -276 -54 138
3010 138 198 480 598 151 -158 -110 -412 -425 -325 -22 139 591 435 396 5 29 -323 -242 -397 162 105 332
3032 332 520 410 284 -231 -547 -371 6 202 224 171 496 202 84 -276 -352 -276 -326 -40 -110 286 515 301
3054 301 60 262 -582 -269 -293 -202 -13 325 488 416 139 -146 -235 -438 -383 -328 -146 -154 355 348 325 98 78 -370
3078 -370 -305 -404 -286 15 288 221 132 -202 2 -38 -556 -231 -132 228 227 171 333 133 -171 -231 -280 -377 -462 99
3102 99 312 459 206 -74 -29 -248 -457 -189 -144 60 312 450 630 178 84 -18 -620 -385 -162 -58 283
3123 283 80 369 194 291 -77 -491 -374 -241 -49 56 401 555 397 93 -152 -439 -209 -213 -189 -125 549 619
3145 619 326 148 -90 -251 -339 -245 219 103 415 206 313 184 -276 -205 -506 -253 -46 -39 -97 337 207 376
3167 376 -133 -77 -138 -158 -137 180 226 88 50 182 199 -183 -52 -217 -211 -31 110 261 224 288 193 -124 -48 -617
3191 -617 -113 -220 40 389 307 153 137 -145 -217 -39 -359 -20 20 50 267 347 110 -189 -167 -252 -266 -59 -149
3214 -149 167 300 165 372 -190 25 -226 -535 68 -231 199 240 221 316 76 -298 -91 -221 87 -105 194
3235 194 162 269 335 83 -252 -202 -267 -230 -88 115 339 326 398 3 -275 -48 -193 -137 -193 -20 279 258 447
3258 447 104 2 -502 -420 -132 -216 199 -15 130 224 -116 -338 134 -239 -342 -222 -49 457 318 298 159
3279 159 0 -190 -151 -355 -259 -256 293 251 139 173 19 14 -220 -150 -107 -316 85 92 434 -12 -6 -312 -201 -118 -189
3304 -189 103 -136 337 -77 271 250 -5 -94 -368 -124 -146 40 231 97 340 195 -162 -141 -217 -266 -42 -8
3326 -8 253 297 374 -51 167 -70 -137 -90 -10 -94 -108 19 48 74 -96 103 -310 -367 -205 -62 122 444 289 292 228
3351 228 -97 101 -175 -165 -181 -44 62 -22 117 105 -197 -372 -301 -71 25 10 15 176 -22 169 -22 40 -249
3374 -249 30 -109 7 57 259 105 70 -44 -344 -47 -371 -264 186 244 456 432 164 412 -21 -378 -205
3395 -205 -345 106 164 161 117 229 253 -191 -251 -217 -212 -98 0 -70 151 366 207 -88 -192 -397 36 -13 -137 74
3419 74 142 -91 18 9 25 -271 -150 -205 5 -278 269 224 200 -31 20 -150 -335 -46 -113 230 351 7 169
3442 169 87 13 -111 -193 -8 -220 134 149 305 191 34 -47 -55 -2 -110 -159 82 60 140 245 161 -133 -229 -324 -171
3467 -171 158 93 -84 -199 205 298 104 -174 -94 -197 -205 -60 235 279 404 210 130 -165 -222 -403 160 -217 330
3490 330 422 236 79 -305 -124 -10 -102 -79 -188 -208 450 173 354 -138 434 -82 -251 -128 -430 7 86 282
3512 282 273 -284 -164 -569 -199 -25 -367 70 -7 104 171 -135 42 -313 8 69 -280 -2 189 68 16 154
3534 154 -82 11 -199 82 79 -231 118 145 181 104 -13 -91 -13 -312 -254 -16 153 87 279 34 48 -129 -78 -155
3558 -155 -251 -162 190 125 48 343 -13 -33 -339 -323 -279 -89 122 126 670 87 228 -152 149 -256 -42 163 -39
3581 -39 126 186 390 -12 100 -345 -300 -140 -132 56 182 -36 125 135 108 -126 -80 -300 -29 -13 52 156 177 256
3605 256 -33 3 -133 -350 -299 -227 85 278 373 51 31 -42 58 40 -197 355 78 -21 161 -120 -91 -141 -124 -246
3629 -246 -10 92 45 326 40 -41 179 91 42 -441 -69 -201 174 144 -177 215 19 49 -253 1 2 -110 -186
3652 -186 54 -51 416 91 -21 -285 -78 -426 99 78 10 110 105 66 -234 160 -126 -143 45 91 59 265 361
3675 361 8 56 115 -420 59 -363 58 260 175 121 94 263 -197 -285 -267 -131 -259 39 -116 84 242 -113
3697 -113 181 -132 -316 -101 -246 36 30 323 160 200 -46 -243 -292 -565 -336 72 -77 -1 198 318 -34 -185
3719 -185 -154 -66 118 248 -55 34 255 95 -55 -289 62 -349 -109 -222 -105 375 -4 42 92 129 -55 15
3741 15 -106 26 107 -6 428 83 201 44 126 -156 -489 -207 35 21 -66 94 -26 -98 -171 -208 -112 154 249
3764 249 116 155 179 -82 -73 -100 -153 -152 -89 -109 -27 227 55 284 -192 -98 -161 -265 211 -55 138 345 85 132 182
3789 182 53 33 -202 -70 -109 87 232 -170 235 -270 15 -98 -244 42 -100 85 -201 156 359 124 -196
3810 -196 -140 -2 -254 -42 64 204 306 -106 37 169 116 -286 -224 -33 -39 56 133 208 91 191 -104 -60 6
3833 6 -83 201 15 268 209 196 -51 43 -56 -263 -43 -242 -2 51 178 100 90 129 -43 -359 -195 -108 122 100
3857 100 219 10 395 361 -275 -97 -584 41 -122 138 288 313 184 -184 -393 -238 -84 -120 -125 8 106 29
3879 29 132 -15 -95 -207 -152 -352 -140 -201 -11 16 154 41 -69 -238 161 51 -28 23 44 -110 136 -169 -152
3902 -152 21 -166 -171 -116 99 234 251 208 337 -312 50 -26 -63 25 17 19 -105 -36 269 13 -162 -2 -209 -273 -45
3927 -45 192 145 53 -141 205 -133 152 -177 -320 47 166 40 -80 53 278 120 -18 -143 -191 58 73 31
3949 31 118 295 45 -13 -215 -248 -56 -160 134 55 -108 90 257 65 163 48 -156 -238 -133 139 291 18
3971 18 -139 56 -290 -86 58 149 9 76 59 397 25 8 -167 51 -291 -44 35 -110 133 17 325 40
3993 40 -52 -218 38 -301 -23 -266 -247 59 62 -14 101 -1 -42 -51 26 90 73 186 143 167 82 -80 -268 -43 -69
4018 -69 -69 -45 24 225 -93 -15 -199 -79 100 5 -22 245 -237 169 -20 -22 -147 -94 -188 -103 69 1 -136 259 225
4043 225 86 60 72 19 -80 6 -114 129 143 18 -309 83 -209 -44 -11 -382 -137 234 270 252 -233 2 -55
4066 -55 -20 -142 -5 52 108 100 180 -8 46 275 -210 -96 67 57 -43 -70 287 114 207 48 -175 97 -53 136
4090 136 165 113 114 432 -59 143 -23 -37 -133 -79 72 -67 220 231 164 273 -119 -277 -123 91 30 237 65
4113 65 14 402 -138 6 -171 17 19 208 44 93 220 93 205 -25 52 24 -167 -64 72 24 166 347 -79
4136 -79 -10 41 -9 -171 -57 9 -84 -50 52 88 -135 68 -242 36 204 -102 202 5 396 129 -100 -270 193
4159 193 -293 -8 161 141 255 -162 -73 22 72 -124 -60 -253 -9 17 -93 -47 62 -84 -105 -26 -23 107 -52 65
4183 65 219 167 86 -58 -143 -32 -30 -107 -89 -35 58 236 52 -61 -62 105 -140 -179 7 -79 115 234 236 83 84 39
4209 39 -157 165 112 -23 -81 17 326 -38 317 147 -280 -135 62 242 136 -47 218 112 -275 9 25 -143
4231 -143 -126 -268 71 518 111 33 65 -231 -62 -123 55 -124 191 228 24 60 70 -202 -62 166 159 166 251 -166
4255 -166 327 -20 -22 136 -105 -206 28 31 -98 60 144 -24 -46 114 49 135 -323 -24 360 70 121 -25 -361
4278 -361 194 73 -90 -346 -172 -69 47 149 244 53 -30 -23 -227 125 -120 130 -353 79 -65 164 240 51
4300 51 132 -45 -122 -242 -417 216 -98 -148 -12 -69 -4 -231 -268 43 179 -157 2 -214 135 -159 -147 -71 53
4323 53 -172 -35 -161 127 185 43 -338 -75 -294 -41 152 71 4 37 -29 153 72 -5 -70 -105 24 314 -112
4346 -112 371 256 1 -97 -358 -38 -137 87 84 -134 180 -53 266 112 -185 87 -155 -179 -67 111 146 -57
4368 -57 -43 -41 75 -216 -109 -205 -30 236 112 -1 10 53 -158 3 27 -110 15 -82 71 52 129 284 130 114
4392 114 -168 38 -344 96 -57 136 194 -307 -25 -96 -121 -21 -82 -317 56 46 -12 -26 -76 -219 93 -153 -115
4415 -115 -223 -279 -175 -53 57 -101 8 -6 -18 103 -138 150 144 14 71 -100 57 -131 73 -86 22 -45
4437 -45 45 74 -263 82 -67 -37 -202 -160 131 15 104 -118 2 111 7 -115 -185 -26 29 -152 46 59 -75
4460 -75 27 8 205 -291 -172 -22 -67 182 64 -21 -153 235 212 -208 127 -33 -42 95 258 97 3 -180 209
4483 209 -98 -262 -95 164 -32 143 -96 -97 -61 31 279 -155 -112 36 -42 -121 -41 -326 123 178 -357 142 -186
4506 -186 113 90 -71 -144 96 -68 48 -63 -181 -321 -33 -134 28 52 -167 -27 -45 -35 -299 97 -22 69
4528 69 -9 -111 -37 -349 -155 -202 147 -70 -226 90 22 211 117 87 26 233 254 -145 -82 116 29 245 -25 91
4552 91 -131 -178 169 131 92 -148 -153 56 -122 193 6 -110 201 -222 22 -95 49 110 93 21 -189 117 85
4575 85 10 -219 -111 -120 -219 388 -205 -46 159 -88 1 -211 156 -210 -46 -10 326 -27 111 27 -16 -80 -235
4598 -235 -119 34 -94 -8 163 84 231 -206 159 -167 -234 -134 -312 1 -6 251 -84 124 -138 131 112 -100
4620 -100 85 78 -22 109 108 9 -136 8 -28 -65 102 -116 -27 -149 168 3 69 284 87 124 157 -138 53 144
4644 144 -13 -137 222 120 -106 -280 -50 -39 -106 242 0 148 -15 -39 245 -51 -20 -67 106 -52 37 150
4666 150 38 -388 -77 69 -30 148 -205 -222 236 123 -99 -134 101 -138 105 156 -150 -101 -242 54 -32 -349
4688 -349 -128 -201 -165 -210 -239 -130 -39 -103 128 37 -134 -196 -49 -83 127 145 35 316 -30 16 111 -84 18 144
4712 144 -224 158 -36 16 181 -200 56 49 -226 170 190 -70 144 143 -184 234 141 132 -135 -48 85 -161 52
4735 52 132 218 42 -119 -67 330 -37 -65 159 33 188 218 -163 -105 17 -90 177 12 -223 -196 53 -30 184
4758 184 147 -14 27 -45 -119 20 120 199 59 -70 -122 -62 42 -134 -27 92 -80 191 -55 -92 221 -1 130
4781 130 234 -226 -18 191 135 32 -13 -34 -17 -13 -228 -49 54 -137 -64 -234 -301 14 -216 66 -66 202 -232
4804 -232 -51 219 -78 81 -119 -206 -181 142 48 -11 116 49 94 71 -47 306 35 -123 -145 -20 -224 -83 1
4827 1 -14 83 108 -204 -178 -54 81 299 27 -324 205 133 -359 -108 379 106 -197 40 -98 20 -27 174 17
4850 17 -233 -32 -97 -6 -315 126 182 -234 -83 77 -99 -217 -159 -91 -27 55 12 122 85 68 -222 -59 103 -111
4874 -111 -68 249 133 335 -3 52 280 -203 24 46 163 61 224 -86 48 -69 -211 57 -81 -48 27 79
4896 79 -190 -104 -40 -180 -52 -41 -16 206 8 192 -184 61 210 0 160 -18 -31 -33 -336 144 -163 -88 -27
4919 -27 151 195 15 43 172 277 -118 2 221 -186 174 182 -33 209 -244 42 -39 123 123 -63 -96 313 -17
4942 -17 -116 -44 -113 -80 -153 -91 -108 19 138 -273 -85 -262 -14 -156 -67 -133 -6 -39 -80 -207 -250 37 -14 63 -85
4967 -85 -145 -26 181 15 29 -94 61 -30 7 58 47 76 -75 76 -72 -195 -159 161 -17 223 162 28 383
4990 383 148 73 60 26 -219 -75 19 -18 -30 263 83 -92 93 21 172 -237 -65 -27 164 11 -201 17 -19
5013 -19 320 -72 -52 -161 -255 -136 45 1 21 148 124 20 21 -155 -106 160 75 274 92 127 -165 -185 -139 41
5037 41 -100 126 47 95 -66 -115 75 -369 5 10 194 197 -73 4 125 -5 104 -101 -266 -39 394 -37 -9
5060 -9 113 -105 45 -175 -107 -83 -190 160 95 9 42 -54 -80 82 -10 147 219 27 227 -43 60 -148 298 143
5084 143 229 51 -279 40 -189 -148 124 315 -209 186 -160 296 -22 -23 -11 -39 138 51 -68 30 49 146 -65
5107 -65 -76 121 83 -21 339 -3 -61 -73 -65 449 128 138 23 114 -102 165 53 46 -27 125 55 -341 -127 -61 238
5132 238 423 286 -111 101 16 -52 -136 -56 -86 507 137 93 159 -13 -69 203 -119 124 -19 -208 196 -143 -70
5155 -70 -130 -142 120 54 55 -213 80 182 -35 -126 -13 -28 -210 -190 -89 203 126 -21 400 -63 59 124 -236 -87
5179 -87 126 -154 -96 87 112 115 117 289 -89 -98 26 -309 -9 230 128 10 -178 -50 37 -13 -248 -42 -190 88
5203 88 -85 0 -175 -69 79 262 -13 36 110 215 -147 -158 209 9 66 19 -117 -250 -122 215 73 241
5225 241 120 -85 -25 53 153 75 -12 107 -71 -106 -41 44 79 -392 -72 115 3 52 6 119 39 -247 103 -178
5249 -178 109 -347 -472 -55 79 100 -67 76 165 60 -77 64 -313 -137 126 75 69 356 -125 -21 70 22
5271 22 -122 158 67 41 -123 9 -203 -58 -23 -243 -14 -10 65 31 -30 -40 -410 -101 79 91 -96 -20 -256 -136
5295 -136 172 -114 238 -62 -128 -29 7 -9 -11 -317 -329 169 144 60 104 -36 62 -146 -193 404 -80 51 86 -91
5319 -91 199 -31 -164 39 173 49 -169 18 -231 87 -32 -73 -123 -196 -40 -80 -45 115 -99 -54 -35 58 31
5342 31 -94 -80 -26 1 -171 -35 150 73 -119 -77 -122 -233 -99 -89 224 -107 -227 302 -356 -153 209 -250 -326
5365 -326 96 246 -60 8 -111 150 28 -78 -138 -60 141 106 -15 35 294 13 157 -32 91 28 -25 -181
5387 -181 5 -28 76 70 -212 -341 -145 110 -122 -216 -282 -141 -98 -67 -38 68 -126 197 -167 -75 87 -70 -156
5410 -156 8 -69 162 -71 -11 -287 -140 91 35 -63 194 -35 -1 -401 -110 -104 -42 496 4 -255 -239 61 57 1
5434 1 108 62 -94 72 60 123 21 -75 -291 -78 -93 78 41 87 20 36 -128 23 143 -87 -211 128 -18 12
5458 12 30 -60 117 -97 -7 -236 -116 -85 -64 -62 -78 -143 30 -196 43 -94 -60 69 127 -22 -33 39 245 117 58
5483 58 150 -48 15 -76 93 136 70 296 192 95 -92 -58 -64 64 210 -279 97 -55 73 82 170 -198 62 2 124
5508 124 -98 188 0 168 -39 -96 83 -39 30 -190 65 -98 82 171 197 -82 -2 71 -198 -85 123 -211
5530 -211 50 39 143 71 373 -165 22 -30 -26 270 -109 133 85 306 -340 -202 72 -174 54 65 194 -165
5552 -165 -42 24 -428 -119 194 262 -439 -37 38 123 -221 145 -171 -185 -291 -96 -250 40 144 -153 42 11
5574 11 -207 -124 68 17 -130 -42 -65 -37 -155 -202 -51 -33 25 -171 95 47 -80 58 119 -42 43 -241 279 -7
5598 -7 -195 196 36 11 -139 82 13 -12 -41 47 -89 124 166 -359 179 -140 -206 190 -39 88 -113 131 -257
5621 -257 -103 117 -9 22 -38 119 254 157 -251 404 -120 -99 -52 -93 7 71 -74 -27 -156 120 172 -292 -1
5644 -1 25 20 46 -532 -204 -128 -130 -39 278 -41 -149 -199 -114 -30 -139 -159 -109 36 -229 -50 -57 140 -14 175 -19 118
5670 118 -56 -169 -83 -212 63 12 -192 -209 -5 -196 -279 -218 -231 -42 142 -118 -23 -172 -290 -70 -153 -106 32
5693 32 256 -263 6 -112 -73 37 -108 211 280 -26 80 -11 -206 36 -132 149 -90 -27 -74 163 88 29 -75
5716 -75 -12 36 111 -70 -55 -94 245 42 -41 142 120 -86 -67 -205 20 12 -56 -41 0 122 3 -119 82 -104 -130
5741 -130 -108 278 -134 -78 17 -201 126 37 -54 -54 57 -187 -46 -88 -66 -50 8 -147 112 -161 -77 58 164 167 84
5766 84 154 -52 -211 107 84 -18 197 -93 -27 217 66 47 -115 -55 94 -187 -41 -4 -4 -303 165 -99 53
5789 53 312 49 -161 211 15 -44 23 -98 183 217 -69 -30 -67 -48 126 60 160 -38 -157 -34 -78 12 -250
5812 -250 -56 45 -304 159 306 189 -13 -225 -125 -160 -184 -13 223 165 -46 -59 65 32 110 -76 -140 215
5834 215 193 -153 -412 -94 21 121 141 -56 -107 60 -21 -35 66 192 -188 234 -141 108 -173 32 133 -378
5856 -378 95 -209 -3 -168 -17 12 11 91 141 -33 82 -219 -110 -18 14 201 -37 163 121 160 -24 100 10
5879 10 -3 68 15 172 -31 -101 29 -32 295 187 -147 -75 -164 -50 -52 -83 -114 159 300 76 235 108 97 -65
5903 -65 211 -212 -181 74 -427 13 -75 0 -83 -137 -87 -26 -98 -123 353 -203 179 -199 9 182 101 -57 56 -36
5927 -36 195 12 211 51 114 263 60 -11 -85 134 -40 -211 -248 265 97 136 -91 -19 20 80 -52 26 143
5950 143 368 49 58 118 155 69 138 64 -50 -57 111 -101 -55 -65 93 -135 -17 134 37 -68 169 135 58 -54 -34
5975 -34 234 -89 -82 -3 189 141 -24 149 84 159 228 200 140 150 -78 171 -120 272 119 -82 -92 279 12 158
5999 158 -13 61 -143 86 -96 -118 -285 3 91 -100 130 145 -216 -214 -23 200 -310 58 0 11 68 104 92 -237
6023 -237 -33 -66 -157 89 31 15 12 74 -283 2 -87 22 -61 49 -34 102 112 -45 -65 -11 -45 -91 71 -135 -149
6048 -149 206 67 -199 -46 -198 -93 24 -78 -167 -19 -25 -100 -44 153 129 8 -7 241 113 -6 -104 23 45
6071 45 180 -260 -98 119 -160 42 -125 103 66 72 -162 93 241 -46 -60 -229 -141 -25 76 140 141 -120 -94
6094 -94 -126 52 -49 -83 -240 -247 319 84 -35 64 -70 47 -207 -249 18 -118 -230 -275 143 -89 94 27 33 -225
6118 -225 22 85 -76 229 -28 -232 105 31 -205 -6 -181 107 -265 24 205 6 52 60 -220 142 -93 -338
6140 -338 -50 -141 -79 186 6 87 -31 21 -36 -107 135 -153 40 132 81 -106 148 -2 -14 -7 46 -20 -15 255 -404
6165 -404 83 -61 -36 -87 -252 -80 -85 58 2 -29 21 -117 81 79 55 116 225 -83 -130 270 -242 90 -333 -271
6189 -271 -78 89 -164 -148 -55 18 99 99 -160 -21 370 -13 -260 285 333 63 166 -77 121 -180 -80 -108 -25
6212 -25 76 -85 -188 -344 61 -19 195 -139 55 77 -36 -123 3 77 -165 -88 -46 -143 -48 -74 39 15 372 102
6236 102 5 -73 -87 266 -294 254 -15 294 93 -165 -70 -51 136 150 -10 50 30 57 68 63 161 -107 -7 -87 208
6261 208 51 74 -134 -55 -190 -17 88 -171 -183 17 64 91 -18 -231 -140 -43 10 -28 296 -43 -18 63 29 47
6285 47 220 130 57 -61 -243 170 385 14 175 41 193 182 -46 -242 -139 100 -352 -225 41 90 93 28 -6
6308 -6 -10 147 23 -125 -112 -13 -22 28 -18 81 106 -178 244 70 -194 -113 -103 -5 82 -143 -48 53 -126 -306 -104 -93
6334 -93 100 -1 -325 114 22 -38 81 78 67 -1 75 -227 8 -249 106 46 -52 -188 -266 -113 -79 -187 -30 152
6358 152 331 -50 -286 -218 20 25 310 154 81 -95 -41 172 59 -18 -81 272 169 21 101 22 -63 261 27
6381 27 84 5 14 75 36 -128 -82 -184 -37 -24 120 20 100 -55 1 123 -260 62 -66 121 -44 53 147 57 149
6406 149 80 195 -37 -22 -163 201 318 -72 226 -94 -46 -240 97 -165 -115 190 -136 89 -106 -50 147 -115
6428 -115 270 -140 14 -47 268 -3 -100 -160 -221 66 94 197 5 -198 -102 -77 30 177 -185 91 53 -35 195
6451 195 -92 -13 156 35 24 -111 -329 115 119 30 -121 7 12 1 162 203 -243 -90 156 232 -240 -143 214 4
6475 4 -6 -168 213 -162 138 -127 45 179 147 -13 -52 1 115 125 206 201 -73 166 -178 -119 143 37 155 -139
6499 -139 73 97 -46 -226 167 64 -196 -162 -147 -43 208 22 -15 -30 -120 -48 -198 -209 -132 8 72 -160 -186 62
6523 62 117 21 -69 -10 171 -19 244 -124 -44 -105 73 -374 40 213 61 1 187 280 72 138 -214 -260 -109 -41
6547 -41 49 -58 109 -88 -5 -179 43 123 -135 48 21 -334 -25 -284 125 -203 -99 21 90 -118 -183 -222 -32
6570 -32 -130 -132 -35 11 -61 224 -106 -51 32 -244 122 -50 80 12 190 176 -7 80 128 108 -7 114 21 -184 -18
6595 -18 98 303 -133 -197 17 -76 -21 231 -72 -128 -4 172 87 -91 -58 -47 -46 149 41 -158 -44 156 9
6618 9 -144 88 -41 323 -175 194 -107 -28 -21 108 -72 44 293 291 112 106 -159 -85 -3 -179 58 -66 -102 -28
6642 -28 -50 -161 186 -45 -11 -163 -380 -45 -15 -232 -51 -9 47 -52 -168 95 -252 -67 -59 65 -113 -138 176
6665 176 -213 -74 42 142 -52 -54 -276 -47 61 215 -45 -65 107 -54 81 246 61 -122 -164 63 -28 258
6687 258 44 -60 -40 -76 60 -2 287 -142 130 -61 -412 -110 128 -156 -59 196 95 172 -13 141 53 140
6709 140 199 149 43 74 -52 -89 464 -82 76 147 78 -145 -197 43 -58 -68 -36 -142 -3 -90 -154 -23 144 -178
6733 -178 -54 -190 -86 -92 -78 -139 -50 -135 100 226 -93 -136 133 -108 17 353 15 68 -95 -24 -47 -10 -18 -124
6757 -124 119 -255 90 -117 52 289 -216 -182 -173 -10 80 -12 35 180 -20 120 -29 -117 234 76 -77 85
6779 85 36 -297 42 -209 -240 243 229 106 52 106 -182 61 178 334 7 -224 253 210 129 -52 206 34 -86
6802 -86 -265 -118 32 -127 67 -264 -68 -34 -103 -399 -67 42 -75 18 -143 -178 267 17 -107 137 205 80
6824 80 237 -51 -33 -72 -85 -32 -164 -120 22 -15 -180 27 -229 451 247 -120 -133 56 90 -212 18 366 69
6847 69 236 -119 -222 -263 -196 -224 96 120 -166 215 64 219 -55 -137 -60 66 72 -98 340 -148 -243 208 81
6870 81 -146 -21 22 253 181 52 140 -17 -175 -90 -159 205 -42 -352 -82 -34 -17 312 242 176 209 -147 250 120
6894 120 -145 -13 -107 -167 8 393 -58 -94 -51 -115 57 185 -80 -212 139 292 -73 65 -338 -190 -158 98
6916 98 26 15 -60 107 -82 -336 284 180 -81 108 225 108 -28 169 136 197 48 227 62 149 76 -60 39
6939 39 157 -62 187 224 65 56 263 31 312 -38 78 -42 -1 3 -142 -67 77 -40 168 -271 -68 23 128
6962 128 -152 268 79 22 -69 -102 -253 -102 263 79 -171 -123 -46 -271 274 -43 -397 -242 30 -3 107 -250
6984 -250 12 -110 129 87 -55 -197 -315 16 211 -174 46 -115 -18 141 -126 -50 100 -99 59 -166 -128
7005 -128 166 6 -104 66 -25 -91 -83 -7 -24 -158 107 -241 170 -407 64 -29 -39 82 -53 -15 125 73 101 -266
7029 -266 -114 -176 -148 -11 165 -81 -76 -128 -181 29 -53 -244 -79 87 136 237 152 -124 -454 77 -50 -5 92 -17
7053 -17 -176 80 -62 167 90 -436 -53 -105 -203 -12 -87 -35 73 89 -95 81 48 134 -10 82 46 260 27 -170
7077 -170 -137 319 -52 144 18 -35 -32 112 133 -60 -17 -73 20 -92 -286 136 45 150 -236 194 -55 55 -19
7100 -19 120 -150 81 196 198 -12 -116 76 -228 -89 279 -161 -364 -37 -266 204 -162 43 326 -312 -35
7121 -35 -38 -185 169 -157 -75 6 311 53 123 -209 164 213 -181 72 97 -207 -227 -53 -75 15 93 -106 184 -69
7145 -69 -118 198 111 -55 -71 -286 267 37 -150 21 6 98 -45 21 -14 -88 -90 198 -6 -50 -338 141 -237 90
7169 90 -31 -150 227 88 -104 153 50 7 175 -17 82 276 105 25 -28 78 -24 99 -20 -228 69 -76
7191 -76 48 -107 167 30 -18 138 -190 0 240 100 64 456 49 147 7 100 -55 85 -112 12 183 290
7213 290 -86 154 -47 32 261 -89 109 -9 95 -8 38 118 171 0 41 245 2 150 -55 9 -185 122
7235 122 74 -169 6 85 -111 175 -321 10 -114 41 -2 12 -71 -293 106 43 32 15 -65 171 47 160 -309
7258 -309 -33 -13 151 -158 -26 -66 -79 -57 -9 -77 -187 -123 -30 233 -237 -73 13 117 45 -70 -107 84 -195 -52
7282 -52 152 127 -211 -22 68 -56 -22 -74 75 -243 257 -255 59 -39 455 -93 -177 318 204 56 -207 -187 -58
7305 -58 -27 221 -210 242 241 -45 32 86 -276 165 -112 -234 324 -6 -201 62 -254 -236 -6 -144 -41 202
7327 202 63 -274 -180 238 -104 -121 -314 -30 -197 102 42 -141 -54 155 15 98 120 6 -115 -104 57 -164
7349 -164 181 -135 7 -57 -5 -61 -228 47 -73 61 -213 2 -167 180 55 195 108 -142 -111 5 -80 42
7371 42 68 -201 36 153 -189 18 -28 187 -27 95 178 392 75 275 -77 134 83 163 -48 -1 28 -72 65
7394 65 -399 130 262 21 169 182 152 26 14 -34 208 -106 -150 48 245 21 -126 -16 88 -297 -154 -186
7416 -186 157 302 -129 -39 -54 -148 129 -303 -1 131 -112 -178 -86 90 55 -111 -58 251 153 -60 -153 89 97 55
7440 55 -77 320 -230 65 -118 -54 117 -145 -119 31 -108 167 20 -115 179 25 -247 -124 27 -42 -140 177
7462 177 139 82 85 -114 126 152 76 -116 96 -31 -39 -189 -35 -217 99 84 245 -43 -40 70 -149 241 -50 -251
7486 -251 -61 -1 3 -251 59 -55 -11 232 -142 72 -74 -39 -29 153 109 -45 240 -250 21 93 -138 -197 76
7509 76 252 -70 -326 -155 135 -325 5 0 -42 -129 40 267 62 -15 -63 -155 7 131 172 -144 10 225 -68
7532 -68 136 -21 -186 -218 62 -313 -87 130 -93 -197 78 21 69 17 -99 157 -69 -157 40 -298 -169 86
7554 86 88 41 145 -325 238 229 49 -1 -36 -21 1 98 -79 -94 169 29 20 243 129 -182 15 -113 93 116 78
7579 78 -249 -310 -94 -270 -155 91 121 93 -148 -216 -8 -4 149 31 4 -58 179 48 -13 -142 -4 -3 -121 55
7603 55 31 133 -51 -265 285 289 -2 -10 90 264 -237 -189 -285 34 -29 16 157 86 -133 -60 -38 -100 -64 239 -202
7628 -202 10 -100 59 -16 206 94 -31 280 75 206 55 -2 -64 -88 -196 -235 114 92 -68 -37 -78 -160 65
7651 65 -37 -214 -38 58 101 -166 49 10 188 65 -170 50 -72 18 171 131 102 28 -11 -196 -12 -35 98
7674 98 2 -164 91 -84 -104 -90 -90 160 287 144 27 -75 -79 141 -211 -44 384 274 -114 -51 125 -266 -221
7697 -221 -164 -13 97 -24 91 371 -134 253 -193 12 -341 105 -122 181 -224 -294 54 9 321 107 107 -224
7719 -224 -174 54 63 -49 -216 38 273 339 226 -134 109 -242 32 -99 30 -109 196 239 -103 149 -185 49
7741 49 -69 -178 125 -98 -279 -212 -162 -29 114 -156 -49 -144 -108 -73 -258 71 201 123 185 -220 -96 160 99
7764 99 -115 13 135 191 32 35 -56 -16 232 81 -27 -40 135 184 101 -89 154 -38 -86 -69 59 -47 75 -71
7788 -71 -195 -85 -150 78 89 -22 59 -90 -158 47 113 20 -124 -15 -12 72 -169 141 -153 177 192 -142 47 -229
7812 -229 38 292 -35 -78 364 74 -77 40 22 23 -116 -130 -6 -320 -109 -33 -77 77 -175 218 68 -127
7834 -127 44 35 -30 -116 -99 156 40 58 -85 102 -34 78 -123 104 53 131 31 117 -109 -57 144 11 -123
7857 -123 -64 165 -67 -7 -42 226 15 -80 -219 -94 -49 27 -204 58 -85 -81 -20 38 -15 -41 -338 -95 -86 -55 -32
7882 -32 134 -44 282 -192 -310 -212 -227 -207 -187 125 66 139 182 -59 3 43 101 147 107 369 -52 82 -198 125
7906 125 213 367 -109 -107 129 158 207 -140 80 -80 153 38 -64 -76 80 -141 -263 -179 -229 -84 -131 -65 181
7929 181 271 -56 89 64 -350 147 85 -50 -147 -81 -185 11 196 173 -45 -10 -43 62 -17 -156 -108 -57 -126 -26
7953 -26 -20 -87 124 9 -103 35 121 -125 -242 23 -138 -65 -289 71 224 76 -238 -383 -148 -82 208 -181
7975 -181 -103 63 57 -134 -66 1 -86 -9 73 149 -46 -149 -197 -124 -275 -75 272 -189 395 49 2 -77 86 231
7999 231 217 -1 60 -243 -139 4 -345 -4 51 -213 27 -278 -33 104 -161 -99 81 96 -131 76 -61 273
8021 273 -251 -243 -101 165 -33 -122 -136 -98 147 58 86 46 8 -16 120 189 -123 -22 146 61 193 -110 85 -142
8045 -142 -12 -103 405 279 118 -93 -105 -114 -50 251 -2 -149 -97 -6 53 18 228 -71 109 -89 7 -28 11 -120
8069 -120 215 -17 -83 93 22 -100 -231 -102 22 83 -31 -66 -127 -59 -51 287 151 -196 -74 19 29 -39 17 -28
8093 -28 61 47 -51 304 80 -40 101 15 -46 404 3 152 -89 39 -66 -34 181 41 -7 108 1 -48 326
8116 326 -130 -172 -198 60 324 -4 113 84 102 -27 -78 -121 7 110 -64 -44 -84 -27 142 125 -1 -55 -221 -173
8140 -173 2 -11 -162 -128 95 -296 -29 -204 -313 99 248 -8 39 11 -55 -105 -143 -10 -283 105 -14 244
8162 244 30 50 -48 -132 126 92 -129 24 -111 68 233 70 -191 80 -25 66 -84 168 68 -158 -166 45
8184 45 -168 35 -93 -78 -46 2 101
8191A01
##END NTUPLES=NMR FID
##END=
