##TITLE=1H_DE-122K3_HCl
 200.13MHz,D2O.
 8 sc
 
 2.1.2026
##JCAMPDX= 6.0         $$ Bruker NMR JCAMP-DX V2.0
##DATA TYPE= NMR FID
##DATA CLASS= NTUPLES
##ORIGIN= UXNMR, Bruker Analytische Messtechnik GmbH
##OWNER= pz
$$ XWIN-NMR		Version 3.5
$$ Mon Feb  2 13:43:36 2026 Russian Standard Time (UT+4h)  she@DPX200
##.OBSERVE FREQUENCY= 200.1313
##.OBSERVE NUCLEUS= ^1H
##.DELAY= (6, 6)
##.ACQUISITION MODE= SIMULTANEOUS
##.ACQUISITION SCHEME= undefined
##.AVERAGES= 8
##.DIGITISER RES= 18
##SPECTROMETER/DATA SYSTEM= spect
##.PULSE SEQUENCE= zg30
##.SOLVENT NAME= DMSO
##.SHIFT REFERENCE= (INTERNAL, DMSO, 0, 14.3821)
##AUDIT TRAIL= $$ (NUMBER, WHEN, WHO, WHERE, WHAT)
$$ ##TITLE= Audit trail, XWIN-NMR		Version 3.5
$$ ##JCAMPDX= 5.01
$$ ##ORIGIN= Bruker BioSpin GmbH
$$ ##OWNER= she
$$ F:/spectra/data/she/nmr/H-C/1/audita.txt
$$ ##AUDIT TRAIL=  $$ (NUMBER, WHEN, WHO, WHERE, WHAT)
(   1,<2026-02-02 13:42:20.87 +0400>,<she>,<DPX200>,
      <created by zg, POWCHK disabled, PULCHK disabled
       configuration hash MD5:
       00 E9 B6 7A A2 85 ED C7 34 08 36 98 17 FE 4E 26
       data hash MD5: 16K
       90 CD DC 02 29 C0 7C 4C 23 B7 87 1E D7 7F 10 AA>)
$$ ##END=
$$ 
$$ hash MD5
$$ 48 09 B9 F2 25 2C 13 7A 13 30 30 30 46 A3 FC A6
##$RELAX= 
##$RELAX= 
##$RELAX= 
##$RELAX= 
##$RELAX= 
##$RELAX= 
$$ Bruker specific parameters
$$ --------------------------
##$DU= <F:/spectra>
##$EXPNO= 1
##$NAME= <H-C>
##$PROCNO= 1
##$TYPE= <nmr>
##$USER= <she>
##$AMP= (0..31)
100 100 100 100 100 100 100 100 100 100 100 100 100 100 100 100 100 100 
100 100 100 100 100 100 100 100 100 100 100 100 100 100 
##$AQSEQ= 0
##$AQ_mod= 1
##$AUNM= <au_zg>
##$AUTOPOS= <>
##$BF1= 200.13
##$BF2= 200.13
##$BF3= 200.13
##$BF4= 200.13
##$BF5= 200.13
##$BF6= 200.13
##$BF7= 200.13
##$BF8= 200.13
##$BYTORDA= 1
##$CFDGTYP= 0
##$CFRGTYP= 5
##$CHEMSTR= <none>
##$CNST= (0..31)
1 1 145 1 1 1 1 1 1 1 1 1 1 1 1 1 1 1 1 1 1 1 1 1 1 1 1 1 1 1 1 1 
##$CPDPRG= <>
##$CPDPRG1= <>
##$CPDPRG2= <>
##$CPDPRG3= <>
##$CPDPRG4= <mlev>
##$CPDPRG5= <mlev>
##$CPDPRG6= <mlev>
##$CPDPRG7= <mlev>
##$CPDPRG8= <mlev>
##$CPDPRGB= <>
##$CPDPRGT= <>
##$D= (0..31)
0 0.7 0 0 0 0 0 0 0 0 0 0.03 0 0 0 0 0 0 0 0 0 0 0 0 0 0 0 0 0 0 0 0 
##$DATE= 1770025340
##$DBL= (0..7)
120 120 120 120 120 120 120 120 
##$DBP= (0..7)
150 150 150 150 150 150 150 150 
##$DBP07= 0
##$DBPNAM0= <>
##$DBPNAM1= <>
##$DBPNAM2= <>
##$DBPNAM3= <>
##$DBPNAM4= <>
##$DBPNAM5= <>
##$DBPNAM6= <>
##$DBPNAM7= <>
##$DBPOAL= (0..7)
0.5 0.5 0.5 0.5 0.5 0.5 0.5 0.5 
##$DBPOFFS= (0..7)
0 0 0 0 0 0 0 0 
##$DE= 6
##$DECBNUC= <off>
##$DECIM= 32
##$DECNUC= <off>
##$DECSTAT= 4
##$DIGMOD= 1
##$DIGTYP= 9
##$DL= (0..7)
0 120 120 120 120 120 120 120 
##$DP= (0..7)
150 150 150 150 150 150 150 150 
##$DP07= 0
##$DPNAME0= <>
##$DPNAME1= <>
##$DPNAME2= <>
##$DPNAME3= <>
##$DPNAME4= <>
##$DPNAME5= <>
##$DPNAME6= <>
##$DPNAME7= <>
##$DPOAL= (0..7)
0.5 0.5 0.5 0.5 0.5 0.5 0.5 0.5 
##$DPOFFS= (0..7)
0 0 0 0 0 0 0 0 
##$DQDMODE= 0
##$DR= 18
##$DS= 0
##$DSLIST= <SSSSSSSSSSSSSSS>
$$ [...]
##$SUBNAM0= <"">
##$SUBNAM1= <"">
##$SUBNAM2= <"">
##$SUBNAM3= <"">
##$SUBNAM4= <"">
##$SUBNAM5= <"">
##$SUBNAM6= <"">
##$SUBNAM7= <"">
##$SUBNAM8= <"">
##$SUBNAM9= <"">
##$SW= 18.0517328524113
##$SWIBOX= (0..15)
0 0 2 0 0 0 0 0 0 0 0 0 0 0 0 0 
##$SW_h= 3612.71676300578
##$TD= 16384
##$TD0= 1
##$TE= 0
##$TE2= 300
##$TE3= 300
##$TEG= 300
##$TL= (0..7)
0 120 120 120 120 120 120 120 
##$TP= (0..7)
150 150 150 150 150 150 150 150 
##$TP07= 0
##$TPNAME0= <>
##$TPNAME1= <>
##$TPNAME2= <>
##$TPNAME3= <>
##$TPNAME4= <>
##$TPNAME5= <>
##$TPNAME6= <>
##$TPNAME7= <>
##$TPOAL= (0..7)
0.5 0.5 0.5 0.5 0.5 0.5 0.5 0.5 
##$TPOFFS= (0..7)
0 0 0 0 0 0 0 0 
##$TUNHIN= 0
##$TUNHOUT= 0
##$TUNXOUT= 0
##$USERA1= <user>
##$USERA2= <user>
##$USERA3= <user>
##$USERA4= <user>
##$USERA5= <user>
##$V9= 5
##$VALIST= <valist>
##$VCLIST= <CCCCCCCCCCCCCCC>
##$VD= 0
##$VDLIST= <DDDDDDDDDDDDDDD>
##$VPLIST= <PPPPPPPPPPPPPPP>
##$VTLIST= <TTTTTTTTTTTTTTT>
##$WBST= 1024
##$WBSW= 4
##$XGAIN= (0..3)
0 0 0 0 
##$XL= 0
##$YL= 0
##$YMAX_a= 505856
##$YMIN_a= -478080
##$ZGOPTNS= <>
##$ZL1= 120
##$ZL2= 120
##$ZL3= 120
##$ZL4= 120
##$ABSF1= 10
##$ABSF2= 0
##$ABSG= 5
##$ABSL= 3
##$ALPHA= 0
##$AQORDER= 0
##$ASSFAC= 0
##$ASSFACI= 0
##$ASSFACX= 0
##$ASSWID= 0
##$AUNMP= <proc_1d>
##$AZFE= 0.1
##$AZFW= 0.1
##$BCFW= 1
##$BC_mod= 2
##$BYTORDP= 1
##$COROFFS= 0
##$CY= -3
##$DATMOD= 1
##$DC= 2
##$DFILT= <>
##$DTYPP= 0
##$F1P= 0
##$F2P= 0
##$FCOR= 0.5
##$FTSIZE= 0
##$FT_mod= 4
##$GAMMA= 1
##$GB= 0.15
##$INTBC= 1
##$INTSCL= 1
##$ISEN= 128
##$LB= 0.25
##$LEV0= 0
##$LPBIN= 0
##$MAXI= 10000
##$MC2= 0
##$MEAN= 0
##$ME_mod= 0
##$MI= 1.114404
##$NCOEF= 0
##$NC_proc= 0
##$NLEV= 6
##$NOISF1= 3.799351
##$NOISF2= 2.8
##$NSP= 1
##$NTH_PI= 0
##$NZP= 0
##$OFFSET= 14.38212
##$PC= 1
##$PHC0= -3863.954
##$PHC1= 7.592312
##$PH_mod= 1
##$PKNL= yes
##$PPARMOD= 0
##$PSCAL= 0
##$PSIGN= 0
##$REVERSE= no
##$SF= 200.129724274929
##$SI= 16384
##$SIGF1= 3
##$SIGF2= 2
##$SINO= 400
##$SIOLD= 16384
##$SREGLST= <1H.CDCl3>
##$SSB= 0
##$STSI= 0
##$STSR= 0
##$SW_p= 3205.1282051282
##$SYMM= 0
##$S_DEV= 0
##$TDeff= 0
##$TDoff= 0
##$TI= <>
##$TILT= no
##$TM1= 0
##$TM2= 0
##$TOPLEV= 0
##$USERP1= <user>
##$USERP2= <user>
##$USERP3= <user>
##$USERP4= <user>
##$USERP5= <user>
##$WDW= 1
##$XDIM= 8192
##$YMAX_p= 0
##$YMIN_p= 0
$$ End of Bruker specific parameters
$$ ---------------------------------
##NTUPLES= NMR FID
##VAR_NAME=  TIME,          FID/REAL,        FID/IMAG
##SYMBOL=    X,             R,               I
##VAR_TYPE=  INDEPENDENT,   DEPENDENT,       DEPENDENT
##VAR_FORM=  AFFN,          ASDF,            ASDF
##VAR_DIM=   8192,          8192,            8192
##UNITS=     SECONDS,       ARBITRARY UNITS, ARBITRARY UNITS
##FACTOR=    0.0002768,     1,               1
##FIRST=     0,             0,               0
##LAST=      2.2672688,     0,               0
##MIN=       0,             -478080,         0
##MAX=       2.2672688,     505856,          0
$$ Real data points
##PAGE= N=1
##DATA TABLE= (X++(R..R)), XYDATA
$$ [...]
2935a17l002j735p13J408K922L341K433R49p22k514l417k865j458L19J909L141
$$ -117 -3119 -4854 -5567 -4159 -1237 2104 4537 5486 4764 2250 -1167 -4032 -5490 -5171 -3262 -121
2951a21L211K062L65j605k719l395k398q82Q84K471L349K685J220m09j985k976
$$ -121 3090 5152 5517 3912 1193 -2202 -4600 -5482 -4598 -2127 1222 3907 5127 4718 2733 -243
2967b43k913j678j26J573K887L051K163L90j158k555l082k395j207Q68K334K846
$$ -243 -3156 -4834 -4960 -3387 -500 2551 4714 5104 3946 1391 -1691 -4086 -5293 -4425 -2091 755
2983G55K738J507p6j826k893k545k258l13J271K499K827K301Q51p94k306k839
$$ 755 3493 5000 4924 3098 205 -2340 -4598 -4911 -3640 -1141 1686 3987 4838 4044 1738 -1101
2999a101k347j416N43J883K774K623J673k2j404k630k892j921n00Q81K403K926
$$ -1101 -3448 -4864 -4321 -2438 336 2959 4632 4610 3206 576 -2316 -4237 -4737 -3856 -1453 1473
3015A473K243R74n34j802k692k530j532n1J611K358K809J596M90j106k203k621
$$ 1473 3716 4690 4156 2354 -338 -2868 -4400 -4451 -2840 -482 2327 3923 4413 3307 1104 -1517
3031a517k083r45P04K027K820K245J144j2k243k254k521j479j20R48K496K654
$$ -1517 -3600 -4545 -3841 -1814 1006 3251 4395 4383 2140 -114 -2635 -4114 -4234 -3286 -790 1864
3047A864K008N21j104j950k341k173q39J96J536K860K014J444P7j578k283k392
$$ 1864 3872 4393 3289 1339 -1002 -3175 -4014 -3818 -2282 578 2592 4036 4113 2535 252 -2140
3063b140j584m07J121K096K303K004P51o02j855k440k024j279Q4J645K174K188
$$ -2140 -3724 -4131 -3010 -914 1389 3393 4144 3542 1687 -753 -2777 -4056 -3972 -2327 -153 2035
3079B035J641K20r67k069k390j612p49P09J724K289J884R75l83j450k221j987
$$ 2035 3676 3896 2929 860 -1530 -3142 -3891 -3182 -1458 831 2715 3690 3307 1857 -364 -2351
3095b351j221j32J218K191K267J368N49r27j943k228j588r46M42J591K031K103
$$ -2351 -3572 -3704 -2486 -295 1972 3340 3889 2962 1019 -1209 -2797 -3743 -3301 -1710 321 2424
3111B424J064l9j310j916j991j400j25O39J827K092J530O79p04j700j864j766
$$ 2424 3488 3449 2139 223 -1768 -3168 -3293 -2654 -827 1265 2795 3474 2770 1070 -794 -2560
3127b560r24L25J462J928J974J062J66j205j786j956j481m32P46J597J928J618
$$ -2560 -3484 -3159 -1697 231 2205 3267 3433 2228 442 -1514 -2995 -3427 -2681 -1084 844 2462
3143B462P72l67j369j850j622j156O5J218J736J763J114M48r73j563j944j387
$$ 2462 3234 2867 1498 -352 -1974 -3130 -3065 -1847 -111 1652 2766 3214 2241 678 -1266 -2653
3159b653n49N34J578J784J631P79j44j196j706j812j304j7Q94J691J724J312N16
$$ -2653 -3202 -2668 -1090 694 2325 3104 2960 1764 58 -1754 -3058 -3075 -2181 -490 1234 2546 3062
3176C062o36j385j769j418p64K14J387J612J716Q48r2j008j587j784r86m14Q18
$$ 3062 2426 1041 -728 -2146 -2910 -2696 -1309 303 2019 2867 2775 1767 180 -1604 -2590 -3004 -2186
3193b186J436J747J373N45m00j203j733j548q27j1J072J626J495J154K29p13j479
$$ -2186 -750 997 2370 2915 2515 1312 -421 -1969 -2796 -2807 -1735 -109 1386 2540 2769 2056 577
3210E77j666j233l71N76J276J495J328O89l98r94j609j424p08j22Q81J464J532
$$ 577 -1089 -2322 -2693 -2117 -841 654 1982 2671 2273 1279 -330 -1754 -2462 -2584 -1703 -239 1293
3227A293J179K89p26j284j724j233l91L92J001J649J133P77l5q25j415j527p94
$$ 1293 2472 2761 2035 751 -973 -2206 -2597 -2205 -1204 445 1578 2355 2320 1495 80 -1447 -2241
3244b241j27P52J186J386R69N47n95j174j425j032p84K73J084J328J468Q40j80
$$ -2241 -2368 -1616 -430 956 1925 2472 1877 703 -722 -1754 -2538 -2265 -1181 147 1615 2455 2275
3261B275n24j346j468r42l46M82J117J389J207L46j61j276j168r61m31n60J040
$$ 2275 1751 405 -1063 -2005 -2351 -1869 -752 637 1844 2190 2029 753 -415 -1376 -1807 -2367 -1327
3278a327J399J133Q77L6l82j319j565p72m14L53J242J466R97L16N2r82j139j288
$$ -1327 72 1205 2082 2118 1736 417 -1148 -1920 -2334 -1981 -739 727 1724 2040 2092 1110 -29 -1317
3296a317o49k97O48J339J130R80L22m15j060j219j156m25L30Q95J165J236N01
$$ -1317 -1966 -2263 -1615 -276 854 1834 2156 1741 681 -538 -1694 -2119 -1789 -894 271 1507 2008
3313B008p8j005j031j108o43l85Q30Q28J676N75O83n09j020j026j379l29m3R98
$$ 2008 1930 925 -106 -1214 -1857 -2242 -1412 -584 1092 1667 2350 1841 821 -205 -1584 -1913 -1956 -958
3331i58J122J112M66K62o32j159j450m34j84O08Q15J043J119J64l58o72j236j193
$$ -958 164 1276 1742 2004 1372 213 -1237 -1671 -1855 -1247 -432 611 1730 1894 1536 864 -372 -1565
3349a565l30J48P24J138J107M94J41m04j165j053n73p0n0J412P16R66l95J36K42
$$ -1565 -1895 -1747 -1023 115 1222 1716 1857 1453 288 -765 -1338 -1408 -1458 -46 670 1636 1241 1377 1619
3368A619j803l62j377o5O26J275R95N74J33p8j229j220m15j58K88M61J330R20
$$ 1619 -184 -546 -1923 -1988 -1362 -87 908 1482 1615 1537 308 -912 -1327 -1485 -1197 -736 594 1514
3386A514K78l02j25j600n29o55l7L87R44R52O12K68l64q98r47p88m28K29P64Q68
$$ 1514 1792 1490 1365 -235 -764 -1419 -1456 -1069 -125 827 1439 1707 1343 445 -502 -1290 -1718 -1489 -725 143
3406A43J061M96j34n70j029q47o17j19L91R33R49M85L35K6j035j336Q0r36P83
$$ 143 1204 1700 1566 996 -33 -880 -1497 -1616 -1225 -292 657 1142 1477 1503 468 -868 -788 -1724 -941
3425i41N94N41O46L40M03q27m15j306m44k43N18O82J065P12L55l93o23r98o59
$$ -941 -347 194 840 1180 1583 756 341 -965 -1409 -1652 -1134 -452 613 1325 1680 1287 664 -334 -993
3444i93o38J90O52P75R43M28K26n84p81p59o79k49L51N51J000O70L07j02o84r33
$$ -993 -1631 -1441 -789 -14 929 1357 1583 999 218 -541 -1220 -1469 -1118 -567 433 1103 1410 1308 624 -309
3464c09p68m18J45R38K81J041M41K50n14o91p86j097M69k16N31J447K14P58n87
$$ -309 -1077 -1495 -1350 -412 -131 910 1351 1601 1087 396 -390 -1487 -1018 -1234 -703 744 958 1716 1129
3483A129n97m21j144p68K61O12L80J405J328j268P78j315r52n3j374P56J68J877
$$ 1129 532 111 -1033 -1801 -1540 -928 -548 857 2185 917 1695 380 -572 -625 -1999 -1243 -1075 802
3501H02N9O23n66N28j339r78j22q76Q89N23J096K23L74l76n58j227n16j71j56
$$ 802 861 1484 918 1446 107 -871 -993 -1869 -980 -457 639 862 1236 860 302 -925 -1441 -1612 -1768
3520a768J022Q15J234k57J70k08j008j040m91R7K80N61J416M63k60N02r79n42
$$ -1768 -746 69 1303 1046 1216 1008 0 -1040 -1531 -1434 -1154 -593 823 1286 1026 1528 549 7
3538Gj040P4p3L38P77Q07M69L3q42n54p45r03J96K54J233j29P79R69j18j174r36
$$ 7 -1033 -959 -1032 -694 83 890 1359 1392 550 -4 -749 -1652 -1456 -1202 31 -98 681 1650 1532 358 -578
3559e78m62J4l94M9J549M81R29O04j383m39q62m51l00L30N49O39N59K39l8k43
$$ -578 -1040 -1026 -1420 -1371 178 659 1588 2192 809 370 -492 -943 -1243 -913 -364 275 834 1073 1035 792
3579G92r34p43j96l4N27M27R85M72l52l27m09m98q97M82k81L89J213L65M85k81
$$ 792 -142 -885 -1081 -1115 -588 -161 824 1296 944 617 208 -290 -1187 -705 -986 -597 616 981 1466 1185
3599A185l13p71r97j4q83L69J218%J780n83N67j660j02r81k54O67J15J183J230
$$ 1185 872 101 -896 -910 -1793 -1424 -206 -206 1574 991 1558 -102 -204 -1185 -1439 -772 -657 526 1756
3618A756o59J50m89J31k029m38l51P87J175J085J10L43n59k40j159l29j116J036
$$ 1756 1097 1247 758 889 -1140 -1578 -1929 -1142 33 1118 1228 1571 1012 772 -387 -716 -1832 -796
3636g96O55L73L59P26j10p11l59j519k05j05O30K49J905M35m09l30n59o92k98
$$ -796 -141 232 591 1317 1207 496 137 -1382 -1587 -1692 -1062 -813 1092 1527 1118 788 229 -463 -761
3655g61j156L11O09R82L80J158l93p38L02r30m48j329J276J169J39p7R67k60l17
$$ -761 -1917 -1606 -997 -15 365 1523 1130 392 694 -236 -684 -2013 -737 432 571 494 1461 1201 884
3674H84j562N66j288o9P02J468N11K73l51n51l61n00q95n92Q32M00J054M88M94
$$ 884 -678 -112 -1400 -1469 -767 701 1212 1485 1134 583 222 -278 -1173 -1765 -933 -533 521 1009 1503
3693A503k10o58q47p01n36J20O41P15Q38M39N8l65p29p89p37k55K70Q52P81P92
$$ 1503 1293 635 -212 -913 -1449 -1329 -688 27 865 1304 1362 997 268 -521 -1258 -1513 -1243 -391 390 1182
3713A182M10j63o61r14p45n22l6M88Q89O98O02J41k95p68q25n00m71K58O92Q56
$$ 1182 1592 1429 768 -146 -891 -1413 -1449 -961 -72 626 1228 1369 1074 306 -519 -1019 -1490 -1232 -540 316
3733C16P33L78p3o25p36r41m57j09N71P31P58Q48J34j94q80r07p35l26R5O93R22
$$ 316 1049 1427 1354 729 -7 -948 -1405 -1514 -943 -212 546 1394 1528 1334 454 -453 -1188 -1514 -1419 -726 196
3754A96P44N27k4n08q83q86m07k76M47Q05R82O13J67l01p06q00q95m44K89M93
$$ 196 940 1467 1443 935 52 -834 -1241 -1517 -1070 -265 717 1330 1497 1196 490 -310 -1205 -1649 -1360 -867
3774h67J116Q04M52Q1m48r03q84p85j92M40M72J038R97K47j12p72r07q80m77J64
$$ -867 249 1053 1505 1586 1138 235 -649 -1434 -1626 -1186 -714 324 1321 1568 1456 684 -223 -1103 -1580 -1416
3794a416M63R58Q62N70M8m15p89j032o36k46L26O88R03R78L33k6o75r19q83p46
$$ -1416 -953 5 867 1437 1485 1070 281 -751 -1387 -1633 -1307 -619 284 1262 1595 1569 894 -25 -908 -1654
3814a654K07J70J231N66R47J15k39o56j206o86K84l95P13Q98N90N54k90J04j860
$$ -1654 -1447 -1277 -46 520 1467 1582 1343 687 -519 -1205 -921 -1316 -603 295 885 1439 1149 1253 -607
3833f07k58o56n15J065R60J751j33J98j075N99j371j792j38J137j17P34J120Q38
$$ -607 -865 -1521 -2036 -971 -11 1740 1607 1805 730 1329 -42 -1834 -1972 -835 -952 -218 902 1740
3851A740l88l54q74j034o39k48M49R82J082O92L82k71p64j071j003m57K20N53
$$ 1740 1352 998 124 -910 -1549 -1797 -1348 -366 716 1408 1790 1519 755 -316 -1319 -1776 -1556 -1003
3869a003R02J010P27K19n72r52j037q73o6K94O79J049Q55N56k29p00j040q48o53
$$ -1003 -101 909 1636 1855 1283 331 -706 -1579 -1645 -1351 -672 377 1232 1788 1559 859 -181 -1029 -1682
3888a682k9O59R60R93P15K36m40q53j240q66l83K79P55J111R97M39j75k29j199
$$ -1682 -1711 -1052 -92 901 1616 1852 1412 559 -681 -1547 -1930 -1651 -896 215 1212 1651 1476 1247 48
3907D8j061o59j32N53Q74J164Q21K19l47q92r75j027m12K06O68J192R52N41J51
$$ 48 -1013 -1672 -1804 -1251 -377 787 1608 1827 1480 588 -387 -1414 -1826 -1620 -952 240 1192 1733 1884
3926A884n65j038j131r11j66L95R35J036J018M72k69o78j215r59n90j7P38J105
$$ 1884 1319 281 -850 -1761 -1927 -1532 -597 439 1457 1929 1660 982 -233 -1192 -1782 -1799 -1061 44
3944D4R69O71K43m62j044j135r36k68K38J045J143J014N70l08p23j209q89q40
$$ 44 1013 1684 1927 1465 421 -714 -1650 -1918 -1680 -635 508 1522 2092 1784 1061 -148 -1037 -1877
3962a877j8N35J013J111R01L20m11j066j023j048m32L52Q11R77J048P38K9p47
$$ -1877 -1895 -1360 -347 764 1665 1985 1574 508 -515 -1563 -1995 -1643 -832 145 1193 1931 1960 1213
3980A213j118j193r32L7M77J220J268P53M40m78j189q86j404m62K38N55J145J800
$$ 1213 95 -1098 -2030 -1993 -1516 -296 972 1725 2165 1687 498 -388 -1792 -2254 -2016 -1461 -316 1484
3998A484O67l2j433m9j351j509O12O4J150J079Q99N65k82j147j037j419j01k39
$$ 1484 2151 2119 686 637 -714 -2223 -1611 -1547 -397 682 1581 2146 1864 717 -320 -1739 -1840 -2079
4016b079P03J326J262P47J64m61j073j290j022m56K88J052J198J025O26j58n71
$$ -2079 -1376 -50 1212 1959 2123 1662 589 -701 -1723 -2179 -1891 -839 359 1384 2010 1852 1281
4033A281j338j029q46j1N28J018J371Q70L78m85j069j372j053n13K59R40J278
$$ 1281 -57 -1086 -1932 -1943 -1415 -397 974 1844 2222 1737 668 -704 -1757 -2270 -2011 -1071 207
4050B07J277O59L7p78j296j185r44j26M41J061J325J116N28n04j152j018j411
$$ 207 1484 2143 2180 1402 106 -1079 -2023 -2149 -1708 -647 678 1794 2322 1818 666 -352 -1763
4067a763m70j69J348J058J209O87Q37j127r60j740n92o54O95R68J448N97R01j18
$$ -1763 -2233 -2402 -1054 4 1213 1900 2737 1610 650 -1090 -1682 -2336 -1641 -673 775 1372 2273 2155
4085B155j376j455m78q69k96Q15J437O82J599J1r83o06j320j252k48K74Q64J507
$$ 2155 779 -676 -1154 -2023 -2319 -1504 -67 615 2214 2225 1242 636 -684 -1936 -2184 -1910 -1046 461
4103D61J181P38k92p27j425j316p15j93O39J257J428R48L19m13j020j281j212
$$ 461 1642 2380 2088 1361 -64 -1380 -2095 -2288 -1649 -392 1036 1984 2303 1890 870 -411 -1623
4120a623p07L04P75J385J325O60Qn69j278j432p75m74N04J341J336J106N16k24
$$ -1623 -2330 -2026 -1251 134 1459 2119 2127 1558 280 -1152 -1927 -2401 -1897 -556 780 1886 2402 2178
4138B178j064j427j274p49M1Q73J308J415P94K30n06j305j335j208k67L65J029
$$ 2178 1114 -313 -1587 -2336 -2295 -1422 -114 1301 2095 2325 1819 514 -821 -2029 -2296 -1931 -902
4155i02J392J107N65J0r07j259j493p13r3P39J222J353J157K27l29j274j559j150
$$ -902 490 1597 2162 2172 1265 6 -1487 -2200 -2293 -1554 -332 1021 2178 2405 2076 802 -757 -1907
4173a907m41K14Q94J562J206P61L1q20j169j506r45l17N04J280J372J094N16k93
$$ -1907 -2348 -2134 -1240 322 1528 2289 2320 1500 331 -1175 -2120 -2437 -1933 -653 719 1813 2329 2036
4191B036j242j270j080q53J45R44J203J607P35j76k57j264j327j281k76L38J470
$$ 2036 794 -476 -1556 -2409 -2264 -1320 -117 1490 2225 2049 1792 528 -799 -2080 -2356 -2018 -548
4208e48M42J306J319m43n70j541j628j021L7J218R82J498J112R6k70j356j411
$$ -548 -106 1200 2519 2076 1506 -35 -1663 -2684 -2647 -1429 -447 1051 2163 2259 1989 633 -778
4225g78j311m66M76J076J383J464P34k34p82j500j429j059k23Q99J244J504J007
$$ -778 -2089 -2555 -2079 -1003 380 1844 2578 2344 1562 62 -1367 -2426 -2649 -1750 -506 998 2005
4242B005P14n78j303j380j235o45n5J190J557J021R13L04p50j613j434q60o07
$$ 2005 2719 2141 838 -542 -1777 -2422 -2477 -1287 270 1291 2204 2508 1758 145 -1289 -2149 -2756
4259b756P30J473J315J253O82m61j060j433j478p87m8Q51J497J544J071Q9n40
$$ -2756 -2026 -553 762 2015 2697 2236 1176 -257 -1735 -2522 -2570 -1719 -222 1322 2393 2482 1942
4276A942j385j436j220m67M29J121J501J494N40P5j250j254j651j004R3O06J477
$$ 1942 557 -879 -2099 -2566 -2137 -1016 485 1979 2519 2594 1344 90 -1561 -2565 -2472 -1866 -389
4293c89J505J135L48n40j244j641j162p40L68P80J527J442Q03M35r34j309j759
$$ -389 1116 2251 2599 2059 815 -826 -1988 -2728 -2360 -1580 -53 1389 2192 2627 1693 384 -1375
4310a375j065j72P52J036J550J186O75k37j161j521j402q97J67R54J380J578J135
$$ -1375 -2440 -2612 -1860 -824 726 1912 2587 2350 1189 -332 -1734 -2631 -2464 -1510 -130 1448 2583
4327B583J03p21j268j752j310m13M45J248J690J368P17l14q47j606j388j069r0
$$ 2583 2686 1965 697 -1055 -2365 -2778 -2333 -1085 605 1973 2690 2376 1529 -77 -1465 -2534 -2624
4344b624R10J372J666J070K80o01j242j669j254q00N26J100J586J466R67q8r40
$$ -2624 -1714 -342 1324 2394 2674 2073 831 -838 -2092 -2892 -2366 -1266 320 1786 2753 2665 1725
4361A725j578j600j126j17N75J456J676J215L47k77j112j645j562o95K05Q44J742
$$ 1725 147 -1453 -2579 -2696 -2121 -665 1011 2226 2573 2296 1184 -461 -2023 -2718 -2513 -1669 73
4378G3J491J201p4o94j638j571q69o13M10J520J423J685N18l23j122j827j444
$$ 73 1564 2765 2691 1997 359 -1212 -2081 -2694 -2284 -764 659 2344 2862 2539 1417 -410 -1854
4395a854q88L9Q40J611J620J058L09n62j541j566j389m28L97J114J782J488P89
$$ -1854 -2742 -2703 -1863 -252 1368 2426 2735 2173 632 -934 -2323 -2751 -2354 -1240 542 2030 2819
4412B819j74j078j562j498j219j28P53J354J877J324M14m64j444j504j547p05
$$ 2819 2645 1567 5 -1493 -2712 -2840 -2087 -733 1144 2468 2882 2418 974 -530 -2077 -2782
4428b782K37J063J623J520R68J34r30j537j485j324l67P60J442J522J506N09l51
$$ -2782 -2545 -1482 141 1661 2629 2763 1833 296 -1189 -2513 -2880 -2120 -678 844 2350 2859 2508
4445B508j182j746j554p92J72R47J494J527J057L44o66j580j534j287l73l19J760
$$ 2508 1326 -420 -1974 -2766 -2594 -1647 -153 1374 2431 2775 2109 529 -1005 -2292 -2665 -2984 -1224
4462a224J730J473P14j16r45j703j449j234k5P55J718J749R38M69n40j194j945
$$ -1224 506 1979 2693 2577 1632 -71 -1520 -2754 -2779 -2024 -306 1443 2381 2850 2310 1116 -829
4479h29j512n42M19J041J732J430J063l8q32j611j675j238l01P20J514J533J512
$$ -829 -2341 -2883 -2464 -1423 309 1739 2802 2764 1932 321 -1354 -2592 -2893 -2173 -659 874 2386
4496B386L67k52j526j586j290q57J70R23J518J880R20K12p51j601j859j008m39
$$ 2386 2753 2501 975 -611 -1901 -2758 -2588 -1665 -147 1733 2653 2865 2114 513 -1346 -2354 -2793
4513b793P52R63J935J476M26r1j022j695j662r88j88R71J556J732J142L29n90
$$ -2793 -2041 -1078 857 2333 2759 2668 1646 -49 -1711 -2699 -2887 -1916 -360 1372 2514 2843 2253
4530B253j363j744j335n80K40J343J515J688R06j03j143j561j677j161k69Q34
$$ 2253 890 -854 -2189 -2769 -2529 -1186 329 2017 2923 2820 1677 116 -1561 -2722 -2991 -2157
4546b157J499J705J301O00m40j370j667j569q31K88J139J439J751J086O3o42j918
$$ -2157 -658 1047 2348 2948 2508 1138 -529 -2098 -2929 -2641 -1502 -63 1688 2774 2837 2195 277
4563B77j561j455j24L02J210K099J625j6M88j743j743j391m41m68J045J250K218
$$ 277 -1284 -2739 -2863 -2561 -1351 748 2373 2357 2845 1102 -641 -2032 -2473 -2941 -1896 -646 1572
4580A572J301J80j052j519j204j859j21N34O27J285K023J179l91j241n71k222
$$ 1572 2873 3053 2001 482 -722 -2581 -2702 -2168 -1541 -256 1767 2946 2555 1314 743 -1479
4596a479k089K82J471J868N92K374j93r10q16j702j601n05l26J419J761J592J037
$$ -1479 -3568 -3286 -1815 53 645 3019 2826 1916 1100 -602 -2203 -2708 -3034 -1615 146 1738 2775
4613B775K0r50j518j508j459k61O76J308J710J429P43l53j244j527j908p91J35
$$ 2775 2795 1845 327 -1181 -2640 -2901 -2225 -917 793 2222 2965 2612 1368 -159 -2067 -2858 -2723
4630b723P66J743J543J492l4p09j232k042j308l56L14P99K342J449J074k81j038
$$ -2723 -1957 -214 1329 2821 2787 2078 846 -1196 -2504 -2860 -2546 -1747 595 2044 3118 2837 1799
4647A799j811j710r43j76Q94J456J681J323M10o64j238j825j451p27L21J316J709
$$ 1799 -12 -1722 -2665 -2841 -1947 -491 1190 2513 2923 2259 1021 -804 -2255 -2982 -2661 -1345 364
4664C64J507J040k44q47j505j765j195k76O89J490J723J353O72n19j280j621j495
$$ 364 1871 2911 2667 1820 315 -1450 -2645 -2921 -2232 -742 981 2334 3006 2487 1207 -414 -1909
4681a909r46J49R84J645J767R30L02q85j502j801j430k53P35J126J900J479O40
$$ -1909 -2855 -2706 -1722 -77 1690 2620 2922 2037 535 -1266 -2696 -2949 -2214 -1088 812 2291 2931
4698B931k68j327j636j614q79q0J004J532J736J177L02m94j520j758j304o97K97
$$ 2931 2663 1336 -300 -1914 -2793 -2873 -1869 -337 1399 2576 2878 2384 864 -894 -2198 -2895 -2598
4715b598J374J603J376J077q8j022j489j693j233l14Q64J419J851J332M39m51
$$ -2598 -1224 379 1755 2832 2744 1722 233 -1460 -2693 -3007 -2143 -724 1127 2459 2898 2447
4731B447j367j652j469q18J23J147J579J679J111N5q64j516j647j253m94N55J559
$$ 2447 1080 -572 -2041 -2859 -2736 -1589 -10 1669 2780 2835 1971 455 -1192 -2445 -2939 -2384 -825
4748h25J426J576O55k53j244j470j937q39J60P42J715J544J304M31o81j587j752
$$ -825 601 2177 2832 2579 1335 -135 -2072 -2911 -2751 -2009 -294 1250 2554 2985 2304 717 -1035
4765a035j482m85M93J325J570J487R98k85q48j575j673j216j13P52J506J536J557
$$ -1035 -2517 -3002 -2509 -1184 386 1873 2871 2586 1738 163 -1510 -2726 -2839 -2087 -581 955 2512
4782B512L37o00r79j870p86j669N64R03J822J409J227rq07j657j598j447m02P52
$$ 2512 2849 2249 1270 -600 -1386 -3055 -2491 -1588 234 1643 2870 2861 2054 397 -1201 -2648 -3050 -2298
4800b298J455J552J530N75l65j105j756j555p40p2J161J450J469J319P33j157
$$ -2298 -843 709 2239 2814 2449 1344 -412 -1967 -2707 -2779 -1618 -168 1301 2620 3353 2196
4816B196j608j516k031J05L32J369K424J314P79P1j992k068j217r96l8J375L89
$$ 2196 588 -928 -2959 -2854 -2522 -1153 1271 2585 3364 3435 1443 -625 -1842 -2838 -2876 -1501 -1112
4833a112K606J426P9j248j038q71j961q89K53J483J601J409R62j74k81j878j740
$$ -1112 1494 2920 2999 1751 713 -158 -2119 -3008 -2755 -1272 329 1738 2700 2526 2245 367 -1373
4850a373j250l98Q81J226J836J159R19n08j308j694j369p16j87J002J457J876
$$ -1373 -2623 -3021 -2140 -914 922 2081 3000 2492 1184 -510 -1879 -2595 -2782 -1780 -323 1553
4866A553R93J93k73j639j938j307o91P76J254J290K014L77J01j243j694j198j393
$$ 1553 2546 2739 2466 827 -1111 -2418 -3109 -2333 -1079 211 2225 2602 2703 1460 -234 -1432 -2825
4883b825L28O44J497J882J009J14n42j531j185j255j209M48J304J088J973R76
$$ -2825 -2497 -1853 -356 1526 2535 2649 2107 576 -609 -1864 -3073 -2625 -1321 -233 1740 2716
4899B716l7p19j895j537j110o08J071J532J679R92J195q79j402j494j273j383
$$ 2716 2679 1960 65 -1472 -2582 -3190 -2119 -587 1092 2084 3279 2400 998 -496 -1769 -3152
4915c152J39J548J363J899O93L19p12j686j519j224m76N56J204J743J363Q67l03
$$ -3152 -3013 -1465 -102 1797 2490 2809 2097 411 -1108 -2332 -2808 -2252 -1048 695 2058 2925 2622
4932B622j168j635j518r85j43R81J586J693J173L56p11j291j722j320q67M50J191
$$ 2622 1454 -181 -1699 -2684 -2827 -1846 -260 1433 2606 2962 2251 960 -762 -2082 -2949 -2499 -1308
4949a308J707J520Q47j15r36j544j655q70k66R67R92J538J350J53n0r36j582j642
$$ -1308 399 1919 2766 2651 1715 171 -1484 -2354 -2620 -1653 -661 877 2227 2380 2330 1394 -188 -1830
4967a830r12J95J316J244J959J201r91q29m86k455j555R01N14Q25K270O0J718
$$ -1830 -2742 -2547 -1231 13 1972 3173 2182 1353 867 -1588 -3143 -2242 -1728 -903 1367 1427 3145
4984C145j708M88k069j510l81l78M16J447J761J171m47m44k139L37r29k258J770
$$ 3145 1437 1925 -144 -1654 -2035 -2413 -1997 -550 1211 2382 1935 1491 -648 -311 -1240 -3498 -1728
5001a728J203J210J384M14L82j098j679k202o07m91J174J274J233J430P04m76
$$ -1728 -525 685 2069 2483 2865 1767 88 -2114 -2721 -3212 -2038 -764 469 1899 2603 2127
5017B127j754j393j648M8O6R53K087J984P4j48n12j797j398j080n30M96J823R51
$$ 2127 373 -1020 -2668 -2620 -2554 -1601 486 2470 2544 2396 1884 87 -1311 -2391 -2921 -2425 -602 349
5035C49J705J155q66j490j260j566j106L23J368J318J489J001J10n01j680j393
$$ 349 2054 3209 2343 853 -407 -1973 -3079 -2756 -1388 -70 1419 2420 2530 2029 349 -1044
5051a044j257l76L73J170J742J193P54j61q77j555j441j057j01P25J469J656J142
$$ -1044 -2301 -2677 -2304 -1134 608 1801 2555 2394 1517 -38 -1479 -2536 -2637 -1912 -443 1213 2355
5068B355M50o10j271j721j300o69L47J019J539J532P07J15q40j461j445j139k17
$$ 2355 2805 2195 924 -797 -2097 -2766 -2419 -1400 139 1671 2378 2493 1653 192 -1253 -2392 -2609
5085b609O41J210J603J371M37m15j092j484j522q43J45J120J217J657J059K03
$$ -2609 -1968 -758 845 2216 2653 2238 1146 -338 -1860 -2703 -2558 -1438 -221 1436 2495 2698
5101B698p94j363j715o98q45N20J160J449J548N80j76q62j597j610p05MM66J751
$$ 2698 1904 541 -1174 -1872 -2717 -2197 -1037 412 1960 2540 2364 1502 -95 -1705 -2410 -2406 -1940 -189
5119a89J535J024J62m40j464j534r38r32O68R40J829R47J019M30j662j317j385
$$ -189 1346 2370 2532 2092 628 -906 -1844 -2776 -2108 -1168 661 1608 2627 3057 1395 78 -1307
5136a307p09o21P32J478R54K026r1l83o24j742j521j173P19J397R35J446J024
$$ -1307 -2016 -2637 -1905 -427 527 2553 2462 2079 1455 -287 -1808 -2981 -2262 -865 70 1516 2540
5153B540J10m14k000j337j136j83K92J218J569J310O11k42j077j404j502q82L7
$$ 2540 2650 2236 236 -1101 -2237 -2420 -2128 -910 659 1969 2580 2338 1261 -143 -1645 -2527 -2490
5170b490Q88J289J519J065L45p70j281j399j385l81L16J369J392J180R64k00r87
$$ -2490 -1602 -313 1206 2271 2616 1846 565 -834 -2219 -2600 -2284 -915 477 1657 2621 2421 1434
5187A434j376j443j172J60N30J267J524J097M87k99j158j610j350m85J80R87J474
$$ 1434 58 -1385 -2557 -2397 -1867 -600 924 2021 2508 2209 1051 -559 -1909 -2394 -2214 -1227 247
5204B47J164J041m1o95j445j540j025l72P75J419J432J183L94m22r76j748j262
$$ 247 1411 2452 2411 1716 271 -1269 -2294 -2666 -1891 -472 960 2143 2537 2115 1139 -609 -1871
5221a871p10K1J204J176J424Q28K96o80q91j880r35l07M20J224R67J402N39l24
$$ -1871 -2581 -2560 -1356 -180 1244 2072 2368 1688 797 -1083 -2018 -2325 -1905 -681 286 1688 2227 1903
5239A903q85r07j072j099q32J217J270J121J591L48l28j710j069q73p37j94K20
$$ 1903 1018 111 -961 -2060 -2892 -1675 -405 716 2307 2655 2327 617 -452 -1325 -2062 -2256 -2036
5256b036K375J526k21M92r20p44j437q32r27M72J946J504L28J174m12j688r11
$$ -2036 339 1865 1644 2136 1216 472 -965 -1797 -2724 -2252 -306 1198 1526 2700 2288 600 -311
5273c11j450o92M6J082J450J430N09J02L3j340k372m42o16N13Q04J777J024P66
$$ -311 -1761 -2453 -2407 -1325 125 1555 2064 2166 2199 859 -1513 -1955 -2571 -2058 -1254 523 1547 2313
5291B313k52o91j499o36j224k61O51R34J546J292K57o38r86j539j045n53K47Q18
$$ 2313 2061 1370 -129 -765 -1989 -2250 -1599 -665 881 2173 2430 1792 806 -733 -1778 -2331 -2084 -1266
5309a266J639J161P16q2q15j058j602o64l76P11J075J331R92M92l00j092j246
$$ -1266 373 1534 2250 2168 1353 295 -1307 -1971 -2347 -1636 -561 770 1762 2254 1954 862 -384
5326c84j057p94J64Q90J186J334Q60n7o72j127j317j010l90N31J083J436J047
$$ -384 -1441 -2235 -2071 -1181 5 1339 2199 2142 1470 343 -974 -1984 -2374 -1843 -760 676 1723
5343A723N63j77r74j318j059r71J53O42J110J398Q86J38l61j068j335r54q15M24
$$ 1723 2286 2109 1135 -183 -1242 -2213 -2060 -1418 -308 1090 1976 2114 1753 685 -650 -1604 -2419 -1995
5361a995J229R98J443M43j1j020j019j271q82j99O16J352J165R37L97l81r84j327
$$ -1995 -766 232 1675 2118 2107 1087 68 -1203 -2085 -2284 -1668 -316 849 1786 2183 1802 818 -509
5379e09j093n25J32Q29J210J203Q17K5o19j224j235q54k61M38J105J244R75M50
$$ -509 -1602 -2127 -1995 -1166 44 1247 2064 2089 1470 246 -989 -1843 -2104 -1666 -561 683 1658 2108
5397B108j02j158j178j240o82J28R26J160J091Q41M69p51j264j273r74k32K24
$$ 2108 2006 848 -330 -1570 -2252 -2124 -1198 -38 1053 1894 2363 1612 348 -925 -1899 -2131 -1907
5414a907R89J172J102O86o6j015r18j164q11O1N39J097J304O39K32k02j124j219
$$ -1907 -918 254 1356 2042 1976 961 43 -1121 -1932 -1871 -1332 -235 1069 1708 1940 1738 614 -605
5432f05j012n25K66Q84J210R99P63Q1o33j231j205p72k46N27R96J200R70L97l26
$$ -605 -1617 -2142 -1876 -992 218 1217 1980 2061 1428 197 -1008 -1780 -2026 -1499 -503 697 1667 2064 1738
5451A738q32j292r02o94Q9P97J049J143Q03J72o18j012j233r41l03K87J058J216
$$ 1738 906 -386 -1288 -1982 -1893 -1096 -47 1096 1899 2071 1453 441 -792 -1733 -2036 -1749 -691 525
5469E25J014N39j85p63j220j066o60j22N79J135J160Q84J06m30r84j143q98n06
$$ 525 1539 2078 1893 1130 -90 -1156 -1816 -1938 -1359 -224 936 1820 1926 1496 512 -631 -1529 -2035
5487b035L27Q40J170J081N13k4o12j157j124p54k21N05J062J170Q35L49l22p82
$$ -2035 -1708 -868 302 1383 1896 1872 1260 103 -1021 -1775 -1996 -1491 -429 741 1576 1925 1603 821
5505H21j221r25n18J67M87J185J107O65N7o11r59j033r29j08M01P87J065J104
$$ 821 -400 -1325 -1843 -1676 -1189 -4 1103 1768 1825 1214 255 -778 -1707 -1815 -1414 -627 438 1542
5523A542M63l20p34j236q74o44J0O53J054R86O38L82n04r95r05j015m43M49Q17
$$ 1542 2005 1685 951 -285 -1159 -1803 -1793 -1140 -86 900 1538 1920 1416 421 -484 -1499 -1942 -1493 -676
5542f76R25R18N16M6p56r97r96p67nN29Q38J242Q29K59l87o97j310q89m32J65
$$ -676 249 1167 1683 1729 973 -24 -1020 -1787 -1792 -1263 -425 817 1646 1905 1518 821 -489 -1378 -1810 -1645
5562a645O59J099R97N94k5n24r04j190n78l26M69Q88J012Q75K68j89q22r09q77
$$ -1645 -986 113 1110 1704 1679 1155 251 -939 -1517 -1843 -1374 -486 526 1401 1669 1480 658 -251 -1128
5581a128o28K5O37J052R36Q09J9l81q52j035r15l59L40P85R43J150L68j74p03
$$ -1128 -1756 -1731 -1094 -42 894 1703 1722 1341 489 -546 -1461 -1820 -1480 -695 248 1398 1766 1592 889
5600H89q87j036m73j62M30J048J006N39M02l56r21r79p70m51K38P24R12R18N13
$$ 889 2 -1034 -1507 -1669 -1239 -191 815 1354 1756 1400 479 -500 -1270 -1721 -1483 -759 153 1071 1584
5619A584N2o81q20r78o58j42L51Q81J091N85L46k43o29r44q61m87P6O14R71Q81
$$ 1584 1636 955 135 -843 -1501 -1643 -1292 -411 680 1265 1611 1368 739 -205 -1066 -1553 -1477 -863 108 989
5639I89N66J25m93n35j036q74l90J179K68J169L95O11p19j0j583m79n15N7J37
$$ 989 1555 1680 1187 652 -384 -1258 -1648 -469 -201 968 1363 1974 1255 1245 -338 -817 -1332 -1275 -1138
5658a138Q99Q39P64K44l17q25r18q17l46K47P06R22Q02M67q7n35r11r73m74j6
$$ -1138 -239 600 1364 1608 1291 466 -452 -1269 -1615 -1368 -662 260 1062 1529 1442 907 -4 -977 -1451 -1467
5678a467M21P61Q28R39J67l84p38q53p93m16O4N98R31Q70N60Q7m27j021o63p75
$$ -1467 -1046 -285 543 1482 1649 1265 527 -326 -1119 -1535 -1471 -873 58 928 1488 1575 1148 127 -536 -1311
5698a311k07M12O88P90P78L79j77p55p74q24n56K09M64P59Q47P64Mm42p45q41
$$ -1311 -1518 -1106 -418 372 1150 1529 1352 597 -177 -1001 -1557 -1348 -884 -125 722 1486 1490 1048 303 -538
5718e38o35k67K55O72Q25R13J64o3n50o97p79n97l59O76P49K85J202O90r19o72
$$ -538 -1173 -1440 -1185 -513 312 1225 1389 1326 776 79 -700 -1297 -1656 -980 -231 54 1256 1946 1027 355
5738C55k44j286l62J2P64Q62O91O50k3n36p35r16o54P6L65N54Q75N93L31k30m87
$$ 355 111 -1175 -1537 -1525 -761 101 792 1442 1419 883 148 -768 -1422 -1346 -981 -427 448 1041 1372 1142 655
5759F55r65n23m32p6J200N69m1J200l95N7o25j550r6n42Q18L77P83P59J01J6o74
$$ 655 -310 -833 -1265 -1341 -141 428 387 1587 1192 1249 624 -926 -1022 -1564 -746 -369 414 1173 1274 1290 616
5780F16o19p33m34k2L64P07P76M72J24j68p01n84q95k63N6O99Q55N25O50j81m33
$$ 616 -3 -736 -1170 -1192 -828 -121 655 1127 1251 1083 382 -202 -1097 -1360 -1304 -605 250 775 1425 1244 811
5801H11o40r68j61l56K86Q32P23N83J70l53m06p71q87k30pQ34Q57K76O30j84l36
$$ 811 171 -797 -958 -1314 -1028 -196 527 1110 1280 927 521 -250 -1137 -1367 -1374 -540 317 593 1223 1039 703
5822G03m56r74j65m10L92M74P97M23L84J82q74n86q23k02K5K71Q13Q15M52j18
$$ 703 247 -727 -892 -1302 -910 -436 361 784 1168 1350 476 -110 -933 -1135 -1110 -839 -26 789 1241 1123
5842A123l64m73q33l67l43J15N34Q15O17L93q2o44n50n98n17o6N22N16Q63M06
$$ 1123 759 286 -547 -914 -1257 -1142 -608 207 824 1217 1135 491 -59 -657 -1174 -1240 -718 -202 661 1067
5862A067J82l29m49q38n12k83k8P21O37O06K84Ml08q41p85k15k0O36J55Q10M38
$$ 1067 1249 920 471 -367 -879 -1162 -1190 -469 168 774 1058 1062 754 -87 -872 -1087 -1107 -471 -316 494 932
5883I32M1j210M27n91l95k21j77N20Q43M13M13O7k50o95n51n33k55L28N07O58
$$ 932 973 -237 190 -401 -796 -1017 -1194 -674 169 582 995 1062 812 117 -434 -967 -1222 -894 -387 271
5903B71O32L11k23l18p69n44m09j04N26N24N82N03J16l35n07o16n86j27J62L36
$$ 271 903 1214 991 673 -96 -640 -1049 -1153 -627 -103 479 982 1098 763 256 -360 -946 -1073 -911 -575
5923e75P46N37L66r4l21n44o45n25m0K14O51P12M29J49j22o11p27l83l04J15N27
$$ -575 171 708 1074 980 659 115 -530 -1055 -1095 -881 -230 482 911 1060 938 327 -400 -783 -1087 -972 -445
5944d45N42N53L45J2k91n71o17m76j69K61O44N50N77J49j43m99n76n38l98J61
$$ -445 97 650 995 1007 716 145 -472 -948 -1117 -856 -212 338 915 1064 921 422 -154 -692 -1090 -929
5964i29M57M83M92L89J62k73n04o97m82j8K6N77L77O37L29m5m10o68m96m32j7
$$ -929 -472 11 503 892 1054 781 277 -420 -902 -920 -894 -317 60 697 1026 981 571 -97 -593 -1025 -1042
5985a042L59M55O61M45J93j84n73o06n19j62J83K96O43N52K38J41n40m37o66k07
$$ -1042 -683 -228 433 878 1071 887 314 -292 -811 -973 -790 -494 149 701 939 1080 540 103 -563 -770
6005g70k21K33N98M64M32K54k07m11m90n63l09J45L46N09O40J56J10k60o15m04
$$ -770 -991 -758 -160 304 736 990 783 372 -118 -681 -990 -845 -499 10 650 806 916 656 41 -363
6025c63m35q3R9N61N58L12L45k03l41o10m95j87Q3K24M49N38L53J76k36n34o54
$$ -363 -798 -881 -782 -221 337 649 994 791 450 -160 -655 -842 -759 -535 -86 452 805 981 745 211 -443
6046d43k99j56Q4K92P60M04K25m4k86m98m85l61J6J61M16O34L39J49j07m98n20
$$ -443 -742 -898 -814 -522 238 642 867 823 537 39 -446 -807 -791 -630 -214 420 759 908 801 303 -217
6067b17l43l72K52K68M70N00L82o1k49n05o26n33K21M1N22M87N19N5k8m41o09
$$ -217 -560 -932 -680 -412 58 558 940 879 630 125 -501 -1034 -813 -772 -250 237 756 811 783 342 -267
6088b67n44l7J15K46M04N95N07j71j95l97o29l10J3k15N39N27K26K68J19m59o61
$$ -267 -811 -848 -733 -487 -83 512 1019 848 653 256 -373 -683 -670 -885 -346 181 407 675 794 335 -326
6109c26J54j023P8J078l0M9K84L93J86j221P88j157r3R81j33K27J41K51J05o8
$$ -326 -172 -1195 -1117 -39 -69 -20 264 657 843 -378 410 -747 -840 141 8 235 376 627 732 664
6129F64m54q84K43k30p80M63R09Q57m44O58l99j490L20M96k58l34N18N85Q47K58
$$ 664 210 -674 -431 -661 -1441 -978 -69 788 344 1002 603 -887 -567 -71 -329 -663 -145 440 1287 1545
6149A545j165O3k27q62J67o30J97Q54R95k20o32J11J73j184K2J75P5K70M99Q49
$$ 1545 380 443 216 -646 -479 -1109 -912 -58 937 717 85 196 369 -815 -793 -618 -543 -273 226 1075
6169A075l41j56l78o27M41j279Q73p7K30O32M90n39K9n86K5o01K30K6N43Q28j11
$$ 1075 734 578 200 -427 14 -1265 -392 -469 -239 393 883 344 373 -213 -188 -789 -559 -533 10 838 727
6190G27o11K63k47k51l74m16L43K07M50N08J79j27k29m80m28j1M2o5O59K88R65
$$ 727 116 379 132 -119 -493 -909 -566 -359 91 599 778 651 422 -58 -486 -497 -455 -520 139 427 1392
6211A392n47j09p24o67Lk13J31M77L50K04L30M8k42m44l92k62O2O60p19L11J545
$$ 1392 845 736 12 -655 -652 -865 -734 -257 93 297 627 675 433 -11 -403 -665 -603 57 -662 -351 1194
6232A194Mj089O07p23k11n73K09J59M51M27k28N08j91k10j270k4Q46p56M35L15
$$ 1194 1198 109 716 -7 -218 -791 -582 -423 28 455 227 735 544 334 -936 -960 -114 -870 -435 -120
6252a20M52N35l97J49n60r19K32j44K90K73N38J66N2o6k93m00l73o5P5N15P7Q63
$$ -120 332 867 470 619 59 -860 -628 -772 -482 -209 329 495 547 481 188 -212 -585 -650 -575 -60 17 880
6274H80l02J50o5j84j298k82K69O44R0O44j44M48m97l75l88j2k13j59M90N14O6
$$ 880 578 728 663 479 -819 -1101 -832 -188 -98 546 402 850 353 -22 -410 -422 -635 -794 -304 210 276
6295B76L91K05m51k11n60k11k02K69J60O26K64m2J0l10l48l00l41K59K05L35M18
$$ 276 667 872 421 210 -350 -561 -763 -494 -334 292 556 514 524 214 -134 -434 -775 -516 -311 24 442
6316D42J73k1j78l67l81j39k24J75K00M51K90K15n7k20l83l43l39J42R6M26L65
$$ 442 615 594 416 49 -332 -471 -695 -520 -320 131 421 636 579 359 -24 -367 -706 -564 -468 -42 323
6337C23J89J68k46l38l88l03l5J21L45K20L88K16j14k33l43m03j27q3J96L57L28
$$ 323 512 680 434 96 -292 -595 -630 -509 -164 56 444 660 546 313 -30 -433 -560 -643 -447 -90 238
6358B38K14K57j77k86m76k93m9K1K44L20L92J23J62m49j67k08m50k4J53K62N37
$$ 238 452 709 532 246 -230 -523 -572 -551 -307 13 405 528 690 241 74 -134 -584 -608 -455 -193 344
6379C44K07P1j01l43m40k32j52P3K33L08L91K16J30l20k28m68k62rJ57K82M00
$$ 344 551 622 521 178 -262 -494 -646 -573 -340 -32 359 575 705 385 157 -311 -573 -582 -425 -143 257
6400B57K10Q8p9j60l77k67k79p2K67K55M59L85K57p5n09p67R1n62N16q0l0J437
$$ 257 467 555 476 316 -61 -328 -607 -679 -412 -157 302 687 944 869 360 -407 -316 -878 -362 -442 -472 965
6422I65l79J47n79k52k87j79J23o0K85Q37k28L83k28m41m01l87j16J60L28K02
$$ 965 586 733 154 -98 -385 -564 -441 -501 -216 621 393 776 548 107 -294 -681 -797 -637 -309 -107
6442a07O48K26pl21j49o17K02l07J22j35R44K95q5J0l74m20m90L4n6L20L21O16
$$ -107 541 767 760 439 290 -327 -125 -432 -310 -445 499 794 709 719 345 -75 -565 -531 -587 -267 54 670
6464F70O2l54r5l66J95p22P78p36P14K32J46q4m5j33l78j54l34j9J49M37L24K89
$$ 670 732 378 283 -83 112 -610 168 -568 146 378 524 440 395 262 -116 -270 -604 -623 -474 -37 287 576
6486E76Lk96j66l15l85l5J62K30M43K40J64q5j87m55k20j36n6J15M23J57L58m
$$ 576 579 283 117 -198 -583 -618 -456 -226 217 457 621 536 349 -106 -326 -462 -518 -403 20 177 535 531
6508E31J1k91m01l11R23j312k01P02O93L97J39n90j06q86Q7M68n02J188K47k09
$$ 531 542 251 -150 -461 462 -850 -1051 -349 344 741 880 290 184 -702 -615 -147 -649 539 786 577
6528E77k3m1k6p64l30M1K97MN00M28k1n20Q52j349J2N6m01K43L91J01O62j30j04
$$ 577 554 513 487 -277 -607 -566 -269 -265 235 663 642 122 974 -375 -363 -307 -708 -465 -74 27 689 559 455
6551D55k15l39k13l98N51K7O14R6O3J57k83n73o6n08k1j16L07M65N42P2O2m24
$$ 455 240 -99 -312 -710 -159 -132 482 578 641 798 515 -58 -124 -632 -653 -769 -462 3 545 617 679 255
6573B55k36l77j35K3J26L87J78K51P5j30m23j31k53j06k9K64L87L09J55r0k75
$$ 255 19 -358 -493 -470 -344 43 221 472 547 417 -6 -137 -390 -496 -525 -261 126 435 590 500 225
6594B25l25k57l00J39J24L89K06L17L4j56k12l41l29r5Q9K55K38M02R6J8k64k74
$$ 225 -100 -357 -657 -518 -394 -5 201 518 552 396 184 -157 -486 -581 -492 -237 1 403 499 517 253 -21
6616b1k16k59j46K81J49M35K02K26k14k29k99k93j97N5k92R90m47N94O05l01o8
$$ -21 -237 -496 -642 -361 -212 223 425 651 437 208 -91 -384 -581 -526 -818 172 -275 319 924 623 555
6637E55m15p16M21Q8K17J81l72Q87k95k97m50n55O64P65j375M49L31L05K0r7n39
$$ 555 140 -576 -155 -67 150 331 -41 846 551 254 -196 -751 -87 678 -697 -248 83 388 408 311 -228
6658b28o27O50n79K1L96K38K04N12j92p02J3m4K13R6k0j153J639n37J613l03r76
$$ -228 -855 -205 -784 -763 -367 -129 75 587 395 -307 -294 -338 -125 -29 -49 -1202 437 -100 1513 1210 234
6679B34j57K93n57l67Q2R95M80n27L31l67n6q71O37q39M43Q5L16M13J28k53o8
$$ 234 77 370 -187 -554 -472 523 1003 476 807 440 384 -487 150 -689 -246 -161 155 568 696 443 375
6700C75l9l07m22k01L99L33N59k04N4j39l52l25j33L0Rk8M95K78L00l07K35k32
$$ 375 336 29 -393 -594 -195 138 697 493 547 408 56 -269 -402 -372 -363 -391 104 382 682 375 610 378
6722C78q79J69m7k1O50J3k2M6R68o47q23k47l7K45m3M70K77M8Kj95l37l55j49
$$ 378 -501 -332 -379 -400 250 263 241 287 1255 608 -215 -462 -499 -254 -297 173 450 498 500 305 -32 -387 -536
6745e36L6J67K46L48J82J46j27l40k23k39j84M2J86L61J26K60N7k05k88m33j03
$$ -536 -500 -333 -87 261 443 589 462 122 -101 -340 -524 -482 -296 65 191 451 508 303 15 -418 -521
6766e21J02J01J87L79K39N6j31k36l28k24k76J36K49M41J35J87J67l19k49k03
$$ -521 -419 -318 -131 248 487 543 412 176 -152 -376 -652 -516 -267 174 309 496 663 344 95 -108
6786a08k73k53K00J19M97M53m50J75q8n52J14n76k70N20M91O93K48L47q01m14
$$ -108 -381 -634 -434 -315 182 635 185 360 272 -280 -166 -742 -1012 -492 -1 692 940 1287 486 72
6806G2L96p94k20L9K05M26L81J27o9l36l08l38m2q6J98R1N17J50K47m69J50j056
$$ 72 468 -326 -546 -507 -302 124 505 632 563 227 -81 -419 -461 -547 -349 -258 259 409 656 187 337 -719
6828g19M00o7m77R81M71M46q21O79o72n08j50J3k6j3KR29j61M53m67J64n58j24
$$ -719 -319 -386 -863 118 589 1035 214 893 221 -287 -437 -424 -450 -463 -461 468 307 760 293 457 -101 -225
6850b25k33L1J29L67K70K96Kk73l13k11l63j8P2L49K27L29qJ38k48l11l96j73
$$ -225 -458 -427 -298 69 339 635 637 364 51 -160 -523 -541 -469 -120 107 436 428 566 318 7 -389 -562
6872e62N8R4L98J76M18l3r5k08l65k76q8l8L12K31L99J17P3k97k57k88l97Q2J80
$$ -562 -504 -410 -12 164 582 549 454 246 -119 -395 -483 -521 -209 22 421 538 611 314 57 -231 -628 -546 -366
6895c66K54L47J96Q1j47j75l23k29j21R5R1L38K08L18J3j30k91l97k50p7J34K55
$$ -366 -112 235 431 512 365 190 -133 -362 -483 -388 -297 41 249 567 580 450 159 -238 -488 -565 -431 -176
6917a76L42L06J73j76k29k61l74j69L7J42M25L28J75O3j58l83l14k34j66R5K87
$$ -176 166 472 645 469 240 -21 -395 -564 -527 -385 40 368 543 606 448 65 -249 -483 -649 -554 -267
6938b67L48L63J45l5k88l21l34j39p0J79K10M83J86J74j21l73k89m05m4j4M22
$$ -267 81 444 589 554 266 -55 -389 -528 -598 -419 -209 274 460 634 513 140 -149 -554 -598 -612 -190
6959a90L03K84J89Jj90l25l69j97j83L44K04L24L15M3k9l00j63l55j29k6J07L37
$$ -190 113 397 586 587 397 72 -297 -494 -677 -333 -129 195 510 553 524 224 61 -294 -423 -449 -342 -5
6981eK45L24l7%m28l03k71k38K89L42J96L05K0J27k26m01k99j61K7R7M25K20J97
$$ -5 240 564 527 527 99 -204 -475 -713 -424 -82 114 419 439 566 340 -61 -360 -521 -494 -397 28 248 445
7004D45J30j68k57k93l63o6J11J82K96L49L26j80k52j95l99j82j7N9K42N38K04
$$ 445 575 407 150 -143 -506 -572 -461 -279 17 366 692 512 260 65 -334 -516 -533 -474 -232 306 510
7025E10Q1j55j05l34m00r1j61K40L90L39K38O5j70k69n42r8j14L6L67L14L43L7
$$ 510 591 436 331 -3 -403 -494 -655 -415 -25 314 552 617 447 178 -364 -462 -576 -540 -173 141 484 521
7047E21j09j33l91l12n3j08K53J73M80J96Pr7k89k77l46r9J74L01J04M05K41j66
$$ 521 412 279 -112 -424 -477 -585 -332 -159 321 517 524 427 138 -139 -485 -584 -410 -109 -5 400 641 475
7069D75q2m72k55j33PJ48K07K75K77N7n6l00l04l56l9Q0K11K28L54J83Q7j31l37
$$ 475 393 -79 -334 -467 -460 -312 -105 170 447 504 448 148 -156 -512 -551 -471 -260 -32 322 505 592 461 124
7092A24m96Jk19J02K23M42K93N7j42k12j53l72j14m2J47L17M17O7J27j69k08m31
$$ 124 -372 -371 -590 -488 -265 177 470 527 385 173 20 -352 -466 -508 -361 -44 373 440 567 398 190 -241
7114b41k59j60K27J78L57M48KM3l63l10k69k14l1J49K58M52K06J7r0j75l51l43
$$ -241 -500 -660 -433 -255 102 550 552 595 232 -78 -347 -561 -592 -443 -185 267 473 490 400 225 -126 -469
7136d69j18N9L12K98J52L33k6j90l40k07l44j6O1N00K18K55N6j02k74l11l29o0
$$ -469 -587 -528 -216 82 234 567 541 351 11 -196 -540 -556 -495 5 223 478 534 432 158 -153 -482 -542
7158e42nK56K39K85M26j2k11k82l64k87j72J14L46M57Q59J48l73n64N71j066j32
$$ -542 -547 -291 -52 233 659 647 436 154 -210 -497 -669 -555 -209 248 1107 1255 882 318 889 -177 -309
7179c09l29O33m2k80Q90j64L6q35N32p26N40K9m36M22N18K56k03j88l03k15l58
$$ -309 -638 -5 -47 -327 563 399 435 -400 132 -594 -54 -25 -461 -39 479 735 532 344 41 -174 -532
7200e32j37L91J37O68M78l22n50M63p43n4o60O38J20K55K29KQ05p76q53k66O74
$$ -532 -669 -278 -141 527 1005 683 133 596 -147 -201 -861 -223 -103 152 381 383 1188 412 -441 -707 -33
7221c3l71m8N09K08L46J35k75k71m00k7l09m0J55L62M76L9J3J0k08l87l90k5L0
$$ -33 -404 -452 57 265 611 746 471 200 -200 -227 -536 -576 -421 -59 417 456 469 479 271 -116 -506 -531 -501
7244e01K57K78L20J66N1j85k61n02j23p2K04K21M14J70J82j67k77k93k86j13l2
$$ -501 -244 34 354 520 571 386 125 -377 -500 -572 -368 -147 267 437 619 452 175 -118 -404 -517 -549
7265e49K97J75M12P2K06j87l47l15l08M9Q9J88M14K71N7K0k53l07m67Np1J97K57
$$ -549 -252 -77 335 407 613 426 79 -236 -544 -495 -406 -218 196 467 524 544 291 -16 -483 -478 -549 -352 -95
7288i5L43K50J08j81k55l82j70k89K03J17N64K28K24k86k32l28k97O20j015N57
$$ -95 248 498 606 425 170 -212 -382 -671 -468 -351 213 441 665 379 147 -181 -478 142 -873 -316
7308c16M59R6J96M20l55l84j04m61l30r4K36P62RN00j10k01l44k93k6k96N9J12
$$ -316 143 239 435 855 500 116 12 -449 -779 -873 -637 125 134 634 524 323 -21 -314 -340 -636 -577 -465
7330d65N50M70K83n06K54n32n62L99o89R50m21J016p11L85J10k78p93k56P17m52
$$ -465 85 555 838 332 586 54 -508 -109 -798 152 -269 747 36 421 531 253 -540 -796 -79 -531
7350e31P58k21M04K91N5o46K18j090L86J95q9J05K45Q66l08p62j6K64q68J33%
$$ -531 227 6 410 701 756 110 328 -762 -376 -181 -270 -165 80 946 638 -124 -140 124 -744 -611 -611
7371f11J9L92N20K42m59q6k14k97Ro9K02J33L91K24K52n75m1k92M20k56n47l02
$$ -611 -592 -200 320 562 103 17 -197 -494 -485 -554 -352 -219 172 396 648 73 32 -260 160 -96 -643 -945
7393i45P76J253o36J4j08j12o4l66l80k8K41k33O66N75n22R4J2l98l34Q1l54N39
$$ -945 -169 1084 448 462 354 242 178 -188 -568 -596 -355 -588 78 653 131 225 237 -161 -495 -414 -768 -229
7415b29K47R29o49J57l76K64o62K15n7m41J200J74l47J11j66k50N0m34k42j9M27
$$ -229 18 947 298 455 79 343 -319 -104 -161 -602 598 772 425 536 370 120 170 -264 -506 -525 -98
7436i8R2M13K86j37l02l20k42l51K17N6L36M04P4J22J6m31l61l55O0K8K47L96
$$ -98 -6 407 693 556 254 -66 -308 -659 -442 -386 -50 354 428 550 566 135 -226 -581 -521 -493 -246 150
7458A50L33J32k7k88k01m51r7j31K32K67L00K28K10k21k02l39k61j96L3K62J88
$$ 150 483 615 588 300 99 -352 -449 -580 -348 -81 219 447 657 436 234 -105 -366 -562 -529 -267 -79
7479g9N53J15j54l2l25k40l68L12o35P66L85J93l90L33p2n40m54K87q4l97P72
$$ -79 474 589 435 403 78 -162 -530 -218 -853 -87 298 491 101 434 362 -178 -632 -345 -429 -826 -54
7500e4O8L6M18J24l66m78k41k47K71J1L80P84K88l02n76K77j577O24j3R07n71
$$ -54 14 50 468 592 226 -252 -493 -740 -469 -458 -78 706 994 692 116 393 -1184 -560 -573 334 -237
7521b37K83L86K55l76k30j52j93n73M01L61L73O1N14m25l22n03j52N67p41K85
$$ -237 46 432 687 311 81 -71 -264 -837 -436 -75 298 359 873 448 126 -377 -529 38 -703 -418
7541d18n6O67Q63n83o8j68k91n33k97j22M44O72Q74l79J33p60k62M8l53J72k10
$$ -418 -474 193 1056 473 405 237 -54 -587 -884 -1006 -562 110 984 605 738 -22 -284 -236 -589 -417 -627
7562f27M46O07M0O3j32n70K94n53o58P11j047J254J43N74L18l41m52k14k78q4
$$ -627 -181 426 466 529 397 -173 121 -432 -1090 -379 -1426 -172 -29 545 863 522 70 -144 -422 -506
7582e06j09K97K90M00K33J2j70l99l13k86P3J25K54L11L12J25j28j94n01r7l26
$$ -506 -615 -318 -28 372 605 617 447 48 -265 -551 -478 -353 -99 212 524 649 521 327 -174 -271 -597
7603e97P1R0M40L15J02J51j12l31l44k55j45J53J80N61O5K70m5k17l47k79j74
$$ -597 -526 -436 4 319 421 572 460 129 -215 -470 -615 -462 -282 279 344 614 569 352 5 -274 -448
7624d48j98K82K40L80K73N9j29l48j64l85j03%K21L66K65K60K6k75k99m00k46
$$ -448 -646 -364 -124 256 529 588 459 111 -53 -438 -541 -541 -320 46 311 571 597 322 23 -377 -623
7645f23k9L59Q1L32L95O6q4k69l14l18j69k7M94J4P83j62L77K53j420P8K00m94
$$ -623 -652 -293 -212 120 515 581 497 228 -86 -404 -573 -600 -106 -92 691 529 906 1159 -261 -183 17 -477
7667d77L18M99j61L73K70K00k50k35j021j46J55K27J80M47j30O72j77n16m14J15
$$ -477 -159 340 179 552 822 1022 772 537 -484 -630 -475 -248 -68 379 249 921 744 228 -186 -71
7687g1n08K67M3N25p3L40m0m8l53m12l78J63k72J131l02L03M96l30J77m25j120
$$ -71 -579 -312 -269 256 183 523 483 435 82 -330 -708 -545 -817 314 12 315 811 481 658 233 -887
7708h87K06O3J97O08J00K71J3j83k71l47k18q9P9K08L70K21J54K2k23m48j38l17
$$ -887 -681 -618 -421 187 287 558 571 388 117 -230 -448 -537 -458 -250 120 341 495 517 294 -154 -292 -609
7730f09J14J23K54L08l72J288j09m12r43M28j048p5Q85J324q92J89q79P29k06
$$ -609 -495 -372 -118 190 -182 1106 997 585 -358 70 -978 -1053 -168 1156 264 453 -426 303 97
7749I7l6m86k59L46O46N96k25O06j048J29p52J82J059j435M42n78P75m42Q25L40
$$ 97 61 -425 -684 -338 308 904 679 1285 237 366 -386 -204 855 -580 -138 -716 59 -383 442 782
7769G82j114k48M55o05q3N63M26J85L41j40k06k49m19k13k8J25L80K45K85K34
$$ 782 -332 -580 -125 -730 -813 -250 176 361 702 562 356 107 -312 -525 -553 -428 -48 197 482 716
7789G16j28m33j10n11l20j39P11N35NJ07o8l01j1k15l80M47l55O26o1J66L72l68
$$ 716 588 155 45 -466 -786 -925 -214 321 326 433 365 64 53 -162 -542 -95 -450 176 115 281 653 285
7811B85j96J81q24K21m91P32oP69Lj05l17Q3n09m13k32K27M19J75M94P7M6k74
$$ 285 89 270 -554 -333 -824 -92 -98 671 674 569 252 335 -174 -587 -819 -592 -173 2 496 573 619 345
7833C45k52m46L5k40K21K1M17M94Nl5l21m72k56o9M9J62L80J85K09N19p66j06
$$ 345 93 -353 -318 -558 -337 -316 101 595 600 565 244 -228 -484 -553 -504 -342 38 223 432 951 185 79
7855G9j260K20k26O86M82L09m37P68J82p45J69p11o7J68o2J15L18O50Q7o43L67
$$ 79 -1181 -961 -1187 -501 -19 290 -147 621 803 58 227 -484 -551 -383 -445 -330 -12 638 725 82 449
7876D49n72o60M27j5O72K19J16j76K81k66o41l4l64l22m79J321L75R82r02L21
$$ 449 -123 -783 -356 -371 301 520 636 460 741 475 -166 -200 -564 -886 -1365 -44 331 1313 411 732
7896G32q1q84l89p8K03J94K42O08l1j29o70P8L44o04m86N89M21M11k96M99O1m75
$$ 732 651 -233 -622 -700 -497 -303 -61 547 516 387 -283 -205 139 -465 -951 -362 59 470 174 673 734 259
7918B59j4l25o63M23j14L48q3P46K94j71o70K45m35n71N59m50J402m43j94N15
$$ 259 245 -80 -743 -320 -434 -86 -169 577 871 700 30 275 -160 -731 -172 -622 780 337 143 658
7938F58o36R0q0n98L69l94M66O45o9o72J040m79j041J77J69j97P92p09N65R32
$$ 658 22 112 32 -566 -197 -591 -125 520 451 -221 819 340 -701 -524 -355 -552 240 -469 96 1028
7958A028p23J58l97Q8o87P95m47j030J704j07j26m61M26l36n4j385J71J113K4
$$ 1028 305 463 66 154 -533 262 -185 -1215 489 382 256 -205 221 -115 -169 -1554 -1383 -270 -246
7977b46pP98J76n53P39j140q24J98mJ16J124l27L38PJ79m24p07L98l68J59L98
$$ -246 -253 545 721 168 907 -233 -1057 -859 -863 -747 377 50 388 395 574 150 -557 -159 -527 -368 30
7998C0P39K38K8m94O0r53k11n5J05j67J583K18n44l62j51o02j40J139j452N82
$$ 30 769 1007 1035 541 601 -352 -563 -618 -513 -680 903 1121 577 215 64 -538 -678 461 -991 -409
8018d09R55J51p1m10r14J722o86j415O28L14K79p08L33Q83P78j429k0j84l06J23
$$ -409 546 697 626 216 -698 1024 338 -1077 -449 -135 144 -564 -231 652 1430 1 -19 -203 -509 -386
8038c86j15R77o67M76O36n30l73j96L54j087J083j101J814J38L3p54K74j16j007
$$ -386 -501 476 -191 285 921 391 18 -178 176 -911 172 -929 885 1023 1056 302 576 460 -547
8057e47j75k29Q5J232o48Q93J20O30j094n21N03r87m6k97J99R45R53k92j54n00
$$ -547 -722 -951 -866 366 -282 611 731 1361 267 -254 249 -738 -784 -1081 -882 63 1016 724 570 70
8077G0l53o49K18J034o64J14r2l34R08k78N57m94j339N69j07P10J245m16o02j48
$$ 70 -283 -932 -714 320 -344 -230 -322 -656 252 -26 531 37 -1302 -733 -840 -130 1115 699 97 -51
8097e1O97o79J15p16L74m45Q75j15K79K85J11k67r01K47p29K73O02N2R98j150
$$ -51 646 -33 82 -634 -260 -705 170 55 334 619 730 463 -438 -191 -920 -647 -45 7 1005 -145
8117a45Q43l18n0r42J26k04j07Q12m04N66R44o34n2n24o87J83L4R49K28o80Q42
$$ -145 698 380 330 -612 -486 -690 -797 15 -389 177 1121 487 435 -89 -776 -593 -559 390 618 -62 780
8138G80j23l77J5q96N4j51M33n04Q16M22L02p2o42k50m16L4o97R83L05M87K05
$$ 780 657 280 295 -601 -547 -698 -265 -769 47 469 771 699 57 -193 -609 -575 -1272 -289 16 503 708
8159G08q0j92N9q48Q65j602R17o02L01Q54L10l50L41k69q11l7J59O72n30K50P59
$$ 708 628 436 495 -353 512 -1090 -173 -775 -474 380 690 340 681 412 -399 -436 -277 395 -135 115 874
8180H74l51M57r36k12l37j90K70K87M08q88Q46
$$ 874 523 980 44 -168 -505 -695 -425 -138 270 -618 228
8191B28
$$ Imaginary data points
##PAGE= N=2
##DATA TABLE= (X++(I..I)), XYDATA
0@%%%%%%%%%JjQj6J6k4L2m0M8n6O6p5R1j08J31j55J79k11K44k82L23l67M22m81
$$ 0 0 0 0 0 0 0 0 0 0 1 0 8 -8 8 -16 16 -24 24 -32 34 -41 50 -58 73 -82 97 -114 130 -152 171 -196 226 -255
33b55N46o18O95p82Q76r83J098j221J360j507J671j849K043k258K486k743L024
$$ -255 291 -327 368 -414 462 -521 577 -644 716 -791 880 -969 1074 -1184 1302 -1441 1583
50A583l330L670m042M458m924N448o044O724p511Q436r540J0885j2563J4734j7661
$$ 1583 -1747 1923 -2119 2339 -2585 2863 -3181 3543 -3968 4468 -5072 5813 -6750 7984 -9677
65i677K1855k8412M0207o8192K63108K86967k39560k28735l00470j63247n1924
$$ -9677 12178 -16234 23973 -44219 218889 505856 266296 37561 -262909 -426156 -478080
76d78080J42203K29978K85532K03896Q6704q9650k07129k76895k28971j22884
$$ -478080 -335877 -105899 179633 383529 470233 380583 173454 -103441 -332412 -455296
86d55296M2948J76944K64407K47025J56923K483j41920k47109k58834j89160m8894
$$ -455296 -412348 -235404 29003 276028 432951 435434 293514 46405 -212429 -401589 -450483
97d50483J01793K22702K62141K16616R4326n5904j89322k54545k34895j34135
$$ -450483 -348690 -125988 136153 352769 447095 391191 201869 -52676 -287571 -421706
107d21706R706J50214K36911K41586J65165L0428j10762k11388k43505j88564
$$ -421706 -412000 -261786 -24875 216711 381876 412304 301542 90154 -153351 -341915
117c41915p0437P2327J89054K40925K09898J06805l2211j60166k33062k26304
$$ -341915 -412352 -340025 -150971 89954 299852 406657 374446 214280 -18782 -245086
127b45086j42263j0887J24714K16551K34170J72081N2489q4567j92348k33359
$$ -245086 -387349 -398236 -273522 -56971 177199 349280 401769 317202 124854 -108505
137a08505j95192r1505M1959J61244K23671K08909J23743l149j27539k08379k15308
$$ -108505 -303697 -395202 -353243 -191999 31672 240581 364324 361175 233636 25257 -190051
148a90051j50823l2579R5238J90454K21222J75224O8690o0037j67034k19920j94852
$$ -190051 -340874 -373453 -278215 -87761 133461 308685 377375 317338 150304 -69616 -264468
159b64468j05249K1017J38745K09902K08436J38295J8014j03986j92103k14707
$$ -264468 -369717 -348700 -209955 -53 208383 346678 364692 260706 68603 -146104
169a46104j60986n7172O8078J68201K11465J79638Q9622l2472j42511k03248j92467
$$ -146104 -307090 -364262 -296184 -127983 83482 263120 352742 320270 177759 -25489 -217956
180b17956j18545l326J14868J91844K03533J45167L7607q3214j75272k07725j69022
$$ -217956 -336501 -339827 -224959 -33115 170418 315585 353192 269978 94706 -113019 -282041
191b82041p3453M6868J51238K03731J86541J06459r554j21109j91061j95624j33063
$$ -282041 -355494 -308626 -157388 46343 232884 339343 329789 208680 17619 -178005 -311068
202c11068k6104R0377J74223J98189J54804N8468n7258j53268j95953j71530q8116
$$ -311068 -337172 -246795 -72572 125617 280421 338889 281631 128363 -67590 -239120 -327236
213c27236K4856J29372J89420J84511J16338Q398j02018j78110j93109j42497
$$ -327236 -302380 -173008 16412 200923 317261 325659 223641 45531 -147578 -290075
223b90075m3743O9615J59229J93377J60841P6701l5532j33925j85196j75623j04518
$$ -290075 -333818 -264203 -104974 88403 249244 325945 290413 156488 -28708 -204331 -308849
234c08849J729J07124J74889J82983J27460K9291p8588j59541j85172j48228n9208
$$ -308849 -307120 -199996 -25107 157876 285336 314627 236039 76498 -108674 -256902 -316110
245c16110M8450J40552J83336J64574Q9272j7025j16617j76075j76097j15962
$$ -316110 -267660 -127108 56228 220802 310074 293049 176432 357 -175740 -291702
255b91702j6563Q9219J61857J80484J38093M7439n7542j41766j78965j54211p6132
$$ -291702 -308265 -219046 -57189 123295 261388 308827 251285 109519 -69446 -223657 -299789
266b99789K7425J20128J71706J64462R9909J841r3495j62845j72698j24017l2775
$$ -299789 -272364 -152236 19470 183932 283841 285682 192187 29342 -143356 -267373 -300148
277c00148O8579J48649J74956J43896O2643m0269j27629j72604j58369r0449Q754
$$ -300148 -231569 -82920 92036 235932 298575 258306 130677 -41927 -200296 -290745 -281991
288b81991J04292J64098J67179J14761K1737p7158j49933j69874j32925n0321
$$ -281991 -177699 -13601 153578 268339 290076 212918 62985 -106889 -239814 -290135
298b90135M9747J32011J68651J47839P6204k1716j11585j63447j58014j00691
$$ -290135 -240388 -108377 60274 208113 284317 262601 151016 -12431 -170445 -271136
308b71136p898Q6804J53486J66217J22477L7590o0384j37784j67315j40079o5714
$$ -271136 -279034 -192230 -38744 127473 249950 287540 227156 89372 -77943 -218022 -283736
319b83736L1518J16829J62171J52421R0430k373r3606j52646j59215j11217k5363
$$ -283736 -252218 -135389 26782 179203 269633 267260 173654 21008 -138207 -249424 -274787
330b74787O8602J39531J61565J28947N1250m2480j21999j61191j42955p6978J4551
$$ -274787 -206185 -66654 94911 223858 275108 232628 110629 -50562 -193517 -270495 -255944
341b55944J02685J54817J52563J00386J3757p7298j42046j57882j19120m1426
$$ -255944 -153259 1558 154121 254507 268264 190966 48920 -108962 -228082 -269508
351b69508N1426J25483J57514J33430O6631k3968j06938j52961j44863q7894k184
$$ -269508 -218082 -92599 64915 198345 264976 241008 134070 -18891 -163754 -251648 -253832
362b53832Q5491J42773J52446J08023K7828o1672j31223j54236j26445n4071L6566
$$ -253832 -168341 -25568 126878 234901 262729 201057 69834 -84402 -210847 -264918 -228352
373b28352J13818J53410J39166P7431r096r3478j43571j47444r7647j7893O8784
$$ -228352 -114534 38876 178042 255473 246377 152899 9328 -138116 -235763 -253656 -184872
384a84872J33474J48822J15221M1753m5866j16457j48611j28908o4987K2147R9143
$$ -184872 -51398 97424 212645 254398 208532 92075 -56536 -185444 -250431 -228284 -129141
395a29141J44396J39212Q6439L510p9476j35816j45305j06067k9524N7017J22291
$$ -129141 15255 154467 240906 244416 164940 29124 -116181 -222248 -251772 -194755 -72464
406g2464J46663J21340N4500l1689j04353j43720j30589p6974M383Q4334J35185
$$ -72464 74199 195539 250039 218350 113997 -29723 -160312 -237286 -232903 -148569 -13384
417a3384J38302R6396J9604o4116j24607j41792j11825m2764M1410J10824J42064
$$ -13384 124918 221314 240918 176802 52195 -89597 -201422 -244186 -202776 -91952 50112
428E0112J25335O4928j6790r3145j37879j35045q6565q240P2181J27768J40727
$$ 50112 175447 240375 223585 130440 -7439 -142484 -229049 -237289 -165108 -37340 103387
439A03387J04575L3547m8620j14330j40221j17465n6387K4922R8118J34044J26853
$$ 103387 207962 241509 192889 78559 -61662 -179127 -235514 -210592 -112474 21570 148423
450A48423P5614j765p7176j28323j33494r4139k1281N8103J17837J37132J09673
$$ 148423 224037 222272 145096 16773 -116721 -210860 -232141 -174038 -56201 80931 190604
461A90604M4561l5673j03848j36153j22368o6921J1441Q5667J30469J30553Q5947
$$ 190604 235165 199492 95644 -40509 -162877 -229798 -218357 -132690 -2221 128332 214279
472B14279J3210o4480j20138j33288j01845l5635M2438J05323J32162J14307N6147
$$ 214279 227489 163009 42871 -90417 -192262 -227897 -185459 -80136 52026 166333 222480
483B22480k0054q9445j28846j22949p5396j879P2846J21360J29706R2485K4987
$$ 222480 202426 112981 -15865 -138814 -214210 -216089 -143243 -21883 107823 200308 225295
494B25295n2480j11431j31499j07572m7645K9399R6294J29714J19064O7421o271
$$ 225295 172815 61384 -70115 -177687 -225332 -195933 -99639 30075 149139 216560 210289
505B10289p8447j22315j25259q5307j6001N8530J12380J27955R9470L6810l8078
$$ 210289 131842 9527 -115732 -201039 -217040 -158510 -46130 81825 181295 218105 180027
516A80027r9834j27286j11150n6875J7008Q4632J23976J19914P5753N298o6810
$$ 180027 80193 -47093 -158243 -215118 -198110 -113478 10498 130412 206165 211463 144653
527A44653j15983j25438r2591k7773M6349J03670J26414J05656M8437k4252q8177
$$ 144653 28670 -96768 -189359 -217132 -170783 -67113 59301 164957 213394 189142 100965
538A00965j22419j14041o8630K443P1281J16007J20110Q4052J8376n2962j06049
$$ 100965 -21454 -135495 -204125 -201682 -130401 -14394 105716 189768 208144 155182 49133
549D9133j22852r7619l8519L2928R3769J22483J08601N8342j2238p8327j17797
$$ 49133 -73719 -171338 -209857 -176929 -83160 39323 147924 206266 194028 115701 -2096
560b096j16954p6221r782O0055J09413J20580R1567L0350l9714r6803j20200j02754
$$ -2096 -119050 -195271 -205053 -144998 -35585 84995 176562 206912 167198 70395 -49805 -152559
572a52559n0174J9517Q2285J16519J10686O7289l1o6287j09131j15809q2314j9333
$$ -152559 -202733 -183216 -100931 15588 126274 193563 193532 127245 18114 -97695 -180009 -199342
584a99342M7192J00186J17026R5680M0203k8453q7196j17359j05260n7583P135
$$ -199342 -152150 -51964 65062 160742 200945 172492 85296 -32063 -137323 -194906 -187771
595a87771P1625J10805J12217P5145J3543n3479j02208j15913q9323l1304L5358
$$ -187771 -116146 -5341 106876 182021 195564 142085 39877 -76036 -165359 -196663 -161305
606a61305R0494J14713R8860N0667j6348p7031j10257j07750o6613k663O0250
$$ -161305 -70811 43902 142762 193429 177081 100050 -10207 -117957 -184570 -187233 -126983
617a26983J04025J12113Q1946K3825m3182r4373j13776r4654m2730K3159Q1259
$$ -126983 -22958 89155 171101 194926 151744 57371 -56405 -151059 -193789 -170630 -89371
628h9371J11475J03706O0400l257o5671j05772j08630p5309j5940M8285R6702
$$ -89371 22104 125810 186210 182953 117282 11510 -97120 -172429 -188369 -140084 -43382
639d3382J10758Q7126L4362l1101q3491j11226r7523n0219J1512P2378J04711
$$ -43382 67376 154502 188864 157763 74272 -36954 -134477 -184696 -173184 -100806 3905
650C905J04045O7266P981n6187r7604j08263q1256k5533L7429Q7264J08524R1777
$$ 3905 107950 175216 183197 127010 29406 -78857 -160113 -185646 -148217 -60953 47571 139348
662A39348M3574j8780p4894j05258r9352n9549N7N9750R9905J04403P2399J8447
$$ 139348 182922 164142 89248 -16010 -115362 -174911 -174854 -115104 -15199 89204 161603 180050
674A80050m4592q9711j05995q5170l5927K7764P9263J04285R4484N1561r008o4899
$$ 180050 135458 45747 -60248 -145418 -181345 -153581 -74318 29967 124451 176012 167004 102105
686A02105j00211j01602o6889r148N0192R2930J03933P9247K8165l3246q3424
$$ 102105 1894 -99708 -166597 -175745 -125553 -32623 71310 150557 178722 145476 62052
697F2052j03962q8911m4591J6076O9380J01257R5644N9384K045n4952r4992j00742
$$ 62052 -41910 -130821 -175412 -159336 -89956 11301 106945 166329 168374 113422 18430 -82312
709h2312p1087k0096L8524Q6101J02096Q3662L7649k3720p3801j00714r2412n1745
$$ -82312 -153399 -173495 -134971 -48870 53226 136888 174537 150817 77016 -23698 -116110 -167855
721a67855N110O0485R5369R7157O6612J2996m5519q8485r9445p7536k8961K8583
$$ -167855 -162745 -102260 -6891 90266 156878 169874 124355 35870 -63575 -141111 -170072 -141489
733a41489P7037R8947Q7025M5263j2486o4827r4545r3899n9050m889N0124Q8634
$$ -141489 -64452 34495 121520 166783 154297 89470 -5075 -98974 -158024 -162913 -112789 -24155
745b4155R6078P3128K0824l4201p9301r7821q1234l8354J7781O8170R5990Q9072
$$ -24155 71923 145051 165875 131674 52373 -45448 -126682 -165036 -147255 -79085 16905 105977
757A05977N2598j719n4166q9810r4709o5610j5447L9990Q1557R6007P7570L0895
$$ 105977 158575 156856 102690 12880 -81829 -147439 -162886 -122896 -41339 54668 132238 163133
769A63133k4439p1317r4139q5718m6562P902N9655R0491R0096N9949Q360m6187
$$ 163133 138694 67377 -26762 -112480 -159042 -151140 -91485 -994 89102 149051 157411 111224
781A11224q2955r2977p0916k4168K9929P4845R3331P9916L9646j4797o3416r0877
$$ 111224 28269 -64708 -135624 -159792 -129863 -55018 38313 118229 157875 143078 79662 -11215
793a1215q6513n3276j511N0581Q5269R0693O5397J7201l5658p7012r2297p5083
$$ -11215 -97728 -151004 -152515 -101934 -16665 74028 139425 156626 120968 43956 -48341 -123424
805a23424l2384K0339O6773Q9985Q2334M7166m856n4537q5404q7770n8845j1201
$$ -123424 -155808 -135469 -68696 21289 103623 150789 145933 91396 5992 -81778 -140623 -151824
817a51824M1598P8336Q8855O9802K4754k5611o9157q8814p8315m0380J1493N8539
$$ -151824 -110226 -31890 56965 126767 151521 125910 56753 -32061 -110376 -150756 -139263 -80724
829h0724Q6146Q3840N3594M427m5921p9584q7413o4559k0029L0978P2088Q7082
$$ -80724 5422 89262 142856 147283 101362 21778 -65635 -130194 -150223 -119245 -47157 39925
841C9925P3031L4153j6270o1555q3966p9395m7640J380N0005Q0036Q4305N8496
$$ 39925 112956 147109 130839 69284 -14682 -94077 -141717 -140337 -90332 -10296 74009 132505
853A32505J2681l6058p3927q5450o8824k7211K1992O4795Q5069P6054M1593p749
$$ 132505 145186 109128 35201 -50249 -119073 -146284 -124292 -59497 25572 101626 143219 135470
865A35470n3723q1204q1683n3302p741M0967P5498Q3759O3027K1445k6318o6977
$$ 135470 81747 543 -81140 -134442 -142183 -101216 -25718 58041 121068 142513 116195 49218
877D9218q3920p0851l4528J3039N6484Q1181P6926M6441J071m5624p5580q1431
$$ 49218 -34702 -105553 -140081 -127042 -70558 10623 87549 133990 135061 89437 13857 -67574
889f7574n6365j5429L2929O8749Q2437O6307K9112j8752o0145q0905p3893m1950
$$ -67574 -123939 -139368 -106439 -37690 44747 111054 140166 121414 61269 -19636 -93529 -135479
901a35479N314M8649P6111P7273N2993J0118l6879p0155p8255o1512k2649K4441
$$ -135479 -130165 -81516 -5405 71868 124861 134979 98100 27945 -50310 -111822 -134471 -110030
913a10030O0841P7980O8464L4259j0004n1550p5685p4474m7111k269M0052P1884
$$ -110030 -49189 28791 97255 131514 121510 69960 -5725 -80199 -127310 -129579 -89527 -17643
925a7643P6983N6930J8516k8689o4498p7506o5682l1140J4462N4584P5833P1867
$$ -17643 59340 116270 134786 106097 41599 -35907 -101589 -132729 -118267 -63683 12150 84017
937H4017M1378p82m4010p2114p3805n1662j1255L2071O5463P5578O0792K3973
$$ 84017 125395 124613 80603 8489 -65316 -116978 -128233 -96162 -30699 44879 105671 129644
949A29644k0015n7676p5857o7466l6143O804M8285P2647P2746M7955O617l6906
$$ 129644 109629 51953 -23904 -91370 -127513 -120709 -72424 223 72969 120924 127541 90635
961I0635o7511p4757n7160j9879K4207N9456P4567O3881L1531j1412n0115p2051
$$ 90635 23124 -51633 -108793 -128672 -104465 -45009 29558 93439 124970 113558 63443 -8608
973h608o8401m2284n79M0012O8375P1634N0076J2594k8478o1659p3075n9084k5206
$$ -8608 -77009 -119293 -119872 -79860 -11485 60149 110225 122819 94341 32682 -40393 -99477 -124683
986a24683J6556N4050P2683O5393L7700m490m4212o8298p0060m7359q733L2421
$$ -124683 -108127 -54077 18606 83999 121699 117209 72997 4699 -65361 -112720 -121453 -89032
998h9032O3328P1266N5523K0336k0747n5847p0071o2001l1178Q825M7276O8278
$$ -89032 -25704 45562 101085 121421 100674 44827 -25244 -87245 -118423 -109598 -62322 5956
1010E956O6041M1581K309l6751o4239o9436n1103j4962K6525N7785P0055N8883
$$ 5956 71997 113578 115887 79136 14897 -54539 -105642 -120604 -94079 -36294 33761 92644
1022I2644K7192j3781m9705o8626o4064l7592J075L9642O4403O6993M6624J0373
$$ 92644 119836 106055 56350 -12276 -76340 -113932 -112857 -73215 -8812 58181 104805 115178
1034A15178k9132n8374o7778n3739k1445J8344N1490O7226N9578L2068p008m3207
$$ 115178 86046 27672 -40106 -93845 -115290 -96946 -45456 21770 81348 113416 106408 63201
1046F3201o4700o4665m2014m965L3253O0400O6846N0856J7014k1682n4037o6609
$$ 63201 -1499 -66164 -108178 -113143 -79890 -19490 47356 98212 115226 93544 39507 -27102
1058b7102n6773k8111J0124M5102O4178O0513L6468J726l5184o1151o2076m4935
$$ -27102 -83875 -111986 -101862 -56760 7418 67931 104399 106125 70941 9790 -52286 -97221
1070i7221j2094K5719N4595O5395N1164K3079j5377m9112o3387n7629l1993L878
$$ -97221 -109315 -83596 -29001 36394 87558 110637 95260 46148 -17239 -74868 -106861 -102983
1082a02983L9168O0758O1107M2146Q072k9066n6260o2857m9860j8246J8047M9515
$$ -102983 -63815 -3057 58050 100196 108268 79202 22942 -39915 -89775 -108021 -89974 -40459
1094d0459O2084N4283K7622p075m0779o0114n8944l6966j996L3143N6252O1484
$$ -40459 21625 75908 103530 96455 55676 -4438 -63382 -100348 -102344 -69201 -12949 48535
1106D8535M4183J3725k3083n2040o1898n1409k2811J1280M4029O1189N6221L3175
$$ 48535 92718 106443 83360 31320 -30578 -81987 -104798 -93518 -49489 11700 67921 101096
1118A01096k402l5828n5109n9945l9770r886K5721N1332N9715M7779J8923j5774
$$ 101096 98694 62866 7757 -52188 -91958 -101844 -76123 -24791 34924 82703 101626 85852
1130H5852m5479n9451n2562k8762O514L8257N7277N7339L6261N098k9676n3926
$$ 85852 40373 -19078 -71640 -100402 -93888 -55631 1646 58985 95246 100344 70668 16742
1142A6742n9534m3826j5122J9179M8014N9886M9636K5652r924m0330n7399n4684
$$ 16742 -42792 -86618 -101740 -82561 -34547 25339 74975 100627 90703 50373 -7026 -61710
1154f1710l2104l99L1077N3640N6658M0196J0794k3663m8728n7934m7069j9129
$$ -61710 -93814 -94213 -63136 -9496 47162 87358 98152 74489 25761 -32173 -79242 -98371
1166i8371J3919M2736N7046N2367K8638l335l5495n4739n5771l6547o083K6026
$$ -98371 -84452 -41716 15330 67697 96335 93000 57505 2766 -53005 -89552 -95635 -69609
1178f9609N0204N5972M2725J6021j6299m3755n4998m8907k3936O800L6811N3867
$$ -69609 -19405 36567 79292 95313 79014 35259 -19739 -68646 -92582 -85782 -48971 4896
1190D896N0975L2393K401k9687n0895n2987m0092j0945K1473M4751N4690M6324
$$ 4896 55871 88264 90665 60978 10083 -42904 -82996 -93941 -72468 -27717 26973 73297
1202G3297K1056j1514l9476n3820m9712k9548Q07L1687N0388N2773L6818Q170
$$ 73297 94353 82839 43363 -10457 -60169 -89717 -88910 -57223 -6835 45938 82756 90926
1214I0926k3096m6073n3182m2005j6920J4308M0582N2443M7025K4724n721l4253
$$ 90926 67830 21757 -31425 -73430 -90350 -76042 -35460 16983 64008 88732 83011 48758
1226D8758n0910m9991l2905l544K6683M7612N2081L9633J3355j7588m2772n1919
$$ 48758 -2152 -52143 -85048 -88592 -61909 -14297 37784 77417 90772 73184 30412 -21507
1238b1507m5113k1913Q281L5470N0269M8914K9000N70k8160m7457m9340l5628
$$ -21507 -66620 -88533 -80252 -44782 5487 54401 83401 83971 55811 8354 -40986 -76614
1250g6614q801K0217M2779N0913M1038J7176j2339l7651n0937m5593k4860L408
$$ -76614 -85415 -65198 -22419 28494 69532 86708 74369 36718 -14219 -59812 -84672 -81264
1262h1264L0474M8447M9030L2644O154k3839m3417m9604l8898j4609J5113L7744
$$ -81264 -50790 -2343 46687 79331 85485 61646 18229 -31375 -70273 -84882 -69769 -32025
1274c2025M8464M3270K1834o729l0613m7495m5622k9141j536K4928M4996M7035
$$ -32025 16439 59709 81543 74814 44201 -3294 -48916 -78057 -79593 -54665 -9669 37366
1286C7366L5156J0211j8489l9158m9463m0743j7673Q607L5029M7710M4566K7291
$$ 37366 72522 82733 64244 25086 -24377 -65120 -82793 -74186 -39157 8553 53119 80410
1298H0410j701k7659m4384m6174l2906p227J9170M0425M5976L6776J6540j1854
$$ 80410 78709 51050 6666 -39508 -72414 -79641 -60471 -20046 25930 62706 79246 67392
1310F7392l6693m4261m0641k2864L932K9984M3793M4635K8855L582k3297m2152
$$ 67392 30699 -13562 -54203 -77067 -73135 -43151 642 45277 74132 77714 54417 12265
1322A2265m5405l5225j1303J5475L7108M5455M0446J8134n719l1562m3223m2354
$$ 12265 -33140 -68365 -79668 -64193 -27085 18370 58816 76950 71231 39669 -3554 -45908
1334d5908k6527j909K4582M0774M4025L1332Q150j6846l7480m4291l5625j4946
$$ -45908 -72435 -74344 -49762 -8988 35037 66369 74519 57673 20193 -24098 -59723 -74669
1346g4669J0378L3392M2653M0312K1085j416k8050m1350m3690k7787o206K0245
$$ -74669 -64291 -30899 11754 52066 73151 71735 43685 2335 -41355 -69142 -75348 -55103
1358e5103L8288M4294L4196J2945j1978l3885m2162l7711k1035M912K7550M1297
$$ -55103 -16815 27479 61675 74620 62642 28757 -13405 -51116 -72151 -67239 -39689 1608
1370A608M0003K5682K802k2202l8092m2039l0102j0157J5917L5402M1759L6684
$$ 1608 41611 67293 70095 47893 9801 -32238 -62340 -72497 -56580 -21178 20581 57265
1382E7265J5439q582l0722m1204l9282k2926Q58K3100L9714M0982L0366O240j7404
$$ 57265 72704 64122 33400 -7804 -47086 -70012 -69154 -46054 -6340 34642 65008 71248 53844
1395E3844l4682m0402l3743j4509J0035L0562M0036L5625J9290l498k4101l8554
$$ 53844 19162 -21240 -54983 -69492 -59457 -28895 11141 46766 66056 62558 38457 -97
1407i7l8561k4945l729K0587L5567L9582L1998Q322j2615l1750m0783l5997j7581
$$ -97 -38658 -63603 -67332 -46745 -11178 28404 60402 68724 56109 24359 -16424 -52421 -70002
1420g0002O765K7018L9033L7897K3693J675k0818l5647l9250k8307p835J4260
$$ -70002 -63237 -36219 2814 40711 64404 66079 45261 9614 -29636 -57943 -65778 -51518
1432e1518L2388L8136L2301J4250q509k9137l7028l5290j9827J874K3522L6969
$$ -51518 -19130 19006 51307 65557 57048 27911 -9117 -44407 -64234 -62360 -38838 -1869
1444a869L6998K6231N320j7651l4707l8468k9875j2775J1276K8991L7575L4159
$$ -1869 35129 61360 66680 49029 14322 -24146 -54021 -66796 -55520 -26529 11046 45205
1456D5205J8511l944k3645l6094l5551k3013k899J8002L3120L7267K6832P356
$$ 45205 63716 59772 36127 33 -35518 -58531 -61430 -43428 -10308 26959 53791 61147
1468F1147j1665k9931l6533l0638j5249O557K7063L5928L3787K0439J59k0664
$$ 61147 49482 19551 -16982 -47620 -62869 -56312 -29249 6679 40466 60905 61064 40400
1480D0400l4600l5911k6323n929J4422L1343L4591L0447J2507p976k6454l5044
$$ 40400 5800 -30111 -56434 -62363 -47941 -16598 17993 48440 60947 52971 26517 -8527
1492h527l1419j7991J866K2063L2951L3189K3476K998j6267l1560l5004k6406
$$ -8527 -39946 -57937 -56071 -34008 -1057 32132 55608 58606 42339 10779 -24225 -50631
1504e0631r337J0346K8471L5173K9390J5751l851k3593l3795l3348k1136j703
$$ -50631 -59968 -49622 -21151 14022 43412 59163 55312 31719 -2076 -35424 -56560 -58263
1516e8263J7925L1301L4124K5276P925j2096k7938l3033k9095j2403N774K4295
$$ -58263 -40338 -9037 25087 50363 58288 46192 18254 -14779 -43874 -56277 -50503 -26208
1528b6208L2439L0590J8686k057j8529l0973l3249k1987n516J4727K8829L3000
$$ -26208 6231 36821 55507 53450 34921 3948 -29301 -51288 -56804 -42077 -13248 19752
1540A9752K6811J1655r190k5881l2358k9856j6492K799K0501L0913L1236K0438
$$ 19752 46563 58218 49028 23147 -9211 -39067 -55559 -52760 -32259 -1346 29890 50328
1552E0328L522j5837k7539l1488k4624q243R538K5542L1424K8104J3421n546k1707
$$ 50328 53850 38013 10474 -21014 -45638 -53881 -44343 -18801 12623 40727 54148 48602 26895
1565B6895l1160k9584j8537p04J7273K9918L1450K2586O536j2945k5903l1413
$$ 26895 -4265 -33849 -52386 -53090 -35817 -5899 25551 48137 54673 41728 15825 -15588
1577a5588k5858j1719N596K3348K9665K8386J6598q24j8191k8326k9815k0139
$$ -15588 -41446 -53165 -47569 -24221 5444 33830 50428 49604 31413 3087 -26728 -46867
1589d6867l966J3490K5893L0376K4013R217q719k3456l0310k6785j4454L231J9805
$$ -46867 -50833 -37343 -11450 18926 42939 52156 43437 19981 -10329 -37114 -51568 -48337 -28532
1602b8532K8347K8780J9649K206j5342k6613k9533k2313p327R499K4301K9160
$$ -28532 -185 28595 48244 50450 35108 8495 -21038 -43351 -50678 -41179 -16878 12282
1614A2282K4262J2359m869j9832k8083k7374j5776j30J5557K6900K8156K0715
$$ 12282 36544 48903 44034 24202 -3881 -31255 -47031 -47161 -31604 -4704 23452 44167
1626D4167N211j1857k4315k8476k4206r775O383K1041K8817K5308J5432j322j7485
$$ 44167 49378 37521 13206 -15270 -39476 -49251 -42868 -21827 6990 32298 47730 46408 28923
1639B8923k6541k7493j8103m173J2520K4730K7834K1409Q447p263k2399k7558
$$ 28923 2382 -25111 -43214 -47387 -34867 -10137 17697 39106 47553 40290 17891 -9667
1651i667k3879j2942L815J8043K6789K5625J6550J821j4189k4935k7618j9779
$$ -9667 -33546 -46488 -42673 -24630 2159 27784 44334 46155 31966 7031 -20587 -40366
1663d0366o333R241K2663K6561K3397J1054m620j9321k5703k4922j5478J22J4997
$$ -40366 -46699 -37458 -14795 11766 35163 46217 41597 22276 -3427 -28349 -43827 -43705 -28708
1676b8708K5208K5379J8466M551j0815k2285k6894k1011q981O735J9751K6035
$$ -28708 -3500 21879 40345 44896 34081 11796 -15098 -36109 -45090 -38355 -18604 7431
1688G431K3887J2865k497j5611k5031k5132j6974l132J2397K2708K5906J9937
$$ 7431 31318 44183 41686 26075 1044 -24088 -41062 -44194 -31797 -9089 16817 36754
1700C6754P637p604k0169k5574k2273j1322K987J6624K4482K3675J5187J256j3311
$$ 36754 44391 36787 16618 -8956 -31229 -42551 -39564 -22940 1542 25217 40404 41660 28349
1713B8349k2506k4960j8315n425R395K0382K5582K0882R568m741j7846k4630k2804
$$ 28349 5843 -19117 -37432 -42857 -33462 -13080 12502 33384 42952 38211 20365 -4265 -27069
1726b7069j3881L62J3559K4027K3715J6581M141j0619k0025k4202k0026p516N747
$$ -27069 -40950 -40588 -27029 -3002 20713 37294 41435 30816 10791 -13411 -33437 -40953 -35206
1739c5206J8185K3755K1667J1441k046j4898k3347k2846j4704k467J1678K1163
$$ -35206 -17021 6734 28401 39842 37796 22898 -449 -23295 -37999 -40466 -28788 -7625
1751g625K3893J8258P027p789j8666k4513k0585j0212L364J5543K2877K2193J4000
$$ -7625 16268 34526 41553 33764 15098 -9415 -30000 -40212 -36848 -21305 1572 23765 37765
1764C7765K48j1763k0715k2987j6834n060Q283J9326K3143J9417Q752n599j6355
$$ 37765 38013 26250 5535 -17452 -34286 -39346 -31063 -11737 11406 30823 39575 33976 17621
1777A7621k2942k0143j3224J211J3169K2644K1782J5952K833r805j9511k2685
$$ 17621 -5321 -25464 -38688 -37477 -24308 -1664 20118 36070 38903 29098 9587 -13098
1789a3098j8423p209N453J6759K2564K0298J0827j757j3308k1915k1141j3978
$$ -13098 -31521 -38730 -33277 -16518 6046 26344 37171 35414 22106 191 -20950 -34928
1801c4928j670J0879J9406K1586J6688N633p290j7954k1895j8266r766L980J4521
$$ -34928 -36598 -25719 -6313 15273 31961 37594 30304 12350 -9545 -27811 -37577 -33597 -19076
1814a9076K1768K0386J2339Q87j1637k0103k1680j5006m898Q345J8177K1009J7872
$$ -19076 2692 23078 35417 36304 24667 4564 -17116 -32122 -37020 -28675 -10498 10511 28383
1827B8383Q244n088j4660k1554j9042j1000J090J1929J9910K0922J3962J919r133
$$ 28383 36627 31539 16879 -4675 -23717 -34717 -33627 -21698 -1788 19134 33096 35015 25882
1840B5882j8623k1068j6332o145O573J5112K1678J8211J0334k423j3598k0242
$$ 25882 7259 -13809 -30141 -36286 -29713 -14601 7077 25288 35622 33199 19601 -641
1852f41j9062j3469j825J0643J7888K1284J4629N457p319j5863k0518j6827q735
$$ -641 -19703 -33172 -34997 -24354 -6466 14818 29447 34904 27585 11722 -8796 -25623 -34358
1865c4358L536J3987J9894J8392J1452m86j0908j8735j9884j2981m077P521J7343
$$ -34358 -30822 -16835 3059 21451 32903 32417 21509 2774 -17110 -30091 -34168 -26647 -9304
1878i304K0058J6120P930m973j4370j9862j8230j0479J230J1818J7752J9659J3116
$$ -9304 10754 26874 34804 29831 15461 -4401 -22631 -33110 -31880 -20062 -2310 17349 30465
1891C0465K696q795j7717j8783j4668o042N579J5210J8588J7285Q367k359j3123
$$ 30465 33161 24366 6649 -12134 -26802 -32844 -27265 -12055 6533 23818 32185 29826 16703
1904A6703j8399j8103j1526m73R805J7359J9049J4171M250o487j6143j8027j6655
$$ 16703 -1696 -19799 -31325 -31798 -21993 -4634 14415 28586 32836 26349 10206 -7821 -24476
1917b4476q010L913J2805J8164J7754J0265n16j0033j6906j8137j2759l442P861
$$ -24476 -32486 -28573 -15768 2396 20150 30415 29899 19866 2960 -15177 -27936 -31378 -23517
1930b3517J5764J8273J4964O284m916j3638j8697j6217r090J838J1105J7527J7544
$$ -23517 -7753 10520 25484 31768 26852 13214 -5483 -21700 -30790 -28952 -17847 -320 17224
1943A7224J1931J878q644j5713j9109j3883m270M612J5049J7603J5552P813k274
$$ 17224 29155 31033 22389 6676 -12433 -26316 -30586 -25974 -10925 6678 22230 30043 27769
1956B7769j1758j7269j6923j0395o14R249J6278J7681J2508L481o804j4573j7373
$$ 27769 16011 -1258 -18181 -28576 -29190 -19941 -3663 14018 26526 30007 23203 8630 -8743
1969h743j4811o652L675J3093J6759J6496R458j131j0160j6003j6558j1984k773
$$ -8743 -23554 -30206 -26531 -13438 3321 19817 29275 28144 17984 1981 -14577 -26561 -29334
1982b9334P660J4316J7336J3117N178l454j2776j7009j4760q022J254J0197J5550
$$ -29334 -21674 -7358 9978 23095 28273 24819 12043 -4966 -19726 -27748 -26494 -16297 -747
1995g47J7185J0877O34p995j5153j6323j3175m388O184J1932J7809J4229P221
$$ -747 16438 27315 27949 19954 4801 -11522 -24697 -29085 -22901 -10969 6840 21069 28290
2008B8290k450j1193j6321j5489j0213p64R723J5162J5733J1761L427n931j3920
$$ 28290 25840 14647 -1674 -17163 -27376 -28140 -18417 -3255 12478 24239 27666 21735 7815
2021G815j6334j2811o398L738J1377J6349J4524Q623q50r922j4806j5572j0659
$$ 7815 -8519 -21330 -27728 -23990 -12613 3736 18260 26883 26033 16111 1305 -14267 -24926
2034b4926k534P341J4230J5646J2568N046m372j2128j5766j4063p682J549J0281
$$ -24926 -27460 -20119 -5889 9757 22325 27371 22999 10871 -4895 -18958 -26640 -25091 -14810
2047a4810J5007J5056R650J127p681j4084j5340j1418m160N394J2200J5534J3570
$$ -14810 197 15253 24903 26030 18349 4265 -11075 -22493 -26653 -21259 -9059 6475 20045
2060B0045O313k341j0562j5650j3980q866o96Q950J4147J5146J0599K925o297
$$ 20045 26358 24017 13455 -2195 -16175 -25041 -25737 -16787 -2640 12506 23105 26030 19733
2073A9733j2655j4649j2900n464L570J1164J4759J3344Q038q97r430j3800j4460
$$ 19733 7078 -7571 -20471 -25935 -22365 -11201 3558 16902 24940 24043 14613 813 -13647
2086a3647j0033j494O724J3389J4759J1006M601m915j0903j4699j3255o267J578
$$ -13647 -23680 -25174 -18450 -5061 9698 20704 25305 20390 9487 -5212 -18467 -24734 -23156
2099b3156J0200J3392J2823Q916J297p665j2445j3938j0868l421M953J2344J4164
$$ -23156 -12956 436 13259 22175 23472 15807 3362 -10576 -21444 -24865 -19912 -7568 6596
2112F596J2207O104k955j0375j3676j3162q261J31Q204J2959J4060R627K716n945
$$ 6596 18803 24907 21952 11577 -2099 -15261 -23522 -23391 -15187 -2228 11832 21459 24175 18230
2126A8230j1781j4562j1248m816L554J0484J3922J2637O951j079q717j3008j3392
$$ 18230 6449 -8113 -19361 -24177 -20623 -10139 3783 16420 23371 22292 13575 567 -12825
2139a2825q864j637O557J2134J3751J0555L652m187j0692j3547j1796o247J898
$$ -12825 -21689 -23326 -16769 -4635 9116 19671 23323 19136 8444 -5103 -16899 -23146 -21248
2152b1248R138J3129J2540Q140Q28p068j2275j3092j0104k943M890J0933J3431
$$ -21248 -12110 1019 13559 21699 22527 15459 3184 -9908 -20012 -22955 -18065 -7132 6299
2165F299J0909N214k397r441j2886j2179p278K96P682J2320J2701Q976K085n639
$$ 6299 17208 22422 20025 10584 -2302 -14481 -21759 -21463 -13781 -1461 11240 20216 22301 16662
2179A6662j1374j2922j0662m012L235R909J2773J1639O544j129p995j2366j2429
$$ 16662 5288 -7634 -18296 -22308 -19073 -9164 3609 15248 21792 20663 12668 302 -12127
2192a2127q053j244O194J1235J2676R622L122l947j0048j2605j0778n298J909
$$ -12127 -20180 -21424 -15230 -3995 8681 18303 21425 17478 7430 -5175 -15953 -21251 -19342
2205a9342Q500J2243J1844P143L79o911j1555j2201r095k356M848J0281J2661
$$ -19342 -10842 1401 13245 20388 20767 13856 2301 -9900 -18995 -21351 -16503 -6222 6439
2218F439J0190M445k520q734j2207j1541o039L85P049J1292J1760Q113J578n508
$$ 6439 16629 21074 18554 9820 -2387 -13928 -19967 -19582 -12533 -1241 10519 18632 20210 14702
2232A4702j0303j1653r551l939L785R245J1954J0552N950j726p434j1950j1083
$$ 14702 4399 -7254 -16805 -20744 -16959 -7714 4240 14792 20742 19016 11582 -368 -11451
2245a1451p728j330O147J0694J1666R317L012l804r698j1694r661m701J341Q131
$$ -11451 -19179 -20509 -14362 -3668 7998 17315 20327 16523 6825 -4869 -14530 -19231 -17890 -9759
2259i759J1116J0565O317O41o783j0417j0943q131k054M611R710J1561R075M042
$$ -9759 1357 11922 18239 18880 12097 1680 -9263 -17394 -19448 -14837 -5127 6434 15509 19551
2273A9551k651q514j1229r929o313P43O703J0876J0348P754K078n749r281j0849
$$ 19551 16900 8386 -2843 -12772 -19085 -18342 -11639 -763 9585 17339 19417 13668 4387 -6462
2287f462r261l220L226Q415J1064R530M976j415p380j0268j0162o615l22N503
$$ -6462 -15723 -18943 -15717 -7302 3762 13292 18268 16853 9473 -795 -10957 -17572 -17894 -12391
2301a2391J0023J0765Q116K163m195r176j0303r616l479J477P265J0773J0141
$$ -12391 -2368 8397 16513 18676 14481 5305 -4998 -14614 -18093 -16616 -9351 1422 11563
2314A1563O464J39p083r596j0122o992k423M633R279R735Q527L045j779q428j0233
$$ 11563 18027 18166 11083 1487 -8635 -15627 -18050 -13417 -4138 5597 14124 17169 15390 6962 -3271
2329c271r518n349J970O355R657J0476O062P13m246r779r939q175k825L382Q911
$$ -3271 -12789 -18138 -16168 -9813 -156 10320 16382 17095 12849 3070 -6869 -15044 -17869 -14487 -5576
2344e576R012R344M319j539o355r798r355o187k61M876R188R782P207K036l927
$$ -5576 3436 12780 17099 15560 9205 -593 -9948 -16135 -16396 -11520 -2332 7450 14657 16693 12766
2359A2766p944r751q504l474J713P760R775Q537N463n57n646r236r806o756j101
$$ 12766 4822 -4929 -13433 -16907 -15194 -7434 2341 10878 16341 15784 10138 902 -8904 -15660 -16761
2374a6761L936Q598R966P545K879k620p154r048q782m514R85O528Q662R456N427
$$ -16761 -12825 -4227 5739 13284 16163 13543 6389 -2659 -11441 -15955 -14970 -8442 220 9676 15103
2389A5103L05m042r257r008o592k368K584P970R686P967L648j372o762q205r632
$$ 15103 15408 11366 2109 -6899 -13491 -15859 -13275 -5305 4381 12348 15996 14624 7862 -343 -9975
2404i975n646K32N210Q500Q657O547K074l585p409r071p346l551K175O580Q830
$$ -9975 -15621 -15389 -10179 -1679 6978 13525 15599 12014 4605 -4466 -11812 -15363 -13188 -6608 2222
2419B222P956M712p11n385q377q491n894j058L891P864R600O111K985l002o522
$$ 2222 10178 14890 14179 8794 417 -8074 -13968 -15026 -11135 -3271 6329 12440 15425 12423 5901
2434E901q856p784m148J019N355Q737Q260N084P14m309p657q210o675j846K725
$$ 5901 -2955 -10739 -14887 -13868 -8513 224 8484 13568 14282 9973 2316 -5894 -12569 -14415 -11690
2449a1690P102Q489P062L253j918n669q198p978m455O67M653P757Q466N971J098
$$ -11690 -4588 3901 10963 14216 12298 6629 -1569 -9547 -14002 -13335 -8682 -925 7541 13512 14610
2464A4610m008o726q169o417l422J957O524Q100O498M664j281n059p002q224m488
$$ 14610 10602 3876 -4293 -10710 -14132 -12175 -5651 2449 8947 13611 12330 7271 269 -7955 -12443
2479a2443r52L801P275P576N190L522k362q023o119p502l183Q80O146N932Q223
$$ -12443 -13395 -9594 -2319 5257 10447 13969 11607 3584 -2535 -10037 -13220 -12340 -6194 -262 7961
2494G961N980m14m167p454p288o508o69J829O036Q345O288L309j704n688p179
$$ 7961 13941 13527 9360 1906 -5382 -11890 -12559 -10730 -4694 3651 9939 13248 11544 5856 -1323
2509a323p172m030K05M401P331P180N457Q42l398o437p796o147k142J740O425
$$ -1323 -8495 -12525 -12320 -7919 -588 6592 12049 12891 9493 3056 -4740 -10887 -13029 -11289 -4864
2524d864O328P330L393J13m674p949o680l791j340L046O989O810O028J093j689
$$ -4864 1464 8794 12187 12300 7626 -323 -7003 -10794 -12134 -9088 -2099 4711 10739 11832 10143
2539A0143n939o768o514k954J133M990O522O808M884p42l934o784p344m987l52
$$ 10143 4204 -2564 -9078 -12032 -10899 -5909 613 7421 12305 11563 7629 845 -6499 -11486 -11838
2554a1838K703O699O172N832K314j802m775p192n370m310j02M882N149P800M138
$$ -11838 -9135 -2436 3736 9568 11882 10080 5305 -1887 -7257 -11567 -11669 -6787 -1638 6162 10300
2569A0300j08q81p063o503n029k265J442N934O858O525K010j207m077o065o551
$$ 10300 10192 9311 2248 -4255 -9284 -11549 -10107 -4173 2685 9210 11220 10013 5936 -129 -6680
2584f680m253K82L271N612O790M660J762k091n837o098n701l095J772M457N445
$$ -6680 -10933 -10651 -7380 -1768 5022 9682 11444 9353 3516 -2582 -8283 -11378 -9606 -5149 296
2599B96O574L592l99l316n981o629m178q30K933N830N973N243R65r93m521o205
$$ 296 6870 10462 10063 6747 766 -5863 -10041 -10871 -7938 -2108 3865 9108 10073 9080 4559 -1646
2615a646o074l205P64L227O722N684M317J15l089n354n179m429j563J196N250
$$ -1646 -7720 -10925 -10161 -6934 -212 5472 9789 9904 6815 1461 -3718 -8147 -9710 -8514 -3264
2630c264M952O086J536l98l499o541m532m063l87L382N631N074N399J241l099
$$ -3264 1688 7774 9310 8912 5413 -1128 -5660 -9723 -10110 -6728 -1097 3977 9376 10617 7518
2645G518m219n788m869k705N72M596N792N120L530p67k173n559o126l145j450
$$ 7518 3299 -2489 -7358 -10063 -9491 -4895 897 6017 9547 8780 6607 1048 -5078 -8223 -9673
2660i673K841M147O019M522J149j183m250n515n465k088N92L649N141N995L034
$$ -9673 -6832 -2685 3334 7856 9005 7822 3572 -1943 -7408 -9496 -8904 -5255 -114 5881 8915
2675H915N84k455n293n314m538n67J129L884N869M564J806o79l669m952n235k123
$$ 8915 9499 7044 1751 -3563 -8101 -8668 -7539 -3655 2214 6778 8584 7905 4236 -716 -5951 -8074
2691h074m91K867M878N127L593R85k163m416n735l707j901Q28L594O256M504L061
$$ -8074 -8565 -5698 -820 4307 7900 8885 6722 2306 -3429 -7136 -9037 -8209 -4615 1641 6145 9206
2707I206n57l449m732m941l512j019K570M532M779L725K063j530l262n543m133
$$ 9206 8649 5200 468 -4473 -7985 -9004 -6434 -1902 2877 6602 8665 7135 3873 -1670 -5803
2722e803k580Q65L327M818M411K940N19k682n234m500l684n13J292L996N053M191
$$ -5803 -8383 -7518 -4191 627 5038 7978 8497 5815 581 -3919 -7603 -8116 -6824 -2828 2225 6416
2738F416K097o54l217n261m400l116o8K845M272M642L399P35j615l965m532l924
$$ 6416 8513 7859 4642 -619 -5019 -8135 -8203 -5358 -1086 3556 6955 7690 6075 2110 -2422 -6346
2754f346j487J246L413M754L701K362p50k574m372m681k826p15K618L732M934
$$ -6346 -7833 -6587 -3174 1580 5281 7643 6893 4319 -53 -4734 -7560 -8275 -5657 -1925 3009
2769C009L816J320j040m191m084m404k068M86L178L914M327K799j6k113l928m311
$$ 3009 6825 8145 7105 2914 -1170 -5574 -7642 -7156 -3978 -64 4263 7062 7046 4933 1005 -3306
2785c306l077r71J590L743M218L624J657q41l243m351l951k387Q2K601L743M605
$$ -3306 -6383 -7354 -5764 -2021 2197 5821 7478 6637 3394 -957 -4908 -7295 -7213 -4612 -869 3736
2801C736K999Q43j764l660m278l620j569J278K678M233L748K118k05k501l915
$$ 3736 6735 7578 5814 2154 -2124 -5744 -7313 -6035 -3357 876 4624 6742 6537 4036 121
2816A21l903k894n4J883L596M286L127J023j515l150m208l567j781K50L493L799
$$ 121 -3782 -6676 -6730 -4847 -1251 3035 6162 7185 5670 2520 -1688 -5255 -7036 -6786 -3293 506
2832E06L276K963K57j932m077l756k799j035J164L232L923L151J830j090k644
$$ 506 3782 6745 7002 5070 993 -2763 -5562 -6597 -5433 -2201 1722 4873 6703 5613 2969
2847B969l646l572k090M97J862L722L906K466M89j800l420l880l054j155J137
$$ 2969 -677 -4249 -6339 -5842 -3980 -258 3648 6114 6603 4803 1383 -2497 -5551 -6706 -5569
2862e569K826L851L454J738n4k720l361l241k949p19K240L341L194L175P28j624
$$ -5569 -2743 1108 4562 6300 6246 3526 165 -3076 -6025 -6744 -4504 -1163 2031 5206 5934 4310
2878D310j704l900l710r30R44J577M551L602O86N05j491m169l799k427p72J979
$$ 4310 2606 -1294 -5004 -5934 -4990 -3413 1138 4740 5426 5931 4440 271 -3528 -5955 -6727 -4748
2894d748K880L702K671J635q46k349l600l008k022J22K008L272L164K299M89j577
$$ -4748 -1868 1834 4505 6140 5294 2945 -655 -3663 -5685 -5563 -3555 -283 2881 5180 5669 4092
2910D092k971l291k767r02J080K682L413K892J584o08k055l401l217j907l70J862
$$ 4092 1121 -2170 -4937 -5839 -4759 -2077 1336 4228 5812 5204 3149 -252 -3469 -5376 -5746 -3884
2926c884K727L481K603P64j359k366k674l325j472Q91K174K943K887J985j72j674
$$ -3884 -1157 2324 4927 5691 4332 1966 -708 -4033 -5505 -4614 -2440 503 3390 5375 5203 3529
2942C529l343k827k292n30J316K765L241K640Q78q02k273l193k768j629P9K081
$$ 3529 186 -2641 -4933 -5463 -4147 -1382 1859 4499 5377 4575 2302 -891 -3659 -5288 -5209 -3128
2958c128K814L046J954M09j409k605l032k332p34Q79K246L052K536J261n15j867
$$ -3128 -314 2732 4686 5095 3686 1081 -1951 -4283 -5017 -4138 -1892 1160 3696 4957 4442 2575
2974B575k910k727j795r8J709K726K882K001R18j094k607l019k452j170O19K026
$$ 2575 -335 -3062 -4857 -4955 -3246 -520 2362 4363 5281 4187 1580 -1439 -3891 -5061 -4442 -2416
2990b416K793K782J505j59j485k746k715j789l44J159K461K651K195Q93r33k041
$$ -2416 377 3159 4664 4505 3020 274 -2441 -4230 -4574 -3415 -954 1697 3892 4785 3852 1811
3006A811k881k487j197K94J822K722K703J697L54j543k685k559k193n34R34K233
$$ 1811 -1070 -3557 -4754 -4460 -2638 84 2787 4484 4838 3295 610 -1949 -4142 -4676 -3742 -1509
3022a509K638K289R77m21j846k703k428j225j74J583K263K424K260K94r24k555
$$ -1509 1129 3418 4395 3974 2128 -575 -3003 -4228 -4402 -2819 -556 1868 4128 4422 3498 943
3038I43k310k077j399R32J977K682K513J151k61j604k410k532j452k66J370J679
$$ 943 -1367 -3444 -4843 -3911 -1934 748 3261 4412 4151 2547 137 -2395 -3847 -4113 -2743 -1064
3054a064K764J682Q55q65j790k560j998j033L62J533K463K290J327mj313k241
$$ -1064 1700 3382 4237 3372 1582 -978 -2976 -4009 -3647 -2114 349 2639 3966 3962 2649 408
3070D08k340j748l98Q39K002K404K055Q21n69j601k237k190j299P2J292K219K226
$$ 408 -1932 -3680 -4078 -3239 -1237 1167 3222 4043 3474 1873 -364 -2554 -3853 -3781 -2489 -270 1956
3087A956J474K58j025j785k217j808n28N42J707K284K000Q83k65j344k294k131
$$ 1956 3430 3688 2663 878 -1339 -3147 -3675 -3133 -1426 858 2858 3741 3476 2132 -162 -2293
3103b293j264j27J011K024K298J627M48o85j763k222j692j014M69J493K113J718
$$ -2293 -3557 -3684 -2673 -649 1649 3276 3724 3039 1276 -946 -2638 -3652 -3183 -1690 423 2141
3119B141J249r6j375j700k024j435j96R77J647K263J522N44n97j635k020j895
$$ 2141 3390 3294 1919 219 -1805 -3240 -3436 -2459 -812 1451 2973 3517 2920 1285 -735 -2630
3135b630r11J73J354K035J897J230L43j084j802j914j536m53N69J563K019J660
$$ -2630 -3541 -3368 -2014 21 1918 3148 3491 2407 605 -1309 -2845 -3298 -2729 -1166 853 2513
3151B513O90l97j265j899j734j052O8J185J654J993J317K28q80j668j891j653
$$ 2513 3203 2806 1541 -358 -2092 -3144 -3076 -1891 -237 1756 3073 3301 2421 753 -1138 -2791
3167b791m52L42J433J915J710J028j40j154j729j689j320k19R76J615J731J325
$$ -2791 -3243 -2901 -1468 447 2157 3185 3045 1891 162 -1527 -2847 -3066 -2090 -475 1256 2581
3183B581M64o81j496j650j500o43K78J391J500J692R73J39j096j731j693j325
$$ 2581 3045 2364 868 -782 -2282 -2925 -2647 -1256 244 1936 2909 3048 1952 221 -1472 -2797
3199b797j93O75J467J764J436N88k85j295j851j408q80PJ187J647J478J028K39
$$ -2797 -2990 -2315 -848 916 2352 2940 2655 1360 -491 -1899 -2779 -2772 -1585 62 1540 2568 2807
3216B807r24j501j626j186l46O16J267J735J338O81l35j151j661j525q80j49R83
$$ 2807 1883 382 -1244 -2430 -2776 -2160 -893 842 2180 2861 2526 1375 -286 -1811 -2691 -2840 -1857
3233a857J624J498J105J47n78j317j190j396n39J91J213J621J216R01l26j028
$$ -1857 -233 1265 2370 2517 1939 622 -568 -1964 -2503 -2312 -1099 522 1738 2639 2313 1285
3249A285j305j515p49j14M51J527J668J016L51m17j417j250j556o04M64Q04J322
$$ 1285 -20 -1535 -2284 -2398 -1947 -420 1248 2264 2615 2198 781 -469 -2025 -2629 -2165 -1361 -39
3266c9J752Q56r0r53j288j309j021k99P25R85J551J035M11p31o98j297j378n46
$$ -39 1713 2569 2479 1526 238 -1071 -2092 -2391 -1666 -681 870 1905 2316 1585 887 -410 -1788 -2334
3284b334L66O03J536J328P18P5o60j458j166j079n67O08J275J493Q21J003k78
$$ -2334 -1968 -1365 171 1499 2217 2292 1632 174 -992 -2071 -2638 -2030 -755 738 1559 2562 2284
3301B284j208j326j216p73J51Q56J156J277P24K22m10j315j423q25m49N34R68
$$ 2284 1076 -250 -1466 -2239 -2088 -1232 -76 1201 1925 2147 1737 422 -1001 -1826 -2275 -1741 -773
3318g73J356J096N17j27p24j598k75j474j36P34J029J330R36L79o85j016j410
$$ -773 583 1679 2196 2069 1345 -253 -528 -2002 -2138 -1404 -375 955 1891 2270 1585 569 -841
3335h41q79l91J87J069J174J131O27o7q12j540j032m08k92P61J090J071Q75q2
$$ -841 -1720 -2111 -1924 -855 319 1450 2077 2010 1198 -342 -1374 -1782 -2074 -1313 -223 848 1723 1641
3353A641J1r46j476p32q14O54J32J803J081O06l77q93p73q10m88k8J75N28J233
$$ 1641 1652 706 -770 -1502 -2316 -1662 -1530 273 1354 1960 1583 690 -83 -893 -1381 -1409 -1234 -706 527
3372E27J300K98n5j364j084j274j79J64N92R66J417P30j02n70j139q21r16P7l00
$$ 527 1827 2125 2070 706 -378 -1652 -1831 -1667 -1075 -109 1308 2038 1936 1366 227 -594 -1510 -1433 -1733
3391a733J164J174O57N93k32q09j111r14m40j03P06R82J145O47J89n92j094j100
$$ -1733 -569 605 1262 1855 1623 814 -297 -1211 -1651 -1754 -1048 -66 1079 1726 1915 1323 229 -871
3409h71p06l20M97O87J099J005M48k09q27j220q53n89n23J192J602L39J173M8
$$ -871 -1577 -1897 -1400 -713 386 1391 1839 1630 803 -417 -1270 -1859 -2382 -1190 412 751 1924 1972
3427A972p17n03j367r59k11L63P88J040Q34N62l18n71r24j057n19k30N71J056
$$ 1972 1255 752 -615 -1574 -1785 -1422 -634 406 1240 1802 1484 913 -11 -1068 -1587 -1817 -1246 -190
3445a90R49P61K05k74j011r74q34l42J69P08R25J009M33%m68r70j072o45p0P24
$$ -190 759 1520 1725 1451 440 -534 -1368 -1710 -1541 -833 92 1101 1534 1534 1066 96 -976 -1621 -1691 -967
3465i67O66J003M58N19m26n01j314o34n72K55P84Q31Q66O48m50jj388j035n40
$$ -967 -301 702 1160 1679 1253 752 -562 -1196 -1768 -1513 -729 102 968 1616 1166 1165 -223 -1258 -1798
3484a798L20J24J343Q70m1J308j072j109k24j259m03J123J08Q75O10J488p76m90
$$ -1798 -1478 -1354 -11 859 818 2126 1054 -55 -279 -1538 -1941 -818 -710 165 775 2263 1487 997
3502I97r21q82n15l63P65M5J099Q34K60P2j094m53j248qk21R23P21J147N1M79
$$ 997 76 -806 -1321 -1684 -919 -874 225 1059 1319 1391 297 -156 -1404 -1412 -1633 -710 11 1158 1209 1688
3522A688r1j102j252l23k79L9J192N81P21L28k09q48n56r80L83j046J055O39Q03
$$ 1688 1597 495 -757 -1080 -1359 -1320 -128 453 1174 1502 1293 445 -111 -1091 -708 -1754 -699 -60 743
3541G43R39m04m60p27p04m23n06P03K56P30J064n4M26q19j467Oj395L79P82Q95
$$ 743 1682 1278 818 91 -613 -1036 -1542 -839 -583 147 1211 1157 1583 764 -703 -697 -2092 -1713 -931 -36
3561c6P71M90q0n24k61m55j428m5J3J104L27J359j01J69q55l91m92j119K41J91
$$ -36 735 1225 1145 621 360 -95 -1523 -1568 -1555 -451 -124 1235 1134 1303 448 57 -435 -1554 -1313 -1122
3581a122Q73R47O01k33O6k72j793k33l27L96M51M54J400N68q22o9q32n86r48k6
$$ -1122 -249 698 1299 1066 1132 860 -933 -1166 -1493 -1097 -646 -192 1208 1776 954 885 53 -533 -1481 -1507
3601a507PJ086Q28R32J51m59o63q47o37K96j260J400P99M71Q86L36p90r80q34
$$ -1507 -1500 -414 414 1346 1497 1038 375 -472 -1109 -813 -2073 -673 126 597 1483 1819 1029 49 -785
3620g85k95k52K14P79R48N56J42K4o03n77j251p28L65R27O01R64L69O78j005r81
$$ -785 -1080 -1332 -1118 -339 609 1165 1307 1331 728 151 -1100 -1828 -1463 -536 65 1029 1398 2076 1071 90
3640I0k86q38j09O26J47K22Q85P80J92j059r21o61Q9p80P29J210J160N29j15j41
$$ 90 -196 -1034 -1143 -517 -370 -148 737 1517 1709 650 -271 -932 -843 -1623 -894 316 1476 2005 1890 1749
3660A749q74j278j092M48K64M81R33K5P88j66j185M77j733p34R1J404j79J135
$$ 1749 875 -403 -1495 -1047 -783 -302 631 656 1444 1278 93 570 -1163 -1897 -1806 -402 -581 554
3678E54J002p6P9j460P2j313j30l66J030Q07Q62K83N6n35p91q69n18k11M74P30
$$ 554 1556 1480 1559 99 171 -1142 -1272 -1638 -608 199 1061 1344 1400 865 74 -795 -1313 -1524 -1050 -320
3698c20J006N12K34l71n92q77p16l37J49N81P93J049M01p7m06r14r51o20k23N13
$$ -320 686 1198 1432 1061 469 -408 -1124 -1461 -1312 -731 62 1111 1512 1435 1029 115 -836 -1456 -1679 -1166
3718a166O67R53Q10K85k26n60r47q23m83K03N52O05J014N04M8l61r29q02o69l03
$$ -1166 -499 454 1264 1549 1323 763 -184 -1007 -1490 -1287 -735 -130 884 1388 1436 1075 146 -656 -1325 -1628
3738a628M66P83Q13O37K64p0m80r57j083k54PM68R15Q78O18J30l44p34j003o10
$$ -1628 -1162 -379 434 1071 1335 1265 785 -172 -1255 -1509 -1502 -1034 -119 759 1377 1507 1163 429 -574 -1184
3758a184l14K10O64R12P42M77r2o36p48j121m55j14N20Q64J011O60J60k50q25
$$ -1184 -1498 -1288 -624 288 1030 1507 1415 779 31 -1090 -1545 -1659 -1139 -275 736 1396 1556 1306 481
3777D81q96q25m87L41N85R50O39Q05Q8p97p22q69q17r7N33O75J067P36K26l03
$$ 481 -415 -1240 -1727 -1386 -801 149 788 1593 1681 884 162 -707 -1524 -1621 -1088 -413 654 1390 1616 1313
3797A313p67j049q00m00K27N48J056R49N87m1m91j041r00p36j30J60Q67J257N00
$$ 1313 546 -503 -1303 -1703 -1476 -928 128 1077 1664 1623 1132 91 -809 -1545 -1675 -1515 -648 609 1109
3816A109Q56l66p82j201m34r09L08P69R22J017N6R12r25j034j555J05k91J40J329
$$ 1109 1965 1599 817 -384 -818 -1727 -1419 -650 272 1289 1345 2257 1332 298 -1257 -1152 -1443 -1303 26
3835B6M3J028M94M10q89j700n87o09r0J140R42J078o0M39k69n10j260n64o76J21
$$ 26 69 1097 1591 2001 1112 -588 -1175 -1784 -1874 -734 208 1286 1226 1665 1396 886 -374 -938 -1614 -1493
3855a493Q21Q91J009N68j37p35j001r02o36k42M90J022J150P28K29k53p49j286
$$ -1493 -672 219 1228 1796 1659 924 -77 -979 -1615 -1857 -1367 -345 805 1533 1762 1509 760 -526
3873e26p54l96oQ48Q91J080N70%n71r39j069q09k02N47Q43J210O94M33k39p68
$$ -526 -1280 -1676 -1682 -834 57 1137 1707 1707 1136 197 -872 -1681 -1883 -1336 -493 717 1411 1844 1605 837
3893H37j182j079m80J76N31R31J213O26K16l29j037j172p41n19O94P17J168Q37
$$ 837 -345 -1424 -1904 -1728 -1197 -266 947 1573 1789 1460 423 -749 -1490 -2009 -1315 -598 570 1407
3911A407M75j63q13j176r19o19j54Q01J054J119P10K93m32j073j124r49l72J90
$$ 1407 1882 1719 906 -270 -1189 -1808 -1962 -1161 -107 1012 1722 2015 1583 510 -614 -1563 -1935 -1745
3929a745Q07J262R99N64K1p22j157r34p54k97N77R17J206Q98L91m64j028j176
$$ -1745 -938 324 1323 1887 1908 1186 29 -905 -1659 -1956 -1379 -462 744 1642 2033 1569 541 -635
3947f35r00k92M0Q44R87J160P06K8o39j074j294q10k41N37R42J273Q95N31j90
$$ -635 -1535 -1827 -1787 -943 44 1204 1910 1938 1299 225 -1069 -1879 -2120 -1583 -641 632 1527 2058 1868
$$ [...]
8191C89
##END NTUPLES=NMR FID
##END=
