##TITLE=1H_DE-11_kr
 DMSO-d6
 8 sc, 
 30.8.2023
##JCAMPDX= 6.0         $$ Bruker NMR JCAMP-DX V2.0
##DATA TYPE= NMR FID
##DATA CLASS= NTUPLES
##ORIGIN= UXNMR, Bruker Analytische Messtechnik GmbH
##OWNER= root
$$ XWIN-NMR		Version 3.5
$$ Wed Aug 30 17:38:23 2023 Russian Standard Time (UT+4h)  she@DPX200
##.OBSERVE FREQUENCY= 200.13135
##.OBSERVE NUCLEUS= ^1H
##.DELAY= (6, 6)
##.ACQUISITION MODE= SIMULTANEOUS
##.ACQUISITION SCHEME= undefined
##.AVERAGES= 8
##.DIGITISER RES= 18
##SPECTROMETER/DATA SYSTEM= spect
##.PULSE SEQUENCE= zg30
##.SOLVENT NAME= DMSO
##.SHIFT REFERENCE= (INTERNAL, DMSO, 0, 15.7039)
##AUDIT TRAIL= $$ (NUMBER, WHEN, WHO, WHERE, WHAT)
$$ ##TITLE= Audit trail, XWIN-NMR		Version 3.5
$$ ##JCAMPDX= 5.01
$$ ##ORIGIN= Bruker BioSpin GmbH
$$ ##OWNER= she
$$ F:/spectra/data/she/nmr/H-F/1/audita.txt
$$ ##AUDIT TRAIL=  $$ (NUMBER, WHEN, WHO, WHERE, WHAT)
(   1,<2023-08-30 17:37:13.39 +0400>,<she>,<DPX200>,
      <created by zg, POWCHK disabled, PULCHK disabled
       configuration hash MD5:
       00 E9 B6 7A A2 85 ED C7 34 08 36 98 17 FE 4E 26
       data hash MD5: 16K
       0C 23 99 EB A4 FC C3 F4 B6 9B 66 FE 5B 6F BB 60>)
$$ ##END=
$$ 
$$ hash MD5
$$ B4 82 D0 A8 5B 94 4D 06 66 29 A7 5A 4D 12 51 E5
##$RELAX= 
##$RELAX= 
##$RELAX= 
##$RELAX= 
##$RELAX= 
##$RELAX= 
$$ Bruker specific parameters
$$ --------------------------
##$DU= <F:/spectra>
##$EXPNO= 1
##$NAME= <H-F>
##$PROCNO= 1
##$TYPE= <nmr>
##$USER= <she>
##$AMP= (0..31)
100 100 100 100 100 100 100 100 100 100 100 100 100 100 100 100 100 100 
100 100 100 100 100 100 100 100 100 100 100 100 100 100 
##$AQSEQ= 0
##$AQ_mod= 1
##$AUNM= <au_zg>
##$AUTOPOS= <>
##$BF1= 200.13
##$BF2= 200.13
##$BF3= 200.13
##$BF4= 200.13
##$BF5= 200.13
##$BF6= 200.13
##$BF7= 200.13
##$BF8= 200.13
##$BYTORDA= 1
##$CFDGTYP= 0
##$CFRGTYP= 5
##$CHEMSTR= <none>
##$CNST= (0..31)
1 1 145 1 1 1 1 1 1 1 1 1 1 1 1 1 1 1 1 1 1 1 1 1 1 1 1 1 1 1 1 1 
##$CPDPRG= <>
##$CPDPRG1= <>
##$CPDPRG2= <>
##$CPDPRG3= <>
##$CPDPRG4= <mlev>
##$CPDPRG5= <mlev>
##$CPDPRG6= <mlev>
##$CPDPRG7= <mlev>
##$CPDPRG8= <mlev>
##$CPDPRGB= <>
##$CPDPRGT= <>
##$D= (0..31)
0 1.2 0 0 0 0 0 0 0 0.06 0 0.03 0 0 0 0 0.0002 0 0 0 0 0 0 0 0 0 0 0 0 
0 0 0 
##$DATE= 1693402632
##$DBL= (0..7)
120 120 120 120 120 120 120 120 
##$DBP= (0..7)
150 150 150 150 150 150 150 150 
##$DBP07= 0
##$DBPNAM0= <>
##$DBPNAM1= <>
##$DBPNAM2= <>
##$DBPNAM3= <>
##$DBPNAM4= <>
##$DBPNAM5= <>
##$DBPNAM6= <>
##$DBPNAM7= <>
##$DBPOAL= (0..7)
0.5 0.5 0.5 0.5 0.5 0.5 0.5 0.5 
##$DBPOFFS= (0..7)
0 0 0 0 0 0 0 0 
##$DE= 6
##$DECBNUC= <off>
##$DECIM= 32
##$DECNUC= <off>
##$DECSTAT= 4
##$DIGMOD= 1
##$DIGTYP= 9
##$DL= (0..7)
0 120 120 120 120 120 120 120 
##$DP= (0..7)
150 150 150 150 150 150 150 150 
##$DP07= 0
##$DPNAME0= <>
##$DPNAME1= <>
##$DPNAME2= <>
##$DPNAME3= <>
##$DPNAME4= <>
##$DPNAME5= <>
##$DPNAME6= <>
##$DPNAME7= <>
##$DPOAL= (0..7)
0.5 0.5 0.5 0.5 0.5 0.5 0.5 0.5 
##$DPOFFS= (0..7)
0 0 0 0 0 0 0 0 
##$DQDMODE= 0
##$DR= 18
##$DS= 0
##$DSLIST= <SSSSSSSSSSSSSSS>
$$ [...]
##$SUBNAM2= <"">
##$SUBNAM3= <"">
##$SUBNAM4= <"">
##$SUBNAM5= <"">
##$SUBNAM6= <"">
##$SUBNAM7= <"">
##$SUBNAM8= <"">
##$SUBNAM9= <"">
##$SW= 18.05172834244
##$SWIBOX= (0..15)
0 0 2 0 0 0 0 0 0 0 0 0 0 0 0 0 
##$SW_h= 3612.71676300578
##$TD= 16384
##$TD0= 1
##$TE= 0
##$TE2= 300
##$TE3= 300
##$TEG= 300
##$TL= (0..7)
0 120 120 120 120 120 120 120 
##$TP= (0..7)
150 150 150 150 150 150 150 150 
##$TP07= 0
##$TPNAME0= <>
##$TPNAME1= <>
##$TPNAME2= <>
##$TPNAME3= <>
##$TPNAME4= <>
##$TPNAME5= <>
##$TPNAME6= <>
##$TPNAME7= <>
##$TPOAL= (0..7)
0.5 0.5 0.5 0.5 0.5 0.5 0.5 0.5 
##$TPOFFS= (0..7)
0 0 0 0 0 0 0 0 
##$TUNHIN= 0
##$TUNHOUT= 0
##$TUNXOUT= 0
##$USERA1= <user>
##$USERA2= <user>
##$USERA3= <user>
##$USERA4= <user>
##$USERA5= <user>
##$V9= 5
##$VALIST= <valist>
##$VCLIST= <CCCCCCCCCCCCCCC>
##$VD= 0
##$VDLIST= <DDDDDDDDDDDDDDD>
##$VPLIST= <PPPPPPPPPPPPPPP>
##$VTLIST= <TTTTTTTTTTTTTTT>
##$WBST= 1024
##$WBSW= 4
##$XGAIN= (0..3)
0 0 0 0 
##$XL= 0
##$YL= 0
##$YMAX_a= 128472
##$YMIN_a= -172840
##$ZGOPTNS= <>
##$ZL1= 120
##$ZL2= 120
##$ZL3= 120
##$ZL4= 120
##$ABSF1= 10
##$ABSF2= 0
##$ABSG= 5
##$ABSL= 3
##$ALPHA= 0
##$AQORDER= 0
##$ASSFAC= 0
##$ASSFACI= 0
##$ASSFACX= 0
##$ASSWID= 0
##$AUNMP= <proc_1d>
##$AZFE= 0.1
##$AZFW= 0.1
##$BCFW= 1
##$BC_mod= 2
##$BYTORDP= 1
##$COROFFS= 0
##$CY= 11.3945322036743
##$DATMOD= 1
##$DC= 2
##$DFILT= <>
##$DTYPP= 0
##$F1P= 15.7292609196834
##$F2P= 12.9074282941183
##$FCOR= 0.5
##$FTSIZE= 0
##$FT_mod= 4
##$GAMMA= 1
##$GB= 0.15
##$INTBC= 1
##$INTSCL= 1
##$ISEN= 128
##$LB= 0.24
##$LEV0= 0
##$LPBIN= 0
##$MAXI= 10000
##$MC2= 0
##$MEAN= 0
##$ME_mod= 0
##$MI= 1.114404
##$NCOEF= 0
##$NC_proc= 0
##$NLEV= 6
##$NOISF1= 3.799351
##$NOISF2= 2.8
##$NSP= 1
##$NTH_PI= 0
##$NZP= 0
##$OFFSET= 15.70392
##$PC= 1
##$PHC0= -21044.73
##$PHC1= 6.05272
##$PH_mod= 1
##$PKNL= yes
##$PPARMOD= 0
##$PSCAL= 0
##$PSIGN= 0
##$REVERSE= no
##$SF= 200.130013532006
##$SI= 16384
##$SIGF1= 3
##$SIGF2= 2
##$SINO= 400
##$SIOLD= 16384
##$SREGLST= <1H.CDCl3>
##$SSB= 0
##$STSI= 0
##$STSR= 0
##$SW_p= 3612.71676300578
##$SYMM= 0
##$S_DEV= 0
##$TDeff= 0
##$TDoff= 0
##$TI= <>
##$TILT= no
##$TM1= 0
##$TM2= 0
##$TOPLEV= 0
##$USERP1= <user>
##$USERP2= <user>
##$USERP3= <user>
##$USERP4= <user>
##$USERP5= <user>
##$WDW= 1
##$XDIM= 8192
##$YMAX_p= 0
##$YMIN_p= 0
$$ End of Bruker specific parameters
$$ ---------------------------------
##NTUPLES= NMR FID
##VAR_NAME=  TIME,          FID/REAL,        FID/IMAG
##SYMBOL=    X,             R,               I
##VAR_TYPE=  INDEPENDENT,   DEPENDENT,       DEPENDENT
##VAR_FORM=  AFFN,          ASDF,            ASDF
##VAR_DIM=   8192,          8192,            8192
##UNITS=     SECONDS,       ARBITRARY UNITS, ARBITRARY UNITS
##FACTOR=    0.0002768,     1,               1
##FIRST=     0,             0,               0
##LAST=      2.2672688,     0,               0
##MIN=       0,             -172840,         0
##MAX=       2.2672688,     128472,          0
$$ Real data points
##PAGE= N=1
##DATA TABLE= (X++(R..R)), XYDATA
$$ [...]
1788A15j58j37K01r5K62l5J02k01K3p5j24K87j34J19N6l22m4J03j5K59l26n8M7
1811a50K84j26J10l05L80j98j55J65J19j63j98J76R0k8k06J78r9J75L07m01Jk0
1833f4J49K8k18N0l0Q1r3K01l29J68J74j87J9P2k45P0L30m6j63O4j52J06K21j49
1857E7m5K02k06qp9rj06M25k45l5L6j50J68k3r9J16OJ42j69j59K14n1J34j18l7
1882c9J50k32q0J04K14j9j44Q2l22J30J23k50L99k08R5j18Q6L1J14j61J9p5J55
1905E4n4j24L90j87j26J40J12k02Lj88J75Q3k74J96l64J08J19n7Q0K42Kk87K71
1928A12o3Q5j33M8j72J25K27j48k14J17j2l79K50J13J59j42k34K98j58j3J37j68
1950a65K18j58K55l9o4J76L5l77L19l23L14o8j86k9O2J41L6j73q3L9J08MJ29L
$$ y = [115, -43, -180, 21, -74, 188, 153, 255, 54, 77, 2, -122, 165, 31, 150, 206, -116, -160, -57, -72, 187, -139, -197, -150, 134, 8, 118, -187, 193, -5, -160, 5, 124, -39, -237, -61, 29, 1, -205, -27, -126, 49, 356, -45, -44, -64, 85, 113, -105, -55, -85, -4, -97, 104, -225, -57, 117, -70, -51, 21, -224, -154, 176, 130, -33, 31, -121, -15, 206, 57, 12, 214, 8, 0, -79, -88, -194, 231, -14, -49, -13, -163, 5, -18, -117, -1, 5, 147, -22, -181, 33, -18, 116, -2, -39, 111, -121, -201, -97, 117, 98, -46, 36, -286, -156, -33, -283, 116, -92, 3, -115, -29, 2, 116, -45, -26, -101, 54, 0, -124, 266, 79, -47, 93, 205, 3, 6, -182, -7, 76, -198, -2, -366, -258, -139, -196, -116, 126, 128, -159, 112, 49, 134, 1, 49, -123, 2, 229, 81, -133, -16, -28, -407, -157, -44, 115, -27, -261, 37, -121, -134, 3, -165, 53, -105, 150, 111, 47, 223, 258, -119, 200, -123, 191, 123, -63, -92, -30, 111, 147, -26, -109, -70, 38, 42, 171, 174]
1974A74k10M1j13p8K06K19k38R5l7M6j93J35j46J03j24K75k70J38j07N4j09J84
1996D5k42M16j24k05L8L4K75k58K12k55Q1J38p4j80K82o1J61k51k10K11p7J10
2018F6j3J6J2j04J7N1n2J68k83O5J7p4K0J20qR9j17M1P1J82k93j15K92l01L71
2043B48n74J48O07n80J66J8q2J29N3j4Jr3k45J86p7N1J20J0p9j45L41j58j12J5
2067f6n0r7K07l97J86L05Q4j70O4Mn8k6j33M33l52P8R0j55O8p7k06J03K36j32
2091f1O2j8o6j82L24J52l7l69K69l84L81J52k74L7J54k44K49n4k64K93k72j29
2113b81K99j05M9J34N6m2k13P0PJ34J0L2l02M6K04r0O4J13j77M0J10j03o5lJ77
2138A64Qk43L59k25k23K44R5r1q7l1K8k12M41k27j50M2J53J14k12L98l12j32r4
$$ y = [174, -36, 5, -108, -186, 20, 239, 1, 96, 59, 105, -88, 47, -99, 4, -120, 155, -115, 23, -84, -30, -139, 45, -197, 219, 95, -110, -72, -38, 237, -21, 191, -64, 17, 155, 81, -99, 183, 122, 283, 32, -178, 33, -44, 66, 53, 69, 81, -23, -6, 45, -7, 161, -122, -57, -40, -114, -94, 26, 18, 117, 0, 41, 112, 294, 1, -114, 178, -123, 248, -326, -178, 429, -151, 15, 33, -49, 80, 133, 119, 120, 27, -218, -32, -109, -58, 62, 72, -7, -152, 189, 31, -81, -66, -116, -213, -6, -403, -217, 88, 172, 2, 66, 70, 12, -14, -147, 286, -66, 12, 102, -53, 15, -62, -268, -165, 71, -61, 1, -17, -83, -265, 59, 211, 174, -195, 74, -310, 71, 223, -51, -14, 140, -104, 145, 91, -173, 120, -152, -281, 18, -87, -38, 96, 152, 110, -103, -33, -26, 108, 118, 150, -152, -106, 98, 8, 72, 185, 8, 48, 158, 55, -10, -13, 164, 172, -71, 288, 63, -160, 84, 179, 88, 1, -30, -2, -214, 227, 0, -150, -108, 45, 159, -53, 345, 33, -99, -193]
2161a93J53j0R4k1K67j57j07N2l54L8J29nMK13Mk80K81q0%n3k15J74j16k71L72
2186h1J64j76J40o1OP6j30K42q2j18Q0lj5k29M04j32k38K46Pr4J51M6Nj01K7j15
2212A9L2k15K58K39j51m48M91m19J20Q8K49k16q1J26O8j96k32K50J38rk5k22L42
2235B06k82J65J02l75K20o6m1JR9p1j49J00L9Ro6nQ3J29Q1k38J7K19j82J42j87
2260e0J69K4j35p0j0N7n6J84k06L27k45j08L2J05R5j47N7j00J00N0J29j80n5o3
2284i6K96k50j6J61l33J14J98m8k10K03qKK17l17o7m2o3o4N28k19qJ00k9P4n9
2309F4Mk2J5k10J13P7o5O6k84qL63j66J9O5rJ52k10J74R2k5j66j4N5j18L4p2M6
2336c0k3K5j51L10P4k21K6N5j43Q9J5O0k05L15k0l21p1J30mJ35J3Q8j71O2J32
$$ y = [-193, -40, -50, 44, 23, 290, 133, 26, 78, -276, -238, -109, -114, -110, 103, 107, -173, 108, 28, 28, -25, -240, -66, -182, -453, -81, 83, -93, 47, -14, -8, 68, -62, 180, 98, -20, 60, 57, 42, -187, 217, 85, -153, 93, 100, 6, 157, 203, 208, 107, 134, 19, 51, -164, 94, 333, 182, -266, 225, -194, -74, 14, 263, 47, -34, 92, 160, -36, -268, -18, 120, 111, 86, -136, 206, -76, 89, 191, -184, 36, -30, -71, -70, 29, -42, -191, -91, -52, -43, -109, -114, -31, 98, 179, -59, -42, 177, -5, 137, -50, 119, 143, 8, -62, -72, -15, -71, 113, -93, 234, -11, -119, -87, 18, 113, -34, 23, -77, 23, 73, 202, 22, -33, -96, 200, -50, -66, 95, -238, -124, 74, 26, -184, 19, 11, 13, 230, -87, -154, -196, -259, -323, 205, -14, -22, 78, 49, 123, 64, 68, 46, 61, -149, -36, 41, -24, 42, -242, -250, 113, -53, -34, 31, 22, 174, -36, 138, 230, 205, 39, 25, 80, -38, -4, -76, -30, -53, -28, -179, 131, 205, -16, 10, 65, -78, 11, 26, 86, -119, 196, 176, -145, -216, -86, -90, 45, 58, 146, -25, 37, 169]
2361A69k31m7N9n0n1K13j52J51r2P6P9j08J30m38M17r8K5r8p3L62j53j56k44K26
2385h4M65n22L57k57N2K34j25J68j22m9j83pk41P1K34q8P4N8r9o0J29j22L75n35
2409b77L37q2j88N1J38m2M1k09L09Q0j52J81n2K2l67R0J37O4k27N8o2j60L32n3
2433c1J23o2k22J98k5j2j6J0q0K16j05j04K07k17L4K06J84m33J05J04k77L51k69
2456a15J50O0L9j15O6j01j82K36n5J1m7J22p3O0%r1o7O1J05K24l14J84n9K9m5
2481H3n9J09j96L6N4J65k31J94j1l06K02M9k64J43j15J29O5R2j05K3J15j11J0
2504G1j03lJ62j04K14j19j22n6M4K92j75j79J00j82J51R6j15J32l42K85J57k98
2526i4J93k00J06L5k32J63J07j19J66k52K79J3j03o2p1J44n1J66r5Q2L7l78L17
$$ y = [169, -62, -109, -50, -100, -151, 62, -90, 61, -31, 45, 124, 16, 146, -292, 125, 27, 52, -46, -119, 243, 90, -66, -310, -84, 381, -141, 216, -41, 11, 245, 120, 288, 166, 117, -66, -73, -314, -243, -9, -97, -23, 35, -64, -124, 5, -117, 258, -277, 60, -22, -210, -159, -21, -63, -22, -231, 78, 158, 6, 187, 135, 157, -210, -120, 17, 81, -146, -88, -150, -310, 22, -31, 92, 30, -192, 6, -19, -31, -47, -37, -117, 99, -6, -110, 97, -120, -86, 120, 304, -129, -24, 80, -197, 154, -115, 35, 95, 134, 19, 85, -16, -198, 38, -17, -6, -53, 69, -4, 56, 56, -35, -102, -41, 64, 288, -26, 158, 99, 128, 83, 24, 133, -63, -27, 27, 192, -39, 155, 144, -162, 40, 89, -175, -32, -147, -18, 47, 139, 34, 57, 172, 61, 71, -32, -35, 127, 23, 237, 118, -4, -60, -16, 276, 101, -78, 22, -160, -9, 87, -28, 104, -238, 47, 204, -94, 99, -101, 5, 40, -192, -29, 78, -41, 125, -127, 152, 165, 62, 0, -71, 73, 22, 188, 93, 175, 212, -166, 151]
2549A51l18K33j7j30L4J71r4q5J86j60j31J35P7J84j35j34p7J06MRRK19j12L7
2573A62k45K53j29J64l85K38k8N5j02J10q6k94Q7o7J04K92o8%Qj43J91l06K26
2596C7j75K47j7l29M02j15K7J07l11K0K20P8q5k07J33j91L48j88J8L3R8k66N1
2619f5L6q4K9j0l0J44j02R6l7l3J85j24j30l5L51j22J7J32j45p3L3k61L34K0l0
2644I6l79M10k7N2K9l44K76k94K42j93R9N2j03j44K72O7J33k07j45J99M1j96j
2667f5j09J08K78k70J77j60j00K77j84n8K56j95j18L40k21J8q4k56M70k55j8J55
2689a4Q4o0J02m4j49j0P4N6O3r8Q9K37j57q2R8k19k35K93j02L40m59K82k95nJ46
2714f5Q9L3J15k55J57j00nj04J78k60J66Q9l00K84K22j16k96K2K11J12k29K95
$$ y = [151, -167, 66, 49, -81, -47, 124, 30, -55, 131, -29, -160, -25, 52, 236, 101, -33, -110, -4, 0, 9, 18, 237, 125, 162, -83, 170, 41, 205, -180, 58, 30, 85, -17, 93, 7, -287, -200, -267, -163, 129, 61, 61, 69, -74, 117, -189, 37, -138, 109, 92, -237, 165, 50, 77, 184, -127, -107, 113, 191, 106, -101, 32, -159, 189, 1, 19, 52, 150, -116, -65, -29, -113, -84, -94, -124, 20, -82, 14, -23, -56, 129, 5, -125, -160, 191, 69, 86, 218, 73, 0, 33, -228, 106, 126, 96, -283, 127, 100, 152, 181, -163, 113, -181, 61, -132, -33, 19, -84, -228, 44, 111, 244, 37, -108, 91, 132, -64, -65, -174, -66, 212, -58, 119, -41, -141, 136, -48, -106, 150, -45, -163, 177, -44, -26, -110, -366, 104, -151, -169, -14, 70, 10, 112, 68, -81, -91, -17, 39, 102, 4, 93, 330, 173, 91, 189, -30, -265, 28, -74, 266, -193, 89, -206, -211, -65, 24, 57, 172, -83, 74, -26, -31, -135, 43, -217, -51, 38, -262, 22, 244, 128, -168, -146, 65, 177, -52, 243]
2736B43l65j13J16lJ31r5k01K17J85J01J8m39K3K05j23o0L02k52q2L79q3q7r9
2759h2J69j7j70l6J82Q1j38J33J11l50L4K21l21N6K84j51M4k44n8K58r4j12N6
2782a44J82J38k73O7l45J94K26%lJ67j33k12J53p3r6L57k97L04k75J34O1j44%
2805a2J7j59k88L79N8J17j09j98RM9J36J24J01l69M57l31p0J87m4k55M64j74k5
2828F4o9j11OR2J59k78K88l65J11j5K52k75N0L65j18n3k68L95J7k76R7j22j21
2851a75J69r7p5J35J02M1J48l58J89j62K5o6J08j29J71j16O8J19k61m8J07L78
2873B73m06J71P9J57l61J19j69J13n1l01M98pj55J30j49m0J19J25j4l20J45O4
2895B0o0j54K64J7J03R7r7k38J13r6L8J1RJ5k74J79M8QJ54Jn31N05j43l24N37
$$ y = [243, -122, -235, -119, -122, 9, -86, -287, -70, 115, 216, 234, -205, -182, 23, -100, -160, 142, -110, -192, 187, 104, 17, -82, 87, 70, -100, -136, 46, 127, -11, 122, 233, -117, -83, 138, -183, -127, 157, 6, 50, -194, -252, 6, -88, -200, -144, 38, 176, -97, -30, -375, -181, 45, 45, 42, 209, 76, -136, 17, -56, -152, 205, -92, 212, -63, 71, 132, -12, -12, 5, -154, -442, -63, -5, 112, 3, -195, -186, -137, -1, 123, 224, -145, 312, -19, -89, 98, 54, -201, 263, 89, 64, -5, -116, -110, -18, 141, -137, 151, -214, -103, -118, 134, -141, -91, 274, 156, 103, -165, 230, 247, -29, 68, -54, -175, -6, -103, -178, -43, 59, 100, 248, -110, 79, -83, -58, -124, -16, -145, 26, -90, -22, 97, -164, -212, -105, 273, -133, 38, 117, 274, -87, 32, -137, -24, -75, -376, 122, 115, -40, 90, -59, -99, 20, 145, 131, -189, -44, 20, -40, -194, 70, 87, 190, 287, 190, -48, 65, -31, 7, 18, 27, 42, -232, -53, -5, 3, 157, 158, -373, 132, -11, -335, 202]
2920B02j32l28K70p4j51m7K94o9K25k86J42l00K94R2r7n5pJ52q8K20k60K69m15
2943a49J99l36L13j01L8M1J16j47O5M9k00o8O2K61j57J31j63M72k86l61K75j89
2965a35L32l63J32K27j68K3O2j97Qm7J37q3K02l07K8N3l2K44r8j97K50p7J91k52
2989f7k72M36o3j81p2M74k48k66L83r7jO9m8J00l37R2K3J03K03l56k4j20N13k56
3013a2J70l48L7L34j01k8Nj56J08q4K7L27l46K33l97J47J52r8J89m01K18J33l3
3036G6j09J32l6j60J09K2l12M15J6j20J11l09J38p7JJ10K8K27j77P9k74L70k12
3059D8r7K81l41o1J68J9J17k07j54K07k8K65l58J19R1K75k05k4p1j28R0L6j63
3082a21J00N5q7O5j3N3r8o6J84J6r3n9Q9J41k61j72L33N6l42M39j72j25Q7j11
$$ y = [202, 70, -258, 12, -62, -213, -260, 34, -35, 190, -96, 46, -254, 40, 132, 35, -20, -27, 125, 37, 257, -3, 266, -149, 50, -286, 27, -74, -36, 5, 121, -26, 39, 88, -112, -180, -118, 143, -14, 117, -46, 426, 140, -221, 54, -135, 197, -166, -34, 193, 25, 48, 110, -87, -79, -126, 11, -72, 130, -177, -149, -96, -128, 116, 18, -179, 71, -6, 185, -67, -339, 97, 34, -147, -219, 255, 7, -259, 124, 27, 26, 95, 47, 147, -190, -98, -75, 28, 231, -125, -149, -269, 244, -12, 158, -190, -153, 181, 80, 52, 57, -99, 9, -75, -48, 279, -67, 166, -231, -84, 68, -30, 159, -242, -24, 109, 76, -33, 99, 63, -97, 12, 34, -278, 137, 153, 33, 144, -165, -27, -104, -103, 7, 35, 262, 85, 164, -110, 260, 48, -49, 232, -109, -170, -2, 17, 134, -73, -227, -20, -48, 217, -141, -22, 69, 344, 139, 115, 44, -84, 6, 42, -121, -21, 34, -53, 12, -1, 52, -46, -112, 72, 88, -5, -64, 25, 166, -95, -267, 66, 122, -220, 219, 47, -78, 9, -102]
3106a02K90l20O4j7L13r3k10NO3K07j80R0N0k72L4J43q0m5L68n05J23j51L46k69
3130a48L46l17q9L68j08j16j65L72j05Q8j22j36K00J65k95M5J80q3J4N5p6l09
3152b36R7K44p5L8r5j01J25j91J19K60j07j44L46l72J46L4k42J60J91p3k48j02
3174b26K83Q1k54l2J32M4j61J93k41J82%M5k88J4K03J94j51J09l17L52j54j13
3196a05L37l28K05l04J47J28q9M0j36J26q9K37k61J40N0q4L6j59K08o0M8j79j75
3219b67J79o8L69j13j52J01J57m16K46J66l28J27j68Q7JJ37n8L6q6q7K12m0j09
3242g4l4J27k96J07k8M59k35l64L08j85L75J59k17m9J52k78J60k11M6j94K54o4
3264h2O0K68l18K06k27J44k55kJ6J34K33jq1k63J50K1q4K55k59j1R3k34J01K81
$$ y = [-102, 188, -132, -68, -85, 228, 135, -75, -70, -7, 200, 20, 110, 160, -112, -78, 65, -15, -60, 308, -197, -74, -225, 121, -148, 198, -119, -208, 160, 52, -64, -229, 143, 38, 126, 4, -132, 68, 233, -62, -17, 163, 80, 94, 149, 73, -236, -139, 105, 30, 68, -27, -128, -3, -194, -75, 185, 78, -66, 280, -92, 54, 88, -154, 6, 197, 124, -124, -226, 57, 138, -116, -148, -16, 28, -133, 60, -181, 1, 1, 46, -242, -228, -25, 169, 18, 127, -190, 162, 8, -105, 232, -96, 109, -195, -48, 80, -9, 31, -105, 21, -68, 169, -92, 48, 98, 14, 50, -109, 99, 39, 87, -92, -267, -88, -156, 213, 100, -52, 49, 206, -210, 36, 202, -126, 1, -167, -80, -79, 58, 0, 36, -50, -137, 75, 35, -74, -108, 19, -277, -170, -198, 261, 26, -338, -30, -215, 160, 319, 102, 53, 205, -73, 87, -124, -78, -272, -18, -82, -22, 246, -72, 134, -93, 51, -204, -206, -190, -56, 177, 176, 95, -168, -18, 3, -81, 174, -85, -96, -3, -237, -136, 145]
3288A45k06R7kj49J97J44j85L0J40j53o1J17Q0k59M0k72L21j55M02m48J47o8K10
3311A12j42m0q4K98j23J20r2R0j44j12QMl1K86k05n6rK45mk78K97L6j35K26L4
3336C01l96Q8K10k08r7lJ64%j29m3P3j27K60p1m6J93j15PJ36k51J5L7r0M18k26
3361A00k75J86K4j59j67K90L50m69K33j11J74j10j75J70j99J93j7P2O5K2l10K81
3383A68m3O3j74j10J54Q2o5j73N1j13m6K69n9J6o1q0J03J6n2J80j45J25j00k2
3407a6J11P2m3J45j10o6j13P3l1l22M19n8K1j61J21j61K10n0k74L00k81J70L7
3430gj25M86m30L36j31n7k47L37k28J63L1r8J57k64k8L02j32l0M1j87J09O2o4
3453dj1M0J49l57M06q6m11L26j95J61k1o0n9J16K53n9k24j48J17J28j15P1J81
$$ y = [145, -61, 36, 34, -115, 82, 226, 41, 71, 211, 58, -3, 114, 194, -65, -25, -297, 24, -131, 271, -177, -30, -98, 112, -30, -70, -154, 144, 21, 141, 49, 139, -5, -117, -109, -105, -136, 150, -55, -111, -120, 125, 121, -157, 140, 176, 41, 267, 301, -95, -7, 203, -5, -102, -105, 59, 59, -70, -113, -40, -167, 93, 22, -24, 169, 54, 61, 197, -54, -39, -2, -92, 326, 100, -175, 11, 35, -124, -291, -1, 349, -120, 113, 2, 176, 66, -109, 61, -138, 55, 38, 110, 175, 197, -113, 168, 125, 188, 14, -96, 58, 140, 75, -98, -47, -160, -206, 63, 4, 20, -41, -121, -18, -2, -54, 126, -19, 106, 6, -16, 95, 167, 124, 269, 159, 93, -20, 53, 22, -300, 119, 61, 82, -79, 42, -119, 91, 41, -233, 67, -214, -44, -7, -132, 354, -76, 260, 129, 72, -175, 162, -66, 97, 128, 30, 187, -77, -105, 197, 65, 35, 76, -111, -2, 60, -4, -15, 25, 174, -183, 223, 137, -274, 52, -143, 18, -3, -63, -122, -6, 247, 188, -36, -184, -67, 61, -54, 17, 198]
3476A98l5j11l43Q0Q1K32l32J21M3k90O9L88j76O7J06j92P9J53k06M67l30j92
3498a23k28M28o0J73p9p7r9N6J0n6K91k57J99j54k99J60L85m6k05p8n5J97k3k
3522E8j41K03K0j49J5OM0n1K8k92L19M7J24k88j8L48j80r0j93L44j79K4N3k1J72
3547A99n3L7k00k15L14p4j29O1J04m6j36L26j87n5q4J60J91k07M6k46K63j21K34
3570A82J6m38L50p1JJ89j11l2o9J6J22k41J88j04K62k87J48l04M3J36j27N5J82
3593A06n9j60J12R2j54J59J12j23l1k88L31l7J92k22O6M4j07j08J82kn0P7J26
3616B58m3m51J17K5K31k67j30J86j59P0M79k68k08o5J51O5m8J09O0ql2P2p3J2
3640H3K16m30P6L58k25J14q3J64o3j20J1l52J34J62k74Q1R0K9M2l67M45P8J5J88
$$ y = [198, 163, 52, -291, -211, -130, 102, -230, -109, -66, -356, -287, 101, -75, -8, 98, -94, -15, 138, -68, 399, 69, -123, -351, 77, 17, 190, 111, 34, -65, -9, 1, -55, 236, -21, 178, 24, -275, -115, 270, 224, 19, -59, -114, 83, 60, 58, -83, 120, 140, -9, 6, 12, 52, 1, 29, -263, 56, 103, 227, -61, -79, 269, 89, -1, -194, 150, -29, -5, 48, 27, 199, 146, 183, -17, -232, 82, 8, -121, -60, 44, -2, -138, 188, 1, -54, -138, 22, 213, 6, 52, -194, 69, -52, 182, 198, -240, 110, 39, 40, 229, 118, 86, 17, 33, 155, -86, 102, -2, 260, -27, 121, -183, -140, -4, -131, -76, 106, 47, -113, -1, 91, -63, 96, 208, 85, 54, -234, 97, 60, 252, 30, 96, 140, 33, -75, 107, 105, 55, 132, 258, 215, -236, -119, -94, 137, -130, -260, -74, -233, -163, 316, 48, -160, -225, -74, -9, -57, 52, 112, 104, 72, 144, 71, 83, 299, -131, -55, 303, 78, 192, 109, 273, 210, 90, 101, -251, -117, 45, -229, -148, -58, -29, 13, -354, 91, 169, 184, 372]
3664C72l96M07m65n2K44j50p5P1P8M2q5l3m5N3J3J94j55J00q9rL1Q8j44L7O8M8
3690A48M8J3l37K84k44K1k34J98K11l33M1J36M0RqR8q0J40j33N6j06J87k88m4
3714a77L02M4j35P9pr4J24q9j15J21l08J74J3j3RK92k18j03l6N6K94l51K75m2
3738I5J19p0j70P9k56K39L2N9p8j46j94M57r9L0rj65K6K16l68K01J9j30K15k21
3762a19R8q7J38p7N0j14J22Q1j98J29N9q3N9j02j44M7J22j41m0K73K48k23K56
3785C54k62K8k09p5m7M0K7p4J51l8L84m73k2J83nJ67j18J47O5j96Q4k02O1j20
3809a50J08j09L44k32Kj5M5J66k04j0q2L45l06j57K02L0k59K91j81J59j89R7J22
3832A7lj04k2K42O2j56J83j70q5L24l83Rl0J52N7P7j02j29K9j7jm9J20j59O7q5
$$ y = [372, -24, 383, -82, -134, 110, -40, -115, -44, 34, 76, -9, -42, -87, -34, -21, 173, 18, 118, 29, 20, 51, 139, -5, 32, 100, 148, 196, 209, -128, 156, -88, -67, -301, -103, 108, -225, -184, -48, -8, 1, -7, 91, 11, 151, 18, 74, -32, 155, -133, -177, 125, 169, 34, 113, 106, 12, 136, 47, -68, 53, -255, -81, -68, -81, -72, 220, 2, -101, -137, -81, 213, -138, 137, 95, 214, 144, -26, 53, -203, 36, 68, 127, 49, -97, -291, 166, 67, 97, 88, -77, -51, 165, -203, -2, 17, -113, 102, -119, -21, -108, 30, -47, 3, -111, 11, 92, -106, 23, 82, -1, 58, -44, -188, -141, -19, -160, -200, 73, 321, 98, 354, 92, 120, -89, -164, -211, -171, -144, -218, -67, -105, 279, -194, -216, -33, -38, 129, 11, 158, 223, 27, 111, -91, -30, -150, -42, -151, 193, -39, -37, -52, -7, 159, -45, -55, -137, 208, -98, -255, -53, -23, -282, 9, -172, -13, -202, -105, 17, 14, -90, -112, 130, 192, 36, 219, 49, -36, 288, -95, -86, -116, 36, 93, 170, 68, -61, -32, -49, -50, -99, 21, -138, -71, -156]
3858a56Q8p6K01j97K55j86M2j16LL34k85J30j8l4O4K77k47q0J52N0j16j14q4J69
3882E6K5J28k07k8k00J98K46l46J64J33k58Q7J16m7o4j19L7N8J69r0J3q2J09j63
3906f5j11L08k15n9L2lK06j26J30j3P1l95J79L26k30k36K75j58M5K6o4n4N5RL6
3931c1K9L4k40J89j7J1M9J76j37j44K68J2l59P0l4J73j74J46Rk30J80J66q8P9
3955A37j07m5J31k43NJ95j20m3j51jK14j65K02m9l8j1J56p9N9K11l4l55j11N85
3979C43o65M07p8j62K92j02p8P5l48J31K32o2j70K65J99l18P1j5r9J4p3J70k93
4002b64L04k67J52j9P0P4O3o0N7K8j94ok16Q3J42r3K10K10k07j20N4p3Q4MR0P9
4028A85k81J66l41J00n6K14j10N7j05J46j15L07p7J78l77lP4J29J31j41n9j97
$$ y = [-156, -68, -144, 57, -140, 115, -71, -29, -145, -142, 192, -93, 37, 19, -15, 49, 326, 79, -1, 151, 201, 85, -29, -113, 56, 81, 209, 2, -26, -226, -28, 218, -128, 36, 169, -89, -2, 114, 67, 3, -116, -79, -21, 148, 58, 71, -11, 98, -65, -176, 132, -83, -142, -110, -113, 93, -33, 97, 84, 155, -240, -61, 265, 35, -201, 74, -84, -39, -13, -77, -131, -76, -67, -31, -2, 32, -208, -19, -36, -25, 24, 200, 63, -81, 187, 199, -160, -90, -124, 49, -125, 21, 30, -200, -20, 146, 58, 137, 30, -15, 116, -127, -122, 73, -47, -90, -241, -242, -28, -193, 9, -40, -78, -89, 67, -12, 47, 258, 224, -131, -242, 343, -322, 85, 7, -155, 137, 35, -43, 32, -316, -185, 47, -15, -185, 80, 279, -39, 32, 17, -82, -68, -141, 29, -264, 40, -227, -75, -94, -24, 50, 113, 53, 110, 138, -56, -62, -278, -195, -53, -146, 64, 274, 67, -53, 1, -72, 12, 16, 106, 185, -96, 70, -271, -171, -227, -13, -123, -66, -171, -25, -140, 167, 90, 268, -109, -112, -38, 91, 222, 81, 22, -175]
4050a75J39j33J24J44k7m3j18K20j20j79K50l35K36J14j19o8J04j22j66K72N8
4071E6k64L61j01k70N3K14r5M3j1o6n4P8n2J56k71K01k04K21K15j00j3k87R9L6
4095e5K84l56j20K57j51K39j15j44N36l19L0R3k83J93k16q2J38O2k9L7j21K71
4117A49p7j12j08q9K74L68j97j70J6P7k08L88p7l47K84j27j78k6K22K0k7j05M9
4140ar4L18l07K37k09j08J79M4l7pK1K4O9j55j48J43R6N5J33m39L65k38J01%j6
4165B6j54j40L59K01k34l7J61j52m3r9L91l90J01K54p0k9j35J3M3j75l3p3J26
4188h9l5J55J59j56j34J03o0M6k06n5L93j36j56K34n5Q5l8j92O9K47j88j2L23
4211C02k66k0M1q2J84k56J89p9OL2L56m31l4Q9r4L18k3j89j8n1k00J43L04k98
$$ y = [-175, -36, -169, -45, 99, 72, 29, -89, 131, 11, -168, 82, -253, -17, 97, -22, -90, 14, -108, -274, -2, 56, -208, 153, 52, -218, -165, 49, -46, -3, -14, -80, -134, -56, -108, 48, -223, -22, -226, -5, 210, 110, 97, -190, -91, -55, 229, -127, -247, 10, -141, 98, -17, -161, 375, 56, 86, 179, -104, 89, -127, -209, -71, -9, -38, -1, -122, 149, 72, -40, -148, -237, 37, 405, 208, 38, 54, 131, -77, 311, 234, -113, 171, 44, -134, -160, 62, 82, 55, -50, -1, -95, 223, -84, 153, -56, -164, 15, 59, 22, 15, 36, 60, 129, -26, -174, -31, 65, 120, 253, -186, 179, -59, 42, 42, 26, -128, -268, 91, 292, 58, 21, 182, 30, -13, -112, 279, -111, -10, 244, 174, 145, 10, 23, 66, -109, -142, -215, -89, -124, 31, 190, 34, -100, 3, -57, -11, -217, -272, 121, -15, -171, 63, 8, 93, 55, -137, -68, 179, -9, -21, 302, 36, 16, 57, -25, 159, -97, 92, 13, 19, 51, 407, -24, -58, 31, -63, 255, 232, 43, 25, -26, -226, -83, 221, -77]
4235g7K0k71M07j17k27J68n6J30n9o7L6J8k9J33kJ00q2K7k04N2L1M1N0k2L5j14
4261g9J52p4J49o6j30j05M4K9q4O4J13O7j49j65L73j98R9L37j12m13L23l44J61
4284hm6J05l10P2Q9J05J23k16J86j26j20K01j62P2J03l19M84l03K58j62Q2rk16
4307a17J05Rk02J24K4j92J88K44k80K34j69K56l13K75j78r6K47j36n4l2l5L54
4329B56k29K05l00R5o9k0K11k48K88K0l24P2J24M0k45L47j06k61L1N1j33J91j81
4352a85P5J92R9l31M57m60P9J94k7Ok43J72j36L25l49L33l50kK9l3K7M00q4j93
4376em7J71k30K50p8J49l45Q0J76K3Q1mp1o3j22N1m2J23j70J40Lk3j61N9j62J61
4402e6m0P7J90m22M20k48J21j34J1j02K4M20l70j35L80k65J71J84j09OQ2l00Q
$$ y = [-77, -57, -328, 79, -38, -265, -97, -153, -23, -82, -149, -113, -95, -124, 9, 7, 107, 25, 52, -152, -100, -69, -28, 22, 0, 35, -79, 73, -1, 148, 82, -48, -153, -109, -80, -164, -100, 13, 80, -69, -234, 139, -59, 40, 377, 265, -148, 175, -169, -8, -54, 51, -259, -187, -98, 7, 130, -86, 100, -26, -146, 55, -107, -35, 68, -251, 233, -70, 188, 26, 108, 99, -117, -12, -3, -205, -81, -57, -249, -61, 183, -97, 137, -32, 224, -89, 186, 8, -88, 159, 23, -31, -63, -98, 256, 27, 232, -68, 27, -42, -62, 149, -99, 189, 209, -115, -43, 81, 121, -124, 223, 117, -144, -113, -62, -195, -4, -185, -110, 82, 181, -150, 307, -153, -74, 120, 93, 99, -144, 28, -108, 217, -132, 201, -149, -151, -122, -155, -128, 272, 188, -5, -52, 119, -111, 139, 61, 210, -135, -55, 121, 144, 225, 221, 150, 87, -35, 16, -26, 97, -73, 67, 70, 47, -114, -55, -217, -56, -96, -19, 171, -251, 169, -79, 42, -92, -81, -183, -159, 261, -109, -244, 136, -129, 42, 226, 117, 123, 205, -95, -87]
4425h7J88k44K17j52P0j37l7L14l10N17k16J83k40pJ7o7J66j46K6q9j21J4J69
4448B8J44O5K8k31j58j7Q7J56k53K55p1O5n5k32R6J30j44K74m8j36K06l60Q0K27
4472A36o8m0j36K28l8j21J44q6k35r4M07k36NO8O2j8J39q8n3J79l29K08R7j61
4496c0j79J25J13j30K2M7M7k30N12j77j1j65J55j16J5k30J31N1K8j69N6K59k74
4519a50K33J68j32k97K34p1J01n4J12j43J58K4k5Q3k17oj31r1L16r7Q2l68R4M81
4543C04m03J62j26O6m7j75M04j85r8kO4j68K13Ln9n2J09j84L16j32k30L39o4p
4567D8l2j21J24J05Pj94K8j26q6K60J5n8J1k24J77J48m2J5j6Q6j0k56L35q2k46
4592a34K7K4K02L9j82J04j29j37K03K1J28m04L25k24J20L04l06Nj58K80K25m81
$$ y = [-87, 101, -143, 74, -78, -8, -145, -182, 132, -178, 339, 123, 306, 66, 59, 76, 9, 175, 29, 55, -34, -155, -141, 28, 172, 237, 265, 34, -124, -141, -54, 102, -151, 104, 33, 98, 43, -189, -93, 37, -107, 167, 119, -17, 189, -171, -91, 136, 68, 28, -108, 120, 82, -39, 105, 19, -216, -310, 97, -139, -134, -66, -4, -22, 117, 29, -24, 155, -174, 34, 131, -30, -209, -84, 29, -101, -79, -32, 15, -215, 297, 120, 109, -56, 99, -17, -2, -232, -101, -50, -22, -191, -135, 124, -150, 83, 251, 119, -178, 56, -15, 86, 32, 144, 1, 159, 183, 158, 241, 24, 18, -113, -204, 112, 15, 97, -271, -177, 304, -99, 63, -63, 3, -44, -219, 185, 0, -98, -100, -36, -204, 9, 12, -47, -99, 10, -174, 142, 10, -220, 119, 55, 48, 16, -105, 19, 124, 131, -63, -35, -161, -247, 13, 28, -30, -19, -243, -66, 82, 40, 55, 39, 125, 115, -141, 194, 112, -134, -107, -83, 119, 158, -24, 80, -49, -186, 17, 38, 166, -238, 87, -137, -17, 287, -19, -14, -172, 108, 333, -148]
4614a48K25k37J99K2k15n2l8M9J07J93j7J6n0R4k54J01K06l01M0m4L50j88j05
4637d7Q9k79L06o3N7k02p0J42Q6J2J48k26L28l53l3p0J48J09k11N4N0K8J01o3
4661D1K6l11K32r1J14K4P6O3Mj87J3j93K08O4k17J35j14k2q3M30j2j17R3kl74
4686b00R7K32l1j5j79K69lm49M13k09J2k0J05Q4l4l6%j5p1L2J64k93J47k2J29
4711A07l42M04j82oJ9P1O8j92Q3j1R3m5j23Q8N7O5m5l1j28L15j94Mm8J24K7j67
4737A1M4m1j5l41L40Q7j20j46r9J96L13p3m95M93l61J29K21L9p4rq9L5n5J01M5
4762A36j24%k5q0K32j35K6kj07l1J00j78N0K10r8P8m0k15K59j18J70l92N33j57
4786I2k20J95j48k04N14m23N11m46j97M39j71Kr4L81l20Q8n2J24j33J42j21Ml
$$ y = [-148, 77, -160, 39, 61, -154, -206, -244, -195, -88, 105, 88, 104, 54, 148, -106, -5, 201, -100, -60, -104, 246, 58, -47, 42, -237, 69, 6, 63, -139, -209, -67, 19, 31, 179, -47, 281, -72, -105, -175, -27, 82, -129, -75, -25, 3, 104, 41, 67, -244, -12, -103, 11, 35, 111, 174, 178, -9, 4, -189, 19, 83, -134, 1, -113, -135, -218, 212, 200, 83, 176, 174, -200, -103, 129, 98, 83, -96, 173, 170, -279, 134, -75, -63, -83, 22, 106, 72, 36, 36, 21, -50, -18, 146, -147, 0, -22, 107, -235, 169, -13, -19, 0, 71, 139, -53, 30, 19, 112, 67, -56, 32, 89, 154, 109, 78, -50, 265, 71, 75, 27, 151, 178, 11, 55, 14, -1, -342, -2, 85, -35, -181, -280, -84, 229, 156, -339, 154, -207, -78, 143, 182, 108, 99, 10, 45, -10, 91, 136, 12, 12, -13, -93, 139, 4, 30, 28, -79, -110, -10, -188, -138, 72, -26, 52, 12, -203, 56, -62, 108, -284, 249, 92, -128, 67, -81, -285, 229, -194, 317, -129, -326, 113, -58, -56, -150, 231, -89, -1, -53, 71, -62, 80, -41, -37, -40]
4809d0j79N14m64K56J15j93j3q8R9k42K42o1K40k83L2Q6K61k92j3JR3m8K21l66
4833a22n5K19r6r9J66l8q3q7K44l3l88L65j22l0K44L5o8m8J09J02k31J62j93p7
4857a24J20r7l8m6J10J72k96K97N9k71N9l44L68M2k9k96O09q0n49J63J89J06j30
4880fj53L3R4j49j8j36N49q0J7Q5r3j38k4K91k91K00q4k25K42Q6m03J65r0KL94
4905B68m49K30j18r7N1J72K6l47L08k83J9L55k13J35K18j97k76Q0M6L11k52j43
4927a56J11m9J60j84M26n46K88k56J25J00j12j18J98J03L24m78n7N6j02K58J6
4948A07k62J44J82j28p4J2K42l89R6J57j40J22n3n9K88l34j01J86k13L63Q3j32
4970I7k94Q0O0L56j76k2m27K27J11k15M86l55K28J18l18n1J46j8N1p9n5j6J01
$$ y = [-40, -219, 295, -169, 87, 202, 9, -4, -92, 7, -235, 7, -54, 186, -97, -65, 21, 282, -10, -23, -22, 71, 23, 244, -122, -177, 42, -54, -153, 13, -25, -108, -195, 49, 16, -372, -7, -129, -159, 85, 120, 52, 4, 113, 215, -16, 146, -47, -124, -4, -101, -139, -185, -75, 97, -199, 98, 157, -114, -55, -399, -31, 11, -18, -314, 295, 215, -334, -171, 18, 124, -6, -159, -126, -32, -181, -199, -335, 214, 134, 151, 236, 143, 5, -19, 272, -19, 181, 97, -128, 114, 200, -203, -38, -128, -126, 268, -181, 49, -69, -166, -115, 57, 83, -264, 44, -239, -220, 135, -78, 57, 275, 78, -198, -118, -72, 239, -13, -156, -45, -94, 66, -118, 308, -238, 50, -206, -81, 19, -93, -211, -13, 90, 414, -64, -121, -65, -167, 91, 107, -155, -11, 171, 43, -31, -19, 223, -166, -70, 87, -53, 69, 16, -43, 245, -89, -190, -4, -217, 146, 229, 97, -197, -117, -57, 299, 123, 101, -326, -99, 12, -203, 283, -72, 156, 274, -44, -95, 51, 33, 84, 5, -50, -66, 35]
4993C5j00J37k31L25k25J0j2j29J52Q2q9J54R6l14L55o6j52j21K93j07k28J55
5015B0r1J24r7j33L36l02O0j2k8O2j32J04N7K4o2K52k15Q6p1Q3j32R0q4m0J78
5040G7j07M2K1j52k8J73p1k14J25J49j56J28mj1K6J23j10Q9j23j3M1j3K31l65
5064a42J61O5J38k29J68j81J02p3k07K98k44M1K06ml6o7j00K15l56J70K60j92
5086gj78L16j02O9k30L95j88j66qK78K1j08l92M58k34j19K26j69J99k30N3m2R7
5109f1N4k01K08J24l2k12J37J01l75L70j90J82K3l2l7N5j51K17k30j07J81j35
5131a11J2J57N9M0k97L5J2Q0j9Q2j00J75n7k0J41p0k86%L16j24J99k83n6k0j07
5156b42J80J82J17l05J17j24J8J23k82J99R6J30l44L83j52k49n0L26k58R1k39
$$ y = [35, -65, 72, -159, 166, -59, -49, -61, -190, -38, 44, -45, 109, 205, -109, 246, 180, 28, -93, 200, 93, -135, 20, -71, 53, -44, -177, 159, -143, -83, -95, -123, -61, -193, -89, -32, -8, -70, 182, -33, 53, -18, 65, -67, 23, -61, -101, 77, -30, 12, 33, -119, -147, 26, -45, -259, -134, 15, -141, -13, -17, -28, -2, 121, 11, 100, -23, -36, 5, -8, 223, -142, 19, 84, 222, -7, 161, -20, 82, 9, -198, 100, -144, -103, 103, 99, 63, -4, -104, 111, -245, -75, 185, -7, -185, 131, 29, 98, -132, 263, 75, -91, -99, 179, 200, 92, -300, 158, -76, -195, 31, -138, 61, -169, -116, -158, -61, -7, -208, 0, 124, 92, -120, 17, 118, -257, 113, -77, 105, 128, 96, 59, 114, -37, 180, -50, -157, 24, -111, -99, 58, 117, 157, -140, -105, -93, -13, -32, 50, -50, 125, 68, 48, 189, 119, -167, -167, 149, 25, 224, -59, -115, -135, -242, -62, 120, 237, -68, 49, -75, -57, 66, -216, -17, 79, 209, -135, 248, 96, -153, -203, 123, -135, -44, -283]
5177b83K48J17j8j36P2N7J87k53j97J04K8j2r2K90p4j3J4j04L8R3j33K1q4J05
5201b5j00K1K4L38k66r6j13n1J86J74R4k48P5n8K2l56K71J88j91R9J2J88q8k07
5225a07J15k7l3j1J13j16O6J80j62l17L91q8N3P7k64J04n3Or5L06l12L97m34J05
5249a06kQ5O8J9K27n22J51K17K05k65O1j78L4J0l6J63k53QK4K69l11r3K87j1j62
5274a11K14l00Q8J21L7j43J99j04m4K89k93m4j58K66j03m0n3J87K58l04J37Nj05
5297ao6o3J19n6r2p7J85K49k55q5J44n7k41J71K37J19K7k1m85N62l53l0O9J02
5321A02k27j27M80k51M2J09j37Pk50L05J46k64j36K11%K78m01j07QK02k3j64M77
5344B80k89K05n0k91J96r4J00l1%lQ5j76j82K0J65l3j03L69k69J94n7j70j2l6
$$ y = [-283, -35, 82, 64, -72, 0, 57, 244, -9, -206, -102, -74, -86, -178, 112, 38, 25, 39, -65, -27, 66, -67, -46, -130, -25, -125, -104, -80, 258, -8, -104, -217, -268, -82, 92, 186, -62, 13, -45, -23, -379, -108, 80, -111, -12, 0, 188, 100, -107, 8, -19, -52, -63, 50, -66, 0, 180, 18, -299, 92, 4, 57, 134, -130, -26, -79, -73, -168, 138, -174, 223, -211, -106, -108, -23, 45, 64, 291, -231, -80, 137, 342, 77, 138, -40, -6, 4, -32, 131, -122, -114, -90, 179, -132, -225, 62, 51, -111, 103, -197, -109, 12, 49, -94, 105, 1, -43, 246, -47, -91, -249, 17, -86, -126, -179, 8, 266, -38, 99, 104, -1, -67, -130, -11, -67, -159, -236, -51, 198, -57, -142, 2, -55, -296, -125, 112, 231, 258, 237, -248, 314, -39, -69, 0, 102, -125, -252, 228, -23, 19, 128, -9, -2, -252, 53, 199, -65, -201, 10, 10, 288, -113, -220, -212, -10, -33, -197, 280, -9, 196, 146, -145, 51, -43, 57, 26, 26, 23, 108, -68, -250, -230, -65, -98, -201, 168, -101, 93, 36, -134, -146, -182]
5368a82L03J13k79J36k36Q7K64j64J10l20K59L0Kp6k21J21P7J34P4l6l93K04k15
5391b08K70j38k67K87J57j58j3K78p8j37k57L84j80J39j76Q8j64K07J22J40l55
5412e9m7N1lQ5K9k21J53J89j80J22n4Jk04M52l19r5J25r2M4J8j48O3J45o5j2Q
5438a4j80o6J24K59m0j0qj65J40P7K0l35J97L8j7K04j57l28K27J29j03p7nm8L46
5463B08j20O8j7j61J44j08j42L34j98M4kJ8K92m29M9p5P6l2p2K48n4j56r7O9J84
5488G1J2j18j99K14j20K79k63J59K62k16k32L17j61j97jR1l10M28k34K17Q9j55
5510f7K15p2j31K56q7l18J69J9K96j69pj65J98O6j61o0J43K0k9j72K3k6J13o0
5534fm6J75r4m2L6j49L2J76k8m9k61L70k91N3J50r5O2j73J58J6lK57j23N0k99
$$ y = [-182, 121, 234, -45, 91, -145, -58, 206, 42, 152, -168, 91, 121, 123, 47, -174, -53, 24, 158, 232, 196, -197, 7, -208, 62, -76, -343, -56, 101, -57, -70, 208, 130, -7, -264, 120, -60, 79, -97, -9, -173, 34, 156, 296, -59, -106, -55, -58, 27, 56, -165, -12, 177, -3, 119, 65, 66, -138, 314, -5, -100, 25, -67, -23, -5, -153, -90, 55, -10, -22, -14, -194, -260, -136, 123, 83, 73, 65, -100, 40, 117, 137, -198, -1, 37, 20, 224, 67, -261, -34, 95, -8, -85, -90, -138, 208, 88, 156, 139, -22, 122, 14, -128, 206, 8, 52, 50, 68, 360, -69, -20, -95, -19, -51, -123, 125, 71, -85, -182, -113, 71, 83, -35, -234, -20, -140, 139, -124, 35, 297, 81, -151, 166, 5, -192, -193, -102, -412, 16, -218, -1, 88, -67, 148, 76, -55, 201, 114, -204, -35, -16, 280, 111, 104, -61, 137, 203, 42, -18, 125, 145, 116, -56, -33, -59, 54, -6, -52, 123, 29, -13, 23, -126, -94, 82, 54, 5, -256, 114, -177, -124, 26, -69, -7, -180, -22, -6, -9, 248, 125, 175, -124]
5559a24J00J03j49J9J26j09P3K0J20k52J00L43k93N3m4J10k51J38j65P8M6L1o7
5582Fm5qJ37j86J13J62M5j56P6m39J37J16L78l53J03J45j67r3J42j59J53j42k2
5605e7L1k39L22J92n86L35k35K66j78K28j28Q3j8O9M3j53O4k6n6k28L63R5k87
5628a00O7j65P8J88K6l2j4l9R1p6j76m9L30m8r1R5o6r7J12m5l00K81L22m4k57
5653ip3K11J81m06L66k45J38j50K26k36K20k4l68l5L15M4M4k1k83L3K11K89l08
5676A20K01j99q8J50l04J46j16J86p7j79K00O9r1j25J12l2j16J09J01o8m1j01
5698a43J92n7k85J80J41J4k30L96j51L7p2P0j92L77m19P0n9L30q2k63J11k8J91
5721A28M6m03K77M5k15K46l38L01k04J91kl7J49k10n7J13n6q7j66L85n4j65J60
$$ y = [-124, -24, 79, -70, -51, 75, -34, 39, 59, 179, -73, 27, 370, 77, 130, 86, 196, -55, 83, -82, -4, 42, 73, 6, -39, -47, 90, -96, 17, 179, 224, 68, 144, -295, -158, -42, 336, -17, 86, 231, 64, -29, 113, -46, 107, -35, -57, -26, -265, 57, 249, -337, -2, -237, 29, -149, 79, -49, 34, 16, 85, 128, -25, 39, 13, -43, -271, 92, 187, -100, -33, -198, -120, 68, 94, 62, 48, 9, 100, 24, -152, -201, 129, 81, -10, 85, 19, -78, 34, -11, -311, -30, 292, 248, -9, -82, 129, 310, -96, 270, 25, 163, 13, 239, 3, 223, 199, -169, -204, 111, 155, 199, 178, -105, -72, 139, 428, 120, 321, 122, 34, 184, -120, 26, -90, 96, 19, -160, 40, 109, 18, -107, 5, -27, -143, -34, 67, -1, -42, -143, 49, -8, -293, -113, 28, 42, -188, 208, 57, 94, 22, 92, -100, 277, -142, -72, -131, 199, 117, -146, -35, -63, 128, 174, -229, 48, 93, -122, 124, -214, 87, -117, 74, 72, 35, 184, -26, -83, 30, -26, -113, -279, 106, 52, -113, 47]
5744D7r6L6k0K64l32pK87j98lJ31Nj43M9j97J52L57n08m9N6M15j63j11J8L0M3
5769F3j81K62k37K0J52M4p9J02k86P2K89m56L23j16K5K5l0k09KK05j61J20K9M4
5793B2K2rk40K04j41J65K9O8j73J00l06K39O3q0j57o4M75k43K7n4K52j66J71n1
5817A53j00O9m9J47r8j65j27R8J08K06j80J29k72J44P0J3O9j39r3o8O7j27K63
5840A18K52l50K6r1J28p0j71k8K05n9L60l29K16j69q7j08R4k1J85k11j34K31N0
5863C7n6N5j73Lo1L04j27NK2j33K94j10J03j23L1k43J39l9M9J32j35J02J05l4
5887A47k30j58K55jJ02j11k05L40o8j39J8M0j51L14m8k27R6Q9j0O0j27L7j28P8
5911b7j92P9K83o5J28o6k65J74j88L93k55K22m10K57j00j38L44j00n4J48j54j5
$$ y = [47, -49, -13, -33, 231, -101, -108, 179, -19, -22, 109, 114, -29, 20, -177, -25, 332, -176, -225, -169, 246, 83, -28, -10, 20, 63, -118, 144, -93, -73, 79, 123, 44, 146, -140, -68, 221, -235, 88, -28, -3, 22, -8, -217, -215, -10, -171, -51, -22, 22, 44, 35, -205, -1, -142, 23, 52, 120, -53, 47, -259, -20, 43, -37, -194, -258, 217, -26, 1, -53, 199, 33, 204, 153, 53, 122, 73, 220, 122, -43, -170, -72, 36, 242, 62, 191, -81, 63, 133, 146, 215, 76, -17, -85, -18, -145, 118, 370, 20, 46, -45, 83, 13, -158, -186, 19, -40, 320, -9, 207, 38, -49, -157, -63, -84, 101, -110, -244, -13, 37, -19, 36, -137, -134, -195, 109, -18, -13, 9, -124, 170, 60, 163, 40, 71, -172, -33, -72, -23, 109, -26, 76, 181, 147, -83, -241, 14, 13, 115, 4, -201, 139, 71, -68, -50, -10, -161, 153, 105, -122, -26, 63, 53, 113, -14, 23, -105, -27, -219, -140, 143, 78, 206, 140, -125, 49, -139, 254, -1, 221, -189, 68, -32, -170, 174, 74, 20, 168, 14, -1]
5933aO8j17O0k70M11j34J16N1o5k63J92j27J49k7J37j37K25k99J12R3P1k33J33
5956A45k4k68j8q7J97K04l17K13N4j62J62l05J9L72p5j65pJ50J63k56j33J07j26
5979a57K27p0J04o3J8J5q8j04K35q9k19J43l2r8K0n0n9J58j0J7j25M21k10j81
6003a97L42j17j9J06N2k99m0L02JN8j67k7K15k73P7P5p8j81J84M9pk3J19l66L50
6028A36j24N9k3J43j92j28Pp5J27j50J13K1J84K26k77k37J26J60o8J45m69K88
6050hk15K69m5j22K7R9J6L5j0k6nq7J89j17J76j09jj70K09r1m2M0j12q3L35k32
6076h0L1m09K24J68L1o9r7M75m24K17Kk55J67N6j41mR7pj17L13k5J66n5j98Nn4
6102A7k9l2L2J24j12J63m9p4rk3J71k72J67K0j00j26j9J72l9M3j3J19l8k3K4j38
$$ y = [-1, 67, -50, 10, -260, 151, 17, 133, 184, 119, -144, 48, -79, 70, 43, 180, 43, 268, -31, 81, 174, 245, 12, 145, 121, -147, -165, -252, -55, 149, -168, 45, 99, -63, 99, -206, -187, 185, 110, -55, -62, 88, 251, -5, -138, -31, -157, 70, 0, 104, 41, 59, 74, -14, -118, 117, 28, -191, -48, -80, -178, -158, -208, -267, -109, -119, -102, -227, 194, -16, -197, 145, 28, 9, 115, 167, -132, -172, 130, 131, 189, 22, -5, 210, -63, 14, 89, 11, -170, 14, 63, 56, 33, 152, -214, 136, 12, 71, 48, 191, -1, -129, -122, -197, -70, -220, -107, -86, 98, 324, 47, -190, -64, 96, 28, 173, -296, -8, -223, 46, 1, -121, -94, 5, 21, 56, 46, 20, 15, -72, 117, 0, 176, 67, 66, -104, 105, 14, -28, 12, -100, -183, 152, -80, -49, -458, -234, -66, -35, -104, -201, 274, -150, 67, 69, -186, -19, 37, -104, -108, -11, -18, -135, 178, 153, 319, 264, 66, 71, 17, -12, -44, -12, 112, 0, 163, 114, 40, 31, 8, 179, -93, 74, 94, -6, -132, -151, 21, -18, 25, 12, 131, 93, 70, 94, -44]
6128d4J4n9M3J32L0k42L13r2Q3k91O7oj47J90J36rQ4k00j35K05P5j50j03r2J24
6153g4m7m7L98l07K01lkk53k56L99M2pJ39k93J04p1K23k35j74J66jJ62k31J83
6177A6N9R4k85n9K66k19M2K18J21m1j42k51J91j47J37mP2j50K45k81K37l35K84
6200F8l3K6K26k59J62j67l52L70J85o0Lk00L9oj31J57Q2j08l4j82K37n9J35oj55
6225f2K56m4j83j27K09j99J01J76j48K5J56j28l92L30K07k89l0j0K09l00K10j50
6247a83l4P8K43r3q1J06N5k8r7J08r4m1R9j79J58l6m8k01L64j16mN4j58K0N1J48
6273I1q8J40j2j87J18K3m9l29K12K5j70N07m31L07k59J4K50n4l24L17j68r4L21
6296A60k87J53j36L16k59k18K84p5j95J84r0m0L07q7Lk5j09K21k02L28q9k7Q8
$$ y = [-44, -30, -89, -46, 86, 116, -126, 187, 95, 178, -113, -46, -52, -199, -9, 127, 118, 202, 2, -133, 72, 147, -3, -106, -198, -74, -121, -168, 230, -77, 124, 121, 119, -134, -390, 9, 51, 44, 183, -110, -6, -77, 146, -89, -263, -97, -98, 64, -167, 16, 75, 169, -116, -175, 91, -128, -86, 132, 253, 212, 70, -181, 10, -137, 0, -4, 68, -82, 163, -118, 119, -216, 68, 35, 61, 287, 28, 190, 23, -329, 41, 226, 166, 169, -31, 8, 2, -129, 28, 110, 2, -32, -214, 23, -36, 99, 93, -62, 194, 150, -33, -160, 49, -150, -49, 127, -21, 4, 160, 32, -360, -30, 177, -112, -142, -152, 57, -243, -33, -183, -217, -139, 104, 11, -70, 36, 91, 63, -34, 74, -20, -61, 38, -141, 17, -19, -67, -268, 96, -20, -24, 30, -128, -108, -57, 91, 3, 143, 131, -56, 62, 85, 36, -293, -81, -56, -226, 281, -150, 157, -102, -88, 162, 108, -216, 101, -67, -161, 160, -127, 26, -110, 206, -53, -271, 13, -62, -257, -73, -163, -203, 104, 17, 20, -5, -114, 107, -95, 233, 144, 117, 205]
6319B05k72J82J0L0jj67n6pj38J22j16J28J36j65n3o9J29R0k0O7kO6K14k46m3
6344B4k40K30j45K65j38J37j54K75k24o8n4k8K11j80J30J44r4j68K7J36j46J74
6366A14K3l14K02o5o5K45L1M7j67J3M5k59k6K62j80MK61p9r3j46L8J58k3K8j54
6391a00j6J21k42J56R1Jj35P2J96j83k27K6K35j51O8J59j61K57k64L01k40j84
6413b20K68j89K34q9r4M5j34L03J52k33j25L8K35j79J17o9K2mj82K15j42P8J75
6436B22J2l38n7K22p2k1K29j1j95k75K64j3j5J6P8j30Ml2r2M4J34L3q9p6ok0L01
6463A17j79K44N2j69l6J14j44l9L8r7p2J14J11P8m57J50j2k4k0R9K13j81P1KJ20
6488I3n0j24K73j14q6k0O3j0j75K59J4j71J45j61o6p1L53l38rJ06R9mj91K54j6
$$ y = [205, -67, 115, 125, 155, 154, -13, -69, -76, -214, -92, -208, -80, 56, -109, -162, -231, -102, -12, -32, 35, 33, 99, 313, 67, 24, -216, 14, -131, 134, -4, 133, -21, 254, 30, -38, -92, -120, 91, -89, 41, 185, 91, -77, -50, 86, -60, 114, 137, -177, 25, -40, -105, 140, 171, 218, 51, 64, 109, -150, -176, 86, -94, -90, 171, 92, -1, -147, -109, 49, 26, 54, -100, -116, 5, -237, -81, 10, 11, -124, -52, 144, -39, -266, -240, -5, -156, -88, 71, -90, 167, -97, 204, -36, -220, 48, -141, 93, 4, -90, -45, -179, 124, 276, 43, -82, -44, 191, 12, 129, 60, 82, 78, -104, 111, -31, 47, 222, 234, -104, -161, 61, -11, -32, 197, 186, -9, -284, -20, -33, -48, -32, 46, -84, -80, -112, -204, -160, -26, 7, -82, -158, -164, -184, 117, -62, 182, 234, 65, 29, 143, -1, -40, -2, -99, -171, -57, 54, 132, -325, -175, -187, -211, -231, -132, 81, -100, -29, -27, 93, 43, -81, 192, 78, -8, -28, 35, 25, -150, 109, 123, -48, 97, -64, -130, -201, 152, -186, -195, -89, 10, 6, -185, 69, 53]
6513E3M5k43J16j21J58Q0q0J91k42J16r0l9K63j20J88l74M6j8J60j81Q1J08l19
6536b22J56L14k83L53k60k9j01K48n2k38J51r1oo3qM39m29k12L86j22M9k80L43
6559D3K32l23Q7Q8q1n6L01j54k7q5J6P4qN6j74j91K19Q3k28N5K13K27j81l35K65
6584A16j44k17K79J32l31K4n1L40k48q5l4K84M8R5j50k17K45r1J60rk55J27m0
6607b2J19Q1k56m2K85j30M2l16o9K53J12N7q6l03m8K44J44N6n5L5k80J86L1k53
6631b15J05l7K35k92J62j0K6k1Q6J90j15j53j63J9J31P6l0j36J58j33J41j59J08
6654b7K6r0J48m2m4j51J76J46L0k67O4K7j01L4J70l4j62j20K00K29j67j31L5l
6678e4mO3Rq2J93K31l28j66N73n87K55j21mp8N1K75k43j3K52k04l10K34j92N5
$$ y = [53, 98, -145, -29, -150, 8, 88, 8, 199, -43, 73, -17, -56, 207, 87, 275, -99, -53, -71, 89, -92, -11, 97, -222, -66, 248, -35, 318, 58, 29, -72, 176, 124, -114, 37, -54, -60, -123, -131, 308, -121, -333, 53, -69, -20, -300, 43, 275, -48, 39, 127, 46, -10, 291, 137, 110, 25, 41, 115, 107, 163, -11, -202, 17, 100, -128, -73, 140, 367, 186, -149, 116, -28, -245, 34, 166, -165, -141, -192, 148, -100, -185, -219, 65, 113, 208, 58, -159, 86, -5, 155, 146, -109, 18, -22, 97, 178, -78, -120, 165, 35, 77, -239, -308, -55, 57, 114, 28, -275, -323, -79, 65, 121, 66, 101, -179, 7, 38, -215, -110, -147, 88, -204, -42, -52, -26, -47, 39, 229, 114, -39, -202, -183, -52, 24, -6, -142, 16, -117, 24, -135, -27, -1, -91, 57, 15, -29, -180, -4, 142, 172, -95, -31, -4, -105, -71, 99, 65, -97, -217, -17, 212, 45, -86, -51, -54, -58, 5, 14, -68, 125, 356, 28, -138, 435, -152, 103, -18, -22, -100, -49, 226, -17, -30, 222, 18, -292, -58, -250, -195]
6702a95K68j9O2j54J20k41K58L5j17j29K71j04J64k56r7Q7j14J79k7L8P9L7j99
6725e4J01%J3R7j74p2M6J95l17J92J50k59J7K11q3l5j44J85p7j1o7L12o6k45K09
6750A24j90L38l24L10j15J24m10J58R3J3j77J10l0j32K02k07K47m8L4k24l9Q7
6772e6P1o2n5O8q8J49J66m12M3K87J68k99J20j63K01n3k83M08J51k32k24J10k2
6795gj4%J17j01k2J40k34k05K77J4J57r5m0j4J97l7l38J13O8J52k72J91k31J33
6819e1K4J27M4n0j95r2L45k09p6K46j0j0l99M05k86K14P9O6j13O5Kj64l9K20q5
6844E8J2j74j57M26P2l12K13j60j51J03J07j96L15J66j91j74R0N3m44L88J44j57
6866C1j90J39O6o7k3%J99l07J85N3K8j36K0J74j56J81m1l25K03lp1o4M2k0K58
$$ y = [-195, 73, 54, 116, -38, 82, -159, 99, 134, 17, -112, 159, 55, 219, -37, -134, -47, -161, 18, -9, 29, 108, 145, -54, 47, 47, 60, 157, -17, -89, -43, 152, -165, 27, 177, -82, -65, 146, 63, 28, -116, 69, -8, -19, -86, 226, 160, -85, 124, -66, 272, -52, 258, 143, 267, -143, 15, 108, 121, -56, 54, 24, -108, 94, -113, 134, 86, 120, -104, -143, -56, 15, -47, -102, -34, -122, 27, 193, -219, -176, 111, 279, -20, 100, -63, 138, 85, -198, 210, 361, 129, -95, 15, -7, -21, -21, 96, -5, -27, 113, -121, -326, -49, -35, 122, 27, -13, -27, 170, 133, -205, -92, -24, 128, -144, 47, -184, -51, -27, 100, 144, 94, -101, -193, 152, -57, -133, 113, 103, 93, -306, 99, -187, 27, 106, 172, 59, 124, 126, -38, -77, 143, 58, 70, -104, -261, 165, 237, -75, 138, -22, -173, -70, 37, -159, 156, 322, 131, -43, 47, 100, -344, 44, 188, 31, -159, -20, 46, -21, -44, -44, 155, -152, 33, 86, 114, -22, -2, 172, 16, 197, 156, -169, 34, 31, -40, -104, -62, -82, 176]
6891A76j87j73J49J71o8k49L53q8q6j45M25m43N5J15j91K72j47L04k39J38k39
6912i7k49N35l43K67j24j2J72k89J95J07j98m2L53n45L34m20J17J39P2L08j18
6933A62q0j16J24o9q6J60%j7k0j17J09J02j22j38K8O0O0O2k22P7p3K24k54K45
6957I9k30j27J87O1Q4K5j76K19j53l11L83l6j33J01j4R6l0j6j39Q2K75J33m34
6980e4K58j63J4J70k9l43L26j31j77J00N8j44o2L12j68M6j83j10K98o7P2J29k89
7003a37Q8J50k77m0M27j60p9k72L82k17J33N6Nj25m0O9jJ75k54k3J91k33K25o2
7027a9j10J39k95J59J10Q2L8p7Lr7J45m91M62r4j95L55J01l45J46J20r7nm0k36
7051b41kJ75O6J44j91M6j52Q8R9R3J44j31j96K7N1J2q6K3Q4j09KL8K27l46J73
$$ y = [176, -11, -184, -35, 136, 68, -181, 172, 84, -2, -147, 278, -165, -110, 5, -186, 86, -61, 243, 4, 142, -97, -346, 189, -154, 113, -11, -23, 149, -140, 55, 162, -36, -78, 275, -270, 64, -356, -239, -100, -28, 280, 162, 82, -34, 90, 21, -65, 95, 95, 78, 58, -59, 50, 152, 30, -108, -80, -20, 40, 102, -120, -43, -116, 108, -146, 99, -131, -258, -71, -10, 74, 99, -77, 142, -11, -322, 61, 25, -108, -7, -21, 75, 45, 29, -110, -28, 247, 380, -54, 204, 41, 55, 225, 196, -147, 179, 48, -129, -29, 29, -115, -177, 135, -33, 13, -170, -280, 18, -49, 23, 152, -137, -49, 101, -176, -216, 211, 51, -28, -300, 82, -135, -2, 54, 59, -66, -106, -37, -38, 137, -117, -140, 51, -182, 43, -19, -129, 10, -285, -126, -16, 66, 104, 27, 30, -67, 78, -413, 49, -45, -240, 115, 216, -129, 17, 137, 40, 35, -5, -241, -243, -68, -2, 142, -49, -3, -155, -67, 32, 125, 269, 138, -58, -31, 20, 32, -54, -31, 53, -56, -54, -16, 211, -135, 38]
7076C8r5N6J90q6J9N2k09L3Lj16J34l0j13j7K35p5j06J53M5k79K57j14LJ78j91
7101c5J28okj47njj94M50j43J6Q3k20l4K08R9o8jN4k25o1K26l19J33J9J66l7J8
7128A02m36K79J49j96J21q9N7mj67M84l40j05K52Q0r8J08j71k01J42r5L92l29
7150f5J49K02j01j57q7n2K49j88Q9k2K05j34k33L1q3N89m23J33J2n1k38L11j45
7173iJ8L2K00l62K53k22N2k12J00L61k87j6O9J51k46j34N97l93L5j2q5J61j71
7196a20K36j95mo8J08N9k1kOm0K17r7mj08k38L32j64L9J43k18l6K30K6r9k75L31
7222C8Oo4j8j13L1P6j61R8J86j25m8L7k6R3N0P6j36P4j87k20J58K47j32MJ66k60
7248a50K5O8J64m4R9J6k23J85O8l49jK52j18K54k65K2J26p4q0J45J09k83o9J31
$$ y = [38, -57, -1, 189, 103, 122, 174, -35, -2, 1, -115, 19, -11, -124, -141, 94, 19, -87, 66, 111, -168, 89, -25, -22, 156, -35, 93, 87, 85, -62, -67, -68, -262, 188, 45, 61, 144, -76, -110, 98, 197, 129, 128, 182, -43, -104, 122, -197, -64, -45, 121, 84, 102, -334, -55, 94, -102, 19, -70, -13, -17, -184, 300, -40, -145, 107, 187, 89, 197, 26, -175, -33, -128, 264, -65, 84, 286, 185, 28, -59, -111, 138, -50, 39, 17, 222, 88, -145, -114, -197, 392, -31, 102, 114, 63, -175, 136, -9, 9, 41, 241, -121, 132, -90, -38, -250, -150, 211, -76, -92, -23, 128, -118, -252, 345, -48, -13, -25, -110, 51, -120, 116, -79, -83, -151, -43, 16, -5, -7, -1, -41, 176, 79, 75, -33, -271, 61, -103, -64, 79, -139, -175, 55, 81, -18, -293, 38, 44, -20, -38, -151, -120, -44, -205, -107, 79, -46, -94, -57, -83, 10, 60, 136, 0, 74, -113, -333, -175, 72, -60, -56, 110, -150, -125, -57, 107, 63, 162, 178, -45, 140, 208, -141, -142, 110, -8, 246, -19, 3, 129, 55, -25, 120, 229, -54, -123, 8]
7272Hj7j4j89J80M3L76l06m3k7J89j29j18k3J5L4K90k34%j26J88n0K03k51J99
7296A98l17K07J5j01J74o9R4o1J2l38K02k01J46L5L04j41j17J62j93K06k29m2
7318e4L1k59J19L34k97o3K51j92J09P6j78P3K14l55oL37M1l44K10l1J96l54L87
7341B45m24J63J9p1J14k31J76m7J50k46M5K10P9k45j12L27j58k96M93l57m3J58
7363e1P4k8L06r7k28k5J02j53L3Q6P3n5j12Qj74L22j44j20J88r0K22m1l3Mp3m5
7389e1O6N6q5O0l44K86K05j04Q7l29K22J43k06Rr2K97j05N1j74j3KP6k09o7L99
7414A80j10l7j42J22j87K89m3L3R9j43j88J00L33j33j66j87J79N2q3K38j27m1
7436C8P2L3j85J74q8J61j82K62j85RM0m67J48R6j47J56J20l4L26l30r5Kq3J45
$$ y = [8, -9, -23, -212, -32, 11, 387, 81, 38, 11, 200, 71, -47, -70, -55, -21, 269, 35, 35, -91, 97, 47, 250, -1, 198, -119, 88, 103, 2, 176, 107, 201, 140, 152, -186, 16, -185, -39, -4, 300, 159, 42, 204, 11, 217, -12, -54, -23, -282, -163, 171, -126, -189, 62, -130, -21, 55, -123, -50, 164, -191, -197, 140, 181, -163, 47, 16, 212, -142, 245, -179, -16, 3, -68, 46, -185, -9, -56, 94, -152, -107, 103, 182, -63, -175, 152, -6, -302, 191, -166, -209, -51, 23, -5, 301, 204, -24, -49, 53, -100, -67, 19, 92, 37, -75, -67, -241, 81, -63, -183, 5, -85, 137, 96, 63, 67, -6, -51, 15, 71, -14, 46, -298, -12, 193, 89, 176, -153, 69, 212, 6, 15, -77, 220, 115, 166, -8, -21, -19, 57, -152, -219, 180, 70, 33, -109, 13, -174, 115, 72, 105, 204, 61, -127, -27, 306, 173, 7, -180, -1, 51, -32, 206, 79, 38, 110, 143, -42, 132, 44, 205, 23, 285, 100, 109, 149, -318, -170, -74, -221, -65, 55, 21, 347, 17, -78, -76, -159, -14]
7460a4J88l0m31J63J47l5K88k03m15L84J25kJ35k44J83l91K25j14J26K4k90M32
7482B51j14j90J55K7j23j64K25j90K64k85J66r2kj39M41l32O6L54m8l47j48L96
7504A71l01J70J65l23M6M4O2K06o04M62q1J5n9r6K20l35K72m3k48K27qJ8K00l56
7528a76K05K71j84l3j26J28k75J38P7Q1J03k17r3J23r7p0L19k63P1j81L80Pj03
7551H5j42K02p3j78M4K05j87J32M1k09O7O3l4M9j63m0J9J78j36N1q6K27j43L3
7575Ek46Q3L86l53K16j35O2j83L1K09j15J09o1j22K02j21O4j80K50r1J12m96L59
7598a5O9M2j00k50K75J36k29O6l05J39K2J40J48k75K68jk16Lj09K26k8j15%j48
7622b57J77r3J12K23p8j88K86j21mJ36k56r0J78M3p9K04j93J28k51K64k1Oo4m0
$$ y = [-14, 174, 144, -287, -124, 23, -12, 276, 73, -342, 42, 167, 165, 300, 56, 239, -152, 73, -41, 85, 109, -181, 251, 137, -53, 102, 129, 6, -158, 67, -123, 141, -144, 22, -70, -72, -211, 230, -102, -36, 318, 270, -77, -225, 171, -130, 40, 205, -118, -72, -28, 34, 240, -364, 98, 17, 32, -27, -123, 97, -238, 34, -9, -257, -30, -38, -20, 180, -176, 29, 300, 116, 83, -43, 85, -190, -52, 25, 106, 209, -8, -101, 22, -75, -145, 174, -89, -18, -199, 181, 188, 85, -57, 145, 72, -106, -62, 143, -44, 88, 129, -80, -13, 50, 16, 65, -98, -138, -119, 59, -77, -26, -112, 115, -28, 5, -241, -158, 228, -125, 91, -44, 18, -165, -134, 75, -40, 69, 8, -114, 88, -33, 31, -149, 101, 10, 122, -374, -15, 54, 96, -4, -254, 21, 157, -72, -6, -311, -172, -150, -10, 138, -137, 131, 130, -86, -83, -192, 34, 6, -109, -109, -257, -80, -173, -61, 162, 84, -104, 182, 61, 57, 193, -63, -153, 25, 68, -11, 193, 0, 128, -123, 141, 120, 126, 62, 22]
7646B2j81J25kJ46l13K23J5lk0rj57J52j36J80j07l0O9k42J97J23J37r7k9m1j32
7671a10j5J81o4K4j0O1P7J14j50Q8J41n88J01J43K5q2L07l41N0J52j77J59l5K3
7695G4l3O1k3j62K82jl31M7J60m2j07K04j87n2J77j05j99K05L3p0r6K13o0M9q8
7720e1M8P7j80L13k19J44k42Q6J17q6R9K7q3J34j63lJ31J16j71j27k12K47R0j67
7744g5L61m73K32j76J25j5J66K8k5l02J32j1r8J58J19k09K72j88QLk21J76N3M4
7768H4j14J29j71J0J46q1K11j93R7j87J35j06k2NR5q3J42j49K11j76N1Q0j24j1
7792b1j04P8j01J17R7k58J07J01l09K09J11k43K42j96O4K63n5j04k64L54j60K9
7814d3j11K27k2j58J71k14K31p8P2q6J0j57K01J0oq1J54l20O7J25o3L02k95K16
$$ y = [22, -159, -34, -36, 110, -203, 20, 35, 32, 12, 3, -154, -2, -138, 42, -65, -95, -26, -268, -71, 52, 189, 92, 63, 22, -110, -125, 56, -8, 16, 6, 67, 144, 258, 108, 196, 337, -251, -150, -7, 18, -64, 243, -98, -48, 104, -73, 86, 51, 74, 41, 102, 79, -83, 199, 198, -133, -86, 74, 32, -75, 129, -58, -110, 67, -38, -237, -32, 1, -69, -165, 48, -12, 37, -51, -3, 74, -106, 207, -12, 132, -110, -24, 93, 7, 106, 133, 50, 184, 21, 18, 149, 265, 94, -33, -245, 2, 92, -75, 286, -187, 45, -131, -6, -21, 145, 173, 148, -154, -22, -33, -131, 27, 146, -63, 209, 21, 29, 32, -189, -13, 40, 84, -30, 99, -72, -62, 84, 3, 214, 21, 118, -69, 66, -40, -62, -57, 38, -45, 97, -52, 159, -17, 34, 114, -10, -21, -125, -47, -148, -31, 66, -192, -85, 16, -293, -84, 27, -216, 26, -170, -106, 157, 102, -2, -266, 88, -72, -43, -154, 73, 51, -107, 64, -150, 81, 3, 75, -11, -1, -158, 43, 53, 47, -34, 120, -200, -133, -8, -71, 231, -64, 152]
7838A52k27L5P6Q2J3r8l4j90K42qr9K17k4k19K43k39P8j03j20J56j48K32K60k75
7862BN9n3Q8j40j35M89o23J55M10l86K47j18J14k1k2j66J17r6J85j3k63K55l6
7885D9Q4o1r5L7J5j00K5J45j4j04L3k1j29J85N2J9k41j4J43j20L9O0l0J23m1K2
7911F1r3k22K66k16N47k64j33J56k52L00m39J03l1M55kj94Q7j3l10J37q3K5N2
7934f3N2o6k96J89Q1K77l22K35O3j70m2PP6j48MJ98L3l72L08j30J5J75j38n2p8
7959a64K16Q6l58K37j15M7J68j83L06n56K49j0m3r2K65J02j5k11J01P3k90Q8M9
7982e0j28K42M7p3K43k94j48L07j20j48J52K20p8m14J47l7n7J37j97J82j04L14
8004A43k44L3o6J74k26m5J56L27m14L38J71l26k24M97j73m60L54J39k79J83kJ
$$ y = [152, -75, -40, 36, 118, 131, 33, -1, -191, 51, 43, -56, 161, 137, -82, 161, -78, 0, -103, -223, -67, -215, 17, 277, 2, 61, 8, 96, -44, -179, 310, -313, -158, 252, -134, 113, -5, 109, 88, 66, -100, 17, -79, 106, 93, -170, 85, 49, 133, 72, -23, 14, 29, -71, -46, 99, 85, -19, 14, -7, -136, 49, 101, 120, -121, -135, 8, -112, -73, -13, -43, 80, 39, 61, -32, -254, 12, -204, 343, 79, -54, 102, -150, 150, -289, -186, -217, 238, 236, 42, 129, 116, -194, -57, -140, -115, -63, -11, -77, -373, -184, -103, 174, -148, 87, 150, -20, -62, -55, 21, -127, -123, 75, 108, -264, 44, -86, -71, 104, -34, -86, -164, 52, 138, -220, 17, -98, -51, 117, -66, 240, -316, -67, -77, -120, -212, 53, 155, 140, -71, 30, 103, -187, -99, -50, -178, 64, 111, 38, 281, -13, -161, 146, 26, -122, 30, 250, 172, -242, -95, -132, -189, -52, -249, -67, -171, 143, -101, -68, -134, 40, -186, -231, -75, 252, -162, 176, 347, 21, -203, 294, 121, -339, 15, 154, -125, 58, 56, 57]
8026E7j58K64k91L15k44R4P9N2j19j47K91k91J95j51J26l27J86R9k38K14k7K03
8048A82j77R9J48k25j1r9M5LJ61j61j43R9k0K07P9K9j80Mj81K44J02k52K38j55
8072C6J03l19K15k7r0K11k17O0n2R0N3J16l19L18k60r5K50K2k5J58j31l54L34
8095G7Qk98J16K4q7N56k91m0k13L56m8l29J85J12k15rJ59n2K9rk9K57k05j18P6
8120A2K9r5m8l4M51l07J49l95m8K02K54k27l0J23p7p2r6O25m76l6N9j09K07O1
8144A22j39k42M64J65m78J8K57j90n3J36L74k87N5k59k5R4k06M42j36j24r7K73
8166A64k73K22j98K05l12K19O8k69K0J28K3j8J31J60l15K23n0K9r3RJ57k24o1
8189e5j53K0
$$ y = [57, -101, 163, -128, 187, -57, 37, 116, 168, 49, -98, 193, -98, 97, -54, 72, -255, -69, 30, -208, 6, -21, 182, 5, 104, 252, 27, 16, -83, -38, -35, 126, -35, -178, -79, -99, 108, 187, 216, 36, 40, -141, 103, 205, -47, 191, 36, 139, -180, 35, 8, -82, 129, -88, -28, -80, 10, 63, 179, -140, 178, -82, -177, 73, 95, 70, 228, 97, -257, 77, 85, -213, -97, -73, -160, 396, 105, 65, -148, 208, 160, -169, 16, 128, -87, -96, 63, 11, 40, 31, 2, 259, 54, -64, 12, 41, -54, -102, -136, 315, 8, 157, -238, -286, -84, 170, -57, -87, 36, -41, -113, -209, 416, -60, -96, -37, -146, 61, 122, -17, -259, 205, 370, -108, -90, 167, -23, -76, 60, 434, 147, 202, -57, -82, 12, -194, 248, 112, -12, -109, 164, -109, 113, -85, 120, -192, 27, 95, -174, -154, -26, -3, -21, 110, 270, -45, 178, 128, 157, 64, 73, 230, 6, -55, -208, -188]
8191a88
$$ Imaginary data points
##PAGE= N=2
##DATA TABLE= (X++(I..I)), XYDATA
0@%%%%%%%%%%%%%%%%%qJ6j6J6j6J6k4L2l2M0m8N3o1P2q3R2j05J20j36J54j72J91
39A01k15K40k68K99l32L66m03M45m91N42n98O59p25P99q82R73j074J189j319J467
59G73j640J843k085K382k755L236l889M834o348R312k6960N6804n4546p1781N3310
74c7510m8591j4255M4109n6088j9188R7034L019J3837J01321j4249n7764N2874
86F4549j703l1395M4255l1602n6005R1738M0228q3247j4601L288m6879Q520j0775
99b3629o1031K5609L0033l7578L6888M1560o1194j0628M6358j3867P183K5419
111E123l6723K3295Q1644j4725l2989K2895j1452p950K2531l7037k3415L8848
123C0045j5227k0420M3665j6501n8508J3610Q643k3905Q246j5675k2282N3962
$$ y = [0, 0, 0, 0, 0, 0, 0, 0, 0, 0, 0, 0, 0, 0, 0, 0, 0, 0, -8, 8, -8, 8, -8, 8, -16, 16, -16, 24, -24, 29, -32, 40, -43, 49, -56, 64, -72, 82, -90, 101, -114, 126, -142, 157, -175, 191, -212, 233, -258, 284, -314, 345, -380, 419, -463, 510, -564, 625, -694, 773, -867, 976, -1109, 1273, -1482, 1754, -2135, 2699, -3649, 5663, -21297, 35507, -19039, -90820, -37510, -86101, -100356, -56247, -112335, -131523, -34489, -31470, -17633, 83688, 69439, 11675, 64549, 62846, 31451, 75706, 44104, -11901, 79837, 120065, 36818, 22217, 25505, -21374, -12854, -23629, -84660, -59051, -29018, -66596, -29708, 11852, -49342, -59970, -13612, -27479, -20296, 5123, -31600, -8305, 73339, 58614, 25625, 48520, 37068, 29118, 51649, 14612, -8803, 30045, 14818, -5602, 38063, 21562, -36946, -23336, -14693, -38598, -30352, -46027, -68309, -14347]
135a4347K9221l6174O626J5610j7118J8453J1749k9312J9744L0677j5928J9359
147C8560K8676l9686k1439K0878j1883j0664J026k8548O395M1007j9832l2180
159b7690J1927j0394j4347J8611q448j2761K9472Q623m522L0883O71l1339J2092
172B778J8400q144O678k916j2300K8025J5617l3014r556O202j8467k046O225j8759
186b1277r52J3830q876M868J4178k2006j3303K0927M634k579P218n170Q481K8764
200B8737m053j8415Q577N67q030Q343k739j1053P094J394o443Q866o701k4990
214a8846J126J1156o507k454j281l774J6354J1783j4444l658Q668l900K916R598
228F737m372L73R904J97L452O505j5176j1617J0643K275p671j683n056J178J1681
$$ y = [-14347, 14874, -21300, -14674, 936, -16182, 2271, 14020, -15292, 4452, 35129, 19201, 38560, 67236, 27550, 6111, 26989, 15106, 4442, 5468, -23080, -16685, 24322, 4490, -27690, -15763, -26157, -40504, -21893, -30341, -43102, -13630, -5007, -9529, 21354, 22025, -9314, 2778, 21178, 13034, 19712, 16796, 4496, 32521, 48138, 15124, 5568, 11770, -6697, -8743, -2518, -21277, -22229, -8399, -17275, -12407, 1771, -20235, -33538, -12611, -7977, -10556, -3338, -8508, -27, 28737, 24684, 6269, 14846, 15413, 7383, 15726, 12987, 1934, 9028, 10422, 3979, 12845, 6144, -18846, -17720, -6564, -13071, -15525, -16806, -20580, -4226, 7557, -6887, -10545, -1877, -5777, -2861, 6737, 2365, 2738, 12642, 12839, 16291, 22796, 7620, -3997, 6646, 8921, 1250, -433, -5489, -4311, 7370]
243G370m859j4020J066J34m809N576K691m893M716O148J957P147j724j1794L184
258b110J1071r32k830n8l58P513M624r588o739J077m319j666L087l537l819L069
274e515J677J826J354q368n672P735N762k248k50J294M688Q011o43n844j81Q42
290D468j507K358J377l876o39K269Q73l4m707q629l36N425l92l759o49J740M753
307a265K993l469k802O13P53J948L674M98j309K011L963J926j842n548l650L129
323A623K722k327l036k50J746J826k001l903k463o69O11J740J408n81l68K764
339a158L881Q50l401k808J272M363J788j533j406K130K484k69k173l259k378n23
355b140J268M96o24j535n77K404J652k983l763o42K471K913O76j315J070L439
$$ y = [7370, 2511, -11509, -10443, -10309, -15118, -9542, -6851, -11744, -7028, -880, 1077, 8224, 6500, -5294, -2110, 8961, 8029, 5199, 5141, 4783, 12296, 16920, 7332, 593, 1670, -2649, -4315, -1228, -4765, -8584, -5515, -3838, -2012, -658, -9026, -14698, -6963, -1201, -3449, -3699, -2405, 2283, 10294, 9651, 3807, 3626, 4468, 2961, 5319, 6696, 2820, 2181, 4450, 5323, 5289, 582, -8047, -8383, -2958, -3350, -7109, -7758, -6018, -1265, 1728, -1741, -4543, -3930, -3177, -1229, 2445, 2943, 1634, 3645, 7608, 9534, 7692, 2144, -1506, 1623, 4345, 2018, -1018, -1268, 478, 2304, 303, -3600, -6063, -6732, -6121, -4381, -2973, -3554, -3922, -1158, 2723, 3573, 172, -2636, -1364, 2999, 4787, 3254, 1848, 3978, 6462, 6193, 4020, 761, -1617, -2140, -872, -376, -1000, -2535, -3112, -708, 944, -2039, -5802, -6444, -3973, -1060, -384, -1699, -629, 2810]
371B810J349o17r07k023n36J611J484J15n93j523L68K519j480m941j888M96J592
388b164J327j196j795K058J951r54l03r74j815J403K935J208K16J59q62K247J763
405E204l259k735L26J025J228O35j981j269K164k08j817n41k204j625K781J559
421g17j68K46q30K12K748J8l339m54K056R96J912j36j829J236J494j259p60p81
439F45k130m1K747o71q89K8j296R16J775k710k650J488J047Q72J647q88p91K346
457A445K07j173P65j383j190K745J867j300q7n96o87J156k68l497l96J210K15
474i67N99O50k071L34J593j021n41K67j208M57L286J47p32N13q75P96J410j757
492H80j917Q87J170J62P70j088j765J311R6j677K84o77j623K507J478j167j51
$$ y = [2810, 4159, 3542, 2635, 612, 76, 1687, 3171, 3286, 2693, 1170, 1538, 4057, 2577, -2364, -4252, -3756, -2164, -837, -2033, -3828, -1770, 181, -773, -1076, -2050, -3865, -2462, 473, 1681, 1897, 2056, 1194, 3441, 5204, 1945, -790, -464, 561, 1789, 2424, 443, -826, 1338, 1130, -687, -1228, -3432, -5057, -2276, -717, -885, -639, -1469, -1257, 1491, 1509, -1830, -2284, -228, 768, 2680, 2544, 715, 1951, 3445, 2186, 1426, 645, -1485, -1526, 1221, 550, -339, -311, -1607, -691, 1084, -1626, -4276, -2788, -1741, -869, 778, -110, -901, 1445, 1652, 479, 1244, -139, -1329, 1416, 3283, 1983, 1896, 1300, 613, 1769, 1501, -1996, -2392, -1182, -967, -368, 282, -1789, -1455, 138, -883, -1424, -1157, -2365, -1908, 1378, 1525, 793, 1306, 431, 1227, 2637, 880, -1037, -150, 1020, 1182, 1952, 864, -901, 410, 506, -1171, -887, -1564, -3187, -680, 798, -369, -520]
509e20K2r18J891M74k430J63K032K0R23O54j945j10J587j019n46K19j634M79J879
528A221j20j562J36n73l12J435r83k011J237J263j45J429p36j556J419P24r76
545a10M39j23q17J322J684j108p71J94p71O95L43j804q06J508L4P0M11j364n67
564a541J502m81o52O09n80J13J993J02j056L08l51L14R51k91j455O83P31k30M61
583A130l79j801R59M10q85M2k7j021P80J429p88o58L02l87N80P29j080j21J320
602E34K76l54Q95j241l76J349l69o11J35n17j55J089J53j421K62l01j31O42k23
621c64r50O11O96k07L24J82r38N44O96k79m06K44m11N89R87n92o37M72n33k3O56
642F61j035o08O80N03l88N14o85n54O90K96q21M53k90RJ115L77q49P5L99m25L26
$$ y = [-520, -498, -1416, 475, 949, -1481, -1318, 714, 734, 1657, 2311, 366, 256, 1843, 824, 278, 497, -1137, -658, 1221, 1101, -461, -325, -898, -1210, 225, -758, -2769, -1532, -269, -414, 1015, 279, -1277, 142, 866, -110, 329, 206, -611, 711, 2395, 1287, 516, 710, -61, 634, 977, -827, -1633, -125, -91, -21, 390, -974, -1541, -39, -520, -1172, -563, -1143, -1030, 963, 1065, 9, 317, -34, 280, 1231, 940, -515, 168, 899, 669, 1130, 751, -1050, -91, 319, -566, -524, -551, -1572, -792, 637, -151, -809, -507, -894, -314, 415, -665, -786, 534, 810, 456, 1351, 110, -266, 1083, 714, 103, 238, -279, -434, 655, 808, -613, -351, -652, -783, -141, -364, -1314, -703, -7, -214, 110, 292, -646, -102, 594, 315, -91, 153, -258, 331, 1318, 726, 89, 561, 28, 5, 661, -374, -982, -302, 201, -187, 327, -358, -912, -222, 74, -747, -294, -584, -575, 540, 917, 68, 143, 542, 117, 443]
663D43Q1q43L72M96j18J25k31q54K68N76k95m66j45J58Q1N73j59o21J74K24j9
684a80M31l09j62J03N84J06J02m22k59K36K78l68K3l76P1M57O8m78j89j4k15L94
706a19k26l96O9O36J44qM8o81L33O34q2j98J20n9Q4M59l89m91K84k10J33O5Q3
729B33o92J64K13K81j23n98k2L82j14K64j53j01R0L88M43o20q8jJ54K6P2j89j69
752a60L35OM2j25k51p6K61k18K02l89L5L71K6j54l03P7K9P6K73r1q5K90k4J70
776C17N3n02J86J97J32k92Q9k92K6L9j44J34k42N4J90K05l08L4k32L98j28L1j57
799b12k6j90M86O9k53L07j76J92j50L62k17m70L02J81j59k04j34N2J92L36k20
820F8k92j20K34j09L33j59k6n4L06l15J62n2j96M23R9j30j41m4J95J68k09J57
$$ y = [443, 524, -319, 53, 549, 431, 556, 325, -529, -261, 315, 20, -446, -591, -433, -352, 221, 62, -559, -385, -161, -180, 251, -58, -220, -117, 467, 573, 675, 253, -6, 230, 508, 140, 163, -213, -142, 315, 383, -95, -284, -298, -513, -119, -345, -741, -672, -36, 108, 100, 148, -533, -200, 434, 352, 154, 274, 215, 299, 758, 369, -122, 162, -48, 85, 150, 233, -459, -295, -82, 199, 76, -522, -544, -162, -276, -12, -165, -266, -176, 212, 655, 35, -53, -54, 100, 126, 198, 9, -160, 175, 181, 223, 98, -153, -229, 32, -186, 16, -373, -338, 33, 59, -95, -398, -321, -292, -216, 57, -34, -119, 171, 147, 317, 370, -132, 54, 251, 383, 91, 180, -112, -86, -47, -191, -57, -299, -245, -55, 150, -158, -124, -356, 42, -86, -55, -212, -238, -428, 58, 127, -126, 181, 5, 197, 47, 409, 192, -278, 24, 205, 46, -158, -292, -240, -48, 288, 68, -224, -344, -110, -219, 114, -45, -71, -125, 181, -134, 28, -24, -220, 203, 302, 172, 31, -13, 182, 350, 141, 298]
842B98k23j08L3j22K49l40J06KJ79k5o0j05j21N13l43k9L55q7r0J0Q7j93K27j36
866G7j84J08o7K13j01j48L78J24o52R4q1j1L31q1k02J58O0J2rk50K95o2J32N2
890A86k71r0L61j8j50jj77L63k13J07ro3R0l10O6M43o55J35K43j2NL7j20k4J47
915G0j1j80l9M36k96M91n65k2L16j93q7j99L43M4k64L28k6j07K58l01O3R0m53
938c04J65K00r4r5L12mj94j15O0J41J13l1%l43L40J4q2j0k38L41m48J55o2K1K70
963A12j74J92m6j11J61j39No3j14M1O5K33k5l51J9J11L49j62l28L55l20J56L22
986B88n49R3j50K31J41J6J59k72mo1J48N7j99r3K91k17K3qJ42j7l8K48q0k57J54
1011D6j62NM2j18R2P8k1J1J02k75K32q3P4j15K05k70K74N3j58k01K23k45J55L7
$$ y = [298, 75, -33, 0, -122, 127, -213, -107, -105, 74, 49, -11, -116, -237, 276, -67, -96, 259, 172, 82, 92, 179, -14, 213, 77, -107, 1, -66, 147, 46, -102, 276, 400, -252, -158, -239, -250, 81, 0, -202, -44, 16, 28, 19, -231, 64, 2, 134, 186, -85, -175, 186, 168, 18, 17, -160, 203, -10, 97, 88, 25, 115, -195, -129, 314, -341, -206, 37, 25, 30, 67, -53, -77, 70, 59, -121, -160, 276, -20, 471, -94, -116, 200, 7, -80, -279, 64, 108, -156, 172, 146, 39, 297, -4, 59, 149, -304, -139, 61, -33, -128, 184, 180, -14, -129, -69, 72, 185, 154, 154, -189, 151, 165, 83, 73, -165, 176, -272, -117, -179, -158, 112, -62, 130, 84, -27, 134, -5, 0, -63, -177, -136, -71, 162, 137, -214, -195, -84, 265, 103, -225, 130, -190, -34, 288, -261, -168, -318, -87, 54, 70, 229, -43, -47, -108, 40, 97, -102, -195, 96, -121, -98, -106, 36, 19, -19, 229, 149, -108, 46, -116, -111, -69, -187, -95, -17, -38, -27, 75, -200, 32, -51, 23, -92, 113, -157, 117, 170, 12, -189, 34, -211, -56, -19]
1035a9J99l3q8M7P8r9j71N7j35J24j6R6r1J41j96R6J01k74K28k6j29K67k21j12
1059a76J15mqN6O4k48L93j26J10l22m4J1K46M8j31j5J29P1q6k60j61M26n3l7p4
1084g6K20k23P2J27J17j7m49L1J47J27j03j89J66J93N6j56k56J5J21Q0j64R6l
1107f8j11L18j68j7o1J4K22l2j02R4k36R4J17m5J16j32j34K56p1M2n6J43l5j00
1131D8j65K28j13j21Q0J06n0J08j23l28L59n4J27k49L35l45J98Q8k87K15j9J14
1153A52l67J50K54k7J26l76O6j26L10j50j92K17q3L86m75O9l0L9J11k51L0K39
1175G2J00l39p4K15J77O6k78ro9J77j75J27kj09L5NK62m01L0J68L1r4o3O1l5K23
1201A01j57kJ29r5J57n9j08j39O9J48j61J80k6r0J98j22J52l42Q2J60j21L02k75
$$ y = [-19, 180, 147, 59, 106, 184, 85, -86, -29, -164, -40, -56, 40, -51, 90, -106, -10, 91, -183, 45, 19, -110, 157, -64, -176, -61, -65, -73, -17, 47, -201, 192, 66, 176, -146, -190, -179, 67, 115, -16, -31, 98, 169, 83, -177, -338, 88, 35, -2, -76, 144, -79, -7, 120, 237, 220, -229, -198, -51, 76, -27, -216, -50, 143, 199, 43, -213, -198, -77, 3, -161, -65, -68, -179, 139, -29, -46, -107, -93, 129, 97, -5, 89, -147, -53, 64, 19, 135, 3, -131, 125, 54, 96, 40, 183, 148, 48, -117, 111, -2, -123, -43, 63, 13, 121, -2, -330, 29, -25, 102, -147, 188, -157, 41, 129, -158, 57, 38, 152, -215, -65, 189, 162, 288, -88, -22, -148, 162, 12, -180, 37, -46, 340, -135, -66, -96, -57, 54, -197, -167, 72, 172, -167, -241, -26, 151, 217, -61, -70, -139, 38, -137, -10, -12, -121, -86, -81, 181, -220, -190, -22, 9, -85, -148, -87, -122, 101, -56, -58, 71, -24, 133, 74, -34, -173, -104, 44, -117, 63, 37, -53, 145, 23, 175, -167, -85, 75, -46, 256, -19]
1224a9j22K46j76Q9q1O0r8o9K96K04m66Q0j26J20J87l41O8P8j14M02j54r8Rr3
1248a18M6J9M9l32J97K30j02j02J79j52K91j30o5j7j13K65j00j23r3J62j54J53
1270a0k22K34Km6J35o7M9m7p6o1J08L1o8K15k76J51P5n3k63K07J5j05J59j81P9
1295a5L7R0j4p9j7J45m78L12K83m18K8R5M8M7q5Nn3l0J08J24K27m72l9J14Q4k10
1321a63L82m30J44L3L74k18l56M51k31n5J11P2k17j23K44q3l9J18N3j2j60K64
1343A59Ok41j14K97k29J98j65l8K60K6j97j36J13L34k14J7k18J5K36K9l44J30
1365g6p3K60r0M5K97m06j16J43J79k01J2P2k1N9J06k98n0J33P5k27L88j33r1k89
1389c02K24K15j28j06J92M4M7m11K81L01m65L75m74L77j40k4K74m18l9J41j99
$$ y = [-19, -141, 105, -71, 18, -63, -3, -101, -170, 126, 330, -136, -56, -182, -62, 125, -216, -148, -70, -184, 218, 64, -34, -25, -118, -72, -53, -4, -336, -139, 91, -11, -113, 66, -86, 205, 75, 10, -7, -120, 145, 45, -78, -171, -9, -163, -10, -232, 2, 4, -42, 93, 26, 75, 28, -48, -109, -1, 30, -38, 177, -99, 52, 127, 74, -189, 18, 33, -72, 87, -94, -15, 22, 112, 98, 19, 2, 147, -331, -19, 264, -154, -126, -31, 17, 64, -21, -16, -69, -99, 9, 133, 360, -112, -151, -37, 47, -163, 219, -211, -67, -34, 340, 122, -234, 217, -14, -69, 42, 114, -103, -226, 18, -65, -104, 14, 67, 55, -105, 159, 165, -76, -190, 107, -122, 76, -89, -127, 133, 159, -38, -174, -61, 273, 59, 76, -142, -127, 109, 138, -206, -76, -149, 111, 21, 66, 363, -43, -159, -16, 163, -38, -26, 46, 25, 84, 190, -108, -158, -25, 50, -177, 211, 78, -13, -302, -78, 137, 9, -97, 95, 139, 186, -225, 56, 357, -108, 267, -207, 170, 30, 6, 280, -138, -177, -36, -235]
1410b35L05lk82K54j52J27l07J01K76n9l21J90K73n0k37J31J39J13j88j74K24
1431A25k01Q0j05n0N1L20O8j10k8j78K49j68j87P0K57l53l2J33J17k48lK84k01
1454a10L65l77N9L2L39l14j82R7M94j95n3j09k07m3J65J66j61K3k08L4J54m2J63
1477I0j3M6J50j69j73J05k07k6J23J21P8P1k13O9J29k65M7J2p2J84Lq7n6M7K3
1502A7J20j90J52j96J06K4m3J26M6j48j0j37J50j43R5J68J36r9r7m8J40n13M06
1525F2j05Q4p7n0L39j17k97j54J73K20r2r2j90K22L05k25p7J07R2Q7l12p2L62
1548A93l67J44J21l8k02L52l5j98J83j12m8J52j69P6j00J6k21L01K51m20N7P5
1570A1n2L7J46p8J5j56j3J52pk97J19J56q5J5oJ82m9j33k17L87P3j08k6j28K40
$$ y = [-235, 70, 67, -215, 39, -113, 14, -293, -192, 84, 25, -296, -106, 167, 117, -120, 11, 150, 263, 75, -99, 125, -76, 4, -101, -151, -100, 220, 288, 178, 150, -28, 221, 53, -134, -64, 193, -160, -192, -59, 58, -190, -193, 91, -110, 255, -122, -63, -31, 308, -6, -188, -91, 403, 208, 155, 46, -161, -204, -39, 127, -34, -11, -219, -185, -31, -73, 90, 77, 123, 273, 104, -69, 36, -171, -197, -74, 47, 125, 196, -17, 52, 181, -84, -37, -25, -97, 87, 90, 3, -53, -6, 17, 137, -53, 99, -97, 9, 33, -10, 116, 162, 14, 4, -133, 17, -126, -31, 137, 273, 174, 77, 29, 169, -344, 62, -43, 41, -36, -86, 253, 136, -161, -315, -142, 78, -14, -106, -296, -74, 231, 6, -71, 36, 128, 215, -97, -169, 193, -174, -30, 91, 53, -149, 203, 168, -30, 153, 41, -7, 145, -24, 52, -48, -32, -253, 48, 299, -121, -64, 11, -41, -4, 142, 64, 79, -77, -90, 62, 55, -242, -123, 33, -52, -37, -43, 139, 90, -43, -260, 127, 200, 92, 66, -62, 178]
1595A78j07k9Q8j12pj48J74J78l26J87k63K67K7j30j73O6K45k69K66pj44J7M7
1618B5k2J26j69K89l34oK09k40J51K29k93k6K44l99J09N7L2kJ38K4k68K64R2j22
1642A08j59Q4p4L9K6n9j11q1j40K92K01j66l8K4r9L89j79o6P4K11k92k03K91j54
1666h2q1M12nj49l04J66N2J11k84K45j38Q7k51O9K64j07r6j9K31Op1j92K0J11
1690eL1P2M9r2J74n12N54l63J33R9m22K92j1Kj32J79j81J13J17l01J02J56j89
1713a35k0P3j7L0M8q9M4J06R5k25n2J04K69k22m7k5J24j58j2K77k87Nj01Q1O2
1738g2J46j59j77J63L19k38jL84n20M79l62O9j15K22O2j90j83L29k17J57j38p0
1760a12P5J60j78lj67K1n5J04n4m0K25M3R8J79l69o0K43q1MM1r0J18j5o5q8L22
$$ y = [178, 71, 42, 130, 18, 11, -137, 37, 215, -111, 76, -187, 80, 107, -23, -196, -130, 115, -154, 112, 105, -39, -22, 25, 3, 129, -40, 249, -85, -91, 118, -122, 29, 258, -35, -61, 183, -216, -107, -50, -18, -20, 118, 142, -126, 138, 230, 108, -51, 33, -41, -2, 24, -35, -146, -227, -367, -75, 126, -40, -78, -54, -153, 236, 57, -9, 65, 276, -16, -219, 72, -82, -163, 249, 244, 95, -209, -43, 9, 120, -164, 81, -57, 30, -221, -152, 112, 5, -91, -110, 121, 127, 56, -136, -116, -5, 26, 98, 147, 55, 229, -283, 271, -92, 41, 140, -282, 10, -1, 1, -131, 48, -133, -20, 97, -204, -102, 54, -135, -155, -82, -99, -69, -21, -110, -66, 40, 135, -90, -142, -38, 231, 9, -38, -63, 61, -97, -109, 168, -119, -114, -215, -134, -72, 74, -85, -262, -99, 220, -18, -19, 365, -155, 324, -38, 31, -84, 138, 200, 10, -173, 156, -61, 96, -42, -112, -37, 123, -55, -58, -225, -204, -259, -155, -209, -249, -24, 19, 117, 296, -73, -133, 110, 29, 33, 74, -16, 102, 87, 22, -66, 256]
1786B56j81k50J00p8O1o7J59P9R1j7k05j45K31l9n1O7L23k10k34Q9R9j40l09L78
1810GJ34jj51j05K35k29M2N0m2J11k03j86J93L40r3o5J7NJ2j06q3L5K63j06m4
1835C0k7j98K78j02j9M4j45j04K61j28K83j85l8J22J14J27l31K66k29k37L91j98
1857b5R7J20j49j09n4lJ92n33N52k38J99m8J24p9N5l43K66m46K04L46j50N0n4
1880b6j73L01J8j19J54j17j14J28k43L51p1j07J42k26J21j55J60j9j68L89j11
1901A15k32J74k54J88j41J19Op1J97L3j11j2J32j78k52K15J15l8m6m5R4J61qj41
1925B0k36M42l44QO0K49q9k79K73l2n5O3O6l24J28j2J89k27K29k16K01m6Q4j35
1949A7j42q0J42O4j98J62kk41M67k74j47L81k19J29l4J5J36L7j64J44j71J01q1
$$ y = [256, 75, -175, -75, -153, -92, -159, 0, 79, 170, 153, -52, -197, 34, -5, -56, 11, 334, 124, -110, -21, 78, -62, -371, 7, 141, 140, -11, -116, 119, -110, -68, -18, -60, 51, -152, -338, -145, 195, 102, 37, 54, 59, 71, -35, -118, -83, 180, 74, 30, 3, -195, 83, -19, -38, 6, -139, -243, 18, -110, 173, -12, -50, 72, 186, 313, -18, 248, 19, -218, 173, -25, 72, 192, 43, -66, -120, -123, 69, -464, 88, -150, 49, 1, 125, 46, 101, -242, 24, -422, -218, 128, -22, 28, -26, -199, 102, 120, 1, 155, 38, -76, 52, -191, 160, 89, -18, 124, -102, 19, -136, 24, 5, -163, 226, 115, -117, 57, -197, -9, -150, -31, -25, -96, 101, 134, 23, 11, 143, -35, -287, -72, 43, 5, -41, -86, 8, 169, 161, 20, -216, 226, -118, -110, -50, 199, 110, -169, 104, 72, 17, 80, 146, -178, -50, -62, 127, -100, 129, -87, 114, 68, 152, 17, -125, -205, -63, 1, -197, -35, -37, -278, 189, -85, -232, 149, -70, 59, 25, 40, 176, 213, 49, 193, 22, 123, 42]
1972D2r6J02o1j60J85J29j03j60q0K14J2k26k9O9j2j01O8K27j83K58J0p5q5QK68
1997B21l29R6J6R5k85J19M5k69K34J01j79J40j83K63R9k2j96J46k34o8J52J50
2019A12l57L37j47J65k15J77m8j97J46l4J8J92j1l24L30p7q7J85j31Q2K7l35J31
2042f1k69L61l4K77k14j28J95JJ4k24j47M29j23l34K78l5p2k50L21k41M37N8m22
2065a83L53n9j57N7j4J9K62K7l52LK06j60J1%n9R5m0k69J72N0j49L46J8k04K77
2090B50l62P8O0K59l54J30M3m7p7j30J04L11k17k28J87Q3p4j06K24j28k7p9K98
2113A98q3q0m70L42K58k05R8k76K84Q6J1k19Q2k6N9j68j1J21O1M6N0r0k1j08J26
2138F5J9P1j31j32q7N4n1j18J70J5K10O8l28K04q5n6K38J29m8m49K86l20L27J68
$$ y = [42, -54, 48, -13, -173, 12, 141, 38, -122, -202, 12, 24, -202, -231, -162, -174, -275, -207, 20, -163, 95, 105, 30, -55, -47, 221, -108, -12, 4, 99, -186, -67, -22, -291, -57, 44, -135, 5, -178, 85, 184, 162, -34, 112, -122, -190, -38, 112, -245, 92, -55, 110, -105, 72, 24, -173, -27, -61, -43, 149, 138, -186, 144, 67, -20, 165, 34, 116, 143, -192, -61, -330, 31, -3, 274, 60, -68, 127, 128, 142, -82, -229, 200, 77, -257, 21, -14, -86, -336, -15, -256, 181, 239, -183, 170, 111, -46, 11, -3, 16, 278, 305, -47, -44, 162, 2, 13, 13, -46, 49, 9, -260, -88, -38, -187, 159, 177, -27, 250, -112, -34, 26, 285, -69, 61, 104, 57, -20, -150, -46, 265, 48, -180, 7, 90, 16, -90, 134, 6, -21, -100, 198, 115, 35, -435, -93, 165, -40, 58, -218, 66, 152, 163, -56, 26, 0, 59, -109, -120, 1, 62, 108, 158, 68, 47, -61, 65, 84, 155, 24, -108, -195, -141, -192, -310, -140, -125, 85, 153, -175, 29, -56, -112, 126, 255, 207, -242, 44, -276, 51, 219]
2162B19k46L1j67K14j48j24L04r4l0n3K66m56L58q7j40L08j03R5l14L86k05k29
2184b15L14J00j82L3Mj42r4JJ74kJ52r8k87L21j13J97k24l8L03k45R5o2N5J67
2208B14k01L51m11K05j20j2m7J23m7kj67P2J05j59n0K02j08J0l3N0j03j6K74j58
2232b8J96o5j79K09j17n7J9p9J88k40Q1R1J10j20k1L29l48NJ94o1j89K12k01J67
2256I6m4J67m04K01K61l53J01J42j34N0J4L4L4o8j60j58L35l9L3m4k31K98k36
2279a05J56o7k20J79j10mQ9O7J19k4j16L4J29n4j62L57j80k0J2M5j90j4N4l40
2303c65O03l11Q0P4j94Q2J39n6j35J64Mj47J29k0O9k00J85m7j32L9J04J7J36l05
2327h7M3P3J25k39j6K36m66L73R1j34Pj44M2j09N5Q4P5J59j57JK23j30j86m6k7
$$ y = [219, -27, 4, -163, 51, -97, -221, 83, -11, -41, -94, 172, -284, 74, -13, -153, 155, 52, 147, -167, 219, 14, -215, 99, 199, 17, 50, 54, -88, -182, -181, -7, -9, 143, 45, -242, 79, -34, 163, -61, -99, 204, -41, 54, -8, 47, 214, 13, 364, -47, 158, 38, 26, -21, 102, 55, 53, -114, -42, 63, -96, -146, 56, -52, -42, -75, -25, -128, -144, 130, -28, 168, 103, -76, 133, 16, -41, -22, -101, 87, -153, -72, 19, 129, 9, -12, 317, -31, -26, 168, 107, -82, 130, -71, 96, 52, 219, -185, 16, 277, -76, 25, 167, 33, 83, 97, 131, 165, 97, -63, -221, 114, 75, 108, 64, -167, 131, -105, 51, -16, -236, -57, -167, -171, -82, -15, 104, 80, -36, -2, 127, 73, -89, 268, 88, 68, 80, 125, -65, -79, -25, -365, 238, -73, 7, 81, -113, -31, 108, 52, -83, 81, 85, -62, 67, 47, 116, -84, 101, 54, -78, -39, 65, 82, 218, -87, -44, 29, 154, -85, -101, 135, -331, 42, 133, -1, 6, -138, -96, -205, -150, -66, 9, 168, 11, 12, 235, 105, -81, -127, -154]
2352a54N4K29J07l10J82mk19J54p8k36K69j33J62q3J63J04p6r1M1l30L58l8r5
2375b4M1j60K25l4M1L7j35M9O5o3n3L6j12J33J00o0j13K82L8l66K30j51j80L17
2399A43j07j09J11j19J40J37m22j9K74k22K08K49pl55N6r2J80k94K49p1j31K24
2421B3Nk7j02j6N6K26k49J8m1J85J39l43n2K97l51J55J54o2m7j50L20j99J69j75
2445f7J54j73L7N2Q2m4k9P3j65j01P6J57m1j02J6m5P9j16K07j93J98j23K56j13
2469G5j46J59J3j6j80ML11j88k2K27k93O6q6N1k44J97J59j3k71j56K35J21j28
2492a25N7r7P9j86K06J91l88K72j4J76j35j1j93L08l93M46Lj38m82N12p3n5MJ49
2516A13j1k27j70K13J63L8k20K02n6N2l97L2J35q0K28jM2K6K8j26k11K79k72K65
$$ y = [-154, -100, 129, 236, -74, 108, 104, -115, 39, -39, -275, -6, -139, 23, -60, 103, 207, 131, 40, 81, -249, 109, 71, -24, 17, -143, 82, 48, 89, 126, -9, 40, 105, 42, -11, 25, -87, 46, 146, 86, -27, 255, 293, -73, 157, 6, -174, 143, 36, -73, 38, -81, 59, 196, -226, -245, 29, -193, 15, 264, 257, -98, -42, -134, 46, -248, 1, -70, -201, 23, 28, 1, -101, -117, -61, 165, -84, -66, -107, 78, 217, -126, -178, 119, -232, -77, 77, 15, -32, -182, 138, -61, 108, -67, 87, -86, -49, 3, 85, 41, 12, 85, -80, -181, -105, 52, 11, -91, -75, -120, -41, -157, 50, -143, 55, -68, 188, 75, -71, 88, 101, 85, -95, -91, 220, 32, 10, 237, -56, 10, -76, -25, -269, -72, 87, 74, -197, -353, -118, 3, -125, -68, -165, -86, -272, -66, 125, -263, 9, -5, 171, 36, 25, -168, 140, -253, 193, 196, 58, -424, 88, 15, -40, -36, 113, 102, -125, -295, -82, 81, 119, -101, 101, 45, 97, -300, -268, -133, -213, 15, 14, 56, 82, 110, -16, -227, 52, -220, 45]
2540D5J55k09k9K58k47Q7Q1k64J63k09K8L00r2L7j17j66K51nk03J76j01j07O7
2563a01J43Qp3j78o0K10j32L05r5L65m51J6p4l5J52j25JK27p3j63J70j80o6K87
2587G8q4k88K93L4j5J18k06J17J94l35J75k90P8K72j00p6j36J31J0J41l23J30
2609h2o9J28Q2kK3j56J85j89N0J1J60k01Q6J63k52j3P1k9n4r1L12j19O9J05j70
2634A8j78k7L49Lk86J28Kj25P7J9j48J09o6K18k97K57Q1r6J30l12K04Q1ok26K33
2659A42l29K77o4J2p9K20m32J97R8p8J20l8M3J9o5j52j37K50N1K0j93p7J87j51
2683a59J46j53K53l3M0J09k11P3P7j11j99K51M1k13L0p0K19R5k07O0nj18J15k01
2707a71J03P3Q9m9N2k34J62M03m59p7K69p4o7n5R6j07p1J14N0k8q5p4J78M2l0
$$ y = [45, 200, -9, -38, 220, -27, 60, 141, -123, 40, -169, -141, 159, 67, 104, -13, -179, 72, 67, -136, 40, -61, -168, -101, 42, 50, -23, -201, -261, -51, -183, 122, 27, 392, -59, -43, -117, -152, 0, -125, -124, 103, 30, -133, 37, -143, -209, 78, -6, -294, -1, 33, 18, 136, -70, 47, 241, -94, 81, -209, -131, 141, 41, -35, -171, -40, -30, 111, -212, -82, -151, -23, 59, 57, 80, -76, 109, -80, -30, -19, 141, -60, 26, 189, -63, -76, -5, -34, -88, -179, 133, 14, 83, 188, 18, -160, -187, 162, 165, -121, 7, 9, -116, -39, -20, -168, -59, -125, 93, -204, 53, 134, 38, 168, -144, 60, 141, 135, -91, 142, -187, 90, 26, 38, -41, 179, -253, -56, 42, -36, 84, 46, 89, 108, 43, -109, -246, 4, 55, 75, -118, -195, -8, -159, -13, -166, 87, 54, 94, 203, -8, 65, 142, 31, -168, 83, 124, -89, -59, -129, 90, 185, -22, 38, 33, -85, 30, -171, -68, 5, 94, 45, 97, -137, 25, 428, -31, -108, 161, 87, 20, -35, 61, -46, -117, -3, 47, 19, -66, -140, 38, 80, 50]
2732E0j74J96k4Q6k53J87M5j16Q0j74J24j32k7K54k01K7J50%o5J62l51O0l0K70
2756A44j92K67k78k75K80J73j06J09j22J0m15M88j26J69k9p9L52l93J5K21p6k03
2778f6J58k67K43l68K07L53l81J01j64m4J4J13j3M0n6o2J71j19K87j99NR0j88
2801a45jK49m69J69K06J07J6j09J5k7Q0o9Q7k72M81l51k45N23m40K08k21J38k35
2824c05J39J3K98l1p9M8r1Rj28J03j09M7J01J43j11K5k02J10m8J25J0M3j10k21
2848b21j25J61J31J93j99O7K9Q1ol71M08l60K04k32K35j33P9l6j27M69j58J4q5
2871A8J47k58J98j05j36J8K83m55L39L8j44j4p8R6Q8j09J47mm9k15K29q7O2J9
2895B8j30p1J27J7J6k8K18k5n0j73K09q1k90M99l71K38qrl87K27j79K76j73N88
$$ y = [50, -124, 72, 48, 134, -119, 68, 113, -3, 77, -97, 27, -105, -132, 122, -79, -52, 98, 98, 33, 195, -156, -96, -126, 144, -48, 219, -59, -334, -54, 119, 13, 122, 0, 10, -405, 83, -43, 126, 97, 18, 370, -23, -8, 213, 137, -66, 92, -175, 68, -300, -93, 260, -121, -20, -184, -228, -214, -101, -114, -74, -130, -192, -21, -140, 147, -52, -47, 43, -145, -146, 103, -366, -197, 9, 116, 132, 23, 38, 11, 91, 22, 109, -163, 318, -33, -278, 245, -195, 13, -208, -70, -305, -166, -153, 145, 114, 35, 83, -8, 1, -127, -24, -133, -86, 15, 158, 47, 72, -130, -20, -68, 57, 67, 110, 0, -221, -346, -185, -54, 139, -60, 7, 36, 117, 111, -260, 148, -212, -8, -240, -5, -138, -59, -95, -222, 247, 89, 103, 18, 165, -93, 105, 0, -136, -118, 165, -290, 49, 87, -57, -71, -149, -53, 35, -74, 73, 69, 20, -195, 34, -53, 9, 28, -102, -173, -46, -29, -13, -41, 177, 152, 102, -71, 138, 57, -233, 266, -105, 133, 125, 116, -271, -44, -223, 53, -120, 468]
2919D68o21K84k04L4l5J57j51O7j9J52j78P6k74K86k81L19L2o7k54J82K06k27
2941d8K61n62L93j97L30l03J71j98j26M31j50j29j2L07j29k23J5R6K85k81j1j4
2963i4N7J42N9k96QQ6P1q9J84m46N63l04K6K68l06j3J3K94j88J50k12K04mk78
2987a05m9K13J85j70O5m49J66J27p8j2M86o52K62K08j57j6J28k13P6N8n0P8k05
3010a04L13k91K22j02j3o0J66l55J85L9L12k97K68l53Q8j93N8J67L0r7r6K11j49
3033e1K48k67J21j47N9L9Q4j34k21L17k40L96n01J95K9K3J36m31J81L48k47R2
3055B9P9l41M58l94K47p5j34L02k10n6k0M0R5J12j86kK6k68L28j22J1J87q9J86
3079B03l22j46L27l72J58K6L22l49L8j88L57l4k83L05j17m6J96J72l51L21j51
$$ y = [468, -153, 131, -73, -39, -74, 83, -68, -1, -20, 132, -46, 30, -244, 42, -239, 80, 112, 45, -209, -27, 179, -48, 213, -349, 44, -153, 177, -126, 45, -153, -279, 152, 2, -127, -139, 168, 39, -184, -169, -73, 212, -69, -80, -94, -37, 105, 164, -132, -124, -38, 33, -56, 128, -318, 245, -59, -33, 235, -71, -84, -71, 223, 35, 185, -27, 177, 173, -105, -154, 59, 244, 74, 139, -310, -144, -17, -95, -107, 379, -273, -11, 197, 40, 24, 152, -61, 15, 73, 23, 101, -104, 209, -82, 140, 38, 25, -35, 131, -224, -39, 0, 312, 15, 283, -70, 18, -175, -117, 50, 80, -17, -113, 98, -51, 197, -70, 51, -96, -37, 2, 86, -48, -269, 48, -192, 204, -297, -102, -73, -50, 86, -345, -164, 184, -63, 29, 108, -233, 225, -169, 78, 3, -131, 171, -39, -95, -115, -75, 20, 132, -54, -56, -30, -298, 30, -92, -81, 106, 17, 203, -119, -265, 62, -310, -152, -126, 196, -153, -115, -303, 54, 20, -263, 42, -75, -121, 75, 247, -104, 217, 66]
3100F6j51p1P3N9K6j04q6J75q4o2NK10k89M93r8r1N9j7L3k45Q4j7J19j15K62j38
3126I6l5O2k57j5O9J08J30o4k94J30j9J76j12K09k29l7J46j52J36o0J51k73K14
3149H0j70M8Kk00K00K16j82K51j39K7j49nOJ27j11N3J12Rj99J6j19J31K24o16
3173c88O39j93J6m5k51J96K46j75J40l06P2j42Q7J05N3L00l03k37K02J45k22J88
3195A27l95J61k25P1K60l04K28K2j86K22o9M0J14q0kK63j37N9m19K74N8p0J17
3218A29j7K5j33K1ml3J28j19l98M69k81K42q6J6j9L2K71j46j68K0j07J40k62K30
3242e0j27L62m43J99N9R4q0N8l9r3K06j71p2J51J0L5j07R1P2l13L68j33j18M1
3266@J39j5k24n0L28m11K96k5J82m46J14J29n3j16k9J96J71k00j26K13k9K4k8
$$ y = [66, -85, -156, -83, -24, 2, -102, -188, -13, -97, -159, -154, 56, -233, 260, 162, 71, 130, 113, 146, -99, -15, -32, 87, -28, 234, 96, 61, 123, -134, -149, -80, 28, 158, 94, -200, -70, -89, 87, -25, 184, -45, -82, 64, -88, 48, -12, 139, -134, 80, -90, -42, -40, -240, -40, 176, -6, 245, 106, 133, -16, -21, -15, 112, 1, 54, 166, 175, -24, -8, -127, 4, 228, -388, 251, 58, 74, 29, -222, -26, 220, 45, 185, -121, -49, -191, -104, 1, 54, 354, 51, -186, 16, 161, -61, 127, -268, -107, -332, -261, -1, -305, -77, -55, -241, -19, -88, -48, 66, -14, -16, 247, 110, 169, -250, 24, 82, 12, 129, 112, 137, 4, 25, 21, -12, 116, -3, -401, 68, -213, 29, -57, -41, -60, -28, 243, 97, -71, -51, -158, -18, -280, -50, -177, 185, -258, -59, 0, 94, 14, 72, 33, -60, 146, -25, -97, 54, 64, 99, -8, 83, 155, -158, 210, 77, -41, 0, 139, 124, -100, -150, 178, -233, 63, 38, 220, -226, -112, 17, -36, -152, -181, 15, 186, -14, -140, 73, 44, 68, 40]
3289D0o0j73K03o8J60j50O0lk0o8m8r1L52j0m4o7m2J54j39R9j36k29L18j68J6
3314a14P8J61j22n0J05o6J45q4R3q7j23j38J34P0L3pP7k60J81j10R9q2J90j83
3338f0j7K15j33O4J9j9L1j55k0N5M0J82j32j99rL00j03k32L72l21L27L8l76K63
3362A30k13o4J50L6N7lq0l39L09M9m9pk9J52k23J2O7j11J85J92l45J12j07R8J37
3387A16l18J63m9l6K28l32L38J02l08r8J80K3L2N3lK00k80k51J85r4J9K63r3k84
3411b44L62k85J96J32j33p1R7J4k12R4Q9j42R9l9L35k32l09L52J11k03K4J90k77
3434e2K17Jp9J35k36k4J00j18m3J9J79k38K52Lj35j37L16j61N3q3J6J68q8q2L
3459a4ok5J18m5l5n0J74R8k17O4k82J12P3j1K69l61q4L09j59L59k39J76k09j48
$$ y = [40, -20, -193, 10, -58, 102, -48, 12, 9, -11, -79, -127, -218, 134, 124, 80, 13, -29, 125, -14, 85, -51, -280, 38, -130, -114, -36, 125, 3, -47, 58, -8, 137, 53, 146, 59, -64, -202, -68, 2, 35, 28, 105, -155, 26, -84, 15, -67, 123, -60, -77, 138, 5, 69, 88, 69, 100, -55, -75, -20, 20, 202, 70, -129, -138, 162, 59, -173, 199, -122, 205, 243, -133, 130, -83, -147, 3, 39, 96, 93, 13, -326, -17, 32, -17, -24, -53, 99, -124, -112, -45, -156, 29, 221, -124, -12, -119, -21, 116, -202, -39, -88, -124, 104, -228, 110, 212, -96, -194, -14, 9, 41, 94, 91, 291, 11, -240, -55, -149, -130, 133, 40, -244, 118, -167, 29, 161, 28, -43, 54, 68, -144, -50, 39, -103, -4, -43, 292, 60, -249, 103, 214, 11, 35, 225, -52, 165, 166, 87, 222, -14, -38, 62, -56, -99, -80, 99, -139, 113, 116, -19, -156, 160, -1, 52, -31, -15, 153, 65, -17, -14, -20, -45, 73, 28, -7, -57, 117, 215, -2, 62, -220, -108, -35, -46, 223, -138, -222, 87, -72, 287, 48, 224, 15, -133]
3483a33j91J30J96k15L28r6J11m1Q4K0j41k9M9n7q8P9m4K30k36J73j07J8r4j15
3507a69j37L57J19l26J31j24rJJ94j61J27j9o0r0J83K7n4j13J82o4K74j74j39
3530d4P5J0r0r6L33l21L38m81K53L19k33M5K06j60l87J63J90q7o9R2K3n9j93J65
3554hmP4m1k48L09k1j0j98K54R5m46R4P1J16k20L73k29j05R4L5j7L4J52k14J34
3579G4j84R6P4J47j50o2N4k69K57ql2J73l32p0J71K47J1k32j4O9l3J7j69J72J96
3604B03j62J6j34L8P0o1K25l49L76l09N1K4J16Jj27m0L01k30K82l87l3K37j85
3627g7k03K81J10k3j61j1J38m4M4r9m6qQ4J22K3pk53J9R1O0P3q8K36n6j84J50
3653A71k48j07M09j93m1k49J25J84K7Qk63P9%R6J20j17k04L24l7l32L59k87L17
$$ y = [-133, -324, -194, 2, -213, 115, 19, 130, 89, 173, 193, 52, 23, 72, 15, -73, 6, -38, 192, -44, 129, 22, 40, -54, -169, -306, 51, 170, -156, -25, -149, -158, -157, 37, -124, 3, -16, -76, -166, 17, 44, -10, -123, 59, -5, 269, 95, -44, 31, 41, -49, -145, 188, -133, 205, -276, -23, 296, 63, 108, 314, 154, -233, -70, 120, 33, -36, 56, 79, 20, -173, -8, -12, 62, 21, -227, 82, 61, 51, -147, 107, 202, -244, -150, -79, 37, -183, 190, -39, -144, -50, -15, -32, 2, 154, -60, 74, -110, -14, 60, 207, 57, -5, 49, -220, 37, 29, -3, 170, -162, -232, -61, 186, 197, -35, -49, 20, -13, 4, -165, 7, 203, 41, 57, -77, -39, 31, -30, 195, -154, 222, -87, -36, -12, 104, 105, -22, -62, 239, 9, 291, -96, -129, 108, -77, -280, 1, 111, 88, -73, -84, 54, 10, 54, -45, -91, -99, -15, 107, 130, 123, -130, -111, -20, 40, 113, 25, 261, 205, 21, 171, -77, -184, 225, 32, -9, -258, -133, 51, 78, 86, -177, -98, -98, -2, 118, 1, -203, 121, 84, -248, 111, -176, 141]
3676A41J6q2K27m02J05J81j77Q4k15K4J27j30K14k09O4K5r6J7o7k12K65K16j15
3699Aj72L72j24r6k6J40m9m6j63K43j73L16j06l08J24O6J43o8j60L5J45K0j22
3722hJ27M9j88q9K6j22L37k14j10K25l7Q2l07O8J41R5j62R5J3p3O4k70K52o4N6
3747a4k4J87j79k22J87R7jk38K02j18J63k31K19j29J39l35L85J47k06k02kN76
3769D01m00o9j65M64k09m2j53K24J76l37K32j60M31l60Kj1q2J61q7n5J62j33J21
3792A11M1l35J00L1N7j46K28lj52J00j37M86m60oJ1k7K09k47J77L1o2j60K45j40
3816d8J50q9J0L1j67K79j73J42p3P5l09J73J66l3J8j98K48j17j34N8n2J9p9Q6
3840a7j89K33j35nM5Q0O1j52J56Q7k61M7l5j21K41N2rK8J06j71j28R3j47m7K72
$$ y = [141, 157, 75, 302, -100, 5, 186, 9, 93, -122, -98, 29, -101, 113, -96, -32, -7, -103, -86, -153, -365, -100, 116, 1, -171, 201, 77, -19, -45, 95, 46, 0, -163, 80, -93, 223, 117, -191, -67, -1, 142, 74, -86, -51, 94, 114, -8, 119, 168, -20, -109, -83, -205, 132, -82, -192, 33, -4, 78, -229, -161, -20, 75, -87, 8, 21, -52, 12, -258, -6, -70, -14, -38, 149, -30, -252, -65, 32, 31, -207, -5, -123, 40, -191, 28, -101, 38, -297, 88, 235, 29, -173, -175, 401, 1, -68, -233, 231, 22, -20, -173, 51, 227, -110, 122, -38, 393, 33, 35, 24, -58, 103, 16, -39, 123, -10, 111, 152, -183, -83, -52, 5, -141, 87, 84, -68, 32, -105, 381, -79, -85, -74, -101, 108, -139, 38, 69, 7, -153, 92, -48, 102, 13, 23, 54, -113, 166, -7, 135, 62, 137, -172, 1, 167, 134, 152, -46, 202, 85, -49, 9, -43, -24, -103, -17, -206, 27, -108, -113, -68, 12, 73, -79, 77, 164, -97, -50, -85, -206, 35, 87, 78, 106, 212, 41, -87, 6, -141, -188, 84]
3865H4%K7N0q6m9mkj84K68l85J42J20j5J12m9r9N6q7M6L4J28q7k44L00k12J05
3891c1K59j71j39m4O4J2m8J59J5k21j40K01K82j57k11J26K36l37PJ64o7j67Q9
3914a19M5J63k25J54k43K25P0j07m9J71j83J23K27k05j80m0jJ93r3K37k35J58
3936H6p5k00Q8J9J7O8k19L20l1J36k94q9J34n7L8K9K14m30J93j80K84J85l41Q9
3960a6J25PK13Ok75n87N40k1%p6J57j86L5J9J22K44l8m35L72k0l95L64l17L36
3984A74j57O5l65K42J3l1k9l2K02j41O3j42j0K00O2p3j48K43J17l00j60L19r9
4007A3j03m6p3K67o0l9K26j75r9Q2n7n9k6j6Q6J3Qj60M12k24J49J91m54K84L4
4032A74m29K27mn8M7M2o0j81R6k6K37l08j11K27P5J79j80l20N27j44j03L0N1q7
$$ y = [84, 84, 111, 161, 75, 26, 22, 20, -164, 104, -281, -139, -19, -34, 78, 29, -70, -14, -101, -55, -21, 107, 20, -224, 76, -136, -31, 228, 57, -82, -126, -62, -50, -98, 61, 76, -145, -285, -84, 198, 41, -170, -44, 192, -145, -138, 26, -41, -208, -119, -74, 89, -136, 18, -225, 0, 70, -37, -86, 85, -98, 25, 252, 47, -133, -173, -174, 19, -74, 163, -72, 86, 11, -189, -101, -82, -65, 3, -216, 104, 73, 209, -85, -174, -40, -97, -59, -30, 184, -246, -53, -233, 51, 236, -105, -16, 109, 116, 329, 335, 60, -527, 13, -8, -8, -84, 73, -113, -78, -59, 63, 307, 269, -166, 206, 186, -209, 155, -162, 174, 17, 82, -283, -41, -28, -59, -88, -120, 82, -59, 4, -138, -148, 52, 114, 41, -107, 136, 253, -47, -207, 112, 13, -90, -136, -209, 58, -2, -41, 185, 10, -89, -7, -64, -123, -149, -165, -79, -66, -58, -218, 194, -30, 119, 310, -144, 140, 174, -255, -28, -32, -90, -43, -1, -61, -242, -146, -172, 65, -243, -354, -127, -52, 127, -53, -373, 154, 10, -93, -63, -12, -99]
4056i9K08j17J65J13j98K6j89J64j67K33k92O8J81kj73J06M1j68K34%n8m2r1k7
4080h4K46j08k71j60L09j01Q9K34j83k43K38N4K04p4R8k03J46k29R7ok46K08j0
4103EK09j58k1n4J4k30M79k00J98k47m5j84K48j17p2J21j84K01J3K50k29J09j31
4126b5J38l33J35k13K76Q5j02l4j44oJ79j5K97Jj48o8j27K4J56J28m36L04p4J84
4150A82L4j14k86L5k7L35k33J2j14M1J50Nn9O7K3k45L70m33K34J73l33J05K81
4173B03k46j0N4n3J0J10J37j00j90J43j27J63p3k8j30K41j84qJ30J5j2j55l47
4196d57N71k42K5J07JP5j98J47j14K70j79n9K77k52M1k13L5N6L47m45L17j98J45
4219E7j15J76j31J22j60m7K28p6O0k44j4J46J09m6J56k66p7l0J32O2O4k8J54k42
$$ y = [-99, 109, -8, 157, 270, 72, 98, -91, 73, -94, 139, -153, -85, 96, 94, -79, 27, 68, -100, 134, 134, 76, 34, -57, -84, 162, 54, -217, -377, -68, -169, -80, 154, -29, -272, -34, 20, 224, 150, 248, 45, 191, -38, 59, 53, -193, 15, 5, 214, 56, 35, -19, -5, -235, 244, 44, 242, -5, -50, -234, 14, -103, -175, -54, -238, -37, -24, 226, -3, 106, -25, 113, -220, -85, -298, -22, 63, -39, -73, -217, -223, -44, -59, 238, 239, 91, 23, -104, -80, 76, 204, -232, 72, -2, 182, 216, 102, -184, -149, -176, 159, -74, -62, -176, -135, 15, 20, -39, 28, 51, -194, 176, -257, -23, 150, -183, -78, 203, -43, -53, 1, -52, -42, 68, 205, 105, -85, 58, -69, 94, 21, -7, -137, 104, -80, -88, 42, 57, 45, -110, -457, 114, -128, -103, 4, 5, 80, -118, 29, -85, 185, 6, -53, 224, -28, 13, -200, -165, -109, 238, -207, 110, -88, 57, -58, 118, -13, 109, -51, -98, 130, 54, 114, -130, -144, 2, 111, 65, 221, -45, -122, -152, -20, 42, 106, 78, 232, -10]
4243a0k5P1o5L9k49J72P2kr7J65j80qO0K3J04N9k32J77Q3r7M2m5L1J03l34N5Q2
4270fJ52J39m1k08K75m66K31J23m5j42K5J29K6k52m3J37k54K23K8J84k21j76K65
4293H3j25M7O7k5k42Q8K94j17j63j52L03j78m9M65k32k35Q5J77K30l21J39k43
4315a04M23N5j95j35M0o1j22Q6j03P3R4P2k87J87rj21K97j94j61P2K76j99p9K36
4339A41k12KK50j27j47K06j00J32j67P5j29Q6j02P7P9l81L38qk5j04L53j02L3
4362A68m4q0p5J22r6J00l40L40j83Q7j94L34k98J24%J5k44L7L12j47K99n64L09
4385a8L24m89J10Q6N9j04N9q6ok4k06J40l4J46n2J72L8k15KmP3K30k39M2j20J1
4411a05k8L5J25l0o6n5J66m6l4oO8q8J15j09j12OM4Q4J35o5K60m42k17N68l03
$$ y = [-10, -35, 36, -29, 10, -239, -67, 5, 3, -94, 71, -109, -117, -57, -34, 70, 129, -103, 74, 157, 60, 102, 57, 88, 191, -143, -88, -6, 146, 285, 244, 36, 311, -155, 76, 199, 154, 12, 37, 166, 192, -60, -103, 34, -220, 3, 31, 215, -6, -182, 83, -42, 5, 72, 47, -195, -107, 187, 70, -93, -245, 58, -120, -169, 296, 64, -171, -86, 91, 321, 0, 139, -104, 319, 374, 179, 44, 84, 23, -99, -13, -116, -43, 51, 123, -164, 23, 14, -107, 190, -4, -165, -93, 183, -16, -95, 141, -71, -69, 181, 54, -93, 113, 13, 145, -22, 53, -76, 10, -92, -15, 64, -317, 21, 13, -12, -116, 237, 135, 168, 124, 44, -31, 91, -5, 95, -245, 95, -88, -1, -195, 139, -159, -35, -35, -20, -264, -227, 85, -62, 237, -327, -18, 306, -183, -73, 13, 72, -32, 27, -59, -65, -89, -295, -155, -189, -43, -95, 77, 115, -100, -98, -102, -29, 201, -38, 4, -116, -105, -133, -98, 27, -3, -69, -124, 42, -4, -38, -44, 24, -64, 51, -58, -170, -164, -120, -36, 99, 34, 294, -148, -365, 203, -100]
4436a00K01j91K57k08P8q0K33j98P7j17j6p9K11j77j85L49p8K05j64o0r7L21j70
4459A2N8j30jJ32k21M4K11k15K02j46J62j40O8k4J5j89K66l8N2o8k47K22k4M6
4483D7k48p2M61l91K71l5j10L06l98L30j06j85n2m1K18K15j26mO5j51R4k29j08
4506b49K85n5K40m13n2L80o6m3K3q6Q4Q6P8p3j2r8l2K0m3j05J1K43j92K77j56
4531E2k7N4M4k2m2n9j50PK41j41l6J42m5j89K37R8j53K7k48L58l5nj8k39j10J88
4557g1J98m6j64j39L23k42J31j09L57p1j29j76J69nn3J34k05L53j91J97j04j78
4579b1L0p0L6R8pl7P9k31j9k9M35l14N0j1MR4j36K22k35L2K24k67j62R9k8J20
4605d4K03n8P9l34K42j2m20J38J26J28j01j26K15j31P8J04k02Q5j6k9j90K30P5
$$ y = [-100, 101, -90, 167, -41, 37, -43, 190, -8, 69, -48, -64, -143, 68, -109, -294, 55, -23, 182, 18, -42, -139, 182, 12, 70, -60, -61, 71, -150, -106, 105, -110, 92, -54, 108, -32, 36, 12, 27, -162, 104, 66, 118, 50, -197, 25, 1, 47, -201, -273, 188, -203, 68, 33, -77, 229, -169, 161, 55, -130, -182, -223, -5, 210, 84, 80, 145, -6, 88, -141, -249, 36, -19, 221, -192, -244, 136, 70, 27, 50, -36, 48, 134, 212, 139, 127, 29, -3, 17, -26, -131, -120, 123, -69, 208, 52, 25, 79, 123, 101, 59, 0, -150, -143, 98, -43, -79, 63, 18, -171, 66, 164, 11, 38, -210, 148, 113, 108, 90, -149, -259, -71, 127, 81, -83, -222, 101, -141, -10, -119, 238, 167, 38, -138, 31, 26, -27, 107, -98, 255, 64, 261, 157, -21, 9, -61, -25, 73, 66, 29, 108, -123, -142, -171, 264, -50, 0, -11, -7, 87, -49, 173, -62, -30, 194, -73, -235, -136, -164, -44, 159, 101, 180, -154, 88, 76, -344, -206, -80, 48, -53, -179, 36, -95, -17, 87, -115, -30, -46, -75, -265, -35, 40]
4628D0p7N7j8L0j29L03l02O2P5ML5l24L37j64J23q7l3K30j50P8n7p0q0N6Q4M6
4654F9j82L9K8k19N77m74nL21R1l06R1j27K54Ro9j06l17J67J74k13K02j42o4M44
4678B42k12Q9J36l52p6K61M5o2l79L34k06O6L22l23k0J42O3r6J31L5j64J01j93
4701a16j45K97J73j60n6R6m00L75l8j48N0j34L20Mk6j08R4o4K88k57rl72J98M31
4725B93j37j19j8o5j95L25k56K84j62N9M9R2k24J48O3j19J57k48J07Q2j26n4L1
4748c3J87p0P9j65%j94P8N15m85J67o8J36k72L28j2l52K37o8k99K40k64J82K17
4771H4Q4k40L3R7k2j20J85M4j97j44KJ51J27r6j56J12J34n6k0L3K5P5k97P2K29
4796A39k57oL47j99R3j45n4j0M05k39J37j69N3k37J1L26l63J14j8M4J46N4L1q3
$$ y = [40, -37, 20, 2, 32, -97, 206, -96, -34, 41, 45, 80, -244, 93, -71, 52, -35, -68, 162, 12, 90, 33, -37, -117, -61, 23, 69, -113, -74, -46, -265, 312, -162, -167, 154, 245, -61, 30, -97, 157, 166, 97, -9, -326, -159, 15, -198, 4, -138, -202, 242, 30, 119, 255, -97, -173, 88, 133, 71, -308, 26, -180, -114, 208, -115, -135, 7, 70, -26, 105, 140, -24, 77, -116, -261, 36, 209, 49, -7, 89, -311, 64, 26, -122, -72, -206, 114, 118, 92, -16, 78, 14, 302, 45, 36, -336, -138, 293, 156, 37, 19, -46, -241, 84, -172, 112, -50, 9, 58, 150, -74, 74, 137, 18, 175, -73, 34, 116, -10, -64, -33, 154, 84, 163, -2, -2, -196, -118, 397, -88, 79, 11, 147, -125, 203, 191, -161, 76, 8, -291, -51, -315, -133, 84, 168, -72, -39, 58, 36, -84, 101, 145, -52, -196, -194, -43, 84, -12, -168, -56, 78, 22, 2, 35, 60, 135, -162, -90, 139, -118, -124, 223, 24, 117, -28, -82, -92, 313, 74, 211, 42, 95, -142, -131, 195, -168, -54, -72, -28, 118, 172, 203, 120]
4820A20l08L0J21J03p2N1K14m7k91J85P4l9l87J38K29k10J11Q6k43j7M6PJ13K0
4844C4k21J64k0rN6K19%m12L55P1l60K42j52P0j35JM2J65J18m07K70lm2J47j36
4869E7j52L56j64J02j58k40J64J68j62J89j83j51K61j4r8K53j96J20J75l15J09
4890A21l2J09n38K92J80j31q4O2p0J04p5J93K10l85k29K65k9J74l34L61j16j12
4912f4jK30k83k2k3K91Kk25L32j5m36R8J94l3q9j39J21L56k93r5K80l23K72j05
4936C0P3P8O1k66J17J8q5k96K39q6K20m7N8j09J13k5k38L64k78M7j78K24p9P4
4960B9k29J22k02J86J01p9O8J66j44j86R8nN0K01m91J12K21k09Q4j33L97k1j77
4983d1P3p5RL06l35J2j66J00L1J16J4j08K58k83J74k08K8J27K6r1J08j23q5J7
$$ y = [120, -188, -158, -37, 66, -6, 45, 259, 212, -79, 106, 180, 141, -246, -108, 121, -89, 22, 108, -135, -152, -106, -99, 14, 34, -187, -23, -43, -52, 4, 223, 223, -189, 166, 237, -123, 119, -33, 37, -98, -97, -55, 110, 228, -179, 91, 88, 46, 193, 57, -95, 261, 97, 199, 41, -199, -35, 133, -29, 160, -23, -174, 87, 73, -25, 228, 32, 152, 327, 12, 121, 89, 198, -340, -48, 132, 1, -83, -21, -91, 13, -62, 131, 341, -44, -273, -8, -37, 137, -197, 164, 48, -64, -65, 165, -118, -140, -163, 128, 130, -95, 237, 222, -214, -116, 78, 45, -44, -183, -62, 294, 1, -94, 186, -137, 135, 30, 103, 181, 242, -24, 93, 111, 26, -270, -31, -117, 103, 56, 114, 5, 118, 93, -145, 219, -59, -12, -190, 34, -45, 29, -200, -78, -280, -94, 7, -72, -4, 162, 18, -168, -70, -75, -25, 176, -315, -203, 18, -191, -107, -240, 157, 136, -41, 32, -43, -34, 272, -63, -51, -217, -117, -86, 30, 44, -64, 194, -89, 85, -123, -95, 32, 58, -33, 75, -48, -133, -116]
5007a16K3L9N6J06MJ81o09N62j97qk9j27mk7O9K7J1m5J15n1N8k17J54J58k80N4
5033i3%M71m93K37q6n0N0k59J42O5Lj07QJ29l71K22L5k8N9R7j96L01L7j57n6j60
5059b00J94Q1J1J57j93m0n9K72r9l45K02J29o8q8L3M5J85r6k49J%P1r9O3P5R0
5085G3o9M6J07l57L11j33j08J22n3J3Q4J92k09J95m41L14Kj30L5M18l39o7j41
5108a35J89l17L27j76qK20k31r6J80K28l06J2O9J96k70J40K3J24j35r2O5pJ05
5131A05k60j53M39j18M7o3K71k34L3M6j51M6N0j38J38L0j63K44l7m51L81J57k96
5154g7K00k03o6j60J64N0j38K94rj32n0J62j39J92l0qQo4J04jj81J66J30j57M1
5179I6k44L3J77J85k99K0L22l24r3L2rk3OO3J91j30q6J9J40j27p2J27n2p9k1P0
$$ y = [-116, -93, -54, 2, 108, 112, 293, -316, 246, 49, 41, 12, -115, -119, -146, -77, -50, -39, -84, 31, -20, 38, -179, -25, 133, -147, -93, -93, 378, -115, 122, 36, -14, 36, -223, -81, -16, -13, -120, -112, 17, -354, -132, -97, -125, -66, 31, -165, 136, 173, 16, -40, -200, -6, 75, 86, 243, 50, 10, -49, 223, 124, -221, -19, 110, 42, -46, -13, 32, 217, 121, -128, -127, -127, -56, -155, -92, -17, 73, 4, 50, 157, -200, 111, -22, -130, -8, -61, -48, 36, 228, 19, 214, -227, 87, 89, -41, -6, 412, 73, 6, -135, 54, -263, 64, -112, -120, 100, -131, -227, -47, 181, -125, -113, -44, 152, -118, 22, 45, 169, 34, -58, 7, 0, 105, -155, -308, 131, 13, 60, -3, 268, 34, 67, 113, -38, 8, 58, -80, 58, 88, -75, 169, 132, -319, 62, 219, -77, 123, -80, -146, -306, -142, -92, -230, 64, 55, -77, -127, 35, -104, 88, 58, 50, 58, -6, 98, 97, -84, 82, 212, 55, 96, -148, -115, 62, 247, -52, -32, 290, -34, -127, -95, -104, -127, -121, -58, 133, 3, -83, -64, 76, -51, -123, 4, -48, -127, -148, -78]
5205g8r4K96k86j60K85L3K75k85K38k19N1J52j41j44j0m7q3L58J8j91J56p8K14
5228B60j38l61L21k6J33K0n43N37k87J49j8k62M06m9k60J55J62k03j47J52j29
5249a28J41n0nK6J59k51O0K5J13L5j52q8J45jj42L34l51J3l9P4K85k17r8K98k06
5274b0R3j0K65k77Q6m85K33J64K8q6N2j75L96j38k57K38j40LOk03j14R9J20L21
5298A99k05K9k45K42K2Q1qr5l9O5o2l29N28l99K55j2o0k21K74k30O2K40j45K40
5322A87m59K33j57L79j59R4J35k52r4j37K67J28m1p1q8R7J75k56j66L50j88K70
5344B47k34l09K82p3n7J18J64l8k06K60l53J19L45k45r5M18k23j05O2j77o8N1
5366a17L89k02J96l57K11j58J36o2l7l2j04J84q3j81J23J84j95J72L1N0j19J14
$$ y = [-78, -172, 124, -162, -322, -37, -4, 271, -14, 224, 5, 56, 208, 67, -77, -87, -134, -217, 141, 159, -32, 124, 46, 260, 122, -239, 82, 56, 189, 209, -334, 203, -84, 65, 47, -215, 191, 142, -118, 37, 199, -4, -151, 1, -128, 13, -37, -42, -16, 143, -108, -48, -23, 90, 125, -27, -115, 30, 29, -113, 221, -130, -117, -156, -82, 203, -14, -112, 186, -20, 73, 63, 328, 51, 137, -348, -115, 49, 77, -9, 43, -132, 264, 126, -131, 107, -33, -30, -24, -227, -341, -242, -122, 199, -6, 23, -222, 20, 42, 123, 115, 20, -19, 46, -16, -345, 183, -216, 39, 27, -33, -254, 20, -210, -148, 92, -53, 187, -272, -39, -196, 183, 24, 118, 253, 1, -93, -230, 37, 165, 124, 53, -35, 62, 237, -19, -185, 165, -23, 247, 13, -296, -14, -87, -144, -26, 138, 100, -106, 154, -199, -80, 265, 20, -75, 343, 120, 15, 77, -100, -168, -117, 272, 70, 266, -91, 120, -38, 98, 36, -1, -33, -137, 47, -36, -217, -94, 90, -105, 67, 98, 148, 29, 143]
5388A43j92J36j03o8o6J75K66j96m0o3j28K22j14J7J90k55J11k5m9J93l00K28
5410H2Pl9Nj5p3J04K61j85o7l08L37k60qK80j01k20K41J66k61K33l08J53J4K38
5434B76j16j95J00j94J7O1R9k76L07J17J6q8K1j57p8J04J10Kr8J1k5m3L21k95
5458co8j02J50K8j25P3K11j19N0j30l0k4j12L65j93J06j30l1j50K38J22j00k12
5481a86K7K88K7l51J90J1L3J22j82K47l66K38M0j72j8q3K05K34l72K0N9J70j56
5504B5j06J93k25J95N3l9m9Q1om0l8N9j61q4LJ90p8N7P6j35o6J28J6L8r2J73j26
5531D2j85J59j40J70k01J2p6N7L18k66K57o9n47N78p1k8l5k4k6O2KJ67j62K19
5555B13j26k59R2o8K12J2l3J41q8j80K44j56K50j20Rj99q7L07l33L16j88j1R5
$$ y = [143, -49, 87, -16, -84, -150, 25, 291, 95, 55, -8, -136, 86, -28, -11, 179, -76, 35, 10, -39, 154, -146, 82, 89, 50, 55, 40, -33, 71, 332, 147, 80, -228, 109, -151, -159, 121, 20, -200, 41, 207, -54, 179, -129, 24, 38, 276, 160, -35, 65, -129, -112, -51, 48, -228, 79, 196, 212, 124, 145, -12, -90, 14, 124, 126, 28, 39, 14, -29, 292, -3, -71, -173, -23, 5, -120, -47, 164, 45, 95, -35, -65, -89, -201, 164, -29, 77, -53, -84, -234, 4, 126, 26, -186, -159, 129, 156, -195, -5, 6, 39, 161, -21, 226, -140, 98, 138, -34, -52, -135, 70, 304, -68, -48, 11, 181, 25, -81, 112, -113, 82, 135, 96, 47, 128, 122, 82, 44, 103, -58, -142, -139, 51, -27, 30, 106, -29, -95, 33, 49, 87, -5, 168, 42, -143, 16, -124, 46, -155, -143, -219, -162, 156, -110, 147, 78, -469, 109, 38, 10, -25, -49, -75, -13, -11, 156, -6, 213, 87, -172, -80, -148, 64, 76, 43, 184, 96, -84, 160, 4, 254, 134, 143, -56, -143, 164, -169, 147, -41, -52, 43]
5578D3O9l61J53K91j85Np5Q2j83J77k32J36r1M14k08o8K15k47J44j88K53M1j1
5601A74m7m35M29k1k92K79k04K15j13r8J50j01J67j95P1P7m2M9m2k65L29k52P1
5624i6o9L83k51mn5jK69j22k66K66p0j05K17k73K20L0k1j13kR9m5Q6k4j80P5P6
5650B4k61L07k09l1J73l7k7K11j26o2K40j93j36O2N7Q8l17Q9J59j46k1K4L07P3
5674B48o8k02P2j45p7K36Q8k23J27R1j97j00K80l10J15o7l3J27J7j73K83o6J9
5697D2j93Q3J32J54j86j26R6M1j72Q5L28m18J59j52K28k29lJ86j64k2J41J28O7
5720B05l07J72M8kl00L33l07L31l33J73K2oj55J18o9n2J86j8k29J56K79k18j76
5743a49K44O1l58J33K3j67K30J74l23L53p2J5k86J00j92J74KJ99j12j25K76n02
$$ y = [43, 112, -249, -96, 195, 10, 15, -60, 22, -161, 16, -216, -80, -171, 243, 35, -33, 182, -65, 79, -109, 144, 185, 174, 127, -308, 121, 100, -192, 87, -117, 98, -15, -113, 37, -64, 103, -92, -21, 56, 14, 63, 21, -244, 85, -167, -96, -165, 218, -33, -37, -92, -93, 176, 54, -212, 54, -16, -121, 96, -177, 43, 73, 52, -61, -63, 36, -9, 77, 53, -127, -52, 24, -237, 70, -139, -170, 3, -34, -61, 150, 24, -38, 202, 9, -127, -65, -8, 80, -237, -148, 11, -135, -156, -132, 175, 248, 180, -22, 50, -95, -172, 64, 152, -71, 56, 147, -50, -150, 130, -180, -65, -132, -165, -38, -21, -194, 89, 23, 42, -151, -68, 64, 218, 32, -94, 2, 43, -129, -44, 284, -134, 25, -127, 101, -128, -131, 55, -109, -131, 10, 138, 205, -102, 70, 118, 116, -184, 149, -158, 173, -160, 13, 35, 29, -126, -8, -77, -129, 57, 39, -190, -34, 245, 27, -149, 95, 156, -202, -69, -46, -213, 17, 191, -132, 221, 149, 164, -122, -22, -214, -40, -38, 161, 49, -76, 200, -302]
5765c02L12J36Oj94m6J51nR5j96P5N4Rj69J63j96L82k83J18j23J21j56J51j1l52
5789b60O9o8L76j73O4r4k99K10J93J00k34m2j06l0M71l26L22k41J34KM1m0kq6
5813a9J06k44k37J98N4K95o3j26K12l53K02J26o3p6j88R7K26j70J22R0L8j73j58
5836a04Q7r0J87n8J66j26k92M49k27j09J99o5K02j43k21L37k38K7k6q7J94k02
5858a40QJ34J02l7j74QJ93K01l40N9j90L58j38j64M9J13j29k5K69q7J81l39K46
5881A58k74K57l82O0L15q6J51k90N4j58J05L09k58J40nJ27k61O2j20j49K7K05
5903a3n2J38j87J79n9j34J27l9J63O9k86K4K36j50j05K96k66J13r3m7J05j65K14
5926F8k5o9K52p2L5m67L44j60R4p7M5J26n3l09K88M35n11P0k05q4K42L7L35k89
$$ y = [-302, 10, 146, 152, -42, -88, 63, 58, 153, -43, 32, 86, 95, -74, 89, -107, 275, -8, 110, -13, 108, -48, 103, 92, -260, -191, -259, 117, -56, 8, -86, -385, -175, 18, 118, -116, -158, -264, -294, 177, -149, 173, -68, 66, 68, 109, 69, 67, -19, 87, -157, -394, -196, -142, 153, 90, -36, 176, -177, 25, 151, 88, 12, -176, -79, 147, -23, 99, 189, 227, 54, -104, -17, -107, 80, 22, 188, 62, -230, 219, -8, -117, 82, 17, 219, 76, -145, 192, -46, -19, -45, -132, 62, -140, -132, 2, 104, 67, -107, -99, 94, 295, -45, 14, -176, 182, 44, -120, -71, 42, -87, -112, 157, 70, 251, -88, 158, -116, 141, -241, -181, 134, 48, 199, -91, -37, -195, -90, 219, -39, 101, 96, 223, -38, 24, -96, -245, -218, -13, -65, 73, -114, 65, 6, -128, -1, -40, 123, 192, -94, -70, 166, 16, -89, 207, -59, 54, -39, -86, 19, -146, 68, 43, -26, 226, 154, 189, -278, 66, -94, 0, -77, -32, 94, 41, -268, 20, 455, -56, 14, -191, -275, -33, 4, 339, 50]
5950E0J3q4j59J14K32l14J90mJ69j65k09J50j39J43L8p2K9K65j59r3L2j55m8J03
5974g3J07m6L3L09m15L9k4J6J14k00L06m7j0k70L58k16l9J39j57J74j02M5Q8o2
5998F7k2j43j25M11m25L63k25j12K28K52m5j24j11k05L29j25lpl0K49mo4j50J21
6022A00j53L16j91M7j43r2K78k10j98R9M1j91L28J1l34J52J48r7L2J08j40m5M44
6045C10l22L8q0J54j25J73j16O9k48K24K6k34J42N6q2J14l83O37m67M7n3K73j47
6068FN7q9q0J17m2lN1J70k33J37j36k9j24K68j46J22q7K0j2L3q6j9K95k79J51
6093F2k40K3J21j4m4J6N5j9N8J7R2j86O5L51k29j70K3k1j11J58p4j6m2K07j19
6118c7K9q7N8K62l53j99K99J18j55q0J89j16K49k63L77j31j10j99J19Q9r7J17
$$ y = [50, 63, -21, -180, -66, 166, -148, 42, 38, 207, 42, -167, -17, -156, -13, 25, -47, -18, 247, 88, -5, 27, -128, -176, -73, 34, -12, 21, 330, -85, -46, -70, -54, 60, -140, 166, 119, 109, -161, 197, -19, -58, 81, -76, 98, -4, 41, 129, 67, 45, -98, -223, 188, -237, 126, -99, -211, 17, 269, 224, 100, -11, -216, 113, -12, -15, -22, -52, 197, 193, 129, -21, 100, -53, 263, 72, 119, -24, -116, 162, -48, -246, -147, -106, -297, 31, 42, -292, -140, 8, -89, -57, 51, -89, -134, 310, -12, 26, -54, 100, -25, 148, 32, 101, -147, 77, 103, -131, 11, 67, -15, 99, -284, 353, -114, -67, -120, 153, 6, 63, -26, -106, 11, -31, -34, 17, 187, -46, 91, -45, -74, -198, 70, -76, 46, -41, -21, -33, 0, -86, -105, 190, -89, 62, -178, -155, -34, -48, -92, -76, -21, -40, 18, 35, 127, -59, 6, 357, 128, -42, -19, -40, -151, 7, -67, -83, -125, 82, -37, -8, -95, -37, 225, -128, -327, -28, 90, -65, -145, 44, -72, 177, -86, 291, 160, 50, -149, -30, 59, -38, 79]
6140G9l06K30j39J80J31l15J78L56n59O1Q6lJ9k7j79J06J62k9j27K30j62J16j28
6163d0M5J09j2k57K16j92L53m5j80n4pJ5K20O3m04O5OK96o0j60k24K18k61L14
6187B4L8j92Q2M8J26J76m25K13Jj70j35K23l05K09J43l1l1j23L10m41K62K6j22
6210i4K02Qp6K0J1k84j1K46j26M7q8L7J35j58J97l4K74j25l15R2K40r6j83J65
6234H4j87n4J32K18j98P3J58l18K05k57R6M09o03j8J68p1N3Q8p2J2J90j90J63
6257H1l6J07l01K60j20K02j19r9J9q5K6J86J97l80J26p6q3J50J59j87P1L1l32
6280b03R1J21j8kj9j1N8l05K40n1o0M05R9k48j01M9r6M7j66J02K17j95L7J38N
6305A34j65k9J68j53J15K2m83M76m27Q0R3N14n98J88K43l7n3L5j62Q6O4k74K13
$$ y = [79, -227, 3, -136, 44, 175, -140, 38, 394, -165, -104, -18, -21, -2, -29, -208, -102, 60, 31, -96, 134, -28, 88, -40, 5, 114, 102, -155, 61, -131, 222, 177, -3, -57, -64, -49, 171, 234, -170, -105, -99, 197, 137, -23, -247, -29, -290, 24, 62, -130, -48, 0, 126, 302, -123, 90, 91, -79, -214, 9, -296, -87, 56, 25, -6, -129, 181, -260, 2, 28, -94, 108, 116, 40, 60, 71, -213, -224, 22, -104, -57, -145, -108, 27, -131, 66, 32, 306, 181, -134, -42, 198, 102, -81, 84, -103, -157, -25, 193, -5, 68, 226, -92, 113, -144, -48, 361, -242, -260, -92, -163, -110, -22, -94, -82, 108, -82, 81, 45, 152, -149, 111, -9, 193, 74, -25, -6, -91, -65, 121, 318, -62, 64, -12, -95, 55, 214, 27, 98, 129, -203, -112, 9, -9, -11, -30, -41, 17, -288, -48, -99, -159, 246, 345, 97, -4, 45, -51, -4, -170, -68, 149, -46, -9, 129, 134, -31, -60, 108, -45, 70, 92, -391, 85, -342, -262, -169, 345, -253, -65, 178, 141, 88, 123, -39, 47, 111, -163, 50]
6328E0q1O7k09L31l78J62L16k80L17k75R6K1k35P9J85l80J21k8L4J01P5k91K29
6351B7k9o2J77j57P9jj23J90M3o2J15j59k49N21k59j37l7J36l3L1L6l2J58k10
6375c7J55k28P1J06J15j34q4q3J31n0J37k68R9j25L35j29N4l6J11k92j9L56l14
6398a29L74m31K39J10j64J85r9p3k73L01M4j38j71L28Ol05J59k97J81j29N24m6
6420A96j5l26R9K69l2kk6J12k36j28l5J22N5J22p5j19R4l3K7k12K9K60J1k88N31
6445D00m85J16LJ1oL4k9o8K2k03K82p4K57l87K54j59J96k06M0O7j13q7J64J93
$$ y = [50, -31, 36, -173, 158, -220, -58, 258, -22, 295, 20, 116, 137, -98, -19, 166, -214, -93, -121, -87, 14, 89, -202, 27, -2, -64, 113, -44, 35, 34, -89, 101, 144, 82, 197, 38, -211, 310, 51, -86, -123, 13, -20, 11, 47, 15, 173, -37, 118, -110, -39, 67, 182, 48, -36, -119, 12, -38, 99, -169, -70, -195, 140, 11, 65, 29, 140, -152, -171, 185, -129, 245, -186, 53, 163, -1, 184, 85, 12, -261, 40, 84, -54, -225, 103, 109, -196, -37, -334, -153, -282, 242, 196, 181, -145, -46, 223, 191, 189, 163, 275, 39, -89, -124, -2, 53, 175, 100, -19, 75, 42, 69, -143, -114, 146, 157, -131, 400, -85, 31, 34, 45, 39, 73, 44, -24, -2, -205, 77, 3, 260, -127, 127, -32, 164, -42, -2, 65, -48, -135, 29, 222]
$$ [...]
8191G
##END NTUPLES=NMR FID
##END=
