##TITLE=1H_DE-111_oil_TFA
 200.13MHz, CDCl3,
 8 sc
 
 11.9.2025
##JCAMPDX= 6.0         $$ Bruker NMR JCAMP-DX V2.0
##DATA TYPE= NMR FID
##DATA CLASS= NTUPLES
##ORIGIN= UXNMR, Bruker Analytische Messtechnik GmbH
##OWNER= pz
$$ XWIN-NMR		Version 3.5
$$ Thu Sep 11 14:06:09 2025 Russian Standard Time (UT+4h)  she@DPX200
##.OBSERVE FREQUENCY= 200.1313
##.OBSERVE NUCLEUS= ^1H
##.DELAY= (6, 6)
##.ACQUISITION MODE= SIMULTANEOUS
##.ACQUISITION SCHEME= undefined
##.AVERAGES= 8
##.DIGITISER RES= 18
##SPECTROMETER/DATA SYSTEM= spect
##.PULSE SEQUENCE= zg30
##.SOLVENT NAME= CDCl3
##.SHIFT REFERENCE= (INTERNAL, CDCl3, 0, 14.3821)
##AUDIT TRAIL= $$ (NUMBER, WHEN, WHO, WHERE, WHAT)
$$ ##TITLE= Audit trail, XWIN-NMR		Version 3.5
$$ ##JCAMPDX= 5.01
$$ ##ORIGIN= Bruker BioSpin GmbH
$$ ##OWNER= she
$$ F:/spectra/data/she/nmr/H-C/1/audita.txt
$$ ##AUDIT TRAIL=  $$ (NUMBER, WHEN, WHO, WHERE, WHAT)
(   1,<2025-09-11 14:04:37.95 +0400>,<she>,<DPX200>,
      <created by zg, POWCHK disabled, PULCHK disabled
       configuration hash MD5:
       00 E9 B6 7A A2 85 ED C7 34 08 36 98 17 FE 4E 26
       data hash MD5: 16K
       BE 4B 05 9E F7 24 6B 8C 06 78 B5 1D E9 80 46 7C>)
$$ ##END=
$$ 
$$ hash MD5
$$ D5 E1 19 13 A1 D1 52 87 1E 0C C3 F9 2C 45 81 1F
##$RELAX= 
##$RELAX= 
##$RELAX= 
##$RELAX= 
##$RELAX= 
##$RELAX= 
$$ Bruker specific parameters
$$ --------------------------
##$DU= <F:/spectra>
##$EXPNO= 1
##$NAME= <H-C>
##$PROCNO= 1
##$TYPE= <nmr>
##$USER= <she>
##$AMP= (0..31)
100 100 100 100 100 100 100 100 100 100 100 100 100 100 100 100 100 100 
100 100 100 100 100 100 100 100 100 100 100 100 100 100 
##$AQSEQ= 0
##$AQ_mod= 1
##$AUNM= <au_zg>
##$AUTOPOS= <>
##$BF1= 200.13
##$BF2= 200.13
##$BF3= 200.13
##$BF4= 200.13
##$BF5= 200.13
##$BF6= 200.13
##$BF7= 200.13
##$BF8= 200.13
##$BYTORDA= 1
##$CFDGTYP= 0
##$CFRGTYP= 5
##$CHEMSTR= <none>
##$CNST= (0..31)
1 1 145 1 1 1 1 1 1 1 1 1 1 1 1 1 1 1 1 1 1 1 1 1 1 1 1 1 1 1 1 1 
##$CPDPRG= <>
##$CPDPRG1= <>
##$CPDPRG2= <>
##$CPDPRG3= <>
##$CPDPRG4= <mlev>
##$CPDPRG5= <mlev>
##$CPDPRG6= <mlev>
##$CPDPRG7= <mlev>
##$CPDPRG8= <mlev>
##$CPDPRGB= <>
##$CPDPRGT= <>
##$D= (0..31)
0 0.7 0 0 0 0 0 0 0 0 0 0.03 0 0 0 0 0 0 0 0 0 0 0 0 0 0 0 0 0 0 0 0 
##$DATE= 1757585077
##$DBL= (0..7)
120 120 120 120 120 120 120 120 
##$DBP= (0..7)
150 150 150 150 150 150 150 150 
##$DBP07= 0
##$DBPNAM0= <>
##$DBPNAM1= <>
##$DBPNAM2= <>
##$DBPNAM3= <>
##$DBPNAM4= <>
##$DBPNAM5= <>
##$DBPNAM6= <>
##$DBPNAM7= <>
##$DBPOAL= (0..7)
0.5 0.5 0.5 0.5 0.5 0.5 0.5 0.5 
##$DBPOFFS= (0..7)
0 0 0 0 0 0 0 0 
##$DE= 6
##$DECBNUC= <off>
##$DECIM= 32
##$DECNUC= <off>
##$DECSTAT= 4
##$DIGMOD= 1
##$DIGTYP= 9
##$DL= (0..7)
0 120 120 120 120 120 120 120 
##$DP= (0..7)
150 150 150 150 150 150 150 150 
##$DP07= 0
##$DPNAME0= <>
##$DPNAME1= <>
##$DPNAME2= <>
##$DPNAME3= <>
##$DPNAME4= <>
##$DPNAME5= <>
##$DPNAME6= <>
##$DPNAME7= <>
##$DPOAL= (0..7)
0.5 0.5 0.5 0.5 0.5 0.5 0.5 0.5 
##$DPOFFS= (0..7)
0 0 0 0 0 0 0 0 
##$DQDMODE= 0
##$DR= 18
##$DS= 0
##$DSLIST= <SSSSSSSSSSSSSSS>
$$ [...]
##$SUBNAM0= <"">
##$SUBNAM1= <"">
##$SUBNAM2= <"">
##$SUBNAM3= <"">
##$SUBNAM4= <"">
##$SUBNAM5= <"">
##$SUBNAM6= <"">
##$SUBNAM7= <"">
##$SUBNAM8= <"">
##$SUBNAM9= <"">
##$SW= 18.0517328524113
##$SWIBOX= (0..15)
0 0 2 0 0 0 0 0 0 0 0 0 0 0 0 0 
##$SW_h= 3612.71676300578
##$TD= 16384
##$TD0= 1
##$TE= 0
##$TE2= 300
##$TE3= 300
##$TEG= 300
##$TL= (0..7)
0 120 120 120 120 120 120 120 
##$TP= (0..7)
150 150 150 150 150 150 150 150 
##$TP07= 0
##$TPNAME0= <>
##$TPNAME1= <>
##$TPNAME2= <>
##$TPNAME3= <>
##$TPNAME4= <>
##$TPNAME5= <>
##$TPNAME6= <>
##$TPNAME7= <>
##$TPOAL= (0..7)
0.5 0.5 0.5 0.5 0.5 0.5 0.5 0.5 
##$TPOFFS= (0..7)
0 0 0 0 0 0 0 0 
##$TUNHIN= 0
##$TUNHOUT= 0
##$TUNXOUT= 0
##$USERA1= <user>
##$USERA2= <user>
##$USERA3= <user>
##$USERA4= <user>
##$USERA5= <user>
##$V9= 5
##$VALIST= <valist>
##$VCLIST= <CCCCCCCCCCCCCCC>
##$VD= 0
##$VDLIST= <DDDDDDDDDDDDDDD>
##$VPLIST= <PPPPPPPPPPPPPPP>
##$VTLIST= <TTTTTTTTTTTTTTT>
##$WBST= 1024
##$WBSW= 4
##$XGAIN= (0..3)
0 0 0 0 
##$XL= 0
##$YL= 0
##$YMAX_a= 86886
##$YMIN_a= -121183
##$ZGOPTNS= <>
##$ZL1= 120
##$ZL2= 120
##$ZL3= 120
##$ZL4= 120
##$ABSF1= 10
##$ABSF2= 0
##$ABSG= 5
##$ABSL= 3
##$ALPHA= 0
##$AQORDER= 0
##$ASSFAC= 0
##$ASSFACI= 0
##$ASSFACX= 0
##$ASSWID= 0
##$AUNMP= <proc_1d>
##$AZFE= 0.1
##$AZFW= 0.1
##$BCFW= 1
##$BC_mod= 2
##$BYTORDP= 1
##$COROFFS= 0
##$CY= -3
##$DATMOD= 1
##$DC= 2
##$DFILT= <>
##$DTYPP= 0
##$F1P= 0
##$F2P= 0
##$FCOR= 0.5
##$FTSIZE= 0
##$FT_mod= 4
##$GAMMA= 1
##$GB= 0.15
##$INTBC= 1
##$INTSCL= 1
##$ISEN= 128
##$LB= 0.25
##$LEV0= 0
##$LPBIN= 0
##$MAXI= 10000
##$MC2= 0
##$MEAN= 0
##$ME_mod= 0
##$MI= 1.114404
##$NCOEF= 0
##$NC_proc= 0
##$NLEV= 6
##$NOISF1= 3.799351
##$NOISF2= 2.8
##$NSP= 1
##$NTH_PI= 0
##$NZP= 0
##$OFFSET= 14.38212
##$PC= 1
##$PHC0= -1570.89
##$PHC1= 38.99226
##$PH_mod= 1
##$PKNL= yes
##$PPARMOD= 0
##$PSCAL= 0
##$PSIGN= 0
##$REVERSE= no
##$SF= 200.129724274929
##$SI= 16384
##$SIGF1= 3
##$SIGF2= 2
##$SINO= 400
##$SIOLD= 16384
##$SREGLST= <1H.CDCl3>
##$SSB= 0
##$STSI= 0
##$STSR= 0
##$SW_p= 3205.1282051282
##$SYMM= 0
##$S_DEV= 0
##$TDeff= 0
##$TDoff= 0
##$TI= <>
##$TILT= no
##$TM1= 0
##$TM2= 0
##$TOPLEV= 0
##$USERP1= <user>
##$USERP2= <user>
##$USERP3= <user>
##$USERP4= <user>
##$USERP5= <user>
##$WDW= 1
##$XDIM= 8192
##$YMAX_p= 0
##$YMIN_p= 0
$$ End of Bruker specific parameters
$$ ---------------------------------
##NTUPLES= NMR FID
##VAR_NAME=  TIME,          FID/REAL,        FID/IMAG
##SYMBOL=    X,             R,               I
##VAR_TYPE=  INDEPENDENT,   DEPENDENT,       DEPENDENT
##VAR_FORM=  AFFN,          ASDF,            ASDF
##VAR_DIM=   8192,          8192,            8192
##UNITS=     SECONDS,       ARBITRARY UNITS, ARBITRARY UNITS
##FACTOR=    0.0002768,     1,               1
##FIRST=     0,             0,               0
##LAST=      2.2672688,     0,               0
##MIN=       0,             -121183,         0
##MAX=       2.2672688,     86886,           0
$$ Real data points
##PAGE= N=1
##DATA TABLE= (X++(R..R)), XYDATA
0 0 0 0 0 0 0 0 0 0 0 0 0 0 0 0 0 0 8 -8 8 -8 8 -10 16 -16 16 -24 24 -32 32 -40 45 -51 57 -65 74 -83 93 -103
38 -103 116 -130 143 -159 176 -195 215 -239 264 -290 319 -351 389 -428 472 -522 576 -639 710 -792
58 -792 888 -1001 1141 -1312 1530 -1821 2224 -2827 3821 -5748 10863 -56253 -106918 50959
72 50959 86886 26088 38977 83222 60181 62900 79711 44905 7790 25110 1995 -53424
84 -53424 -44381 -21908 -64709 -78760 -43609 -29167 -24598 -3776 6062 11548 26621 42074 40307
97 40307 26979 26197 30806 17631 2499 -575 -2027 -11238 -23995 -23385 -15382 -18330 -15353 -10340 -20500
112 -20500 -9678 18515 10446 -7804 8930 26530 16424 8014 14300 12265 2824 5350 233
125 233 -17029 -8502 659 -18879 -22924 -1784 1944 -6467 -2310 6563 10368 10026 9030 4229 962
140 962 6649 2802 -12492 -10584 -209 -3143 -8592 -6609 1607 8553 5672 2790 6601 7447 7447 3488
156 3488 -4577 -3328 1189 -4165 -9090 -7167 -1230 -51 -5800 -4278 2460 2545 2968 2565 -1492 4067
172 4067 10065 4117 -1006 2657 6120 2498 -4137 -3859 -1263 -4970 -6475 -6910 -8335 -2829 306 -3986
188 -3986 -1700 6147 8680 6841 4372 6656 9249 5471 1624 -2599 -5286 -2483 -4902 -12344 -10145
203 -10145 -4067 -3764 -4746 -2943 3549 8259 5945 4518 6998 8231 7773 1931 -3039 325 939 -4464
219 -4464 -7606 -6584 -3192 -2821 -6144 -4473 -340 -96 437 1116 1096 5507 6466 3655 3777 5467 6262
236 6262 3091 -2028 -1691 -1344 -4491 -5751 -7373 -8030 -3509 -2372 -3643 -1158 3555 5912 4916 3673
252 3673 6154 7295 3165 762 -341 -1398 -752 -3567 -6645 -3896 -1566 -2379 -2805 -1735 1673 2602
268 2602 343 1792 2390 2350 2992 833 -709 1744 1986 -624 -2207 -1372 575 -655 -3558 -2024 -228
285 -228 -874 -228 -712 -98 2769 2387 788 1370 2346 2670 295 -2073 -380 -392 -2884 -3024 -2841 -1733
303 -1733 378 -486 -504 1854 3232 3419 1718 1177 2590 1553 -1719 -1579 -2185 -2291 -1592 -2983 -2951 -681
321 -681 146 424 -154 967 3195 2162 611 1709 1914 1027 912 -603 -365 493 -517 -1883 -2859 -2024
339 -2024 -504 -2151 -3184 -398 425 182 1378 1277 2645 3650 2770 1510 1852 1670 534 -2007 -3253
356 -3253 -1548 -2151 -3606 -3113 -2254 -873 298 -267 1095 2604 2826 2562 1650 1950 2672 778 -925
373 -925 -749 -867 -1438 -1672 -2176 -1826 -1062 -1144 -922 -975 -169 1355 611 287 1819 2110 1946 1384 803 985
393 985 1420 -385 -890 -1678 -1403 -933 -2805 -2976 -945 -504 -824 174 1151 2225 2474 1743 1607 1310 1620
412 1620 349 -1074 -1241 -319 -1120 -2311 -1127 -725 -10 -233 -239 657 1216 1028 917 234 380 1065 238
431 238 -423 32 290 487 -583 -1292 -203 -364 -515 -1022 -1095 42 488 -561 -113 1063 1282 665 15
450 15 478 734 100 -869 -959 -961 -526 -592 -1668 -749 423 376 91 488 975 1460 1134 268 478 -24 -56 -425
472 -425 -1155 -850 -135 -858 -932 -597 497 692 307 404 517 1069 679 538 7 713 845 -410 -769 -359
492 -359 191 -107 -1049 -1510 -197 -790 -713 -473 -179 899 1010 490 904 1630 1677 801 177 503 324 -557
512 -557 -1411 -1198 -1335 -514 -967 -1511 -59 646 133 579 533 1350 1774 886 645 636 98 250 -573 -801 -622
533 -622 -173 -691 -784 -1064 -9 -29 -791 -511 413 663 316 107 236 1492 980 236 93 424 330 -82 -896
554 -896 -689 -578 -773 -1160 -749 -485 280 -58 -29 667 1099 881 527 -19 612 537 69 -424 -499 -325 -174
575 -174 -340 -920 -65 260 426 137 -52 63 341 -116 -299 252 128 95 -170 -159 -35 179 -69 -445 -293
596 -293 150 -135 -408 -214 277 278 -32 -218 116 817 147 -70 119 134 -6 -138 -716 -343 -7 -448 -348
617 -348 -57 443 632 255 116 608 224 319 204 -381 -30 -235 -522 -742 -443 -179 40 -256 -208 396 653
638 653 219 192 -58 355 454 -314 17 191 140 171 -475 -461 -52 -20 -140 -558 -62 59 -127 -322 16 651
660 651 611 659 260 640 722 486 17 -151 -54 -40 -633 -800 -154 -386 -237 -175 2 98 499 251 115 242 567
683 567 426 -310 -108 188 -368 -271 -368 -260 -119 -179 -424 -218 17 66 75 -150 -34 274 188 -46 38 392 546
706 546 392 -75 -13 30 -253 -197 -579 -375 -239 -505 -244 169 218 75 -59 236 573 718 382 227 -77 -86
728 -86 -84 -495 -282 10 -87 -72 141 61 51 219 -111 28 79 24 112 -220 62 287 58 -191 -147 105 208 -20
752 -20 9 -125 54 -27 -25 -344 -19 307 44 46 65 8 223 -68 27 -98 -13 -243 -483 -257 -142 147 -291 -57
776 -57 178 -16 85 48 161 129 270 -180 -59 -119 -47 -437 -290 -256 -57 -107 -8 431 139 68 213 184 103 177
800 177 265 -60 32 47 -172 -239 -140 -147 -98 -314 -247 -317 62 66 -258 -366 184 -157 -153 81 302 384 261 409 -254
825 -254 -99 -161 -161 -128 -381 -163 -20 -223 -271 -100 265 64 297 136 338 200 88 130 112 -177 13 -131 -283
848 -283 -104 -50 146 -164 -137 66 -53 66 192 -39 273 104 136 -6 129 123 271 -275 110 -42 -84 -217
870 -217 -160 -159 101 -132 -91 -261 183 4 257 527 332 441 16 145 13 36 80 -240 -296 -110 -36 -71 63
893 63 86 130 8 65 -43 223 194 -63 -27 127 -132 -129 -85 209 179 205 -37 -26 -54 227 -25 -113 164 4 20
918 20 294 72 34 174 -131 -9 48 -25 -187 -265 -244 55 -131 73 248 -34 97 -77 167 47 -9 10 -10
941 -10 -84 155 -79 -10 -95 -193 -90 323 -57 -93 -183 92 333 155 23 167 127 72 90 66 138 -349 -190 223
965 223 -188 -137 43 -180 43 -263 -12 171 139 155 106 58 345 85 27 -31 -11 16 -126 -229 -241 -304 -187 -260
989 -260 74 26 -45 -135 -4 231 63 -2 218 58 165 -22 -223 158 -229 -8 -189 -58 -288 9 -286 47
1011 47 -186 161 -51 -68 -89 -94 -33 149 314 215 -115 122 218 -388 -59 -28 -22 -109 -267 -265 9 256 158 -109 -17
1036 -17 83 127 -159 -213 8 -27 107 65 -92 -318 -154 -35 75 -225 18 -6 -6 201 278 74 -50 76 -153
1059 -153 27 8 9 -30 45 177 -175 2 -124 74 69 50 83 231 -2 197 -17 -38 -249 -204 -153 165 -18 -121
1083 -121 -52 -240 -119 135 94 56 -88 -45 176 -118 183 234 7 -40 -195 49 -101 -201 107 -26 -119 -2
1105 -2 38 -168 4 -26 160 271 -21 128 -44 51 101 -6 72 -319 -42 -121 -63 -242 -143 -18 -31 -216 -180 -297
1129 -297 -4 66 71 18 146 258 188 123 44 -256 194 167 17 -64 -422 91 -33 134 127 66 76 78 286 171 279
1154 279 -10 296 87 -69 -121 -290 -120 10 -23 -126 124 68 -284 -67 44 -244 -153 280 281 -108 -66 -105 25
1177 25 -54 73 10 -64 266 -148 -245 183 -176 -24 -116 -218 -108 147 64 215 173 287 196 -96 -65 16 -319 209
1201 209 69 -251 104 -364 -130 63 -127 173 58 220 -62 26 119 155 135 190 70 -58 88 49 -164 15
1223 15 105 -193 -240 0 -236 104 94 100 205 251 -67 67 76 157 303 -151 -75 -52 -63 175 1 172 91 -255 213
1248 213 188 1 -55 -90 -98 60 -252 -75 -156 -151 -122 37 -77 -86 -42 -98 -169 -62 -188 -346 102 137 98 354 315 215
1274 215 129 131 201 -274 59 47 -92 82 -163 31 -155 -33 91 -106 -5 57 14 -140 -94 76 -178 20 -36
1297 -36 -13 -7 132 -68 -33 58 199 -66 52 -156 13 368 163 203 -48 -15 -48 -128 106 145 -117 -139 39 -206
1321 -206 157 -150 -24 -45 221 107 142 53 -18 339 120 163 154 27 6 -28 -210 -215 -28 187 -57 -8 -16 -45 38
1346 38 102 24 -93 107 -16 -7 91 -159 -9 34 25 -16 -17 37 -89 -264 80 -104 77 -75 -68 -264 -351 -223 -106
1371 -106 63 -24 -55 -28 219 79 161 324 -12 166 -140 -105 -128 129 27 7 149 154 -30 -8 -24 -46 102 68
1395 68 -72 -42 -53 237 107 -55 -34 8 -62 48 -34 -5 -260 -20 -184 -171 53 -27 38 96 -180 -41 92 78
1419 78 45 -261 -41 -81 -9 -139 -134 -78 -6 -78 -44 -276 45 -27 147 -152 -69 -142 7 -92 -333 -285 -10 -39 -45 188
1445 188 123 192 -244 51 -187 77 115 237 141 7 14 38 248 -329 -77 152 12 14 137 -58 -31 297 172
1468 172 74 167 -107 -146 -203 -475 -32 159 247 -87 74 -276 127 109 -127 -80 12 46 -91 168 165 -216 249 -30
1492 -30 114 61 208 59 -34 19 28 128 -68 -152 -157 -143 -9 186 46 -139 220 -8 253 173 56 176 -206 -35
1516 -35 -147 35 -174 178 -77 -77 -41 93 -71 -4 180 -29 218 -134 270 166 89 251 -176 -32 -116 -20 155
1539 155 -90 -132 28 -6 -9 -71 -386 124 -12 171 -92 -177 23 -140 -63 -118 249 -28 -13 23 78 88 -221 -68
1563 -68 -102 65 84 5 123 60 88 105 22 88 -86 182 234 6 -125 142 -139 203 -163 132 362 115 11
1586 11 -24 239 95 131 30 -286 -156 -189 -141 45 105 225 -161 -139 34 97 174 369 -170 -90 113 151 311 121
1610 121 28 -136 169 -391 -89 70 142 -95 -83 241 -303 193 -56 -10 101 53 135 -199 -5 -180 -62 -86
1632 -86 56 -122 -138 -299 -97 93 -320 60 -40 11 -119 184 -114 -19 254 -166 -64 18 159 -69 -19 -95
1654 -95 -70 -84 -12 -135 164 -102 175 -201 -9 -6 133 -120 93 340 144 64 -104 -13 -127 -79 104 -87 111
1677 111 -153 -192 196 233 0 3 153 100 -108 3 210 88 -56 51 69 -84 144 -3 -176 -53 -72 -16 -87
1700 -87 -140 36 -50 70 292 -42 172 -92 -126 29 83 -34 -133 -157 -134 238 -237 121 72 -395 180 76 -82
1723 -82 211 -17 218 -4 212 -26 32 -154 89 -26 170 134 96 90 109 46 -347 -52 -6 152 77 -65 66
1746 66 -55 -73 -304 61 180 -158 -146 33 181 -73 -310 -54 214 56 10 -291 -167 16 20 107 75 40 11
1769 11 -191 -190 179 -133 -306 179 376 116 54 62 -5 132 -175 232 -24 88 -43 -336 -55 29 -51 98 -97
1792 -97 -62 -34 247 -203 93 -4 -110 8 -88 -3 49 -154 -199 -118 82 24 -229 2 -223 116 -128 46 138 63
1816 63 113 45 -106 140 0 33 122 -49 -7 254 3 -194 139 -273 5 3 -137 -148 41 -91 40 14 -98
1839 -98 143 -251 -119 207 122 29 42 -75 -125 -157 -13 210 123 -63 -50 15 -133 -308 -43 -75 69 -235 -98
1862 -98 74 -268 -207 -213 -6 298 -61 -248 -439 312 -128 98 -36 3 -97 50 35 159 152 -186 178 15 -68
1885 -68 22 -44 -65 -125 168 240 15 -183 -4 -213 38 -173 57 214 -136 116 185 -136 34 -202 193 212 31
1908 31 -111 -193 106 13 -7 -153 236 -8 45 149 -274 -53 -149 89 85 -301 48 10 20 -218 76 242 -282
1931 -282 100 -145 -195 -38 -28 19 134 201 17 -158 -34 -238 -85 103 12 71 54 -16 146 315 19 -21 -69
1954 -69 135 184 -151 169 63 -2 -48 50 52 50 -27 -72 -129 105 59 216 0 -9 98 -129 217 88 190 -374 -197
1979 -197 102 137 148 -44 -21 317 93 -203 72 -249 171 -106 87 19 203 -85 58 -83 -92 222 127 -21
2001 -21 135 -84 89 114 17 128 117 -256 -59 -15 66 278 42 -27 244 63 -139 152 113 -240 49 -9 -43
2024 -43 164 -108 89 -80 31 -66 77 2 73 -75 331 16 66 -265 -105 -14 -171 -70 -222 87 -182 112
2046 112 -101 168 119 182 58 -143 10 -268 -148 -288 201 197 -266 -155 223 27 106 11 -104 2 63 79 245
2069 245 -105 82 9 -159 73 146 159 13 -54 -249 40 -175 -255 130 42 58 75 9 -16 214 -339 -261 72 164
2093 164 -80 293 18 -118 10 -9 9 120 -54 -69 65 179 436 -251 30 -138 -84 143 -94 32 -245
2114 -245 128 -256 250 -1 58 -97 -187 -203 -5 118 69 176 107 -77 -136 53 -259 54 -204 -198 -147 138 -257
2137 -257 38 156 201 36 -41 -70 -72 334 -101 -40 -25 -70 -80 150 165 150 -55 194 168 8 -221 -108 -212 157
2161 157 104 -202 -210 26 95 -57 -165 -8 287 -55 -50 99 -44 55 -62 -226 -6 -380 58 -29 -68 -48 29 -129
2185 -129 -67 -48 -69 112 -50 -280 62 -212 35 -199 7 38 -126 -237 -305 42 -69 -199 32 -179 58 -126
2207 -126 33 18 -93 29 267 -239 23 -37 91 -214 36 145 -81 -119 -176 -86 -69 198 64 -8 11 82 57
2230 57 -93 -33 -211 -17 -41 36 30 92 -49 -72 64 221 -7 -201 -221 78 247 -95 11 2 -8 -110 -163 -142 134
2255 134 -163 171 -93 350 -53 -4 -94 -21 -1 176 -273 -64 92 -88 -444 135 4 -124 107 -39 137
2276 137 10 242 -12 -91 118 -67 42 -25 -47 -118 -145 45 -22 -104 312 25 -4 7 67 -50 9 247 226 207
2300 207 376 297 66 -15 -200 -172 124 261 -187 14 219 42 140 -62 -98 -117 24 -167 -217 -74 -22 52 77
2323 77 206 -243 36 32 -78 140 98 -110 -302 -139 -189 -105 264 152 -150 82 54 47 45 115 75 -65 205 -156
2347 -156 -122 58 -141 -4 -194 -76 77 43 -184 -118 -126 161 -269 -196 162 -283 283 -136 30 -42 114 -67
2369 -67 185 207 -77 -9 -275 12 84 -61 131 141 153 29 -71 -56 -169 -233 -78 91 248 172 135 14 373
2392 373 121 -128 68 -239 5 10 -94 27 155 34 102 -93 -107 207 197 6 16 8 266 39 79 103 20 3
2416 3 11 2 149 142 54 9 212 -29 289 -1 83 -10 10 404 263 118 -145 81 94 20 -230 -220 -77 -100 26 99
2442 99 238 -132 231 -239 -2 62 -90 22 196 -184 -219 76 55 -241 107 -174 -62 -59 -178 -112 -37 179 -13
2465 -13 -76 -33 -71 -62 225 -24 83 86 -111 154 4 73 -71 399 -129 -373 198 -120 -92 -96 -69 111 16 -83 -55
2490 -55 -10 -79 174 -62 -82 -54 -67 -289 48 269 272 152 213 -83 -79 4 -26 -5 -107 154 -87 369 220 20 205
2515 205 -26 32 140 253 36 -132 -140 145 -134 259 247 126 -43 100 89 -324 182 70 147 2 174 220
2537 220 117 -113 51 -128 57 31 -235 392 -94 -104 -127 95 228 38 25 -216 -12 89 -90 187 -114
2558 -114 -109 -32 -52 -226 -229 -127 -167 52 464 -159 -141 -214 44 -98 -118 -69 -69 -161 121 74 -106 -117 -5 36 146 -12
2584 -12 -329 -46 -239 -168 -21 76 69 267 -122 101 92 -56 235 158 -270 -117 121 -17 144 69 37 161 -106
2607 -106 -183 33 -15 9 68 35 195 -54 121 106 -74 276 118 3 77 390 -90 244 -37 65 -129 -349
2629 -349 157 3 -45 -226 -90 66 253 225 175 167 218 -274 -37 193 162 -173 87 -14 -71 -103 151 -59 204
2652 204 -116 228 -122 -135 207 38 4 104 188 14 -206 -95 -282 -50 14 7 180 -13 -200 -39 18 37 -86
2675 -86 -105 -108 66 126 -46 236 -109 7 -78 13 83 276 -81 -111 -76 -111 230 136 149 26 298 -171 -57 -244
2699 -244 163 188 111 -17 -42 -11 -396 4 -220 107 34 97 249 -130 -52 118 164 98 21 -206 14 -74 -265 68
2723 68 -21 72 69 154 -126 -133 -104 -212 41 136 -260 60 153 155 -40 94 -91 -64 -141 -43 -106 169 -96 -135 -193 -200 -42
2750 -42 -150 -70 71 96 50 21 41 93 5 -86 164 -194 -255 57 105 34 -241 -118 -109 -45 111 42 294 74 -133
2775 -133 -88 -108 28 -141 -23 -196 -18 -191 214 236 329 -86 20 -36 15 -206 -202 318 -212 -86 37 -122 303
2798 303 -91 -110 -20 8 -99 -29 -47 -159 175 32 297 134 44 -16 -142 144 34 -126 111 100 -16 -98 82
2821 82 -20 279 -144 45 149 97 -244 -99 163 186 -81 -110 -85 92 -13 -95 -55 -80 170 -150 -80 -144 -16
2844 -16 138 -103 -11 45 -266 -25 149 -106 215 -103 -39 91 -86 27 -109 290 -84 -129 96 10 -94 15
2866 15 123 -38 140 7 180 -152 118 101 -128 -36 53 -15 -101 -13 162 -102 82 17 -3 112 -162 -219 51
2889 51 -40 134 158 -18 -151 183 6 65 52 96 109 -208 102 -35 234 148 -107 310 -281 67 -99 67 -60
2912 -60 74 -89 181 2 121 -239 -3 24 -100 75 -157 57 119 -111 -52 13 -181 50 135 46 -73 -102 72
2935 72 97 275 146 76 233 -54 -480 79 -245 308 -80 -115 3 38 86 -202 -25 -78 -186 -66 -15 6 112
2958 112 112 94 94 239 -142 79 -14 -27 77 41 -116 -48 -244 -57 115 77 90 -184 -112 -240 147 -17 34 96 216
2983 216 262 217 -25 55 118 -134 -207 208 -147 -133 -43 -32 15 186 -85 -141 -37 -82 -74 114 -76 -130 33 -56 -125
3008 -125 -207 -17 156 3 -331 184 -68 119 186 -154 29 -13 -26 22 -42 -125 -230 52 -108 -124 -32 85 146
3031 146 251 160 -55 -95 -154 98 -124 92 78 135 139 -134 91 -214 -408 109 166 148 27 -207 -50 -360 -189
3054 -189 52 25 233 140 -84 -117 122 -59 59 -71 283 -192 -32 70 109 -16 -112 -99 -90 -123 -199 146 243 245
3078 245 149 -131 -29 -86 17 4 -112 3 -167 -105 32 -63 2 -16 9 -163 -81 -154 346 -154 30 -63 -61 -13 249
3103 249 -19 43 -94 336 27 213 -78 -12 -87 276 255 -156 5 155 43 -98 21 6 124 79 -44 -214
3125 -214 7 95 -33 40 -320 -397 -5 -31 -212 -1 -248 -92 54 209 210 15 74 -304 79 82 75 -193 -58 -61
3149 -61 33 157 351 -165 238 -144 10 -45 -156 128 132 111 -169 -88 359 -172 -171 145 -161 93 -27 184 -96
3172 -96 207 249 34 -154 -89 -167 5 5 226 273 24 81 105 -157 120 -24 -41 109 71 -18 -397 380 203 -45
3196 -45 -11 -19 100 151 123 70 97 -104 -153 78 -193 -197 -127 -36 -483 -58 23 149 -187 56 126 79 93 44 -164 -166 195
3223 195 -215 36 20 -91 -36 222 37 17 -5 -240 -114 92 -92 67 -157 -159 57 -92 49 184 86 -90
3245 -90 55 -41 21 -41 -24 -60 95 57 -94 -88 -4 -204 83 74 120 113 158 -168 -37 -108 183 -39 -22 -94 -227 -19
3271 -19 -4 -101 -318 -76 51 -129 100 158 -186 139 94 40 -9 117 -205 231 -31 -146 -213 133 -77 -159 -159 176
3295 176 108 -306 -92 35 -42 39 1 -170 -380 41 113 -179 -116 4 -208 5 -13 132 309 147 227 -115 79
3318 79 -154 15 116 -72 -215 -8 39 120 8 -150 -136 31 55 -70 377 -184 256 15 321 -36 -91 48
3340 48 175 173 -125 55 39 -76 -45 -73 93 -52 -117 -261 55 -13 159 129 -59 523 -44 59 -249 200 39
3363 39 -178 105 -140 102 -69 105 159 317 53 -197 105 -186 -10 4 -224 96 -233 98 -170 93 -121
3384 -121 -95 -78 -99 -99 157 189 -85 40 120 24 -39 -82 -145 -228 11 15 45 11 -47 6 165 271 -157 -146 189 -46
3410 -46 -100 -247 14 -62 -327 -65 -128 238 216 431 -63 32 147 -74 -150 6 274 -79 59 -55 149 66 -119
3433 -119 307 68 15 27 -192 49 -19 -116 -147 93 -149 264 -51 37 142 134 -161 -38 213 33 221 35 -194
3456 -194 -43 108 319 251 -69 113 178 -215 -126 167 -201 -217 -19 1 190 0 60 -157 11 -91 59 173
3478 173 -115 83 -155 43 166 199 -41 -146 -88 -233 -120 470 48 -16 -69 -108 20 17 -11 236 -245 178 189
3501 189 -50 24 -272 30 -29 139 -161 360 60 45 142 162 -15 26 -1 201 -235 -56 60 -34 130 -265 239
3524 239 -160 136 44 123 -23 79 174 -11 10 -54 -81 -14 -116 -247 -269 112 -164 -21 224 323 134 161 -277
3547 -277 13 -45 -73 1 13 47 -133 -83 -299 48 123 447 50 -59 39 -27 199 68 -200 113 71 27 -73 -28
3571 -28 -16 -56 -29 229 244 -193 -43 72 -126 -169 135 -318 98 96 -234 90 -206 -46 17 -170 -109 65 -26 -108
3595 -108 76 -182 -58 14 134 -214 -5 39 8 19 -104 157 124 163 210 -26 86 -252 -99 -118 -258 183 -254
3618 -254 68 110 -166 0 174 -26 95 143 132 -96 108 85 -61 112 20 131 78 -131 52 164 -36 130
3640 130 -56 -204 -188 -244 -35 -104 136 59 -156 18 -14 63 -126 -25 -292 16 134 -76 62 75 32 -266 -167
3663 -167 -11 -205 8 -178 146 47 -131 -28 -122 -38 -38 -191 -103 173 245 -143 -119 -109 166 7 -229 -45 173
3686 173 -212 -151 31 -79 75 -123 -247 -64 -156 -17 310 -259 144 203 -276 -158 -165 66 -73 -186 76 -2
3708 -2 -143 89 -22 237 -14 99 -160 -205 -64 61 82 -1 -220 352 -162 174 183 -241 38 9 113 -174 -108
3731 -108 222 3 -7 47 360 -83 40 226 -146 -73 -9 218 -116 -219 86 60 -28 -16 -84 153 78 84 -1 -146
3755 -146 -50 129 186 -26 -146 78 -39 -189 -188 -203 -230 0 -241 157 -6 66 73 65 136 -74 304 294 30 -33 -67
3780 -67 -185 35 -201 169 95 -155 116 153 118 -47 26 -98 169 29 -120 -169 39 -167 -11 -56 38 70 167
3803 167 137 163 7 -101 168 -40 68 43 -102 -218 303 85 -177 -130 -67 -18 -35 1 178 -13 196 -183 -316
3826 -316 -202 -110 -79 6 -234 -237 77 0 -223 -97 -4 37 40 -402 39 -79 -120 -1 -52 111 145 30 -43 20 193
3851 193 -118 -221 221 -13 -192 92 -106 76 -60 -130 213 81 3 -153 117 69 191 101 93 -148 32 198
3873 198 -121 -16 -122 -84 122 355 -27 -63 -72 -71 62 82 -162 -17 -28 178 85 133 20 38 -275 70 115 -189
3897 -189 -195 18 -137 90 112 -76 289 -73 46 137 -65 -301 10 110 -49 -88 134 -169 89 -178 214 -44
3919 -44 14 164 -31 -387 -34 14 -199 78 -45 133 -118 -184 -95 -88 -138 -40 -60 -104 -123 69 -56 -43 128 61 187
3944 187 -91 103 -13 -147 106 -172 -145 -95 334 152 111 22 153 -85 -267 -238 87 27 220 55 -121 188
3966 188 124 152 -224 -221 -161 152 -50 132 35 -65 -190 -42 132 87 -5 163 -133 28 -27 30 77 -3 179 177 -217
3991 -217 14 29 -103 -21 -165 -152 -278 -10 21 -97 57 -61 96 30 -30 306 -200 21 288 27 -120 -20
4013 -20 -64 40 33 165 59 -232 -43 -138 -39 -91 -157 7 -237 165 -205 -148 -53 79 179 5 97 129 175 64
4037 64 40 -222 -14 182 308 195 -77 -105 -72 212 94 40 11 -108 -82 97 -31 -62 -61 -20 56 -261 -148 80
4061 80 -69 -46 -37 350 58 -344 -13 80 -83 -80 26 76 -23 -5 172 -221 -180 116 126 254 10 49 109 -23 -39
4086 -39 118 -201 -206 -15 -60 -147 -26 110 91 -157 -35 77 151 -178 -52 137 -378 132 88 138 -132 264 110
4109 110 -32 141 -37 -107 280 42 75 33 10 116 -9 181 109 190 -152 141 -70 -73 41 -74 62 182 49
4132 49 -175 -143 2 35 53 12 -259 183 -182 119 101 -64 2 -20 174 -213 112 -85 61 83 271 -71 188
4155 188 -4 160 157 -90 22 138 -41 -3 68 -56 -51 -31 49 -2 -19 -34 106 -153 125 298 -256 270 144 -96
4179 -96 31 6 -114 -49 144 -188 40 149 182 -167 52 -143 -298 -19 163 -24 -176 130 62 -219 49 -34
4201 -34 188 22 115 200 -4 93 11 -158 59 317 -135 39 63 -49 43 -23 245 9 -222 -26 -252 -60 -58
4224 -58 -46 104 -119 -79 -83 -249 33 -85 -76 -99 257 -80 -122 -26 160 -51 -249 47 91 10 -92 -5 105 36 -197
4249 -197 -251 -47 146 12 86 -22 -20 -93 59 -86 136 97 203 -134 -2 -84 61 -36 60 136 280 112 -122
4272 -122 188 -127 -172 62 29 125 -134 204 -59 -142 38 -66 81 -173 -44 76 42 -48 -136 173 210 106 -124
4295 -124 -94 203 -119 -26 -116 -98 -89 238 -38 -46 98 187 175 -190 -148 60 -46 -156 -46 145 -53 13 -71 58
4319 58 -143 -19 -2 -88 -70 -23 219 224 111 -72 -43 24 210 5 -70 126 28 145 168 -78 -179 -211 -42 -46 42
4344 42 -2 17 -60 -67 -79 143 22 32 2 47 -312 -30 -55 129 168 24 -103 82 189 -188 161 -13 -17 174 -241
4369 -241 -77 184 -131 -13 59 260 61 126 114 41 240 51 107 -81 65 -305 -139 -104 149 12 59 -172
4391 -172 83 140 -109 -163 -294 -90 -1 -166 89 -323 -271 107 45 -164 278 -127 144 -56 -101 -152 75 42 -65
4414 -65 226 47 28 -166 -194 22 84 137 309 74 -150 -32 109 89 -164 -18 2 148 79 18 47 20 -50 -182
4438 -182 -40 -206 108 -19 -33 71 28 -29 100 199 249 155 -117 -148 275 94 58 -110 121 -242 -214 -11 103
4461 103 -61 -124 -102 99 288 50 100 -45 362 -64 22 -137 -109 308 151 -29 39 1 -121 -196 52 -41 -60
4484 -60 127 72 -147 116 -196 -19 35 -162 -120 -143 -151 65 69 -226 59 -150 -34 -104 41 23 356 116 -163 143
4508 143 169 14 -166 -251 36 27 159 -13 204 -107 -82 197 -59 50 51 -66 82 234 13 -80 -103 -7 -95 -190
4532 -190 120 204 294 -52 7 29 55 68 174 -192 155 142 44 100 -48 134 32 -116 -158 -175 -136 141 -34 195
4556 195 137 47 -42 72 164 -163 -130 -172 185 -160 -58 -96 190 -66 65 -16 -146 21 59 -24 -95 -10 216 34
4580 34 -127 24 123 -132 -129 148 57 142 -70 196 -119 32 -197 38 -84 63 -136 -144 -122 69 -206 146 12
4603 12 63 241 38 63 -71 10 194 -20 91 -66 80 -87 -170 141 171 -41 -41 -89 -90 120 72 64 -79 28 134
4628 134 145 -124 45 -37 -210 -61 24 -182 78 82 -72 136 -335 282 175 -209 -21 -35 -135 -249 -126 -54
4650 -54 -188 -2 173 -61 -90 -143 -43 -321 118 -210 -42 15 -33 -190 -123 201 -185 -111 -260 -24 43 -45 12
4673 12 -226 -62 12 3 -29 50 -17 -213 -79 -232 49 47 93 189 0 107 154 -133 -54 -134 77 -255 -44 -165 -122
4698 -122 -28 235 198 269 160 46 186 14 -60 -15 67 151 -20 -1 -30 75 2 -45 215 -217 138 116 102 263
4722 263 -42 -325 118 96 -141 143 -22 43 130 131 203 -260 23 -201 -244 22 90 106 -109 140 -147 -244 -77
4745 -77 -47 -16 -169 157 -129 22 -307 -144 198 -139 268 95 -107 -76 -229 -325 -60 131 109 189 140 -11 -109
4768 -109 5 -40 6 -11 213 118 -59 193 -258 13 -40 102 -156 -105 -69 96 -146 -89 13 -128 -47 264 26
4791 26 170 240 -101 -125 123 82 226 -100 53 -216 55 126 31 133 -137 180 -50 -40 -164 32 -223 135
4813 135 18 107 -372 -4 116 -63 69 -38 66 -139 -122 -38 -40 65 -170 -346 37 101 -252 -107 -135 197
4835 197 -94 159 7 56 -165 47 84 -174 216 61 161 102 86 129 -14 -216 67 66 1 147 107 60 83 231
4859 231 51 -55 121 60 -23 -73 -229 -128 -64 -47 160 5 290 -10 -4 69 -54 168 -217 145 -75 189 60
4882 60 23 45 -146 -152 -214 70 -328 -62 30 -1 -31 14 152 -110 215 139 317 86 262 140 143 -91 -85 150 52
4907 52 120 33 64 246 11 46 235 -192 -34 -3 119 36 -30 1 48 -20 181 -56 121 -33 -117 -134 -69 -142 128
4932 128 77 -3 6 31 -111 -111 -228 -191 -80 7 41 36 87 -16 -9 126 218 93 -86 4 77 -54 108 1 -16 12 -6
4959 -6 -128 5 -159 212 46 122 205 -177 15 8 143 139 -1 -18 134 236 -273 51 -84 -227 115 -177 -186 27
4983 27 239 0 -144 -71 110 17 -80 202 -198 -22 -38 206 -83 346 218 293 -83 2 -87 131 135 -54 38 233
5007 233 -85 1 347 -123 -5 277 -187 194 54 -155 3 -169 216 126 15 -8 -91 29 -34 29 10 -112
5029 -112 39 -68 1 161 -230 52 88 -160 213 -29 -57 -136 -144 -23 -22 -57 33 -148 -64 175 -8 -278 56 183
5053 183 50 -60 188 -161 -53 -2 70 -127 -93 -116 59 72 216 82 190 -246 60 -132 172 -141 -38 -82
5075 -82 144 -121 -93 99 -56 83 -209 -176 -277 49 112 -33 192 -97 126 40 105 -128 141 249 -328 -25
5097 -25 -22 128 -75 -26 176 -65 54 -303 -163 -159 -74 182 107 2 -161 -243 -354 5 -7 104 -36 -149 -260
5120 -260 220 -120 -217 -20 91 211 123 -161 287 -95 -107 56 -22 299 250 -291 -89 103 264 136 -148 -43
5142 -43 -122 106 -96 240 -448 -24 -39 -75 -54 -13 126 0 248 96 160 -45 95 171 96 -75 81 -39 -130
5165 -130 56 239 -28 -273 98 -146 -130 61 -62 -95 99 -15 -168 -98 130 -144 -207 -193 -394 -23 -107 181
5187 181 -67 -57 -95 -20 58 -130 -15 57 8 174 171 -46 174 -162 181 -11 165 -92 -80 220 -4 -151 -34
5210 -34 5 -167 155 -118 -277 -76 -15 248 -99 -107 -113 -58 -9 246 -58 42 -124 119 245 -26 -181 -136 92
5233 92 212 78 70 107 -222 56 202 -6 41 -348 -244 94 102 180 1 -66 -60 102 31 -94 47 60 -166 -62
5257 -62 -199 153 27 16 -16 6 95 -59 -142 -161 178 77 -293 -39 38 55 55 -289 51 -128 -56 -47 -42 50 -69 5
5283 5 -22 105 69 254 31 -347 -100 37 -172 361 108 -87 324 -160 -37 -137 -199 -20 185 -49 11 35
5305 35 137 61 86 -31 -88 248 368 4 -259 -171 167 85 73 75 -311 60 -73 -3 19 81 276 -71 -298 93
5329 93 247 -17 109 -2 -235 -137 61 88 -253 -135 273 -227 -59 -108 16 87 -27 63 161 11 -262 -69
5351 -69 187 170 243 -93 -213 3 85 0 35 -11 38 -25 -111 261 190 52 24 333 -122 100 4 -110 8 -107
5375 -107 -77 13 18 100 41 -34 240 213 -31 -126 171 -118 -170 219 -56 -313 -1 -59 -251 281 -157 150 34 168
5399 168 -72 -172 229 67 -176 -77 -221 -51 67 -57 40 -272 -175 200 128 -106 -159 264 -81 -117 22 -46
5421 -46 244 108 -37 58 -167 -220 -48 -37 -18 23 -49 93 199 -131 -243 91 -17 -12 -252 33 -19 -79 90 -160
5445 -160 -61 6 -195 93 -12 -407 295 308 -155 -151 49 -238 -222 -235 102 267 184 -176 60 33 48 162 -74
5468 -74 -22 -103 79 47 -140 221 -206 14 -21 26 52 188 -69 -106 -183 54 -6 -55 36 -5 45 130 101 -11 -154
5493 -154 -197 66 -10 -107 27 124 -136 -36 33 42 -153 -62 112 -71 118 -131 115 76 -83 269 28 291 106
5516 106 -56 18 8 194 22 -37 59 -1 186 -103 -91 -182 64 -56 132 -139 -50 30 406 -132 -105 149 104 6
5540 6 -42 158 98 -29 188 146 -157 -54 -215 -29 -42 70 65 -166 58 -296 -74 -208 -190 -90 -180 -143 167 -124
5564 -124 -259 223 88 8 -238 -94 -22 143 30 -30 -138 -226 181 -146 104 134 2 60 -135 155 127 78 183
5587 183 53 9 -11 139 -254 -53 -28 9 148 -2 288 -21 107 -20 240 -84 31 372 -40 94 -68
5608 -68 203 -60 148 207 -121 160 -136 -4 -437 201 -4 -76 -120 66 -219 102 94 61 -381 -13 -2 -121 35
5631 35 -26 23 -115 -71 119 200 2 22 131 -394 -272 119 -32 118 -118 40 -78 -30 -44 163 121 61 -138
5654 -138 42 15 151 381 200 249 -141 -133 -163 -2 29 -56 -397 96 -160 -41 51 72 88 101 92 204 12 -66 9
5679 9 126 86 -197 111 146 105 80 -94 -102 96 83 164 45 -58 -380 -2 4 -137 -323 55 383 -235 26 -9
5703 -9 -299 -243 94 -318 -5 191 56 -89 84 120 -125 -53 2 298 207 294 -2 166 205 -84 -80 5 77 -85
5727 -85 -70 103 55 19 196 -188 -88 450 121 237 214 131 -87 143 34 290 -196 81 273 -7 -181 -23
5749 -23 118 -41 -140 -110 21 -111 -41 126 -115 73 -93 233 -156 190 -175 147 138 -107 120 23 -111 -79 154
5772 154 90 128 78 123 17 159 141 103 -50 347 52 96 -302 -79 -150 1 132 80 43 287 86 -34 -44 -77
5796 -77 -100 75 -228 -32 79 15 152 -22 189 -39 157 17 59 7 -184 -187 78 46 59 10 17 -199 243 24
5820 24 -86 -88 236 49 89 -50 171 116 -140 -68 206 -87 22 19 -57 -81 -76 15 -83 -147 -293 91 13 -287 -53
5845 -53 -80 2 18 -252 -26 249 188 45 -111 178 -197 -171 -175 -35 28 -42 331 314 -236 -48 275 54 61 -108
5869 -108 -167 -111 273 -121 141 -52 16 158 140 200 -31 221 89 -118 93 101 -63 -27 -401 64 -51 -54 -99 -257
5893 -257 -189 -22 81 -144 -148 74 -251 66 -45 -130 -200 -230 -23 103 4 -93 130 -21 93 63 148 -50 -75 40
5917 40 -34 138 0 -220 -26 211 86 112 3 -231 -35 -171 272 205 -152 79 -38 37 -102 31 227 14
5939 14 342 68 119 67 -57 -185 -177 53 179 26 63 85 65 -26 -207 -2 -67 25 -141 10 -128 42 166 398
5963 398 289 -18 120 -120 -103 94 143 247 27 -29 -183 -6 65 54 -117 -178 77 49 82 29 80 -17 -317 -203
5987 -203 168 -140 156 146 351 103 82 -14 86 112 98 86 -87 81 54 -96 -59 -97 -129 -108 27 -28 -30 -125 183
6012 183 -140 -182 -1 -147 137 199 11 -72 137 125 84 92 -184 -160 -67 -44 -41 197 37 -91 242 256 75 -273
6036 -273 90 9 -136 36 110 -105 62 -53 -158 -295 48 184 -24 -82 70 26 -10 -210 15 -81 105 -40
6058 -40 219 258 -191 139 -63 103 -144 -85 -2 34 -167 83 -108 -66 -144 36 187 216 -74 -5 -84 99 118 67
6082 67 -225 182 -14 82 -195 80 60 -160 -47 44 -80 30 -301 -277 -138 80 -51 -291 104 14 257 -93
6104 -93 -197 4 37 -29 101 -80 -104 -289 278 -317 134 24 13 -55 89 256 -217 -12 33 279 -210 93
6126 93 53 -8 -145 61 160 -134 162 119 -16 -54 82 208 25 201 -80 -117 169 -111 93 -102 6 29 176
6149 176 -139 -2 -85 54 -11 40 -180 114 103 -55 -19 -135 -28 84 -38 -108 -158 169 -193 213 -118 -83 48
6172 48 -197 -112 -4 23 -141 -86 -94 53 -82 208 69 74 59 0 -233 -332 -298 -13 -133 72 -42 -18 -65 195 13
6197 13 2 86 198 64 -156 -126 49 363 -84 2 -81 122 159 -102 -183 203 -22 83 -49 -57 70 23 -73 120
6221 120 121 127 139 -116 78 -12 87 6 -49 -9 -102 105 124 293 107 -108 222 -152 -205 24 272 35 32 67 -239
6246 -239 187 -64 -155 -305 61 83 103 -130 285 -1 37 71 -94 193 -2 -76 -85 121 -10 -280 10 169 -78
6269 -78 55 -19 -77 -6 -82 -163 -23 -5 -105 -90 143 -74 -130 136 -160 55 -8 234 86 134 64 -19 19 122 -37
6294 -37 -163 -70 -296 -126 152 115 -47 211 -282 -41 -221 199 -2 -63 -28 -58 25 -97 -12 407 153 -67 -14
6317 -14 -114 -31 -17 358 208 -27 190 -50 -46 -34 -168 -205 -28 -174 -46 -39 -44 -109 -187 -22 -265 131 -85 -110 -190
6342 -190 -116 -96 127 76 53 43 -63 31 -166 -78 47 -35 129 78 394 -26 -33 -127 -50 6 -401 82 58 -99 -94 -73
6368 -73 0 244 -88 -74 -205 26 148 -38 149 -119 284 148 178 62 -2 396 -58 198 44 118 -109 -8
6390 -8 -98 64 -50 -27 6 14 -176 -185 -119 34 136 -222 -42 81 -61 122 35 -120 153 64 -102 -33 35 -77 -86
6415 -86 -25 -59 53 203 -66 -156 9 -104 2 15 337 -51 0 398 -114 329 248 -9 77 -80 136 -24 -78
6438 -78 -408 -357 -183 -15 -11 37 34 115 -178 -51 144 -163 78 -177 -260 413 58 243 -30 -69 -1 -108 -68 165
6462 165 7 -40 29 -78 129 46 150 235 -59 -208 29 116 162 12 -202 68 246 212 28 173 -1 -119
6484 -119 24 42 -167 34 -16 -152 33 -196 -143 -186 -120 72 13 75 -65 -246 142 60 105 -89 -129 -82 238 251
6508 251 128 172 -176 56 84 -325 -189 118 6 102 -184 19 56 74 -78 -16 -91 36 -117 166 43 149
6530 149 -72 -24 -78 203 180 -233 169 -3 334 54 -68 25 -39 -132 98 -119 243 -132 -155 -76 -201 -51 -3
6553 -3 82 85 15 -81 78 38 -196 24 -78 24 -56 -76 -23 43 25 197 121 71 7 -154 -116 -132 121 -26 -123 -128 48
6580 48 -134 -311 188 -237 37 -216 -34 311 205 94 -26 102 -125 129 145 96 -135 0 -10 -144 -134 -289
6602 -289 56 -88 -141 -80 63 -137 -45 -52 173 -109 26 338 -3 344 34 -310 -23 -64 140 65 -81 -332
6624 -332 -286 123 -108 39 -56 -103 -2 -11 54 60 244 24 36 227 176 185 -143 52 -201 155 77 65 224 108 -72
6649 -72 -55 -98 314 64 -8 66 132 72 -14 -59 -230 124 -98 212 94 -176 49 162 179 -74 -126 -70 -8 198
6673 198 -161 56 -48 -110 84 182 -118 227 309 -107 -71 -17 -43 212 13 115 296 231 -47 171 15 209
6695 209 -155 -89 94 -112 -125 -50 -95 0 102 134 -210 173 -12 -25 -38 -10 7 238 14 149 -50 -12 -170 48
6719 48 259 56 84 -32 239 51 8 -21 -234 42 -203 102 264 171 14 -149 35 -136 172 6 20 -1
6741 -1 -48 -139 0 66 -58 117 -71 -11 28 365 -157 47 -15 33 -21 283 19 -189 153 163 36 -166 -199 239
6765 239 58 77 -87 -202 -175 -51 -182 -43 -32 131 167 128 69 34 55 -112 150 29 120 126 303 118 -72 135
6789 135 288 -134 79 -183 -288 206 -39 -52 74 106 -162 -43 249 -36 -58 -148 -2 -74 206 -158 -92 49
6811 49 100 -171 -131 71 54 34 -134 -240 95 -40 -33 15 35 121 21 -134 136 -115 -187 74 56 63 -33 -260 143
6836 143 35 -114 208 -29 -192 61 128 -39 219 58 -25 127 -46 68 80 -88 276 -97 19 -24 47 116
6858 116 175 -81 3 30 7 258 167 118 239 -44 -125 -50 312 -70 344 5 -122 -104 -1 128 26 -47 -76 -146
6882 -146 49 34 -128 120 136 28 -7 12 -265 -100 62 -97 45 -6 -6 -103 -37 -362 -59 230 181 158 -85 52
6906 52 -86 216 16 -330 -218 47 -112 103 71 -48 -88 -63 -42 88 48 65 -81 223 254 -76 -247 -86 166
6929 166 -261 111 -136 104 -3 279 -141 215 66 135 -22 62 -38 -213 -209 -225 -5 83 52 178 59 -43
6951 -43 -25 -166 135 -3 49 86 -258 -333 -38 -51 -272 -94 183 -302 52 33 63 202 -83 -159 120 191 93 71
6975 71 11 -14 -5 -184 190 74 -169 165 -301 47 -34 17 -80 13 -16 -66 -61 -85 -96 -10 91 48 9 -162 41 -314
7001 -314 76 343 6 40 -59 62 -5 -94 -131 46 -80 -24 310 92 105 -177 70 363 -3 18 6 -89 -182 -37
7025 -37 -101 -37 -94 -51 157 150 253 174 109 -116 180 -25 -41 -91 53 17 -33 -115 12 -279 -252 -26 33 -51 -53 104
7051 104 47 141 -12 11 -39 33 49 -191 -155 -381 59 -260 -39 -121 -106 37 -182 168 113 -180 -6 -24 115 119
7075 119 -172 -22 -29 110 -51 -143 75 -320 137 -97 112 79 248 115 -112 -121 51 153 -155 -154 -92 -243 153
7098 153 -168 82 -91 159 48 -110 -4 -292 -139 32 28 48 25 -163 291 -72 18 -231 190 -249 84 28
7120 28 135 288 76 -24 -8 -157 -218 -81 -106 39 185 -45 -128 -17 -81 -243 47 13 56 -148 -10 9 54
7143 54 134 -139 229 49 -82 -106 159 8 204 -12 41 24 -23 26 6 276 -109 -39 -152 -144 -121 -89 97 63 29
7168 29 242 -253 25 263 100 35 238 -167 -18 -51 57 360 -54 -56 -47 122 119 100 32 -167 114 205 -11 139
7192 139 171 67 -39 -123 -102 178 -210 -213 -24 -180 137 -141 -96 -171 -137 180 -160 175 67 207 -52 162 89
7215 89 -6 -123 187 428 225 -157 72 -59 95 -65 -93 38 244 -69 23 -59 9 65 -77 25 -39 -18 -34
7238 -34 -238 -8 208 -147 -57 -36 57 -134 -242 -299 -18 -83 -210 -50 -119 -87 29 26 -60 -386 140 9 -81 -35
7262 -35 -254 4 72 -54 68 98 136 215 158 -116 25 -155 73 -110 -150 264 -101 86 -11 -151 15 310 241
7285 241 52 -136 -117 -241 93 -40 108 -121 100 -160 106 154 -118 31 -3 -21 101 -99 159 312 64
7306 64 326 339 4 -75 22 -6 141 57 275 68 -3 148 -185 -110 207 -21 -43 30 -137 142 -288 -147 -45
7329 -45 -235 -158 -78 -254 232 102 55 51 -22 -109 -159 4 43 42 31 185 -18 143 111 27 -104 -176 -206 66 110 94
7355 94 116 -44 119 73 163 131 -61 -132 -97 57 203 38 32 -54 -237 54 -89 -18 -30 -8 -304 44 23 -210 178
7380 178 -99 -29 -185 212 76 3 -132 76 25 -204 60 -52 -5 8 -57 349 -43 -28 72 30 74 -219 -65
7403 -65 245 87 167 327 89 -258 -267 -67 -198 -16 20 75 -173 -26 -120 -3 -38 -111 -7 -92 -52 -65 38 4
7427 4 65 -6 176 43 202 -179 16 241 -67 35 -30 -249 285 -45 77 -210 -27 -113 196 2 13 131
7449 131 103 52 -118 314 -189 130 289 -129 191 46 35 -199 93 -33 -208 154 -138 9 -70 -228 -206 -248
7471 -248 45 197 -29 -22 115 -193 -46 180 -57 60 124 -14 148 105 -20 56 -143 -17 -142 12 -67 -232
7493 -232 -195 -59 122 143 -252 129 -69 52 65 -202 -96 149 75 0 291 -117 -20 164 -138 131 -6 -6 -69
7516 -69 -120 21 -40 -298 79 -99 -9 0 -64 -290 -210 133 -118 -121 -109 -114 -111 117 -14 210 52 -97 -183 120 81 40
7542 40 -14 -412 60 -60 -78 -7 -16 -33 127 -83 -250 128 -62 -12 -57 -42 -11 120 -45 29 55 -32 13 115 136
7567 136 94 -8 -66 68 87 -171 -184 75 -85 -102 36 159 69 -53 127 59 82 -72 88 -206 74 39 -131
7590 -131 -165 15 76 72 -144 -38 -143 -82 -236 -118 60 205 -194 -209 134 -134 -18 -53 -53 72 108 152 22 223
7614 223 83 -65 -89 14 41 215 30 186 -48 80 -43 -16 27 -88 111 34 88 -30 10 -67 -20 95 93 -38
7638 -38 34 62 68 -217 122 -129 61 52 -40 73 148 -4 65 -163 204 72 -178 -66 295 190 61 -47 79
7661 79 -149 -25 -97 -320 232 78 -164 -99 -165 98 24 268 -24 13 -5 24 -1 27 23 78 -35 -291 -295 -1 53
7686 53 -50 61 12 173 9 46 22 215 223 124 55 -154 89 -321 -262 -46 215 145 -234 248 83 -141 80
7709 80 13 -361 80 71 -198 104 130 46 -35 -105 -134 -28 -106 3 133 -60 -173 232 -109 -156 -80 -210 178 -116
7733 -116 -79 328 82 79 232 -75 -136 174 9 -40 187 -39 28 200 16 70 38 -19 187 293 -12 242 -1
7756 -1 93 170 -18 -19 -55 45 -132 130 37 18 85 -213 -61 40 -225 -20 22 -54 -106 -95 -39 97 221 -186 -88
7781 -88 -189 -100 -68 54 -67 63 -269 -102 391 -117 313 -47 15 -272 4 109 -176 38 -56 -107 40 -179
7803 -179 18 -181 290 188 -173 110 -87 -237 81 222 161 78 -195 -218 -68 -60 1 23 48 -219 171 2 49
7826 49 -8 46 119 4 306 -95 -12 15 259 -140 -195 -33 -226 -126 -176 225 59 49 47 153 54 34 141 -126
7850 -126 -14 -79 127 138 100 320 126 86 108 -105 -90 -126 -147 -72 14 -73 85 51 66 -123 158 -36 -148 70
7874 70 40 -185 -88 -273 92 107 42 126 153 199 -262 -149 -103 -208 63 132 -259 -8 50 43 95 220 -28 -272 -10
7899 -10 14 0 -237 -3 70 88 -212 -119 -56 166 -115 61 88 -153 -6 -113 177 -121 27 51 60 -24 -23 -97 3
7924 3 57 134 -78 -243 94 -289 206 -92 5 59 3 93 31 -50 -86 -56 81 -141 63 -37 137 -189 -350 20
7948 20 -2 -267 284 219 123 24 159 -79 -233 -47 56 -84 -85 -11 151 -138 -233 73 -194 -231 -25 159 -91
7971 -91 20 59 -171 -21 156 5 -7 250 270 -81 20 74 13 161 257 -156 97 -19 -266 -88 92 -124
7993 -124 10 72 -75 -240 -127 2 223 -193 62 117 -67 100 225 -35 -44 -9 56 -198 104 350 -68 28
8015 28 -116 501 -19 125 -12 136 -11 160 177 273 -102 122 -79 -168 197 -44 7 163 37 13 49 144 -119
8038 -119 -175 47 138 -170 -27 -282 -15 -74 61 180 -62 63 119 -131 188 110 74 88 -78 -223 -91 115
8060 115 117 26 96 54 -78 -95 2 -118 -61 -73 167 77 -71 262 -244 92 99 -63 264 -221 64 7 22 -240 -107
8085 -107 -102 160 -92 -71 80 96 -227 -204 224 -45 40 -32 -145 295 -5 -60 -89 -66 59 61 -152 -62 -64 -35 186
8110 186 34 -12 -207 -33 -100 -32 -64 95 -68 83 72 0 50 199 28 91 180 -108 185 162 -244 58 -321
8133 -321 -35 140 55 96 229 -59 -114 -84 93 189 -19 71 -97 -18 -236 196 -36 121 -69 88 95 51 150 128
8157 128 -13 10 -129 290 -10 -27 123 -131 -18 10 2 -161 -117 185 195 -90 128 181 61 201 72 242 62
8180 62 -97 -111 197 186 -24 -21 -107 175 -49 85 -357
8191c57
$$ Imaginary data points
##PAGE= N=2
##DATA TABLE= (X++(I..I)), XYDATA
0 0 0 0 0 0 0 0 0 0 0 0 0 0 8 -8 8 -8 8 -16 16 -22 24 -32 32 -40 48 -56 64 -72 87 -97 112 -128 145 -166
34 -166 185 -209 235 -263 295 -329 367 -407 451 -500 553 -609 673 -744 819 -902 992 -1094
52 -1094 1206 -1331 1471 -1630 1808 -2014 2253 -2536 2872 -3288 3809 -4488 5419 -6772 8924
67 8924 -12917 22886 -107178 -121183 3177 -82937 -61678 -13638 -1497 4078 55305 38531
79 38531 23817 55618 72476 26459 35916 61462 20777 -17886 8232 4703 -23554 -33448 -39274
92 -39274 -50414 -41709 -29986 -26060 -27838 -12252 11217 19421 19519 31347 38386 33751 22751 19763
106 19763 19869 6247 -8440 -11930 -25941 -27746 -8608 -16894 -37243 -17394 7971 2033 -3656
119 -3656 10277 17396 11200 13772 14579 1243 3615 13480 -5837 -16430 2645 4471 -11183 -9557
133 -9557 225 2020 -874 -1758 -2299 -2259 4110 4501 -6645 -3991 8558 4982 -3893 -2388 2485 4556
149 4556 -1474 -7261 -3944 -912 -1603 -1573 -3751 518 8959 6860 1994 5428 9001 6408 -2665 -6157
165 -6157 -2009 -4724 -9517 -9325 -10326 -5260 3582 464 -1833 5794 12155 9744 4877 5195 8519 3459
181 3459 -1770 -2671 -5362 -4778 -3477 -9718 -9610 -1429 -460 -2857 -2557 1602 6655 5538 3406 4220 4255
198 4255 7091 5986 -1249 -1383 3552 -357 -5664 -6543 -3878 -2358 -6425 -8266 -3426 -52 767 135
214 135 149 6966 10769 6603 4345 6057 6524 3777 -2839 -5194 -3768 -6510 -8931 -8240 -7747 -3694 -818
231 -818 -1838 730 5267 7283 6355 3819 4849 6687 3195 516 -656 -2648 -1320 -1241 -5693 -5321
247 -5321 -2221 -1845 -3584 -4270 -866 2126 -142 -122 2570 3771 5331 4106 702 3168 4260 798
263 798 -2193 -3024 -1749 -2382 -5494 -4656 -2459 -1841 -495 87 191 3313 5058 2393 1845 2723 3140 1464
281 1464 -2411 -2257 -746 -2278 -3290 -3080 -2520 474 622 -781 674 2703 3039 1230 -278 1507
297 1507 2310 -946 -1640 -1033 -1066 55 -1128 -2464 -378 564 -347 -806 -965 1317 1549 -410 732 2345
315 2345 1943 1868 1199 -127 678 424 -1524 -2905 -3083 -1712 -2106 -3369 -1337 795 696 1962 2142 2714
333 2714 3934 3420 1733 979 689 240 -1705 -3740 -2565 -1830 -2946 -2307 -1651 -632 1037 711 507
350 507 1945 2612 2462 973 538 2539 1834 -832 -857 -309 -777 -1226 -2446 -2458 -1706 -1339 -1833 -1497 -407
369 -407 1486 1058 477 2455 3286 2505 2297 1558 612 578 -684 -1820 -2490 -2765 -1913 -2471 -3031 -1076 376
388 376 321 1056 1394 2358 3005 1894 1014 906 697 637 -815 -1740 -434 -647 -1839 -1636 -1056 -527 -582 -832
408 -832 -457 625 560 690 310 380 1884 1475 289 709 760 309 -462 -1230 -1120 -1061 -1528 -1216 -1308 -637 717
429 717 527 -86 1512 1997 1444 749 246 787 390 -655 -1176 -1184 -688 -449 -1063 -1079 305 814 176 358
449 358 662 1159 871 -451 -116 -141 7 210 -919 -642 201 -274 -604 -491 18 281 -62 -390 233 689
469 689 299 456 151 502 971 184 -571 -105 -105 -187 -996 -1579 -998 -440 -494 -482 -248 1079 1503 1058 1101 1622
491 1622 1278 935 -297 -525 -199 -522 -1636 -1284 -1147 -697 -369 -1211 -50 838 599 333 250 1016 1309
510 1309 894 139 460 495 456 -144 -885 -657 -192 -918 -1146 -830 -685 -368 -464 -541 295 924 923 905 756 1032
532 1032 1445 572 66 219 213 -272 -1036 -1527 -684 -880 -878 -625 -309 757 914 128 752 717 1163 748 -297
553 -297 138 585 -156 -511 -615 -394 -35 -279 -673 -481 20 -12 -362 -349 214 799 -122 294 618 673 765 187
575 187 -239 407 235 -498 -527 -681 -363 -194 -669 -780 125 333 336 162 264 958 614 44 -268 -217 214 -210
597 -210 -808 -386 232 -231 -175 -459 174 429 272 257 401 278 251 1 -437 63 -74 -358 -420 -145 50 207
619 207 161 -18 156 375 40 -175 98 505 527 84 185 426 350 436 -317 -298 85 274 -690 -422 -447 -104
641 -104 241 29 213 484 789 665 322 338 471 94 -283 -451 -531 -821 -582 -801 -293 95 -146 -306 51
662 51 256 503 64 165 130 267 436 -124 -301 506 354 -7 -106 -342 -295 -245 -372 -835 -406 49 29 -37 -28
685 -28 589 608 277 302 604 289 382 -307 -414 -173 -34 -811 -601 -724 -258 -402 -373 169 302 398 231 164 214
708 214 250 72 -217 -118 11 24 110 -290 -40 -148 -309 -189 -376 15 279 -211 -250 154 148 -27 17 11 424 236
732 236 80 -69 -107 -49 82 -416 -505 -254 -248 -259 -284 125 251 230 -153 439 257 239 162 -139 -241 -159 -344 -273
756 -273 -62 56 152 -70 101 169 275 224 313 199 126 12 -71 -427 23 163 -59 -245 13 160 220 -119 -28
779 -28 71 149 36 -167 4 211 95 110 23 160 29 5 173 -199 -228 -288 -361 -213 -215 14 142 33 -92 124
803 124 411 192 295 232 172 -76 -14 -294 -303 -52 8 -59 -144 187 23 -61 149 143 140 162 221 -61 117 166 88 -162
829 -162 13 204 -72 -116 -356 -114 -270 -41 -138 -66 -230 -127 -28 34 172 -20 459 335 127 396 32 -18
851 -18 100 -207 -418 -372 -461 -150 -282 -162 279 147 180 584 93 100 -58 231 70 2 58 -68 -201 -173 -92 -46
875 -46 342 -313 -256 36 142 77 -28 -328 47 182 94 85 -389 130 93 196 -108 -12 31 116 -8 -134 41 -10
899 -10 84 -224 56 89 -233 24 -104 15 70 -93 -9 4 46 -53 -286 -155 -154 289 343 240 -193 107 311 4
923 4 17 275 -103 -128 -165 -32 -205 -273 194 113 78 181 147 -153 115 -16 -94 -60 -266 -111 44 -34 2 -126 -321
948 -321 144 -19 -385 13 -42 -159 -96 -62 -74 347 97 101 27 381 196 -135 53 -15 -30 -253 -143 -165 -24 -10
972 -10 95 -14 -211 53 171 11 286 301 2 205 -73 -44 -8 243 97 118 -180 -96 -59 -52 142 -66 86
995 86 -144 -44 -98 -37 -68 -23 172 197 61 -37 113 71 132 -122 -523 -98 -98 -230 -242 -40 -24 52 43 188 88 -152
1021 -152 16 -147 -72 121 -307 165 75 -211 -56 84 -110 6 -182 -145 -206 48 -66 -17 200 -280 -64 98
1043 98 68 -29 200 124 -84 -129 -218 -53 -120 50 7 -87 -172 -7 40 -135 137 303 137 -93 -73 -65 178 -107 50
1068 50 32 -26 21 36 -133 55 -24 44 188 59 -43 -60 -83 -26 103 47 -72 -110 -1 -50 -158 -24 228 150 -60
1093 -60 57 145 142 225 -24 171 234 -1 -43 80 185 -11 44 23 54 -61 -251 -117 178 7 284 70 -64
1116 -64 41 1 18 11 219 222 194 -34 98 -89 -32 -179 -59 300 51 -80 -96 149 88 27 73 -10 68 -173 57
1141 57 -339 8 2 -175 -95 -94 30 3 39 -21 -66 49 -64 -109 65 -42 8 -70 127 75 -14 98 -117 -74 -60 -19
1167 -19 -108 -288 -241 -11 76 -130 -85 15 63 148 182 231 148 -44 -71 139 160 -158 -257 -45 -14 -220 -1 -150 146
1192 146 -191 -312 -224 -83 87 -162 296 -18 306 -26 127 158 -41 88 49 6 183 200 -256 -213 -317 7
1214 7 -4 -199 -164 121 201 -32 -187 -71 268 78 -1 -65 69 67 -4 -208 -75 65 106 -27 -167 -67 187 -49
1238 -49 -104 170 57 63 -7 22 72 236 -105 38 -147 -252 120 60 97 71 197 12 144 294 60 -17 37 236
1262 236 45 23 -91 -51 -208 -93 -258 -96 183 -28 95 242 -64 178 192 179 -294 165 -61 -63 -70 -86 105
1285 105 91 176 64 312 -183 108 -135 120 24 1 172 269 -126 -37 -60 -107 -92 -47 -310 -194 85 -55 -8 -78
1309 -78 1 66 -125 292 -21 155 -81 213 293 -134 -4 189 -115 94 -17 -44 -88 110 98 -112 -101 178 -41
1332 -41 -8 -363 123 135 -55 -122 -81 -134 153 194 3 -105 -112 15 101 22 -74 181 -307 187 -274 120 9 200
1356 200 23 123 223 118 -130 -36 -36 90 -339 -130 -270 -48 19 -33 -51 212 -109 214 368 -108 23 -32
1378 -32 85 44 -87 -8 -120 22 -125 145 -10 55 204 -35 -46 -273 99 148 116 70 -175 14 -33 -12 206
1401 206 52 69 -12 206 85 -30 2 33 148 132 -45 126 -120 238 -261 3 -50 -43 -259 -116 75 49 -133
1424 -133 -30 -64 -254 246 203 -187 -34 -1 237 15 69 -114 -101 6 -84 160 193 -2 -72 -37 -133 -293 -100
1447 -100 -109 21 21 76 -19 40 -221 20 66 -127 107 -136 -317 -161 -142 -82 -101 -113 -209 19 -105 -56 153 -4 -42
1472 -42 140 69 -100 427 220 143 -265 137 152 -76 27 249 -125 -19 -27 34 -85 1 -230 111 -37 -133 -97
1495 -97 -168 201 -99 -346 -55 167 36 -101 -195 110 -7 -183 231 51 -55 -7 -169 -104 -81 15 -110 246
1517 246 -204 11 75 -164 387 72 114 6 -79 169 153 32 -20 24 11 -32 86 -90 26 41 284 -191 17
1540 17 -56 234 134 -24 -3 30 143 149 -107 90 -92 44 69 -16 58 159 311 -200 115 -270 -24 171 -4
1563 -4 185 -64 -20 13 124 1 116 200 148 219 5 31 40 -49 -106 -15 -123 -48 -316 154 -136 -50 276 52 63
1588 63 5 259 -141 -65 309 -136 -156 -55 27 -332 29 -345 -15 36 -7 -90 1 307 59 -18 239 33 17 36
1612 36 45 -102 185 -282 -42 -219 -32 -235 -18 38 -77 -185 211 -49 -255 134 201 110 -142 134 -20 -98
1634 -98 -247 -438 34 11 -102 87 51 171 -235 -203 -136 -21 -37 124 -14 126 216 -130 110 -30 -65 -42 -54
1657 -54 82 -80 28 11 27 -16 179 -272 -338 92 341 18 -183 49 11 -34 -131 122 -113 193 -6 108 -175
1680 -175 10 -85 -293 -45 31 27 -77 -34 149 -154 45 -137 -74 217 -4 77 -7 -141 306 -132 105 48 -26
1703 -26 171 72 27 51 -161 -394 -271 -106 63 -57 -198 -156 11 -375 152 -5 111 103 39 293 -80 204 182
1726 182 134 120 -4 130 139 91 130 69 -54 -7 0 45 -199 176 47 30 80 0 -51 145 -392 -55 14 -266 70
1751 70 -61 -469 -193 -35 -237 -26 183 -102 -104 276 55 -130 -11 33 24 -83 136 -10 283 -357 -36 -91
1773 -91 -99 170 215 -159 -180 4 301 -27 3 -3 166 230 155 -39 -187 347 -116 31 -17 -251 41 54 173 -185
1797 -185 -188 -295 -176 47 -10 1 54 -124 -89 -40 -49 43 -38 -30 155 -9 -106 -13 104 -168 -186 159 -202 -95 -64 -62
1823 -62 -71 41 -108 61 113 114 -83 50 193 -269 36 100 -174 -97 74 -32 33 194 -38 240 -123 -181 166
1846 166 34 72 30 44 163 19 213 50 -64 -228 -6 -226 55 72 -232 212 213 -213 -11 3 -82 -85 -159 88
1870 88 -22 63 149 -101 114 -213 37 -228 -19 -6 82 -16 70 170 -28 182 -13 92 184 -6 67 140 204 -42
1894 -42 11 -385 224 145 -153 -37 59 12 199 -4 -8 -48 9 -55 -148 -105 66 -138 -25 113 -37 4 -60 380 165
1919 165 32 166 -14 79 27 -122 220 -166 38 134 -96 -18 42 -191 -35 -34 27 178 -152 129 169 70 -24 307
1943 307 -26 186 3 -44 -37 -78 62 -21 242 140 44 -120 -141 182 273 -248 -4 -72 200 -47 53 -73 -132
1966 -132 -337 -187 -173 64 -17 -248 79 -246 166 96 -97 54 -144 -65 -111 -211 -230 -108 129 191 43 -119
1988 -119 -251 11 77 -140 48 -16 -59 50 -39 151 22 -176 -103 50 115 -81 -213 167 41 18 200 -169
2010 -169 -7 128 29 -57 306 -69 113 -71 -60 79 298 204 -173 1 -140 -10 -35 -197 37 43 -218 -60
2032 -60 88 -129 34 79 34 161 228 -188 116 220 10 11 4 -12 209 -36 -231 134 160 198 -337 -41 13 -110
2056 -110 23 97 259 -144 38 -133 72 152 43 27 -185 -212 137 50 270 219 -264 253 115 172 -153 -42
2078 -42 190 136 -78 -81 -69 147 113 -55 227 -96 -182 -349 1 -81 40 2 -293 42 86 -15 -29 -123 -119 4 -160
2103 -160 28 112 -56 -32 -35 62 -30 13 -127 -108 -29 86 179 82 136 64 -21 -113 178 -129 -107 -227 14 161 121 -67
2129 -67 -42 70 -107 -135 -387 205 80 75 -30 62 60 207 114 39 158 102 111 -196 -177 -168 -16 118 -74 -35 -215 298
2155 298 -228 -93 -94 -218 43 -290 -16 -246 -125 66 -19 7 -169 53 -167 95 -245 -127 -18 150 -178
2176 -178 319 -229 150 155 8 -18 -272 -10 51 55 -50 182 247 27 35 32 -33 -6 -130 19 -105 -361 124 88 5
2201 5 117 24 280 -48 221 -89 47 257 81 68 -51 -324 -126 -48 48 -40 256 -72 -95 146 -50 -116 -35
2224 -35 79 -22 -221 -78 114 -215 26 -17 159 -31 -158 -7 21 -16 58 67 128 -199 -113 -49 -171 22 131
2247 131 77 -358 -45 170 -48 71 -177 145 12 150 -35 184 213 -195 -67 -75 -166 2 86 287 167 -154
2269 -154 198 -102 199 -80 26 -69 -575 197 34 -95 152 338 117 -197 269 -152 208 7 -3 44 58
2290 58 -135 88 -203 -81 -123 -14 166 -261 304 -76 -134 81 223 -88 -2 76 219 143 67 -39 96 254
2312 254 -249 -69 108 121 -107 -93 100 -313 -172 241 -130 -114 -46 -209 -141 -108 -98 87 -175 19 114 -129 116
2335 116 -310 -25 161 -72 -144 75 -61 365 15 51 -5 -103 -259 -141 -28 136 59 25 -3 20 -74 272 -73
2358 -73 44 -97 21 65 -94 -97 -5 -188 104 290 -191 5 198 -89 -230 -11 167 -186 139 61 18 -72 -290
2381 -290 0 -29 171 -52 147 70 -216 136 168 -184 131 -30 247 -9 1 328 73 23 86 238 -113 -90
2403 -90 65 49 -11 -76 13 -133 -191 -3 159 89 200 -70 64 133 -22 -30 -6 -266 97 32 -240 -126 -283 149
2427 149 -90 -111 54 208 30 246 -143 185 -147 -172 -103 27 310 126 206 -215 -55 -114 25 6 132 -14
2449 -14 184 -180 -35 62 56 -101 -142 90 -283 -118 118 -171 6 149 -58 -8 -91 16 55 -276 144 -106 23
2472 23 91 -192 -135 16 -60 -171 -114 199 31 -40 43 243 173 -131 -64 45 253 -9 212 57 -42 -100 50 -77
2496 -77 205 35 -93 -196 -65 107 115 -3 298 97 153 4 51 142 -16 -131 -5 170 0 47 230 186 2
2519 2 -116 -132 397 -86 186 -156 56 0 -154 -43 167 133 111 -109 -333 104 -63 54 195 130 3 -185
2541 -185 4 45 154 106 -120 -56 -181 12 125 -87 -190 -123 259 -177 204 -210 45 34 -128 25 -22 -241
2563 -241 136 30 -264 19 162 99 81 -25 85 -203 -242 256 -91 -142 -22 -203 35 -137 152 -74 -180
2584 -180 81 35 -128 85 6 37 -94 -71 -163 -168 392 -236 87 43 -47 -97 108 245 -87 -37 -135 -133 226 294 -179
2609 -179 93 -129 -89 24 -96 227 214 134 62 -29 -122 -36 -50 -243 17 99 247 333 49 -247 134 -58 120
2632 120 60 -184 -104 -33 -24 -5 10 146 -27 -3 120 -185 25 27 -148 -137 -52 30 -217 220 113 -100 284 -164
2656 -164 -75 -36 -179 -66 -266 -149 -79 -41 -31 180 255 -180 -123 109 44 -100 138 -35 -81 -67 -118 -63 -216 105
2680 105 39 52 -25 -5 138 20 130 252 137 -56 157 241 -73 -45 200 61 -136 225 -324 40 219 -174
2702 -174 188 -144 -13 238 141 93 -85 56 -43 141 -13 144 78 57 84 -127 27 -58 217 -173 7 122
2724 122 -169 80 -85 84 258 -158 95 -109 -68 24 293 -113 130 -98 -86 5 173 -66 -13 -64 227 -93
2746 -93 347 248 6 -22 -121 69 32 -95 -35 169 -97 109 24 121 -26 -22 178 -48 99 -150 -152 -16 73 28 -320
2771 -320 -47 214 262 -20 70 -107 -125 -111 -326 -45 134 -85 43 4 137 -228 -11 -92 23 155 -64 137
2793 137 140 11 -14 -18 33 -100 -5 -69 57 66 128 -189 2 92 226 103 -138 -144 -149 -64 187 63 -109 -175 76 -46
2819 -46 -43 -2 169 -12 19 187 -56 -106 -86 106 211 79 135 200 -105 -195 224 219 -191 77 24 -51 -39 20 113 -97
2845 -97 198 -130 46 113 209 -46 212 111 -288 -79 -150 -59 -50 -25 134 290 116 0 166 82 -117 -37 -40 9
2869 9 -165 -134 -382 16 -41 182 136 -8 108 150 -102 134 0 -165 -237 -131 287 -31 -33 40 95 36 -249 -172
2893 -172 -131 87 -74 88 161 -76 273 -110 -176 -187 -33 -80 -202 -250 3 71 156 72 7 42 -206 3 80 -319
2917 -319 -168 179 107 -126 245 107 18 -228 65 -13 80 11 99 -1 -68 -79 -256 -27 -47 -78 43 109 80 -4
2941 -4 216 22 -338 -95 -32 19 -3 115 -27 -43 -108 -128 -15 6 72 -10 -172 -231 -59 0 3 31 78 -24 323 -33
2967 -33 -176 -44 7 227 100 27 -321 -10 6 -243 -15 151 63 -12 -7 203 -65 46 354 253 154 156 283 -220
2991 -220 9 -229 -20 30 0 69 135 126 -365 -49 12 109 -145 -37 -59 255 -123 18 246 97 105 -154 115 -147
3015 -147 -79 -207 -87 36 208 6 -181 117 88 1 -54 -10 1 -95 292 51 -71 -11 224 -63 46 -10 24
3038 24 -55 -49 127 27 124 -81 -77 -116 54 -102 39 188 26 -71 42 -141 211 -155 161 136 19 -280 145
3061 145 -185 58 267 -63 254 -160 172 -150 189 41 18 63 83 108 -335 331 32 -69 110 -202 270
3082 270 67 -72 76 10 237 -145 112 21 234 -42 -175 -68 28 -38 218 224 -95 98 201 -194 -95 24
3104 24 -142 -27 -60 -105 204 40 6 85 -43 35 -257 115 63 -113 -90 134 -38 -33 -46 24 -124 54 -137 -17
3128 -17 332 54 12 -29 -95 -158 -24 100 163 99 114 155 -263 -20 189 -224 5 -14 50 209 -42 43 -55 9 -135
3153 -135 -72 -255 -3 1 -20 257 -58 11 -93 62 106 104 33 -14 14 -275 358 71 134 209 59 113 48 55 -100 29
3179 29 139 -220 280 95 15 -180 6 -187 -62 -35 -44 1 -37 -3 -181 -24 -265 -139 -45 39 291 -29 -70 -41
3203 -41 100 9 335 130 -50 37 -174 -13 61 18 -39 93 -31 13 39 -134 143 116 87 -23 -165 -264 135 160
3227 160 53 234 -80 106 -211 -107 -32 -73 -340 201 143 -30 234 180 158 124 8 154 263 -205 -172 0
3249 0 267 56 44 -115 19 -107 117 71 -106 190 59 -179 -29 -35 81 -120 7 -40 -71 -49 -138 -153 -140 39
3273 39 -67 123 -8 -194 -114 -175 222 226 -138 -6 -29 88 1 -101 -200 65 -295 -40 -43 205 270 63 64 -43
3297 -43 172 258 337 -85 104 101 -115 139 161 38 -370 126 -29 5 143 -159 245 134 170 253 64 -8 57 7
3321 7 -172 -93 -36 -10 -136 -153 -243 -32 49 7 53 -58 -166 -22 -153 -76 -27 -147 -58 -38 -64 266 -34 107 -174
3346 -174 -127 -62 5 36 27 -91 -115 -203 292 15 -143 -109 366 -155 -188 27 -75 -6 31 -73 24 -7 -95 172 108
3371 108 -100 -124 -138 -41 101 -6 -1 -99 19 147 -71 -155 54 1 103 93 -5 -78 26 103 -1 186 -222 -120
3395 -120 176 60 117 -223 147 14 -57 51 -85 -215 -138 11 -248 -151 -136 -165 -131 217 126 -110 140 -188 259
3418 259 -342 97 -30 -104 170 -84 156 -91 -72 51 -65 -54 86 -45 59 -216 -139 -38 -1 22 -25 155
3440 155 -81 9 -190 -93 -117 63 114 -43 -150 -56 -111 -194 45 -174 -10 47 5 -124 63 -223 -65 -45 -106 436
3464 436 -84 -137 -15 69 -22 107 -117 -21 -39 32 -42 -41 -61 -120 -70 108 -24 75 -65 -73 163 -171 -72 -19 262 149
3490 149 -71 -94 6 -160 -169 -167 80 -221 -183 -85 144 -117 155 -122 133 11 -71 -226 221 75 -204 -195 -48
3513 -48 40 39 -100 90 217 -269 7 104 -243 21 29 -127 -139 74 -234 164 51 22 156 81 31 -21 139 -15
3537 -15 -71 -153 118 369 -87 -153 -233 -82 -311 93 -32 103 46 335 234 309 -34 273 28 94 102 -36 188
3560 188 238 256 42 330 -87 182 -108 -16 -173 239 66 165 -101 -158 163 85 218 -108 -8 23 -201 -103 -65
3583 -65 137 -68 -127 312 -118 -87 -315 -103 -205 -68 -53 129 86 -67 -294 -183 -166 -234 92 8 86 -32 -49
3606 -49 -132 -78 -175 71 -90 80 263 30 227 -65 -38 -116 23 -176 -149 56 -57 -21 -59 -127 -178 -99 23 -196
3630 -196 -54 157 -33 -159 -198 -134 153 119 -43 76 86 64 -240 -43 -73 -295 -86 106 -106 3 25 258
3652 258 -27 -183 -34 -129 -134 79 27 -199 -104 -238 145 -233 -51 -100 87 -131 92 305 -223 -70 -185 -92
3674 -92 -186 110 133 154 111 -8 -235 140 -114 -118 247 106 -85 -376 157 108 -39 -11 221 -9 75 -183 44
3697 44 -363 -228 130 -60 81 164 -84 -93 -33 -77 -39 -152 -102 -215 29 -26 7 -62 -120 -27 82 200 323 53
3721 53 196 38 32 253 3 191 -238 123 -136 165 -176 -238 -36 52 185 -97 98 -66 -153 -123 -105 -11 54
3744 54 124 -70 -6 141 -196 -108 -139 -146 77 -17 -8 -21 -253 -250 99 120 160 -83 -29 -9 19 -191 -124 -266 51 -130
3770 -130 -213 233 -56 -147 -64 -20 -88 -4 -37 114 -103 94 240 -114 -137 -119 -62 -252 -137 -26 28 -313 -89 1
3794 1 119 197 38 -66 -38 -90 -183 22 -9 192 -118 55 0 -3 -118 26 61 -225 -15 -218 10 -59 196 -121
3818 -121 211 -53 280 -362 -21 -62 -66 159 74 311 136 160 -8 45 29 -147 57 104 266 35 -349 81 9
3841 9 153 -58 93 -100 112 -105 221 10 -37 -53 135 -142 -166 -127 -39 -149 -352 73 -36 -18 42 -12 -181
3864 -181 -7 373 9 146 231 -65 6 -78 -182 -127 -253 64 129 93 -48 120 243 195 101 -72 128 230 -111
3887 -111 -28 12 -4 -260 -52 -80 -127 66 75 165 -91 -128 -139 -199 11 -98 -331 222 -317 55 -91 -106 15 22 42
3912 42 171 189 83 162 -133 84 130 267 -100 -70 -20 -296 340 -181 -46 75 -191 145 -198 109 73 195
3934 195 75 -7 -47 -7 117 73 -51 -157 -80 -224 -108 -70 25 -92 -69 154 -11 -42 304 -54 189 -272 -27
3957 -27 17 -171 158 -195 -47 119 95 57 -130 104 6 206 56 87 -237 205 -9 192 -252 182 53 -204
3979 -204 88 -183 51 -83 -298 190 -167 -66 17 67 38 23 -103 91 -78 5 52 85 55 285 -50 28 47
4002 47 45 238 -222 160 9 172 246 0 154 -252 -193 -235 -28 -119 -139 68 -210 -126 -177 -185 -42 -83 -64 46 -80
4027 -80 -140 177 39 -214 185 15 96 -30 164 117 41 171 153 211 -112 272 -123 -79 -28 6 125 -132 -74 41
4051 41 34 12 -202 -26 32 -189 -109 -135 -109 134 161 -53 308 -239 37 -384 30 -285 -90 -59 -143 81 -262 -116
4075 -116 148 58 -153 -215 -14 75 195 -130 86 -278 204 -123 52 -188 -256 -2 -95 -310 30 39 127 35 -95
4098 -95 119 30 -50 -119 -193 124 277 -190 -123 95 209 101 146 -205 60 -175 126 159 -1 64 -40 104 -155
4121 -155 68 -218 76 -232 -140 -95 -214 -44 177 8 252 244 127 -34 161 -93 -162 94 -185 -234 -169 -38
4143 -38 -75 157 -285 82 71 -148 -158 67 113 -98 -29 -15 119 102 -229 66 -45 4 -85 -19 -195 202 14 133
4167 133 -97 -6 29 -171 217 188 1 39 186 208 -233 209 183 63 99 54 -206 -145 203 -8 -205 13 -138
4190 -138 -76 -104 4 148 -87 156 -147 -38 39 12 221 40 -58 135 -3 -283 -31 106 -110 98 6 -35
4212 -35 76 98 -154 96 -251 -151 129 -4 15 186 -27 144 57 -126 -97 -97 147 -67 32 -79 96 -220 -115
4235 -115 92 161 -108 -66 -126 -155 -175 -14 39 -96 84 -227 -20 224 -60 25 -14 -28 -3 117 253 -149 -25
4258 -25 237 206 -174 -36 147 274 120 -69 -89 -201 -67 95 -2 -178 -13 60 -110 -103 -95 -12 -7 138 -29 -31 -62
4283 -62 -67 0 312 122 4 144 -24 98 -25 -267 179 -98 33 100 125 20 -406 1 164 290 26 57
4305 57 -211 178 380 15 -61 177 103 88 -110 -5 63 -46 -163 222 -359 22 -51 -13 90 13 62 297 -178
4328 -178 -46 57 253 68 214 94 -118 231 169 110 -10 193 -20 125 111 -68 -51 -199 -28 209 272 107
4350 107 130 93 51 244 -80 13 -328 -71 -18 283 53 97 15 100 22 -224 -1 -94 85 7 211 16 -116 412
4374 412 -52 178 -161 -68 -213 -163 190 -9 -87 20 32 103 180 90 206 -13 -135 -66 158 -51 130 -63 -329
4397 -329 94 -2 170 -100 129 -270 -124 23 -35 -184 161 -150 54 134 -124 103 35 -62 -233 32 16 -148
4419 -148 -99 -25 125 -70 88 -151 -233 -135 -203 52 -332 -130 188 337 62 -96 -130 194 34 -287 -42 204
4441 204 -85 -42 -143 285 -163 172 63 -11 -116 44 326 -266 -35 -220 -57 -193 41 100 -99 70 154
4462 154 -172 30 -135 180 -283 -267 -333 -105 122 -25 -38 72 109 -151 408 18 146 -175 56 132 -60 207
4484 207 81 220 90 20 43 80 112 24 2 -47 -105 10 87 -6 -70 -34 156 86 -50 195 -152 56 63 -10 -301
4509 -301 -128 -146 9 -7 -105 112 -224 -235 60 -84 16 -98 -27 -29 -305 68 173 -47 -219 82 -128 63
4531 63 27 -7 97 23 14 148 319 -69 87 127 -108 174 46 228 -24 355 -9 -132 59 -229 215 -5
4553 -5 -270 -149 -86 -39 -26 49 -107 -105 56 132 92 -140 -30 59 121 -112 43 -114 151 -79 24 141 173 4
4577 4 -14 317 -142 -209 172 37 -68 -21 -444 -159 203 -74 343 -202 -115 58 -184 -144 0 -289 -24 -140
4599 -140 -49 -13 149 53 -61 -100 150 128 76 89 95 27 3 -37 87 -52 90 11 93 95 -47 78 -106 123 -178
4624 -178 87 171 -219 -60 -56 57 -109 132 199 -353 20 92 140 -3 -100 -120 252 146 144 -114 -39 -168 -38 -128
4648 -128 -42 91 -57 127 -167 28 -131 10 -3 51 13 61 188 -169 -27 195 -100 -163 83 -188 20 -73
4670 -73 -73 52 -50 -187 -71 -94 -364 -308 225 -49 -113 -24 -92 -101 -195 -76 106 286 1 -45 2 90 195 247 -90
4695 -90 -152 134 -153 46 -92 -340 104 63 -48 -29 91 -115 62 -36 -69 345 69 -69 -104 257 187 -94 209
4718 209 269 221 -93 -58 181 208 161 -80 -123 78 30 -117 12 -233 -211 -115 -4 -11 -268 4 52 -117 299 168
4742 168 -38 44 123 125 -39 49 152 30 55 -150 -69 59 -100 -217 88 -423 254 -190 108 -116 196 145 -241
4765 -241 30 -64 174 -160 71 -128 -106 113 167 148 -117 -300 220 146 162 -180 254 -172 -40 225 -226 -134
4787 -134 -23 54 133 70 54 188 46 47 128 -243 178 26 -99 -242 51 -5 -70 -165 -304 83 -222 -58 -35 216
4811 216 -140 360 68 -59 158 334 18 192 -71 -45 178 -78 -134 43 -140 140 103 84 11 -140 241 -81
4833 -81 -192 -160 -80 -30 2 108 -33 -99 188 12 73 24 242 -37 162 -59 29 -347 110 329 -69 174 100
4856 100 -62 -191 -171 -92 -42 -79 22 115 -78 -62 -152 240 -7 -157 114 -111 -81 -22 78 -121 -108 30 -89
4879 -89 91 152 -349 -43 73 134 -140 -1 -230 135 212 -136 104 159 17 26 17 -62 72 204 -95 -57 151 -84
4903 -84 -4 -4 -21 75 -25 35 -124 -107 -111 63 27 -263 -94 -22 -86 158 294 24 -44 -88 -78 -134 153 -3 -150 10
4929 10 -31 -48 -93 -205 56 -153 -55 187 -92 -147 169 292 -21 -45 -46 302 133 350 -223 51 -102 164 -95
4952 -95 118 -92 -75 262 -218 -65 126 190 107 158 197 -74 -99 -15 179 -235 -157 -89 207 114 101 28 233 -32
4976 -32 -98 -100 -211 -89 -91 21 76 143 -66 -135 59 3 223 -32 72 -40 8 83 -141 143 -78 -141 -121 -63 -326
5001 -326 154 196 143 -2 126 8 118 -262 -66 27 -107 -50 -227 148 176 247 111 46 -85 -73 -20 -36 326
5024 326 33 41 55 55 108 12 176 46 205 -107 50 75 -215 -26 212 -52 32 -6 -275 121 -206 110 -48
5047 -48 62 230 -46 59 -16 1 104 -267 -60 -3 -133 -9 -54 -80 -219 262 131 -90 -74 70 173 6
5069 6 -57 122 -31 -144 67 203 -208 -48 -14 -98 -102 62 -89 -103 48 -58 -78 -18 78 118 21 -65 -95 -109 -356
5094 -356 -154 -8 82 -47 -8 -156 -129 37 -84 270 -176 -12 -125 46 -154 -128 -9 -183 254 131 -162
5115 -162 198 77 -97 57 -117 -6 69 -21 -9 140 146 108 -11 103 -201 106 96 -115 31 -102 100 -90
5137 -90 167 82 94 136 95 -191 141 -108 65 106 -12 162 96 32 117 -86 222 -7 192 48 87 142 -56 95
5161 95 -121 114 75 157 54 -274 -79 -6 -153 116 -116 -30 -165 282 -144 186 -94 -222 194 110 -6 63
5183 63 -153 76 -7 221 273 -373 -149 112 398 64 72 102 18 74 -181 -74 202 132 121 113 91 306 13 95 6
5208 6 -166 409 -201 -211 16 -50 -162 -61 -4 -42 65 118 -232 3 203 227 -20 -195 40 175 -87 -153 98
5231 98 -249 112 62 -151 -218 244 -52 51 14 -53 -186 -90 -215 -309 66 -280 260 -156 -170 49 -186 -84 -45
5254 -45 -29 -80 -21 -67 -84 36 -81 175 56 134 -159 320 -254 28 302 15 60 71 185 93 138 -159 230 10
5278 10 32 -88 61 -121 68 239 134 98 -8 16 -80 178 5 -92 45 118 87 94 217 -19 -83 173 95 -65
5302 -65 86 76 -98 143 87 20 96 -182 78 16 -137 287 132 116 -93 -111 155 40 103 -158 15 -120 -252
5325 -252 82 -2 -66 275 94 171 19 -75 57 -268 25 -106 13 -24 -32 357 113 70 34 -36 -113 13 33 -39
5349 -39 75 8 -116 17 159 -170 65 101 108 318 -8 -218 -37 72 -166 -22 -122 191 25 33 -97 22
5371 22 -184 189 -84 197 39 -15 -203 -211 46 -99 6 -205 -131 286 -136 91 184 -39 -85 -27 -6 201 -18
5394 -18 9 142 -125 -191 -2 3 -15 -54 -158 99 10 -163 -109 -27 -139 -119 -118 -99 -37 183 40 -225 -148 -193 119 -12
5420 -12 93 175 267 -223 149 -75 -9 137 89 -32 13 257 -133 28 -126 -105 191 41 32 -340 -201 86 44
5443 44 -31 -43 79 37 -147 -126 92 -110 19 -157 -37 44 -197 220 -81 -170 -7 44 -278 -118 -121 10 150
5466 150 -78 87 -171 -81 99 -5 77 62 4 20 143 223 -27 66 89 -198 -243 11 -308 -65 -5 -188 127
5489 127 88 -104 17 17 -68 -19 -67 -45 67 -166 62 232 213 -222 -96 79 -129 -142 60 -55 -196 -39 -37 0
5513 0 -180 165 -154 -153 -9 263 30 3 56 -42 -187 -293 30 65 104 144 -310 -190 -512 -113 -156 6 163 -137
5537 -137 -99 -178 3 -175 -62 -64 -191 21 15 54 323 -174 4 116 -227 164 -35 58 245 8 78 -190 103
5560 103 -159 -369 -65 -34 108 -6 -243 -125 -18 -44 -61 86 0 -147 79 -167 26 86 -37 -188 -71 178
5582 178 -69 48 60 -35 107 31 -132 -43 -64 177 -11 187 -170 -134 17 11 -162 -54 323 6 -52 75 237
5605 237 -131 -76 183 -236 65 81 50 64 67 -111 56 -206 127 103 67 238 -68 121 -279 -300 70 261 -134
5628 -134 -37 -25 0 173 83 -188 -104 42 35 210 -86 243 -85 -122 -123 308 -269 -128 -73 64 -72 -286 -346 -157
5652 -157 -67 -2 160 -198 -43 65 -156 125 -2 161 50 -67 174 41 263 -114 115 27 154 39 276
5673 276 -277 -39 -125 199 -36 256 77 -153 -147 -50 -176 294 60 78 -40 -70 147 -21 281 -142 5 223
5695 223 -123 151 241 -308 -68 -55 115 100 -25 -14 -78 151 43 234 -24 48 161 21 -144 119 90 20 112
5718 112 131 -283 114 138 45 43 -154 25 -35 67 -32 66 -5 -288 -20 -125 97 72 1 30 -97 -94 -276 70 5
5743 5 -48 110 -295 198 165 132 110 1 -150 -131 111 176 194 -217 105 -63 28 -93 -2 -29 118 -135 234 114
5767 114 256 -19 -153 155 -229 -86 42 88 -130 -7 106 -100 -42 78 88 262 170 -14 150 -145 197
5788 197 -151 104 137 -62 113 -69 -177 -1 183 13 135 49 -31 109 -104 51 160 225 -200 21 94 146
5810 146 22 224 -37 -107 36 -95 -38 79 39 -94 173 -52 112 -69 -76 -86 -82 22 168 191 39 -5 165
5833 165 -128 -86 -82 190 -40 -92 -63 277 298 -99 14 -64 174 -35 17 -88 -130 106 -212 100 52 17 253 300
5857 300 -70 -200 -69 94 44 -213 -171 17 144 -10 225 -20 -191 -96 76 28 -64 137 106 52 48 31 -88
5880 -88 56 -9 214 96 164 62 -22 -93 -132 215 94 -73 -244 58 -302 -19 1 44 23 164 -240 -317 135
5903 135 61 -189 97 168 -114 118 46 -71 -113 150 73 96 316 -158 92 -72 -154 -44 133 242 218 -122 65
5926 65 125 0 7 191 -15 -40 74 -281 204 97 -314 -12 -30 77 -60 274 91 0 -54 -149 -203 -77 -78 -179
5950 -179 188 -46 42 182 -156 107 -175 325 27 -15 166 -47 -38 -113 -84 -84 -136 -9 158 18 -116 -169 304
5973 304 -63 -202 150 -116 418 124 69 -80 12 -44 56 204 17 120 -257 131 -29 -1 353 12 -228
5994 -228 -85 193 -5 -4 -38 41 -45 -12 0 -140 79 -149 -62 -140 72 -5 -234 -117 -27 15 -90 245 105 284
6018 284 -236 -253 24 -285 -211 232 50 20 52 -264 -137 37 -63 -58 -79 151 -12 -81 166 -92 -81 -156 -32
6041 -32 69 78 -61 -17 -101 -44 -107 -122 215 36 369 -45 193 -46 83 -165 86 -21 166 -71 -67 -26 130 222
6065 222 15 251 140 -170 -133 -41 96 -59 179 122 24 -39 8 -34 -50 -8 24 50 -62 143 180 -62 232 111
6089 111 -218 232 -137 129 -121 158 -158 -3 -182 120 76 -33 5 73 -179 242 198 64 105 -3 -52 9
6111 9 0 167 -69 115 115 130 -55 -88 65 -123 102 -248 -40 105 -29 -17 -35 67 -68 -144 -4 420 -129 53
6135 53 96 -29 497 214 113 -310 -57 -9 -78 -86 212 -30 -208 87 156 -10 -326 32 -41 -119 -135 -42 227 25
6159 25 -173 222 250 262 300 -40 94 -57 -18 -191 -1 46 -47 -199 97 -6 -19 56 113 9 22 -30 -48 305
6183 305 73 11 -52 -113 -2 -241 262 44 76 103 294 39 -161 140 104 58 69 55 -132 3 74 -154 215
6206 215 34 -348 157 61 -131 -165 -35 -14 -34 88 156 3 -12 4 -110 -25 399 -13 90 -130 -34 -110 -24 -39
6230 -39 -218 -32 -149 102 263 94 -101 -152 -181 142 -26 -92 -18 -133 149 11 -191 -102 -183 -202 272 187 137
6253 137 -46 30 43 -51 -216 75 57 -19 25 35 -11 -133 -158 -79 -26 24 -186 -400 17 79 28 88 -67 -223 -208
6278 -208 78 80 -6 171 194 -171 -38 -203 76 56 -192 -234 -168 8 -150 -33 -144 -355 30 160 -29 -90 393
6301 393 -48 164 -170 202 -88 56 -79 191 -127 -170 -9 156 3 -118 -129 -67 -152 183 -82 313 -68
6322 -68 -182 61 91 70 -105 -38 160 -106 -113 -103 37 26 -153 6 70 -2 -138 50 -49 -69 -21 -26 72 -66 141
6347 141 156 -118 -78 90 -162 -118 -231 -22 46 -126 -272 156 107 -44 65 -109 157 -138 125 22 8 277
6369 277 -49 258 258 -93 -2 11 13 139 -102 16 -37 263 2 -103 188 -177 192 191 -270 -213 -61 44 70 1
6393 1 -82 242 -90 41 11 -45 74 -12 19 -172 26 42 -17 -96 -165 144 64 83 -3 -14 41 74 370 206 2 -5
6419 -5 -69 68 157 32 240 98 -15 99 120 326 -55 -69 23 99 90 -32 199 201 301 190 -151 -346 -87 -32
6443 -32 -180 33 224 -181 145 -297 151 -192 362 94 88 38 124 -8 -95 229 -91 21 -49 76 173 -152 -161
6466 -161 68 157 206 -143 22 -158 -122 150 50 -33 178 -177 51 83 -300 57 -157 112 144 81 -276 -104
6488 -104 -30 57 72 30 98 3 71 251 27 142 -127 40 -210 -176 -192 -46 -154 -232 82 -18 -385 49 213
6511 213 266 -67 -59 158 -103 -42 107 -83 15 -42 -134 91 -241 -234 233 146 -115 -60 -126 231 -98 -59 -48 179 -399
6536 -399 6 -162 -100 -220 97 144 -97 -9 52 -126 194 138 -15 28 40 -214 -79 -98 126 7 -86 -126 139
6559 139 150 13 -31 327 42 5 -64 59 250 -65 -202 196 -56 -78 -41 -65 135 74 -101 -4 171 -118 -19
6582 -19 -153 48 -70 -45 46 -95 -29 101 41 -83 -90 0 258 118 284 39 -271 -161 -185 45 -139 -77 159
6605 159 -76 -61 23 18 -173 -56 88 -89 -46 -461 40 94 -44 28 -164 -94 -54 216 -184 -83 139 97 85 -72
6629 -72 -66 73 -278 -93 -71 82 -12 32 -49 9 165 -24 98 -98 -80 -110 75 46 3 90 -215 -76 234 70
6653 70 96 -3 -234 28 -45 -65 -52 6 -50 -299 77 173 -160 -63 -190 -93 46 13 3 -190 -155 -37 -51 45 317
6678 317 -19 -90 392 175 -157 252 -16 -188 -30 -73 180 -109 91 80 104 -83 122 201 136 67 71 210 -209
6701 -209 -210 367 -255 -30 -79 46 32 258 58 24 -109 -60 222 202 24 33 92 -103 -42 75 186 -98 -3 -145
6725 -145 195 -112 91 103 -134 290 131 140 -98 -221 -163 -8 196 -243 -161 86 -227 -36 151 238 47 59
6747 59 -203 137 -190 0 -39 -51 -211 56 -141 -16 213 25 -129 -46 116 -55 166 -16 151 -43 169
6768 169 212 56 -27 -204 -77 155 177 -171 -56 175 252 -81 140 -273 56 89 -205 -295 91 -261 -72 -39
6790 -39 -87 289 -2 -203 160 -21 103 -17 -79 -6 -48 -195 78 95 -20 -63 80 -45 -108 34 83 -123 -20
6813 -20 -16 92 -140 -51 -176 214 192 117 115 -35 187 147 110 -327 -87 -27 233 196 50 -3 11 101 71 -117 -127 121
6839 121 253 -139 99 -24 -23 -69 107 3 -56 25 64 -163 65 172 201 -15 -293 -85 -100 -35 37 22 129 197
6863 197 137 251 -180 264 148 -35 111 -150 -243 -21 -7 18 8 134 -23 139 -5 -318 -26 -74 -5 -65 194
6886 194 -11 -138 116 -53 81 50 -38 21 186 260 13 -1 105 13 -46 -96 -177 62 -30 200 379 -192 16
6909 16 -164 6 60 161 84 -186 -44 32 35 -196 110 136 24 -117 0 0 -253 53 117 -30 97 -170 -45
6932 -45 32 269 -324 69 111 40 -63 -16 21 180 -84 -355 76 70 -159 92 -119 -153 246 241 10 85 -100 -179
6956 -179 147 -259 -149 -2 -184 -79 -4 65 -148 25 202 208 -283 46 -82 -59 195 94 53 19 -139 -142 -180
6979 -180 160 -236 41 115 296 -266 255 7 -43 -98 -118 119 167 305 -102 -313 -191 -280 302 -58 -64 182 86
7002 86 -59 114 -114 -137 -264 -219 -22 126 200 80 335 -4 94 -177 54 244 294 22 -126 -89 -167 -53 63
7025 63 -129 553 142 -66 -62 -165 7 -99 -207 185 159 221 -4 55 -30 27 11 14 80 -128 -106 126 114 -34 -3
7050 -3 -213 190 260 203 140 -207 -100 -160 -227 -177 -123 -33 254 50 -17 6 -73 155 -332 83 64 -45 89 -245 -57
7075 -57 192 -26 20 -279 -56 -101 -3 -33 -105 7 122 56 42 -278 -203 -83 24 171 -3 30 -88 102 154 -246
7099 -246 -6 111 -160 -35 -175 164 -176 27 187 6 -106 68 -10 -64 -200 -21 -16 38 206 64 312 -147
7121 -147 43 -101 -40 -153 64 -7 -147 22 -104 -157 49 -79 130 94 34 -165 25 -41 -26 -38 -178 20 -100
7144 -100 -130 -113 -129 -111 149 -10 98 -401 41 -104 44 57 -233 360 87 62 121 29 210 -81 18 82 41 18
7168 18 -56 -226 89 -113 12 -264 -55 170 48 -123 -133 -37 -327 -81 133 101 -91 112 -24 18 -60 -160
7190 -160 157 160 111 20 73 -138 -41 -278 -56 206 249 210 14 7 140 116 -21 -107 40 46 65 102 272 107 109 -50
7216 -50 128 -129 -1 106 49 -66 104 -12 -165 -182 -53 -71 12 189 -96 47 -53 60 58 -107 -279 186
7238 186 39 -179 0 -230 38 140 52 -81 202 9 5 127 352 5 -174 197 -85 -41 75 224 3
7259 3 -241 -75 26 -25 157 64 -24 -44 -3 -137 88 -282 -46 -211 155 76 -101 -66 54 36 -10 -117 -162 -110
7283 -110 -308 -175 83 132 13 82 208 189 -12 -153 123 -8 118 50 -106 70 231 -17 154 -51 -315
7304 -315 12 -30 71 -126 32 55 82 -44 99 -10 14 -228 49 50 -70 -226 -24 -41 205 127 -114 -64 -322
7327 -322 -39 -74 -265 -150 107 118 -71 -172 20 -176 22 -87 74 -89 33 -136 129 -79 4 -168 -38
7348 -38 63 -377 -54 -81 -13 -31 -75 26 165 -78 56 -5 70 -195 39 -45 -398 -81 -277 289 131 -202 314
7371 314 60 -92 3 -100 130 110 -299 -73 -79 239 -169 22 282 -65 -54 175 -62 49 -161 108 228 35
7393 35 139 -116 -370 -216 0 31 -126 -159 171 96 -30 -263 61 -18 203 177 -137 -18 212 114 -4 -29 14
7416 14 -256 127 35 -163 -11 115 -259 206 13 -505 -34 178 0 18 243 53 -28 -201 32 -68 274
7437 274 -411 78 -172 -164 -106 -125 -136 -194 178 98 67 -125 -2 87 38 31 325 51 47 35 52 -206 -109 265 -11 81
7463 81 -226 316 -18 90 42 55 -251 250 189 -22 37 -127 181 43 248 171 120 3 37 -95 -155 -28 104
7486 104 -174 -266 -126 153 -104 63 19 -37 145 -180 -331 75 126 -132 -184 -35 -175 -15 -96 137 -149 -20
7508 -20 194 -27 -37 -30 46 -70 -105 -20 107 196 55 -107 3 177 -66 67 173 23 9 71 -130 -342 24
7531 24 66 107 82 1 13 63 -174 -196 -52 -16 1 -16 33 -152 -17 196 157 65 218 -27 -114 227 -154 -97 62
7556 62 -174 42 64 -163 -97 -1 81 -136 -35 -210 43 53 25 29 144 -146 -34 48 4 40 51 25 -110 19 28
7581 28 -81 -137 -48 -59 -7 15 -207 -104 16 -60 249 -226 -61 138 -132 100 124 -13 114 84 -101 -107 85 155
7605 155 -83 100 27 -250 -66 69 24 294 -79 110 20 71 -145 -72 103 33 -9 -148 8 29 219 52 183
7628 183 12 -156 0 -91 123 -81 148 -339 46 34 85 -379 -256 -80 -125 169 212 158 -17 247 211 267 -73
7651 -73 83 151 4 -21 38 -42 22 128 109 144 133 58 9 -180 75 -273 235 -77 18 -89 -38 -41 65 374 212
7676 212 120 -101 -255 -28 -19 -175 192 -177 66 52 -13 -265 235 -130 -321 98 119 -161 -173 32 -58 5 1 53
7700 53 92 -30 -93 38 -62 64 -34 13 249 -275 32 7 103 71 26 93 162 240 8 65 -33 -114 110 7 -24
7725 -24 -61 -106 70 11 119 26 -2 -95 41 118 120 110 83 -130 9 -221 -77 -40 21 -22 -217 -397 -207 -54 117
7750 117 91 89 260 188 195 -108 -165 -8 236 275 -151 -34 -7 3 -175 174 -2 187 -207 272 155 -122 240
7773 240 192 68 242 -119 -143 127 -87 -314 21 31 -136 36 -83 110 134 159 -143 -15 192 140 -41 148
7795 148 -118 129 22 -38 293 -3 -12 -47 -72 -54 -28 119 223 144 13 -37 -44 40 -69 169 206 -116 -74 32 -20
7820 -20 43 -36 154 134 99 -25 -62 137 -149 19 49 117 -113 126 44 -78 -64 -119 154 229 37 -28 -52 47 409
7845 409 -125 -328 75 -58 205 -100 -240 -75 -51 146 116 -181 -14 -159 -425 63 -23 -127 -112 -36 0 46
7867 46 -225 35 209 -29 221 -46 154 56 172 -57 -31 242 -121 -14 -63 -129 2 -186 198 87 -65 278
7889 278 59 -216 -54 -118 6 -28 -3 -252 -78 121 106 -110 8 -98 -9 379 246 98 -13 -33 98 179
7911 179 300 95 113 88 -237 33 -77 56 -144 -49 78 -69 106 -102 -175 -83 -250 -40 31 -70 -43 -123 20
7934 20 -81 74 -21 33 -230 -76 -123 -29 -118 62 90 -3 82 -68 293 -209 -16 171 93 86 319 -123 -100 -8 185
7959 185 -110 26 -71 -132 -77 -145 10 50 185 -46 -18 41 73 176 35 53 -90 -64 -83 -183 7 -149 285 128
7983 128 23 45 189 21 116 115 40 219 -13 -117 138 254 29 6 -59 -8 92 233 160 -67 35 2 247
8006 247 151 -234 106 -50 -195 -65 74 115 -239 15 77 177 162 110 -197 108 -61 -206 -122 -78 -33 55 -188
8029 -188 -85 -337 150 -160 -183 23 -268 -45 -57 17 -143 39 -63 135 67 81 16 187 58 105 175 -36 -124
8052 -124 -77 158 144 -181 91 200 -183 55 60 -102 -8 -124 40 78 351 -103 -36 50 -9 16 14 -27 -165 -200 -13
8077 -13 37 -94 145 18 -14 132 -81 -114 -29 -121 61 -65 -61 -214 -104 145 -134 183 -19 -7 135 -162 -250
8100 -250 227 107 29 -38 -150 144 -98 179 114 -343 224 -76 -89 -192 153 102 -122 -131 -245 443 -50 -236
8122 -236 70 -292 -144 166 -44 -183 140 64 18 -28 -235 118 59 -235 -117 167 -174 139 -67 42 29 59
8144 59 152 -77 -21 43 190 17 90 130 99 53 36 -137 -105 154 -21 -93 -26 218 100 -103 -258 -15 -38 -197
8168 -197 -54 61 162 113 -200 -74 -24 -71 -168 4 93 187 14 94 -74 -133 140 -76 6 -83 140 135 14
8191A4
##END NTUPLES=NMR FID
##END=
