##TITLE=1H_DE-10krTFA
 CDCl3
 8 sc, 
 4.9.2023
##JCAMPDX= 6.0         $$ Bruker NMR JCAMP-DX V2.0
##DATA TYPE= NMR FID
##DATA CLASS= NTUPLES
##ORIGIN= UXNMR, Bruker Analytische Messtechnik GmbH
##OWNER= root
$$ XWIN-NMR		Version 3.5
$$ Mon Sep  4 14:15:59 2023 Russian Standard Time (UT+4h)  she@DPX200
##.OBSERVE FREQUENCY= 200.13135
##.OBSERVE NUCLEUS= ^1H
##.DELAY= (6, 6)
##.ACQUISITION MODE= SIMULTANEOUS
##.ACQUISITION SCHEME= undefined
##.AVERAGES= 8
##.DIGITISER RES= 18
##SPECTROMETER/DATA SYSTEM= spect
##.PULSE SEQUENCE= zg30
##.SOLVENT NAME= CDCl3
##.SHIFT REFERENCE= (INTERNAL, CDCl3, 0, 15.7039)
##AUDIT TRAIL= $$ (NUMBER, WHEN, WHO, WHERE, WHAT)
$$ ##TITLE= Audit trail, XWIN-NMR		Version 3.5
$$ ##JCAMPDX= 5.01
$$ ##ORIGIN= Bruker BioSpin GmbH
$$ ##OWNER= she
$$ F:/spectra/data/she/nmr/H-F/1/audita.txt
$$ ##AUDIT TRAIL=  $$ (NUMBER, WHEN, WHO, WHERE, WHAT)
(   1,<2023-09-04 14:14:45.53 +0400>,<she>,<DPX200>,
      <created by zg, POWCHK disabled, PULCHK disabled
       configuration hash MD5:
       00 E9 B6 7A A2 85 ED C7 34 08 36 98 17 FE 4E 26
       data hash MD5: 16K
       B5 93 F7 59 2D 27 0C 4C 28 F4 BC D1 70 F5 B1 CB>)
$$ ##END=
$$ 
$$ hash MD5
$$ CE 6E 0A 17 28 A2 5E BB 99 7C D2 20 E9 0C 7D B6
##$RELAX= 
##$RELAX= 
##$RELAX= 
##$RELAX= 
##$RELAX= 
##$RELAX= 
$$ Bruker specific parameters
$$ --------------------------
##$DU= <F:/spectra>
##$EXPNO= 1
##$NAME= <H-F>
##$PROCNO= 1
##$TYPE= <nmr>
##$USER= <she>
##$AMP= (0..31)
100 100 100 100 100 100 100 100 100 100 100 100 100 100 100 100 100 100 
100 100 100 100 100 100 100 100 100 100 100 100 100 100 
##$AQSEQ= 0
##$AQ_mod= 1
##$AUNM= <au_zg>
##$AUTOPOS= <>
##$BF1= 200.13
##$BF2= 200.13
##$BF3= 200.13
##$BF4= 200.13
##$BF5= 200.13
##$BF6= 200.13
##$BF7= 200.13
##$BF8= 200.13
##$BYTORDA= 1
##$CFDGTYP= 0
##$CFRGTYP= 5
##$CHEMSTR= <none>
##$CNST= (0..31)
1 1 145 1 1 1 1 1 1 1 1 1 1 1 1 1 1 1 1 1 1 1 1 1 1 1 1 1 1 1 1 1 
##$CPDPRG= <>
##$CPDPRG1= <>
##$CPDPRG2= <>
##$CPDPRG3= <>
##$CPDPRG4= <mlev>
##$CPDPRG5= <mlev>
##$CPDPRG6= <mlev>
##$CPDPRG7= <mlev>
##$CPDPRG8= <mlev>
##$CPDPRGB= <>
##$CPDPRGT= <>
##$D= (0..31)
0 1.2 0 0 0 0 0 0 0 0.06 0 0.03 0 0 0 0 0.0002 0 0 0 0 0 0 0 0 0 0 0 0 
0 0 0 
##$DATE= 1693822485
##$DBL= (0..7)
120 120 120 120 120 120 120 120 
##$DBP= (0..7)
150 150 150 150 150 150 150 150 
##$DBP07= 0
##$DBPNAM0= <>
##$DBPNAM1= <>
##$DBPNAM2= <>
##$DBPNAM3= <>
##$DBPNAM4= <>
##$DBPNAM5= <>
##$DBPNAM6= <>
##$DBPNAM7= <>
##$DBPOAL= (0..7)
0.5 0.5 0.5 0.5 0.5 0.5 0.5 0.5 
##$DBPOFFS= (0..7)
0 0 0 0 0 0 0 0 
##$DE= 6
##$DECBNUC= <off>
##$DECIM= 32
##$DECNUC= <off>
##$DECSTAT= 4
##$DIGMOD= 1
##$DIGTYP= 9
##$DL= (0..7)
0 120 120 120 120 120 120 120 
##$DP= (0..7)
150 150 150 150 150 150 150 150 
##$DP07= 0
##$DPNAME0= <>
##$DPNAME1= <>
##$DPNAME2= <>
##$DPNAME3= <>
##$DPNAME4= <>
##$DPNAME5= <>
##$DPNAME6= <>
##$DPNAME7= <>
##$DPOAL= (0..7)
0.5 0.5 0.5 0.5 0.5 0.5 0.5 0.5 
##$DPOFFS= (0..7)
0 0 0 0 0 0 0 0 
##$DQDMODE= 0
##$DR= 18
##$DS= 0
##$DSLIST= <SSSSSSSSSSSSSSS>
$$ [...]
##$SUBNAM2= <"">
##$SUBNAM3= <"">
##$SUBNAM4= <"">
##$SUBNAM5= <"">
##$SUBNAM6= <"">
##$SUBNAM7= <"">
##$SUBNAM8= <"">
##$SUBNAM9= <"">
##$SW= 18.05172834244
##$SWIBOX= (0..15)
0 0 2 0 0 0 0 0 0 0 0 0 0 0 0 0 
##$SW_h= 3612.71676300578
##$TD= 16384
##$TD0= 1
##$TE= 0
##$TE2= 300
##$TE3= 300
##$TEG= 300
##$TL= (0..7)
0 120 120 120 120 120 120 120 
##$TP= (0..7)
150 150 150 150 150 150 150 150 
##$TP07= 0
##$TPNAME0= <>
##$TPNAME1= <>
##$TPNAME2= <>
##$TPNAME3= <>
##$TPNAME4= <>
##$TPNAME5= <>
##$TPNAME6= <>
##$TPNAME7= <>
##$TPOAL= (0..7)
0.5 0.5 0.5 0.5 0.5 0.5 0.5 0.5 
##$TPOFFS= (0..7)
0 0 0 0 0 0 0 0 
##$TUNHIN= 0
##$TUNHOUT= 0
##$TUNXOUT= 0
##$USERA1= <user>
##$USERA2= <user>
##$USERA3= <user>
##$USERA4= <user>
##$USERA5= <user>
##$V9= 5
##$VALIST= <valist>
##$VCLIST= <CCCCCCCCCCCCCCC>
##$VD= 0
##$VDLIST= <DDDDDDDDDDDDDDD>
##$VPLIST= <PPPPPPPPPPPPPPP>
##$VTLIST= <TTTTTTTTTTTTTTT>
##$WBST= 1024
##$WBSW= 4
##$XGAIN= (0..3)
0 0 0 0 
##$XL= 0
##$YL= 0
##$YMAX_a= 78579
##$YMIN_a= -110770
##$ZGOPTNS= <>
##$ZL1= 120
##$ZL2= 120
##$ZL3= 120
##$ZL4= 120
##$ABSF1= 10
##$ABSF2= 0
##$ABSG= 5
##$ABSL= 3
##$ALPHA= 0
##$AQORDER= 0
##$ASSFAC= 0
##$ASSFACI= 0
##$ASSFACX= 0
##$ASSWID= 0
##$AUNMP= <proc_1d>
##$AZFE= 0.1
##$AZFW= 0.1
##$BCFW= 1
##$BC_mod= 2
##$BYTORDP= 1
##$COROFFS= 0
##$CY= 11.3945322036743
##$DATMOD= 1
##$DC= 2
##$DFILT= <>
##$DTYPP= 0
##$F1P= 15.7292609196834
##$F2P= 12.9074282941183
##$FCOR= 0.5
##$FTSIZE= 0
##$FT_mod= 4
##$GAMMA= 1
##$GB= 0.15
##$INTBC= 1
##$INTSCL= 1
##$ISEN= 128
##$LB= 0.24
##$LEV0= 0
##$LPBIN= 0
##$MAXI= 10000
##$MC2= 0
##$MEAN= 0
##$ME_mod= 0
##$MI= 1.114404
##$NCOEF= 0
##$NC_proc= 0
##$NLEV= 6
##$NOISF1= 3.799351
##$NOISF2= 2.8
##$NSP= 1
##$NTH_PI= 0
##$NZP= 0
##$OFFSET= 15.70392
##$PC= 1
##$PHC0= -21047.48
##$PHC1= 12.85272
##$PH_mod= 1
##$PKNL= yes
##$PPARMOD= 0
##$PSCAL= 0
##$PSIGN= 0
##$REVERSE= no
##$SF= 200.130013532006
##$SI= 16384
##$SIGF1= 3
##$SIGF2= 2
##$SINO= 400
##$SIOLD= 16384
##$SREGLST= <1H.CDCl3>
##$SSB= 0
##$STSI= 0
##$STSR= 0
##$SW_p= 3612.71676300578
##$SYMM= 0
##$S_DEV= 0
##$TDeff= 0
##$TDoff= 0
##$TI= <>
##$TILT= no
##$TM1= 0
##$TM2= 0
##$TOPLEV= 0
##$USERP1= <user>
##$USERP2= <user>
##$USERP3= <user>
##$USERP4= <user>
##$USERP5= <user>
##$WDW= 1
##$XDIM= 8192
##$YMAX_p= 0
##$YMIN_p= 0
$$ End of Bruker specific parameters
$$ ---------------------------------
##NTUPLES= NMR FID
##VAR_NAME=  TIME,          FID/REAL,        FID/IMAG
##SYMBOL=    X,             R,               I
##VAR_TYPE=  INDEPENDENT,   DEPENDENT,       DEPENDENT
##VAR_FORM=  AFFN,          ASDF,            ASDF
##VAR_DIM=   8192,          8192,            8192
##UNITS=     SECONDS,       ARBITRARY UNITS, ARBITRARY UNITS
##FACTOR=    0.0002768,     1,               1
##FIRST=     0,             0,               0
##LAST=      2.2672688,     0,               0
##MIN=       0,             -110770,         0
##MAX=       2.2672688,     78579,           0
$$ Real data points
##PAGE= N=1
##DATA TABLE= (X++(R..R)), XYDATA
0 0 0 0 0 0 0 0 0 0 0 0 0 0 0 -7 8 -8 8 -8 8 -16 16 -20 24 -26 32 -40 45 -50 58 -66 79 -88 100 -114 127 -144
36 -144 162 -181 201 -225 250 -279 310 -342 381 -421 462 -511 560 -620 682 -752 827 -914 1011
55 1011 -1118 1242 -1383 1548 -1743 1977 -2265 2628 -3102 3756 -4707 6237 -9102 16337 -75888
70 -75888 -110770 -17066 -80959 -44292 44688 35937 6704 78579 72954 15972 35588 58646 11180
83 11180 20587 59447 40727 19739 37726 20698 -6900 -15071 -37377 -64160 -59852 -62662 -65831
96 -65831 -40851 -20428 -24113 -8927 8807 3882 5872 18674 10699 7540 28051 38915 36489
109 36489 48096 55944 41052 26188 19715 4643 -14944 -28329 -37574 -41242 -35107 -30792 -28258
122 -28258 -19212 -16030 -22968 -18439 -9493 -16028 -13882 5232 7188 7844 38126 50038 29028 36199
136 36199 50859 19655 602 20336 4807 -27985 -10969 163 -26156 -19497 772 -23627
148 -23627 -37516 -16364 -22920 -38415 -18423 -6434 -13088 3654 22787 22306 29103 33760 21938
161 21938 20773 23736 9639 7580 15765 2592 -2820 10709 1365 -14850 -6886 -14341 -37203 -29893
175 -29893 -18748 -31917 -26686 -4667 -6461 -5497 15223 17747 8480 16429 18350 8626 15171 22550
189 22550 14853 16094 22296 13356 7797 10111 -2608 -17389 -16721 -21058 -30782 -23763 -14458 -20368 -17763
204 -17763 -3823 -3887 -8298 772 4270 -3661 1416 14601 14842 15579 26125 27226 18825 19315 19095 6673
220 6673 -2176 -4568 -11050 -15512 -12532 -11533 -11953 -11612 -13467 -13613 -11319 -14540 -16027 -9188 -7645 -6738
236 -6738 7221 17027 12893 17934 26254 16718 10199 17438 10157 -3414 1800 5403 -4084 -2028 5123
251 5123 -4427 -11741 -8080 -12713 -20366 -17290 -15122 -16675 -9668 -1030 3379 8779 12103 10194 10200 10261
267 10261 6546 6239 8027 4774 5105 10631 9708 5441 5634 1237 -8641 -11618 -11377 -15973 -17438 -11946
283 -11946 -9133 -7473 -276 4291 3084 2415 3539 2063 1161 3711 5857 6453 8341 11420 12874 11155
299 11155 8188 3817 -2165 -7292 -9851 -10639 -11139 -10294 -7808 -4964 -2897 -771 6 -1744 -3756 -3758 -1873
316 -1873 -493 2803 6758 9205 10630 12657 12917 9558 5395 1146 -3515 -6530 -6290 -5791 -6057 -5238
332 -5238 -3423 -3590 -4026 -4019 -5070 -7756 -8024 -5445 -3261 397 5766 8586 9072 11334 12466 9135 5910
349 5910 4561 274 -2428 -527 17 -1306 -664 -718 -3621 -5190 -5799 -8770 -10791 -10568 -9355 -6674 -2160
366 -2160 1594 4207 6720 7086 6779 7737 6186 3911 3951 4342 3409 5321 7055 4650 1852 1500 -2146
383 -2146 -6889 -7275 -8131 -11695 -10940 -6554 -5534 -3814 654 1550 -501 855 2530 927 1735 4497
399 4497 4396 5148 8908 9606 7502 7017 4650 -337 -1982 -3036 -6262 -6640 -5108 -6372 -4965 -1426
415 -1426 -2625 -4439 -2519 -3765 -6318 -2257 605 -1279 2368 7174 5949 6558 10500 7097 2024
430 2024 3541 1614 -3307 -880 511 -3626 -2396 648 -2825 -3813 -1369 -5373 -8422 -4843 -4415 -5482
446 -5482 123 2822 965 4673 8433 4548 3909 5929 1500 -1159 2694 2193 -293 3038 3120 -1354
462 -1354 -458 606 -4934 -6864 -5087 -7619 -7931 -2818 -1428 -1547 2642 4144 1531 3608 5062 1084
478 1084 496 3474 2035 1806 5891 5944 2438 3392 3054 -2151 -3585 -2865 -6863 -8971 -4746 -4012 -4908
495 -4908 -988 908 -1868 -342 1782 -1371 -1200 2174 846 847 6301 7214 5086 7829 6926 1629 1795
512 1795 1403 -4401 -4526 -1867 -5565 -6169 79 -1121 -5089 -1316 -1392 -6801 -4026 -715 -4836 -2466
528 -2466 3989 2558 2763 9153 8109 3326 5490 4970 -224 922 1782 -1975 -1155 1997 -1035 -1823
544 -1823 1044 -2665 -6665 -4467 -5743 -8065 -4149 -1934 -3827 476 4865 2015 2692 6374 3173
559 3173 -114 3373 3311 399 3030 4746 1608 2150 4559 452 -2562 -1385 -3760 -7265 -5196 -3150
575 -3150 -4870 -2942 -154 -927 -214 2209 462 -1076 1302 1026 -598 2544 4537 2931 4140 5413
591 5413 2643 1671 2479 -1659 -4265 -1732 -2569 -5335 -1601 87 -3199 -1876 1001 -2281 -2915 633
607 633 -1813 -3403 1800 2878 509 3845 6111 2217 2582 4584 610 -1045 838 -1753 -3441 318
623 318 -109 -2929 -565 -79 -3872 -2592 -965 -4288 -3421 -186 -1304 -809 4300 3519 1287 4370 4453
640 4453 214 1480 3262 -662 -501 2562 494 -535 1970 216 -3142 -2229 -2002 -4936 -4219 -2268
656 -2268 -3527 -2609 372 680 727 2688 1924 470 1403 2165 978 1833 3202 1996 2295 4049 2103
673 2103 365 819 -972 -4008 -3073 -2020 -4152 -3534 -803 -1954 -2164 493 -188 -2216 -458 184 -1336
690 -1336 406 2861 2175 2695 5120 3986 2542 3535 1687 -1017 -330 -803 -2720 -1164 -124 -2256
706 -2256 -1768 -120 -2177 -2958 -1747 -2801 -4119 -1517 -112 -1199 1530 3413 1841 2534 4123 2214
722 2214 1027 1810 768 -483 1018 1377 127 993 902 -1034 -1159 -1036 -3242 -3620 -2712 -3229 -2743 -87
740 -87 474 31 1676 1885 665 770 1515 377 -40 1695 1686 1478 2636 2507 982 617 401 -1477 -2495
759 -2495 -2069 -2450 -2508 -1703 -713 -412 341 394 -181 187 -163 -604 79 728 830 1263 2825 2492 1662 2009
779 2009 1349 -695 -830 -563 -1892 -2215 -824 -1055 -1448 -53 173 -1003 -970 -727 -1338 -1301 -301 257 530
798 530 1628 2362 2510 2571 2120 1058 424 -245 -635 -138 -490 -1072 -513 88 -707 -1138 -776 -1730 -2529 -1798
818 -1798 -1488 -1584 -605 697 942 1391 2272 2187 1601 1328 1357 842 659 945 1412 712 590 800 207 -909
838 -909 -1074 -1613 -2596 -2784 -2059 -1628 -1561 -757 41 12 242 863 688 495 457 925 1211 1464 1891 2266 2119
859 2119 1455 917 586 -379 -1175 -1337 -1673 -1956 -1170 -693 -1171 -997 -684 -879 -1410 -555 -471 -1013 -184 738
879 738 1103 1570 2234 2191 1568 1512 1055 205 37 -233 -724 -179 -70 -438 -327 -194 -1070 -1713 -1147 -1716 -1923
900 -1923 -823 -674 -539 670 1538 1184 1325 1663 726 283 805 735 -57 524 952 128 560 754 -276
919 -276 -827 -877 -1715 -1975 -1215 -1201 -1179 27 233 239 805 1146 324 131 652 -111 15 975 1065 429 1289 1379
941 1379 76 151 -129 -1351 -1913 -944 -1422 -1571 -597 62 -485 174 573 -200 -158 439 -194 -184 786 801 1169
962 1169 1763 1631 803 1400 918 -663 -688 -576 -1500 -1455 -283 -812 -1151 -163 -173 -1532 -515 -451 -1337 -717
982 -717 199 203 331 1783 1699 1119 1924 1529 281 748 590 -744 -342 346 -600 -231 521 -656 -1289 -476
1002 -476 -1252 -2192 -1214 -810 -1657 -458 933 340 765 1622 1222 416 1289 974 -75 681 1043 219 503
1021 503 1365 239 -262 294 -733 -1707 -993 -1316 -1741 -1032 -446 -924 -26 463 -20 -48 737 39 -385 696
1041 696 814 249 1270 1916 834 897 1131 -28 -813 -46 -950 -1632 -407 -482 -1138 -669 -50 -914 -824 185
1061 185 -792 -994 195 34 -358 1391 1206 602 1262 1628 46 305 691 -339 -747 349 -129 -852
1079 -852 199 -6 -941 -349 10 -1442 -1016 -147 -763 -488 739 457 57 1195 975 73 779 1050 -254
1098 -254 -43 785 -52 -95 832 -30 -800 -119 -274 -1465 -851 -724 -1406 -1021 -15 -295 -66 873 733 87
1118 87 850 652 10 552 976 347 550 1096 511 -52 483 -323 -1025 -402 -838 -1505 -984 -499 -922 -436
1138 -436 262 -66 -528 240 -25 -398 414 813 337 862 1693 1021 961 1632 394 -101 301 -220 -966 -504
1158 -504 -444 -976 -279 3 -706 -697 -67 -812 -1189 -218 -325 -689 338 771 344 999 1496 658 688 1069 267
1179 267 -124 584 238 -202 183 272 -403 -179 -75 -1083 -1174 -468 -1190 -1103 -205 -150 -288 461 608 224 558
1200 558 749 193 69 549 172 95 743 615 117 496 282 -559 -485 -491 -1167 -979 -431 -744 -461 289 299 -154
1222 -154 295 324 -366 189 234 -31 184 961 596 414 887 590 -1 -60 -163 -813 -610 -343 -727 -321 105
1243 105 -302 -148 -95 30 -357 -239 -13 -251 88 500 433 342 825 783 233 488 28 -395 -168 -68 -617
1264 -617 -316 169 -156 -304 -144 -166 -546 -233 -357 -743 -218 297 178 378 989 725 496 593 565 31 89
1285 89 130 -109 126 144 -40 -129 -44 -502 -301 -562 -748 -830 -407 -404 -135 4 286 397 434 439 370 390 384 322 317 374
1311 374 572 393 341 579 -118 -230 -195 -701 -751 -652 -704 -620 -341 -298 -248 -75 -41 89 99 84 39 210 520 516 796
1336 796 677 530 616 225 131 65 -302 -156 -453 -416 -220 -206 -108 -342 -319 -278 -234 -450 -321 -186 -238 102 379
1359 379 586 435 599 539 237 252 38 131 23 -17 -89 200 81 -268 -214 -266 -441 -180 -541 -290 -439 58
1381 58 -95 187 485 416 146 360 248 -9 40 108 164 -125 310 158 132 -26 -210 -289 -555 -359 -498 -534 -232
1404 -232 -334 39 168 56 27 246 190 68 119 254 -6 124 491 401 316 325 300 -67 -171 -189 -519 -312 -201
1427 -201 -219 -272 -68 -62 -81 16 -11 -98 -42 68 19 122 426 492 556 791 484 228 225 171 -378 -182 -368 -468 -176
1452 -176 -80 -155 -321 -54 -64 -354 -335 -305 -559 -179 207 -29 478 666 394 346 531 382 184 358 76 -38
1474 -38 -31 130 42 -189 -102 -277 -451 -415 -492 -548 -326 -292 -239 -97 291 -41 62 371 86 100 413 148 47 396
1498 396 279 162 331 319 -203 -35 -15 -156 -374 -373 -188 -285 27 173 -271 45 238 -290 -268 250 -79 36
1520 36 328 307 18 414 439 179 204 281 -84 -190 -188 -151 -368 19 82 -417 83 145 -296 60 130 -296 -273 92
1544 92 -142 -34 321 197 23 374 243 -182 259 86 -255 -261 94 -21 -206 257 -157 -463 29 11 -658
1565 -658 -287 82 -184 112 159 16 114 292 309 -129 160 67 -96 51 216 -165 144 181 91 -420 -86 -477
1587 -477 -414 -78 -171 -353 -8 150 4 84 394 18 32 77 98 -71 302 412 74 201 421 137 -139 48
1609 48 -151 -678 -177 -188 -444 -264 -30 -223 -111 204 -253 -45 12 -57 -134 59 145 -58 380 498 45 377
1631 377 146 -23 -204 195 -151 -261 165 169 -73 67 74 -284 -100 -248 -385 -199 -4 -224 -298 217 234 38
1653 38 301 335 -67 84 379 92 -130 306 106 -132 298 53 -188 -38 -132 -420 -214 -215 -198 -245 266 -244
1675 -244 -25 188 -54 -115 -116 114 43 105 -60 103 87 195 228 93 331 31 -411 22 -205 -163 -32 156 108
1698 108 12 368 97 -223 79 -16 -70 104 50 -3 -77 286 75 137 189 166 -142 -156 -226 -217 -214 -9 81 -162 23
1723 23 98 -109 -85 -247 31 -56 62 -48 182 143 175 373 208 108 -23 136 163 -201 249 37 -195 49
1745 49 164 -28 -149 130 -98 -270 -147 166 -202 64 103 105 330 350 56 -50 163 24 73 232 -133 -118
1767 -118 141 223 -139 -137 139 -430 -411 -231 -364 104 120 79 -94 123 80 -92 34 166 124 254 267 -161 19
1790 19 36 -54 25 148 84 9 -10 -58 -188 -180 -27 -213 -185 19 -108 -261 58 30 21 -101 -29 -26 13 283 136 198
1816 198 144 298 66 83 229 -35 -49 -21 -27 126 -106 -26 30 58 118 -210 -286 -246 -240 -31 -150 -22 -117 8 194
1841 194 111 -77 67 50 -59 40 6 41 71 -124 70 95 -166 -193 -241 -210 -212 -72 67 -100 88 107 64 229 -14
1866 -14 -36 -140 138 75 -15 190 21 -84 206 138 155 29 26 -85 -167 -188 -72 -36 -159 160 9 25 -131 100
1890 100 -203 -108 -10 123 62 -11 81 89 75 73 147 -69 -26 -235 -22 23 -5 -88 55 -49 -90 -201 -63 -43 -264 -38
1916 -38 10 -27 6 136 136 177 152 231 182 125 -245 17 197 -46 -128 100 81 8 14 149 -195 -149 -123 -58 -87 35 0
1943 0 212 289 147 -7 82 17 3 261 139 106 -7 -6 -52 76 -99 153 4 -199 121 -50 -282 -18 -141
1966 -141 -233 11 105 -25 28 -105 -27 -89 126 79 43 151 111 -46 136 152 -29 78 -95 -27 -113 33 -100 -88
1990 -88 -41 58 -237 56 37 -113 -194 264 -58 -162 4 28 113 45 -33 -238 59 -133 -106 -26 -163 27 -80 24
2014 24 -279 21 111 -42 -227 6 27 51 -10 20 188 -119 155 -161 7 68 141 -87 -29 30 23 -126 184 -68
2038 -68 114 -193 -168 -66 12 -146 -111 -15 -73 -116 70 -15 -77 167 78 37 -58 149 -27 1 255 84 48 322 -28
2063 -28 133 -213 -45 -133 -176 112 -74 -101 19 87 21 4 174 -92 148 172 57 55 98 -47 176 211 214 -57 -53
2088 -53 29 -50 43 69 22 -79 3 40 -56 -84 34 82 24 -103 -139 55 157 208 47 272 -37 -141 87 -15 33
2113 33 -10 16 -62 -146 227 13 23 29 -77 -76 31 -148 -101 -90 186 -9 -166 68 89 -45 45 94 -128 -2 86
2138 86 -13 60 16 18 62 14 5 -193 -40 211 -26 -201 -65 -122 0 116 98 56 90 24 140 -50 28 -86 14
2163 14 -66 125 93 190 -146 60 -79 -129 -136 81 -98 -137 -99 -86 -111 -30 107 23 -133 -94 121 -13 82 66 -104
2188 -104 53 105 107 -63 313 -26 -33 66 -98 100 -74 -30 -45 75 114 -11 0 -59 -137 111 65 -117 -149 -70 -7
2213 -7 11 209 27 88 -121 -113 27 171 -44 -69 -8 42 -136 -359 -100 -2 74 -224 -5 215 35 -4 251 201
2237 201 -89 232 155 113 -165 -72 162 -41 129 6 106 116 153 55 128 52 -50 43 -74 75 -54 -110 60
2260 60 33 -14 -135 -1 -24 82 105 76 37 161 -297 -51 25 170 87 -194 -3 -1 128 -136 -43 -146 4 -118
2284 -118 102 10 -135 -168 -86 -45 -43 -7 -96 -17 124 149 152 61 81 128 -25 -68 214 66 174 76 -182 98 -238 3
2310 3 -133 17 -157 -43 -15 159 32 54 39 -53 38 -36 36 -7 92 173 -16 -189 184 18 73 50 -43 -70 -8 -101
2336 -101 -112 -8 108 9 -105 -56 -148 -6 2 2 269 -32 173 141 -22 -28 209 65 84 146 -190 17 -38 73 -14
2361 -14 -17 69 172 -11 12 -112 51 -75 58 -78 64 224 61 126 -94 -70 60 -26 -17 -90 -300 -189 -82 -10
2385 -10 19 -3 -49 34 -256 -87 21 -139 110 -119 50 47 -2 -11 47 25 -1 57 -48 128 106 108 -4 -96 -17 36 15
2412 15 -122 9 -120 -130 -67 93 24 -73 1 19 -173 -57 50 80 62 -48 78 131 106 151 71 -153 114 -87
2436 -87 -74 3 155 -130 114 -21 -184 -5 -15 139 -72 -178 218 -10 -79 -91 -6 -224 -34 -66 -12 159 68
2459 68 -3 47 -57 -24 44 72 -68 59 -78 -210 -132 25 -77 -191 102 -109 -193 -102 -28 -188 77 122 -8 -29
2483 -29 170 107 -33 168 -101 -152 -70 -158 -159 -83 -51 -127 -39 54 -8 -191 42 32 -81 22 18 -75 -46 166 189 -113
2509 -113 -83 3 38 249 72 -41 37 -32 20 155 61 -42 -204 90 -151 -114 42 -110 24 -198 33 -138 -63
2532 -63 133 34 11 167 -14 -54 -24 -92 -286 14 22 -158 -116 -64 5 -94 -33 -391 2 33 82 -82 61 -161 -14
2557 -14 154 142 167 -109 144 -11 -74 -123 -111 263 162 -210 4 -91 11 -118 -56 120 -22 189 -122 -111 -171
2580 -171 -154 -189 16 95 -86 -45 41 -18 261 -75 100 -73 -219 24 -4 -118 67 -5 31 86 -69 56 202
2603 202 -5 45 -116 -168 107 -143 101 153 96 26 96 -116 -11 -4 159 -203 41 133 -68 -118 22 -63 -185 13
2627 13 44 16 85 91 -70 -141 -78 141 5 175 80 10 -101 189 -119 140 88 -213 -97 162 125 59 -54 51
2651 51 4 141 -10 -157 -126 23 -72 201 -26 -118 -400 3 40 -63 -72 155 -55 -16 83 53 -107 -25 65 -179
2675 -179 -2 98 50 -111 32 53 -59 -50 201 3 -165 -38 -60 -50 50 -107 -176 244 -97 -58 140 -6 -6
2698 -6 116 -80 11 -90 -36 69 122 59 -15 -51 -138 136 118 145 138 -125 30 -96 -57 43 230 64 229 -7 8
2723 8 -103 57 40 -29 57 -2 -44 -76 46 -66 -169 -14 -13 -17 -27 226 18 36 -63 -30 43 -112 157 -49 121 25
2749 25 203 65 8 -258 -75 65 80 34 77 10 26 -29 -1 38 -22 -214 -67 -46 13 -81 122 332 17 21 139
2774 139 13 140 17 50 232 35 127 -89 -103 -59 -144 -11 87 80 -16 31 56 82 82 7 -9 -15 -25 88 77 -31 -19
2801 -19 -55 -379 156 -7 -26 80 -101 -73 93 57 70 -74 -19 -74 24 140 -31 -73 297 -62 -207 -37 -23 11
2825 11 -154 80 175 -127 13 8 -91 243 89 58 89 -27 -75 38 145 186 -189 124 243 -139 -65 -132 -18 -46
2849 -46 222 14 -174 107 -30 108 81 -7 54 -145 -96 118 -125 -144 -1 -6 13 68 -213 -276 130 -156 -115 61
2873 61 -13 16 9 -19 -91 121 82 49 83 -142 33 44 -71 178 92 139 27 130 23 -47 32 75 -145 42 30 -88
2899 -88 96 49 -6 79 4 186 -17 -29 -115 -239 133 -144 -104 -101 -20 -120 266 -97 -48 -78 109 -37 -65 -132 44
2924 44 -60 -24 -182 -16 -4 8 0 173 16 -137 89 51 140 -56 41 -35 -19 -28 -14 -101 -134 -13 -94 -158 45 -94
2950 -94 24 -144 -15 62 5 -125 -82 123 102 61 63 -143 53 64 -156 -36 76 170 181 -70 105 14 10 -76 -166
2975 -166 3 51 42 57 177 190 -27 -65 100 -112 62 -22 -25 -44 -38 -179 -176 147 -185 42 -170 -1 -5 105 -100
3000 -100 15 127 -13 5 104 51 -129 27 -28 19 120 178 -85 -74 18 50 -7 -152 99 76 -166 102 -20 -51
3024 -51 40 135 165 201 86 -34 120 -49 -13 -30 38 226 -151 21 -38 -12 5 57 165 171 19 -8 -80 122 50 -104
3050 -104 -84 -104 50 -58 14 -84 -26 -77 -47 65 -66 131 -229 -133 -43 50 -60 85 44 -163 13 45 77 183
3074 183 100 61 -47 -33 91 -132 -51 15 -124 -188 -63 -71 -75 -222 -154 -74 -81 -138 -164 -132 -51 -152 -94 118 88 -79 252
3101 252 138 -70 36 -82 73 -76 12 152 58 25 -302 56 -50 56 71 -180 -70 -152 -35 152 55 -58
3123 -58 -74 -85 -62 -34 154 33 88 -46 -122 127 -52 43 24 98 216 -86 203 66 -125 45 94 88 -114 76
3147 76 -51 61 -31 34 -125 54 -74 -60 152 -54 -93 -118 41 -120 -314 -33 -168 -74 -13 47 -3 171 -36
3170 -36 193 -46 -118 97 191 -113 -190 -63 135 4 174 -156 69 171 -138 -165 -277 -77 -112 30 44 -156
3192 -156 -73 42 -118 142 -191 74 201 199 93 -43 -104 -34 18 109 -151 -212 -252 -76 -8 59 163 70 -90 -75
3216 -75 -85 129 -76 -63 216 -5 84 -141 138 54 188 117 -76 125 102 -155 -66 1 -148 -230 -26 -128 -124 37
3240 37 104 -69 112 113 -203 -125 -57 56 -66 -104 -141 14 61 -79 43 31 -10 -41 184 -65 -154 -39 -20 -5 -56
3265 -56 -306 40 -122 -42 112 220 -90 3 -8 -113 45 -69 -126 164 75 137 100 84 146 -91 -16 -185 -61 -10
3289 -10 139 -106 17 9 157 263 -23 -31 11 4 -121 -11 165 -126 47 49 -71 217 -67 -38 13 15 -210 44 30
3314 30 4 -11 -60 -28 -12 77 -98 140 -212 31 -127 70 -22 -26 157 -38 184 66 114 7 -44 -51 78 -74 35
3339 35 -36 17 -264 138 51 -24 -126 -17 -206 21 -63 -5 -98 -44 90 -83 -69 -53 173 -65 -72 178 -28 -57 131
3364 131 -22 164 -69 -69 57 24 240 76 152 74 -142 -14 69 -85 -197 140 107 -86 82 126 12 -70 196
3387 196 115 -152 -143 -1 128 205 57 137 214 -107 27 0 86 309 167 -33 137 38 20 184 257 -73 23 -125
3411 -125 25 -116 -151 7 3 42 89 -82 -26 198 -52 -121 161 29 13 55 180 -115 29 45 -64 -29 -6 -27
3435 -27 -116 -36 -32 -178 259 72 75 19 -81 -103 4 219 -81 -109 -86 -70 -246 28 46 73 -34 34 169 -90 69
3460 69 222 -45 -73 111 -107 -32 -53 -9 -173 -156 20 -35 18 -135 115 63 -102 -6 -85 35 -37 54 -138 229
3484 229 -15 -46 -113 62 -115 -102 135 -29 -18 165 -81 -34 147 2 33 -154 7 110 73 114 94 32 -55 -149
3508 -149 -59 -146 -42 62 -18 279 -89 28 107 30 -181 95 45 -149 170 -180 -107 28 5 54 -56 23 -11 -59
3532 -59 -65 113 -25 5 250 -115 -29 156 172 187 212 162 -57 -29 35 -151 -101 146 -56 112 114 -85 57 89 -161
3557 -161 -63 11 32 -12 -154 -55 206 -72 27 64 120 75 178 -81 -52 55 -102 2 -144 83 133 106 48 45 -27
3582 -27 -124 91 33 57 -136 47 169 -68 140 44 115 -12 -1 -153 21 -130 104 -50 -118 -122 -42 140 2 -48
3606 -48 -87 65 127 -96 -13 -39 76 -86 97 -46 -176 -21 -25 -99 195 -90 9 59 -40 22 35 1 14 15 89 31
3632 31 -27 -21 -30 8 24 43 -14 166 64 56 -228 168 176 -101 -53 131 -147 116 -53 -137 80 51 5 -23 -91 -143 51
3659 51 206 9 119 -2 -122 55 -71 -162 -77 75 37 -105 -8 137 29 154 68 -15 -139 -31 17 71 187
3682 187 -17 7 -109 -93 16 -15 -60 91 -251 92 -88 -146 -44 -43 -35 16 166 164 -63 -39 -22 -151 -21 -168 107
3707 107 -108 -43 -176 -118 -60 -126 -94 98 -24 53 113 28 -53 63 129 -177 -25 -35 33 -159 10 139 -34 40
3731 40 -76 -54 -141 -187 -4 1 -79 39 51 -88 -17 -130 150 54 49 -65 108 -22 -4 -90 314 -276 30 -91 -160
3756 -160 -23 38 -40 126 14 -144 160 -67 -29 -63 -49 -188 111 -169 58 26 -98 -49 -218 133 -108 124
3778 124 138 33 -108 -165 52 -58 171 23 -17 162 80 58 -97 5 -178 -23 153 6 -8 -56 -104 6 -38
3801 -38 -151 124 -30 285 14 -57 -41 133 149 19 46 -161 110 44 28 21 56 -21 -63 -263 -132 -17 126 8
3825 8 25 -127 10 -31 -60 8 -209 -3 198 -106 -71 -24 57 -82 123 -259 -29 109 30 46 119 -14 -4 47 -68
3850 -68 199 -35 -190 201 -76 39 105 144 48 -60 -15 5 -101 -22 222 9 13 99 155 58 -128 -152 -85 -50 -108
3875 -108 22 40 -81 127 -71 90 1 -173 151 116 -228 -167 45 165 235 -23 -119 99 -172 130 -93 -4
3897 -4 218 89 42 -193 -103 -88 35 10 92 -104 -75 -53 127 171 -169 -205 40 -70 -132 138 -131 -168 -198 61 9
3922 9 -54 -35 70 -44 2 249 -84 -1 -152 15 -140 125 -58 17 -70 34 23 53 119 -118 -28 -14 110 105 170
3947 170 96 169 -137 -74 -187 -179 -66 34 -109 -180 -25 -7 42 125 -4 -91 -46 36 -4 94 -83 -117 -32 -100 -34 124
3973 124 -94 -81 12 -174 64 205 39 -18 98 49 -258 -124 -177 -76 67 20 87 99 50 111 -200 92 61 -61
3997 -61 27 -146 13 -4 -9 -122 28 202 -42 -176 115 -10 -198 -109 69 2 -13 35 63 -309 -33 4 -41 54
4021 54 6 82 -15 208 -58 54 -47 -75 -276 40 27 85 -59 1 -13 56 -236 111 -139 -133 46 -109 -80 47
4045 47 -52 -165 76 49 21 -8 143 107 -25 -6 -66 45 50 -2 203 -69 -150 53 81 96 -46 -117 105 -45 -115
4070 -115 40 231 -156 57 -48 -29 24 63 -70 -79 82 81 -98 215 -272 138 -12 -131 17 63 49 -334 -6
4093 -6 -32 52 129 107 -70 -65 -79 198 98 77 61 -34 -45 97 -117 -32 -106 -110 94 -69 -124 -10 -81 -58 -113 -290 -3
4120 -3 -104 -61 117 -74 5 -40 82 -63 12 94 157 -49 45 -122 -148 69 -91 -11 -64 170 -43 -36 178 95 -41
4145 -41 -217 -55 20 -34 112 25 20 142 94 -26 96 128 24 -163 49 -43 -69 60 -94 71 -97 -124 -156 5
4169 5 -91 39 -20 49 56 26 74 -89 126 25 150 3 3 -41 -58 86 153 -43 -144 -27 -93 55 -102 141 60
4194 60 -56 22 -9 172 -9 80 26 71 -68 -183 -123 46 -48 -110 -100 67 152 21 79 -245 -15 155 -6 121
4218 121 -111 -97 91 -35 -8 -83 3 -113 -69 160 70 21 101 106 96 77 29 -13 -124 -198 -209 -18 86 -66 -100 16
4244 16 69 -181 -80 35 165 29 10 50 -182 -47 25 -25 -46 18 127 45 -27 -187 -95 -88 -86 -121 -25 -99 -6 195
4270 195 2 4 36 89 -30 -105 -97 76 75 17 -20 108 -78 88 36 -33 111 111 -13 -92 109 49 -97 -144 32 140
4296 140 74 -53 196 -78 -83 72 -57 -174 -57 34 47 -53 -42 -63 107 57 105 -47 -55 126 99 -68 60 10
4320 10 -120 -4 38 108 86 4 -55 108 58 -52 94 35 16 18 -88 -106 36 158 76 53 270 -90 77 240 -60
4345 -60 24 -173 -86 -171 -64 80 20 -22 73 9 -131 -105 -157 59 169 -95 -204 43 -108 -141 93 35 98 159 -33
4370 -33 -93 50 59 108 39 44 43 75 -36 -177 40 104 45 -35 251 -8 103 27 -59 68 189 5 -162 106 113 52
4396 52 34 -60 -70 -9 136 -52 67 -213 179 -105 122 -73 -142 -133 14 66 243 231 -38 -68 -175 -21 -116 36
4420 36 -12 -39 51 -142 191 49 13 34 29 32 145 -112 -58 103 -94 134 -91 96 -76 90 42 133 -8 137
4444 137 -11 111 -105 -52 -235 236 -118 84 -85 -134 193 55 -7 -94 15 -156 -4 -87 -35 250 83 81 116
4467 116 120 -8 49 96 44 218 -96 5 30 -59 79 -122 130 98 12 19 -80 30 -77 -175 29 41 -100 383 72
4492 72 76 -47 42 75 134 103 64 -288 -8 51 48 -118 95 33 -66 55 67 102 -11 25 137 -168 160 84 135 33
4518 33 -63 56 115 -34 14 124 33 107 -61 228 121 -27 42 -45 7 -192 -112 -6 63 -5 41 -80 86 14 209
4543 209 38 37 -122 -111 45 82 44 40 68 149 16 -192 -95 -79 123 -11 -68 19 8 51 15 -41 -117 -146 -133 68 -78
4570 -78 -62 56 47 0 179 -6 -40 -26 -105 -4 181 -77 -13 112 -25 -59 -32 6 62 -14 175 166 -28 168 65
4595 65 195 64 28 -97 -15 -88 -44 58 -43 -91 57 -13 -156 21 66 52 -27 209 131 -101 144 28 98 -147
4619 -147 51 -47 -117 -79 128 -71 73 -17 -134 -65 -47 -53 -41 -84 -79 114 118 -47 14 80 -92 -87 43 8 24 95 74
4646 74 89 -81 9 -12 -56 81 23 212 34 -49 -3 -26 -49 81 -21 64 28 -51 -272 -79 -118 117 5 -34 129
4671 129 -170 60 -75 0 -25 74 -105 -39 78 214 -144 -31 57 169 -58 67 74 -105 -209 11 175 -82
4693 -82 83 200 79 103 -276 134 246 -161 -111 -131 11 -61 44 -53 -73 10 27 5 73 -76 -28 -150 51 -46
4717 -46 143 -75 -7 2 -189 -150 -5 -66 101 -134 52 -141 49 -34 49 -162 52 -161 27 157 -115 -32 96
4740 96 -240 -108 64 118 -74 37 215 -60 65 -140 -58 -9 -60 36 176 134 10 -87 62 -51 132 116 -108
4763 -108 19 -103 50 -125 -163 -29 -105 -55 -2 -10 -102 -53 -39 98 194 21 55 108 -103 -14 -202 95 51 -103 20
4788 20 56 -97 53 -112 -82 93 128 67 -69 -14 -53 25 -105 -114 162 75 -71 -91 -71 -90 -18 -44 57 -66 20 -11
4814 -11 -91 228 27 -28 -76 75 -190 -146 28 26 17 75 211 133 155 30 -99 22 68 -92 -10 -47 -182 -118 102
4839 102 108 202 11 -69 -23 -125 -13 202 12 -34 135 109 91 -13 -29 104 148 -23 30 -29 13 97 93 -80 177
4864 177 -90 91 83 137 11 110 -20 -70 138 72 17 227 -68 -56 3 235 -59 56 12 154 3 15 42 -100
4888 -100 103 117 114 20 -187 -65 -67 -44 65 -57 -111 -99 64 -71 122 165 180 -147 -94 45 107 60 -3 47 -5 -71
4914 -71 -83 -98 162 159 -26 28 45 -83 61 -160 128 -17 111 -6 -79 -25 79 -77 -214 -19 147 -108 198
4937 198 -111 -122 110 78 60 25 -37 225 35 86 -91 -174 -47 -272 6 126 103 97 -87 140 125 -221 60 73
4961 73 -21 -102 -121 100 -274 75 -64 81 -191 22 -44 88 -14 -23 19 137 7 -158 -23 -72 33 -151 -16
4984 -16 7 -100 26 265 105 -200 -40 46 -55 45 -132 -9 64 78 47 -116 134 -78 85 -60 -6 24 -97
5007 -97 -72 107 -77 46 103 -73 -47 -24 -101 36 -176 119 -57 98 109 -17 12 -125 89 -25 116 91 -31
5030 -31 64 -55 26 183 -167 218 36 20 4 -105 11 -126 -28 -22 -176 -161 294 -78 133 168 -216 -23 -107 -5
5054 -5 202 168 37 8 -84 -85 -17 -20 -175 13 -6 5 113 109 -58 -111 -9 -68 81 -93 -38 -31 141 38 -117 -22 50
5081 50 -19 43 -45 106 15 -189 -107 -223 -144 151 11 100 66 53 51 45 -28 -80 36 -37 -83 -35 2 9 20 108 -124 -109
5109 -109 84 -27 159 -56 -1 -114 118 115 -83 104 61 146 -3 49 -3 10 26 215 70 -58 -144 -5 -59 117
5133 117 140 -85 -21 -36 -12 103 134 4 -53 98 8 85 -92 -15 -47 112 93 38 -15 -121 129 -68 -60 -110 27
5158 27 -94 -73 -72 172 225 39 56 -33 3 -13 59 238 69 21 50 -75 -94 -109 -123 -10 -45 -65 -72 53 -104 100
5184 100 -164 93 33 10 47 -42 228 100 30 97 -90 2 168 138 75 -119 260 145 -257 -236 95 -79 -200
5207 -200 -155 -131 -7 88 -103 -47 52 133 -150 48 18 -60 20 53 -8 64 -121 -105 95 74 78 -138 66 2 55 117
5233 117 -58 218 -187 90 28 -75 24 -131 28 26 4 119 11 -138 -7 -47 -96 -56 -9 -15 -4 -148 -136 -37 -14
5258 -14 -10 0 -57 19 86 -12 -46 -22 18 -8 -10 138 -10 140 66 -28 -29 123 171 -155 280 -148 -21 -56 49 -39 -65
5285 -65 207 224 23 -78 79 -120 13 18 34 139 149 111 -32 90 20 183 73 -54 -12 65 110 31 175 44
5309 44 123 -39 87 -33 33 20 -94 197 59 -28 69 107 211 -113 -100 50 -89 -85 -308 -71 -109 -64 -2 -112
5333 -112 -95 -69 146 -33 39 8 149 -7 -65 48 30 -102 -95 90 -73 125 27 42 -59 -112 77 126 42 -47 -143
5358 -143 15 -121 265 263 82 31 -126 23 -180 -233 57 -111 103 39 -86 85 -33 -168 129 -177 -249 127
5380 127 74 206 8 144 -181 -68 -7 -30 -70 -176 31 -97 18 -65 181 84 -22 122 -5 -45 173 94 154
5403 154 8 40 79 -42 248 -140 -61 -29 23 -51 25 164 2 -85 107 -155 110 28 232 28 -113 186 15
5426 15 -82 29 -94 -38 -24 41 261 -95 -38 16 -53 -88 58 58 -176 -228 -59 26 -186 44 -20 -108 156 9 -81
5451 -81 109 -26 -82 145 84 -4 -60 77 173 -25 -35 -159 36 -35 84 90 -243 -15 203 108 -146 -35 9 -77
5475 -77 25 126 -94 -44 -108 125 -18 73 22 -125 13 -88 -6 63 -13 33 16 -12 52 -134 58 79 38 177 14
5500 14 4 -133 -51 -11 -86 45 -60 13 33 -265 -39 -83 200 27 93 301 -56 -184 -54 38 -81 -43 -129 -86
5524 -86 13 95 122 -5 50 -55 -87 -22 246 -9 -25 21 -156 -20 167 129 13 144 -30 126 -266 1 2 -62
5548 -62 -139 -81 -49 -136 0 2 66 124 -153 63 -82 -15 140 214 107 -96 6 -157 151 116 -96 -50 8 25 80
5573 80 -154 -45 -30 -24 -174 -204 -12 -196 -43 -19 -54 -72 100 -12 106 0 -30 -7 -140 -3 56 -89 -134 -39
5597 -39 -62 -92 -4 85 240 248 56 49 183 -89 31 -29 -5 112 231 -127 72 13 117 76 61 122 49 2 -73 4
5623 4 -5 145 51 126 -207 -26 -238 151 -122 -98 78 -75 -40 -98 28 -85 -43 74 -32 49 -82 -216 8 -77
5647 -77 81 -23 214 -101 85 -118 -103 4 -3 -15 -13 -160 -117 -34 119 -47 -133 -59 85 129 110 94 15 -52 -126 -97
5673 -97 32 8 -22 36 27 91 42 40 239 43 -112 -71 -28 -86 131 -173 -165 49 60 -53 -81 212 69 106 -50 36
5699 36 17 215 46 74 -39 -323 88 63 80 67 -14 -120 187 -110 170 104 173 -104 -115 40 -109 43 -60
5722 -60 29 179 -35 -155 28 -59 20 26 120 -36 -76 45 -64 285 -79 -27 77 -168 -14 -113 259 9 -182
5745 -182 -67 -135 16 -93 33 107 -49 -21 -101 -56 -94 -152 -155 10 -165 -104 -6 136 -100 29 -130 57 -67 109
5769 109 -124 61 80 94 29 -109 -110 -64 -27 80 156 -134 -144 246 -60 96 37 -50 -3 38 50 -39 6 64 46 -29
5795 -29 -22 -62 12 -25 42 -15 -11 -44 -203 -52 -160 -47 -111 49 209 -31 24 -80 31 -64 47 9 -10 85 108 -174
5821 -174 -43 80 -50 -55 -157 -106 -2 -5 -63 -103 -142 -233 -84 32 7 149 -17 -131 202 72 -17 40 37 0 -23
5846 -23 -128 -103 -185 -102 -61 391 140 83 41 118 -62 5 -61 68 -2 20 157 150 11 -35 16 -52 108 20 -244 52
5872 52 3 -86 108 2 5 -103 -69 124 91 -158 67 -44 4 -35 -71 -94 -1 -30 73 -33 28 -143 78 68 -27
5897 -27 56 298 -142 -14 76 -38 -85 -59 18 -3 -147 -119 -5 151 -46 -148 2 93 86 107 -16 138 118 -4
5921 -4 1 -191 154 29 -26 -138 177 -47 -93 -212 -8 -30 -70 -349 54 121 -43 129 -132 -49 216 -8 -63 -165
5945 -165 71 -44 4 -78 60 -23 -78 -112 50 -60 -42 98 -115 -40 127 187 120 -24 69 -204 133 -130 -75 112
5969 112 -4 68 53 -59 -46 48 -153 -123 -82 41 59 -66 -156 -85 58 12 -89 86 -65 188 -64 -270 -5
5992 -5 -66 -18 -14 91 101 229 22 60 -198 -19 -50 -128 37 -19 -63 255 17 -72 150 -29 99 -6 47 28 -6
6017 -6 -153 -16 182 -124 -126 2 -76 143 -100 36 12 -166 -15 -81 -37 116 54 33 -45 128 -81 -39 -162 -82
6041 -82 -127 -81 259 31 -104 -89 -181 -6 -39 4 50 -102 -92 29 79 -213 318 -107 235 -79 -135 156 221 -84
6065 -84 -34 -53 255 24 -5 -68 140 -17 -123 23 -45 164 43 -49 -1 -28 -51 107 103 74 -169 -11 -10 202 -132
6090 -132 -83 -80 -9 -33 20 103 -33 49 184 6 -163 20 19 143 -138 -152 -11 41 127 77 36 166 -109 14 125
6115 125 -56 -107 179 129 -65 -38 -243 -45 -23 118 92 -15 28 162 -29 46 30 15 -50 -62 152 -47 -97 -58
6139 -58 -39 -5 29 28 123 -20 35 21 -17 -134 20 -3 89 13 -9 100 -44 42 103 75 -112 7 -173 133 -33 186
6165 186 84 82 95 205 -46 49 -116 -221 111 27 -33 275 -195 189 237 -97 -21 -96 105 -68 104 -64 142
6188 142 -7 10 -101 27 56 -139 151 -41 59 -125 -92 294 -25 166 99 68 -177 -228 -27 72 -91 129
6210 129 -242 -94 -23 112 -42 40 -101 141 -9 -61 44 -238 171 -10 -75 96 -87 153 86 -309 195 157
6232 157 12 -55 189 -29 13 -105 104 23 36 -77 20 109 -167 -109 59 116 -151 -112 15 8 -78 192 -82 -64
6256 -64 -26 -98 -132 -24 168 -129 -47 -56 -126 2 -253 -136 -20 234 -103 -37 219 -68 -116 40 -67 -79 -98 127
6280 127 87 -164 -130 -129 -16 -217 -43 108 -168 -98 141 -342 4 -52 77 172 38 93 -6 -84 7 22 -118 7
6304 7 -72 56 169 39 45 -101 280 79 -27 17 53 -44 136 76 -11 -264 -177 27 -190 -50 -31 -163 121 195
6328 195 131 68 62 -123 214 41 -9 -137 37 148 -107 -75 14 -212 4 -30 18 -66 -215 3 -126 -37 -22 24
6352 24 189 -104 35 23 -48 19 73 91 -39 227 30 104 43 -7 -68 -39 93 -141 -102 93 -140 194 56 19
6376 19 -30 -34 -70 -107 11 57 -15 28 -100 -71 106 -96 123 -111 14 -141 85 -77 55 186 92 126 36 39 95
6401 95 106 -42 -37 -56 116 30 -49 -54 197 -136 -151 17 150 73 63 91 81 -47 118 -105 -103 -71 140 6 -25 -11
6427 -11 19 123 137 72 -16 -102 -43 154 -314 83 -106 -85 131 -97 -127 45 106 -45 -7 -93 48 -74 41 -24
6451 -24 70 31 59 -145 7 -26 -105 -29 -50 54 21 -199 3 20 0 -87 -69 -14 76 -35 -80 58 112 88 -81 -24
6477 -24 53 67 -58 -43 28 110 -90 9 -2 56 -108 10 81 -42 91 -125 40 -56 -4 7 173 117 175 -27 -80
6502 -80 78 87 -54 202 1 104 55 -26 94 158 6 -235 108 211 2 -4 -43 31 124 -48 -6 -87 70 8 6
6527 6 100 177 -41 109 -2 61 88 59 74 166 59 165 -153 -41 -96 10 22 -43 64 39 -51 72 81 -36 -86 220
6553 220 16 -170 -67 -56 55 -93 83 2 6 -139 4 -27 -29 38 44 80 -8 -148 -225 -35 -2 -113 -53 46 -175
6578 -175 106 3 72 -112 138 -28 9 -15 -195 -24 -74 -112 7 -139 -15 -47 33 73 -135 84 -233 19 -65
6601 -65 -11 46 7 131 116 -37 29 64 -88 4 -149 68 190 40 57 53 -107 -138 -56 -187 0 -77 36 -40 -8
6626 -8 154 -32 -37 29 61 1 -114 23 45 -94 -218 206 -23 -110 10 15 -23 126 53 2 25 -69 -89 -14 20 -64 -94
6653 -94 -24 -49 145 28 100 78 30 117 -76 -50 -52 28 -3 130 -97 49 -31 -63 111 -98 70 21 -49 -50 -10 -62 -32
6680 -32 59 -150 84 -56 -46 10 60 -197 181 114 -75 142 23 60 139 -78 10 -290 -41 -62 35 132 61 112 50
6705 50 -67 64 74 -34 -47 21 50 -102 -56 -75 -123 33 -82 -67 -82 71 72 -124 -11 104 -125 -12 -217 -60
6729 -60 -29 -126 -46 142 30 48 -136 -35 10 -134 13 60 -28 -145 130 -180 -55 173 85 -166 8 91 53 -229
6753 -229 -20 100 36 59 194 -16 -208 98 -20 73 85 -94 -140 128 103 -10 -31 115 -107 217 -276 29
6775 29 27 155 -64 -100 33 -124 45 11 -119 5 4 66 -4 64 1 -62 71 -93 7 -86 -105 -26 48 -42 72 78
6801 78 -15 -47 -113 -110 84 227 96 20 96 81 44 -91 -135 254 56 9 116 -219 29 -24 -18 -39 -134 -11 -87 -31
6827 -31 14 -42 33 130 170 36 -144 90 39 -79 88 -98 17 56 -85 -20 -170 95 1 -138 -69 184 -109 -77
6851 -77 109 -208 -16 72 -62 23 60 -104 -75 52 -156 90 125 25 -1 74 -81 29 120 -76 -158 -47 19 -163
6875 -163 86 20 -20 153 -33 -65 36 20 0 -132 20 74 24 215 103 -44 -93 80 -98 88 98 2 -39 74
6899 74 -100 11 -14 36 -276 61 14 -195 172 -90 -63 116 73 -53 -49 -110 97 16 -28 -93 29 146 8 33
6923 33 41 31 -83 -53 142 -25 -42 -65 -35 26 -135 6 -200 74 229 151 45 -48 37 135 -131 -13 106 -38
6947 -38 50 -145 -75 4 82 75 53 -45 -195 84 -76 -226 48 10 147 94 107 -173 -137 -32 -111 119 -74 58 -149
6972 -149 56 136 -119 -45 103 -8 -29 131 72 18 -185 71 -9 -23 -215 -221 57 86 180 -49 -42 -26 -157 120 162
6997 162 35 96 -29 -29 59 -100 -127 32 -33 264 -57 -25 178 -121 -177 -248 -164 75 3 -128 148 192 26 23 125
7022 125 -18 -106 105 -30 -15 76 -17 -88 66 228 53 72 -54 113 10 -101 109 -68 -27 -59 -34 -30 33 -40
7046 -40 241 -36 -92 -85 -148 -177 -8 -39 129 -171 -44 197 -36 -33 -27 213 51 48 91 58 -43 -217 36 -84 40
7071 40 -150 -54 -73 78 -112 -290 -63 111 -25 138 88 66 63 -268 175 73 72 -13 42 -41 -163 9 -24 -89 104
7096 104 14 -115 127 43 -154 -41 -90 29 -53 -54 12 -114 160 -90 -1 -27 52 -65 229 66 -45 -23 -18 112
7120 112 11 24 150 64 139 76 -87 -104 -30 24 -34 -2 157 -144 -12 2 -15 -68 84 -62 -206 62 -61 -18
7144 -18 65 -124 -159 111 -44 56 164 262 -8 42 42 24 -21 -7 135 95 -51 96 -112 -58 -54 -204 48 5 -76
7169 -76 93 107 -57 198 -138 94 137 -37 27 -146 -59 168 -40 -146 -3 -59 -138 132 93 -3 -63 -46 -200 318
7193 318 -86 55 95 -82 26 13 -83 -179 -195 -44 22 -123 29 -30 -59 -29 154 -217 -116 82 2 182 30
7216 30 -67 119 68 105 56 33 58 74 19 73 34 24 62 32 28 -32 82 72 -51 -28 62 278 -106 194 -69 -51 26
7243 26 80 119 14 101 134 -125 -112 218 -119 179 -221 -27 114 -66 -161 209 -86 15 -98 -16 -134 -61 -1
7266 -1 -76 -19 -93 217 237 -160 -73 -60 131 73 -15 44 225 24 115 85 73 -105 40 56 -39 88 -55 -84 -129 156
7292 156 -146 -184 -38 -127 130 121 -171 -212 69 197 -130 188 196 54 100 86 0 39 245 -34 -27 159 -66 215
7316 215 -146 -62 73 22 -23 -130 129 -184 52 -9 135 -120 280 116 -114 -165 23 -28 122 -112 26 3
7338 3 63 -59 50 109 -54 -79 73 3 -47 76 -17 -90 14 -18 -18 11 -4 -7 -41 21 13 -184 -198 3 -134 103 -86
7365 -86 -48 30 -25 -17 -54 -60 -62 -170 -79 43 31 -107 59 -53 143 -145 -91 110 174 -53 33 -19 -88 -2 119 -42
7391 -42 -65 -9 46 57 20 32 -20 6 -32 -82 -71 -15 -27 -60 81 -104 -57 -49 21 168 -45 -24 49 25 -209 -27 -76 31
7419 31 36 -20 -177 -64 -101 -28 -18 115 -1 85 -76 -14 -108 6 9 141 -193 32 81 91 41 -84 -132 -112 82 91
7445 91 177 18 -35 -133 181 196 -113 77 -53 -153 -116 -36 139 -60 -20 12 142 -11 -175 -169 -51 60 -17 80
7469 80 -226 -97 36 -24 -105 -94 -10 204 146 -16 56 -170 -126 75 -91 -152 98 208 -36 -109 324 -52 -3 135
7493 135 -88 -41 67 -86 50 198 48 -66 38 -20 -92 42 61 -257 16 124 13 12 -1 -109 69 31 -52
7516 -52 -68 -123 44 119 4 65 195 -182 47 179 133 -16 -105 -89 -132 -50 28 -137 -76 40 -126 -160 -13 -73 89
7541 89 -15 167 12 -120 35 -134 212 44 95 115 -75 41 133 -111 12 246 -82 -40 -74 157 22 -133
7563 -133 45 -34 135 -96 93 49 113 -12 70 -36 7 -4 45 68 -228 105 132 13 20 -1 192 113 284 -13
7587 -13 14 -131 142 5 -70 58 -24 -14 -185 -177 -229 62 109 -181 -98 64 -99 23 -128 -6 -122 -92 36 -111
7611 -111 7 -122 -65 -189 -5 22 -85 -267 16 -30 -120 -148 -111 -253 -135 15 -146 -120 38 9 -141 -106 14
7634 14 -17 117 135 -99 -52 -71 49 -10 -233 -163 -62 102 39 -115 -257 28 -14 -217 68 87 110 -66 -125 105
7658 105 -49 -21 -81 -179 -72 -23 75 -90 77 24 -86 33 108 -55 -241 -184 80 -22 15 94 -196 -115 -50 13
7682 13 -84 100 -299 -141 61 -55 138 -29 98 36 38 -19 223 -82 155 -28 -66 -29 -24 -141 -11 -50 -89 -28
7706 -28 -156 -160 62 -136 -237 260 -161 -13 51 173 153 148 148 140 -29 82 -251 -145 -58 107 5 149 -15 3
7730 3 118 -65 -178 -35 -216 -29 0 22 1 -86 -76 11 -118 -67 -82 19 21 12 73 -22 46 -58 -20 58 -164 -47
7756 -47 -21 10 -77 -54 11 -146 -107 -84 -70 112 24 174 208 -170 147 214 -224 -66 43 -18 -90 60 -54 -163 125
7781 125 141 135 -60 179 36 49 144 -86 88 236 12 -93 -26 -74 87 -70 -268 72 81 73 55 49 266 120 31
7806 31 31 6 -5 -120 72 36 126 76 -109 115 -228 64 -131 70 -196 -96 -59 -19 107 -66 44 95 19 -91
7830 -91 181 85 -40 30 18 -74 82 96 149 97 -23 -150 -101 73 -13 -111 -154 -61 0 -107 36 -67 77 -22 137
7855 137 -104 85 -10 -182 130 -40 -27 -161 118 20 32 -71 -115 72 137 61 45 107 184 -64 45 257 155
7878 155 -51 144 -78 102 114 41 46 -20 -42 -80 12 -7 27 69 11 5 226 -3 181 -75 11 30 -4 -14 -171 -283
7904 -283 -208 47 -84 37 -7 84 -124 -28 101 13 -42 -53 -5 8 67 65 3 -17 -142 98 120 -95 -2 173 27
7929 27 44 -95 -283 -106 26 -47 -96 75 14 34 -14 3 -120 163 -61 121 -101 212 -46 47 78 -35 85
7952 85 -102 -44 -70 -127 65 -233 -36 116 44 96 -19 -90 56 99 115 3 -56 -82 96 -41 -252 -177 33 162
7976 162 123 111 12 4 22 57 -81 128 39 119 -50 163 50 -55 89 50 -153 -4 71 84 102 -207 46 139 -102
8001 -102 44 40 146 -3 25 -6 -13 165 -73 -264 40 -59 115 26 -54 77 162 -41 38 224 142 -18 55 -57
8025 -57 12 -11 -34 -51 -91 -157 160 114 142 -139 141 18 -75 1 -102 27 -11 -83 -15 -73 198 -82 64 -53 128
8050 128 -86 -60 -205 29 -34 -236 -75 129 103 -146 65 -136 -31 -19 13 -15 41 -21 -125 77 5 0 -83 52
8074 52 24 59 -3 -1 59 41 -105 -68 55 -64 65 -30 82 92 -71 -24 145 -3 -60 -100 -10 9 -61 -12 171 92
8100 92 40 -170 177 154 79 110 136 -12 -1 -128 82 -93 -14 -64 -147 148 112 -67 39 25 -1 -15 11 182 -40
8125 -40 152 -56 126 51 -72 -84 73 96 295 88 -86 18 73 89 -42 -21 -82 -55 -105 33 -15 25 103 -183
8149 -183 -160 -28 -21 -48 51 95 146 56 -74 85 142 -75 -60 62 -82 45 -86 -24 -90 211 -12 -18 139 45 -47
8174 -47 -11 -160 113 40 -176 -164 85 99 -79 86 -217 -74 7 -56 64 51 -7
8191g
$$ Imaginary data points
##PAGE= N=2
##DATA TABLE= (X++(I..I)), XYDATA
0 0 0 0 0 0 0 0 0 0 0 0 0 0 0 0 0 0 0 0 8 -8 8 -8 8 -8 16 -16 16 -21 24 -25 32 -35 40 -45 52 -57 65 -73 81 -92
40 -92 101 -112 124 -139 153 -170 187 -207 227 -250 274 -304 336 -370 409 -451 501 -557 622 -700
60 -700 791 -903 1043 -1225 1470 -1821 2369 -3364 5757 -25666 -17788 -15393 -50164 -14144 -15026
75 -15026 -53157 -58099 -47595 -58182 -40713 -18638 -4882 23639 48514 51254 71569 73479 42258
88 42258 40643 47824 8339 1845 38341 16610 -19210 16083 21740 -33138 -34585 -14466 -62474
101 -62474 -86818 -45897 -44947 -66918 -23772 11340 -10342 1802 46772 35047 7157 29134
113 29134 39897 13792 19357 47241 37681 22379 34781 29822 3145 -2975 -7986 -34320 -46912
126 -46912 -39532 -39617 -38207 -26665 -19762 -13663 -6109 -7431 -2901 8177 749 -3515 16932 24998 19657
141 19657 36508 46181 27304 25320 31438 7866 -7857 -1628 -17733 -34979 -19200 -15328 -27630
154 -27630 -15969 -10401 -25600 -18530 -7469 -21610 -16440 4189 -3007 -382 30817 31939 19028
167 19028 36585 37131 11269 15320 23470 -1850 -9510 6350 -5124 -17459 -1938 -3530 -22951
180 -22951 -21017 -17138 -28669 -27719 -17534 -17453 -13052 271 7391 14187 22153 20313 18427 20763 15181
195 15181 11628 17302 14107 5562 10784 13368 2116 -1676 33 -13541 -26341 -21675 -21114 -28969
209 -28969 -22554 -10718 -12266 -9274 5141 7934 1586 6679 10804 5099 8002 17787 16961 15778 21274
224 21274 19789 14274 12999 5955 -5724 -9661 -14362 -20646 -16612 -12931 -17295 -13328 -5279 -9686 -10592
239 -10592 -1866 -5368 -12065 -1599 5209 2095 11727 23136 17551 16111 23454 17080 6484 6265
253 6265 1632 -7737 -7069 -3884 -6271 -5843 -4886 -8040 -9180 -10125 -13793 -13950 -12612 -13708 -8271 1853
269 1853 4987 8014 15922 15720 10169 12452 12784 3950 1194 4677 1196 -507 5245 5762 -1113 -2460
285 -2460 -3105 -9715 -13764 -12496 -13338 -15106 -9912 -2861 789 4263 8389 8746 6007 5502 6080 3839
301 3839 2565 3561 5007 5840 7535 8576 5855 1086 -3115 -6931 -10576 -12467 -12423 -11571 -9675 -5615
317 -5615 -553 2090 3219 3397 2622 1127 1523 3079 3731 4579 7409 9322 9946 10394 9074 4336 -1044
334 -1044 -4372 -7362 -10074 -10103 -8970 -8406 -6729 -3368 -1869 -2511 -2578 -2771 -4631 -3724 416 2204 4199
351 4199 8536 11268 10994 12009 12003 7018 2788 579 -2985 -4613 -3670 -3814 -4787 -4061 -3885 -5023 -4886 -6580
369 -6580 -8919 -8939 -7485 -5930 -1943 2687 4445 6301 9836 9392 7824 8086 6207 1833 1938 3517
385 3517 1951 1594 3621 1195 -2361 -2099 -3651 -8265 -9746 -8848 -10124 -8800 -3632 -1305 -558 2923
401 2923 4038 2673 4027 4763 2522 2911 4305 4060 5631 8047 6315 3888 3722 310 -4014 -3842
417 -3842 -5232 -9280 -7920 -4484 -5731 -3611 1044 -1210 -3348 415 21 -3100 897 3304 456
432 456 3792 8848 6519 6225 8575 3760 -883 995 -1329 -5680 -3053 -2410 -5693 -2530 626 -3268
448 -3268 -3042 -727 -4953 -6261 -1478 -1567 -2698 2866 5159 3469 7055 9339 4242 3178 4217 -407
464 -407 -2305 674 -616 -3080 -34 355 -3014 -1401 -1269 -6261 -6762 -4432 -6335 -5572 434 1164 634
481 634 5077 6816 3920 5025 5964 1241 -21 3441 2119 395 3910 4075 -228 245 890 -3974
497 -3974 -6082 -5111 -8263 -9000 -4068 -3122 -3669 1175 2761 149 2734 4081 319 669 3661 1229
513 1229 2266 8039 6179 3102 6926 5022 -1580 -402 -352 -7306 -6944 -3129 -6500 -6112 77 -1498
529 -1498 -4706 -133 64 -4711 -1634 1014 -2169 4 5261 4197 5373 9434 6201 2968 5238
544 5238 2738 -1944 -756 -712 -4438 -2345 99 -2721 -2325 103 -4283 -6550 -2611 -4010 -6618 -2322
560 -2322 384 -1158 2235 6350 4310 3687 6154 3057 123 2921 2626 -1010 735 2785 779 342
576 342 1747 -1326 -3740 -3111 -4803 -6681 -3867 -2640 -4010 -1406 2018 967 1506 3640 1296 83
592 83 2453 1651 -246 3525 4228 878 2849 5183 528 -1157 845 -3368 -5834 -2330 -2896 -5450
608 -5450 -1460 519 -3035 -719 2950 -706 -1704 1626 -239 -1128 3142 3271 1360 4660 5151 1204
624 1204 2429 2991 -1602 -2598 -733 -3205 -3840 -43 -1608 -3153 -72 -373 -3758 -1299 139 -3810
640 -3810 -2102 1591 680 1250 5098 4357 2250 4302 3729 205 708 1288 -1608 -1623 1008 -87 -1610
657 -1610 -110 -1495 -3183 -2375 -2708 -4736 -3391 -1917 -2328 -704 2145 2064 2042 3406 2702 1118 2414
674 2414 2301 290 1571 3175 1450 1082 3031 874 -1877 -1058 -2102 -4845 -3852 -2608 -4434 -3343
690 -3343 -325 -892 -965 1481 741 -1121 672 1267 -85 1687 3465 2066 3023 4861 2905 1652 2480
707 2480 -349 -2480 -1230 -1744 -3537 -1950 -953 -2571 -1458 149 -1603 -2667 -907 -2008 -2652 -143
723 -143 841 401 2474 3946 2820 3234 3620 1378 572 868 -730 -1189 357 -80 -809 157 109 -1790
741 -1790 -1456 -1352 -3618 -3698 -1807 -1863 -1613 867 1630 1213 2208 2914 1413 971 1384 272 -198 915 1125
760 1125 944 1288 1055 12 -41 -764 -1967 -2456 -2519 -2963 -1956 -698 -240 143 1232 950 233 965 1157
779 1157 -65 110 1141 916 1035 2341 2284 1029 858 722 -1171 -1760 -1535 -2340 -2782 -1662 -839 -873 -5
798 -5 108 -370 -370 -329 -191 -74 232 670 1594 2206 2172 2480 2397 1019 242 241 -544 -1573 -1109 -1106 -1608 -1163 -365
821 -365 -675 -1309 -1180 -1326 -1874 -1616 -615 -242 90 1234 2151 2151 2202 2481 1835 907 472 635 212 -61 184
842 184 197 -480 -408 -443 -1302 -2145 -2248 -2413 -2629 -1858 -895 -585 -88 618 993 1265 1063 1029 1150 708 968 1319
864 1319 1662 1253 1690 1557 714 98 -78 -1096 -2113 -1821 -1740 -2095 -1488 -628 -644 -696 7 -46 -694 -205 5
885 5 -72 634 1367 1462 1854 2184 1525 1529 947 182 -528 -299 -918 -1338 -458 -171 -877 -738 -151 -1081 -1235 -1057
907 -1057 -1180 -1480 -423 335 41 1298 1985 1076 1423 1688 585 236 290 79 -551 208 127 -319 190 135
927 135 -1076 -1135 -1181 -1606 -1704 -728 -832 -645 899 1240 688 1255 1513 295 348 895 210 -334 804 716 -149
948 -149 660 822 -209 -545 -623 -1672 -1941 -1231 -1371 -1401 -112 -38 -29 905 969 196 436 885 -285 215 1426
969 1426 747 556 1957 1381 385 723 321 -1404 -1295 -744 -1899 -1681 -442 -794 -1172 184 -109 -764
987 -764 -50 128 -653 -215 895 473 847 2225 1293 1325 1953 1025 -137 412 -312 -1440 -516 -25 -1074
1006 -1074 -797 174 -909 -1325 -526 -1176 -1805 -757 -540 -1082 210 1442 730 1066 2192 1087 553 1266
1024 1266 630 -83 527 700 -135 364 896 -309 -603 -129 -1273 -1843 -1219 -1261 -1869 -627 -97 -484 361
1043 361 1016 136 217 1058 272 -202 877 1037 293 1155 1351 505 354 907 -658 -941 -295 -1174 -1554 -558
1063 -558 -537 -1072 -246 292 -711 -424 353 -524 -556 761 390 168 1237 1354 476 1050 1108 -174 -162 319
1083 319 -1055 -871 41 -717 -956 80 -70 -1006 -138 -23 -1107 -556 333 -462 -44 1363 728 573 1547
1102 1547 1145 36 670 630 -573 -144 439 -368 -435 204 -388 -952 -238 -566 -1369 -821 -435 -912 -508 519
1122 519 146 466 1144 884 419 1016 496 92 488 845 -79 152 710 30 -65 95 -627 -1514 -882 -1079
1142 -1079 -1518 -819 -260 -878 -252 663 222 -164 622 257 -156 680 692 182 1065 1431 649 585 1013 -9
1162 -9 -554 108 -754 -1416 -694 -464 -1058 -274 18 -630 -356 -61 -583 -876 392 -75 -403 845 1231 670
1182 670 1210 1400 417 540 789 -68 -420 211 -278 -514 -85 13 -579 -42 -384 -1262 -828 -384 -945 -614
1202 -614 279 310 167 678 894 352 704 762 50 -68 468 -24 8 580 368 -84 171 -124 -891 -546 -462
1223 -462 -1040 -857 -278 -373 -303 360 255 184 692 410 -30 338 460 1 236 479 348 258 616 465 -236
1244 -236 -308 -355 -1042 -649 -411 -558 -580 11 113 -202 428 232 -248 147 123 -28 412 696 645 755 792 460
1266 460 233 261 -248 -821 -352 -377 -721 -507 -251 -371 -434 -96 -208 -432 -143 -43 -210 81 467 409 532
1287 532 1048 601 578 531 95 147 292 -125 -228 -217 -325 -507 -206 -255 -443 -762 -535 -686 -678 -364 -252 -105
1309 -105 445 489 609 544 477 576 288 235 393 299 290 176 140 161 -196 -124 -420 -415 -601 -767 -936 -431 -415 -101 103
1334 103 125 233 268 15 261 43 258 259 436 535 744 491 578 308 8 58 -159 -585 -513 -445 -500 -428 -277 -173
1358 -173 -167 -181 98 -473 -152 -274 -114 101 502 547 583 761 435 375 49 199 -2 -195 -42 -74 -74 203 -94
1381 -94 -148 5 -181 -287 -388 -625 -306 -113 -13 145 215 490 447 201 477 304 146 -119 178 -53 -293
1402 -293 200 65 -95 -151 -67 -524 -539 -477 -448 -388 -173 -216 4 471 360 249 315 399 108 -51 121 11 245
1425 245 459 247 159 185 149 -412 -304 -292 -327 -333 -298 -451 -121 147 5 132 72 199 -223 229 267 -50 236
1448 236 501 410 253 637 244 -21 -72 -208 -473 -198 -345 -565 -404 -157 -358 -141 -9 -308 -268 -47 -80
1469 -80 -178 133 67 152 668 603 238 313 509 160 -238 167 -10 -123 -148 43 -149 -216 16 -432 -557 -325 -351
1492 -351 -675 -324 18 -26 230 399 109 287 603 88 127 454 -136 -148 277 12 -14 204 145 -58 -164 -75
1514 -75 -558 -334 -146 -303 -441 28 198 -54 147 214 -191 -154 91 -176 14 434 353 -30 537 258 -109
1535 -109 10 38 -275 -324 46 -374 -368 27 -49 -188 117 -40 -387 -170 -157 -192 -55 258 242 56 217 295 187
1558 187 306 26 -369 -109 -87 -282 -136 -33 14 -96 76 -111 -363 -135 -123 -269 33 187 -262 45 303
1579 303 275 -140 302 90 -65 81 243 -104 27 156 -304 -47 -24 -99 -234 -178 -222 -455 -297 46 -230 125
1601 125 251 78 -47 408 110 206 273 44 -128 113 295 -51 312 313 75 -8 70 -404 -462 -88 -89 -332 -37
1624 -37 122 -143 161 89 -160 -10 322 39 101 330 95 -66 353 320 -9 219 220 -94 -137 330 -175 -344
1646 -344 -20 -96 -291 -40 119 -187 -111 -4 -338 -83 164 96 20 298 247 331 421 210 -157 133 43 -289 132
1669 132 210 104 -120 264 146 -124 -142 -139 -370 -329 -6 -267 36 108 149 73 192 288 131 220 221 -130 -96 190
1693 190 146 -82 240 82 -107 -78 19 -259 -149 -61 -228 -93 131 63 68 189 -120 40 194 120 -245 -155 140
1716 140 -58 62 208 104 93 62 -246 -261 -181 -216 -90 -5 -89 -152 -154 -148 53 -219 -56 18 -77 10 142 -197 404
1741 404 148 -49 274 -30 -161 59 -23 -97 -69 -132 -80 -143 -116 92 66 -159 78 13 -186 8 -220 -144 235
1764 235 151 13 267 155 71 161 136 55 -148 68 -4 -29 126 156 -298 -8 -153 -249 -341 -29 -321 -179 87
1787 87 -45 34 119 164 -95 141 96 75 -82 203 -12 235 110 -23 -32 243 159 204 -20 -127 -169 -240 -30 -143
1811 -143 95 79 35 147 -74 -106 -77 -175 29 49 119 -47 323 86 237 -53 91 142 -161 31 -38 -12 108
1834 108 -27 -25 45 -174 -25 -153 -27 29 -59 38 -104 -143 33 133 85 159 115 30 4 43 36 74 -298 74 48 238
1860 238 67 -69 113 -15 -177 -141 -205 -46 62 126 116 86 -172 63 146 -116 -92 100 172 248 198 -40 -25 -57
1884 -57 108 -45 26 -128 -3 -66 -195 -21 -151 -96 -144 68 1 85 70 147 17 -7 42 12 184 274 -5 123
1908 123 62 -235 -180 -177 -45 -230 -194 74 -199 -95 103 106 -170 -17 25 -92 11 -27 -112 302 112 120 243 -18
1932 -18 186 -38 -45 -29 -298 -158 -144 -238 69 17 -275 43 84 -116 -101 -99 -104 -203 10 315 22 151 193 54 119
1957 119 265 -167 162 187 4 61 140 74 -43 11 -42 -199 -208 47 -70 -157 -23 -49 -93 85 5 -69 -19 113 20
1982 20 -78 122 -40 124 101 -62 160 -109 -156 -135 -265 87 39 -131 -5 -16 40 204 1 -168 171 -91 94
2005 94 103 96 -15 -63 132 36 79 124 48 8 -109 -55 -142 117 -90 -27 252 41 11 -23 18 -192 -261 -244 -64 16 -62
2032 -62 -18 88 -21 65 84 125 208 32 -49 15 -111 -15 -246 173 -23 -128 299 -213 -272 145 -201 -182 -55 -101
2056 -101 23 2 234 7 171 220 54 -120 146 46 -99 -86 98 31 49 -118 -74 42 -4 -11 -217 24 -93
2079 -93 -116 -78 190 -27 16 64 -47 49 -36 11 82 16 62 67 61 -25 49 11 -144 -159 -346 -20 66 -62 -39 41 19 -58
2107 -58 126 110 -206 -179 78 93 -61 195 107 23 288 -78 59 255 -181 -62 39 93 86 89 99 -78 -182 90
2131 90 -123 -20 -80 -5 -56 -66 199 77 193 24 123 45 109 -6 6 238 -132 68 171 162 37 196 -3 -248
2155 -248 199 -120 -201 -25 -26 -106 25 -121 102 86 70 141 -67 53 -10 -19 22 101 44 -90 244 -125 -153 56 -76
2180 -76 37 39 -73 -96 -137 18 -73 26 100 156 -122 222 -160 -188 218 -188 -94 152 199 149 252 290 -74 22 95
2205 95 -185 59 -316 -35 -342 -18 48 3 16 112 -180 -66 130 53 -40 303 2 132 156 -132 -115 232 -197
2228 -197 -94 124 12 3 102 249 -46 -34 -36 4 -83 -13 -5 8 74 171 102 207 49 -132 -18 -40 59 -15 137 13
2254 13 -62 -27 -59 120 -174 264 62 -91 -166 -150 23 -48 -128 183 -22 -7 68 -228 -23 -87 -25 112 -43 83
2278 83 -119 176 -5 -189 115 54 -75 -305 47 -49 -9 76 -17 92 54 -124 -234 -61 -90 10 -14 -24 32 -56
2302 -56 19 3 169 153 -175 175 -89 92 -12 -42 -142 -27 -57 21 -51 -25 1 171 -242 29 44 -62 -10 -92
2326 -92 -77 -74 -71 139 -70 207 61 61 74 -88 -6 76 -79 195 -21 -32 -2 1 21 99 34 -14 19 63 -117 193 -108
2353 -108 31 87 -98 -49 70 174 13 23 -75 133 82 173 -75 66 -21 112 -158 80 -22 103 -31 -44 2
2376 2 -33 -60 119 -22 -133 118 -107 63 -6 17 -30 -50 -141 62 -80 -51 -170 89 -112 -24 4 -25 -85 24 82
2401 82 -77 -8 107 -113 48 204 92 101 93 -4 266 114 171 -59 179 0 -72 -77 -46 48 -170 48 -165 50
2425 50 -110 -218 19 -82 70 -149 -109 -17 61 52 -119 -215 5 -92 151 41 -36 -40 174 188 -166 102 -2 -36
2449 -36 38 -92 -21 12 -27 56 -102 -178 -12 55 -89 41 -40 -55 142 18 -159 97 100 -8 -102 72 -216 91
2473 91 252 64 179 32 -25 -36 -28 51 -34 -94 44 -5 64 77 -149 -43 66 98 137 34 73 -23 -123 -85 15
2498 15 59 -17 -2 -134 -30 -42 -30 142 -47 62 -60 -124 97 90 -15 6 83 47 -97 20 45 -99 -40 -27 261
2523 261 -12 -8 11 12 -175 -9 -87 -14 79 -105 89 131 -6 130 8 9 127 -33 87 -156 -32 -81 36 169
2547 169 -104 82 95 -74 -138 -232 -47 24 52 41 -91 -40 -112 46 -3 -47 -45 -86 76 17 58 -46 58 -64 93
2572 93 52 89 154 -195 39 -17 6 78 -91 -117 169 201 115 76 12 44 -122 -88 -4 -208 -105 3 -274 -24 125
2597 125 -73 6 44 130 -153 154 139 85 8 30 -100 67 -101 -231 66 -139 83 46 173 57 100 165 -19
2620 -19 119 -75 -95 26 78 36 -60 -96 23 39 102 79 12 -73 183 -14 21 -313 -90 -193 152 -49 -163 -48
2644 -48 111 305 -133 -16 157 5 -53 -73 -136 112 103 211 7 -116 14 -62 157 42 -68 15 -96 -152 -51
2667 -51 -115 125 190 -10 89 262 16 -20 -57 -137 187 -43 -106 231 61 -282 -14 -71 51 251 -98 12 -90
2690 -90 20 11 155 -50 -94 -61 30 169 -145 48 26 -50 -102 228 -94 68 -32 -67 180 -28 122 80 8 57
2714 57 66 15 52 -131 63 -134 -154 71 107 56 -95 -67 -135 -132 12 -77 74 -9 -97 -13 -28 18 149 -23 -48 74
2740 74 59 14 -30 -156 15 40 -20 -76 -117 66 79 -39 52 31 52 -58 -27 136 -150 -99 -70 -80 138 260 -119
2765 -119 -38 115 4 -73 -133 127 -4 16 -9 143 -30 -145 -30 -9 -95 74 -36 81 86 -95 -100 -239 -1 -145
2789 -145 -16 -120 55 -56 58 -35 65 24 19 21 -26 90 38 100 -134 93 -68 113 142 222 234 -82 -36 125
2813 125 100 -85 -29 -101 60 -114 -12 -157 21 5 40 -83 14 41 -58 -130 -218 -46 -62 -99 -26 -217 19 -57 -228
2838 -228 58 40 67 -33 28 69 -133 -24 -117 -104 19 -82 0 239 196 94 111 36 80 -184 63 157 -48 51
2862 51 -41 -90 -40 120 -72 217 -101 -133 122 -71 -192 166 -108 97 143 113 110 -47 -155 -16 -100 122 151 -213
2886 -213 -3 70 28 66 -80 -34 96 58 11 -122 110 94 -51 116 -199 23 -56 74 -46 85 40 -3 -103
2909 -103 43 166 47 52 -75 72 -10 52 294 135 -101 -57 -114 -195 -148 208 -26 24 35 78 53 -18 -184 9
2933 9 52 -55 -245 -89 -61 -91 70 -167 -4 -150 133 117 -75 0 19 100 193 85 72 -11 13 -76 -79 43 52 -179
2959 -179 11 143 -28 176 -100 -76 86 -72 -68 -55 -36 -146 85 -67 -66 -189 34 26 -120 62 -57 -29 -16 -25
2983 -25 23 -13 29 66 77 111 27 95 69 -53 -35 67 -196 -34 17 154 17 -35 -148 -148 66 -134 42 73 -34
3008 -34 283 -81 -319 122 -25 -133 -75 -200 -168 288 41 55 -71 108 58 -83 -58 -67 -85 -10 10 112 74 31
3032 31 -19 250 -2 -124 89 148 -199 -126 -18 -76 82 -147 169 134 -200 124 2 11 140 67 91 -39 -2 86
3056 86 25 206 20 14 -42 -162 82 -142 135 -40 83 -140 166 219 44 -110 -53 181 16 -111 -149 52 -69
3079 -69 88 -9 218 116 112 65 4 30 -157 -167 59 58 -32 -84 44 -140 -102 55 -37 -39 -69 11 -22 -53 -57 -20 -11 6 -72
3108 -72 -29 -6 22 -55 108 39 47 106 -251 6 184 -125 27 80 -87 -51 34 -140 25 -115 26 110 -59 -119 63
3133 63 -52 15 40 -34 99 -31 -154 -17 -2 -44 -230 166 98 61 17 108 97 48 -11 103 -90 109 66 80 -75
3158 -75 165 17 -80 22 16 40 -25 106 -19 116 -32 -88 -130 -140 -117 1 -28 -96 -181 72 59 205 37 -4 -25
3183 -25 -126 -59 136 38 -158 7 173 -11 -156 -103 151 51 65 -82 -107 85 -53 -51 -22 -38 -69 64 -29 -221
3207 -221 -61 22 41 -19 -93 77 56 -29 -23 -214 102 -4 -28 -29 121 137 -46 145 -26 -35 -123 -6 213 -67 -137
3232 -137 -45 -17 -146 -8 -30 -43 120 193 189 26 -164 57 -127 -93 21 81 -199 126 99 113 45 95 40 -108 146
3257 146 -44 -10 61 46 136 108 35 -33 -20 -102 47 23 164 55 -13 -145 6 -41 93 28 103 81 66 103 -136 -233
3283 -233 42 -118 -174 -102 -109 -85 10 66 -19 -67 158 -40 -8 23 -96 172 -224 -228 131 -42 23 -71 -35 -22 91 91
3309 91 31 -83 32 -1 9 97 -122 56 -64 68 -55 50 -126 -213 133 -106 -35 -18 -103 -121 89 33 -60 -175
3333 -175 -31 29 -61 -236 154 153 -148 75 108 -89 -131 6 7 -168 -62 -102 -132 36 -186 -66 157 -30 -70 70
3357 70 -161 1 33 -69 189 98 43 72 -39 -99 -23 -17 -61 -174 95 -89 -108 -71 83 128 -123 38 -50 75 -119
3382 -119 24 -114 66 -118 -81 -1 87 26 101 -111 91 -5 129 77 -20 -53 190 54 -24 -110 -224 26 145 68
3406 68 -96 258 257 79 90 -27 102 -4 -188 41 77 -101 -92 -146 -31 200 -4 51 46 122 70 -179 25 26 5
3431 5 -83 -41 106 58 104 -70 -71 -17 -265 52 18 14 -11 148 -144 278 -30 42 -186 243 73 -114 -90 -198 45
3456 45 -101 169 245 31 -188 51 34 -101 -107 68 -63 7 -135 19 20 -37 9 22 32 -224 21 -107 -86 164
3480 164 42 82 69 -82 93 -162 -66 51 102 38 -168 93 191 -90 59 -58 220 -125 198 7 180 166
3502 166 106 56 102 16 2 -109 -11 195 61 -79 -167 61 70 -128 -65 80 -50 -56 97 192 11 -33 77 -51 -171
3527 -171 -75 -104 -69 105 -96 93 -38 117 164 -76 -46 140 -110 -47 -12 57 -37 -2 131 -20 137 -140 42
3550 42 -8 -57 239 -24 -53 -76 35 9 -47 -84 -10 -43 -83 70 -26 82 13 -88 20 61 77 91 126 -97 -278 -87
3576 -87 43 -77 216 95 -152 44 23 23 10 133 187 69 109 -19 217 13 -7 45 108 122 -107 -68 7 -28 118
3601 118 3 18 -263 96 36 -92 28 36 82 107 -307 -125 56 7 7 108 108 -63 23 -7 156 172 -87 -61 24
3626 24 16 49 -113 -60 122 133 -37 -30 137 66 147 95 -138 -113 50 -65 -236 -101 -16 5 -28 62 -148 -163 -205 1
3652 1 -45 -174 8 -4 100 93 168 149 69 73 -56 -101 95 81 -247 86 32 82 -20 67 -83 -16 3 167 67 -15
3678 -15 123 122 -60 88 -63 -68 181 -196 -3 -109 -3 -42 37 -7 59 -36 -69 193 90 34 -17 53 -36 -103 151
3703 151 112 54 3 -37 116 -70 233 -113 -111 91 14 62 39 -38 0 123 221 -95 -26 -188 92 248 101 -31
3727 -31 -137 -89 -176 99 -81 369 91 82 -21 121 -162 135 -81 32 182 -171 97 125 84 -107 32 -16 110
3750 110 41 -1 7 -255 -118 132 -19 92 -188 -143 30 -120 6 -49 -59 -19 8 109 -86 -25 90 64 -11 99
3774 99 51 105 36 -9 -76 26 -100 43 54 108 80 151 -77 50 -33 -122 -31 -52 106 -119 146 3 -89 -33 194
3799 194 -71 111 -53 -13 142 279 29 110 28 -120 117 -9 148 78 -32 245 -94 7 -8 -32 -2 105
3821 105 59 109 105 -253 58 97 85 -85 32 47 -14 -83 -115 92 -23 -186 -167 237 125 -144 265 -40 121 24
3845 24 116 10 74 214 76 62 -32 -60 -26 -55 -45 -53 55 94 -20 12 104 -33 -26 100 -81 40 -112 71 28 148
3871 148 -192 1 111 -261 -94 -172 48 36 68 77 -1 23 -57 61 -49 -29 -114 -124 39 -73 48 -34 197 -144
3895 -144 106 74 57 192 -3 112 91 111 -215 99 -39 93 -14 81 -5 -152 -163 -131 -50 -3 24 65 -120 -2
3919 -2 -13 208 122 75 12 -55 -30 -31 105 -94 34 8 59 -208 13 -138 88 -111 19 7 -67 -63 -25 -63 -195 -62
3945 -62 -153 90 -71 -21 -26 -68 -7 -53 163 -13 94 -13 8 -113 -93 -219 -5 -111 137 38 83 58 148 70 -54
3970 -54 -120 3 -17 -66 15 77 14 -175 -5 -141 -155 -156 98 36 137 -73 76 130 145 108 15 5 41 91 -35 -114
3996 -114 149 -130 145 52 -4 141 77 -252 -217 119 -67 129 -80 54 -31 -34 -102 -115 6 -21 -59 -4 19 66 160
4021 160 118 144 -51 -85 -181 186 -84 46 89 -69 10 -30 94 12 0 -122 210 -290 124 120 60 -63 -25 44 184
4046 184 -129 -126 -33 -131 18 76 38 341 9 19 71 92 -5 113 51 187 6 27 -12 -48 -122 60 97 -48 3 75
4072 75 -14 103 85 -24 -92 -96 -120 -86 -57 66 -10 164 71 117 -14 -25 -26 37 41 -56 163 136 88 -64 20 46 -37 -139
4100 -139 -74 -20 -82 183 308 -182 82 67 -148 -64 151 95 88 -48 -145 53 -204 -24 86 167 139 -60 -109 -6
4124 -6 28 -151 78 -51 14 49 -53 -17 -25 194 -58 -64 -108 19 -85 154 -45 10 -39 242 -82 -115 -49 49 96 -23
4150 -23 -56 -39 -36 -11 -40 -152 125 5 88 49 144 27 54 -123 -53 -38 -3 126 19 -204 98 45 13 244 -74
4175 -74 22 -149 -7 -31 50 -159 -41 -129 -11 19 -175 -38 30 -102 -81 109 3 -11 167 -165 -17 -3 -3 -85
4199 -85 24 65 -109 235 74 115 -43 -174 -141 67 9 -249 -95 18 72 117 -42 -96 -3 60 -76 202 56
4222 56 283 -134 10 -24 -301 -69 148 -54 -13 -47 -98 65 52 -7 91 -78 48 121 81 130 -141 -146 108 -71
4246 -71 40 -91 118 -108 -90 -40 93 -57 14 13 -53 51 -119 -171 197 89 7 -188 -24 21 62 -52 109 65
4270 65 80 57 -4 113 11 17 47 -11 26 -79 3 -57 -29 -253 241 -106 -10 40 54 63 -50 132 -117 -56 46 75
4296 75 -47 -68 186 28 -63 160 181 3 196 94 -93 83 -12 28 -29 -65 104 -89 -178 30 -30 127 -74
4319 -74 -33 68 252 -96 27 93 58 -87 81 135 48 -25 149 88 -36 83 358 69 100 78 77 37 -19 -159 116
4344 116 7 45 196 -67 198 -14 -123 144 33 81 -27 31 22 -14 11 -305 73 121 -43 -131 70 -65 26
4367 26 -32 -20 37 -27 237 -148 156 167 198 162 149 54 11 68 171 59 -138 10 -90 -173 -177 70 -124 88 52
4392 52 -134 -82 106 68 -100 25 -213 93 112 56 79 2 28 -9 -59 137 -124 -1 76 62 8 -18 23 110 -77
4417 -77 -69 -95 -29 290 -126 115 23 122 -243 -126 132 67 59 63 -153 70 -223 54 -68 8 178 12 -10 -107 134
4442 134 -152 -43 198 140 -243 -19 20 -55 103 -124 6 90 -22 175 114 -48 -38 -117 36 -54 -40 200 0
4465 0 253 246 -31 -84 28 -89 -165 13 177 -6 97 -144 -52 -100 -90 -4 -136 50 -11 144 -163 -84 1 -85 -98
4490 -98 132 115 160 44 34 103 91 -92 -50 -307 -162 2 -37 -40 -97 -53 73 -24 -27 86 124 -143 96 7 -2 91 -34
4517 -34 3 -12 95 105 77 -23 0 171 20 -160 59 243 196 -1 -60 -25 11 71 43 21 -28 31 209 -22 -48
4542 -48 219 149 -109 -53 18 13 -50 89 -4 -5 -29 40 -56 49 53 -131 -20 -54 108 24 -14 89 193 -26 -1 -147
4568 -147 -53 -70 89 96 103 -100 -114 -96 30 29 61 194 9 133 -15 173 -13 130 -83 82 -22 141 -57 -6
4592 -6 172 -14 -62 137 88 -70 14 -5 -46 -40 -83 42 -40 23 29 69 92 -28 -54 48 231 -15 -184 91 -150 16
4618 16 -147 -137 57 127 -168 12 -20 -118 -5 42 -5 113 -74 29 82 113 -87 123 49 159 -40 110 -166
4641 -166 -16 31 11 -8 -36 0 81 -93 205 87 -95 -105 -218 -91 12 124 110 -79 -65 -162 82 -97 112
4664 112 72 9 12 127 152 53 128 88 65 -50 -91 60 -32 78 -77 -5 -59 -83 44 98 -99 -1 51 -264 21 21
4690 21 107 -71 -21 31 -17 183 100 -53 135 -5 -37 -145 119 -55 -39 -84 46 66 26 106 -40 179 146 -38
4714 -38 -118 -60 -175 272 16 12 -190 7 -22 -102 47 -90 117 -98 53 -56 103 170 14 169 27 -28 -40
4737 -40 -2 85 50 -54 40 -45 70 205 35 -122 -80 -30 -263 -43 21 81 -43 66 -104 64 116 29 46 3 -158
4762 -158 -107 -156 82 96 26 126 -15 13 188 27 -11 -35 1 142 -110 137 13 177 -40 25 -11 -50 -80 -31
4786 -31 -124 -136 -59 -131 -33 133 24 -4 -117 -180 13 -139 -119 27 318 -11 10 36 75 -2 -40 -167 67 86 -45
4811 -45 -47 182 27 -149 -147 -82 80 -131 235 -154 -5 95 -40 -117 -89 -15 24 150 -153 94 -261 -63 117
4834 117 -62 201 193 255 -26 57 -106 -48 48 8 38 -2 -1 113 -232 11 -45 -53 -215 75 -218 4 20 -94 4
4859 4 -74 -255 -70 113 105 -83 -25 -44 78 26 -20 -103 89 -58 -66 -30 7 121 -35 -59 -5 120 225 -18 -182
4884 -182 102 -180 51 42 34 33 -32 8 -26 -15 66 -37 -31 11 -66 228 -63 13 78 57 -74 -19 -92 -1 -36 -59 46 59
4912 59 -6 -56 0 79 147 -81 -104 -157 -43 19 -75 156 123 -195 -17 -10 -84 48 5 268 -75 1 37 -44 -25 -26 56
4939 56 114 -171 -113 166 37 -48 -18 130 -68 -129 55 -26 -112 77 -102 -27 200 58 -195 -80 -23 -28 -18 8 26
4964 26 226 -57 -31 -26 -28 181 170 -140 -24 -86 -93 -27 -83 -75 174 140 -26 19 73 -101 61 20 56 -133 42 -118
4990 -118 124 -58 -37 198 -20 55 -76 -79 82 -143 -252 109 79 -223 141 63 -55 36 -29 -7 -29 -184 19
5013 19 -115 -74 -17 -186 131 -142 48 57 64 166 -115 95 -97 -21 63 27 33 17 23 47 -103 106 -17 -33 11 64
5039 64 5 9 105 -61 71 42 -118 166 138 -7 56 -127 12 -69 -200 47 21 -31 113 7 -125 -34 45 -46 153
5064 153 32 4 -67 108 -10 -95 28 -27 -40 -31 83 37 53 -58 198 52 -148 84 82 6 -64 -18 -57 62 211
5089 211 -1 -94 102 128 101 -138 -71 57 84 -29 33 67 110 186 23 177 -1 23 -66 84 -16 6 122 -17
5113 -17 59 -124 -45 0 -209 -192 179 -20 -151 178 68 20 0 37 -152 -69 143 -5 -68 84 11 -122 13 -117
5137 -117 57 -184 -221 -18 -72 -131 -42 -55 171 11 30 99 123 -110 -17 258 -54 123 78 -77 3 124 -62 169
5161 169 150 -12 -63 178 -6 186 -120 -14 243 -5 -79 67 285 -74 -124 102 -94 -122 -44 -176 -145 -97 107
5184 107 158 81 95 -72 79 311 -26 -4 -214 150 191 -15 -64 124 16 8 35 -28 -122 59 131 -313 -96 10
5208 10 -33 38 -119 65 -151 -57 -78 47 -107 23 256 39 155 168 -38 -12 -96 14 108 -108 -143 -41 -76 -39
5232 -39 113 -120 -32 124 -85 58 -95 144 20 87 -101 54 -127 -33 66 -85 70 69 -153 -66 64 -118 -133
5255 -133 -42 12 16 -23 26 185 214 -234 -185 -205 -97 -265 27 72 4 55 76 432 15 -59 -18 21 -4 108 -67 57
5281 57 50 148 40 37 -43 31 37 19 59 -149 -32 204 -61 -178 -137 -23 202 173 -13 74 -117 -35 -8 68 90 -37
5307 -37 62 120 63 13 61 33 52 27 -159 44 110 -49 128 -5 48 -82 34 58 -108 -139 -286 -11 -246 -16
5331 -16 -95 -198 134 86 -87 -65 -59 -282 -193 -120 71 62 82 45 76 97 -165 93 -51 -66 21 131 -48 -83 -13 -26
5357 -26 47 131 39 -145 240 97 -31 -159 -68 123 -47 137 -61 30 -411 191 -8 -11 -61 13 319 81 26 -103
5381 -103 -74 -52 44 37 59 -19 -2 -93 24 232 -12 309 233 -176 2 167 -88 -104 44 -26 219 35 92 -162
5405 -162 85 -81 227 23 -106 27 -44 266 -84 65 49 -104 49 207 330 -212 6 24 86 -2 24 -119
5427 -119 -8 -15 -114 5 64 319 -38 151 89 -1 48 -138 -303 70 -36 -85 -45 -26 126 -165 -50 -87 59 -16
5451 -16 -18 -66 11 -53 47 41 73 -131 56 71 -23 40 238 97 -6 75 104 -77 -145 38 19 -24 -21 191 45 -79
5477 -79 -69 57 189 53 -27 -7 -44 83 -90 27 126 -165 74 100 7 -7 -150 -147 102 -14 166 -37 -42 177
5501 177 -75 -37 -146 155 -156 71 144 -14 148 -97 146 193 2 15 89 -20 65 -173 -124 -70 87 39 3
5524 3 59 -89 198 15 -179 -88 115 -135 20 -122 -32 -91 -161 22 -53 103 127 20 110 129 113 -120 -45 36 -111
5549 -111 -131 -133 63 -176 26 85 -91 27 30 49 26 -231 127 -94 -39 3 -59 -44 65 66 -91 -158 73 75 100 -17
5575 -17 -87 67 100 95 44 -64 -118 -28 17 -158 -63 -25 30 50 78 52 -77 -20 -75 -34 -21 -15 -49 54 122 -50 26 154
5603 154 -9 42 -24 44 -46 -37 -166 -29 14 -46 108 97 -70 98 -23 -19 155 56 5 96 196 -80 71 -64 -165
5628 -165 50 -56 -27 -106 182 13 -85 90 -139 60 3 58 59 -123 -48 -134 -2 -112 -129 -14 138 -188 64
5651 64 -9 128 -161 -143 -40 -69 -5 59 -15 -1 25 -30 112 -58 62 -137 -37 37 151 79 -26 -54 9 -124 -101
5676 -101 -89 -158 40 -113 -50 40 11 109 -111 -6 58 209 -120 67 -38 47 26 12 -35 60 96 -85 -147 -192 15
5701 15 -245 22 112 51 -13 91 -54 -112 -22 -51 -39 -17 176 -238 166 -5 -124 -132 86 -117 -19 -27 -86 -64 11 18
5727 18 -93 41 39 -187 -78 -116 87 -7 69 -102 43 261 2 64 68 121 -164 -142 109 162 -130 98 -2 -19
5751 -19 -70 5 67 40 -76 94 83 -23 -140 -44 92 -86 -162 -93 28 -7 156 149 -43 -7 117 -54 -26 -150 -74
5776 -74 148 135 -129 -26 -25 -45 -88 117 -1 148 11 -13 107 -81 29 174 -83 15 203 -244 121 69 -74
5799 -74 59 -25 -19 -39 -58 -59 -98 -201 69 -290 66 -81 -22 29 65 -27 -98 -59 -35 96 -38 -25 72 96 -50 234
5825 234 40 153 7 -43 -28 -18 -64 -110 112 43 34 -2 13 98 8 135 100 115 127 110 -21 110 -133 -29 -149
5850 -149 -171 80 -190 -55 195 -50 -130 101 57 174 46 14 141 -58 -101 63 43 67 87 0 -58 -52 -210 87
5874 87 12 54 -43 32 -112 111 -3 101 -150 -77 -1 -113 -6 -13 39 73 209 -8 -248 126 -83 -29 -68 80
5898 80 36 -103 -215 150 137 -115 74 36 62 -135 -4 -110 -116 83 265 -25 -46 48 44 -45 -163 45 -209 72
5922 72 193 -26 155 -146 252 -211 -164 -173 3 146 67 120 -123 112 119 135 166 -48 52 -61 50 -173 -43
5945 -43 -87 97 106 101 130 0 -23 -71 12 -133 38 -169 130 -50 -84 -118 -130 -134 -120 -52 -49 -105 30 -108 116 -49 -168
5972 -168 -70 -139 -148 12 -43 -41 76 11 100 -144 100 -22 74 -48 126 164 -169 27 -8 -31 -17 160 45 -194 82
5997 82 -112 52 -124 -57 72 4 52 -197 191 -90 -123 -221 -38 29 97 44 140 -25 -13 -336 2 8 7 -50 148
6022 148 24 73 84 6 -129 80 36 -38 36 -64 47 127 -86 32 -51 -170 -10 -32 63 -108 -79 -100 63 166
6046 166 -88 -98 -31 -84 -15 22 3 117 38 -159 146 147 -130 239 113 43 -57 53 -22 -97 -80 73 114 -80 -84
6071 -84 0 -218 -51 -102 53 -34 -106 -4 -86 228 -69 19 -28 123 -166 -9 -182 -1 -145 73 19 -89 -65
6094 -65 103 -43 37 -106 -119 68 -128 16 122 -39 71 34 -57 -5 67 46 -50 -37 -113 -105 -58 -63 -148 -95 -53 32 128
6121 128 -216 105 311 -8 -123 55 -40 228 -45 73 -40 -40 154 142 28 -9 -113 71 -66 -150 68 -23
6143 -23 -82 -98 47 21 -52 24 -27 63 -37 195 -24 203 70 28 59 -67 74 -68 23 -128 -95 18 65 146 -40
6168 -40 41 69 50 143 79 62 -84 11 -77 104 -109 115 -16 -59 -175 48 5 119 -253 123 -21 -58 157 -19
6192 -19 -21 12 -63 103 -8 -91 187 208 306 183 -63 133 -10 79 291 -13 -64 16 -85 232 -39 64 -42 -58
6216 -58 -43 -68 -138 -53 42 -114 -3 6 0 -266 -8 57 148 36 -77 -51 -71 -28 104 92 48 -162 17 127 77 -103
6242 -103 -119 130 -154 -177 -9 -26 -159 225 -89 -62 -139 81 -24 -65 137 -68 110 1 -8 -128 36 -64 -166
6265 -166 3 205 143 37 -84 22 308 89 34 112 -141 -58 34 82 97 42 -131 27 167 50 27 -47 -222
6288 -222 -50 -49 109 53 -20 -107 -8 43 209 8 -84 145 99 -106 -40 19 94 34 61 -100 -13 38 33 -216 104 -125
6314 -125 -108 111 91 -9 17 -14 -51 11 -71 75 6 -97 -40 32 -29 -37 -14 12 159 -80 -49 272 -147 -55 37 66
6340 66 -48 -70 -37 -116 102 -129 -3 -71 30 -35 109 -84 -33 -16 -45 31 57 -30 -85 61 22 -102 10 33 125
6365 125 85 78 -23 141 -13 141 78 70 -31 -7 -62 -97 -213 -27 74 -162 107 222 -37 -61 41 -37 114 -1
6389 -1 60 33 -184 -185 128 115 9 -148 85 -52 115 -2 -43 71 3 -42 -2 67 -60 208 120 -112 -128 -7 94
6414 94 31 -75 228 -202 -70 19 -73 186 -29 188 103 62 -56 43 29 163 -7 57 77 15 20 -107 34 -54 199
6439 199 -42 94 81 66 -39 134 183 115 67 -55 -93 72 -89 -4 26 124 77 -12 54 111 2 -112 0 -57 -45
6464 -45 46 -5 -376 124 204 24 13 209 21 38 24 13 123 137 -259 313 171 -75 79 57 49 -85 156 30
6488 30 37 -36 20 74 -115 129 204 94 44 11 -73 -5 56 -39 86 -193 88 135 -126 -39 55 32 -11 -1 -262 54
6514 54 149 143 116 81 -44 -174 16 -110 31 -15 -15 85 -168 77 163 -23 60 -68 83 -65 -12 -93 33 -15 94
6539 94 111 39 -60 140 73 -27 35 -16 32 -27 -48 35 -157 -94 92 56 133 -158 65 -83 -173 21 -40 21 -182 43
6565 43 -38 -156 237 5 3 143 -103 -6 81 7 69 19 223 -35 -118 103 -31 84 48 -296 -11 89 -130 -86
6589 -86 12 -56 -11 89 147 -143 94 -34 -7 14 2 -33 -24 100 80 -9 -7 -90 -108 -74 236 -191 27 -54 120 -163
6615 -163 160 -50 -135 42 22 67 28 -16 -37 199 -17 -206 -64 -99 -88 139 67 -11 37 179 -167 55 -37 103
6639 103 79 52 -157 45 143 -44 -114 75 -7 147 -40 163 72 20 -237 208 44 -51 36 232 -123 79 165
6662 165 100 158 -260 35 110 -49 -45 -4 24 -63 -83 -19 -21 108 7 -96 80 36 -105 -207 103 101 -119 205 -92
6687 -92 -122 203 -106 -185 93 100 -69 -4 173 15 49 1 36 223 54 -27 32 -6 47 38 22 -233 -104 55 -41 -10
6713 -10 -192 83 -124 -90 -87 -83 -94 -60 -79 16 -56 -1 47 110 54 131 333 -96 49 -31 -58 -15 -285 -114 81 41 -137
6740 -137 -41 -213 -102 69 -247 -21 -91 69 132 -112 13 -56 24 83 62 8 54 20 -186 -1 127 -37 113
6763 113 28 107 -92 -85 80 -65 62 -196 23 -54 14 97 48 138 136 95 -147 -24 208 -25 266 -119 58 -47
6787 -47 -2 20 -99 1 -55 1 194 155 -14 80 -60 -68 -42 -13 6 -92 133 73 160 -85 177 51 -23 259 -258
6812 -258 46 -30 -93 -26 -107 -23 3 -61 12 -29 4 40 90 19 136 143 288 -96 1 -286 87 212 -11 66 -194 81
6838 81 -110 240 -160 65 -72 -55 -198 -32 93 126 23 57 97 162 -152 -83 135 -18 -115 61 -163 -239 -9
6861 -9 -20 -46 -202 120 -108 80 43 -198 -41 -17 22 242 108 188 -17 80 55 84 -161 -296 44 61 -76 -73 -43
6886 -43 -79 73 6 -63 144 119 -104 93 -30 -55 33 37 -99 -158 35 -56 -35 -79 -269 -67 -92 91 22 -106 -70
6911 -70 -296 163 -159 63 -150 -77 -116 -26 107 127 -155 -25 -41 -170 82 131 1 29 13 185 -173 -142 30
6934 30 104 42 77 139 -37 135 46 -208 11 57 -8 72 198 28 16 -65 14 54 -203 6 34 102 25 27 -17 26 52
6961 52 74 -44 67 21 7 68 147 21 -29 -123 70 23 -1 62 187 61 -24 46 180 63 201 182 -156 -224 71
6986 71 18 190 23 -30 210 -221 -44 38 98 49 109 75 127 -38 -50 -118 130 -151 3 -65 -91 36 -175 -17
7010 -17 -165 -60 -104 122 -102 -116 53 -82 41 -80 166 30 233 -100 -90 84 -14 65 152 169 231 100 -19
7033 -19 -109 -20 -58 74 53 -40 -62 216 118 -145 111 31 110 -39 -18 137 -167 -33 62 159 -217 -109 318 172
7057 172 -53 -36 -62 -19 62 -175 61 -116 93 28 186 42 -201 149 22 -262 -13 -101 77 89 41 81 -168
7080 -168 106 199 23 169 -203 -59 35 17 -77 121 -128 4 -119 -114 -174 128 -45 -144 -83 -47 48 -164 163 8
7104 8 -53 129 97 -127 -94 -277 22 -84 -19 -75 11 -78 -7 -107 -116 9 68 133 183 112 -10 18 41 8 -159 27
7130 27 -47 126 79 62 -131 -187 50 120 -58 199 121 -75 -9 0 -112 -108 -6 -126 -156 45 60 -23 54 -35 -194 132
7156 132 125 118 68 -255 26 -17 198 -79 -41 144 10 -45 -40 92 103 -144 -103 61 -171 63 4 128 -54 290
7180 290 12 -78 -9 101 66 85 32 -184 139 168 -108 -152 -97 -18 -68 97 -85 -65 107 -19 107 12 27 -150
7204 -150 -211 49 -5 72 1 38 154 66 -103 -141 35 -154 -43 123 160 144 -23 162 -53 74 -72 -85 -43 -6
7228 -6 -247 -124 52 -111 78 5 113 -95 25 -60 -29 161 138 96 77 -32 134 -105 -21 -31 -54 127 -21 -114
7252 -114 -36 215 -111 -73 -41 73 73 48 -36 -185 260 -127 -43 176 63 113 -243 111 -4 -266 -129 -193 -150 145
7276 145 25 59 -31 -93 64 -42 166 23 1 -61 -169 186 -127 -101 147 156 -19 -14 51 -37 46 -138 61 17 -66
7301 -66 -29 -17 -25 86 163 -27 115 -57 95 -52 -152 301 13 -25 40 17 -198 -313 140 -196 5 -48 2 14
7325 14 -86 -2 160 -17 203 -99 -46 -148 40 20 -33 -41 38 -124 189 74 30 -49 171 163 -58 -148 31 -143
7349 -143 -202 78 127 -145 -132 52 90 -19 46 -24 -76 -49 11 -107 -112 60 -51 -70 -71 -57 -2 -285 -21 130 90 144
7375 144 121 -30 137 -61 97 38 -21 -190 -42 -222 19 -6 -112 -33 -64 -109 -9 107 2 -45 14 56 -168
7398 -168 31 -133 -11 -16 -7 26 93 58 -131 31 54 25 49 171 113 -72 -67 -17 -161 -61 -81 9 202 -98 107
7423 107 -119 45 -117 -19 -15 -40 -78 98 24 90 147 52 207 -100 81 -74 75 15 -94 -89 73 -49 140 35
7447 35 -14 -4 35 -43 162 -24 -68 68 28 106 -57 -124 -36 27 52 -11 11 53 61 -70 -28 -87 -40 -155 8 146 7
7474 7 177 50 88 164 9 -95 -18 5 42 89 115 69 -115 -44 99 149 -46 16 -23 66 -57 -79 37 -22 57 -84
7500 -84 -103 31 -56 103 -95 3 -55 -36 9 -108 -86 167 -2 93 111 -21 93 109 -155 -112 -34 -79 109 -139 -237
7525 -237 20 -1 -59 -170 96 46 53 -139 -2 67 134 109 113 32 -66 56 -73 3 17 -18 72 -26 158 40 -1 -6 -53
7552 -53 99 183 -109 -102 -44 -99 -76 -32 -108 -26 48 -61 -265 -66 -125 -147 23 -86 -52 -198 -60 101 -67 46 133
7577 133 68 -87 -81 -71 -187 61 65 -39 -9 -45 1 -54 35 57 69 -36 -47 237 -84 8 -84 -59 -114 63 11 29 52
7604 52 -187 -96 -62 37 60 -133 -187 -142 53 75 85 187 126 110 21 -156 101 47 166 65 -137 -109 -105 4 179
7629 179 -33 -141 -26 41 -67 158 86 33 -147 273 68 -92 -122 27 -87 -34 244 207 28 -143 -1 181
7651 181 -28 77 -56 -71 30 -28 -33 21 134 -18 -10 49 81 -177 -102 -42 -198 -44 61 -59 28 -48 188 35
7675 35 -32 167 26 5 109 46 67 -154 -171 38 88 -187 -67 -27 -77 -189 -80 -71 -92 115 288 -209 -102 -38
7699 -38 -78 -77 -12 -87 56 100 135 172 31 -67 159 -88 8 -37 -88 296 -298 -101 -61 -96 123 -135 11 -15 16 -4
7725 -4 134 145 -198 -209 -253 -144 4 -274 41 158 -57 -48 39 107 -70 -32 -93 -58 10 -88 155 48 -53 -63 -79
7750 -79 300 11 -177 11 -58 -42 -36 -75 126 68 -45 94 -34 6 0 -166 -241 106 -41 -72 80 54 -75 165
7774 165 -45 83 -84 -148 42 26 19 254 -25 -142 -134 -46 75 88 -145 33 127 165 -81 -89 -53 -58 -164 -63 -74
7799 -74 97 4 -221 -43 -147 -90 -190 -23 -5 -157 -58 71 -162 -61 -46 -21 105 194 -177 74 -35 -130 -193
7822 -193 38 -158 164 97 65 -84 31 -130 -94 36 -78 -175 -1 -16 34 3 -20 27 -103 129 8 139 -120
7845 -120 72 -128 92 -23 -120 143 -123 209 -96 60 -17 -81 -108 -84 -29 -17 -91 30 -145 -39 53 -4 -29 -101
7869 -101 -178 -121 117 89 70 -184 132 -259 60 68 24 -72 112 -15 -49 172 -85 -1 94 -109 -126 100 -143 148
7893 148 94 -118 98 42 102 -90 -65 26 79 -10 -159 -34 50 -55 74 173 186 3 163 -137 45 -43 -7 -79
7917 -79 10 -5 -49 -71 -74 200 174 -103 144 236 23 -113 175 -64 -248 74 -21 19 138 -124 -19 -8 43 -93
7941 -93 -67 197 -17 13 219 49 -67 142 -89 163 -1 46 74 -27 -35 -91 -88 -72 -18 16 105 -47 91 -208 62
7966 62 -16 -88 56 91 118 -86 -77 137 0 -28 -63 -21 228 -235 230 33 -159 -7 -55 -39 84 63 -75 78
7990 78 144 -87 39 -119 89 20 148 48 -17 -196 -21 -119 40 -50 -136 47 -110 194 -124 -13 333 21
8012 21 -108 -24 -113 -162 -30 53 -127 81 -43 -118 1 -126 -110 94 1 -131 17 -202 -74 -33 170 31 184
8035 184 -48 132 154 -114 22 38 11 -336 130 -64 -76 -32 -51 27 310 -174 -85 94 -166 78 14 19 -201 16
8059 16 128 3 -58 78 25 50 130 -67 143 176 204 -141 123 210 70 38 34 61 39 70 107 -111 88 -141 151
8084 151 64 4 87 -137 -45 61 56 -202 -155 -16 55 -93 -52 85 302 200 28 -54 -25 87 65 43 88 57 -206
8109 -206 7 -5 81 102 -228 133 -85 -179 11 -162 -14 33 -101 -155 58 128 -130 14 -17 2 123 95 -22
8132 -22 -148 -78 -101 48 4 -153 -42 57 -111 55 50 3 -173 -139 -157 10 -90 -180 -36 -204 -93 -29 212 5
8156 5 123 -209 68 -7 53 -33 -54 220 -103 210 -89 -207 -50 -110 -274 248 86 150 -49 -288 -89 -134 112
8179 112 -77 -30 -39 116 129 144 -202 73 93 -35 -161 -12
8191a2
##END NTUPLES=NMR FID
##END=
