##TITLE=1H_DE-108_oil_TFA
 200.13MHz, CDCl3,
 8 sc
 
 2.9.2025
##JCAMPDX= 6.0         $$ Bruker NMR JCAMP-DX V2.0
##DATA TYPE= NMR FID
##DATA CLASS= NTUPLES
##ORIGIN= UXNMR, Bruker Analytische Messtechnik GmbH
##OWNER= pz
$$ XWIN-NMR		Version 3.5
$$ Tue Sep  2 14:31:23 2025 Russian Standard Time (UT+4h)  she@DPX200
##.OBSERVE FREQUENCY= 200.1313
##.OBSERVE NUCLEUS= ^1H
##.DELAY= (6, 6)
##.ACQUISITION MODE= SIMULTANEOUS
##.ACQUISITION SCHEME= undefined
##.AVERAGES= 8
##.DIGITISER RES= 18
##SPECTROMETER/DATA SYSTEM= spect
##.PULSE SEQUENCE= zg30
##.SOLVENT NAME= CDCl3
##.SHIFT REFERENCE= (INTERNAL, CDCl3, 0, 14.3821)
##AUDIT TRAIL= $$ (NUMBER, WHEN, WHO, WHERE, WHAT)
$$ ##TITLE= Audit trail, XWIN-NMR		Version 3.5
$$ ##JCAMPDX= 5.01
$$ ##ORIGIN= Bruker BioSpin GmbH
$$ ##OWNER= she
$$ F:/spectra/data/she/nmr/H-C/1/audita.txt
$$ ##AUDIT TRAIL=  $$ (NUMBER, WHEN, WHO, WHERE, WHAT)
(   1,<2025-09-02 14:30:11.35 +0400>,<she>,<DPX200>,
      <created by zg, POWCHK disabled, PULCHK disabled
       configuration hash MD5:
       00 E9 B6 7A A2 85 ED C7 34 08 36 98 17 FE 4E 26
       data hash MD5: 16K
       52 93 47 78 B1 06 1C F6 3E 24 E0 85 D6 77 CC 55>)
$$ ##END=
$$ 
$$ hash MD5
$$ 82 B9 2D 3E 82 AB A4 E7 52 0B C4 F3 80 5A A4 F1
##$RELAX= 
##$RELAX= 
##$RELAX= 
##$RELAX= 
##$RELAX= 
##$RELAX= 
$$ Bruker specific parameters
$$ --------------------------
##$DU= <F:/spectra>
##$EXPNO= 1
##$NAME= <H-C>
##$PROCNO= 1
##$TYPE= <nmr>
##$USER= <she>
##$AMP= (0..31)
100 100 100 100 100 100 100 100 100 100 100 100 100 100 100 100 100 100 
100 100 100 100 100 100 100 100 100 100 100 100 100 100 
##$AQSEQ= 0
##$AQ_mod= 1
##$AUNM= <au_zg>
##$AUTOPOS= <>
##$BF1= 200.13
##$BF2= 200.13
##$BF3= 200.13
##$BF4= 200.13
##$BF5= 200.13
##$BF6= 200.13
##$BF7= 200.13
##$BF8= 200.13
##$BYTORDA= 1
##$CFDGTYP= 0
##$CFRGTYP= 5
##$CHEMSTR= <none>
##$CNST= (0..31)
1 1 145 1 1 1 1 1 1 1 1 1 1 1 1 1 1 1 1 1 1 1 1 1 1 1 1 1 1 1 1 1 
##$CPDPRG= <>
##$CPDPRG1= <>
##$CPDPRG2= <>
##$CPDPRG3= <>
##$CPDPRG4= <mlev>
##$CPDPRG5= <mlev>
##$CPDPRG6= <mlev>
##$CPDPRG7= <mlev>
##$CPDPRG8= <mlev>
##$CPDPRGB= <>
##$CPDPRGT= <>
##$D= (0..31)
0 0.7 0 0 0 0 0 0 0 0 0 0.03 0 0 0 0 0 0 0 0 0 0 0 0 0 0 0 0 0 0 0 0 
##$DATE= 1756809010
##$DBL= (0..7)
120 120 120 120 120 120 120 120 
##$DBP= (0..7)
150 150 150 150 150 150 150 150 
##$DBP07= 0
##$DBPNAM0= <>
##$DBPNAM1= <>
##$DBPNAM2= <>
##$DBPNAM3= <>
##$DBPNAM4= <>
##$DBPNAM5= <>
##$DBPNAM6= <>
##$DBPNAM7= <>
##$DBPOAL= (0..7)
0.5 0.5 0.5 0.5 0.5 0.5 0.5 0.5 
##$DBPOFFS= (0..7)
0 0 0 0 0 0 0 0 
##$DE= 6
##$DECBNUC= <off>
##$DECIM= 32
##$DECNUC= <off>
##$DECSTAT= 4
##$DIGMOD= 1
##$DIGTYP= 9
##$DL= (0..7)
0 120 120 120 120 120 120 120 
##$DP= (0..7)
150 150 150 150 150 150 150 150 
##$DP07= 0
##$DPNAME0= <>
##$DPNAME1= <>
##$DPNAME2= <>
##$DPNAME3= <>
##$DPNAME4= <>
##$DPNAME5= <>
##$DPNAME6= <>
##$DPNAME7= <>
##$DPOAL= (0..7)
0.5 0.5 0.5 0.5 0.5 0.5 0.5 0.5 
##$DPOFFS= (0..7)
0 0 0 0 0 0 0 0 
##$DQDMODE= 0
##$DR= 18
##$DS= 0
##$DSLIST= <SSSSSSSSSSSSSSS>
$$ [...]
##$SUBNAM0= <"">
##$SUBNAM1= <"">
##$SUBNAM2= <"">
##$SUBNAM3= <"">
##$SUBNAM4= <"">
##$SUBNAM5= <"">
##$SUBNAM6= <"">
##$SUBNAM7= <"">
##$SUBNAM8= <"">
##$SUBNAM9= <"">
##$SW= 18.0517328524113
##$SWIBOX= (0..15)
0 0 2 0 0 0 0 0 0 0 0 0 0 0 0 0 
##$SW_h= 3612.71676300578
##$TD= 16384
##$TD0= 1
##$TE= 0
##$TE2= 300
##$TE3= 300
##$TEG= 300
##$TL= (0..7)
0 120 120 120 120 120 120 120 
##$TP= (0..7)
150 150 150 150 150 150 150 150 
##$TP07= 0
##$TPNAME0= <>
##$TPNAME1= <>
##$TPNAME2= <>
##$TPNAME3= <>
##$TPNAME4= <>
##$TPNAME5= <>
##$TPNAME6= <>
##$TPNAME7= <>
##$TPOAL= (0..7)
0.5 0.5 0.5 0.5 0.5 0.5 0.5 0.5 
##$TPOFFS= (0..7)
0 0 0 0 0 0 0 0 
##$TUNHIN= 0
##$TUNHOUT= 0
##$TUNXOUT= 0
##$USERA1= <user>
##$USERA2= <user>
##$USERA3= <user>
##$USERA4= <user>
##$USERA5= <user>
##$V9= 5
##$VALIST= <valist>
##$VCLIST= <CCCCCCCCCCCCCCC>
##$VD= 0
##$VDLIST= <DDDDDDDDDDDDDDD>
##$VPLIST= <PPPPPPPPPPPPPPP>
##$VTLIST= <TTTTTTTTTTTTTTT>
##$WBST= 1024
##$WBSW= 4
##$XGAIN= (0..3)
0 0 0 0 
##$XL= 0
##$YL= 0
##$YMAX_a= 132689
##$YMIN_a= -189798
##$ZGOPTNS= <>
##$ZL1= 120
##$ZL2= 120
##$ZL3= 120
##$ZL4= 120
##$ABSF1= 10
##$ABSF2= 0
##$ABSG= 5
##$ABSL= 3
##$ALPHA= 0
##$AQORDER= 0
##$ASSFAC= 0
##$ASSFACI= 0
##$ASSFACX= 0
##$ASSWID= 0
##$AUNMP= <proc_1d>
##$AZFE= 0.1
##$AZFW= 0.1
##$BCFW= 1
##$BC_mod= 2
##$BYTORDP= 1
##$COROFFS= 0
##$CY= -3
##$DATMOD= 1
##$DC= 2
##$DFILT= <>
##$DTYPP= 0
##$F1P= 0
##$F2P= 0
##$FCOR= 0.5
##$FTSIZE= 0
##$FT_mod= 4
##$GAMMA= 1
##$GB= 0.15
##$INTBC= 1
##$INTSCL= 1
##$ISEN= 128
##$LB= 0.25
##$LEV0= 0
##$LPBIN= 0
##$MAXI= 10000
##$MC2= 0
##$MEAN= 0
##$ME_mod= 0
##$MI= 1.114404
##$NCOEF= 0
##$NC_proc= 0
##$NLEV= 6
##$NOISF1= 3.799351
##$NOISF2= 2.8
##$NSP= 1
##$NTH_PI= 0
##$NZP= 0
##$OFFSET= 14.38212
##$PC= 1
##$PHC0= -1566.788
##$PHC1= 17.99228
##$PH_mod= 1
##$PKNL= yes
##$PPARMOD= 0
##$PSCAL= 0
##$PSIGN= 0
##$REVERSE= no
##$SF= 200.129724274929
##$SI= 16384
##$SIGF1= 3
##$SIGF2= 2
##$SINO= 400
##$SIOLD= 16384
##$SREGLST= <1H.CDCl3>
##$SSB= 0
##$STSI= 0
##$STSR= 0
##$SW_p= 3205.1282051282
##$SYMM= 0
##$S_DEV= 0
##$TDeff= 0
##$TDoff= 0
##$TI= <>
##$TILT= no
##$TM1= 0
##$TM2= 0
##$TOPLEV= 0
##$USERP1= <user>
##$USERP2= <user>
##$USERP3= <user>
##$USERP4= <user>
##$USERP5= <user>
##$WDW= 1
##$XDIM= 8192
##$YMAX_p= 0
##$YMIN_p= 0
$$ End of Bruker specific parameters
$$ ---------------------------------
##NTUPLES= NMR FID
##VAR_NAME=  TIME,          FID/REAL,        FID/IMAG
##SYMBOL=    X,             R,               I
##VAR_TYPE=  INDEPENDENT,   DEPENDENT,       DEPENDENT
##VAR_FORM=  AFFN,          ASDF,            ASDF
##VAR_DIM=   8192,          8192,            8192
##UNITS=     SECONDS,       ARBITRARY UNITS, ARBITRARY UNITS
##FACTOR=    0.0002768,     1,               1
##FIRST=     0,             0,               0
##LAST=      2.2672688,     0,               0
##MIN=       0,             -189798,         0
##MAX=       2.2672688,     132689,          0
$$ Real data points
##PAGE= N=1
##DATA TABLE= (X++(R..R)), XYDATA
$$ plain form
0 0 0 0 0 0 0 0 0 0 0 0 0 0 0 0 0 -8 8 -8 8 -8 16 -16 16 -23 24 -30 32 -40 44 -49 56 -64 73 -84 94 -106 118
37 118 -132 148 -164 184 -203 226 -250 275 -303 334 -369 406 -447 494 -543 599 -662 732 -811
56 -811 904 -1010 1133 -1282 1461 -1684 1972 -2355 2896 -3709 5072 -7759 15035 -77384 -189798
71 -189798 56113 132689 15250 27884 99061 10526 -15009 95557 90371 -36091 -23341
82 -23341 32826 -31439 -57854 3582 -39100 -104607 -30304 41895 -14508 -47164 9535 23361
94 23361 -1365 49195 70158 -18367 -33639 58318 52195 -24900 -11371 17825 -32076 -40885 27844
107 27844 18854 -58905 -40163 18634 -6356 -16772 28107 6032 -37093 15621 63713 8116
119 8116 -31556 16154 35864 -4209 -4503 7510 -29873 -32624 18144 12021 -34594 -22736 10765
$$ packed form
0@%%%%%%%%%%%%%%%qJ6j6J6j6K4l2L2l9M7n4O2p2Q4r3J05j20J37j57J78k00K24
37A18k50K80l12L48l87M29m76N25n78O37p03P75q53R41j037J142j261J394j543
56h11J715j914K143k415K743l145L656m327N251o605Q781j2831K2794r2419j12414
71a89798K45911P6576j17439J2634P1177q8535k5535J10566n186j26462J2750
82b3341N6167o4265k6415O1436m2682o5507P4303P2199n6403l2656N6699J3826
94B3361k4726N0560K0963q8525j5272R1957o123p7095J3529K9196m9901q809O8729
107B7844q990p7759J8742N8797k4990j0416M4879k2075m3125N2714M8092n5597
119H116l9672M7710J9710m0073k94J2013l7383k751N0768o123m6615J1858L3501
$$ plain form
132 10765 41 -4931 26821 22134 -21286 -8421 33142 14692 -15573 -3494 -1436 -15116 242
145 242 14309 -13320 -25809 10568 22694 -9214 -8080 15586 1206 -10067 13012 13758 -12694
158 -12694 -11607 7888 3548 -5293 6198 652 -22795 -7786 19659 3500 -18973 -5293 7149
171 7149 1434 4178 12227 3008 -5172 10635 14948 -4714 -7069 4684 -5078 -13952 -1207 236
185 236 -14451 -12995 4908 7341 -2037 2033 6872 1204 7214 16421 3286 -7609 1462 6544
199 6544 -3606 -7933 -1881 -2535 -9589 -4944 539 -3542 -2011 3853 -773 -2220 6453 8272 -108
214 -108 -1476 8063 8773 -1959 -3247 2900 243 -2992 -2427 -5582 -6979 -3383 -2361 -4329 -2947 2623
230 2623 3323 -580 3981 10472 5869 1927 3374 3421 1186 -1344 -3487 -4782 -5025 -2985 -4229 -7248
$$ packed form
132A0765j0724m972L1752m687m3420J2865M1563j8450l0265J2079K058j3680J5358
145B42J4067k7629j2489L6377J2126l1908J134K3666j4380j1273K3079P46k6452
158a2694J087J9495m340q841J1491n546k3447J5009K7445j6159k2473J3680J2442
171G149n715K744Q049r219q180J5807M313j9662k355J1753r762q874J2745J443
185B36j4687J456J7903K433r378M070M839n668O010R207j3135j0895R071N082
199F544j0150m327O052o54p054M645N483m081J531N864m626j447Q673J819q380
214a08j368R539P10j0732j288O147k657l235N65l155j397L596J022j968J382N570
230B623P00l903M561O491m603l942J447M7k235k530k143j295k43K040j244l019
$$ plain form
246 -7248 -2795 3610 780 -1820 1721 4798 4228 2708 1891 2541 1656 1391 274 -1992 -214 1824
262 1824 -2717 -4697 -1679 -506 -2510 -3850 -1490 881 -127 -141 1683 2749 3600 3628 1248 1107 2714
279 2714 1600 -1414 -2937 -1863 -869 -3848 -4318 -1425 216 249 162 -283 2303 4119 2515 649 378
296 378 1645 1392 -2212 -2280 91 -34 -1569 -1712 -1123 812 1042 -548 -379 577 936 413 -1019 527
314 527 2354 195 -299 605 1046 776 -405 -1018 -618 -552 -975 -1799 -1485 174 1339 61 -188 1619
332 1619 2515 2048 992 -9 469 21 -1307 -1846 -1830 -677 -889 -1945 -1150 1200 1437 1029 862 1161
350 1161 1803 1226 563 117 -224 267 -233 -1698 -1111 352 -522 -1119 -788 -106 -293 -901 -240 661 596 581
370 581 629 298 1776 2397 822 -517 522 722 -771 -1781 -1184 -975 -1816 -1234 -819 -1016 471 1476
$$ packed form
246g248M453O405k830k600L541L077n70j520q17O50q85k65j117k266J778K038
262A824m541j980L018J173k004j340K360K371j008j4J824J066Q51K8k380j41J607
279B714j114l014j523J074R94k979m70K893J641L3q7m45K586J816j604j866k71
296C78J267k53l604o8K371j25j535j43N89J935K30j590J69R56L59n23j432J546
314E27J827k159m94R04M41k70j181o13M00O6m23q24L14J659J165j278k49J807
332A619Q96m67j056j001M78m48j328n39J6J153k12j056P95K350K37m08j67K99
350A161O42n77o63m46l41M91n00j465N87J463q74n97L31O82j87o08O61R01o5j5
370E81M8l31J478O21j575j339J039K00j493j010N97K09q41N82M15j97J487J005
$$ plain form
388 1476 413 881 1774 2053 678 49 998 497 -825 -903 -438 -1129 -784 -182 -1013 -1030 469 449 -500 -689
408 -689 1238 1083 -341 119 1348 431 243 695 144 53 202 -174 -1310 -998 -85 -847 -1897 -848 890
427 890 -74 -343 770 963 941 1058 1030 -13 356 448 -118 -1143 -633 767 -732 -1375 -73 495 -331
446 -331 -104 692 401 33 541 24 -722 373 1119 -241 -752 477 563 -700 -665 498 -90 -843 -107
465 -107 17 -893 242 753 -359 -465 699 768 -96 -168 937 182 -494 32 -117 -484 3 416 -616
484 -616 -567 741 612 -300 -89 957 257 -484 436 465 -829 -656 117 -376 -806 104 243 -465 -67 779
504 779 -78 -465 64 943 -386 -325 586 274 -459 349 161 -270 -127 360 -167 -898 -127 427 -723 -519
524 -519 550 552 -355 218 1043 277 -147 674 250 -609 385 502 -711 -836 330 34 -708 -296 237 -215
$$ packed form
388A476j063M68Q93K79j375o29R49n01j322p8M65o91L45O02q31j7J499k0r49j89
408f89J927j55j424M60J229r17j88M52n51r1J49l76j136L12R13p62j050J049J738
427H90r64k69J113J93k2J17k8j043L69R2n66j025N10J400j499o43J302N68q26
446c31K27P96k91l68N08n17p46J095P46j360n11J229Q6j263L5J163n88p53P36
465a07J24r10J135N11j112j06J164O9q64p2J105p55o76N26j49l67M87M13j032
484f16M9J308j29r12K11J046p00p41R20K9j294J73P73m93m30R10J39p08L98Q46
504G79q57l87N29Q79j329O1R11l12p33Q08j88m31J43M87n27p31P71N54j150K04
524e19J069Kr07N73Q25p66m24Q21m24q59R94J17j213j25J166k96p42M12N33m52
$$ plain form
544 -215 -473 429 598 -206 310 435 -213 -62 118 -61 -556 -184 543 -133 -601 160 186 -352 -214 82 -261
565 -261 -39 565 407 -270 89 630 43 -308 385 287 -423 123 -40 -204 -421 54 -372 -616 99 563 -90
586 -90 -202 232 286 34 67 361 104 -101 47 18 -320 -93 79 -241 -257 254 355 -355 -101 503 300 -374
608 -374 -155 1 -196 -38 153 -202 -187 222 117 -218 -315 -99 -150 -132 -114 -74 -346 -172 267 0 202 150 199
631 199 -50 210 330 -172 -243 69 -28 -62 -21 5 144 -77 308 33 112 166 193 -204 -65 299 5 -72 -414
654 -414 50 82 -189 16 73 -71 182 181 239 -6 -4 -70 -82 -208 316 70 -102 56 163 7 39 107 -89 -209
678 -209 216 136 208 -102 286 -137 -117 339 -39 -55 6 -6 144 174 -150 -56 117 104 168 6 -85 262 173 22
702 22 52 279 -38 45 -42 -108 -325 28 -85 -68 154 165 103 -230 -122 28 80 28 43 -349 -60 76 352 97
$$ packed form
544b15k58R02J69q04N16J25o48J51J80j79m95L72P27o76m68P61K6n38J38K96l43
565b61K22O04j58o77L59N41n87l51O93r8p10N46j63j64k17M75m26k44P15M64o53
586i0j12M34N4k52L3K94k57k05J48k9l38K27J72l20j6N11J01p10K54O04k03o74
608c74K19J56j97J58J91l55J5M09j05l35r7K16n1J8J8M0k72J74M39k67K02n2M9
631A99k49K60J20n02p1L12r7l4M1K6J39k21L85k75P9N4K7l97J39L64k94p7l42
654d14M64L2k71K05N7j44K53jN8k45Ko6j2j26N24k46j72J58J07j56L2O8j96j20
678b09M25q0P2l10L88m23K0M56l78j6O1j2J50L0l24R4J73j3O4j62r1L47q9j51
702B2L0K27l17Q3q7o6k17L53j13J7K22J1o2l33J08J50N2n2J5l92K89J36K76k55
$$ plain form
726 97 55 169 -111 201 89 80 241 9 -79 50 -40 -109 -132 141 -160 -73 -78 329 -261 453 281 -310 -77 95
750 95 -48 -116 -238 61 -5 64 -29 47 46 -215 -156 -142 164 -42 -28 205 3 1 108 -45 203 151 82 -145 5
775 5 223 -31 -54 -47 122 -296 91 -205 84 316 -58 -78 193 -79 -161 -26 -196 -138 -124 111 193 -116 15 -446
799 -446 -36 30 355 66 -42 156 46 -86 -29 -19 -193 -50 19 -34 216 -149 -272 -48 81 -40 99 150
821 150 -9 -220 14 -203 -102 276 28 107 -12 -16 -57 1 14 -25 47 208 -168 -310 -74 -22 -51 -270 108 -312
845 -312 -218 -63 141 162 0 6 -85 -273 122 -33 -21 135 81 113 170 -142 35 -224 -53 -81 -168 4 17 86 293
870 293 -55 -81 -76 101 3 178 -259 31 -102 -20 -169 9 151 -191 175 -64 -235 142 -16 143 -60 11
892 11 57 17 207 35 86 108 120 178 79 -40 -237 -200 39 95 7 -71 -85 246 103 -212 83 -23 122 61 -47
$$ packed form
726I7m2J14k80L12j12rJ61k32q8J29r0o9k3K73l01Q7nM07n90P14j72n91K33J72
750I5j43o8j22K99o6O9r3P6jk61N9J4L06k06J4K33k02kJ07j53K48n2o9k27J50
775EK18k54k3PJ69m18L87k96K89K32l74k0K71k72q2J35j70N8J4K35Q2l09J31m61
799d46M10O6L25k89j08J98j10j32N7J0j74J43O9n3K50l65j23K24J29j21J39N1
821A50j59k11K34k17J01L78k48P9j19mm1N8J3l9P2J61l76j42K36N2k9k19L78m20
845c12R4J55K04K1j62Or1j88L95j55J2J56n4L2N7l12J77k59J71k8q7J72J3O9K07
870B93l48k6NJ77r8J75m37K90j33Q2j49J78J42l42L66k39j71L77j58J59k03P1
892A1M6m0J90j72N1K2J2N8r9j19j97L7K39N6q8p8j4L31j43l15K95j06J45o1j08
$$ plain form
917 -47 -154 67 82 -74 -220 73 -113 51 38 -131 -23 -351 -127 -265 84 15 153 54 45 178 13 -138 -128
940 -128 210 0 129 -34 -146 -10 54 -167 -76 -3 2 -18 44 -58 113 -68 206 91 -2 -127 -26 185 -127
963 -127 -281 34 -74 52 -79 -25 -53 16 115 91 -101 -13 -19 115 -34 57 -41 145 -98 -34 105 -31 96 66
987 66 61 -300 99 77 -78 -92 100 -127 -109 -43 130 -84 -26 180 -103 88 -114 -104 18 187 65 182 -87
1010 -87 -144 -20 -133 -106 116 -79 -136 122 10 -114 -107 -206 74 175 7 164 29 198 60 -96 31 82 24
1033 24 200 -137 -84 83 -17 99 -106 41 -146 130 54 -36 63 -62 40 -93 -26 146 -50 83 89 -187 -107
1056 -107 90 -126 52 -32 11 60 215 26 246 -138 -177 -28 -164 10 -58 104 7 -141 -26 259 -267 5
1078 5 18 36 98 127 -143 23 203 -34 -18 -137 153 -181 120 88 179 144 -39 -129 -56 18 46 -48 161 142 32
$$ packed form
917d7j07K21J5j56j46K93j86J64j3j69J08l28K24j38L49o9J38r9rJ33j65j51J0
940a28L38k10J29j63j12J36O4k21R1P3Nk0O2j02J71j81K74j15r3j25J01K11l12
963a27j54L15j08J26j31N4k8O9R9k4j92Q8oJ34j49R1r8J86k43O4J39j36J27l0
987F6nl61L99k2j55j4J92k27J8O6J73k14N8K06k83J91k02J0J22J69j22J17k69
1010h7n7J24j13K7K22j95n7K58j12j24Pr9K80J01j68J57j35J69j38j56J27N1n8
1033B4J76l37N3J67j00J16k05J47j87K76p6r0R9j25J02j33O7J72j96J33Ok76Q0
1056a07J97k16J78q4M3M9J55j89K20l84l9J49j36J74o8J62r7j48J15K85n26K72
1078EJ3J8O2K9k70J66J80k37J6j19K90l34L01l2R1l5j83r0P3P4K8r4K09j9j10
$$ plain form
1103 32 136 81 32 -138 -32 302 -80 -115 9 305 -45 52 143 -128 104 303 -65 134 -284 -66 184 -53
1125 -53 -66 5 88 -64 -22 124 -83 -284 65 -274 -23 -7 74 -118 57 -189 -123 -114 -145 -6 189 -15 -131 196
1149 196 -341 -102 30 107 -205 287 -69 -271 -93 -165 335 129 34 -28 26 -262 102 264 67 -58 106 8
1171 8 -57 46 -4 -95 -109 53 112 -74 201 80 172 -259 -9 -146 106 73 -86 -181 147 65 212 32 -399 -33
1195 -33 -204 -52 49 44 -89 130 70 -60 16 106 -62 97 -144 92 118 168 0 68 254 -202 29 -25 -47 206
1219 206 19 72 -45 49 -231 -126 -43 -74 86 198 -8 128 -107 136 -119 -93 214 -235 -125 126 -53 -114
1241 -114 -127 185 96 -168 -178 85 -240 126 -93 -167 -182 169 190 146 -49 319 -46 -85 140 -122 -44 46 -283
1264 -283 -106 222 115 -97 -230 170 -160 -170 6 208 -177 67 -107 -353 191 -120 280 -90 -20 63 40
$$ packed form
1103C2J04n5m9j70J06L34l82l5J24K96l50R7R1k71K32J99l68J99m18K18K50k37
1125e3j3P1Q3j52M2J46k07k01L49l39K51J6Q1j92J75k46O6Rl1J39J95k04j16L27
1149A96n37K39J32P7l12M92l56k02J78p2N00k06r5o2N4k88L64J62j97j25J64r8
1171Ho5J03n0r1j4J62N9j86K75j21R2m31K50j37K52l3j59r5L28q2J47j80m31L66
1195c3j71J52J01nj33K19o0j30P6R0j68J59k41K36K6N0j68O8J86m56K31n4k2K53
1219B06j87N3j17R4k80J05Q3l1J60J12k06J36k35K43k55K6L07m49J10K51j79o1
1241a14j3L12q9k64j0K63l25L66k19p4j5L51K1m4j95L68l65l9K25k62P8R0l29
1264b83J77L28j07k12j33M00l30j0J76K02l85K44j74k46N44l11M00l70P0Q3k3
$$ plain form
1285 40 68 54 3 -67 132 115 300 57 -54 -276 112 57 -32 49 -19 -71 -175 222 -23 -27 73 -145 -141 85 -12
1310 -12 -14 -120 145 -76 -5 -74 -64 -17 73 49 -86 295 -121 98 -70 87 195 199 -212 -42 -34 83 -153 -36
1334 -36 -29 8 -176 -7 -227 222 -108 95 16 -116 12 -14 327 359 -13 22 74 184 -45 -25 -103 -131 90 29
1358 29 -195 -214 110 124 144 167 201 110 -100 0 -35 32 171 91 217 47 78 196 -14 -14 411 -65 97 -13
1382 -13 151 -71 132 -381 187 46 -191 3 -71 90 -183 -10 -67 -253 -212 -151 -350 -184 46 -65 104 -270
1404 -270 -134 38 78 45 -251 -7 38 283 -37 -53 -110 174 -20 -239 -131 -179 269 -33 24 -15 189 -28 -284
1427 -284 472 37 -38 -225 56 -43 -37 -184 18 115 11 -45 104 -183 18 -29 73 -163 151 182 31 100 33
1450 33 -28 -16 -62 -230 -71 223 148 99 230 19 -12 92 73 -2 199 6 282 -120 -155 85 233 -36 98
$$ packed form
1285D0K8j4n1p0J99j7J85k43j11k22L88n5q9Q1o8n2j04L97k45mJ00k18MK26r7
1310a2kj06K65k21P1o9J0M7R0k4j35L81m16K19j68J57J08Mm11J70QJ17k36J17
1334c6PL7j84J69k20M49l30K03p9j32J28k6L41L2l72L5N2J10k29K0p8k8K21o1
1358B9k24j9L24J4K0K3L4r1k10J00l5O7J39q0J26j70L1J18k10%M25m76J62j10
1382a3J64k22K03n13N68j41k37J94p4J61k73J73n7j86M1O1j99J66K30j11J69l74
1404b70J36J72M0l3k96K44M5K45l20j6n7K84j94k19J08m8M48l02N7l9K04k17k56
1427b84P56m35p5j87K81r9Oj47K02R7j04n6J49k87K01m7J02k36L14L1j51O9o7
1450C3o1J2m6j68J59K94p5m9J31k11l1J04j9p5K01j93K76m02l5K40J48k69J34
$$ plain form
1473 98 -70 -42 -35 15 -1 -165 28 -230 143 -108 193 -64 -41 -95 90 -96 -65 -450 72 119 -82 -52 69 -53
1497 -53 224 -101 -46 -117 102 -7 -363 -29 14 9 114 67 68 257 260 -16 -33 61 113 -36 -36 129 107 253 133 -73
1523 -73 -4 321 57 163 -92 39 -322 -164 -66 -31 -54 45 -171 -24 95 -123 52 -3 144 -119 -88 236 85
1546 85 39 -80 161 173 -7 136 -90 -124 -81 16 -47 82 -21 -366 -140 -3 -169 -121 -32 -45 -133 265 -113 -67
1570 -67 61 156 154 216 -145 -214 -102 51 -114 91 115 -29 32 -152 -38 37 1 -165 37 171 -278 126 -141
1593 -141 24 207 -58 -25 -350 -288 -220 -56 -61 26 45 261 84 59 4 -41 105 111 -38 -145 -4 106 -339 -287
1617 -287 215 66 295 -92 -117 106 -70 -189 -218 -248 31 -80 -108 117 -36 -167 -54 -45 -66 -55 4 -56 121
1640 121 20 -132 -92 -11 -131 102 -61 101 -22 -116 104 -32 52 -14 147 103 174 103 -19 -109 -112 -122 -76 318
$$ packed form
1473I8j68K8PN0j6j64J93k58L73k51L01k57K3n4J85j86L1l85N22M7k01L0J21j22
1497e3K77l25N5p1K19j09l56L34M3nJ05m7JJ89Lk76j7R4N2j49%J65k2J46j20k06
1523g3O9L25k64J06k55J31l61J58R8L5k3R9k16J47J19k18J75n5J47k63L1L24j51
1546H5m6j19K41J2j80J43k26l4M3R7o3J29j03l45K26J37j66M8Q9j3q8L98l78M6
1570f7J28R5kO2l61o9J12J53j65K05K4j44O1j84J14P5l6j66K02J34m49M04k67
1593a41J65J83k65L3l25O2O8J64nQ7J9K16j77k5n5m5J46Oj49j07J41J10m45N2
1617b87N02j49K29l87k5K23j76j19k9l0K79j11k8K25j53j31J13Rk1J1N9o0J77
1640A21j01j52M0Q1j20K33j63J62j23r4K20j36Q4o6J61m4P1p1j22r0lj0M6L94
$$ plain form
1664 318 14 40 46 -33 -35 -75 -90 -57 -120 253 -54 93 151 62 -46 -49 218 -82 -232 13 363 -23 53 -299 46
1689 46 12 -134 -1 113 -94 -13 -14 -14 -81 -238 -33 227 -111 117 -58 -100 -190 149 220 94 470 -70 110 -143
1713 -143 97 156 -28 98 100 218 -122 -45 -96 -80 -18 223 38 -82 -3 25 160 -133 144 43 -91 284 -99
1736 -99 36 168 69 -129 91 -36 -425 186 -26 163 40 -13 162 -52 34 53 25 -384 -62 33 -107 -37 -110
1759 -110 57 71 -71 101 -6 -65 80 -202 -124 -27 36 -95 -209 -5 -222 250 -202 -141 90 162 -88 204
1781 204 -9 214 19 1 13 101 127 -49 74 -56 113 97 -240 -4 -180 -121 -161 -175 -122 -172 -113 105 153 -76
1805 -76 159 -89 -166 -63 -62 4 -52 152 8 -62 169 62 131 66 -99 190 115 70 -34 4 -233 -3 35 -143
1829 -143 -15 -58 199 11 145 78 -7 212 -276 -259 120 -131 47 -71 41 -297 -377 -129 200 -40 -120 73
$$ packed form
1664C18l04K6Op9km0j5L3o3L73l07J47N8q9j08lK67l00j50K45L50l86P6l52L45
1689D6l4j46J33J14k07Q1j%o7j57K05K60l38K28j75m2r0L39P1j26L76n40J80k53
1713a43K40N9j84J26KJ18l40P7n1J6O2K41j85j20P9K8J35k93K77j01j34L75l83
1736i9J35J32r9j98K20j27l89O11k12J89j23n3J75k14Q6J9k8m09L22R5j40P0p3
1759a10J67J4j42J72j07n9J45k82P8R7O3j31j14K04k17M72m52O1K31P2k50K92
1781B04k13K23j95j8J2Q8K6j76J23j30J69j6l37K36j76N9m0j4N3n0N9K18M8k29
1805g6K35k48p7J03JO6n6K04j44p0K31j07O9o5j65K89p5m5j04L8k37K30L8j78
1829a43J28m3K57j88J34o7q5K19m88J7L79k51J78j18J12l38q0K48L29k40q0J93
$$ plain form
1851 73 135 10 -178 95 44 -114 188 64 9 42 212 -154 132 99 -106 43 -51 248 -117 -188 198 -59 -161
1874 -161 12 8 -30 266 289 99 277 -97 -115 -413 -105 237 -94 -97 115 75 -44 -227 81 -381 71 44 -65
1897 -65 35 -98 -58 -146 -56 -317 86 -125 302 58 13 -77 -213 -155 125 38 73 -12 43 -97 193 5 -44 -113
1921 -113 -38 -142 -239 -212 -80 -65 -152 126 -36 103 -185 -58 0 73 -214 48 -14 81 -123 56 -89 -42 -96 -152
1945 -152 103 -29 -309 169 22 89 -78 -328 82 -63 179 60 35 105 -70 59 164 -132 -120 -139 54 57
1967 57 18 134 -8 107 114 116 -137 -78 8 -112 -200 13 389 -28 16 198 99 108 159 21 -34 -35 -95 164 -240 -311
1993 -311 -28 23 -33 51 -174 71 132 78 -348 68 246 90 -411 72 -1 126 226 33 17 -67 125 175 4
2016 4 -55 -136 -1 -32 85 207 219 53 -125 124 -123 190 -232 51 133 78 157 -160 134 -152 21 103 -66
$$ packed form
1851G3O2j25j88K73n1j58L02j24n5L3J70l66K86l3k05J49r4K99l65p1L86k57j02
1874a61J73ml8K96K3j90J78l74j8k98L08L42l31lK12m0j19j83L08m62M52k7j09
1897f5J00j33M0q8R0k61M03k11M27k44m5r0j36N8K80q7L5q5N5j40K90j88m9o9
1921a13P5j04r7K7J32J5q7K78j62J39k88J27N8P3k87K62o2R5k04J79j45M7n4n6
1945a52K55j32k80M78j47O7j67k50M10j45K42j19k5P0j75J29J05k96J2j9J93L
1967E7l9J16j42J15PKk53N9Q6j20q8K13L76m17M4J82r9RN1j38n5jo0K59m04p1
1993c11K83N1n6Q4k25K45O1n4m26M16J78j56n01M83p3J27J00j93j6q4J92N0j71
2016Dn9q1J35l1J17J22J2j66j78K49k47L13m22K83Q2n5P9l17K94k86J73Q2j69
$$ plain form
2039 -66 234 -21 -32 -144 90 -209 152 -32 145 90 93 -90 -158 -121 233 11 -141 62 -37 39 -237 196 -150
2062 -150 -84 -277 -93 -58 -101 125 -81 48 -87 53 52 68 -145 44 55 -203 385 1 -111 63 -107 189
2084 189 99 59 110 75 54 3 29 -17 216 228 75 -156 139 105 132 -145 1 378 45 90 83 66 -202 -190 -288 -144
2110 -144 50 137 -232 144 56 -40 210 113 -88 -164 -137 -189 175 -204 -176 256 -65 179 33 161 217 -120 88
2133 88 282 64 -112 68 -100 -17 -149 126 -9 86 -50 52 -86 111 58 -98 -128 -18 95 178 -91 120
2155 120 -57 153 48 -41 -6 33 0 -12 59 -155 -155 161 90 139 68 84 52 87 64 -218 150 -57 -60 -86 -102 -29 301
2182 301 -191 62 -157 -275 -28 104 97 63 4 -175 113 -201 -87 -149 6 -180 -165 40 -96 -33 -268 133
2204 133 -7 -177 -40 102 -186 -26 -250 346 130 55 67 25 -71 -26 121 -96 126 191 123 34 168 -92 40
$$ packed form
2039f6L00k55j1j12K34k99L61j84J77n5Lj83o8L7L54k22j52K03r9P6k76M33l46
2062a50O6j93J84L5m3K26k06J29j35J40jJ6k13J89J1k58N88l84j12J74j70K96
2084A89r0m0N1l5k1n1K6m6K33J2j53k31K95l4K7k77J46L77l33M5pj7k68J2r8J44
2110a44J94Q7l69L76q8r6K50r7k01p6K7n2L64l79K8M32l21K44j46J28N6l37K08
2133H8J94k18j76J80j68Q3j32K75j35R5j36J02j38J97n3j56l0J10J13Q3k69K11
2155A20j77K10j05q9L5L9l3j2P1k14%L16p1M9p1J6l2L5k3k82L68k07lk6j6P3L30
2182C01m92K53k19j18K47J32pl4n9j79K88l14J14o2J55j86J5K05j36O3k35M01
2204A33j40j70J37J42k88J60k24N96k16p5J2m2r6M5J47k17K22O5o8q9J34k60J32
$$ plain form
2227 40 -192 34 -203 50 -153 -210 135 42 -90 3 -93 -168 -270 107 -110 -71 294 -8 48 -280 54 -5 63
2250 63 -2 32 -193 192 91 -84 -15 25 122 -223 -37 128 -10 -91 159 -79 10 26 -21 248 -14 -67 -171 -66
2274 -66 -93 -89 -117 -220 -45 107 -119 71 -269 -23 -192 -32 -38 -170 -117 74 11 -202 -35 62 228 132 -127 -180
2298 -180 -214 -36 -172 79 -64 -170 -13 216 -300 45 40 10 -160 62 139 119 230 30 113 110 55 23 39 -162
2322 -162 -2 84 16 -101 129 159 -352 144 -56 28 -19 -144 35 204 252 -279 -61 -88 -240 -139 112 -274
2344 -274 -39 -235 119 160 113 -28 -288 62 82 158 139 165 -154 112 58 142 -107 185 -40 173 -82 -31 219
2367 219 -94 285 184 42 -283 8 183 279 114 241 140 -69 127 0 12 223 80 68 -173 -292 -5
2388 -5 -7 50 -67 100 -46 -83 -118 -89 76 -206 111 -88 -276 -32 -40 -8 327 209 182 73 120 174 28 41 24
$$ packed form
2227D0k32K26k37K53k03n7L45r3j32R3r6p5j02L77k17L9L65l02N6l28L34n9O8
2250F3o5L4k25L85j01j75O9M0R7l45J86J65j38q1K50k38Q9J6m7K69k62n3j04J05
2274f6k7Mk8j03J75J52k26J90l40K46j69J60oj32N3J91o3k13J67R7J66r6k59n3
2298a80l4J78j36K51j43j06J57K29n16L45nl0j70K22P7k0J11k00Q3ln5l2J6k01
2322a62J60Q6o8j17K30L0n11M96k00Q4m7j25J79J69M8n31K18k7j52J01K51l86
2344b74K35j96L54M1m7j41k60L50K0P6j9K6l19K66n4Q4k49K92k25K13k55N1K50
2367B19l13L79j01j42l25K91J75R6j65J27j01k09J96j27J2K11j43j2k41j19K87
2388ekN7j17J67j46l7l5K9J65k82L17j99j88K44qL2L35j18k7j09M7N4j46J3j7
$$ plain form
2413 24 -135 -125 94 25 -295 55 -9 -326 -350 70 -35 44 -203 -210 166 -228 83 -76 66 151 314 54 35
2436 35 -92 169 -37 -216 -116 25 65 227 143 104 153 -135 15 131 -25 -62 55 106 20 -54 296 154 186
2459 186 92 -170 148 146 152 -128 -132 49 7 -22 -17 56 7 94 -41 -167 -183 123 26 34 219 12 -135 -233 -91 -23 86
2486 86 -173 -185 -184 91 66 -93 223 60 -27 9 -80 200 78 -77 -306 143 -91 122 -48 -361 -288 -97 283
2509 283 222 -79 -29 -256 -343 115 -147 -218 -367 -108 -65 -337 36 23 -322 -4 -238 -15 -231 -45 201 136
2531 136 119 32 109 -180 107 -72 120 -60 -17 0 -145 -65 -96 -136 -79 -278 70 61 -160 -190 168 205 168 -174 -122
2556 -122 -89 -88 -81 279 38 -425 -128 -107 67 51 -99 52 -56 -217 41 -255 -70 -106 191 61 195 -128 37
2579 37 129 256 26 63 120 30 -115 -108 267 -116 67 35 5 -103 -148 -83 95 -92 -99 80 -13 175 -91 -49 82
$$ packed form
2413B4j59J0K19o9l20L50o4l17k4M20j05P9k47pL76l94L11j59J42Q5J63k60j9
2436C5j27K61k06j79J00J41M0J62q4l9M9k88J50J16j56l7J17N1q6p4L50j42L2
2459A86r4k62L18kOk80mJ81m2k9NP3m9Q7j35j26j6L06r7QJ85k07j47r8J42O8J09
2486H6k59j2JK75k5j59L16j63q7L6q9K80j22j55k29M49k34K13j70l13P3J91L80
2509B83o1l01N0k27q7M58k62p1j49K59M3k72L73j3l45L18k34K23k16J86K46o5
2531A36j7q7P7k89K87j79J92j80M3J7j45Q0l1m0N7j99L48rk21l0L58L7l7l42N2
2556a22L3JPL60k41m63K97K1J74j6j50J51j08j61K58k96J85l6K97j30J34l23J65
2579C7R2J27k30L7N7r0j45PL75l83J83l2l0j08m5O5J78j87pJ79r3J88k66M2J31
$$ plain form
2604 82 160 -19 141 -12 -69 -7 65 80 -351 284 40 -20 -80 -283 -172 -23 267 -82 70 -62 73 -56 -84
2627 -84 20 8 -165 -125 249 251 -32 -45 -53 -82 -215 -93 -55 -396 100 118 94 10 -128 -152 87 -143 -72 68 -152
2652 -152 -13 -202 198 -18 98 -10 -248 75 149 223 69 -96 94 -53 162 131 -85 59 -59 33 -43 -76
2674 -76 -23 46 1 -127 152 28 36 87 126 158 -64 19 -147 37 91 -170 -150 -251 -133 8 -67 -90 4 -184 -154
2699 -154 25 79 -138 -118 184 83 1 34 16 -208 -82 61 -280 53 -111 -102 -66 -8 12 101 -215 -68 -44 -302
2723 -302 37 241 163 112 174 140 180 -247 49 14 28 -56 -65 142 -54 -31 58 -21 193 79 -7 -50 71 -76 92
2748 92 33 48 -133 27 -127 228 245 -18 -123 176 61 -237 -84 21 100 186 74 -153 -25 -110 -88 9 -86
2771 -86 -129 -307 -208 101 -154 133 -21 230 201 56 -25 -191 177 -389 40 -138 -30 86 -33 126 117 148 -160
$$ packed form
2604H2P8j79J60j53n7O2P2J5m31O35k44o0o0k03J11J49K90l49J52j32J35j29k8
2627h4J04j2j73M0L74Kk83j3qk9j33J22L8l41M96J8k4q4j38k4K39k30P1J40k20
2652a52J39j89M00k16J16j08k38L23P4P4j54j65J90j47K15l1k16J44j18R2p6l3
2674g6N3O9m5j28K79j24QN1L9L2k22Q3j66J84N4k61K0j01J18J41p5k3R4j88L0
2699a54J79N4k17K0L02j01q2L3j8k24J26J43l41L33j64RL6N8K0Q9l16J47K4k58
2723c02L39K04p8n1O2l4M0m27K96l5J4q4rK07j96K3Q9p9K14j14q6m3J21j47J68
2748I2n9J5j81J60j54L55J7k63j05K99j15k98J53J05P9Q6j12k27J28q5K2R7r5
2771h6m3j78R9L09k55K87j54K51k9j45q1j66L68n66M29j78J08J16j19J59rL1l08
$$ plain form
2794 -160 56 20 -135 -1 280 -233 140 -38 -98 -26 222 189 91 61 -42 -47 -86 -83 -67 30 -44 102 -102 -211 -179
2819 -179 90 -4 13 99 55 63 -44 -99 89 415 41 -52 122 -244 8 25 -23 138 367 -51 86 261 -41
2842 -41 14 9 -57 -157 -206 97 1 169 40 88 -60 -35 59 222 30 -36 56 212 145 -117 -47 40 -185 109 14
2867 14 -127 -108 -101 54 338 79 -276 -263 -43 -7 -67 234 48 -23 141 -342 109 85 -142 28 165 -88 -87 171
2891 171 143 5 260 -21 107 -143 5 365 56 -48 -160 -180 -220 -202 -110 -314 -8 92 -64 221 154 -144
2913 -144 -36 -180 -166 233 66 119 -269 -186 -129 -65 32 151 -18 133 5 -56 53 135 73 -9 177 -84 164
2936 164 -201 210 206 -85 -77 99 -30 127 191 -1 196 -123 -107 225 79 -128 170 75 178 -80 -72 -151 -532
2959 -532 68 224 -18 155 -22 207 117 -138 257 -22 49 -70 39 -42 -97 23 55 33 181 75 -6 44 -187
$$ packed form
2794a60K16l6j55J34K81n13L73j78o0P2K48l3r8l0j03nl9LJ6R7p4J46k04j09L2
2819a79K69r4J7Q6m4Qj07n5J88L26l74r3J74l66K52J7m8J61K29m18J37J75l02
2842d1N5no6j00m9L03r6J68j29M8j48K5R4J63j92o6R2J56o7k62P0Q7k25K94r5
2867A4j41J9PJ55K84k59l55J3K20L6o0L01j86p1J64m83M51k4k27J70J37k53JK58
2891A71k8j38K55k81J28k50J48L60l09j04j12k0m0J8R2k04L06J00j56K85o7k98
2913a44J08j44J4L99j67N3l88Q3N7O4R7J19j69J51j28o1J09Q2o2q2J86k61K48
2936A64l65M11mk91QJ76j29J57O4j92J97l19J6L32j46k07K98r5J03k58Qp9l81
2959e32O00J56k42J73j77K29r0k55L95k79P1j19J09q1n5J20L2k2J48j06q1N0k31
$$ plain form
2982 -187 -1 -133 159 -28 -79 -98 -70 -4 -207 -36 -102 154 -150 182 -79 -105 -125 -135 78 -92 69 -57 123
3005 123 205 278 137 -64 251 -102 59 86 -54 197 175 -63 -108 -16 -21 159 -206 170 -2 242 212 -60 151
3028 151 -33 65 -119 40 -120 -185 68 107 125 -76 -26 -29 280 -212 88 30 196 -86 154 150 199 286 -137 -25
3052 -25 -89 -330 111 261 -200 -160 90 -79 -197 -383 -123 5 -117 -140 42 -58 -254 20 -24 -163 -83 23
3074 23 -28 281 -91 51 208 -285 89 -23 -113 -74 172 -9 -45 18 5 -144 43 262 -297 151 -49 126
3096 126 32 -29 -149 -38 16 -137 112 -97 -155 -147 -130 -46 -68 -31 -328 -5 37 188 166 43 113 -19 -341 72
3120 72 -40 113 -157 -40 125 12 138 -61 -10 -186 -74 137 -37 -283 41 12 127 55 1 -126 -93 -136
3142 -136 2 -47 -81 -77 20 204 185 203 -69 -120 -108 40 -75 13 266 -32 103 -68 12 38 -27 -150 -36 8 -151
$$ packed form
2982a87J86j32K92j87n1j9K8O6k03J71o6K56l04L32k61k6k0j0K13j70J61j26J80
3005A23Q2P3j41k01L15l53J61K7j40K51k2k38m5R2nJ80l65L76j72K44l0k72K11
3028A51j84R8j84J59j60o5K53L9J8k01N0lL09m92L00n8J66k82K40mM9Q7m23J12
3052b5o4k41M41J50m61M0K50j69j18j86K60J28j22k3J82j00j96K74m4j39Q0J06
3074B3n1L09l72J42J57m93L74j12r0L9K46j81l6O3j3j49J87K19n59M48k00J75
3096A26r4o1j20J11N4j53K49k09n8QJ7Q4k2L7k97L23M2J51k2j23P0j32l22M13
3120G2j12J53k70J17J65j13J26j99N1j76J12K11j74k46L24k9J15p2n4j27L3m3
3142a36J38m9l4MR7J84j9J8k72n1J2J48j15Q8K53k98J35j71Q0K6o5j23J14M4j59
$$ plain form
3167 -151 219 69 67 -61 -97 -3 26 -61 -312 261 -140 234 20 -139 -3 153 -17 12 -88 30 -16 122 324
3190 324 -107 30 277 -182 -219 66 -38 28 -75 45 64 45 -187 194 236 -131 102 -127 -57 119 -32 -87
3212 -87 -96 -51 44 78 231 134 63 212 114 -102 -205 256 -9 117 -149 -82 193 42 146 -59 -67 89 98 165 0
3237 0 95 -24 126 -80 22 394 -143 64 -165 -227 84 39 -35 21 96 365 182 88 -106 374 211 221 -137
3260 -137 -76 115 56 24 190 5 -6 38 -323 35 -233 -123 0 244 178 -27 160 5 -314 -164 -163 -94 -34
3283 -34 63 -236 -141 -108 205 -111 47 205 76 -2 88 -123 -103 32 233 221 172 124 -75 45 -99 178 -107
3306 -107 122 -88 -101 178 79 89 87 12 -156 121 58 100 -130 -426 57 -319 3 140 116 67 -236 -82 7 22
3330 22 -33 19 -118 -85 160 218 39 2 257 -2 105 236 20 191 39 -184 201 -62 164 171 133 1 23
$$ packed form
3167a51L70j50kj28l6R4K9q7k51N73m01L74k14j59J36J56j70K9j00J18m6J38K02
3190C24m31J37K47m59l7K85j04O6j03J20J9j9k32L81M2l67K33k29P0J76j51n5
3212h7rM5R5L4J53r7p1J49r8k16j03M61k65J26k66O7K75j51J04k05qJ56RO7j65
3237@R5j19J50k06J02L72n37K07k29o2L11m5p4N6P5K69j83r4j94M80j63J0l58
3260a37O1J91n9l2J66j85j1M4l61L58k68J10J23K44o6k05J87j55l19J50JO9O0
3283c4R7k99R5L3L13l16J58J58j29p8R0k11K0J35K01j2m9m8j99J20j44K77k85
3306a07K29k10j3K79r9J0kp5j68K77o3M2k30k96M83l76L22J37k4m9l03J54Q9J5
3330B2n5N2j37L3K45N8j79l7K55k59J07J31k16J71j52k23L85k63K26Pl8j32K2
$$ plain form
3353 23 -123 88 16 -163 -164 -108 251 160 255 -168 -100 -3 -84 131 -90 -17 -482 -183 -107 -178 263 48 -36 256 -161
3378 -161 121 61 201 -1 33 -245 19 139 93 109 55 138 112 -76 -134 219 -76 122 -190 -105 153 -256 -95
3401 -95 48 208 -27 -184 -10 -30 -277 -165 230 -26 -148 2 -31 -189 -212 37 -37 216 -150 -97 196 98
3423 98 97 -94 -125 -48 132 27 -48 276 132 220 209 88 -41 199 165 296 313 -130 202 -11 92 208 -62
3446 -62 275 30 31 144 -258 -46 -211 -82 -66 12 103 145 -61 -40 3 -162 -42 -186 96 196 250 78 -120
3469 -120 130 31 -178 187 70 -2 -25 -116 -120 63 -23 -264 30 -3 45 12 -157 -133 -236 -103 -35 -106 -174 209 -48
3494 -48 -157 72 90 108 67 -91 -145 95 -144 -64 182 68 131 13 219 149 16 -200 57 65 -33 -177 -248 -263
3518 -263 169 -104 -238 89 68 -217 66 8 -55 168 89 -228 42 -289 -2 -80 183 124 -128 42 -125 101
$$ packed form
3353B3j46K11p2j79jN6L59r1R5m23O8R7q1K15k21P3m65K99P6p1M41k15q4K92m17
3378a61K82o0J40k02L4k78K64J20m6J6n4Q3k6j88n8L53k95J98l12Q5K58m09J61
3401i5J43J60k35j57J74k0k47J12L95k56j22J50l3j58k3K49p4K53l66N3K93r8
3423I8jj91l1P7J80j05p5L24j44Q8j1j21j29K40l4J31J7m43L32k13J03J16k70
3446f2L37k45JJ13m02K12j65J29J6P8R1M2k06K1M3j65J20j44K82J00N4j72j98
3469a20K50r9k09L65j17p2k3r1mJ83q6k41K94l3M8l3j69K4j03J33O8p1o8L83k57
3494d8j09K29J8J8m1j58n4K40k39Q0K46j14O3j18K06p0j33k16K57Qr8j44p1j5
3518b63M32k73j34L27k1k85K83n8o3K23p9l17K70l31K87p8K63n9k52J70j67K26
$$ plain form
3540 101 58 -104 308 106 106 51 -3 82 -112 99 -18 -208 63 37 -193 33 55 14 143 154 277 196 -207 -32
3564 -32 149 156 271 37 326 -41 16 78 -164 -16 -60 -5 -14 82 84 45 299 -35 44 -86 -18 -216 2 -111 -34
3589 -34 196 39 81 -47 133 -164 0 62 264 -191 -14 -142 74 50 -42 85 -89 -145 98 -88 72 244
3611 244 -191 6 -13 259 -252 -60 49 -69 7 193 2 51 -252 -14 66 -61 144 -381 -128 -67 12 -73
3633 -73 111 -20 79 251 143 -33 -332 -33 -134 -103 -57 -264 55 -31 -157 236 23 -187 250 74 -63 136
3655 136 125 109 -169 213 111 -78 135 -143 -25 3 133 40 115 -50 146 -127 143 -57 25 -61 245 -18
3677 -18 -78 216 79 39 143 149 19 101 -81 92 155 -197 -64 -197 267 110 -43 -69 -145 -47 -107 -155 -123 -110 118
3702 118 -265 75 -120 -69 11 -281 -97 10 167 90 31 139 -253 -133 24 80 -27 -54 47 -108 -89 -5 -39
$$ packed form
3540A01m3j62M12k02%n5n4Q5j94K11j17j90K71k6k30K26K2m1J29J1J23q1m03J75
3564c2J81PJ15k34K89l67N7O2k42J48m4N5rR6Kl9K54l34P9j30O8j98K18j13P7
3589c4K30j57M2j28J80k97J64O2K02m55J77j28K16k4r2J27j74n6K43j86J60J72
3611B44m35J97j9K72n11J92J09j18P6J86j91M9l03K38Q0j27K05n25K53O1P9q5
3633g3J84j31R9J72j08j76k99K99j01L1M6k07L19q6j26L93k13k10M37j76j37J99
3655A36j1j6k78L82j02j89K13k78J18K8J30r3P5j65J96k73K70k00Q2q6L06k63
3677a8o0K94j37m0J04Oj30Q2j82J73O3l52J33j33M64j57j53k6p6R8o0m8L2J3K28
3702A18l83L40j95N1Q0k92J84J07J57p7n9J08l92J20J57N6j07k7J01j55J9Q4l4
$$ plain form
3725 -39 148 216 96 -110 29 -191 -180 -52 -26 -36 -10 248 263 289 -85 -210 136 -57 154 -45 65 211 -162
3748 -162 54 93 -90 -52 190 187 9 -126 9 -61 -68 21 -49 253 26 250 25 14 110 -240 78 -298 38 -31
3772 -31 170 193 -44 206 -79 -79 87 -125 -139 112 286 -58 -92 -136 224 -103 -143 -58 187 -41 -150 -116 -43 -82
3796 -82 -118 308 210 2 -80 217 120 68 238 300 46 3 -76 -35 110 15 -205 -55 39 95 56 -195 -139 -50 26 -213
3822 -213 -122 80 -131 96 -29 -314 -208 20 -4 -73 -76 -77 -119 68 129 -47 211 118 -129 -254 -140 63 240
3845 240 128 93 -188 144 15 224 20 25 143 116 -71 205 -116 133 -1 71 -91 -189 87 97 0 -29 152
3868 152 62 5 -66 -153 -105 -122 262 81 125 150 -189 -85 -126 -16 -209 128 -194 228 101 -167 158 -82 33
3891 33 -63 119 -141 -48 212 -169 -97 116 -170 238 128 8 -4 -256 39 -168 274 -33 129 30 -44 -292
$$ packed form
3725c9J87O8j20k06J39k20J1J28K6j0K6K58J5K6l74j25L46j93K11j99J10J46l73
3748a62K16L9j83L8K42lj78j35J35p0pQ9p0L02k27K24k25j1R6l50L18l76L36o9
3772c1K01K3k37K50k85%J66k12j4K51J74l44l4m4L60l27m0Q5K45k28j09L4P3l9
3796h2l6M26r8k08q2K97r7n2J70O2k54m3p9M1J45r5k20J50R4N6l9k51N6Q9P6k39
3822b13R1K02k11K27j25k85J06K28k4o9ljm2J87O1j76K58r3k47j25J14K03J77
3845B40j12l5k81L32j29K09k04NJ18k7j87K76l21K49j34P2j62r8K76J0r7k9J81
3868A52r0n7p1q7M8j7L84j81M4K5l39J04m1J10j93L37l22M22j27k68L25k40J15
3891C3r6J82k60R3K60l81P2K13k86M08j10j20j2k52K95k07M42l07J62r9p4k48
$$ plain form
3913 -292 -21 117 62 156 -184 188 -456 -44 28 42 -29 8 83 3 -99 -9 115 -156 2 -377 -79 -154 -181 -85
3937 -85 -123 -74 -235 1 35 -160 -249 26 67 137 20 -174 -14 -33 152 -135 205 -87 257 -283 52 11 5 -284
3961 -284 32 -287 125 35 -123 367 -1 61 -14 14 56 -103 -64 64 -158 203 -190 158 -141 -91 -56 43 -98
3984 -98 140 316 97 342 78 -39 20 127 -77 -463 245 -77 -19 167 50 245 54 70 -6 106 23 -196
4006 -196 -141 87 -88 51 137 -96 173 90 -17 -28 42 -32 -167 -142 168 -2 -191 -55 -40 2 32 -128 41
4029 41 -92 -52 -36 -74 -172 117 -205 51 16 21 139 -71 94 244 -141 -97 26 43 -111 60 4 -101 -42 109
4053 109 39 198 -107 61 269 67 -312 161 -75 17 -34 -116 -20 -114 -65 311 244 -77 -260 69 -143 320 -93
4076 -93 -198 -147 -172 285 150 -107 -57 29 -56 143 -55 90 -21 347 35 182 57 -159 -214 86 45 37 20 100
$$ packed form
3913b92K71J38n5R4l40L72o44M12P2J4p1L7P5q0j02R0J24k71J58l79K98p5k7R6
3937h5l8M9j61K36L4j95q9K75M1P0j17j94J60j9J85k87L40k92L44n40L35m1ok89
3961b84L16l19M12r0j58M90l68O2p5K8M2j59L9J28k22L61l93L48k99N0L5R9j41
3984i8K38J76k19K45k64j17N9J07k04l86P08l22N8J86j17J95j91J6p6J12q3k19
4006a96N5K28j75J39Q6k33K69q3j07j1P0p4j35K5L10j70j89J36J5M2L0j60J69
4029D1j33M0J6l8r8K89l22K56l5NJ18k10J65J50l85M4J23J7j54J71n6j05N9J51
4053A09p0J59l05J68K08k02l79M73k36R2n1q2R6r4M9L76o7l21j83L29k12M63m13
4076i3j05N1k5M57j35k57N0Q6q5J99j98J45j11L68l12J47j25k16n5L00m1qj7Q0
$$ plain form
4100 100 39 84 132 -58 98 -120 -381 95 16 114 185 -140 -55 -82 127 -25 -163 -26 5 48 -19 188 -101 93
4124 93 174 -20 -30 -57 -125 40 155 85 -215 199 249 -235 71 125 -94 42 162 215 -143 272 54 2 13 -94
4148 -94 9 149 -51 75 -167 -14 21 -181 38 -479 109 56 -39 -159 -111 146 -300 -131 -20 -196 -57 79
4170 79 -253 10 34 -225 -37 32 -128 -96 -119 -89 -1 64 95 103 135 161 199 -28 -76 28 450 -107 -188 82 13 -50
4196 -50 286 -45 -13 -255 -116 -28 -165 -63 59 162 -97 -37 89 163 189 19 -116 -172 88 -161 153 43
4218 43 79 109 135 -41 -27 -272 61 203 -112 -32 -363 46 14 -189 125 163 82 11 -102 -152 78 147 -119 154
4242 154 33 14 -18 -129 -74 101 -47 -83 -25 -194 -135 189 213 88 118 -91 -54 -15 118 61 -235 198 75 235
4266 235 -130 79 -74 -287 174 23 54 -136 23 135 13 103 -90 -163 -114 -7 146 -127 66 51 54 -144
$$ packed form
4100A00o1M5M8j90J56k18k61M76p9R8P1l25Q5k7K09j52j38J37L1M3o7K07k89J94
4124I3Q1j94j0k7o8J65J15p0l00M14N0m84L06N4k19J36J20N3l58M15k18n2J1j07
4148i4J03J40k00J26k42J53L5k02K19n17N88n3r5j20M8K57m46J69J11j76J39J36
4170G9l32K63K4k59J88O9j60L2k3L0Q8O5L1QL2K6L8k27m8J04M22n57q1K70o9o3
4196e0L36l31L2k42J39Q8j37J02J22J03k59O0J26P4K6j70j35n6K60k49L14j10
4218D3L6L0K6j76J4k45L33J42l15Q0l31M09l2k03L14L8q1p1j13n0K30O9k66K73
4242A54j21j9l2j11N5J75j48l6N8j69N9L24K4j25L0k09L7L9J33n7k96M33j23J60
4266B35l65K09j53k13M61j51L1j90J59J12j22R0j93p3M9J07J53k73J93j5Lj98
$$ plain form
4288 -144 -61 90 -84 -120 -230 162 349 -180 -52 52 -56 -100 245 -77 35 262 -21 60 110 103 -356 98
4310 98 -49 77 55 16 236 101 -207 152 299 -170 65 37 -156 -57 45 -157 -26 -145 -115 -68 99 71 26
4333 26 301 58 245 -50 -206 -121 26 196 -208 12 -60 -118 84 45 13 147 102 24 -149 -127 -7 43 -70
4356 -70 131 -142 -60 40 -80 297 125 19 -89 174 34 99 206 205 199 -92 169 50 -98 -76 -12 37 -22 176
4380 176 -36 -34 24 137 -30 20 294 -8 62 -35 132 247 -22 -149 43 58 -120 -152 -24 164 12 -22 -250
4403 -250 54 -55 -293 -147 -8 73 -48 -61 -203 -176 28 96 35 -289 -122 194 66 13 329 -54 4 -221
4425 -221 29 105 8 29 61 72 -106 380 60 -124 -485 -1 225 -53 -165 369 99 248 55 77 -85 197
4447 197 -98 -76 273 -74 -87 206 39 222 -121 -19 -9 -235 -238 -54 423 -127 126 181 -45 -4 73 -14 -194
$$ packed form
4288a44Q3J51j74l6j10L92J87n29J28J04j08m4L45l22J12K27k83Q1N0pm59M54
4310I8j47J26k2l9K20j35l08L59J47m69K35k8j93R9J02k02J31j19L0M7J67k8m5
4333B6K75k43J87k95j56Q5J47J70m04K20p2n8K02l9l2J34m5p8j73K2J20N0j13
4356g0K01k73Q2J00j20L77j72j06j08K63j40O5J07jok91K61j19j48K2O4M9n9J98
4380A76k12KN8J13j67N0K74l02P0r7J67J15k69j27J92J5j78l2J28J88j52l4k28
4403b50L04j09k38J46J39Q1j21j3j42K7K04O8o1l24J67L16j28n3L16l83N8k25
4425b21K50P6r7K1L2J1j78M86l20j84l61M84K26k78j12N34k70J49j93K2j62K82
4447A97k95K2L49l47j3K93j67J83l43J02J0k26lJ84M77n50K53N5k26M1P7q7j80
$$ plain form
4470 -194 115 -18 -18 -62 -142 -54 -255 -156 -135 119 105 352 216 -73 -374 202 -104 -53 -124 120 -99 324 -120
4493 -120 -94 45 -138 -110 0 74 -3 -185 112 5 -128 -3 123 76 -194 -35 -23 180 177 124 -274 -60 7
4516 7 109 39 -112 -81 158 133 -7 86 -382 97 -62 -176 -173 -154 92 -14 -50 -106 23 364 262 -137 50 163
4540 163 224 -87 -38 -33 122 -163 -85 218 -59 181 -160 21 -27 107 120 -48 -118 19 105 -49 -168 36 -45
4563 -45 93 171 -186 -147 -162 -134 -14 4 9 123 30 -186 162 53 43 -5 -236 82 31 -98 24 -236 78 38
4587 38 -174 -72 -28 -91 216 115 124 -187 -59 -67 48 -57 133 -4 108 6 -36 71 83 -22 269 -75 111
4610 111 -180 -199 -76 -52 -149 155 282 186 95 269 99 48 159 -62 -12 -2 267 -106 -216 38 33 71 149 230
4634 230 -19 -292 71 136 115 -261 109 86 245 -30 -69 75 278 -6 153 7 -19 -109 113 104 -100 -21 -35
$$ packed form
4470a94L09j33%m4q0Q8k01R9K1K54j4K47j36k89l01N76l06N1p1K44k19M23m44
4493a20K6J39j83K8J10P4p7j82K97j07j33J25J26m7k70J59J2K03ln3l98K14O7
4516GJ02p0j51L1K39k5j40R3m68M79j59j14LJ9K46j06l6n6J29L41j02l99J87J13
4540A63O1l11M9NJ55k85P8L03k77K40l41J81m8J34J3j68p0J37Q6j54j19K04q1
4563d5J38P8l57L9j5K8J20J8NJ14r3k16L48j09j0m8k31L18n1j29J22k60L14m0
4587C8k12J02M4o3L07j01Rl11J28qJ15j05J90j37J12j02m2J07J2j05K91l44J86
4610A11k91j9J23K4r7L04J27r6r1J74j70n1J11k21N0J0K69l73j10K54nL8P8Q1
4634B30k49k73L63O5k1l76L70k3J59k75l9J44K03k84J59j46k6r0K22rk04P9j4
$$ plain form
4657 -35 213 86 -89 36 -62 -51 9 143 -205 -114 -163 -181 49 150 -156 -143 204 41 29 108 11 -53 153 -124
4681 -124 136 -132 -100 121 139 381 -26 -177 -361 179 107 81 150 -118 -74 299 -184 -192 63 -195 231 168 163 21
4705 21 -184 -177 82 38 74 -3 62 -109 137 177 134 -218 -53 11 -181 134 111 -40 -28 91 233 -312 -73 -107
4729 -107 -15 103 39 -139 -4 19 -31 149 -18 -178 -108 -60 -119 180 -205 -94 19 -102 -123 24 -93 0 43
4752 43 -117 56 -470 -1 -15 -60 -60 46 -180 -49 172 -80 150 21 -79 129 327 78 25 97 350 -163
4774 -163 -20 166 93 -46 -27 13 -3 141 -33 16 -170 186 -143 -159 181 -75 -65 -156 382 -242 28 -61 -257
4797 -257 275 41 147 -25 -100 86 209 127 333 -173 324 103 150 232 -61 -3 -113 -131 -28 -47 102 131 157
4820 157 83 -58 -53 392 -64 59 79 121 -60 -146 162 -161 199 -224 -83 13 31 117 31 -220 8 341 -106
$$ packed form
4657c5K48j27j75J25r8J1O0J34l48R1m9j8K30J01l06J3L47j63j2P9r7o4K06k77
4681a24K60k68L2K21J8K42m07j51j84N40p2k6O9k68M4L73m83qK55k58M26o3nj42
4705B1k05PK59m4L6p7O5j71K46M0m3l52J65O4j92L15k3j51J2J19J42n45K39l4
4729a07R2J18o4j78J35K3n0J80j67j60P0M8n9K99l85J11J13j21k1J47j17R3M3
4752D3j60J73n26M69j4m5%J06k26J31K21k52K30j29j00K08J98k49n3P2K53n13
4774a63J43J86p3j39J9M0j6J44j74M9j86L56l29j6L40k56J0r1N38o24K70q9j96
4797b57N32k34J06j72p5J86J23q2K06n06M97k21M7Q2k93N8j10j8J03j9J49K9K6
4820A57p4j41NM45m56J23K0M2j81q6L08l23L60m23J41R6J8Q6q6k51K28L33m47
$$ plain form
4843 -106 -43 98 69 17 208 -10 -84 -70 -206 72 -72 70 -60 11 -226 180 -69 -71 -15 251 -81 -25 204
4866 204 -177 27 156 150 35 191 7 100 242 -252 -194 -168 57 -189 49 -234 -6 -121 96 137 -84 39
4888 39 -161 -73 -48 -42 -12 -65 42 86 -28 -125 -158 83 -171 37 -160 -148 127 288 -1 -183 -23 163 29 -50
4912 -50 -36 -9 -181 53 66 1 142 8 126 -151 -147 -85 139 98 -53 143 -281 -68 63 -154 -475 -107 -189
4935 -189 69 31 -3 320 13 201 -26 -175 -111 -39 -44 13 -109 120 -60 120 233 -9 -16 2 -126 -39 -113 -48
4959 -48 -47 -104 131 -10 -175 119 19 -83 -180 -16 126 -218 -5 61 -284 -31 108 -112 -54 120 -25 -124 130
4982 130 145 -112 -31 -189 155 -90 10 -146 55 -111 131 -373 65 117 -108 113 4 -65 -315 128 -253
5003 -253 187 -325 21 -44 -23 -91 -137 -78 12 131 -129 73 173 -114 255 -7 275 63 84 -39 187 -30
$$ packed form
4843a06O3J41k9n2J91k18p4J4j36K78j44J42j30P1k37M06k49kN6K66l32N6K29
4866B04l81K04J29oj15J56j84R3J42m94N8K6K25k46K38k83K28j15K17M1k21J23
4888C9k00Q8K5OL0n3J07M4j14r7l3K41k54K08j97J2K75J61k89j82J60J86j34p9
4912e0J4K7j72K34J3o5J41j34J18k77MO2K24m1j51J96m24K13J31k17l21L68q2
4935a89K58l8l4L23l07J88k27j49O4P2nN7j22K29j80J80J13k42pJ8j28Q7p4O5
4959d8Jn7K35j41j65K94j00j02r7J64J42l44K13O6l45K53J39k20N8J74j45r9K54
4982A30J5k57Q1j58L44k45J00j56K01j66K42n04M38N2k25K21j09o9k50M43l81
5003b53M40n12L46o5K1o8m6N9R0J19k60K02J00k87L69k62K82k12K1j23K26k17
$$ plain form
5025 -30 66 216 -138 27 -240 -18 151 -1 -86 8 -101 -76 -21 50 -31 9 49 54 -8 7 41 -165 -90 42 2 -82
5051 -82 -91 2 -79 119 -138 -47 87 173 86 67 35 -48 259 -86 -40 -73 -194 136 -13 182 97 -96 72 105 2
5076 2 39 -46 180 154 79 177 -152 21 247 85 -3 12 37 -170 207 121 -376 146 -109 176 11 -140 19 421
5100 421 142 -61 31 79 127 116 123 -13 239 162 -130 103 -145 -192 83 -58 61 -3 75 276 -127 -31 249 28
5124 28 -122 -36 -117 -41 105 366 55 -155 76 71 73 -235 -166 4 -81 25 -124 -200 36 -31 -277 516 341 161
5148 161 45 -96 -163 34 -38 182 -15 9 -141 207 70 -14 185 -3 -192 84 42 13 -89 43 -167 -195
5170 -195 -116 52 -48 12 53 -78 156 131 191 -225 230 29 9 -14 -47 -99 43 123 -62 274 196 85 91 19 -196
5195 -196 -71 266 194 249 139 -271 -160 -176 -36 209 -107 -152 131 -104 -145 140 5 77 -5 236 213 109 12
$$ packed form
5025c0R6J50l54J65k67K22J69j52q5R4j09K5N5P1q1M0M0No2J5L4k06P5J32m0q4
5051h2rR3q1J98k57R1J34Q6q7j9l2q3L07l45M6l3j21L30j49J95q5j93J68L3j03
5076BL7q5K26k6p5R8l29J73K26j62q8J5K5k07L77q6m97N22k55K85j65j51J59M02
5100D21k79k03R2M8M8j1Pj36K52p7k92K33k48m7K75j41J19o4P8K01m03R6K80k21
5124B8j50Q6q1P6J46K61l11k10K31nKl08O9J70q5J06j49p6K36o7k46P93j75j80
5148A61j16j41o7J97p2K20j97K4j50L48j37q4J99j88j89K76m2k9j02J32k10k8
5170a95P9J68j00O0M1j31K34k5O0m16M55k01k0k3l3n2J42Q0j85L36p8j11Op2k15
5195a96J25L37p2N5j10m10J11j6J40K45l16m5K83k35m1K85j35P2q2K41k3j04r7
$$ plain form
5218 12 -233 -293 143 -17 1 178 -87 -39 175 15 101 -29 114 84 247 -15 -262 -71 -200 -23 -105 -73 53
5241 53 -122 -207 16 -289 -210 110 -78 326 170 -113 -290 -98 161 28 6 8 108 -36 8 -47 -62 292 336
5264 336 -27 80 -85 251 -63 -81 3 217 -43 26 80 -206 -87 -151 46 286 -121 -177 179 214 -116 0
5286 0 107 115 32 -187 -37 -64 -60 -63 111 201 12 -3 69 121 -45 82 -108 158 84 -106 178 158 -128 224 66
5311 66 15 -4 173 71 -99 189 264 -49 80 -124 167 -12 41 -96 -100 155 95 -102 245 -53 -54 -134 75 -83
5335 -83 -17 -78 65 -68 -18 -147 -169 128 278 365 -191 32 -132 266 130 -179 -93 79 -250 66 -72 -60 -109
5358 -109 10 -60 178 -64 -27 29 -23 10 153 62 190 241 36 20 347 50 -54 106 237 207 -35 263 47
5381 47 102 31 -58 -46 -24 129 -32 199 -141 -81 32 -6 -5 13 168 187 157 -17 -6 10 -14 139 -14 -32 -202 -133
$$ packed form
5218A2k45o0M36j60J8J77k65M8K14j60Q6j30J43l0J63k62k47J91j29J77q2L2J26
5241E3j75q5K23l05P9L20j88M04j56k83j77J92K59j33k2KJ00j44M4n5j5L54M4
5264C36l63J07j65L36l14j8Q4K14k60O9N4k86J19o4J97K40m07n6L56L5l30J16
5286@J07Qq3k19J50k7MlJ74R0j89j5P2N2j66J27j90K66p4j90K84k0k86L52j58
5311F6n1j9J77j02j70K88P5l13J29k04K91j79N3j37mK55o0j97L47k98jq0K09j58
5335h3O6o1J43j33N0j29k2K97J50Q7n56K23j64L98j36l09Q6J72l29L16j38J2m9
5358a09J19p0K38k42L7N6n2L3J43r1J28N1k05j6L27k97j04J60J31l0k42K98k16
5381D7N5p1q9J2K2J53j61K31l40O0J13l8JJ8J55J9l0j74J1J6k4J53j53j8j70O9
$$ plain form
5407 -133 -80 38 -243 -66 218 -17 187 183 46 35 -197 -46 34 -47 -132 57 37 -58 -122 -49 10 62 -204 84
5431 84 35 -292 -2 -27 133 -64 -197 101 -1 -47 44 266 71 127 -47 134 88 -213 -37 226 23 127
5453 127 -63 -50 -117 -189 27 -165 135 -169 -17 48 89 -15 -226 60 12 29 195 157 202 -258 -85 -306 -155
5476 -155 228 -60 10 119 5 -44 -29 -90 -184 254 -188 -89 -48 110 -171 13 -132 -29 73 186 -120 -98 3
5499 3 -42 -203 119 217 -239 -78 99 38 -65 -259 77 19 53 146 -140 -22 116 -86 171 -62 -155 -28 -2
5522 -2 116 37 195 -9 204 -197 -111 -47 34 130 0 110 74 28 105 36 144 263 -197 -188 232 -23 259 -182
5546 -182 -43 -98 205 -291 -76 -80 -180 -48 -42 -25 -181 31 31 -86 204 -1 -254 268 -75 -195 12 31 23 67
5570 67 -204 -234 -124 62 123 -149 -119 44 -60 22 135 -275 54 87 156 91 -55 275 23 -67 -20 -65 -239 -104
$$ packed form
5407a33N3J18k81J77K84k35K04mj37j1k32J51Q0q1q5J89k0r5o4P3N9N2k66K88
5431H4m9l27K90k5J60j97j33K98j02m6R1K22j95N6j74J81m6l01J76K63k03J04
5453A27j90J3o7p2K16j92L00l04J52O5M1j04k11K86m8J7J66l8M5m60J73k21J51
5476a55L83k88P0J09j14m9J5o1r4M38m42R9M1J58k81J84j45J03J02J13l06K2J01
5499Cm5j61L22R8m56J61J77o1j03j94L36n8L4R3k86J18J38k02K57k33r3J27K6
5522bJ18p9J58k04K13m01Q6O4Q1R6j30J10l6m6P7o9J08J19m60RM20k55K82m41
5546a82J39n5L03m96K15mj00J32OJ7j56K12%j17K90k05k53N22l43j20K07J9qM4
5570F7k71l0J10J86O1k72L0J63j04Q2J13m10L29L3O9o5j46L30k52r0M7m5j74J35
$$ plain form
5594 -104 206 80 17 50 269 239 -52 194 -95 -112 85 96 106 -28 82 -149 -110 53 54 280 -149 55 162
5617 162 126 -91 86 93 295 -39 -102 19 -120 57 22 251 -64 54 -15 39 -38 -92 -7 -43 -113 -28 -41 -78 0
5642 0 6 109 32 -58 79 109 -221 -243 200 72 190 -3 10 130 56 -256 33 -37 114 -72 36 234 54 -45
5666 -45 -119 112 141 220 90 89 47 -18 -46 -51 -61 -99 286 -103 -163 -127 149 232 -225 151 169 16 175 157 212 -287
5692 -287 256 -242 -193 -143 22 -253 215 -162 -137 -123 78 -57 25 -75 129 -39 251 83 -201 299 141 120
5714 120 -156 65 -39 -71 -201 -18 -29 77 -169 -108 -93 258 119 11 61 88 -114 -13 -209 -10 56 166
5736 166 53 -31 -82 94 41 -198 176 192 -110 17 -22 -15 -40 -154 5 -46 85 58 210 22 235 -15 151
5759 151 169 -298 -216 -2 -353 75 130 75 108 101 35 -28 171 174 -42 -191 147 -175 105 187 247 56 -91 189
$$ packed form
5594a04L10j26o3L3K19l0k91K46k89j7J97J1J0j34J10k31L9J63JK26m29K04J07
5617A62l6k17J77PK02l34o3J21j39J77l5K29l15J18o9N4p7n4Q5l6p0Q5j3l7P8
5642@OJ03p7r0J37L0l30k2M43j28J18j93J3J20p4l12K89p0J51j86J08J98j80r9
5666d5p4K31K9P9j30jm2o5k8nj0l8L85l89o0L6K76Q3m57L76J8j53J59j8N5m99
5692b87N43m98M9N0J65k75M68l77K5J4K01j35Q2j00K04j68K90j68k84N00j58k1
5714A20k76K21j04l2j30J83j1J06k46O1J5L51j39j08N0K7k02J01j96J99O6J10
5736A66j13q4n1J76n3k39L74J6l02J27l9Pk5j14J59n1J31k7J52j88K13k50J66
5759A51J8m67Q2K14l51M28N5n5L3po6o3J99Lk16j49L38l22K80Q2O0j91j47K80
$$ plain form
5783 189 279 -124 175 -137 50 393 54 43 69 -44 -63 -25 8 -124 178 -12 125 -24 67 -330 199 236 8
5806 8 6 -96 -16 -355 98 -23 20 126 -50 162 -57 157 156 -308 94 -57 140 48 -117 -64 271 87 71 -85
5830 -85 -374 -171 17 119 142 -267 -114 123 -117 105 63 107 -82 -53 63 -149 -49 -112 277 84 -185 -28
5852 -28 -160 -56 -194 116 92 45 -35 -58 146 352 117 61 -221 109 -262 -95 28 145 -131 -19 245 -30
5874 -30 144 60 163 -16 -182 54 76 -1 129 -12 28 -168 -86 118 63 272 -87 -137 52 -123 -270 3 54
5897 54 -56 72 -99 118 -362 -13 -1 -117 -256 42 54 13 82 49 -255 137 50 51 266 -91 158 147 -92
5920 -92 -116 -331 -181 -146 -14 11 95 -122 -137 -1 -103 212 -8 49 50 -113 30 312 -159 -40 -67 77 32 63
5944 63 238 81 4 -50 -75 92 38 -201 456 -56 -153 -81 53 10 -86 -45 110 114 -120 84 -194 -184 81 154 -68
$$ packed form
5783A89R0m03K99l12J87L43l39j1K6j13j9L8L3j32L02j90J37j49R1l97N29L7k28
5806Hkj02Q0l39M53j21M3J06j76K12k19K14jm64M02j51J97r2j65N3L35j84j6j56
5830h5k89K03J88J02K3m09J53K37k40K22m2M4j89K9J16k12J00o3L89j93k69J57
5852b8j32J04j38L10k4m7q0k3K04K06k35n6k82L30l71J67J23J17k76J12K64k75
5874c0J74q4J03j79j66K36K2p7J30j41M0j96Q2K04n5K09l59n0J89j75j47K73N1
5897E4j10J28j71K17m80L49J2j16j39K98J2m1O9l3l04L92q7JK15l57K49j1k39
5920i2k4k15J50L5J32K5Q4k17j5J36j02L15k20N7Jj63J43K82m71J19k7J44m5L1
5944F3J75j57p7n4k5J67n4k39O57n12r7P2J34m3r6M1J55Mk34K04k78J0K65P3k22
$$ plain form
5969 -68 -144 -124 153 -101 109 60 69 -123 21 -30 -319 49 37 -96 -51 184 -213 168 78 183 221 20 -114 49
5993 49 -21 167 -73 47 32 69 -108 -101 337 90 -71 -43 2 -42 84 -11 187 -105 31 20 191 210 -28 -75
6017 -75 152 238 -143 20 -144 292 -170 59 -63 -212 28 -201 -100 -31 5 13 -14 -41 206 15 99 27 212
6040 212 -143 228 25 -18 -238 -232 -59 -121 -116 -67 -118 -130 -177 -96 -175 106 68 13 5 238 266 -33 88 126 16 -61
6066 -61 209 -67 -148 126 -89 110 -159 -190 120 126 -69 -326 -78 14 171 108 137 -7 54 -58 13 -130 -119 -122
6090 -122 -20 45 5 149 140 -102 -334 90 80 -122 268 199 -39 206 104 32 11 -92 -147 73 -49 -215 -25
6113 -25 55 -153 178 -75 25 11 54 35 -39 1 -254 100 -52 -113 -6 -12 -78 -166 100 -197 -120 58 -46 58
6137 58 -4 -34 142 -23 -111 -119 -215 240 25 72 -10 61 -82 -102 16 186 -90 -33 -9 256 44 107 -30 -40 25
$$ packed form
5969f8p6K0K77k54K10m9Rj92J44n1k89L68j2j33M5K35l97L81r0J05L8k01j34J63
5993D9p0J88k40J20j5L7j77PM38k47j61K8M5m4J26r5J98k92J36j1J71J9k38m7
6017g5K27Q6l81J63j64M36m62K29j22j49K40k29J01O9L6Qk7k7K47j91Q4p2J85
6040B12l55L71k03m3k20OJ73o2NM9n1j2m7Q1p9K81l8n5qK33K8k99J21L8j10p7
6066f1K70k76q1K74k15J99k69l1L10Oj95k57K48R2J57o3K9j44O1j12P1j43J1l
6090a22J02O5m0J44rk42k32M24j0k02L90o9k38K45j02p2k1j03n5K20j22j66J90
6113b5Q0k08L31k53J00j4M3j9p4M0k55L54j52o1J07oo6q8K66k97P7J78j04J04
6137E8o2l0J76j65q8qr6M55k15M7q2P1j43k0J18J70k76N7K4K65k12O3j37j0O5
$$ plain form
6162 25 -155 -126 70 103 137 -121 90 -47 -186 237 197 186 -57 218 -7 10 -281 -114 5 76 115 155 14
6185 14 -154 11 174 108 107 -93 82 -45 154 -53 71 72 104 -223 1 505 8 145 470 -177 -141 -98 52
6208 52 238 10 74 -222 -76 -98 158 172 -84 -126 66 282 -205 18 -67 -70 45 -151 82 -254 -157 31 54
6231 54 -172 156 211 28 -165 -114 308 -37 -58 -60 -70 1 -317 -113 196 6 6 134 -64 -196 38 -386 321
6254 321 -175 147 -25 89 61 -18 26 137 -41 -233 110 58 -174 227 283 64 34 21 -87 21 -1 8 -63 115
6278 115 -20 -79 111 68 13 158 -166 -88 -77 54 164 -165 -159 -11 -89 -95 -71 -262 26 79 -71 237 -298 -49
6302 -49 45 -301 -156 -150 -165 -213 121 -2 -70 64 212 -76 233 73 -46 -69 -183 58 22 133 84 -128 12
6325 12 -260 139 199 -92 -150 -25 73 98 -78 167 134 24 51 -157 -94 60 43 -288 155 72 -25 146 -76 -116
$$ packed form
6162B5j80K9J96L3L4k58K11j37j39M23m0j1k43K75k25J7k91J67J19P1L9M0j41
6185A4j68J65J63o6jk00J75j27J99k07J24JL2l27K24N04m97J37L25o47L6M3J50
6208E2J86k28O4k96J46k2K56J4k56m2J92K16m87K23q5lJ15j96K33l36R7J88K3
6231E4k26L28N5j83j93N1M22l45k1kj0P1l18K04L09j90%J28j98j32K34m24P07
6254C21m96L22j72J14k8p9M4J11j78j92L43n2k32M01N6k19l0j3j08J08k2Rp1J78
6278A15j35n9J90m3n5J45l24P8J1J31J10l29OJ48p8oK4j91K88N3j50L08n35K49
6302d9R4l46J45Oj5m8L34j23o8J34J48k88L09j60j19k3j14K41l6J11m9k12J40
6325A2k72L99O0k91n8J25R8K5j76K45l3j10K7k08O3J54j7l31M43q3r7J71k22m0
$$ plain form
6349 -116 192 151 -54 110 23 -168 122 180 59 162 56 16 66 4 16 260 -42 86 -123 49 -8 -48 -10
6372 -10 -38 -151 -20 -71 -49 52 132 25 -118 66 -3 -174 -46 -31 -101 -82 307 -304 115 191 -139 299 79
6395 79 -212 124 21 5 -116 57 -102 -113 -81 247 -207 -69 132 -366 139 180 -102 176 113 -107 232 100
6417 100 271 219 124 141 -123 -64 3 -69 36 -28 -287 42 -25 -179 -224 -49 -57 -50 -35 -63 100 213 14 261 -108
6442 -108 -104 226 94 104 -46 119 111 -136 53 -71 -41 115 -87 105 -113 -57 -77 -55 -148 -44 225 -119 -155 68
6466 68 51 30 -77 -54 322 -36 120 67 47 -262 -197 121 48 -127 27 -264 28 103 35 30 168 -22 -194 196
6490 196 39 183 -77 -110 51 59 -55 55 131 205 -257 -47 -76 78 303 44 50 -80 -27 -165 -20 8 9 -109
6514 -109 -63 118 72 90 89 70 -13 -75 14 -144 -59 147 18 -43 200 -297 98 -18 133 -47 -286 -107 -64 119
$$ packed form
6349a16L08m1k05J64q7j91K90N8j21J03j06m0N0o2J2K44l02J28k09J72n7m0L8
6372a0k8j13J31n1K2J01Q0j07j43J84o9j71J28J5p0J9L89o11M19P6l30M38k20
6395G9k91L36j03j6j21J73j59j1L2L28m54J38K01m98N05M1k82K78o3k20L39j32
6417A00J71n2r5J7k64N9O7p2J05o4k59L29o7j54m5J75qPJ5k8J63J13j99K47l69
6442a08ML30j32J0j50J65qk47J89j24L0J56k02J92k18N6k0K2r3J04K69l44l6K23
6466F8j7k1j07K3L76l58J56n3k0l09O5L18p3j75J54k91K92P5o8nJ38j90j72L90
6490A96j57J44k60l3J61Qj14J10P6P4m62K10k9J54K25k59Oj30N3j38J45K8Jj18
6514a09M6J81m6J8jj9q3o2Q9j58Q5K06j29o1K43m97L95j16J51j80k39J79M3J83
$$ plain form
6538 119 -169 65 71 300 37 -38 -19 81 116 -117 39 198 -233 -34 112 51 -337 3 -217 -244 -46 50 -86
6561 -86 54 -55 -58 27 -62 88 49 119 -112 80 211 129 172 -233 -21 131 49 -222 -72 -100 -171 150 3 286
6585 286 -35 271 -211 242 109 -111 103 98 -39 81 -256 4 43 -45 -248 -127 19 267 -27 -102 -57 -17
6607 -17 -2 170 265 102 197 -240 -1 7 -185 50 52 -99 171 98 -74 -93 112 -59 -353 -91 -85 -131 108 40 196
6632 196 -10 -66 1 43 -77 -306 -108 9 -277 158 -294 35 8 60 140 13 -25 129 -63 -24 73 94 -263
6655 -263 -131 94 -58 -72 -151 112 -63 84 46 173 36 6 164 120 94 49 -125 186 -183 106 -14 124
6677 124 39 105 198 110 39 -86 65 -326 131 11 6 81 -11 -292 -11 -157 16 -104 22 170 221 -286 94
6700 94 336 -31 -90 14 41 -44 171 105 -60 118 55 -247 175 -61 -147 -122 -43 119 79 -125 308 66 128 -187
$$ packed form
6538A19k88K34OK29k63p5J9J00L5k33J56J59m31J99J46o1l88L40k20k7J98R6j36
6561h6J40j09lQ5q9J50l9P0k31J92J31q2M3m05K12J52q2k71J50k8p1L21j47K83
6585B86l21L06m82M53j33k20K14nj37J20l37K60L9q8k03J21J46K48k94p5M5M0
6607a7J5J72R5j63R5m37K39Qj92K35Kj51K70p3j72j9K05j71k94K62Om6K39o8J56
6632A96k06n6O7M2j20k29J98J17k86M35m52L29k7N2Q0j27l8J54j92L9R7K1l57
6655b63J32K25j52j4p9K63j75J47l8J27j37l0J58m4k6m5j74L11l69K89j20J38
6677A24q5O6R3q8p1j25J51l91M57j20nP5r2k81K81j46J73j20J26J48N1n07L80
6700I4K42l67n9J04K7q5K15o6j65J78o3l02M22k36q6K5P9J62m0k04M33k42O2l15
$$ plain form
6724 -187 -197 -98 -46 10 -313 -101 -36 -20 157 -142 -8 82 130 13 -159 12 -140 44 -182 -85 374 -55 120
6747 120 225 44 91 -162 219 7 -7 -27 184 -113 45 -11 -277 242 50 70 -167 75 -35 -2 58 227
6769 227 -240 -56 -17 12 -3 210 119 160 143 -12 62 94 212 -38 174 -121 109 209 -62 139 -220 209 -21
6792 -21 270 160 -22 111 -50 112 -55 100 -271 -238 -363 117 -148 -64 -43 -43 -205 -155 186 -111 71 -142
6814 -142 -7 81 -158 151 14 86 -48 -215 145 169 113 86 -205 -48 -141 -36 64 -78 -142 99 77 206 12
6837 12 28 -161 -343 -70 -337 -47 -74 65 -12 -84 198 89 -146 251 -92 48 205 186 40 277 -115 126
6859 126 68 -56 -24 -121 -282 149 -87 -235 78 -25 29 -53 58 171 103 7 -374 -363 188 81 -22 78 -51
6882 -51 -113 106 -106 -367 -251 9 131 200 -79 190 125 -100 -106 -203 -284 52 -63 280 77 -5 -6 -26 -12 144
$$ packed form
6724a87j0R9N2N6l23K12O5J6J77k99J34R0M8j17j72J71j52J84k26R7M59m29J75
6747A20J05j81M7k53L81k12j4k0K11k97J58n6k66N19j92K0k37K42j10L3O0J69
6769B27m67J84L9K9j5K13r1M1j7j55P4L2J18k50K12k95K30J00k71K01l59M29k30
6792b1K91j10j82J33j61J62j67J55l71L3j25M80k65Q4K1%j62N0L41k97J82k13
6814a42J35Q8k39L09j37P2j34j67L60K4n6k7k91J57r3J05J00j42o4K41k2J29j94
6837A2J6j89j82K73k67K90k7J39p7p2K82j09k35L97l43J40J57j9j46K37l92K41
6859A26n8j24L2r7j61M31k36j48L13j03N4q2J11J13o8r6l81J1N51j07j03J00j29
6882e1o2K19k12k61J16K60J22O9k79K69o5k25or7q1L36j15L43k03q2jk0J4J56
$$ plain form
6906 144 49 -5 -128 -1 86 45 15 -9 82 130 -86 71 39 39 194 -59 -140 -122 -88 65 -214 -212 -196 82 -90 -86
6932 -86 15 201 -193 -28 54 36 -114 -155 -179 -127 14 13 71 138 -51 -51 431 -89 -92 -66 -77 124 38 102 77 -151
6958 -151 -469 71 213 40 43 -1 105 -355 -17 -266 -62 -108 -178 87 189 194 -32 159 190 17 -159 -214 -230
6981 -230 15 -139 222 94 191 267 187 121 45 184 82 39 -230 -65 -130 246 183 114 111 -79 284 87 -187 -232
7005 -232 -28 -83 -105 -108 -58 28 125 -30 52 -110 115 -83 -64 101 -171 -39 2 -43 95 42 -171 126 -6 304
7029 304 -96 -111 75 -50 -195 213 -56 -161 127 -261 133 -205 -2 102 -3 74 -25 -72 200 20 59 -52
7051 -52 -97 169 -200 -461 199 -207 -222 46 -12 -155 24 -136 19 -124 -179 -260 -84 -85 187 -109 80 -49 72
7074 72 56 -17 -88 92 -61 181 -65 99 -111 9 413 83 161 -74 7 80 96 54 91 -61 -100 -43 31 120 -30
$$ packed form
6906A44r5n4j23J27Q7m1l0k4R1M8k16J57l2%J55k53q1J8L4J53k79KJ6K78j72M
6932h6J01J86l94J65Q2j8j50m1k4N2J41jN8O7j89%M82n20lK6j1K01q6O4k5k28
6958a51l18N40J42j73Lm4J06m60L38k49K04m6p0K65J02Nk26J91L1j73j76n5j6
6981b30K45j54L61j28R7P6q0o6p6J39j02m3k69J65o5L76o3o9lj90L63j97k74m5
7005b32K04n5k2lN0Q6R7j55Q2j62K25j98J9J65k72J32M1m5J38n3k13K97j32L10
7029C04m00j5J86j25j45M08k69j05K88l88L94l38K03J04j05P7r9m7K72j80L9j11
7051e2m5K66l69k61O60m06j5K68n8j43J79j60J55j43n5q1J76jK72k96J89j29J21
7074G2j6p3p1J80j53K42k46J64k10J20M04l30P8k35Q1P3J6m2L7j52l9N7P4Q9j50
$$ plain form
7099 -30 80 -285 -161 -201 -259 -108 85 80 -315 -66 9 133 -246 -102 139 90 -166 1 -135 180 -99 13
7121 13 269 -283 -124 0 9 86 -2 -10 -50 -95 33 98 -12 -25 50 59 113 -222 -28 -207 31 -126 -25 339 31
7146 31 -185 -67 74 131 257 101 58 -181 106 -121 -130 -137 17 268 -3 -122 161 -115 -75 57 -110 186 -310
7169 -310 48 239 -227 27 -302 -98 295 49 -175 39 -99 -131 -73 -195 -33 87 -44 -45 -144 181 -96 -281
7191 -281 51 -7 -73 -207 -250 70 -135 37 270 -325 63 298 -144 5 -95 171 271 43 72 -163 -143 105
7213 105 -70 -84 19 55 -95 -79 -148 94 -159 160 240 40 -80 -21 115 -3 103 -125 -61 -55 -32 299 272 -1
7237 -1 -41 157 167 -75 173 84 74 -4 61 -149 -240 -74 63 210 81 -118 181 46 -224 -153 -10 12 -40 -18
7261 -18 17 -59 -7 -131 -199 124 45 160 -21 119 2 -6 11 165 93 183 332 -20 -62 87 262 -89 18 38
$$ packed form
7099c0J10l65J24m0n8J51J93nl95K49P5J24l79J44K41m9k56J67j36L15k79J12
7121A3K56n52J59J24RP7q8qm0m5J28O5j10j3P5RN4l35J94j79K38j57J01L64l08
7146C1k16J18J41N7J26j56m3k39K87k27rpJ54K51k71j19K83k76M0J32j67K96m96
7169c10L58J91m66K54l29K04L93k46k24K14j38l2N8j22J62J20j31jr9L25k77j85
7191b81L32n8o6j34m3L20k05J72K33n95L88K35m42J49j00K66J00k28K9k35K0K48
7213A05j75j4J03L6j50J6o9K42k53L19Q0k00j20N9J36j18J06k28O4OK3L31k7k73
7237am0J98J0k42K48q9j0p8O5k10r1J66J37J47j29j99K99j35k70P1J43K2n2K2
7261a8L5p6N2j24o8L23p9J15j81J40j17qJ7J54p2R0J49l52m2J49J75l51J07K0
$$ plain form
7285 38 63 278 -109 -218 -73 245 93 -156 82 92 9 35 14 -155 26 -22 -50 131 111 -322 -82 114 -71
7308 -71 154 -70 47 -117 274 -239 -39 122 -256 -122 -40 13 194 -19 172 -2 -417 -24 242 79 221
7329 221 75 -330 59 125 92 40 184 24 -116 -187 57 2 117 -81 23 -11 -110 59 -12 127 37 -86 -107
7352 -107 71 87 169 233 88 -306 -94 -335 124 134 272 0 4 39 -80 58 -252 125 126 -96 120 -39 200
7375 200 -71 -209 102 33 -173 31 123 35 43 -64 -175 84 12 212 214 -282 -160 21 -163 117 -220 44 55
7398 55 179 51 181 -190 -249 -48 -41 31 -66 4 45 -10 107 -3 -4 -179 -51 53 103 -163 -202 -179 -94 12 150
7423 150 -111 -131 30 -62 -257 -157 120 -169 179 299 -120 -188 75 -98 114 64 161 67 114 180 -83 -119 60
7446 60 9 -184 -36 -22 -63 -26 109 95 365 27 -82 -114 281 244 14 37 -39 84 22 67 29 -21 79 153 -153
$$ packed form
7285C8K5K15l87j09J45L18j52k49K38J0q3K6k1j69J81m8k8J81k0m33K40J96j85
7308g1K25k24J17j64L91n13K00J61l78J34Q2N3J81k13J91j74m15L93K66j63J42
7329B21j46m05L89O6l3n2J44j60j40p1K44n5J15j98J04l4r9J69p1J39r0j23k1
7352a07J78J6Q2O4j45l94K12k41M59J0J38k72ML5j19J38l10L77Jk22K16j59K39
7375B00k71j38L11o9k06K04R2q8Qj07j11K59p2K00Km96J22J81j84K80l37K64J1
7398E5J24j28J30l71n9K01PP2r7P0M1n5J17j10jj75J28J04N0k66l9K3Q5J06J38
7423A50k61k0J61r2j95J00K77k89L48J20m19o8K63j73K12n0R7r4M7O6k63l6J79
7446F0n1j93J48J4m1L7J35j4K70l38j09l2L95l7k30K3p6J23o2M5l8n0J00P4l06
$$ plain form
7471 -153 82 71 344 -121 150 -90 31 -61 204 -138 -74 113 -37 221 511 -62 -36 -264 -88 -81 -27 -113 175
7494 175 -124 207 27 -56 73 210 133 -149 207 -94 157 155 -192 -337 -300 63 142 31 -10 -99 156 177 -55
7517 -55 1 255 -307 79 -65 -185 -66 42 55 -65 243 -132 -47 317 -89 11 -63 245 92 168 -98 83
7539 83 -34 82 -86 -35 -51 -75 -62 -12 -131 -66 102 -126 -24 -70 32 160 -227 32 95 142 -38 38 103 42
7563 42 -213 -67 -171 163 -196 132 233 46 147 -158 -184 -72 280 -30 -252 -343 -32 100 -29 202 163
7584 163 31 -166 -181 150 12 275 46 225 -18 -38 -121 -285 96 163 -100 -26 -311 -63 1 163 -32 -113
7606 -113 -99 171 -58 -183 -45 -148 10 -23 -201 23 -175 -119 59 -225 172 9 452 -74 -128 246 -171
7627 -171 -150 4 -76 38 -28 -181 196 29 -2 -155 1 -21 -237 -140 -34 -62 151 98 -126 196 19 78 -61
$$ packed form
7471a53K35j1K73m65K71k40J21r2K65l42O4J87j50K58K90n73K6k28J76PN4q6K88
7494A75k99L31j80q3J29J37p7k82L56l01K51kl47j45L7L63P9j11m1q9K55K1k32
7517e5N6K54n62L86j44j20J19J08J3j20L08l75Q5L64m06J00p4L08j53P6k66J81
7539H3j17J16j68N1j6k4J3N0j19O5J68k28J02m6J02J28l87K59O3M7j80P6O5o1
7563D2k55J46j04L34l59L28J01j87J01l05k6J12L52l10k22r1L11J32j29K31l9
7584A63j32j97j5L31j38K63k29J79k43k0q3j64L81O7k63P4k85K48O4J62j95q1
7606a13J4K70k29j25J38j03J58l3j78K24j98N6J78k84L97j63M43n26n4L74m17
7627a71K1J54q0J14o6j53L77j67l1j53J56k2k16R7J06k8K13n3k24L22j77N9j39
$$ plain form
7650 -61 -94 -129 -20 -68 -172 -300 -28 -126 -309 229 -216 128 36 17 4 -37 -264 -105 -155 -164 167 -325 112 -63
7674 -63 94 10 -47 -18 -145 -90 62 -54 -4 242 -144 -37 113 -166 134 -297 -211 -123 167 -135 -7 -15 -43 -52
7698 -52 13 285 -120 136 44 58 -235 140 54 -128 186 76 100 213 -169 123 -63 -51 71 -269 226 -17
7720 -17 57 -178 -67 -24 -163 -107 -57 -22 -56 -207 -133 55 17 -38 -78 63 28 47 -3 264 102 42 23 -121 -219 173
7746 173 -155 168 98 -83 20 -75 39 -81 -144 152 -8 271 -115 56 136 93 105 13 78 149 -18 -229 -33
7769 -33 -129 -65 21 131 7 -457 201 293 96 41 -181 306 -104 46 163 -245 150 -37 -98 -95 82 148 -139
7792 -139 18 -142 -62 278 210 42 -17 -187 266 -130 -16 -144 33 12 -359 62 48 110 -222 -164 -31 -215
7814 -215 18 51 19 87 -56 -78 81 -325 -66 -278 -59 -46 363 51 38 210 -287 134 129 -62 151 -52 90
$$ packed form
7650f1l3l5J09m8j04j28K72r8j83N38m45L44r2j9j3m1k27J59n0rL31m92M37j75
7674f3J57q4n7K9j27N5J52j16N0K46l86J07J50k79L00m31Q6Q8K90l02J28qk8r
7698e2O5K72m05K56r2J4k93L75q6j82L14j10K4J13l82K92j86J2J22l40M95k43
7720a7P4k35J11M3j39N6N0L5l4j51P4J88l8n5m0J41l5J9n0K67j62o0j9j44r8L92
7746A73l28L23p0j81J03r5J14j20o3K96j60K79l86J71Q0m3J2r2O5P1j67k11J96
7769c3r6O4Q6J10j24m64O58R2j97n5k22M87m10J50J17m08L95j87o1LJ77O6k87
7792a39J57j60Q0L40o8j68n9j70M53l96J14j28J77k1l71M21j4O2l32N8J33j84
7814b15K33L3l2O8j43k2J59m06K59k12K19J3M09l12j3J72m97M21nj91K13k03J42
$$ plain form
7837 90 75 -30 113 88 -200 -70 82 54 -238 -30 -17 54 -337 93 112 -170 2 13 254 -26 21 17 15 -246
7861 -246 272 253 -82 -21 -29 -34 247 -41 -87 -16 -200 21 -210 221 128 38 -233 113 106 -171 10 52 77 -87 97
7886 97 185 -97 -5 21 42 -283 117 -145 -96 27 134 -68 -122 -63 16 157 -121 135 -138 14 -199 34 11
7909 11 -152 46 107 -94 -100 -211 -119 46 145 123 42 -86 75 -14 -34 2 -90 68 38 -172 192 -302 -216 27 33
7934 33 106 -30 -65 -43 238 105 -167 97 117 155 -247 -139 6 325 37 141 -127 -80 211 207 235 -395 -7
7957 -7 179 389 -135 -157 90 -75 29 -170 -230 64 43 134 192 -34 -156 -33 160 -135 49 -11 14 128 -50
7980 -50 -68 -162 -32 -215 45 112 111 -108 204 95 210 163 -13 24 -258 85 -10 -17 59 -95 18 -106 -202 280
8004 280 17 480 12 24 33 -208 199 -149 -131 63 -81 -144 -24 -176 141 290 41 90 149 17 -73 272 -56
$$ packed form
7837I0j5j05J43k5k88J30J52k8k92K08J3P1l91M30J9k82J72J1K41k80M7mkk61
7861b46N18j9l35O1qnK81k88m6P1j84K21k31M31r3r0k71L46pk77J81M2K5j64J84
7886I7Q8k82R2K6K1l25M00k62M9J23J07k02n4N9P9J41k78K56k73J52k13K33k3
7909A1j63J98O1k01oj11R2J65R9k2q1j28J61q9k0L6r2J58l0k10L64m94Q6K43O
7934C3P3j36l5K2K81j33k72K64K0L8m02J08J45L19k88J04k68M7K91mK8o30L88
7957gJ86K10n24k2K47j65J04j99o0K94k1R1N8k26j22J23J93k95J84o0K5J14j78
7980e0j8r4J30j83K60O7jk19L12j09J15m7j76L7k82L43r5pP6j54J13j24r6M82
8004B80k63M63m68J2Rk41M07l48J8J94j44o3J20j52L17J49k49M9N9j32r0L45l28
$$ plain form
8027 -56 -28 121 -202 306 -150 -146 8 -113 -52 135 15 75 96 -15 -117 224 135 199 -152 -123 -36 -98 26 -54
8051 -54 42 314 321 59 -96 -82 -21 357 -16 2 -91 165 259 -174 122 -119 48 -176 123 251 -203 184 -140
8074 -140 -31 -122 69 100 15 -13 193 -11 301 97 -181 111 -247 -57 21 8 -87 -109 -119 258 208 78 150 38
8098 38 -149 -118 -59 -71 6 45 133 -13 -453 205 9 215 -203 49 364 7 121 -104 237 -44 190 -80
8120 -80 -37 51 -131 331 -55 376 247 -13 -193 160 179 38 -85 185 115 -8 125 -139 -54 140 -129 35
8142 35 201 100 -110 -8 339 -22 -367 -123 326 -12 42 -22 69 -292 56 -141 -55 54 -82 284 45 67
8164 67 81 -249 -38 257 -22 -25 94 -56 293 261 -33 15 60 -180 105 155 169 95 -28 78 -78 82 147 -173
8188 -173 -155 33 -70
$$ packed form
8027e6K8J49l23N08m56MJ54j21O1J87j20O0K1j11j02L41q9O4l51K9Q7o2J24q0
8051e4R6K72Pk62j55J4O1L78l73J8r3K56R4m33K96k41J67k24K99J28m54L87l24
8074a40J09r1J91L1q5k8K06k04L12k04k78K92l58J90P8j3r5k2j0L77n0j30P2j12
8098C8j87L1N9j2P7L9Q8j46m40O58j96K06m18K52L15l57J14k25L41k81K34k70
8120h0M3Q8j82M62l86M31j29k60j80L53J9j41j23K70p0j23J33k64Q5J94k69J64
8142C5J66j01k10J02L47l61l45K44M49l38N4o4R1l61L48j97Q6J09j36L66k39K2
8164F7J4l30K11K95k79lJ19j50L49l2k94M8M5k40K85N0J4p4j23J06j56J60O5l20
8188a73J8J88j03
8191g0
$$ Imaginary data points
##PAGE= N=2
##DATA TABLE= (X++(I..I)), XYDATA
$$ plain form
0 0 0 0 0 0 0 0 0 0 0 0 0 -8 8 -8 8 -8 16 -16 24 -24 32 -40 41 -49 61 -72 80 -96 111 -126 144 -162 185 -209
34 -209 237 -267 301 -336 376 -420 466 -519 575 -637 703 -780 860 -949 1045 -1150 1268 -1396
52 -1396 1539 -1698 1875 -2075 2305 -2565 2870 -3227 3658 -4185 4846 -5706 6878 -8576 11271
67 11271 -16213 28319 -127248 -84600 89486 -85726 -76909 15778 -4912 -39141 85886 90010
79 90010 -23838 -13251 92783 44469 -5593 43360 27925 -48390 5834 60754 -14944 -78233
91 -78233 -24313 -3834 -41520 -19723 12152 -52140 -59077 47189 64360 -15929 -1618 52514
103 52514 20712 -1590 51110 39466 -46579 -41782 23235 -3630 -41528 -5331 -9601 -50051
115 -50051 -4792 48326 -1440 -41007 15420 48053 4429 -7342 17294 -5420 -14839 28821
$$ packed form
0@%%%%%%%%%%%qJ6j6J6j6K4l2M0m8N6p2Q1r0J10j33J52j76K07k37K70l06L47l94
34b09M46n04N68o37P12p96Q86r85J094j212J340j483J640j809J994k195K418k664
52a396K935l237L573l950M380m870N435o097O885p843R031j0552J2584j5454J9847
67A1271k7484M4532j55567M2648J74086j75212Q817R2687k0690l4229J25027M124
79I0010j13848J0587J06034m8314n0062M8953j5435p6315N4224N4920p5698o3289
91g8233N3920K0479l7686K1797L1875o4292o937J06266J7171q0289J4311N4132
103E2514l1802k2302N2700j1644q6045M797O5017k6865l7898L6197m270m0450
115e0051M5259N3118m9766l9567N6427L2633m3624j1771K4636k2714r419M3660
$$ plain form
127 28821 22847 -31115 -24091 16082 5343 -14239 6999 7125 -29962 -18219 27854 13687 -21951
140 -21951 -4872 12708 -58 7210 19927 -4379 -19648 9926 21486 -15779 -23055 5598
152 5598 -1116 -17186 4958 12570 -10617 -7430 18359 16384 1288 6887 5854 -13833 -5542 18346
166 18346 -371 -28166 -12574 5678 -2197 -4826 4021 -493 -6238 8946 17296 -1001 -4614
179 -4614 11014 6348 -5683 4019 6693 -9343 -10286 5065 4554 -9879 -9492 -1384 -5101 -2936 7200
194 7200 -1629 -9851 3650 13902 4899 116 7200 8170 -477 -129 4349 -2602 -7125 -3003 -6909
209 -6909 -10403 -2542 10 -6514 -5155 6430 9174 603 483 9529 8451 2674 2748 266 -2521 -780
225 -780 -1845 -5127 -6067 -2345 -2187 -6423 -2712 3970 1016 -3079 1464 4597 3371 2777 2371 2847 3015
$$ packed form
127B8821n974n3962P024M0173j0739j9582K1238J26l7087J1743M6073j4167l5638
140b1951J7079J7580j2766P268J2717k4306j5269K9574J1560l7265p276K8653
152E598o714j6070K2144P612k3187L187K5789j975j5096N599j033j9687Q291K3888
166A8346j8717k7795J5592J8252p875k629Q847m514n745J5184Q350j8297l613
179d614J5628m666j2031R702K674j6036r43J5351n11j4433L87Q108l717K165J0136
194G200q829q222J3501J0252r003m783P084R70q647L48M478o951m523M122l906
209f909l494P861K552o524J359J1585K744q571j20R046j078n777P4k482k787J741
225g80j065l282r40L722J58m236L711O682k954m095M543L133j226n94m06M76J68
$$ plain form
242 3015 3486 1355 -2543 -939 2555 -2977 -8048 -4923 -1871 -2993 -4109 -2744 394 2034 2594 4011
258 4011 3193 4925 6594 2493 -931 1381 1727 -2238 -4547 -3387 -1508 -2994 -4190 -1432 108 370
274 370 1285 125 691 3358 2780 794 111 1393 2304 -240 -2134 610 897 -978 -1820 -2707 -871
291 -871 623 -1291 -2547 -1247 886 1773 -320 116 3480 3017 617 308 825 1160 304 -2245 -2375
308 -2375 -1230 -1046 -1496 -1579 -141 1872 1225 94 1736 2182 1642 408 -383 -57 -103 -1319 -2005 -1356
326 -1356 -280 538 -1087 -1368 674 1370 712 75 -72 762 1040 -12 -207 191 881 1047 -717 -916
344 -916 1052 63 -1800 -1648 -982 -411 -414 -778 114 655 1423 1552 752 1682 2667 1235 -391 -100 -352 -1085
364 -1085 -2364 -1786 -1003 -1051 -1091 -655 -557 994 1913 855 147 1279 2146 692 -213 381 401 -437 -561 -282
$$ packed form
242C015M71k131l898J604L494n532n071L125L052j122j116J365L138J640N60J417
258D011q18J732J669m101l424K312L46l965k309J160J879j486j196K758J540K62
274C70R15j160N66K667n78j986o83J282R11k544j894K744K87j875q42q87J836
291h71J494j914j256J300K133Q87k093M36L364m63k400l09N17L35q56k549j30
308b375J145J84m50q3J438K013o47j131J642M46n40j234p91L26m6j216o86O49
326a356J076Q18j625k81K042O96o58o37j47Q34K78j052j95L98O90J66j764j99
344i16J968r89j863J52O66N71ll64Q92N41P68J29q00R30R85j432j626K91k52p33
364a085j279N78P83m8m0M36R8J551R19j058p08J132Q67j454r05N94K0q38j24K79
$$ plain form
384 -282 -1068 -514 -62 -925 -1426 22 139 -555 -716 850 1400 481 643 1633 1384 941 928 -267 -701 0
404 0 -425 -1659 -1987 -535 -507 -1821 -952 1084 762 160 1135 1178 679 1193 883 58 -147 490 71 -1812
424 -1812 -1025 615 -158 -1052 168 -27 -202 110 303 -301 -34 1046 667 -643 374 1679 179 -697
442 -697 611 938 -229 -976 7 -560 -759 -394 -305 -578 -62 1274 -66 -439 934 1106 -288 -494 762
461 762 390 -988 -431 349 -626 -240 256 -648 -712 638 510 -392 -91 755 561 -639 -63 507 -398 -290
481 -290 316 -340 -659 489 371 -815 -503 915 107 -824 40 863 31 -490 481 162 -303 376 553
500 553 -328 -566 506 -424 -1180 -208 512 -349 -910 572 804 -57 167 509 -22 -118 276 -135 -756 -99
520 -99 160 -378 -679 360 200 -790 -24 98 100 -479 277 404 -3 107 699 -226 -752 700 251 -551 -379
$$ packed form
384b82p86N54M52q63n01J448J17o94j61J566N50r19J62R90k49m43j3j195m34P01
404@m25j234l28J452K8j314Q69K036l22o02R75M3m99N14l10q25k05O37m19j883
424a812P87J640p73q94J220j95j75L12J93o04K67J080l79j310J017J305j500q76
442f97J308L27j167p47R83n67j99L65Q9k73N16J336j340l73J373J72j394k06J256
461G62l72j378N57P80r75L86M96r04o4J350j28r02L01Q46j94j200N76N70r05J08
481b90O06o56l19J148j18j186L12J418q08r31Q64Q23q32n21R71l19m65O79J77
500E53q81k38J072r30p56R72P20q61n61J482K32q61K24L42n31r6L94m11o21O57
520i9K59n38l01J039j60r90P66J22Kn79P56J27m07J10N92r25n26J452m49q02J72
$$ plain form
541 -379 340 -494 -692 -77 -107 -436 119 1 -93 -357 430 441 -293 280 1025 451 -459 227 361 -264 -247 173
563 173 -196 -645 182 -12 -278 -143 452 38 -254 490 534 -319 -83 215 93 6 -185 99 -335 -352 45
584 45 22 -526 -185 425 -390 -390 221 132 -239 367 96 12 97 284 62 -226 301 81 -251 -482 -137 132 -336
607 -336 -200 37 -82 -90 76 46 -107 339 457 -156 -193 36 -30 -178 14 194 -186 -58 165 -29 72 -169
629 -169 234 -203 -54 397 347 -410 -58 304 -71 -270 203 129 -288 29 152 -124 12 55 -134 -301 -58
650 -58 472 -109 174 210 -55 -146 -67 44 88 250 -42 -234 -49 136 45 -172 92 16 210 -100 37 365 -356
673 -356 163 381 -119 89 16 -68 29 46 36 -12 -269 53 220 -64 -90 -4 189 309 232 271 -146 142 41 24
697 24 -173 151 29 -85 -5 -211 -87 -61 -166 -70 -29 91 195 -109 -205 108 25 -102 107 4 -141 5 -10
$$ packed form
541c79P19q34j98O15l0l29N55j18r4k64P87J1p34N73P45n74r10O86J34o25J7M20
563A73l69m49Q27j94k66J35N95m14k92P44M4q53K36K98j22q7j91K84m34j7L97
584D5k3n48L41O10q15%O11q9l71O06k71q4Q5J87k22k88N27k20l32k31L45K69m68
607c36J36K37j19qJ66l0j53M46J18o13l7K29o6j48J92J80l80J28K23j94J01k41
629a69M03m37J49M51n0p57L52L62l75j99M73p4m17L17J23k76J36M3j89j67K43
650e8N30n81K83L6k65r1P9J11M4J62k92j92J85J85r1k17K64p6J94l10J37L28p21
673c56N19K18n00K08p3q4R7J7j0m8k57L22J67k84k6Q6J93J20p7L9m17K88j01j7
697B4j97L24j22j14Q0k06J24K6j05R6M1J20J04l04r6L13q3j27K09j03j45J46j5
$$ plain form
720 -10 21 200 -255 -50 79 190 83 43 -214 54 117 -12 -42 -103 69 143 -141 267 19 57 268 112 75
743 75 -248 68 -60 -48 -15 108 -164 -196 -146 105 -139 105 189 34 169 178 30 -57 -34 -82 47 28 -137 -77 -178
768 -178 -86 -5 189 82 42 37 -180 22 -160 -57 -56 -252 -101 -86 149 -97 35 -139 486 -7 -66 82 -80
791 -80 218 -20 0 -138 127 153 -38 -103 -15 152 39 -111 28 98 127 -78 10 83 103 -283 169 147 49 -20 250
816 250 -110 -178 -5 120 -293 -386 -113 3 -145 65 70 167 125 -87 -49 44 -118 141 159 -234 12 -185 122
839 122 150 -7 -123 50 58 74 -207 19 0 -147 -152 77 47 240 -106 161 116 -236 -200 79 18 54 251 -137
863 -137 -125 -156 -33 -268 177 -15 151 -198 -33 131 190 -305 -43 -145 -115 -147 44 46 -8 -27 53 -12 67 -27 -59
888 -59 -155 -348 113 -128 -198 -51 207 72 -121 -148 -100 3 70 -69 -23 -74 386 185 133 129 -96 15 -223 -100
$$ packed form
720a0L1J79m55K05J29J11j07m0k57K68O3j29l0o1J72P4k84M08k48L8K11j56l7
743G5l23L16j28J2L3J23k72l2N0K51k44K44Q4j55J35Rj48q7K3m8J29j9j65O0j01
768a78R2Q1J94j07m0nk17K02j82J03Jj96J51J5K35k46J32j74O25m93n9J48j62
791h0K98k38K0j38K65K6j91o5Q8J67j13j50J39P0K9k05Q8P3K0l86M52k2r8o9K70
816B50l60o8J73J25m13r3K73J16j48K10NR7m2k12L8R3j62K59J8l93K46j97L07
839A22K8j57j16J73QJ6k81K26j9j47nK29l0J93l46K67m5l52L6K79o1L6J97l88
863a37J2l1J23k35M45j92J66l49J65J64N9m95K62j02L0l2J91Kn4j9Q0o5P9r4l2
888e9r6j93M61k41p0J47K58j35j93k7M8J03O7j39M6n1M60k01n2mk25J11k38J23
$$ plain form
912 -100 -98 10 203 77 -172 108 -269 -87 -35 34 -219 58 53 84 102 -240 -142 74 140 -107 -91 132 125 -90 266
937 266 217 128 72 142 107 43 -211 -91 242 -55 -66 26 -34 57 -126 -87 213 -23 -25 -63 -115 17 92 51 50 -253 33
964 33 -91 31 -181 72 141 178 91 144 -64 -9 64 140 -105 110 -274 -24 186 15 -112 -44 -146 -52 117 -26
988 -26 -50 -100 -87 -128 211 6 184 25 -121 -158 -55 244 91 60 -18 193 -105 -7 -70 -104 -29 -103 48 -47 45
1013 45 115 -150 -66 76 -222 -68 -9 -111 95 -64 6 201 -54 -310 -205 -147 120 -58 54 148 -87 -15 107
1036 107 0 81 -144 -73 -46 193 -207 -84 -5 -13 101 -209 -46 133 155 -228 -24 -4 17 24 23 -216 63 168
1060 168 -175 -24 180 214 -15 30 45 162 -215 201 199 -135 -70 121 -31 53 -49 214 28 -2 -103 -43 -144
1083 -144 135 236 36 209 177 180 -2 -173 32 -65 129 274 182 17 -20 -49 -36 -21 -213 -49 201 89 -145
$$ packed form
912a00KJ08J93j26k49K80l77J82N2O9k53K77nL1J8l42R8K16O6k47J6K23pk15L56
937B66m9q9n6P0l5o4k54J20L33k97j1R2o0R1j83L9L00k36kl8n2J32P5m1jl03K86
964C3j24J22k12K53O9L7q7N3k08N5P3P6k45K15l84K50K10j71j27O8j02R4J69j43
988b6k4n0J3m1L39k05J78j59j46l7J03K99j53l1p8K11k98R8o3l4P5p4J51r5R2
1013D5P0k65Q4J42k98J54N9j02K06j59P0J95k55k56J05N8K67j78J12R4k35P2J22
1036A07j07Q1k25P1K7K39m00J23P9qJ14l10J63J79K2l83K04K0K1Pjk39K79J05
1060A68l43J51K04L4k29M5J5J17l77M16kl34O5J91j52Q4j02K63j86l0j01O0j01
1083a44K79J01k00J73l2Lj82j71K05r7J94J45r2j65l7k9J3J5j92J64K50j12k34
$$ plain form
1106 -145 -130 -93 374 -25 -7 -131 -15 -7 -216 -179 -239 31 -181 106 259 163 -112 71 -118 93 -241 -140 9
1129 9 111 -387 69 -80 177 -111 138 -86 -214 133 -43 -45 128 98 24 -45 -255 34 23 -92 -95 331 -131
1152 -131 13 -256 -66 7 -116 81 68 312 90 -181 -5 -66 72 -172 -167 84 17 -168 -151 -104 243 -6 41
1175 41 284 42 122 -162 -137 35 196 -172 -44 -26 67 108 133 23 55 -161 -42 -342 165 -35 -95 141 233
1198 233 35 -12 -181 -55 87 -13 -127 -60 -25 -144 26 -84 94 39 90 -77 39 -72 -118 -308 150 -164
1220 -164 -111 -51 108 -343 64 34 313 10 -29 88 -133 44 -167 116 -37 -17 133 370 -136 343 17 13
1242 13 -313 208 11 219 -71 77 -354 -202 78 -30 34 92 -228 165 299 -16 89 9 -27 16 -181 -209
1264 -209 107 220 129 -8 -69 -93 -103 100 6 -105 33 25 212 -51 90 107 -63 -115 195 -15 16 184 81
$$ packed form
1106a45J5L7M67l99J8j24J16Qk09L7o0K70k12K87J53r6k75J83j89K11l34J01J49
1129IJ02m98M56j49K57k88K49k24j28L47j76kJ73l0p4o9k10K89j1j15lM26m62
1152a31J44k69J90P3j23J97j3K44k22k71J76o1J38k44NK51o7j85J7M7L47k49M7
1175D1K43k42Q0k84K5J72J61l68J28J8R3M1K5j10L2k16J19l00N07k00o0K36R2
1198B33j98m7j69J26J42j00j14O7L5j19J70j10J78n5N1j67J16j11m6j90M58l14
1220a64N3O0J59m51M07l0K79l03l9J17k21J77k11K83j53K0J50K37n06M79l26m
1242A3l26N21j97K08k90J48m31J52K80j08O4N8l20L93J34l15J05q0l6M3j97k8
1264b09L16J13r1j37o1k4j0K03r4j11J38qJ87k63J41J7j70n2L10k10L1J68j03
$$ plain form
1287 81 85 43 85 -13 -160 70 -171 -276 -233 -121 88 -192 -343 91 108 -181 -166 -175 112 78 0 124 -113 -62 -41
1312 -41 59 58 -46 244 -115 70 35 280 6 -28 -269 -166 72 -60 21 69 8 -23 213 -196 -151 58 166
1335 166 -1 -93 -19 239 -81 177 74 -39 -98 39 73 -149 -100 217 104 -98 74 -92 -204 -350 -263 17
1357 17 263 -69 51 172 -224 46 -270 98 -26 410 -66 -205 110 -130 164 -44 83 159 -52 -162 -111
1378 -111 232 66 -97 -223 -72 196 133 -157 399 -84 102 231 -22 -257 -70 33 -203 -44 249 2
1398 2 61 -162 -153 166 249 179 152 244 -112 -68 4 157 -195 166 18 -37 -35 -147 -76 180 365 134 -146 23 -107
1423 -107 -373 55 -163 316 194 -37 139 -4 8 13 66 -37 -144 31 121 73 52 64 -65 -415 33 362 -280
1446 -280 149 212 -138 162 41 136 -123 56 -12 173 -175 106 -23 -42 -104 -216 -158 62 122 22 -32 121 -101
$$ packed form
1287H1Mm2M2r8j47K30k41j05M3J12K09k80j51M34J7k89J5rK87l4p8J24k37N1K1
1312d1J00jj04K90l59J85l5K45k74l4k41J03K38j32Q1M8o1l1K36m09M5K09J08
1335A66j67r2P4K58l20K58j03j13n9J37L4k22M9L17j13k02J72j66j12j46Q7K80
1357A7K46l32J20J21l96K70l16L68j24M36m76j39L15k40K94k08J27P6k11j10N1
1378a11L43j66j63j26J51K68o3k90N56m83J86J29k53k35J87J03k36J59K93k47
1398BN9k23RL19Q3p0k7R2l56M4P2J53l52L61j48n5Kj12P1K56J85k31k80J69j30
1423a07k66M28k18M79j22k31J76j43J2NN3j03j07J75R0m8k1J2j29l50M48L29o42
1446b80M29O3l50L00j21R5k59J79o8J85l48K81j29j9o2j12N8K20O0j00n4J53k22
$$ plain form
1469 -101 -173 -133 -190 -165 145 -120 20 -24 369 -26 171 74 -25 -56 -87 63 40 -100 -107 33 -50 86 -92 44
1493 44 -1 -244 -205 -195 -316 94 149 -1 78 83 -105 8 346 293 2 -250 224 -130 163 9 228 -54 -8
1516 -8 -204 75 234 318 11 -231 46 145 223 189 -241 -111 2 -6 -122 -130 -20 -15 75 15 0 61 115 9 -278 -43
1542 -43 -47 -216 -117 119 -166 203 -11 176 16 -124 55 -56 279 -201 -24 -149 -62 -106 -97 128 -27 -255 -29
1565 -29 -18 247 -72 56 1 -87 12 85 -109 -112 -275 16 35 -117 -5 -104 -202 -110 -49 54 -65 -251 33 52 -12
1590 -12 33 8 182 109 -223 -164 -138 -29 18 325 -14 388 112 83 58 -136 66 175 54 -317 -147 -2 199
1613 199 138 163 137 32 44 213 142 -53 30 -105 138 157 20 40 3 -157 50 -127 105 -121 -183 -155 24 76
1637 76 6 53 84 -126 285 -188 -325 -102 -237 -126 -64 97 165 114 -38 58 36 -192 -268 261 -54 187 -158
$$ packed form
1469a01p2M0n7K5L10k65J40m4L93l95J97r7r9l1l1J50k3j40pJ40q3J36j78J36
1493D4m5k43L9J0j21M10N5j50P9Nj88J13L38n3k91k52M74l54K93j54K19k82M6
1516hj96K79J59Q4l07k42K77R9P8l4m30J30J13qj16qJ10NR0o0j5O1N4j06k87K35
1542d3mj69R9K36k85L69k14J87j60j40J79j11L35m80J77j25Q7m4RK25j55k28K26
1565b9J1K65l19J28n5q8R9P3j94lj63K91J9j52J12r9r8R2O1J03j19j86K84J9o4
1590a2M5k5J74p3l32N9K6J09M7L07l39M02k76k9k5j94K02J09j21l71J70J45K01
1613A99o1K5k6j05J2J69p1j95Q3j35K43J9j37K0l7j60K07j77K32k26o2K8J79N2
1637G6p0M7L1k10M11m73j37K23j35J11O2J61O8n1j52R6k2k28p6N29l15K41l45
$$ plain form
1660 -158 205 90 274 -200 110 172 56 40 -222 -26 43 209 -58 10 -51 22 -44 -127 -207 -162 -14 254 22
1683 22 26 -185 -77 -6 -265 46 17 57 -157 -212 53 40 -68 13 -163 27 94 -87 -9 -62 32 22 54 -64 -123
1708 -123 -108 13 103 -123 -37 45 -175 -72 295 249 54 -144 -25 -165 137 201 -21 171 -3 -265 -113 196
1730 196 53 101 41 72 137 205 -40 201 17 407 72 13 143 -58 -96 73 122 120 15 -15 -76 -31 -306 23
1754 23 27 43 -144 -215 -186 -33 33 -345 -67 -306 174 138 -150 -122 60 -182 331 46 83 -165 167 -9 25 -28
1778 -28 93 293 -39 4 157 174 -31 -245 152 -113 70 -70 -70 -12 122 -52 207 12 -110 -154 -30 -94 -94
1801 -94 143 -28 223 222 -184 -230 0 146 -161 -84 -73 63 160 57 -138 -169 37 104 88 143 152 178 136 -126 126
1826 126 177 249 34 -113 -42 -116 -135 -74 -157 112 -94 26 153 -25 118 28 37 175 -170 128 114 -102 -148 -201
$$ packed form
1660a58L63j15J84m74L10O2j16j6k62J96O9J66k67O8o1P3o6q3q0M5J48K68k32
1683B2Mk11J08P1k59L11k9M0k14n5K65j3j08Q1j76J90O7j81P8n3R4j0L2j18n9
1708a23J5J21R0k26Q6Q2k20J03L67m6j95j98J19j40L02O4k22J92j74k62J52L09
1730A96j43M8o0L1O5O8k45K41j84L90l35n9J30k01l8J69M9kj05l0o1M5k75L29
1754B3MJ6j87p1K9J53O6l78K78k39M80l6k88K8J82k42N13k85L7k48L32j76L4n3
1778b8J21K00l32M3J53J7k05k14L97k65J83j40%N8J34j74K59j95j22m4J24o4%
1801i4K37j71K51jm06m6K30J46l07P7J1J36R7j03j95l1K06O7j6N5RK6m2k62K52
1826A26N1P2k15j47P1p4j9O1q3K69k06J20J27j78J43r0RJ38l45K98j4k16m6n3
$$ plain form
1850 -201 196 20 160 29 121 415 221 -110 57 155 -201 -196 -110 -65 186 -91 287 -66 102 -101 300 34
1872 34 147 28 -242 27 -59 13 -202 -4 -71 251 187 90 222 88 72 -56 35 -342 -61 34 0 -97 -114 124
1896 124 -48 30 26 0 141 210 44 -247 -237 53 207 157 -102 48 -166 56 100 -342 -248 -38 153 -120 -132
1919 -132 -88 -280 154 12 -178 -179 -101 129 45 -314 62 191 -48 -36 101 -240 -51 100 -32 114 -141 20
1941 20 -115 -27 103 -34 -83 16 82 184 85 153 -27 225 -58 -138 -57 -81 11 137 123 -45 114 -88 52 -148
1965 -148 -191 54 -116 295 119 -168 -176 -20 -194 -154 173 -9 98 72 39 -104 38 -105 118 -350 98 142
1987 142 -29 -33 -48 -86 28 -58 -143 -291 74 -32 141 128 151 45 -84 -35 64 8 207 205 -37 283 79 -266
2011 -266 0 216 -62 -180 -138 -214 44 15 -8 78 -119 -14 240 21 114 313 -185 28 10 -16 61 60 -179 -270
$$ packed form
1850b01L97j76J40j31R2K94j94l31J67R8l56NQ6M5K51k77L78l53J68k03M01k66
1872C4J13j19k70K69q6P2k15J98o7L22o4r7J32j34j6j28R1l77K81R5l4r7j7K38
1896A24j72P8mk6J41O9j66k91J0K90J54n0k59J50k14K22M4m42R4K10J91k73j2
1919a32M4j92M34j42j90jP8K30q4l59L76J29k39J2J37l41J89J51j32J46k55J61
1941B0j35Q8J30j37m9R9O6J02r9O8j80K52k83q0Q1k4R2J26j4j68J59k02J40k00
1965a48m3K45j70M11j76k87qJ56j74M0L27j82J07k6l3j43J42j43K23m68M48M4
1987A42j71mj5l8J14q6q5j48L65j06J73j3K3j06j29M9R9n6J99kk42L20k04l45
2011b66K66K16k78j18M2p6K58k9k3Q6j97J05K54k19R3J99m98K13j8k6P7jk39r1
$$ plain form
2035 -270 27 -185 40 -304 158 -151 25 -99 4 -248 188 -37 189 74 -15 -293 137 81 11 -8 87 89
2057 89 -157 408 -110 173 36 -45 -35 241 -174 -98 261 -90 218 30 188 3 303 71 108 316 174 331
2079 331 -47 40 -187 140 274 43 -22 -127 164 114 -176 333 141 214 -39 -104 33 -29 -29 -10 28 67 -281 140
2103 140 286 240 -12 -70 79 -9 153 223 -139 55 146 -74 79 -191 -199 242 -3 -155 45 -86 152 13
2125 13 -60 163 -168 173 -13 14 46 57 258 42 64 104 -53 -74 -77 -111 75 -120 37 -217 138 44 -36 16 -33
2150 -33 183 90 -109 113 68 266 -55 -65 107 -45 72 -51 -159 -107 119 65 -303 -218 -40 61 -56 -154 2
2173 2 -38 -237 -72 -121 -105 -103 11 100 225 -272 -51 -52 -26 137 76 6 -154 167 217 -13 98 244 -228 41 41
2198 41 12 22 -222 60 61 -173 -157 -41 88 193 -105 -12 -157 -51 12 -114 -175 227 -36 114 -174 385 34
$$ packed form
2035b70K97k12K25l44M62l09J76j24J03k52M36k25K26j15q9k78M30n6p0j9R5K
2057H9k46N65n18K83j37q1J0K76m15P6L59l51L08j88J58j85L00k32L7K08j42J57
2079C31l78Q7k27L27J34k31o5j05K91n0k90N09j92P3k53o5J37o2%J9L8L9l48M21
2103A40J46m6k52n8J49q8J62P0l62J94R1k20J53k70qM41k45j52K00j31K38j39
2125A3p3K23l31L41j86K7L2J1K01k16K2M0j57k1ll4J86j95J57k54L55r4q0N2m9
2150c3K16r3j99K22m5J98l21j0J72j52J17j23j08N2K26n4l68Q5J78J01j17r8J56
2173Bm0j99J65m9J6KJ14Q9J25m97K21jK6J63o1p0j60L21N0k30J11J46m72K69%
2198D1k9J0k44K82Jk34J6J16J29J05k98R3j45J06O3j26o1M02k63J50k88N59l51
$$ plain form
2221 34 -235 -198 -53 106 20 146 147 249 23 -91 143 274 265 -117 -49 38 -36 63 4 242 126 0 -68 67
2245 67 -202 -83 -64 -250 -136 70 -145 -162 -235 -112 12 -47 -46 -236 92 -29 40 30 -108 -87 67 -32 -81 117
2269 117 8 -95 -89 -34 -188 -336 122 -2 -292 128 76 38 -169 57 162 -70 60 130 -77 -35 -141 -46 -195
2292 -195 -108 163 142 -138 -239 469 99 -133 35 -19 137 159 245 -219 94 -83 -18 -9 293 89 55 105 160 26
2316 26 81 -164 38 -100 -30 129 -96 98 -293 -55 71 54 -213 -223 -36 247 74 -122 357 79 7 -81
2338 -81 197 23 85 85 -216 75 -124 -120 235 13 -36 58 -138 -32 -126 233 145 76 -36 -113 -18 16 -215 154 -313
2363 -313 -134 -127 -129 70 139 -91 0 54 51 117 18 -159 94 54 73 164 49 -112 188 125 12 -62 -21 -182 3 162
2389 162 -44 178 166 -144 167 -60 117 -233 -6 202 -42 49 91 103 63 10 61 109 -140 145 3 37 -193
$$ packed form
2221C4k69L7J45J59q6J26JJ02k26j14K34J31rl82O8Q7p4R9n9K38j16j26o8J35
2245F7k69J19J9j86J14K06k15j7p3J23J24n9Jj90L28j21O9j0j38K1J54r9m9J98
2269A17j09j03ON5j54j48M58j24k90M20n2l8k07K26J05k32J30P0k07M2j06R5j49
2292a95Q7K71k1k80j01P08l70k32J68n4J56K2Q6m64L13j77O5RL02k04l4N0N5j34
2316B6N5k45K02j38P0J59k25J94l91K38J26j7k67j0J87K83j73j96M79k78p2q8
2338h1K78j74O2%l01K91j99ML55k22m9R4j96J06r4L59q8o9j12p7R5L4k31L69m67
2363c13J79PkJ99O9k30R1N4lO6r9j77K53m0J9R1j15j61L00o3j13p4M1j61J85J59
2389A62k06K22j2l10L11k27J77l50K27K08k44R1M2J2m0n3N1M8k49K85j42L4k30
$$ plain form
2412 -193 238 60 82 -31 154 -6 -153 -153 75 -71 -4 -12 295 -147 105 -161 -6 144 84 3 1 -297 33
2435 33 -58 -156 -3 92 -106 10 165 -4 41 132 -95 -44 -7 89 -33 -3 -207 -77 22 143 -88 177 -58 135
2459 135 13 -30 97 93 -44 -235 -64 -25 168 -96 179 -210 552 27 -7 185 3 78 -9 -16 -166 161 283
2482 283 93 -116 -110 132 -221 -13 -19 76 -166 67 162 -11 -73 80 -62 85 248 105 233 143 49 -173 341
2505 341 -171 174 -89 -212 -282 30 333 130 -21 -90 103 -121 121 -142 270 129 163 150 8 -140 -98 33
2527 33 -322 82 -170 -152 -82 -35 127 20 45 296 -146 204 -118 -242 231 -75 -93 -122 -25 -9 109 51 136 189
2551 189 -5 -20 -106 62 173 -113 -169 -160 22 -219 -288 -58 178 53 -113 -15 -18 227 52 -66 6 -140 195
2574 195 28 125 -21 -15 142 -157 186 22 -213 220 -283 93 -69 -26 -38 344 -46 165 -278 -269 -139 91
$$ packed form
2412a93M31j78K2j13J85j60j47%K28j46O7qL07m42K52k66J55J50o0q1kk98L30
2435C3r1r8J53R5j98J16J55j69M5R1k27N1L7R6j22L0k04J30R9J21k31K65k35J93
2459A35j22m3J27mj37j91J71L9J93k64K75l89P62n25l4J92j82P5q7pj50L27J22
2482B83j90k09OK42l53K08oR5k42K33R5j73o2J53j42J47J63j43J28r0r4k22N14
2505C41n12L45k63j23p0L12L03k03j51o9J93k24K42k63M12j41L4j3j42j48M2J31
2527C3l55M04k52J8P0M7J62j07K5K51m42L50l22j24M73l06j8k9R7J6J18n8Q5N3
2551A89j94j5q6J68J11k86n6RJ82k41o9K30K36j25j66R8lK45j75j18P2j46L35
2574A95j67R7j46OJ57k99L43j64k35M33n03L76j62M3j2L82l90K11m43RJ30K30
$$ plain form
2596 91 7 -167 -76 -208 -107 281 -199 -171 -38 5 144 -134 40 -115 -54 -113 68 -232 -192 -214 -78 -59 245
2619 245 -46 -38 115 136 148 295 56 -9 16 8 -41 -151 166 -28 48 105 142 -80 81 372 -38 154 123 308
2643 308 -84 -221 79 -231 -315 -46 -277 -214 116 15 304 19 -146 -144 232 -222 135 141 -207 143 -10 134
2665 134 116 -162 -51 145 168 219 4 -105 -86 -6 41 70 -93 42 -156 -274 17 51 -75 148 -83 214 -464
2688 -464 -118 -34 202 213 41 -104 59 -139 -202 -229 212 -253 102 125 -307 60 -80 -88 -210 115 -233 83
2710 83 -62 162 -38 -103 -16 431 30 167 -151 60 -133 -163 63 6 2 -206 -8 -85 -20 -198 -13 -120 -60
2733 -60 -43 -260 49 169 -63 -312 189 138 -13 -296 186 90 -20 17 -41 -251 -224 97 -66 -242 57 127 57
2756 57 -93 -216 26 136 75 -245 -50 -11 97 -176 359 11 99 85 232 -66 6 -107 -246 292 410 250
$$ packed form
2596I1q4j74R1j32J01L88m80K8J33M3J39k78J74j55O1n9J81l00M0k2J36J9L04
2619B45k91QJ53K1J2J47k39o5K5qm9j10L17j94P6N7L7k22J61K91m10J92l1J85
2643C08l92j37L00l10q4K69k31O3L30j01K89k85j65KL76m54L57Ol48L50j53J44
2665A34j8k78J11J96K3N1k15j09J9Q0M7K9j63J35j98j18K91L4j26K23k31K97o78
2688d64L46Q4K36J1j72j45J63j98o3k7M41m65L55K3m32L67j40qj22L25l48L16
2710H3j45K24k00o5Q7M47m01J37l18K11j93l0K26n7mk08J98p7O5j78J85j07O0
2733f0J7k17L09J20k32k49N01n1j51k83M82r6j10L7n8k10K7L21j63j76K99P0p0
2756E7j50j23K42J10o1l20J95L9J08k73N35l48Q8j4J47k98P2j13j39N38J18j60
$$ plain form
2778 250 -77 63 112 -61 -63 261 68 246 -63 -139 -21 69 -8 124 24 -35 -17 288 -130 268 -17 220 301
2801 301 -43 409 -168 115 145 -42 -49 -88 154 -3 -399 -154 -154 -113 -35 -125 -385 -204 110 -196 -86 -221 215
2824 215 -333 -56 50 108 -98 104 -99 20 35 93 85 -203 -103 110 153 -22 -11 -35 -139 142 99 -216 -14
2847 -14 144 -77 34 -5 102 -78 24 -166 -88 140 -38 214 10 -144 -119 -105 61 -26 161 39 -12 67 27
2870 27 50 15 -17 144 46 53 -4 -146 31 -13 -26 137 -56 -106 137 156 -70 -129 90 -32 -1 17 77 32 70 -246
2896 -246 73 82 -34 -87 137 20 50 -92 26 -29 -3 -214 -22 -252 -218 15 -83 255 83 -19 -49 -3 93 -58
2920 -58 165 -32 39 -239 -162 -19 121 173 -238 -10 -128 95 -114 128 8 74 356 -42 51 -17 44 65 -202
2943 -202 75 34 -88 -236 113 -8 84 -146 141 35 275 -163 -230 -30 106 -121 15 101 2 166 -131 -117
$$ packed form
2778B50l27J40M9j73kL24j93J78l09p6J18R0p7J32j00n9J8L05m18L98k85K37Q1
2801C01l44M52n77K83L0j87pl9K42j57l96K45%M1P8r0k60J81L14l06J10j35M36
2824B15n48K77J06N8k06K02k03J19J5N8qk88J00K13M3j75J1k4j04K81m3l15K02
2847a4J58k21J11l9J07j80J02j90P8K28j78K52k04j54K5J4J66q7J87j22n1P9m0
2870B7K3l5l2J61r8Pn7j42J77m4j3J63j93n0K43J9k26n9K19j22L1J8O0m5L8l16
2896b46L19Rj16n3K24j17L0j42J18n5K6k11J92k30L4K33r8L38j72j02l0M6R6j51
2920e8K23j97P1k78P7J43J40N2m11K28j18K23k09K42j20O6K82l98R3o8O1K1k67
2943b02K77m1j22j48L49j21R2k30K87j06K40m38o7K00J36k27J36Q6r9J64k97J4
$$ plain form
2965 -117 -155 79 -190 -45 71 92 47 -76 -167 -166 172 254 -44 -84 -4 198 -16 3 -76 -133 137 -185 396 -128
2989 -128 57 -173 -188 53 -10 193 143 -19 -5 -93 42 -227 -14 -128 98 -225 175 -84 137 -215 -94 -116
3011 -116 72 -90 -209 -165 -158 -275 134 82 -34 68 -316 -77 -106 -74 38 -248 178 70 -106 5 -98 104
3033 104 77 -113 -77 -21 225 78 54 239 -3 151 26 -175 152 144 -58 -53 77 165 -145 126 -53 -66 106
3056 106 -135 -38 -185 203 61 -74 -60 36 -45 -150 23 106 118 78 -165 6 -39 -57 135 16 0 282 -159
3079 -159 19 -154 -119 120 14 -15 86 -58 163 -146 -154 -155 281 83 -214 -152 43 -44 82 114 230 231 -177 -216
3103 -216 -72 -40 -120 -331 -65 -126 -215 -84 98 61 -125 205 112 267 -84 -193 21 -147 191 3 -18 -5 59
3126 59 -43 -153 -201 -82 150 -186 183 411 -89 61 129 51 -55 -165 165 -243 -112 -79 30 40 -183 29
$$ packed form
2965a17l8K34k69J45J16K1m5j23r1JL38Q2k98m0Q0K02k14J9p9n7K70l22N81n24
2989a28J85k30j5K41o3K03n0j62J4q8J35k69K13j14K26l23M00k59K21l52J21k2
3011a16J88j62j19M4Pj17M09n2j16J02l84K39k9L2J12k86M26j08j76J11j03K02
3033A04k7j90L6N6K46j47k4J85k42J54j25k01L27qk02NJ30Q8l10K71j79j3J72
3056A06k41R7j47L88j42j35J4R6q1j05J73Q3J2m0k43J71m5j8J92j19j6K82m41
3079a59J78j73L5K39j06k9J01j44K21l09qjM36j98k97O2J95q7J26L2J16Jm08l9
3103b16J44L2q0k11K66o1q9J31J82l7j86L30r3J55l51j09K14j68L38j88k1J3O4
3126E9j02j10m8J19K32l36L69K28n00J50O8p8j06j10L30m08J31L3J09J0k23K12
$$ plain form
3148 29 -21 174 -67 33 6 -141 61 -24 -161 -22 68 177 -43 83 55 130 -7 -49 -35 217 -217 -70 -44
3171 -44 46 -235 -267 -33 137 308 72 -41 -160 36 13 96 -325 252 -152 -44 -98 -331 57 111 135 -209 27
3194 27 -325 91 -2 111 -75 -5 -33 -91 186 80 -124 107 -58 2 -155 -130 51 39 232 116 -339 105 69
3217 69 -66 -43 -60 33 -164 -218 58 111 -166 164 53 20 -277 -134 71 87 -103 -37 -191 321 -19 -8 -106 -213
3241 -213 36 178 205 -23 11 -232 10 12 -42 233 -49 79 126 63 -91 79 -116 -204 -285 120 28 -265 -148
3264 -148 -69 64 70 -59 156 125 107 35 127 91 327 76 43 -109 -207 -133 -184 89 123 217 7 71 -6 -79 105 224
3290 224 115 -28 -55 -180 -18 122 76 101 56 192 109 249 86 -46 -338 -82 -54 -109 -109 -255 160 338 60
3313 60 -19 -80 315 129 3 -59 -118 -160 -4 -48 223 -19 59 63 -22 -134 96 -55 -160 166 90 -217 12 -72
$$ packed form
3148B9n0J95k41J00k7j47K02q5j37J39R0J09k20J26k8P5j37m2J4K52m34J47K6
3171d4R0k81l2K34J70J71k36j13j19J96k3Q3m21N77m04J08n4k33L88N4K4l44K36
3194B7l52M16r3J13j86P0k8n8K77j06k04K31j65O0j57K5J81j2J93j16m55M44l6
3217F9j35K3j7R3j97n4K76N3k77L30j11l3k97J43K05J6j90O6j54N12l40J1r8j07
3241b13K49J42K7k28L4k43K42Kn4K75k82J28M7o3j54J70j95q8q1M05r2k93J17
3264a48P9J33Oj29K15l1j8p2R2l6K36k51l3j52r8P4n1K73L4R4k10O4p7p3J84J19
3290B24j09j43k7j25J62J40m6K5m5J36q3J40j63j32k92K56K8n5%j46M15J78k78
3313F0p9o1L95j86j26o2n9m2J56m4K71k42P8Mq5j12K30j51j05L26p6l07K29q4
$$ plain form
3337 -72 148 140 13 -85 29 -121 -94 2 -111 177 12 -80 -20 -174 -81 311 38 -29 -239 85 85 -56 93 -40
3361 -40 58 229 40 20 -150 -265 -24 -18 -235 101 -19 126 -132 177 115 -149 -52 -12 129 219 49 -128 110
3384 110 -126 -44 -227 -185 -189 112 91 224 -73 -236 -43 -7 79 -13 -23 124 -105 94 -37 -112 166 102 -247 -147
3408 -147 -22 -60 158 197 322 -27 -118 113 141 178 55 287 82 145 -43 32 280 -37 223 151 42 40 -144
3431 -144 -105 -67 222 -210 3 107 103 164 156 44 -162 15 -201 -60 266 -189 -83 233 285 66 -21 -58 18 -172
3455 -172 23 87 159 36 -125 -14 -27 -385 -29 -259 -65 82 57 112 134 186 42 -122 108 -180 -133 125 206
3478 206 -56 -81 54 212 56 27 -21 -124 263 -194 182 294 5 -260 -57 -88 62 -38 -4 253 71 -130
3500 -130 102 -7 104 -243 -99 68 -279 38 139 -17 -158 263 -218 -45 -12 -35 -52 -19 -76 226 -106 -155
$$ packed form
3337g2K20qj27r8J14j50K7R6j13K88j65r2O0j54R3L92k73o7k10L24%j41J49j33
3361d0R8J71j89k0j70j15K41Ok17L36j20J45k58L09o2k64R7M0J41R0j70j77K38
3384A10k36Q2j83M2mL01k1J33k97j63J93L6Q6r2j0J47k29J99j31p5K78o4l49J00
3408a47J25l8K18L9J25l49r1K31K8L7j23K32k05O3j88P5K48l17K60p2j09kj84
3431a44L9L8K89m32K13J04mO1qj12k06J77k16J41L26m55J06L16N2k19q7l7P6j90
3455a72J95O4P2j23j61J11j3l58L56k30J94J47k5N5K2N2j44j64K30k88M7K58Q1
3478B06k62k5J35J58j56k9m8j03L87m57L76J12k89k65K03l1J50j00L4K57j82k01
3500a30K32j09J11l47J44J67l47L17J01j56j41M21m81J73L3k3j7L3n7L02l32m9
$$ plain form
3522 -155 92 -142 82 192 -61 -40 -57 -199 226 -9 89 319 -10 66 107 106 225 -182 -64 -38 -127 -64 24 -140
3546 -140 -122 33 -86 13 182 55 114 -107 -71 -118 -76 -18 77 -77 -97 -106 -396 146 112 -123 -127 88 56 119 -42
3571 -42 89 37 34 57 -210 86 109 -142 81 -50 -147 95 -82 110 -114 66 316 88 147 -25 15 -191 80
3594 80 104 121 -118 -63 -386 128 86 -234 -135 25 15 326 -28 -24 -125 -131 195 -86 -54 9 90 139 29 1 105
3619 105 -126 85 75 -174 127 67 -35 -132 -225 161 -27 -114 109 101 104 -33 16 -60 29 -155 -224 -241 99 113 75
3644 75 142 31 -76 -34 3 57 193 -8 -378 164 86 5 -263 75 17 21 -215 -80 245 212 46 -101 -68 207
3668 207 -301 119 244 170 131 70 -140 126 171 126 104 -116 -9 -120 -193 -82 -14 2 193 58 45 91 -478 196
3692 196 332 -29 9 -47 63 40 84 113 70 -214 -68 39 103 124 61 -11 4 81 -63 41 22 -135 42 -7 -67
$$ packed form
3522a55K47k34K24J10k53K1j7j42M25k35R8K30l29P6M1jJ19m07J18K6q9O3Q8j64
3546a40J8J55j19R9J69j27N9k21L6m7M2N8R5j54k0rk90N42l4k35mK15l2O3j61
3571d2J31n2lK3k67K96K3k51K23j31r7K42j77J92k24J80K50k28N9j72M0k06K71
3594H0K4J7k39N5l23N14m2l20R9J60j0L11l54Mj01oL26k81L2O3Q1M9j10k8J04
3619A05k31K11j0k49L01o0j02r7r3L86j88q7K23qLj37M9p6Q9j84o9j7L40J4l8
3644G5O7j11j07M2L7N4J36k01l70N42p8q1k68L38n8Mk36J35L25l3j66j47L3K75
3668B07n08M20J25p4l9o1k10K66M5m5k2k20J07j11p3J11O8J6J91j35j3M6n69O74
3692A96J36l61L8n6J10k3M4K9m3k84J46J07O4K1o3p2J5P7j44J04j9j57J77m9o0
$$ plain form
3717 -67 -192 22 -107 261 -29 -6 185 -127 -148 40 -91 -34 189 85 182 -169 22 152 182 82 -126 -232
3739 -232 132 115 13 -79 -24 10 267 22 148 -79 -95 63 -87 46 -1 -114 8 -62 141 282 -26 -81 23
3762 23 219 141 -29 -201 -343 -177 -50 84 -3 -227 -352 41 189 84 -66 152 -190 -128 103 -192 -317
3783 -317 279 89 -135 -9 -50 -55 55 -201 47 -85 -78 137 -111 -8 91 -137 -3 30 -42 65 -130 -102 -131
3806 -131 31 -319 -143 187 87 -89 127 -114 -167 128 -172 -15 115 -24 -64 -173 -256 3 -65 58 197
3827 197 301 -55 218 -272 192 -69 -61 89 186 -55 -15 -87 -39 6 52 -115 62 -17 73 77 221 84 -125 -61
3851 -61 -143 -275 -35 -239 62 -412 56 -139 -52 -104 53 81 -56 96 227 -6 49 -221 -274 134 -110 -149 13
3874 13 56 165 -32 -81 -41 202 -194 -49 92 11 30 115 -68 -284 163 -108 -59 158 -249 -302 -105 69 85
$$ packed form
3717f7j25K14j29L68k90K3J91l12k1J88j31N7K23j04R7l51J91J30L0j00k08j06
3739b32L64j7j02r2N5L4K57k45J26k27j6J58j50J33m7j13J22p0K03J41l08n5J04
3762B3J96p8j70j72j42J66J27J34q7k24j25L93J48j05j50K18l42O2K31k95j25
3783c17N96j90k24J26m1nJ10k56K48j32PK15k48J03R9k28J34L3p2J07j95K8k9
3806a31J62l50J76L30j00j76K16k41n3K95l00J57J30j39m0j09q3K59o8J23J39
3827A97J04l56K73m90M64k61QJ50R7k41M0p2M8M5M6j67J77p9R0MJ44j37k09O4
3851f1q2j32K40k04L01m74M68j95Q7n2J57K8j37J52J31k33N5k70n3M08k44l9J62
3874A3M3J09j97m9M0K43l96J45J41q1J9Q5j83k16M47k71M9K17m07n3J97J74J6
$$ plain form
3897 85 9 -228 80 -185 134 255 15 121 -354 15 -104 -30 -37 162 91 -233 328 -155 110 -189 129 -43
3919 -43 207 -189 -82 -33 11 58 -144 109 137 59 -119 -56 -155 -134 72 -101 -51 -47 -13 -155 72 -39 31 -7 -75
3944 -75 114 -125 140 65 40 -1 107 214 -385 45 169 56 -70 -32 144 -72 123 -215 105 68 -44 -370
3966 -370 14 231 151 -119 134 0 -11 48 184 10 17 -10 143 -123 -2 -160 80 133 133 -144 98 466 30
3989 30 71 48 -116 282 210 -85 73 -136 -61 43 7 -220 -4 230 42 -139 100 -108 211 -81 171 -151
4011 -151 84 -112 -88 -32 -45 -146 -4 114 304 184 49 42 -135 12 -79 -14 -144 35 208 -120 -36 278 43
4034 43 -308 -187 -166 -312 -190 322 -348 -41 24 14 -6 57 81 -17 139 43 38 63 -145 -9 63 -247 -159 -25 222
4059 222 17 52 -41 41 32 -225 137 208 -73 -241 -38 35 -103 40 164 -31 66 203 174 148 283 184 59 9
$$ packed form
3897H5p6k37L08k65L19J21k40J06m75L69j19P4pJ99p1l24N61m83K65k99L18j72
3919d3K50l96J07M9M4M7k02K53K8p8j78O3r9K1K06j73N0ML4j42K27j11P0l8o8
3944g5J89k39K65p5k5m1J08J07n99M30J24j13j26L8J76k16J95l38L20l7j12l26
3966c70L84K17q0k70K53j34j1N9J36j74Pk7J53k66J21j58K40N3%k77K42L68m36
3989C0M1k3j64L98p2k95J58k09P5J04l6k27K16K34j88j81K39k08L19k92K52l22
4011a51K35j96K4N6j3j01J42J18J90j20j35pj77J47r1O5j30J79J73l28Q4L14k35
4034D3l51J21K1j46J22N12o70L07O5j0k0O3K4r8J56r6nK5k08J36P2l10Q8J34K47
4059B22k05L5r3Q2rk57L62P1k81j68K03P3j38J43J24j95R7J37k9k6J35r9j25n0
$$ plain form
4083 9 -130 -95 -192 18 -97 -32 141 18 70 52 -47 -286 -287 170 178 -92 4 114 -265 101 20 96 -122 -35 54 -215
4109 -215 -103 170 -119 -214 155 -76 218 154 184 186 60 -298 154 -10 -9 89 -174 169 -113 215 -169 -155 -122
4132 -122 -166 50 343 -43 -157 26 85 191 -41 179 19 26 24 332 -81 191 -1 -47 -182 -194 -246 -95 174
4155 174 -33 32 85 -14 214 77 -107 340 40 -26 -316 -299 73 -54 -301 -58 5 255 -192 -258 85 -43
4177 -43 -45 131 -78 -280 162 -252 -75 199 92 205 135 -236 91 -145 -267 80 120 68 -66 160 -39 98
4199 98 -66 82 176 243 15 135 -60 2 -192 -11 -113 52 138 137 -105 -103 -6 -68 -167 206 126 94 35 -91 85
4224 85 110 102 27 -7 -28 -112 59 -153 -101 -105 185 -117 52 148 -423 -4 -219 -102 254 -109 197 -38 -46 -5 -57
4249 -57 -209 -172 -3 385 141 -162 -31 40 -198 193 -68 147 -204 -214 159 29 -62 -75 -158 19 -216 -107
$$ packed form
4083Ij39L5r7K10j15O5J73j23N2j8r9k39jM57Qk70R6J10l79L66q1P6k18Q7Q9k69
4109b15J12K73k89r5L69k31K94o4L0Kj26l58M52j64JR8k63L43k82L28l84J4L3
4132a22m4K16K93l86j14J83N9J06k32K20j60PkL08m13K72j92m6j35j2n2J51K69
4155A74k07O5N3r9K28j37j84M47l00o6k90J7L72j27k47K43O3K50m47o6L43j28
4177d3kJ76k09k02M42m14J77K74j07J13p0l71L27k36j22L47M0n2j34K26j99J37
4199I8j64J48R4O7k28J20j95O2j94J81j02J65Q6jk42KR7o2r9L73q0l2n9j26J76
4224H5K5qp5l4k1q4J71k12N2mK90l02J69R6n71M19k15J17L56l63L06k35qM1n2
4249e7j52L7J69L88k44l03J31P1k38L91k61K15l51j0L73j30r1j3q3J77k35J09
$$ plain form
4271 -107 -18 235 -2 70 161 -40 176 -109 88 -39 102 159 103 125 363 -54 -209 -5 -283 -125 -149 -50 114
4294 114 -206 -260 -35 99 -160 105 -63 169 -82 41 -2 43 -108 38 82 -155 88 223 -45 -17 -259 -42
4316 -42 88 -264 17 424 52 -77 -96 -81 -8 44 28 -62 5 -113 138 -12 73 -34 -21 14 18 -160 62 -1 -88
4341 -88 8 -163 -11 -49 -260 200 -109 97 -27 159 -61 -78 144 47 -131 74 -178 -99 -162 -36 1 -43 -363
4364 -363 59 -259 202 126 93 33 -55 -25 -88 -102 132 -83 -141 188 66 -163 -143 -231 -30 141 -297 220 -26
4387 -26 201 63 147 167 -192 -76 -54 -97 185 -64 92 -231 -164 133 15 90 -30 -184 -2 -83 -146 -3 129
4410 129 -138 -99 -118 -1 253 -64 -212 -170 69 72 7 -83 -160 33 112 5 94 12 43 -86 102 -105 -49 -42 222
4435 222 50 66 58 -34 71 -143 22 16 124 174 437 -88 213 24 62 -94 190 -63 -28 -134 -204 -12 -114
$$ packed form
4271a07Q9K53k37P2R1k01K16k85J97j27J41N7n6K2K38m17j55K04k78J58k4R9J64
4294A14l20n4K25J34k59K65j68K32k51J23m3M5j51J46M4k37K43J35k68K8k42K17
4316d2J30l52K81M07l72j29j9J5P3N2j6r0O7j18K51j50Q5j07J3L5Mj78K22o3q7
4341h8R6j71J52l8k11M60l09K06j24J86k20j7K22r7j78K05k52P9o3J26L7m4l20
4364c63M22l18M61p6l3o0q8L0o3j4K34k15n8L29j22k29K0q8K01J71m38N17k46
4387b6K27j38Q4K0l59J16K2m3K82k49J56l23O7K97j18P5j20j54J82q1o3J43J32
4410A29k67L9j9J17K54l17j48M2K39Lo5r0p7J93P9j07Q9q2L1j29J88k07N6PK64
4435B22j72J6qr2J05k14J65oJ08N0K63n25L01j89L8j56K84k53L5j06p0J92j02
$$ plain form
4458 -114 -125 -16 -107 127 126 -165 121 -85 -11 108 -48 -27 -124 -153 143 126 125 209 -162 246 36 12 134 35 21
$$ packed form
4458a14j1J09r1K34jk91K86k06P4J19j56K1r7k9K96j7jQ4l71M08k10k4J22r9j4
$$ [...]
8191A93
##END NTUPLES=NMR FID
##END=
