##TITLE=1H_DE-107k_TFA
 200.13MHz, CDCl3,
 8 sc
 
 3.9.2025
##JCAMPDX= 6.0         $$ Bruker NMR JCAMP-DX V2.0
##DATA TYPE= NMR FID
##DATA CLASS= NTUPLES
##ORIGIN= UXNMR, Bruker Analytische Messtechnik GmbH
##OWNER= pz
$$ XWIN-NMR		Version 3.5
$$ Wed Sep  3 14:28:05 2025 Russian Standard Time (UT+4h)  she@DPX200
##.OBSERVE FREQUENCY= 200.1313
##.OBSERVE NUCLEUS= ^1H
##.DELAY= (6, 6)
##.ACQUISITION MODE= SIMULTANEOUS
##.ACQUISITION SCHEME= undefined
##.AVERAGES= 8
##.DIGITISER RES= 18
##SPECTROMETER/DATA SYSTEM= spect
##.PULSE SEQUENCE= zg30
##.SOLVENT NAME= CDCl3
##.SHIFT REFERENCE= (INTERNAL, CDCl3, 0, 14.3821)
##AUDIT TRAIL= $$ (NUMBER, WHEN, WHO, WHERE, WHAT)
$$ ##TITLE= Audit trail, XWIN-NMR		Version 3.5
$$ ##JCAMPDX= 5.01
$$ ##ORIGIN= Bruker BioSpin GmbH
$$ ##OWNER= she
$$ F:/spectra/data/she/nmr/H-C/1/audita.txt
$$ ##AUDIT TRAIL=  $$ (NUMBER, WHEN, WHO, WHERE, WHAT)
(   1,<2025-09-03 14:26:56.59 +0400>,<she>,<DPX200>,
      <created by zg, POWCHK disabled, PULCHK disabled
       configuration hash MD5:
       00 E9 B6 7A A2 85 ED C7 34 08 36 98 17 FE 4E 26
       data hash MD5: 16K
       4F FC FA F7 55 D9 51 8A 16 BA 1F B5 FE 06 72 75>)
$$ ##END=
$$ 
$$ hash MD5
$$ 87 E1 97 8E EB E4 7D 44 06 05 E0 CD BC CB 5C 52
##$RELAX= 
##$RELAX= 
##$RELAX= 
##$RELAX= 
##$RELAX= 
##$RELAX= 
$$ Bruker specific parameters
$$ --------------------------
##$DU= <F:/spectra>
##$EXPNO= 1
##$NAME= <H-C>
##$PROCNO= 1
##$TYPE= <nmr>
##$USER= <she>
##$AMP= (0..31)
100 100 100 100 100 100 100 100 100 100 100 100 100 100 100 100 100 100 
100 100 100 100 100 100 100 100 100 100 100 100 100 100 
##$AQSEQ= 0
##$AQ_mod= 1
##$AUNM= <au_zg>
##$AUTOPOS= <>
##$BF1= 200.13
##$BF2= 200.13
##$BF3= 200.13
##$BF4= 200.13
##$BF5= 200.13
##$BF6= 200.13
##$BF7= 200.13
##$BF8= 200.13
##$BYTORDA= 1
##$CFDGTYP= 0
##$CFRGTYP= 5
##$CHEMSTR= <none>
##$CNST= (0..31)
1 1 145 1 1 1 1 1 1 1 1 1 1 1 1 1 1 1 1 1 1 1 1 1 1 1 1 1 1 1 1 1 
##$CPDPRG= <>
##$CPDPRG1= <>
##$CPDPRG2= <>
##$CPDPRG3= <>
##$CPDPRG4= <mlev>
##$CPDPRG5= <mlev>
##$CPDPRG6= <mlev>
##$CPDPRG7= <mlev>
##$CPDPRG8= <mlev>
##$CPDPRGB= <>
##$CPDPRGT= <>
##$D= (0..31)
0 0.7 0 0 0 0 0 0 0 0 0 0.03 0 0 0 0 0 0 0 0 0 0 0 0 0 0 0 0 0 0 0 0 
##$DATE= 1756895216
##$DBL= (0..7)
120 120 120 120 120 120 120 120 
##$DBP= (0..7)
150 150 150 150 150 150 150 150 
##$DBP07= 0
##$DBPNAM0= <>
##$DBPNAM1= <>
##$DBPNAM2= <>
##$DBPNAM3= <>
##$DBPNAM4= <>
##$DBPNAM5= <>
##$DBPNAM6= <>
##$DBPNAM7= <>
##$DBPOAL= (0..7)
0.5 0.5 0.5 0.5 0.5 0.5 0.5 0.5 
##$DBPOFFS= (0..7)
0 0 0 0 0 0 0 0 
##$DE= 6
##$DECBNUC= <off>
##$DECIM= 32
##$DECNUC= <off>
##$DECSTAT= 4
##$DIGMOD= 1
##$DIGTYP= 9
##$DL= (0..7)
0 120 120 120 120 120 120 120 
##$DP= (0..7)
150 150 150 150 150 150 150 150 
##$DP07= 0
##$DPNAME0= <>
##$DPNAME1= <>
##$DPNAME2= <>
##$DPNAME3= <>
##$DPNAME4= <>
##$DPNAME5= <>
##$DPNAME6= <>
##$DPNAME7= <>
##$DPOAL= (0..7)
0.5 0.5 0.5 0.5 0.5 0.5 0.5 0.5 
##$DPOFFS= (0..7)
0 0 0 0 0 0 0 0 
##$DQDMODE= 0
##$DR= 18
##$DS= 0
##$DSLIST= <SSSSSSSSSSSSSSS>
$$ [...]
##$SUBNAM0= <"">
##$SUBNAM1= <"">
##$SUBNAM2= <"">
##$SUBNAM3= <"">
##$SUBNAM4= <"">
##$SUBNAM5= <"">
##$SUBNAM6= <"">
##$SUBNAM7= <"">
##$SUBNAM8= <"">
##$SUBNAM9= <"">
##$SW= 18.0517328524113
##$SWIBOX= (0..15)
0 0 2 0 0 0 0 0 0 0 0 0 0 0 0 0 
##$SW_h= 3612.71676300578
##$TD= 16384
##$TD0= 1
##$TE= 0
##$TE2= 300
##$TE3= 300
##$TEG= 300
##$TL= (0..7)
0 120 120 120 120 120 120 120 
##$TP= (0..7)
150 150 150 150 150 150 150 150 
##$TP07= 0
##$TPNAME0= <>
##$TPNAME1= <>
##$TPNAME2= <>
##$TPNAME3= <>
##$TPNAME4= <>
##$TPNAME5= <>
##$TPNAME6= <>
##$TPNAME7= <>
##$TPOAL= (0..7)
0.5 0.5 0.5 0.5 0.5 0.5 0.5 0.5 
##$TPOFFS= (0..7)
0 0 0 0 0 0 0 0 
##$TUNHIN= 0
##$TUNHOUT= 0
##$TUNXOUT= 0
##$USERA1= <user>
##$USERA2= <user>
##$USERA3= <user>
##$USERA4= <user>
##$USERA5= <user>
##$V9= 5
##$VALIST= <valist>
##$VCLIST= <CCCCCCCCCCCCCCC>
##$VD= 0
##$VDLIST= <DDDDDDDDDDDDDDD>
##$VPLIST= <PPPPPPPPPPPPPPP>
##$VTLIST= <TTTTTTTTTTTTTTT>
##$WBST= 1024
##$WBSW= 4
##$XGAIN= (0..3)
0 0 0 0 
##$XL= 0
##$YL= 0
##$YMAX_a= 178725
##$YMIN_a= -211352
##$ZGOPTNS= <>
##$ZL1= 120
##$ZL2= 120
##$ZL3= 120
##$ZL4= 120
##$ABSF1= 10
##$ABSF2= 0
##$ABSG= 5
##$ABSL= 3
##$ALPHA= 0
##$AQORDER= 0
##$ASSFAC= 0
##$ASSFACI= 0
##$ASSFACX= 0
##$ASSWID= 0
##$AUNMP= <proc_1d>
##$AZFE= 0.1
##$AZFW= 0.1
##$BCFW= 1
##$BC_mod= 2
##$BYTORDP= 1
##$COROFFS= 0
##$CY= -3
##$DATMOD= 1
##$DC= 2
##$DFILT= <>
##$DTYPP= 0
##$F1P= 0
##$F2P= 0
##$FCOR= 0.5
##$FTSIZE= 0
##$FT_mod= 4
##$GAMMA= 1
##$GB= 0.15
##$INTBC= 1
##$INTSCL= 1
##$ISEN= 128
##$LB= 0.25
##$LEV0= 0
##$LPBIN= 0
##$MAXI= 10000
##$MC2= 0
##$MEAN= 0
##$ME_mod= 0
##$MI= 1.114404
##$NCOEF= 0
##$NC_proc= 0
##$NLEV= 6
##$NOISF1= 3.799351
##$NOISF2= 2.8
##$NSP= 1
##$NTH_PI= 0
##$NZP= 0
##$OFFSET= 14.38212
##$PC= 1
##$PHC0= -1562.062
##$PHC1= 11.99228
##$PH_mod= 1
##$PKNL= yes
##$PPARMOD= 0
##$PSCAL= 0
##$PSIGN= 0
##$REVERSE= no
##$SF= 200.129724274929
##$SI= 16384
##$SIGF1= 3
##$SIGF2= 2
##$SINO= 400
##$SIOLD= 16384
##$SREGLST= <1H.CDCl3>
##$SSB= 0
##$STSI= 0
##$STSR= 0
##$SW_p= 3205.1282051282
##$SYMM= 0
##$S_DEV= 0
##$TDeff= 0
##$TDoff= 0
##$TI= <>
##$TILT= no
##$TM1= 0
##$TM2= 0
##$TOPLEV= 0
##$USERP1= <user>
##$USERP2= <user>
##$USERP3= <user>
##$USERP4= <user>
##$USERP5= <user>
##$WDW= 1
##$XDIM= 8192
##$YMAX_p= 0
##$YMIN_p= 0
$$ End of Bruker specific parameters
$$ ---------------------------------
##NTUPLES= NMR FID
##VAR_NAME=  TIME,          FID/REAL,        FID/IMAG
##SYMBOL=    X,             R,               I
##VAR_TYPE=  INDEPENDENT,   DEPENDENT,       DEPENDENT
##VAR_FORM=  AFFN,          ASDF,            ASDF
##VAR_DIM=   8192,          8192,            8192
##UNITS=     SECONDS,       ARBITRARY UNITS, ARBITRARY UNITS
##FACTOR=    0.0002768,     1,               1
##FIRST=     0,             0,               0
##LAST=      2.2672688,     0,               0
##MIN=       0,             -211352,         0
##MAX=       2.2672688,     178725,          0
$$ Real data points
##PAGE= N=1
##DATA TABLE= (X++(R..R)), XYDATA
$$ [...]
1952F26n16M24N21k91j407r8N52R4j073o72M81R94j51k40J54J270P86J39o98J97
1972A092O34l53r66p06J47j96p74o89l8P85P96k29k02J390J095j15o76J3M18J5
1992A441j392o44J29k0k3r75L50Q93L50l43l11N61J008j81n86J9M16L15m29q01
2012b23j01P11l01m90j94J29N12o57m79K52Q04M31n14k42R39Q15m1r86P1N07J38
2033A081r86j105J77M32o53o30K39P85P71k15L52P72O59k46n07m69L84j7j042
2052b18j051j01P30k41p31L5J093R02J08o32M95J085j78r32k62K99M79o37j008
2071g65k1M84K72n77l92K98K90K87m82Q8L57O58o3p63M88J361m46m98j24O2J76
2092F90p11j093j74L35K82o02j36R22R84Nk24L92N71M75n82o95J46j02l26r25
$$ y = [626, 110, 534, 1055, 764, -643, -741, -189, -95, -1168, -1840, -1359, -365, -516, -756, -602, 668, 1454, 1593, 895, 1092, 1726, 1373, 407, -299, -152, -348, -1122, -1811, -1849, -1064, -268, -497, -699, 691, 1786, 1671, 995, 1008, 1426, 1441, 49, -595, -466, -486, -509, -1484, -1134, -241, 109, -234, -545, 16, 1024, 843, 257, 276, 692, 1007, 578, -223, -324, 387, 86, -404, -598, -469, 43, -614, -1093, -841, -37, 394, -120, -362, 577, 1392, 1351, 365, 436, 943, 1081, 95, -1010, -833, -401, -1054, -1684, -1445, -660, 111, -104, 248, 1020, 1679, 1433, 926, 457, 841, 824, -218, -1269, -1370, -640, -881, -1612, -1577, -484, 418, 526, -106, 389, 1474, 1296, 364, 102, 401, 880, 243, -765, -786, -302, -30, -607, -999, -701, -411, -124, -606, -518, -161, 497, 434, -329, 159, 1520, 1074, 576, 452, 514, 690, -21, -1114, -1288, -953, -671, -1273, -1409, -487, 497, 502, 278, 670, 1241, 1716, 1134, 439, 585, 483, 157, -768]
2112g68l52K33K56o31j5P51N96L11j77J77P36M12o17r17J18N41l12p76l03M65
2132b72J06j51n77M14L90J78l06o6J50P99Kq01L31O31J47o48o43K74L52m34q19
2153i43n9L3M34j89l00O92Q58p1j85N55M62jn16o81k5M7o78o56j19M88K69k26
2175h11k37R66M30N79m41N2N05K71p77l22l29J95J00j082k19M63M58J23m09M9
2195d36Q05O0j78l49M61N07J21q87J44L69o2k59q06R4L49j96r55P8L45N34m03
2216f64m0P47O55Q1R1l21N04K62p95m03k95M4m5r00m90P80K75k04K75J65Q73O35
2238A230o86O3K52M66m68o82m67K39j4o51l86M91J39J27l60N5P72M42k40l15J88
2259A95N05j37o17k22M82K21l50n30J23M15l03l88m95N75N65K8l31P7P29L08k08
$$ y = [-768, -1120, -887, -631, -1262, -1277, -526, 70, 381, 204, 381, 1117, 1529, 912, -5, 113, 654, 342, -434, -737, -272, -166, -317, -894, -480, -90, 88, -218, -284, -134, 665, 667, -134, 197, 828, 975, 327, -316, -42, 310, -124, -943, -1002, -969, -535, -724, -1024, -332, 526, 455, 270, 825, 1287, 1286, 770, 89, 64, 111, -567, -1223, -1342, -854, -585, -811, -1048, -82, 348, 927, 486, 538, 1043, 1314, 537, 215, -114, 81, 181, -901, -1120, -657, -199, -76, -485, -436, 369, 429, 251, -98, 363, 870, 991, 104, 248, 617, 555, 296, -510, -416, -67, -263, -1218, -1140, -795, -261, -664, -704, 43, 698, 779, 870, 549, 1053, 1315, 520, 117, -178, -134, -179, -1079, -1569, -789, -514, -718, -443, -278, 595, 1230, 544, 607, 859, 1325, 857, 175, -292, -53, -67, -718, -1104, -613, -474, -347, -707, -652, 120, 562, 322, 7, 195, 700, 563, -54, -276, 206, 427, 77, -453, -330, 85, -218, -606, -1101, -526, 39, 67, -264, -187, 542, 850, 642]
2280F42j76J26Q4k2q05k29j57J83q5l26K04N05j52k89K11O84J078o76k42N3J99
2301H10k67p07l75K49J88o89m34L64M81N67k89mO09L27o4o08Q4P13m97n69k89
2322d00j0L61j79m45O8L30J66l86J69K5N81J91k77j69L78L16k61p4JK84m09n18
2344b58n48k7N48o19m1R2M78O37l12l2Q30K90j15l04k03o0K53p01n43j7K97Q2
2366b73r36K64N15N20lQ5l2O67k4k94r4k33J11j94l57j41L16r6l86j65M58J91
2388a01j40r8J28N19K75l19l46N11J49R2l21j89N9J44o64m43M4O34j63n38j50
2409i17Q74j1J26j1O10J71O9l95l32L41j95k18o28l13J22N60o32k8O02N30K6m9
2431C02M6L09O06p54k73k60J91o3p03M0L26J48m02J83j15L94L91l97J64M46j83
$$ y = [642, 466, 592, 676, 654, -151, -380, -537, -354, -439, -765, -561, -56, -208, -497, -286, 398, 1476, 800, 558, 611, 810, 543, -164, -539, -290, -102, -791, -1225, -861, -380, 187, -102, -106, 503, 830, 766, 158, 242, 955, 458, -111, -400, -410, -49, -228, -673, -605, -275, -109, -495, -326, -301, 280, 471, 194, 25, 403, 719, 458, 384, 385, 669, 260, -258, -806, -833, -285, -904, -945, -853, -375, 262, -50, -82, 748, 1038, 923, 619, 416, 356, 609, -92, -635, -652, -355, -273, -1209, -945, -430, 90, 87, 172, 140, 807, 783, 489, 395, 162, 273, 79, -278, -419, -103, -199, -585, -750, -292, -101, -241, -339, -211, 308, 583, 264, -82, 429, 578, 670, 349, 160, 219, 363, -301, -744, -700, -66, -229, -767, -917, -43, -54, 72, 61, 671, 842, 911, 516, 184, 525, 330, 112, -516, -829, -707, -147, -779, -807, -205, 325, 351, 302, 348, 657, 1263, 509, 236, -24, 167, 104, -599, -559, -233, -85, -487, -304, -419, -25, 366, -31, 133, 579, 396]
2452C96j66j30J57J07j7n06Jj08K61k59j38o8M86j50k32J29J06O57n2l97L23L00
2474G00O6k04p10R2n2j22o03J31O3K12q4k44P84K75L93n05N12R5q0k72n28J85
2496A04j40K44o75k27P6L12M8r0K45L51k9k10K17L71j15om34J75mj64j24k62K8
2519c09J90m3l70kO16J13k27k52J96L81L87l31o6L16K1m12l50J75m7k09n11k17
2541i51M44J34j38J7L50N27L78j72j68m7J39K3n54k81J89j17l62k60K98L62K05
2562A6m58J26P02m9J50m28J98K31j17l15n86N03K58n03o1nL20r5l86J13L54K73
2584B41l36J5j20O69j19p5j55L18j55k42k34k13J97j92j09n0R3M57k68K56m2N82
2606E18L18l30j26L42m22k0l12k89o1p1m2q9J51K61Q3J17K46J06K16k28J08j60
$$ y = [396, 230, 100, 257, 364, 347, -159, -158, -266, -5, -264, -402, -470, 16, -134, -366, -237, -131, 526, 474, 77, 400, 700, 766, 562, -148, -56, -108, -230, -833, -702, -639, -427, -511, -755, 29, 304, 697, 192, 704, 799, 719, 447, -81, 104, -36, 208, -467, -694, -618, -306, -258, -348, -103, 248, 219, 9, 226, 597, 482, 476, 42, 217, 213, 49, -75, -337, -309, -119, -162, -532, -534, 82, 195, -32, -284, -88, 293, 680, 349, 283, 599, 620, 208, -142, 33, -14, -223, -734, -951, -507, -373, -511, -494, -144, 383, 761, 589, 421, 374, 513, 536, -18, -299, -110, -227, -589, -849, -551, -189, 16, -442, -316, 386, 337, 487, 59, 257, 488, 371, 56, -530, -27, 231, -272, -333, -338, -18, -113, -499, -386, -32, 241, -95, -80, -200, 469, 350, 275, 120, 438, 283, 41, -193, -406, -209, -401, -510, -560, -467, -10, -278, -22, -64, 518, 836, 506, 380, 722, 300, 280, -32, -321, -382, -453, -495, -584, -433, -172, -89, 28, 274, 380, 596, 368, 476, 316]
2628C16K86l7p82j51J07lL9j80m3L97N4l12Q4J13N34L1m89K73J65Mj83j61M2K35
2652C39l67l01j87q6L98k8l48M74j45M84k47M88M4K51l09k31LN8K6l17n50O3J98
2675b90j41l02M21K90J32j21Q4J18K48k6r5j10j53J77n26J38j76M1J69m68J9M86
2697h5jJ39j91k1L44L60m54J25J12J11k36n1l03K01k11j8k97j87L34k30J16R2
2719c51K55L80qj66K15L66l67n3m54J46K13j98m21L20j23j69o8j8M17J01J58L61
2741E36M4j09r7n1m90K13k74n9k9k76R4K42j63J70M22k24L18l93L51M85k22j48
2763C40k99L99j22j18m11m2L77j12j50l40K18K33J76m19J18L66K43J4k81J18L12
2784F20k79k68j68J40l35r6q2O4k4k5R6k27N71K17J18n8J46J53j1k16m60M02l37
$$ y = [316, 602, 565, -217, -368, -261, -264, -225, -405, -448, -51, 3, -309, -225, -112, 422, 453, -36, 237, 402, 406, 223, 62, 104, 339, -28, -329, -516, -602, -204, -232, -580, -106, -251, 233, -14, 474, 518, 769, 460, 229, 232, 290, 316, -1, -551, -488, -290, -431, -733, -312, -22, 110, -11, 73, 191, 439, 413, 318, 208, 55, 232, -294, -156, -332, -291, -122, -590, -571, -85, -86, 53, -138, -159, 185, 545, 91, 216, 328, 439, 203, 152, -151, 50, -161, -179, -476, -663, -329, -559, -443, -351, -96, 284, 276, 110, 325, 691, 324, 271, -183, -37, 176, -22, -443, -123, -246, -415, -483, -501, -84, 17, 175, 536, 580, 471, 374, 323, -167, 46, -228, -287, -316, -592, -498, -256, -419, -249, 173, -51, 267, -126, 225, 710, 488, 340, 41, 440, 318, 200, -211, -253, 124, 12, -138, -478, -260, -27, 149, -270, -152, 214, 457, 471, 190, 308, 620, 341, 73, -95, 45, -290, -386, -468, -404, -428, -453, -357, -584, -13, 204, 322, 264, 410, 563, 552, 336, -124, 278, -59]
2807e9l8j96k21K38O0j79p4K90L22K07j35k27N32j02k85J78l12L27l96k52J93
2828a29j83J06K40k94k57M62J06r0k05M11k21N15l23l2K03J31n47j4J57K7l03
2849b40j95p5M52k02k00l3N80P0j78Q9J55K16p8k04j92j50J86P1n39K49j2K08
2871b2o2J82j70R2M19k49q0LL64n50J52q1k32K09j74L03l61J45J97l22L67j51
2893b1K45j76J81L2j27J51r3k95K08l8m28K47j19J1k46MJ80J01K75k64M18k17
2915B9M12K43n34J77K5M7l01l35N8j03L9k07Ok02M28J54J21m0J81K42M8j72p1
2938B45j20J33M4l41j07L64n96M0Q0n6K74n3m2J99O8J82m15N25j41o9j38p0K80
2961B86k86r6j08J64k46o1l3O2J69K01k21mK43K66j72j6k5K49l1j22n13K8J40
$$ y = [-59, -97, -293, -514, -276, -216, -395, -469, -179, 143, 350, 215, -12, 520, 418, 133, 311, -1, 326, -70, -322, -129, -312, -206, 34, -260, -517, -55, 51, -39, -244, 167, -54, 461, 138, 106, 309, 440, -107, -121, 36, 63, -240, -435, -510, -58, -260, -460, -493, 87, 157, -21, 68, 223, 439, 361, 157, -35, -185, 1, 72, -467, -218, -230, -22, -84, 98, -72, 20, 439, 190, 110, 113, 477, -73, 79, -2, -234, -25, -199, 104, -257, -112, 85, -237, 130, -21, 224, 48, 229, 261, 134, 285, 192, -103, 105, 67, -361, -114, -233, -222, -468, -464, -284, -183, 92, -172, 246, 29, 441, 684, 150, 327, 352, 399, 98, -237, -179, -282, -243, -450, -444, -646, -218, -64, 57, 17, 198, 440, 488, 316, 245, 125, 258, 302, -39, -146, 218, -378, -338, -258, -314, -40, -93, -135, 64, 132, 314, -101, 424, 283, 214, 76, 6, 286, 0, -96, -204, -40, -286, -347, -380, -318, -149, 52, -169, -173, 70, 336, 164, 148, 123, 372, 341, 219, -294, -266, -126]
2984a26N4k07j78M10j17J43p3mL04R2K03k30j29K19l80j89k04K44o3o0R0p4K91
3007A6j6l3K18r5J52Qk57P8O3J14m09O1J08l25M42l51J27r5K45j04l84M93M3q
3031I1j32K6j63M37j15m3O5j86j19j39R9k12J75M0LQ6R4J41K67m68L24L5j36N0
3055B20q9L2m06Q0m78K09K11kq7Q4L43k6M8j77R7K54j6l66K76N9J38n42k4r5j15
3080c72M22j28k30k7J04j10K53O6L60K76n74K90m52M80j31j43j5k94Q0J81l26
3101b90m5k78N55j66j6L01J5J20k19N30jp1m10J83k74J06j90l23J26K11K35k33
3123a34r6L92K52l31Nn0J95n6m18J92Q5J33l31J49J89r6N1l98J50P6l1J14Pj85
3147a36J04J82k18r5j47N37K7k19Kj01K17k12K9m35L55k3J35k49M02j8p5n7L08
$$ y = [-126, -72, -279, -457, -47, -164, -21, -94, -98, 206, 298, 501, 271, 142, 361, -19, -208, -412, -168, -231, -291, -201, -275, 16, 0, -33, 185, 90, 242, 250, -7, 71, 134, 248, -161, -100, 8, -317, 125, -226, -99, -194, 51, -53, -437, 56, 99, 91, -41, -15, -178, 259, 144, 101, 166, -20, -139, -278, -179, -391, -216, -176, -173, -87, 7, 148, 415, -53, 271, 306, 170, 220, 131, 163, -243, -163, -641, -432, -221, -223, -310, -226, 117, 91, 139, -38, 59, 313, 297, -69, 207, 266, 404, -138, -162, -257, -372, 50, -78, -308, -335, -231, -341, -88, -22, 338, 614, 40, 330, -122, 358, 227, 84, 69, -225, -145, 36, -290, -335, -613, -58, -224, -240, 61, 76, 196, -23, 507, 506, 435, 25, 208, -66, 40, -150, -473, -347, -136, 99, -134, -230, 162, 414, 83, 88, 38, 233, 177, -241, -49, 36, 169, -162, -13, 176, 80, 131, -267, -117, -41, -72, 42, 49, -136, -32, 150, -68, -163, -310, 227, 254, 35, 37, -64, 153, -59, -30, -465, -110, -133, 2, -247, 155, 137, 62, 5, 313]
3170C13N4o5j17j59n7O5k26k19L86p7j11L44j31j16M14J0l28J26L6j30J6k47K29
3193A0r4R9j52j89R2J3Q7J83k50J44K06k10L00j95K07j15j84J94N2j12j84K13
3215A15l36M17l74j53K26M3J2j57J45J50K59j49k40M18l42J36r7k55Q7k60J56
3236a99j97J43J18k4R5P7M6j57L04j60J06N5k79O4P8j62Q4O3l97K22K90r0j33
3259e3L3r6J63N4O3R2j07R6j68j68j26L24l9j82o4k11L56L9n67N32J37k25R7P5
3283E5J35p6n4J99l11n5K05l8k32J06r8P9k12K72l01L55J18j93M5N8K70l98L64
3306B93l52J30k16M4q9J06J03l6k22K67j01M01k81j3K77k01j96K09k7l13J60P5
3328A8l35K28k6J43l27K03J40k98N0J48K50jk81P3J89R4kl87J78J94O1j02k87
$$ y = [313, 367, 302, 185, 26, -31, 34, -192, -411, -25, -102, -213, 131, 0, -116, 298, 308, -20, 106, 142, 12, 28, -219, 10, -84, 15, -137, -326, -234, -221, -134, 49, -201, -57, 149, -61, 239, 44, 251, 136, -48, 146, 198, 86, -98, 115, -221, 196, -178, -331, -105, -62, -50, -207, -62, 88, 347, 198, -42, 376, 34, 170, 73, -182, -95, -355, -199, -396, -253, -135, -159, -64, 13, 59, -98, 206, 46, 152, 207, -72, -8, 70, -92, -8, 55, -342, -120, 170, 80, -53, -20, -116, 47, 101, 164, 256, 149, 245, 77, -91, -217, 107, 68, -114, -178, -389, -33, 6, -561, -29, 108, -117, -20, 55, 190, 114, 60, 259, -52, -107, 98, 60, -172, -66, -164, -85, -297, -25, -326, 29, 147, -46, -1, 57, 327, -71, 293, -59, 71, -145, -101, -190, -84, 19, -17, -239, 28, -73, 328, 47, 34, 311, 110, -86, 123, 96, -217, -57, 18, -317, -89, -115, 28, -299, -96, 44, -254, -204, -56, 194, 193, -88, -15, 174, 268, 266, -121, 57, 251, 312, 210, -77]
3351g7k03K46Q9l18j05L27n1L74l48N84l04j63j3J96J41k10J4l6l64R9j3m3L5
3374a43j84K93N3r0J3K44l1J67r8j14p5m3J60r3k11k80L27K2j83L38k7M1J03j1
3398A78jj53p0M18m19L8M4jJ83J15m23J9K08l55N6K33l57L18j2K41l60K2n9K79
3422A42Mk27j62M24l73K66j50q2K85l13J06K18j93J20q1oM5K1j61K33J33j21N8
3445A86m52J66k80J88L88l42K51k33Q4Rj2P3j17J12J52k88J55J58l57m6Q3J24
3467Bk55k2O4J43J3j02M35j36l17L1K65j00j77K71p5j7K2n6M7l03O3K81j42Q6
3491B1J16k52k6J36K24q9k63j02M54j50p0j6K7J76l25R2l8J93j32o7n2J07K75
3514B39M6k35N2j14Q2J42j4j56O5k52J75j55K14k41JJ%M5J44l7Q8j90J73J35n7
$$ y = [-77, -280, -34, 55, -263, -368, -41, -92, 282, -66, 518, 214, 51, 38, 234, 375, 165, 179, 143, -221, -122, -135, -178, -143, -327, -34, 19, -71, -58, 186, 155, 322, 224, 110, 35, -8, 152, 59, -152, -432, -105, -83, -266, 72, 45, 86, 189, 178, 177, 24, -46, 372, -47, -9, 35, 34, 217, 332, -91, -72, 136, -219, -163, 70, -287, 31, 19, 260, -100, -78, -137, 142, 146, -81, -243, 181, -192, 74, -76, -158, 127, -186, -80, 138, -55, 65, -16, -22, 23, 44, -117, 116, 249, 128, 186, -266, -100, -380, -192, 196, -146, 105, -128, -44, -35, -47, 26, -91, 21, 173, -115, 40, 198, -159, -205, -122, 2, -253, -275, -211, -68, -55, -157, 278, 142, -175, -144, 121, 21, -156, 115, 40, 23, 45, -11, 36, -267, -204, 77, -65, 21, 137, -115, -141, -5, 219, 130, -133, -235, 219, 69, -1, -17, 10, 186, -139, -47, -85, 108, -24, -91, -143, -36, 239, 285, 50, 102, -12, 70, 212, 198, 42, 107, -145, 30, -125, 89, -152, -151, -150, -150, -105, 39, 2, 90, -100, 73, 208, 151]
3539A51l46L70K6p0J66m25Q0R6r1qr8J81j48K86rJ06k63N9r9L65l26oJ21l12K29
3564C5l05Q9N9J76P6r5r7m2Jl89O18q7j6P8p8M2j3M1l62J77R1K9j56j77K70j50
3590a85J9K15J7j01N8N1k39K67j32K58j2r1j0q4O1j45l95L29J7K14p0o6M2K50
3614B68L1j33k1o7j22r4J37L01n70j51M78l01M37l3j70j54j6N6r1L07j35J55j43
3637c1k46K70P6l03L25k19K05l09o4R8K54L5q4j59K25m4LK10k94l9J42p8q5J47
3661C5R7j81k20N2K98l04J91K49j40j50K83J1k54K93k08K4R7l04P1K9l3M9j37
3684a52J88j38J21k03K11q5R6Lp3Q7j32K95l16R3j1j17L6p8p3M60j95L7k56K7
3708a75Q6J51kj93K12J14r4k58P3K74j41j05J85o9P7P3l10K72j88j34L41k56L30
$$ y = [151, -195, 175, 201, 131, 297, -128, -48, 48, -43, -51, -149, 32, -116, 170, 161, 267, 4, 63, -36, 329, 3, -3, 118, -194, 35, -270, -181, -122, 54, 130, 35, -62, -104, -103, -492, 126, 39, 23, 101, 23, 65, 52, 93, -269, -92, -1, 28, -128, -305, -35, -185, -166, 49, 66, -35, 23, 74, -165, 102, -30, 228, 216, 125, 115, 31, 92, -53, -448, -119, -102, 112, 42, -24, 18, 268, 299, 166, 145, 78, -44, -138, -1, 300, -270, -421, 57, -244, 193, 160, -10, -164, -180, -124, -215, 92, -43, 112, -31, -277, -7, 69, -234, 91, -128, 77, -232, -296, -198, 56, 91, 7, -152, 73, 29, 32, 242, -52, -91, 51, -27, -112, 35, 132, -49, -269, -217, 81, -223, -32, 217, 77, -73, 210, 221, -33, 260, 52, 76, 173, -131, -60, -31, -64, -15, -152, 36, -102, 19, -184, 27, -58, 38, 41, -32, 55, -77, 218, -98, -5, -16, -133, -97, -175, -248, 212, 17, 54, -202, -175, -89, 62, 60, -133, 79, 193, 99, -159, -86, 188, 47, -58, 127, 58, 135, 208, -102, 170, -18, -152, 189, -67, 263]
3731B63J36k78j68l7K39o7k74m7K47q2PJ23k77O5J24j5k9j24L31l0k33K37j64
3754e3j44k1PJ65L59m92M30q8l53K33k43O1k5K95l83K16K45j10l74q7J31L68K7
3777A64k62J31k75L41l34K30p4J03N3lj16o9J70j21L9p8K36j85k0k3N6P0q0o2
3801a09L6K49r1p2L9Q2k36J16J32j60k07K34lRj38p9K27lj31j03K72j5p7j24J03
3826d9PR2PJ7J55j78K76k30j05K00j05M1J13m29J30l7K33l04K46m9K6l7k1J05
3850A04L6j61M1n3j21O5j29L77L1l28R6J45l7o3j48K39q8J28k6L5l7k31R5Rp3
3875i4n7K85j94J06k92K08PJ71j31k43K57q0K10j41K30k31P3j42N4m1j29J68m4
3898e0l8L04k23P1j34O7Q1j40k6K3m2J8q0M5K14j56K69l40K6L54j63k58K2k8K39
$$ y = [263, 399, 121, -47, -84, 155, 88, -186, -233, 14, -68, -61, 62, -215, -150, -26, -41, -70, -194, 137, 107, -126, 111, -53, -197, -218, -211, -46, 313, -179, 251, 163, -190, 43, -200, -139, -164, 131, -252, -36, 209, 99, -275, -362, -231, 137, 164, -98, 33, -242, 99, -235, -5, -79, 24, 77, 74, -42, -111, 59, -62, -23, -101, 135, -50, -70, -93, -37, 33, -47, -109, -73, 176, 85, 13, 52, 134, -102, 14, 146, -14, -221, 13, 10, 19, -119, -198, 29, 26, -105, -208, 64, 49, -28, -152, -49, -42, 50, 57, 74, 229, 51, 327, 97, -8, 192, 87, 128, 241, -188, -58, -95, 138, -166, 80, 31, 57, 20, -1, 104, 140, -21, 20, -33, -154, -89, -218, 159, 190, -138, -42, 103, 66, 3, -145, 94, 6, 134, 108, 143, 106, -125, -30, -21, -94, -151, 134, -60, 46, -246, -38, -31, 140, 9, -234, 23, -57, 153, 12, 242, 11, 84, -58, -4, -45, -174, -6, -50, -88, 216, -7, 64, -70, -3, 78, -62, -88, -65, -107, -89, -169, -124, 90, -66, 203, -137, -111, 243, 80, -178, -156, -184, 55]
3923E5j23L48k50j5J3J97j68K41l33n1L68o54L37M3J20K12k70j29r9o8L01j83
3945a08K46j10q7K17k29J07j47j44J77K26m19J20O0l4j07K00J87K46j46K3m2l70
3967a34J03j25J66l61L35K77m27K17r8K43l32j0J81j58J19L46j27k43J02R4j17
3988E1J87l61R1l7k3K08k20K43k21K23r5k52L86k85M4pN7p0k4L78j94k75L9%J71
4013A4K08k44j8j23K98j54J50k31M4J57l59K49P0n7j05L1j05J21K2l37J00L38
4035F9q6K51j53j03J70K12q3k59K7O7j3o6j53J6K2p9j23M2O0K82j49J78k94J65
4059@k59K51L17k03l6k08J68J11k99j08k1J97P1K2q9K86L3n1j28m1m4K08k19p
4083d9J04j36J05Q7l5j39M1k89M30q6J0J85j82n8k9J0P3L7j15N8J23k39q6J46
$$ y = [55, -68, 280, 30, 15, 28, 225, 57, 298, -35, -86, 282, -372, -35, 8, 128, 340, 70, -59, -158, -226, 75, -108, 138, 28, -59, 158, -71, 36, -111, -255, -78, 148, -271, -151, -91, -125, -232, -32, 155, 401, 255, 278, 236, -134, -31, -156, 10, -351, -16, 261, -166, 51, -47, 196, -136, -146, 35, -123, -4, 342, 215, -28, 74, 168, 51, 238, -123, -32, -69, -92, 116, -104, 139, -82, 141, 46, -206, 180, -105, -61, -68, -11, -81, -105, 273, 79, -196, -157, -157, 14, 222, -22, -40, -163, 135, -19, 131, -100, -56, 101, -258, -9, 61, 4, -101, -70, -175, -54, -32, -369, -269, 69, -17, 234, 81, -22, 148, 360, 277, 18, 45, 112, 99, 33, -120, -104, -82, -161, -284, -242, -182, 100, -49, 129, -165, 0, -259, -8, 309, 106, 70, -138, 30, 141, -158, -266, -287, -90, -19, 3, -86, 200, 233, 182, 54, 13, -31, 177, -42, -49, 55, -81, 24, 111, 76, -63, -22, -311, 119, 33, 43, 228, 46, -12, -41, -31, 42, 79, -36, 22, 145, -94, -180, -34]
4107c4L2l8j14J63k0n5K50j41m8k19J28K54k66o4L16l6k20J23k18K62n3OK3j73
4131a42N8qP9K0R6p2P2m9%J4j13J10k66K68j39o2R4K8RkL8R3k2o7q1K6J12o0J93
4160B27l58NL36J4l47Q3j18Q2K83j99j27qL8M01k17k16R3K35K6j78p7J7k3o0J4
4185g4J39m5k01J34j13L55k2k09J92k61K15j00J61k00l8rN6K56l06J02j54J16
4207fJ51L2k72J71j26K02k56K96j01R2j48J77q3k12J63k41M81m34k47J36J57J47
4229G9j63k9K60j57l5K37j28J4p4j08O6k02L70k01m9J28O7j74J17J14k75J83O7
4252A07j67o5l22O05o5j67P3K29k42j59K58k10j4L7R5j16J39J08n72N90l33K70
4274G9l3k06J83J31j46j56J84K8l50K23j84J06R8j15L20k54q7K94j55R5K7j58
$$ y = [-34, -2, -40, -154, 9, -11, -66, 184, 43, -5, -224, -96, 158, -108, -172, 144, 108, -112, 11, -207, 55, 2, 8, 31, -142, -84, -92, -13, 7, 103, 31, 103, 54, 54, 68, -45, 65, -201, 67, -72, -134, -40, -12, -3, -5, 33, 126, 104, 37, -44, -18, 94, 34, 227, -131, -126, 210, 224, -123, -40, -158, -76, 207, 8, -119, -127, -89, 312, 95, -121, -28, 207, 233, 55, -22, -5, -28, -88, -74, 65, 20, -181, -47, -160, 195, 173, -36, 156, -105, 110, 10, 171, -29, -67, -76, -20, 236, -70, 32, -122, -6, 145, 177, -95, 76, -50, 152, -104, 192, 91, 183, 35, 212, 129, -83, 80, -161, 320, -114, -361, -225, -68, 79, -84, -113, 147, -10, -45, 192, 64, 78, 4, -104, -38, -240, 130, -71, -120, 8, 75, -99, 18, 132, -143, 40, 107, -60, -125, -447, 158, 93, -74, -1, 228, -14, -173, 85, -125, -139, -102, -7, -123, 16, 124, -448, 142, -191, 79, 46, -160, 23, 154, 8, -148, 36, 64, -286, -63, -247, -141, -43, -158, 162, -92, -179, 115, -40, 55, 82, -76]
4296g6L57l30j06K43o4k42J90M6P4k20j25N58k02l3k24K32j46J92K7k67m7L24
4318A61o4n3J84m64ML04J44j75K31l12J16j06K42K31n72L92O9m22%j05K44j26
4340g7J78lm8Q2k6r2J9k73M55p0P8j25Q3j64J45j02k22L25j70J2j7l4m6n0K09
4365F7K7k76J67J38j58J00pK15n6j37j67k04N96l91Q6m1j85J80l37K79K33n9k07
4388a37J32K51Nl76J58j10J52J52j73m6K06m98M30J8l07K48Q7Mj42k07J92j60
4410a21k5K70N3J2j04j07o0n8n1Q5j05K91j63q5P6k48K4M59p8J77m70K78R5k25
4434h0NO7m1K20k43kK61l48J98j02k06J60L35J8j78j45j27M11l06J50J33k57O5
4457a2q6J46pj6j14J77k27K57J38l51K84j57O5k20J87m33L19r2J30L5j08J86j52
$$ y = [-76, 281, -49, -155, 88, 24, -218, -28, 18, 92, -128, -253, 305, 103, 70, -154, 78, -68, 124, 151, -116, -163, 161, 97, 44, 228, -236, -232, 72, 216, 41, 272, -40, 76, -30, 212, 443, -129, 263, 332, -90, -90, -195, 49, -77, 101, 98, 50, 132, 106, 14, 33, -240, 215, 145, 223, 98, 181, 17, 162, 60, -162, 163, -7, 5, -12, -46, -92, -142, 67, 94, -182, -15, 123, -35, 65, 58, 273, 217, 80, -87, -291, 305, -86, 0, -41, -226, -46, -383, -104, 129, 70, -137, -5, 246, 251, -125, 33, -77, 75, 227, 54, 8, 214, -284, 146, 164, -143, 105, 192, 196, 54, -153, 39, -121, -146, 124, 177, 189, 85, -22, -82, -140, -191, -106, -211, 80, -83, -168, -92, -340, -316, 143, 65, 242, -228, 50, 145, -80, -75, -8, -49, 171, -72, -74, 187, -161, 37, -65, -271, -111, 224, 242, 64, -81, -208, 203, -103, 47, 180, -77, -12, -98, 48, 41, 25, -89, 88, -139, 118, 256, -95, 189, 32, 97, -123, 64, -369, -50, -142, -12, 23, -85, 101, -51]
4480e1l25K98J74j14j98J63K56l6p4m0k1K2J22l09R5M6k44J87j28K4K61p5j05
4503g2J49m2k11K12J07j06N6j56j8M8pl0K25j34o0n1oJ87k37M4J23J85j93j55
4527a42J89l9o4n8J05j81L64k72L4J60m05L28j95K41r8Q3k8j5J12j45j8M6k82
4550b80L48k01J42J2O3J60j36m54J86L42k52K33k61K07l1j15J00m5J81l70J92
4571B1j61j74J07K31j85MNJ3J54J47mj0K10n36M54m04P6k8K13k25J17j61K19k32
4595a49K45P1m9K9m01K53P8j42O5J51j97j55K39Jk33K79k29R9Q5J32j72M3k56
4618b13L31k87L15L2n3j05K72n53J90J32l26K5J90K5K93k78M4J14Lj41R0o9J02
4641A33k76L6Q4n8K3r7M5l6J06O6N3j08j74K82Pr2J60Q8l06K72j34j04J25r4j77
$$ y = [-51, -376, -78, 96, -18, -216, -53, 203, 167, 93, 53, 32, 54, 176, -133, -38, 8, -236, -49, -177, -153, 108, 33, -72, 77, 35, -176, 36, 143, 37, 93, -63, -81, -33, -40, -70, 155, 21, -39, -90, -96, 91, -146, -102, 21, 206, 13, -142, 47, 8, -56, -114, -9, -190, 174, -98, -64, 96, -309, 19, -176, 65, -33, 50, 22, 7, 119, -26, -44, 2, -280, 68, -133, 9, 21, 84, 244, 108, -346, -160, 182, -70, 163, -98, 109, 78, -37, 63, 18, 199, -171, 21, -140, -314, -207, 24, -161, -157, -152, -139, 15, 162, 158, 148, 358, -178, 276, -128, -52, -80, 133, -92, 25, -136, 83, -149, 96, 167, 118, 147, -254, -1, 77, -65, 0, 151, -46, -201, 38, 39, -194, 85, -144, -45, 40, 172, 0, 43, -213, 118, -169, 146, 178, 125, 20, 292, -261, -71, 61, -265, -240, -50, -25, 268, -10, 34, 148, 151, 10, 100, 31, 133, -143, -107, -23, -81, -58, -155, -110, -146, -40, 26, 79, -29, -203, 79, 86, -6, 154, 242, -64, 208, 74, -30, 95, 1, -176]
4666a76Q0J40k72L03k78J10j15J25O0j58O3J21R2J08l91L28j26j7j91L12n17M07
4688Hk89Q4J56J22j08K1J40l50M02j50l3K9r8N31l54mj13n7L1J9k47J79q3K5L12
4713A73j00k44R9l7J89L9n8J1P7k69J73r7j69N27n38J63k18L45j30j10J19K53
4735A98r5k24J22K21J97n38L4L07k09K9m86M58r9R8k48K96r2J92l76L33j51J48
4757A15j82J81j97k8J64j15N3KQ6k48J86l2j47O05o54K31J17K5J73o7l86J83q6
4780b1k4J39k09R2J79k01m3L28m41Q3%J56%j36K98Lk28j2J70j91P5R5j80j17L23
4805A38l67L67l32K04j58O8M8M5j23j2K96n5k10p9P2J16Q1j91l9p9K10%jk00K60
4830E9k8J79j91J0NJ70j04P2l02J64q3J92o8j11p7j28J35K0O3j02o1L48J9j77
$$ y = [-176, -96, 44, -228, 75, -203, -93, -208, -83, -23, -181, -118, 3, 95, 203, -188, 140, 14, -3, -194, 118, -399, 8, -281, -197, -41, 81, -27, -6, 134, -216, 186, 36, 3, 32, -66, 465, 111, 107, -6, -63, -32, -13, -260, -81, -164, -139, 173, 73, -171, -72, -109, 80, 119, 61, 72, 149, -120, 53, -44, -213, 314, -224, -61, -279, 66, -64, -174, -55, 198, 103, -121, 1, 222, 419, -119, -85, 222, 13, 42, -444, 14, -85, 13, -235, 61, -31, 161, -215, 118, -33, 115, -67, 114, -83, -111, 53, -62, -9, -7, 79, -169, 17, -15, -162, 443, -211, 20, 137, 162, 335, 268, -118, 65, -21, -45, 94, -115, -23, 156, -45, -88, 240, -201, -118, -118, 38, 38, -98, 200, 203, -25, -37, 133, -58, 17, 112, -68, -185, 138, -229, 138, -194, 10, -148, -80, -32, 13, -110, -122, 174, 119, -91, -170, -98, 18, 99, -92, -131, -210, 0, 0, -1, -201, 59, 31, 210, 19, 29, 34, 204, 100, 172, -130, 34, -49, 143, 75, -36, -113, -241, -106, -86, -23, -125, -186, 162, 181, 4]
4854DJ1N0j42J11O2k20k99M47k4J72k63k3J85j05J44J59oj0k89j20L40j58j63
4877a37J76L1J2j75K25j42k80L62M6k58K88M6j30k52M03j79p1K57k62j37J60R6
4899G9m98L84O9K53m53K49o2OK79m22Q5N4OK38l5j59q3k56J64J32l6j93L54j94
4923c9l13K90R5r6J35L2K35m08L3j04J11K9m0K5r0R8o7J88j92K02j51K26n9k26
4947h6O4K8j42K60p9PK61o2j89p3J17l04NK88k35O1MJ52k06J79j59J72J47k61
4971e1J13J46l1j48K38l88K78m04K48j0q8m7j18J18%K79k04R4J77k16R1k4Mk22
4995a65L17l13M7K45k09k16J28K20K64j14l31J21R2J6m5J50j13J09k71j02K34
5016F4j60J15j83L5L45l88NK97K9J01k57LK19l34J86N2k21J10j82K87k5j29K27
$$ y = [4, 15, 65, -77, 34, 96, -124, -423, 24, 0, 172, -91, -114, 71, -34, 110, 269, 263, 253, -36, -156, 184, 26, -137, 39, 70, 82, -93, 132, -10, -290, 72, 118, -140, 148, 194, 64, -188, 215, 36, -35, 222, -40, -177, -17, 79, -419, -35, 34, 287, -166, 83, 21, 27, 306, -116, -31, 23, 29, 267, 232, 73, -10, -266, -102, 30, -6, -199, 155, -39, -352, -62, 33, -63, 72, 104, 339, -69, -36, -140, -29, 0, -40, -15, -105, -7, -74, 114, -78, 124, -27, 199, 140, -86, -22, 6, -136, 124, 45, 52, 313, 251, 62, -11, 106, -198, -193, 95, -140, -79, -75, 77, -129, 50, -109, 63, 210, -51, 62, 208, 177, 29, 267, -121, 157, -247, 1, -9, -97, -144, -262, -144, -144, 135, -69, 25, 202, -14, 77, 53, 57, -165, 152, -161, -114, 131, -78, -294, -166, 54, 318, 204, -127, -6, 86, 102, 57, 207, 94, 203, -68, -170, 64, -96, 19, -164, -129, 216, -172, -167, 130, 159, 260, 3, 6, 225, -109, 77, 129, -92, 18, -164, 123, 98, -31, 196]
5039A96l23J35J92k0k41L13l08J14J34m41M8J24M3K48l72k66K79J38O2j17l45
5060d07L49m1L12J93n39J52K53k20j43J73k44K08J34k98K5J53l19M28l66J40J3
5081d4j32K54j50J69K5N4j90J32j70J24j93M5j83K46O0j44J07j42J44K38m18J08
5103f0J87j51J43j37o0k16L12O0j79R3q9J65j61K75j70NK7k1k0l7k24K56j6l8
5127e6N2j38L74k49R3k38K37Nr8K15R2j61j92j19M69l82J56k80O0R2K02j63J05
5150G6k91J43r6K19o3r5L2j04n1J46K03qj67J87K1l9q4l5K44k34K3q6R4m70K80
5175a55K77k92O4j15K32N3O8j11K75r7k00j03N4J40N0j19k0Kj92K21p5J77K5j66
5199gJ39l0k48n9J09J98m12K45o6M7k62L54J19J30l77M4K36J04l17j15J46j33
$$ y = [196, -127, 8, 200, 180, -61, 252, -56, 58, 192, -249, -201, -77, -34, 214, -158, -424, -145, -7, 55, -62, -407, -58, -99, 213, 406, -133, 19, 272, 52, -91, 82, -162, 46, 180, -118, -93, 60, -259, 169, -197, -57, -44, -176, 78, -72, 97, 122, 176, -14, 118, -52, 72, -121, -76, -259, -13, 47, -97, 10, -132, 12, 250, -168, -60, 127, -24, 119, -18, -78, -294, 18, 78, -101, -8, -97, 68, -93, 182, 12, 17, 44, 23, 3, -34, -258, -2, -18, -56, -4, -142, 232, -17, 76, -162, 75, 80, -18, 197, 289, 128, -64, -183, 286, -96, 60, -220, -160, -68, 134, -29, 76, -215, -72, -168, 51, -12, -107, -75, -179, -230, -84, 119, 111, -56, 131, 152, 113, 29, -6, 238, 4, 27, -59, 35, -435, -155, 122, -170, -106, -221, 11, 64, 132, 21, 296, 199, -1, -104, -50, 90, 140, 21, 1, 3, -189, 32, -43, 134, 159, -7, 132, 102, -146, -205, -96, 102, -310, -65, -131, -84, -346, 8, 127, 257, -120, -76, 160, 264, -53, -168, -22, -155]
5221a55L19k45q7L02k13M23o65K74l25N58p2q5l24K83R0J08k96J26k0J66k18k8
5243h4J34k4j80J78j61Q0J01j72L8r3J97j45R6J46r0P8r8Lk48K11K03J8j16P2
5267A44m01K13J09l24L35k57J66l8J26r4J93n5k07J51k2J83n04K88K05o6k18n5
5289a28Q6Q3K0k36M7j86Q0N44n11K46m1j13J48l5N0m9j8O7J53n2m40K58Q2k59
5313b04K98j31K23k07l9J70J00j77J6Kk41J51R2j92K84k35J48q7N3k01K2QJ16
5336c1R3J28j28Q4k36q2K6r5L07p8l0K34m1l30N2r2L16n8J26l91J59O4j60K29
5360F6j91J75j58n1P1L7J35j79J56k16J87L3k4j03O4j83R4K00Qj74J74Q0k59J31
5384G3J02k50j84K83k20K9K57j34M06l56M4nJ05k47M3j03%N4L7o6j03J33J42J18
$$ y = [-155, 164, -81, -168, 134, -79, 344, -321, -47, -372, 186, 114, 29, -295, -12, 78, 186, -110, 16, -4, 162, -56, -84, 50, 26, -154, 24, -137, -57, 44, -128, -90, -183, 14, -131, -35, 111, 21, 99, 1, 4, -244, -33, 170, 188, 72, 144, -257, -44, 65, -259, 76, -181, -15, -53, 73, -21, 172, 117, -90, 61, 39, 222, -282, 6, 211, 145, -73, -128, -42, 41, 61, -175, -128, -314, -234, 310, -201, 45, 4, -109, 39, 4, 54, 5, -13, 54, 207, 155, -285, -27, 55, -204, 94, -37, 186, -21, -60, 110, 210, 33, 49, 51, -190, -39, 53, -139, 145, -90, 58, -29, 24, -177, -155, -147, -31, 62, 190, 62, 146, -90, -172, -146, -241, 66, -12, -42, 192, 151, -179, -127, -219, 97, 39, 165, -226, -67, -3, -163, 66, -125, 50, -108, -159, -88, -51, 84, -95, 61, -155, 32, 65, 41, -62, 2, -181, -87, 113, 121, -53, 121, 201, -58, 73, 175, -75, -259, 24, -196, -167, 90, -44, 362, 6, 50, 45, 150, -97, -54, -157, -157, -103, -66, -132, -235, -102, 40, 158]
5408A58Ll96K39j8J07j59m6J08J70l13O4L5j69L32j86K73k52K08k44Ok17L92j80
5431h5o9K21k3q2OK72k81P9lK56l50j55J62k1K24o06M23J60n8n5N6m2N8j60j58
5456b31L17k3k09R1k20j43L59K18j81j22J40n0k22L59k15K80k51J12j00J1M1Q7
5478D8K9k16j09J26L38k02k0j3K14j85P1j71J88k25L60l51L92k21j45j2o8J78
5500FJ33ok95L47j22K5k89K97l09K86k67j5M25j98O9j33n3K66k24p1J9J5l3J96
5524F9j00P8j46O2m2J64l8J10j5J01l6m00J78l8MJ43J6j10L8j93K67l51N83q9
5548B55j40N8o5l38k6M06k89Q0K10j33k82L45l35L01p5K29q8j82M99m12J27k5
5570A20j9J7O4k07k4Q3k00K47j59j11N8j77L20J24j09j10J9K54j27j18J18J38
$$ y = [158, 161, -235, 4, -14, 93, -66, -112, -4, 166, -147, -83, -48, -217, 115, -71, 202, -50, 158, -86, -80, -297, 95, -85, -154, 67, 44, -38, -32, 240, -41, 38, 35, 291, -59, -214, -52, -73, 151, -455, -32, 128, 70, 15, 71, 29, 87, -73, -231, 86, 63, -146, -55, -275, -418, -59, 159, -22, -144, -4, -54, -276, 83, -132, 148, -103, 9, -91, -80, -39, 48, 77, -139, -248, -122, 216, 14, -6, -19, 195, 10, 81, -90, 98, -127, 233, -118, 274, 53, -92, -104, -172, 6, 139, 133, -162, 185, 63, 88, -201, 96, -213, 73, -194, -209, 216, 18, 87, -46, -99, 167, -57, -128, -109, -94, -127, 69, -31, 47, -99, -37, -79, 85, 47, 157, 142, 243, 207, -193, -15, -53, -49, 94, 110, 0, 38, -155, 112, -239, 344, 255, 115, 173, 108, -230, -256, 150, -139, -59, 151, 18, -264, 81, -254, 47, -28, 201, 113, -69, 430, 18, 145, 120, 101, 118, 182, -25, -49, 34, -166, 81, -78, -189, -131, -308, 12, 136, 27, -83, -64, 190, 63, -55, 63, 201]
5592B01j90Q4j75j44j46N65j23J31l25k78J71L47q0j34J75K7l9j1p3l0P8k3K1
5615B9j64K10j36J5j88J45O5K2QK5J77k9Q1k01q5J36o5k0m8p2p7K17r9Q5N2%j39
5642e6J36J32P2k20J29j79J66j07j56k6J65J8k3k17J05pj23M1L77o7J36l79J73
5665I0j36J31n2k19JL11j59nJ11k07J56r9j19J25K79l14jL10l6n7Jk3J45m34O4
5690a37J4R0j96k2P8L6ML11m81K37J88j84K0J13J08j79j57Q1l5M5k32R3L27k69
5714a47J03PK20l55J76r1n8M16n30N04J53m45k32l6K84j29J16q4N1K00j25M3j32
5737i1J49J11jl12K54j86K9J1p1j09J47K08j40n7N3N6J09j63ok98L87n8P9j3m1
5762D7J26k49j4J86J42l95j67L37%j91R2q6K22j0l1k2J32L1l38K37j24o1K13o2
$$ y = [201, 11, 95, -80, -224, -370, 195, 72, 203, -122, -400, -229, 118, 38, -96, 79, 106, 67, 56, -17, -47, 31, 8, 29, -135, 75, -61, -46, -234, -89, -24, -2, 6, 31, 208, 179, 260, 59, -26, 110, 45, 25, -23, -95, -172, 45, -54, 31, 83, 83, -56, 80, 212, 284, 64, 193, 14, 180, 73, -83, -109, 56, 74, 51, -166, -61, -68, -191, -150, 227, 160, 296, -83, 90, -46, 85, 33, -186, -185, 126, -33, -38, 73, -134, 22, -77, -196, -71, 208, -106, -107, 203, 167, 110, 111, 88, 233, -201, -137, -123, -33, -229, -251, -173, -137, -133, 178, -303, -66, 122, -62, -42, 71, 179, 0, -157, -76, -111, -66, -298, -205, 122, -147, -44, -37, 183, -172, 4, -87, -145, 271, -259, 245, 398, -47, -279, -315, -31, -160, -44, -128, -77, 123, -2, 41, -91, 58, 169, 168, -144, 110, -76, -47, -36, -107, -216, -69, 139, -1, -58, -5, 51, 160, -3, -9, -307, 80, 22, 101, 88, 47, 173, -76, -90, 96, 238, -157, -324, 13, 13, -178, -86, -172, 50, 40, 9, -13, 119, 150, -188, 49, -75, -136, 77, 15]
5786A5j80K30p6q1l8j2J36J98k86R3K44p2j35L14m06r7K60k9k38K23j16j9K33
5809A61j46r6J53r3J69j98P7j92K0K71j36n5k23L89Rk05J75l57K67J9o1O1O0j57
5833h8J69m80M00o0j2J41k7q0j13R4L6J80q1l9l08L04O3o6j11J30qJ4M1j53J12
5858E8k04J58j57L65j80q3J59o1n4J38r6P3j01l0O4Jk8m8J26q6Q3k7q1r3L28J04
5884C28n04K40R8k48r5J22K00j77o9R0O9o3j2k44J75k28K22n8R4j1M4P8J0r9l3
5909g1J76j29M1j15L66k27K2k84K07J36j87J65j18O8K76m40K7l53O47l19K46p0
5931F4n4j90R9K32O3J35l81p2k2K49J1R9k02j09P7k04L96j65k4j42Q5K14r6K1
5955H4j25O7r6J93j90o8j03j33M75k0q3j46J94k01q9M24k46M6m4M19k38k68J13
$$ y = [15, -165, 65, -11, -92, -130, -142, -6, 192, -94, -1, 243, 171, 36, 350, -56, -153, 107, 78, -160, 63, -53, -72, 161, 15, -81, 72, -21, 148, -50, 27, -165, -145, 126, -10, -65, -288, 101, 110, -95, 80, -277, -10, 9, -52, 9, 69, -88, 81, -399, 1, -59, -71, 70, 43, -37, -150, -56, -20, 160, 79, 40, -268, 36, 99, 33, -78, 52, 44, 58, 99, -54, 58, -146, 12, -145, 220, 40, -43, 116, 55, 1, 139, 43, 116, 15, -15, 49, 50, 22, -26, 100, 14, 97, 70, -11, -104, 224, 328, -176, 64, 162, -86, -181, -59, 141, -36, -105, -15, 54, -9, -21, -265, -90, -318, -96, -154, -60, -71, -27, 51, 61, -38, -71, 105, -24, 17, -98, 268, 41, 63, -221, -14, 122, -65, 100, -18, 50, 326, -114, -87, -440, 207, -112, 134, 64, 10, -180, -81, 151, 214, 349, -32, -104, -126, 123, 134, 233, 31, -78, -1, -205, 191, 26, 2, -140, -55, 159, 63, 84, -41, 26, -70, 123, -67, -135, -238, -371, 104, 84, 1, -145, 49, -152, -241, 183, -63, -17, -61, 358, 120, -148, -35]
5978c5N0l5K5j8J9P7j30l88L32Q4J29m03M3J47J36j60L38o4k61J27m8J14J54l18
6002h5OK3J07k9j33J08r3J87k29M8L09l82L7J27N2L0J35l73L06p6p7K02l06N9
6026d7q8L6J44r1J22k02p9J43K30j49j57K07j77J76l20L05j47J8j14J12PQ0q4
6049g5R8J51m21R7K0J82k1k5k21L58j19K11k54j43k68N17J79k18K24k02M7m14
6071b97N37l54l1j13L94O2j46k05j2K39m94M18j1Q5O5j93L4O9R6J7q4k72J40J8
6095c8q4M8n1j42K48J3k91L56k80J63N2j04L06N9j24J34j00k68K88n7j27P7j68
6118i0%o6J0N3J19n0p4J35k03L52m43K44J96j29P8j81k55N34k67q6r5K97j24L32
6142B87q8O0k13q1o2J2K7l44L52J8J30j64m0j45M3L35k8n2J98l68N7r8J04K27
$$ y = [-35, 15, -20, 5, -13, 6, 83, -47, -435, -103, -19, 110, -293, -250, -103, 33, -127, 211, 147, -114, 13, -35, 79, 233, -85, -79, -56, 51, 22, -111, -3, -96, 91, -138, -90, 219, -163, -126, 1, 53, 83, 218, -155, 151, 75, -2, 200, -106, -47, -135, -99, 45, -46, 76, -126, -205, -62, 168, 19, -138, 69, -108, 68, -252, 53, -94, -76, -190, -78, -71, 9, -75, 23, 174, -247, -150, -130, 52, 31, 6, -215, 143, 24, 235, -19, -162, -430, 87, 266, 48, 272, 70, 117, -297, 240, -114, -145, -258, 136, 198, 52, -153, -165, 74, -420, -2, -13, 72, 137, -56, -22, 47, 143, 160, 76, -196, -56, -38, -122, -74, -125, -267, -19, -6, -297, 59, -221, -58, -6, -110, 196, 255, 131, 265, 165, -103, 185, 128, 1, 78, -90, -90, -156, -146, -93, 26, -24, -98, 37, -166, 186, -257, -13, 183, 54, 132, -49, -304, 230, -37, -123, -218, 79, -45, 287, 199, 259, 46, -35, -97, -85, -58, -402, -50, -32, 98, -66, -106, -251, -208, 127, 99, 47, 245, -123, -66, -164, -60, 167]
6166A67k58L2R1J59k35J25J28j19l17O6K61j61L16m65M9K7K62o2k54J98O3j74
6188a01P7M0j43O2P3j39N7J36j96K41l00N2P2O4N7j78o8J96J34K18k71L4j22k1
6212b6K1J46j91j38J56j0j40K31l1J32mM0j35j76J67l5O3o0N1K1Mj84j25Q8L77
6237B42k65j01J23J64R1k27K9N2j49J0j03K27O5l1l91N03k00m8r8l38P31l37J66
6260A15j55R2N7k08j98M80k48K06j28Q7k18k01L23P6J2j94O4J14J1N2j37J75n8
6283A19K01k67k2Q3m7K04ql47J36j10Rj72K01Qj08J33o6j03O26k91k55j17K33
6306D0M1l24P2K23n0L2j18j35K68J99l96J51Q9J23k44q5J4K68j65J04j35J20k15
6329a23K88k83J6P5J40k61J13L8j60o5K41o3j29J05j19K38J06l89K93M4o6k16
$$ y = [167, -91, -59, 32, 191, -44, 81, 209, 90, -227, -161, 100, -61, 255, -210, -161, -134, 128, 66, -188, 10, 73, -101, -24, 16, -127, -65, 8, -131, -74, 62, -134, 107, -193, -141, -69, -5, 52, -126, -194, 2, 136, 354, 83, 117, -5, -26, -5, 141, -50, -188, -32, -42, -182, 49, 18, 150, 146, 186, 51, -125, 42, 7, 70, 10, 61, 82, 86, -98, -223, -135, 242, -23, -124, -1, 163, 254, 27, 56, 108, -41, -31, -134, 93, 158, 127, -264, 239, 39, -9, -107, -445, 286, -51, 115, -40, 52, 109, -99, -297, 183, -65, 141, 13, 100, -118, -319, 4, 80, 92, -102, -38, 76, 87, 139, 2, 177, 119, 320, 53, 31, 114, 67, 271, 263, -84, 52, -58, -49, -221, -20, -12, -120, 13, -53, -156, 470, 179, -76, -193, 40, 81, -243, -171, 52, 2, 34, -84, -219, 49, 248, -148, 3, 92, 215, -29, -114, -100, 168, 3, 107, -28, 92, -123, 165, -118, -102, -27, 113, -148, -35, 3, -157, -222, 19, -44, -173, -68, -187, 51, 157, -232, 61, 105, 39, -177]
6351a77J56j01J40J2r1J3k6J13N6k78J43M9r1J7P0k71J85J66k92K50J07j34j5
6374Ap8P5k86Q2K04J16m52K36p2K25K88n09K29o6N2j50J86j93J76j23J36r1J7
6397CPQ0r1R3j57J41N5j46QJ91m35O2L86j70o6k18J33R7J02J87k50l3j2R6q8K80
6423B55k16k1j08Q9J22n7j03J09pj5q3J53K8k99J19m6p2L09k05j79P4M4L17k3
6447A85m51J85L81j78J35Q5l58M7J11j38k14K54r9r0J75j04P5K08j34j29P1r8
6469h1J29J32l1k65J34k68M04j52Nj96J87J90k73J55Q8j04k16K86j71J88j56j3
6491b8k6J24L2J35k51K16j30L5m58J38J18K0Lo4M8J84k64J47J73P3k51n7J44O1
6515A22m3j04K97k49J54P6l57M65l99RJ82k85J37J52j04J38k84L37n4m53M47j21
$$ y = [-177, -21, -122, 18, 30, -61, -48, -74, 39, 95, -183, -40, 9, -82, -65, 5, -266, -81, 85, -207, 43, 150, 16, 1, -77, -2, -288, -206, -2, 114, -338, -102, -174, 51, 339, -170, 59, -7, 45, -105, 81, -112, 64, -59, 77, -14, 3, 10, 90, -1, 92, -65, 76, 131, -15, -7, 184, -251, -189, 197, 27, -39, -257, -124, -27, 75, 262, 12, -21, -33, 63, -25, 255, 39, 18, -90, -1, 121, 64, -39, 70, 63, 48, -35, 118, 146, -153, -34, -80, -152, 157, -48, -227, -153, -109, 208, 185, -266, -81, 300, 122, 257, 342, -16, 31, 142, 4, -210, 44, -55, -145, 30, -74, 1, 209, 75, -54, 17, -81, 48, 180, 149, -116, 18, -250, 154, 2, 7, -189, -2, 188, -85, 70, 158, 54, -162, 124, -47, 141, -15, -28, -54, 70, 102, 237, -14, 202, 72, 107, -351, -213, -95, -75, -72, -136, -88, 96, -168, -21, 152, 225, -26, -83, 61, 122, 79, -25, 272, 23, 177, 253, -104, 361, -38, -29, 153, -132, 5, 157, 53, 191, -93, 244, 190, -263, 184, 63]
6537F3nj90R3j76K97j95p8Q3o2K04Q6j64j38K11o1L67k77L8RJ72Ml96LL16j35
6562F9J4k14K8k11K82j61J32j51K22P2L4Qj5o4J64m27K37k03r7K68J92k23j30
6585a74J16Q8l6J79N8k67K79J62l99J59j83l2J25j03j03PJ31p4J21K8N4j65j24
6608a53J37j7q6n3K76j16m5Q2l29M44j29K80l38J36l00J92j05K28j58P1K21m40
6630b02L50Jj42j8M9j26JJ79o3o9J82J28m24M58k59O4m39N97j54k69J57k60M08
6653A49j07lj39O4K0J69R7k18J01k38Q3Pr2j36J99J9q1J08J15l54M76m32K86P
6677A00j77R0j23R0P2M3j99m3k7j44L36J8J93k62K3O4oq5J5O6l49K98j84O09l57
6702F1n44M75R1j59P7J34m6j73n1J14N1J7j34J44j22K88j91p2J41M1K1k13L2j4
$$ y = [63, 58, -132, -39, -215, 82, -113, -191, -108, -170, 34, 120, -44, -182, 29, -32, 335, 58, 96, 105, 277, 281, -115, -112, 204, 69, 83, -131, -103, -314, -32, -193, -61, -212, 10, 82, 116, 124, 109, 45, 209, -218, 19, -184, -281, -13, 179, -44, -174, -58, 30, -6, 173, 231, -36, 243, 405, 6, 165, -18, -50, 75, -28, -131, -124, 7, -67, 54, 82, 136, -29, -153, -16, -33, -119, -172, 104, -12, -57, 25, -304, 140, 11, 291, -47, 89, -211, -19, -124, 104, -54, 17, 238, -202, 148, 149, 7, -11, 38, -88, -87, 92, 29, -40, 142, 270, -154, 304, 45, 109, -330, 267, 113, -156, 1, -259, 149, 42, 39, -100, -36, -16, 153, 250, 32, 133, -105, -22, -15, -107, -243, -44, -25, -106, 2, 117, -237, 239, -193, 93, 100, -77, 13, -110, -20, 52, 95, -104, -147, -174, -318, 18, 36, 229, -33, -10, 54, 48, -37, -22, 44, -305, -7, -191, 418, 61, -483, -8, 83, -76, 1, 135, 89, -84, -135, -21, 30, 47, -87, 57, -65, 223, 32, -40, 101, 142, 163, -50, -18, -32]
6726c2n3J23p9K17O2k04Q9j25o8J47k36K53j54k1k03K74o9L25j62m7K41l42l4
6749i8K5J61J38m58L63L7k61Rl0J53K8p7p5K16o0j42j5L69l69L6Q0K7Q8m26J83
6774i8K52m51K26M9J64q2n9L10l06n2J15%l27J33K33j61m1Q7Q1q6J91k05J77k23
6798g3K22o7K4m1M2k25J99l6k17l9L84l72J84o9J33l12K47l2N1J08j00P5j08J8
6822dJ16j2j36R8j90R8n5J21l2j84j9q0L36j61J03J39o3l4j9l23L13O7j46J66
6846I9P0j02L1j47J61k85L02N7l73K04j33r9M20l42J06K9N0ro7j09K36n2j18j8
6870h9J50J7n4k06J26J86j72j73N1N9L1m4Q8j2r0j5K67k41L3ML16j04P5k86l4
6895a17J68Pp2J8k83L44o6J45k29N8L70m11J96N0k83J04R0N5m25M69k56N2o3M
$$ y = [-32, -85, 38, -41, 176, 238, 34, 123, -2, -70, 77, -159, 94, -60, -81, -284, -10, -79, 246, 84, 37, 278, -64, -98, -73, 88, 226, -232, 131, 168, -93, -84, -114, 39, 67, -10, -85, 131, 71, -71, -86, 283, -86, -50, 30, 57, 145, -281, -98, 154, -297, -71, -22, 142, 60, 1, 311, 5, -47, 68, 68, -259, -126, 107, -54, -95, -8, 73, -13, 178, -27, 150, -73, 149, 82, 106, 65, 107, -118, 81, 45, -172, -211, 173, -199, -15, -84, 49, -263, -16, -48, 3, 111, 11, 86, -22, -4, 112, 100, -36, 62, -128, -30, -85, 36, 4, -180, -199, -279, 57, -104, -1, 138, 75, 41, 22, -301, 12, 79, -67, 99, 169, 67, 98, -49, 112, -173, 129, 186, -187, 17, -116, -215, 205, -137, -31, -2, 48, 39, -28, -137, 99, 47, -71, -89, 61, 78, 24, -182, -56, 130, -42, -215, -164, -105, -74, -118, -30, -42, -132, -147, 120, -121, -88, -84, 232, 128, 203, -83, -117, 51, 58, -14, 4, -279, 65, -1, 144, -85, -27, 343, -68, 128, 178, -105, -1, 89, 144, -281, 188, -68, -16, -79, -75]
6919g5J09k20K47J57o6l55K8L43j37j56J79j22j6K15j45r5K48L9k75J38N1k8j08
6942d4j9N1K71o9l68j55K14J25j12Q7J30j47m03M58k05K76j21R9j30p5J49Rj75
6965a54L97l91J69K35n35L52k8Ml1R3Rk41J88k0k00m7K29J22J0k86o7K01j22j46
6989b59nK11M4J88k21O8J70m20L56k31n3J22K5K0J2o1L2J76k23j43K35K34k09
7012F8j28K92l13N1L4k71N03j45j76j51K31qNr2oK31j0n0l98N06j89j90K72L7
7036A03J42j41k65m6qK10jj17J94k10J71j19K6K17l07%k7N2K97k17K01j15Q2L9
7060A61m88K12m2K48J20j07j34N1L7J05o7j35j48J15K3J1j07k7j58K04K67l13
7082a72L24l59L18j36k53P18l33O8R5o6m68K08k01J23l14K02o6M64n5j86L5k8
$$ y = [-75, 34, -186, 61, 218, 152, -203, -175, 168, 31, -125, 54, -68, -84, 131, -14, -109, 139, 178, -97, 41, 92, 64, -44, -63, -12, 259, 190, -178, -333, -119, 6, -106, -19, 111, -36, -439, 19, -186, 90, -31, 68, -62, -137, 12, 21, -154, 243, -148, 21, 256, -279, 73, 45, 49, 18, 111, 120, -121, 67, 47, -153, -200, 29, 151, 161, -125, -192, 9, -113, -259, -264, -53, -9, 179, -42, 26, 196, -224, 132, -99, -152, -30, -5, 15, 27, -34, -2, 174, -49, -192, 43, 277, 68, -60, 232, -81, -30, 4, -267, 236, 91, -85, -236, -5, -13, -8, -100, -106, 125, 115, 65, -333, 173, -16, -206, 66, 103, 245, 104, -161, -207, -215, -5, -6, -123, 71, -139, 32, -87, -61, 156, -151, -151, -178, -126, 171, -46, 155, 40, 122, 161, -327, -115, -157, 91, 211, 104, -30, 21, 58, 163, 96, -39, -187, -72, -49, -38, -145, -172, -330, -126, 141, -172, 152, -207, 111, -25, -278, 440, 107, 175, 270, 204, -264, -56, -257, -134, -448, -246, -312, 152, 97, -89, -54, -82]
7104h2J51k5o1J59j94l2K52j64R5N0j04j54J43N5j55M5n0P2k35K8M91m49K55J82
7128B73r4Mo64K78K04K2o9J8j03L95l50R8R6K5j11K6pl13L48j38Q0P8k05J47m1
7153cm5L33j36j02k56J82j46K1K39K00l63R9m8k0j33K58mO5k62L16j69R7j32J30
7177A21j09J5j67L87l70lJ56J17j73J96r7K2l8K9J74l41J39K13k94j06Q9L99l09
7200E0k69N3j60K75m0K04%n2K5k55J11n7j7P8N7K61l04j36J40j0N5j7q4J98j51
7225d5k72K12K97o9J70k52k81K43r8oJ17j77J77L05l80k69K43L5n2j53N6L4L70
7248B05l77KL70m1j11j00L7Q5k14J76o8M56m90O2O1M7n2j44j30K43P5o5J59J5
7272B01m5j52K9k0N8n3J97j71J78m5n1j76l5L79k85k8r7J40q6R9j89J87J07k95
$$ y = [-82, 69, 44, -17, 142, -52, -84, 168, 4, 99, 149, 45, -109, 34, 89, -66, -21, -71, 1, -234, -206, 285, -164, 91, 273, 179, 183, -481, -203, 1, 23, -46, -28, -131, 264, -86, 12, 108, 133, 22, 48, 41, -272, 76, -62, 18, 96, -109, 38, -3, -48, 285, 149, 47, -209, -27, -173, -152, 87, 287, -76, 23, -25, -45, -178, 80, 76, 141, -121, 195, 26, 123, -9, 121, 12, 27, -140, 247, -123, -126, 30, 147, -26, 170, 73, 95, 57, 86, 260, -81, 58, 271, -23, -129, -40, 359, 50, -219, -166, -326, -51, -91, 113, 113, 61, 86, -169, -58, -115, -132, -54, 3, 264, -40, -176, -36, -46, 9, -8, -92, 106, -45, -317, -105, 192, 123, 293, 41, -240, 3, -95, -101, 16, -161, 16, 321, -59, -328, -85, -50, -102, -255, -199, -165, 205, -172, -170, 200, 159, 48, -52, -15, 70, -144, 32, -36, 420, -70, -8, 53, 100, 48, -96, -226, 17, 92, 27, 186, 201, 156, 4, 33, 13, 71, 18, 215, 44, 222, 177, 126, -50, -85, 294, 9, -19, -116, 24, -62, 37, -152, 35, 142, -153]
7296a53J51j73J31M1M4L4j36O3K94m43O8J53j36k9L15j21r4r0j52K07N3O1l9j92
7320a43J96J48j75J00j68j11P7Q3k59K03l2K07n5n2K3q9L9p2k4J98lm05L60k73
7344b27K50Q0j83J25j51K45k03J45k5k19L29j74j3j9j62K30P3j06pJ63k64K79
7366A66k95M81m61l2O5J08K5j77K3L19l88K59L5j19J69j4k43R4p9J3J33oo1j61
7390a46N39m12K22k26M6l24L62J17k19km2K47k55K76k28j9J97m1p7m7l3J70l97
7413b92K92J93k73N9Oo2J42j89m1K79k67j47J26K49l7q9M3j48N2J14N9K35j67
7436A37k3J59k92j03J35O9o0k12J21n5J83j46j6K27o6J78k16K43k43r5j49Q8K09
7459G3q9M13l58j26Q1j29j39K82k07L05l21K93P9n6j18L7l2J44m15M06j60n8M2
$$ y = [-153, -2, -175, -44, -3, 41, 75, -61, 2, 296, -147, -79, 74, -62, -91, 224, 103, 9, -81, -233, -26, 27, 88, 49, -143, 53, 201, 26, 126, -42, -153, -76, 7, -252, -49, -81, 126, 71, 19, 42, -47, -8, -80, -104, 94, 91, -314, 46, -227, 23, 103, -80, 45, -106, 139, -64, 81, 56, -163, 166, -8, -21, -40, -202, 28, 101, -5, -12, 151, -113, 166, -129, 352, -109, -141, -76, 32, 57, -120, -97, 222, -166, 93, 128, 9, 178, 164, -79, 15, -64, -51, 82, 76, 15, -146, 393, -19, 203, -23, 23, -301, 61, 178, -41, -43, -85, 162, -93, 183, -45, -64, 133, 92, 15, -32, -65, 105, -292, 0, 193, -80, -21, -15, -77, 65, -124, -165, 114, -153, -300, -174, 75, 38, -51, -8, -156, -104, 10, 69, 304, 137, 114, 273, -19, -122, 13, 82, 22, -190, -69, -124, 59, -87, -103, 124, 58, 236, 20, 263, 20, -75, -224, -136, 73, -16, 397, 39, -87, -6, -135, -274, 8, -199, 106, -215, 78, 157, 101, -17, 20, -12, 132, -283, 123, -37, -95, -53]
7482e3L7J51N8j50o6K9o4nj53L51n36K58lK98j05l12K15J25l1r1J67%K19k36j67
7507f4J43J7j61J22N9k74N6K96j99P4J2q8M5rr6J86k32R5L3L4j08k00L64m1j09
7532d5k74J15J54J09m1J3p2j13J27r0J06L63n12J40M3n9l9j19N1J98k33kM5J29
7556fK00k49l02L88j98K40j52j03L14Q0k29n5Q5M3Ln4k8O7n5j08J94k26J21J29
7580I9J29k63l18L83J33j95q2J07m7J01L7j00k25N9OK98Q0j77P8j97J64l23K91
7603C8J87q4p9j16k66K10k2O9J97lj59J76K7j51K5o7K1q5n0K47K8k20p0K42j96
7628a01j73J11K35K9l43L28j91N3j24K2K32j93K18j05l5n6J33qQ6M5k38j98J90
7651h3J24n8K34l44J82J35K8o5k27m4J85lr7m6K8k3j62J63R9K37k83j20J22q0
$$ y = [-53, -16, 135, 193, 43, -23, 6, -58, -63, -216, 135, -401, -143, -146, 152, 47, -265, -50, 75, 44, -47, 120, 120, 339, 103, -64, 79, 96, -65, 57, 116, -158, -102, 194, -5, 69, 81, -7, 38, 29, -67, 119, -113, -18, 15, 49, -59, -259, 105, 64, -45, -319, -204, -50, 59, 18, 31, -41, -154, -27, -117, -11, 352, -160, -20, 23, -36, -75, -194, -143, 55, -178, -180, -135, -6, 194, -55, -357, 31, -167, 73, -79, -182, 132, 212, -17, -72, 13, 56, 59, 5, -23, 44, -11, -119, 75, -151, -30, 99, 228, -35, -353, 30, 163, -32, -114, -7, -54, 47, 84, -16, -241, -182, -176, 122, 202, 25, 103, -94, 70, -253, 38, 225, 141, 62, -54, -320, -110, -132, -63, 134, 131, -28, 148, 175, 24, 49, -18, 3, -82, -132, 115, 143, -77, -147, 95, -101, -274, -163, 72, 101, -242, 86, -105, -52, -176, -154, 78, -115, 103, -2, -37, -93, 40, 32, 118, 163, -75, -273, -83, 41, -17, 217, -127, 55, 190, 218, 153, -74, -118, 67, 64, -33, -79, -51, -74, -236, -73, 26, 263, -20, -140, -18, -98]
7675i8J4N3K20j79k20J8J83j99K88j07o2J8J88O4j35k78K56K32m33J34K13j88
7697a8J3QK7J9Q4m00L92l84L86r4j5Q6j55k26R5J15l0J90k21J67k2K9m8L9%k11
7723a74K50J9k04l3K48P2j9j14k30J74o1m8K61l75J2k0NK48j07J91jj54J53N4
7747A47r8l10M89j54P3K9k02J66q0j24l4K26j65J33l71M23l28J61n9J75k11L8
7769g6J1n8J1J82k74O2L06j32j79p9K01L6J03k22m7j25M44J35k11l48J99J79k49
7792a31K27j00J68k42p3M76o18L73J4m0j74J47J5R4n9l03J71L76j60l1k08J23
7814D5j2Qj35kQ6j43K18L8k50k9J94n4O1J23j14l6J08j05Rl7rN0j4J01q2j67L
7841a45M00l06J02l6jJJ50k36J65j57L1K53k38J53k49J06J24k69K11l0p2j46P9
$$ y = [-98, -84, -31, 189, 10, -210, -192, -9, -208, 80, -27, -89, -71, 117, 181, 46, -232, 24, 256, -177, -43, 170, -18, -5, 3, 30, 49, 133, -267, 125, -259, 127, 33, 18, 104, -51, -277, -182, -67, -97, 93, -128, 39, 17, 46, -2, 37, 37, -174, 76, 95, -109, -142, 106, 178, 159, 45, -185, -11, -72, -120, 141, -234, -222, -242, -237, 11, -96, 95, 94, -60, 93, 147, 49, -261, 228, 74, 147, 176, -26, 140, 60, -64, -98, 128, -37, 96, -275, 148, -180, -19, -78, 97, -114, -76, -65, -123, -112, 70, -204, -142, 164, 32, -147, -226, -25, 11, 114, -108, -155, -280, 164, 299, 88, -260, -61, 118, -131, 96, -4, 164, -78, -151, 325, -293, 80, 94, 54, -120, 27, 42, 136, 77, -226, -55, 321, 161, 130, -78, 45, 33, 41, -94, -96, -10, -153, 65, 103, -147, -176, 18, -36, 25, 148, 34, -2, 106, 1, 10, -27, -36, 14, 0, 101, 19, -148, -145, 255, -51, 51, 15, 14, 15, 165, -71, 94, -63, -32, 221, -17, 136, -113, -7, 117, -152, 59, 29, -43, -189, -110]
7864a10p2J72o5Rj29K46k34J88r6J03J4J97k74P2k70L60J6j75P6j04M1M9j56K76
7888A34j35m9M4J1o5n0O7n2N7R2j57J46j89K94j9k32K32m26K90n8J74k04L37M8
7912B90k48j47J54oj5k24K66r6Q0r2L0J10q6j54J52M4j72J43p0N0L1P8k83Q0K14
7937A29nJ4J41k64N5j93L4J50r4J16Kk84j60L16q2K49k54n4K77j03p8Rn2P5L39
7962B83j40j59K62k79n6k4K22q8K00l7n11J93K16k07K51M0j02n1o3K56m27J5J98
7985hq1k4J55J69j25p2p3O3j84L0K5j11J20l1K57l20MK00J69j68L1j01L6q4J23
8010@m7k72K74o9L06j59j90J69J35j41kM4j28O6jL57l85Q7p0J01j23o2J76L8l8
8035F6j14q0K36j40J32Qk68J97j85J70O7o1k1P6k48j45L04M4k2k7j04O5J2r2K03
$$ y = [-110, -182, -10, -75, -66, -195, 51, -183, 5, -91, 12, 26, 223, -51, 21, -249, 111, 127, -48, 28, -76, -35, 14, -142, 134, -1, -50, -6, 5, -60, -110, -43, -95, -38, 54, -103, 43, -146, 148, 129, -103, 129, -297, -7, -65, 109, -95, 242, 290, 42, -105, 49, 43, 28, -196, 70, -26, 54, -38, -8, 102, 16, -138, 14, 58, -114, 29, -41, 9, 40, 118, -165, -85, 129, 124, 138, 279, 15, 70, -123, -89, 61, -33, 83, 85, -199, -359, -43, -125, 124, -130, -184, 93, -10, -88, -79, -131, -56, 283, 143, -16, 246, -33, -89, -113, 109, 21, 221, 184, -327, -134, 82, -125, 126, 166, 64, 13, -50, 206, -221, -206, -8, -89, -113, 42, 211, 86, 14, -59, 4, -180, -150, -125, -236, -116, -147, 110, -210, -206, -6, 163, -5, 26, -75, -39, -123, 0, -47, -319, -45, -114, 192, 33, -157, 12, 147, 6, 4, 48, -80, -14, -15, 342, -43, 44, -26, 75, -48, -110, 66, 104, 66, -48, -128, 108, -32, 100, 108, -160, 37, -148, 22, 89, 28, 7, 83, -165, -310, -6, 38, 16, -11, -115, -50, -38, -130, 73]
8060G3o6L1R0j37O4k24J27K95k12j16q9P6Q7r4J05K08k26O8N4p0k20ML4K04j59
8085i3J87J01L1k93J31j85R0L29r0k12l84O50k73J44J09k17M6qK5j5k14P6p7M36
8109B94j06j84j6j91K67k69Q9K06K0L5Q6j69P3o5O6p3K51k07k39K87j56p0J25
8132E4j45o4K71k58Q1L16j07j89K49k74r9K01k6O1m0P2m7p6J00m5o9J12J81k20
8156C9M1m6K6J20n43L64M9q7K68l06J44k21r6K55J25j10L19m25R1j40R4p6J66
8179E1k24N4j65M69r2j43n1J5K94l21J80J7
$$ y = [73, 7, 38, 128, -9, 55, -169, -42, 253, 41, -75, -164, -88, -1, -95, 10, 218, -8, 60, 114, 44, -176, -172, -138, 66, -93, 94, 195, 226, -67, 64, -121, -31, 298, 208, -4, -388, 262, -11, 133, 242, 25, 71, 63, 88, 73, -141, -65, -142, 294, 188, 4, -12, -203, 64, -205, -116, 90, 110, 145, 231, 62, 135, 70, 136, 63, 314, 107, -132, 155, -1, -71, 54, -91, -155, 116, -142, -61, 255, 148, -41, 208, -66, -165, 36, 10, 71, 31, 103, 56, -20, 80, 35, -34, 78, 259, 39, 80, 34, 60, 180, -363, 1, 50, -37, 231, -75, 69, -152, -248, 7, 132, 22, 341, -84, 7, -133, -39, -115, 51, -173, -119, -284, 185, 93, -50, -101, -86, 208, -113, 67, 84]
8191H4
$$ Imaginary data points
##PAGE= N=2
##DATA TABLE= (X++(I..I)), XYDATA
0@%%%%%%%%%%%%Qj6J6j6K4l2L2m0N0n8P2q8J04j20J37j61J86k10K41k76L15l59
34a91M06m57N15n78O44p18Q03q94R91j097J212j342J484j635J801j986K190k411
52a263K656k932L239l582L972m418M934n536O256p135Q229r641J1537j4236J8427
67A0507k5877M3163j61987p7158K05297K959n0404l3068J06039Q9950L626o3441
79D9606k795L9879K9933n2609n8013k7330j6953j7110K1567J8789j0309m7867
91g3212k1648M7368N8460j5094m3724J1182R0231N9955n8167p9007L8571J03173
103A18088K3667j00397j00631J8983O1072l2091j02647m6250P3293Q8458k1799
114b0254o3581L0814J07613P0490k1265m2467J7278L0792l4645p5186m5537Q338
$$ y = [0, 0, 0, 0, 0, 0, 0, 0, 0, 0, 0, 0, 0, 8, -8, 8, -8, 16, -16, 16, -24, 26, -32, 40, -48, 56, -64, 73, -88, 98, -112, 129, -147, 168, -191, 215, -242, 273, -305, 339, -379, 424, -470, 521, -576, 636, -706, 778, -857, 944, -1042, 1148, -1263, 1393, -1539, 1700, -1882, 2090, -2328, 2606, -2930, 3326, -3809, 4420, -5221, 6316, -7920, 10507, -15370, 27793, -134194, -211352, -6055, -3096, -53500, -86568, 19471, 109421, 113047, 49606, 46811, 86690, 116623, 64014, 6001, -21329, -38282, -55392, -33825, -15036, -25345, -73212, -94860, -47492, 10968, -4126, -47850, -36668, 53563, 113518, 55351, -23656, 14915, 118088, 141755, 41358, -59273, -40290, 20782, -11309, -113956, -160206, -86913, 1545, -20254, -83835, -53021, 54592, 125082, 103817, 61350, 78628, 109420, 74775, -411, -45948, -37610]
126c7610N211m7631l7990K5610M0354J2882M091L7704O7197K0868l8117j9721
138C2848K7419K3599l3287o9272j6484L7227k828n8015l7070L8199O6060q84n3312
151d5800m452N6544M1827k2240m2725K2195O3509M595n4235k9382L0916L7238
163E7990l0345o3599j1854K8935l89m4997l2927L6513N9342L683k3735J9027N9299
176E6943L7826k3600l0960J8468J9885l5965o7990l8171J6050J0757l8835k9628
188a05220L0660N4327K0798j3993J2900O2527L9147k3987l7461k596K1373j5820
200D2655o2795l4023K1064J6625k6861l7638J3635N6445K2705k5527r159L5287
212A2413M0998q494m1000R61M2102J2129l6971l6695J0943L1623j5695m8994j4069
$$ y = [-37610, -32399, -80030, -118020, -92410, -52056, -39174, -35083, 2621, 69818, 90686, 52569, 32848, 60267, 83866, 50579, -18693, -35177, 2050, -778, -58793, -95863, -57664, 8396, 7512, -45800, -50252, 6292, 48119, 25879, -16846, 5349, 68858, 73453, 19218, -10164, 20752, 57990, 27645, -35954, -47808, -18873, -19262, -64259, -97186, -60673, -1331, 2352, -21383, -2356, 56943, 94769, 71169, 40209, 58677, 78562, 42597, -25393, -63564, -47514, -36757, -75592, -105220, -74560, -20233, 565, -13428, -528, 61999, 101146, 77159, 39698, 37102, 58475, 42655, -20140, -54163, -33099, -16474, -43335, -80973, -67338, -10893, 11812, -13715, -22874, 12413, 53411, 44917, 3917, 4878, 46980, 59109, 22138, -14557, -3614, 28009, 12314, -36680, -50749]
225e0749K5144J5446k6655l2850K2001N0547J3189j7442L920M2205L5890j8626
237F2020l5409M244J8492j5910n3253m0374J0949J7411k3355k6335J8057N0870
249a2593L0498j2027j607M1445L6436j0549l7115j6831J6906m804m8284l6982
261e5507R049K3858m185k8067K414M3902K8311j0942j3647J8210L4881j221l7176
274I880j2973K3680J3705k3343l4272L234K9434k865l4281j5490K1163K5808j2957
287i277l0145R769L9874J6966j5502j1106K5867L2546j0881l4514r679J4019J62
300A8099l5730l6569N269K1546n290j8153O525M0432L3793m654q244K1975K6511
313F5510m668l4512k3798Q956nl5053l4037K089K6492Q361j9683N01L7272L2547
$$ y = [-50749, -25605, -10159, -36814, -69664, -47663, 2884, 16073, -1369, 2551, 44756, 80646, 62020, 26611, 30855, 49347, 33437, -19816, -60190, -49241, -31830, -55185, -81520, -63463, -12593, 17905, 5878, 4271, 45716, 82152, 71603, 34488, 17657, 34563, 29759, -18525, -55507, -46458, -22600, -26785, -54852, -52438, -8536, 19775, 8833, -4814, 13396, 48277, 47056, 9880, -3093, 20587, 34292, 10949, -23323, -20089, 9345, 6480, -27801, -43291, -22128, 3680, -9277, -39422, -29653, 10221, 27187, 11685, 579, 26446, 58992, 48111, 13597, 3918, 17937, 18099, -17631, -54200, -48931, -27385, -32675, -50828, -44303, -3871, 29922, 25268, 17024, 38999, 65510, 60842, 26330, 2532, 11488, 11483, -23570, -57607, -55518, -29026, -20665, -40348, -39847, -2575, 29972]
327B9972j909j7390N487L0333M689l2903k4002Q282J5530j2975l4000o438K4797
340a0527R811j8572j7392J3002K8604J506k1463J84K6815J9275r270j6497J1625
353A7101K4342m669k7982j5337P642N383k4667l0343L012K1389M246j3185l32
366c3400L2815L3110n73j1674R452K2196K357l1208k8625K905O090k0776l1138
379d8469p143K3753J7874j0290m794K4351L1753Q094j5984n070K0016Q012k2590
392A9513k5779k191J3229m520k5932q544J8111J4885p603j5249P424K5657N134
405A4135j6475n884J7014J8331o708j9795L439J9651J300k1084j8067N809J2215
418C881j2758k5538k001J9175J2753q601q088K0980K8870L954j3208k666J4807
$$ y = [29972, 28063, 10673, 16160, 46493, 51182, 18279, -5723, 2559, 18089, 5114, -28886, -35324, -10527, -716, -19288, -36680, -23678, 4926, 6432, -15031, -14847, 11968, 31243, 21973, 5476, 17101, 41443, 36774, 8792, -6545, 1097, 6480, -18187, -48530, -45518, -24129, -19883, -33068, -33400, -585, 32525, 31952, 20278, 29730, 51926, 54283, 23075, -5550, -2645, 3445, -17331, -48469, -55612, -31859, -13985, -24275, -29069, -4718, 27035, 35129, 19145, 14075, 34091, 42103, 19513, -6266, -8457, 4772, 252, -25680, -34224, -16113, -1228, -8831, -24080, -16656, 9001, 14135, -2340, -8224, 8790, 27121, 20413, 618, 4057, 23708, 25008, 3924, -14143, -8334, 3881, -8877, -34415, -36416, -17241, -4488, -13089, -21177, -197, 28673, 32627, 19419, 16753, 31560]
431C1560P747k2658k8210l428P430p155k2315j0022J9863K0988j797n254J4817
444A566K6441J1333j4694j1177J0290O736j5968k5833q725J1484J632j8629r223
457c4767J4805J9429J413j2365L051K2328J0074j2109j1910P320J6479m263k0362
470h77m843J2740O278j3869j8916K204J4622k826j7602n490J5312J7315l044r566
484h562J1348K3064P160j1663r760P679Q279j5534k5269q634O534O96j5795j0798
498d1255J5611K1512M626m114P490K2156J3163j1222j3898L205O006j0407k4119
511a1246j2843R006N643j2031r827R006K0352P653r675o32J6814J2029o835j4247
525C167M68J3362m9j7103r425P114R397o781j6581j247J3436L220j1520p838R045
$$ y = [31560, 39307, 16649, -11561, -14989, -7559, -14714, -37029, -47051, -27188, -6200, -7997, -13251, 1566, 28007, 39340, 24646, 13469, 23759, 30495, 14527, -11306, -20031, -8547, -6915, -25544, -34767, -19962, -533, 880, -11485, -8434, 13894, 23968, 11859, -51, 7269, 23748, 19485, -877, -5720, 7020, 13298, -571, -19487, -17283, -2661, -5487, -23089, -28579, -13267, 4048, 1004, -8562, 2786, 25850, 33010, 21347, 11587, 19266, 27545, 12011, -13258, -21892, -15358, -14662, -30457, -41255, -25644, -4132, 494, -3620, 3870, 26026, 39189, 27967, 14069, 17274, 23280, 12873, -11246, -24089, -15083, -9440, -21471, -31298, -22292, -1940, 5713, -3962, -4594, 12220, 24249, 17414, 3167, 3635, 16997, 16948, -155, -9580, -2466, 6931, 150, -16431, -17678, -4242, -1022, -12542, -20380, -11335]
540a1335J7372K29r642M309J6569R482q429j2603L515Q607r257j9816j0321N970
554a5350N544j0152j0655J0261J9771P932m582J143J6399J2739q802j4610k856
567F782N230l819j9744j3616O523R013m346q302M373J8819J0954o238l773R643
581A1499J1293l415j5621n718R129J838j2225j1074K977J1121m61j2496k026J1747
595c432Q046n799r285M917J4897K607r041k662J0224R253o062j3666p35P624k712
610D174j4797j1145M931R702l923q761N342J6628J0961l055l573R982J1216n177
624B2505j4395p769K953Q3j5321j3419L225R938K023o263J520J6147J3216k811
638A1632m841M227R423J48j4314r441M451L157p847j1686n40J0630L533q292l368
$$ y = [-11335, 6037, 6266, -3376, 933, 17502, 26984, 18555, 5952, 9467, 18074, 8817, -10999, -21320, -15350, -9806, -19958, -30613, -20352, -581, 7351, 2769, 3912, 20311, 33050, 24248, 9638, 6782, 12012, 8193, -11551, -25167, -18644, -9631, -13977, -22279, -17906, 913, 11867, 5629, 1856, 11499, 22792, 19377, 3756, -1962, 7167, 9005, -3220, -14294, -11317, -196, -657, -13153, -15179, -3432, 4614, -1185, -10470, -5553, 9344, 11951, 2910, 248, 10472, 19725, 13663, -3, -738, 6886, 4174, -10623, -21768, -16837, -7135, -11058, -19819, -14477, 2151, 13112, 10057, 6484, 16466, 27682, 22505, 8110, 341, 3294, 3377, -11944, -25363, -22138, -12200, -10177, -16440, -14920, 1227, 14443, 11632, 6791, 11018, 20441, 20589, 6275, -3166, 1285, 4442, -3405, -15091, -15631, -5001, -1468, -9760, -13128]
653a3128Q563J0202j163q607R38J1839M317o615o321N087R127k767j2463l710
667d701N738J413r392j1196K332R887K36o793J102J2484J1898j485n454N023R221
682B0313j174j1852j0320J528K686r659j2212L66R091N888l972j295J2013J2486
696A3887J74n704p20P363J445j1543j0329Q39M239l215j0151k468R932O661m057
711c647l861N221J0283K062q752k883P826M748n136q612O28Q651nr709m821M784
727c223M875m128r964P95R336L096m851k379Q085J0726L92p211K31O521J594r776
743D119j0974R8L909m944q801j769Q240Q619r68k233P874J1467K739o483m237
758F656M089K442r363j1083k288L948J09p588l857Q503Q650K64l495K189J0253
$$ y = [-13128, -4565, 5637, 4474, -4133, -3195, 8644, 12961, 6346, 25, 5112, 14239, 11472, -991, -4701, 1037, 2450, -6942, -18138, -15806, -5919, -5683, -12476, -11374, 1110, 13008, 11523, 6069, 11092, 20313, 19139, 7287, -3033, -1505, 1181, -8478, -20690, -20324, -11233, -5345, -9317, -10612, 1401, 13887, 14061, 8357, 7637, 15000, 16445, 4902, -5427, -4588, -349, -3564, -13715, -16183, -6251, 410, -3647, -7508, -2287, 7996, 10058, 1306, -1577, 6249, 10997, 5861, -2751, -2123, 6528, 6523, -3186, -8007, -3223, 1652, -2476, -12440, -11645, -2309, 787, -4064, -6443, 1642, 12368, 12760, 5549, 5780, 12301, 13895, 4119, -6855, -6757, -2848, -7792, -16593, -18362, -10122, -1503, -2471, -4704, 3170, 14637, 17376, 10893, 6656, 10745, 13187, 3824, -7259, -9547, -5599, -5490, -13078, -16935, -8432, 218, 482, -3013, -824, 9429]
773I429M071o927n264L542M933l417r229k675O409J969o366o006K039P093l29
788g28q188q27P703N697k222m233M407R627J438o288k919L633L272o857j0717
803g202k072M246r95o534l605O472R607N86k119M397R241M604n111o361K195K702
819A0051o518r930m881L859K597n325m222O099Q593L119l154J80P416M991m956
834G919o725L18M427j157q071m179M604L814k735n873M46P270K424n883k505M800
850a106N970m22n567P97P352K457m752m703J522M300l344q924k444L338K351l787
866f962m130M247Q888K355k415P78O013N554m245p225q09K440k917q732n416L118
882i458M659k077l413L421Q861N509k709k202N148M750l105p439k919K876M49
$$ y = [9429, 13500, 6573, 1309, 4851, 9784, 6367, -2862, -5537, 872, 2841, -3525, -9531, -7492, -399, -728, -8916, -9743, -2040, 3657, 1435, -2798, 1609, 11236, 12674, 6386, 3467, 7100, 10372, 3515, -7202, -9274, -5028, -6023, -12557, -16162, -9690, -83, 503, -1616, 2781, 12022, 16626, 11515, 5154, 7349, 10051, 3533, -6397, -11278, -7419, -4822, -10147, -14369, -8270, 323, 3442, 288, 468, 7884, 12875, 7919, 1194, 1512, 5939, 4782, -3289, -7468, -2864, 950, -1785, -7658, -7212, 58, 2482, -3401, -5906, -1106, 4864, 4442, -1125, -328, 7024, 9481, 4729, 26, 1548, 5848, 2504, -6420, -8864, -5526, -3175, -6962, -11092, -6845, 2043, 4398, 1983, 2761, 8774, 14328, 10083, 2858, 2049, 4489, 1572, -7160, -12576, -9458, -4799, -6876, -10289, -6868, 1993, 7502, 4793, 2591, 7739, 12489, 9384, 1945, -974, 1902, 2351]
897B351o594n694K582N290K85m493q27P236M265k812l118J908O086Q39n741j962
913c99M219L297l459n866o16M364o67o271l814K636M391j216m014K227Q306L345
929F463j560j550L727N524k643p580l009J617o96o519o283J830N392K12k364J419
945f020P222O750j079l237L022M026j044o490n492J905J609m925n248M64M825
960c712K595l170j783N523N361m44m165l62N524J571m906l316K259L419j097n976
976b679j524M163J329m366m305J315N306L11l974M09N678M806j166l422J887M988
992H756j121o137m097J020J788m356n929L20N590K268j703k87N416O712m01l603
1008D236K68K813K54n755n932P06J998k247m666m38N141L857j474j599L579N373
$$ y = [2351, -4243, -9937, -7355, -2065, -1780, -6273, -7100, 136, 4401, 1589, -1529, 379, 6465, 7304, 1563, -399, 3820, 7117, 3658, -2208, -2824, 1540, 873, -5398, -9212, -6576, -2185, -3401, -7415, -5188, 3118, 6463, 4903, 3353, 7080, 12604, 9961, 2381, -628, 989, 293, -6226, -12509, -10679, -5287, -5075, -7439, -6020, 1202, 7952, 6873, 3636, 6658, 10684, 9640, 3150, -2342, -437, 1172, -3753, -9001, -8537, -3712, -1117, -4287, -6070, -547, 4814, 4370, 205, -157, 5367, 6938, 2032, -1284, 975, 4394, 3297, -2679, -4203, -40, 1289, -3077, -7382, -6067, -761, -450, -4424, -4015, 1663, 6469, 5303, 1881, 3768, 8756, 7635, 1498, -2599, -1579, 209, -4147, -10076, -9756, -4166, -1898, -3601, -3888, 1528, 8240, 7839, 4236, 4504, 7317, 7571, 1816, -4116, -3410, -1412, -3659, -8325, -8763, -3622, 235, -1239, -2838, 741, 6114]
1024F114O80l970k369L542J821m113m041m15L580M14m953k207L642L162j988l750
1040d851M12N336J805l125j296L543M426k71m154n62L615L06m544m876l94K814
1056a816j963m523j88M343M237l92j259L793O127P85l660j748J807R27m981o331
1072d842j038J968j82l598j560M534N614l41j411K077M962J854l301l412J766
1087C090J823k583m752j841L230J187l391k668K394L453M33l278m00M327K345
1102C369j718k243J431M524N08m111j879K735J177l097m965p63L061j21l842j224
1118g158L277M488N50j841K054N022J881k900l385O08J859l057n739j976K078
1133d239J170j940k427L431N427J090j412J96L713K890k932m208R4J677j077m011
$$ y = [6114, 6794, 2824, 455, 3997, 5818, 1705, -2336, -2751, 829, 1243, -3710, -5917, -2275, 887, -1101, -4851, -4439, 897, 2702, -423, -1719, 1824, 6250, 5979, 1825, 1263, 4878, 5184, 640, -4236, -4630, -1816, -3779, -8302, -8490, -4147, 90, -302, -1561, 2232, 8359, 9144, 5484, 3736, 5543, 6470, 1489, -4842, -5880, -3912, -4094, -7692, -9252, -4718, 896, 555, -856, 1221, 6183, 8037, 4736, 1324, 3090, 4913, 2330, -2422, -4263, -1033, 154, -3237, -5905, -3511, -58, 375, -2903, -3303, 1024, 3369, 1651, -592, 839, 5363, 5871, 1760, -119, 2616, 3793, 696, -4269, -5032, -1971, -2092, -5934, -7158, -3881, 607, 1157, -684, 1370, 6392, 8273, 5373, 1988, 2596, 4455, 1398, -4341, -6317, -4239, -3069, -5009, -7436, -4005, 1422, 2512, 1100, 1296, 5009, 7899, 4967, 759, 853, 2530, 1453, -2558]
1149b558l175K597K485j605k309J270M204J558k456j588K978K948j488l028l41
1164e08L681R80l733k379J367K376j420m149j260K965J395j999j962K068M797
1179B219R67k157M86L588K148k568l819p93J656j687m365k803J708K499n36k184
1195e641K491N263K281j112p44K354K838k424m164j641Q66k4l647l422J545L126
1211b055k10j769O00M141L007j864j692J468K774r2l300j894K577J535k672k911
1227b357o7K589J33l564j588K315K185q55k196J394M158J698j585o90K276K265
1243F111j625m158j113J337p66l620k783R59K887L77j912J419M292L151k41j958
1259B357J465K389r36m292k453N03R41k954l047P51L277J021j143l73L260L526
$$ y = [-2558, -5733, -3136, -651, -2256, -4565, -3295, 909, 2467, 11, -1577, 1401, 4349, 2861, -167, -508, 3173, 4153, 420, -1959, -592, 1784, 364, -3785, -5045, -2080, -685, -2684, -4646, -2578, 2219, 3186, 1029, 1515, 5103, 7251, 4683, 864, 71, 1727, 40, -4325, -7128, -5420, -2921, -3457, -5641, -3150, 2113, 4394, 3282, 2538, 4892, 7730, 5306, 1142, -499, 367, 343, -3304, -6726, -5181, -2055, -2265, -4034, -3434, 707, 3714, 1850, 158, 1626, 4400, 4308, 1008, -886, 1691, 3226, 554, -2357, -2424, 165, 298, -3266, -4854, -2539, -354, -1209, -3405, -2011, 2147, 3845, 2260, 1570, 3846, 6111, 4486, 328, -785, 552, -214, -3834, -6617, -5658, -2771, -2394, -4306, -2887, 1405, 4556, 4315, 2357, 3822, 6211, 5275, 983, -1470, -967, -26, -2980, -6027, -5276, -1999, -978, -2121, -2494, 766, 4292]
1275D292j056k534K87K389N48l209k529J351J810j069k878n00K521J128k205j760
1291c414J249K987K06k368k84L474J996j621j602N51K767n46l852j990J225Q55
1307c67k233k713L47L326J147r49L39L079L140j92k458L77J680p21l352l240k14
1324c004J679j747k802L72L068K991r75n46K575L023J11k335r92J495O56k910
1340F59l112M92J320k3k497j181K808J862q57j506Q91K499J474k179r94K104K076
1357C836q39k407l74K012Rk943k354N03J054o31k148m01L085J951m60m32K031
1374A492L407M64k386o24J016J11k771l758p46J673n61j924n23K569L065J73j233
1391e56J935L009P11k147j805P76R28k052l079m63J603O43k031j413J948K356
$$ y = [4292, 3236, 702, 989, 3378, 3926, 717, -1812, -461, 1349, 280, -2598, -3098, -577, 551, -1654, -3414, -2165, 822, 1028, -1340, -1624, 1850, 3846, 2225, 623, 1174, 3941, 3395, -457, -2447, -1222, -367, -2600, -5313, -4966, -1640, -493, -1442, -1103, 1976, 5116, 4924, 2466, 2843, 4523, 3802, 450, -2790, -3004, -1325, -3072, -5874, -5502, -2434, 557, -418, -964, 1611, 4634, 4745, 2410, 1418, 2913, 3569, 659, -2453, -1961, -641, -664, -3161, -4342, -1534, 328, -529, -2035, -1144, 1355, 2829, 650, -344, 1760, 3836, 2997, 590, 216, 2228, 2237, -706, -3060, -2557, -1503, -2134, -4282, -4683, -1598, 353, -107, -539, 1492, 4899, 5363, 2977, 2353, 3369, 3480, 709, -3049, -3795, -2122, -2683, -4607, -5130, -2561, 504, 677, -556, 1379, 4388, 5099, 2952, 1147, 1923, 2851, 799, -2280, -2743, -1140, -497, -2528, -3941, -1993, 363]
1407C63K11j526m5K285J644j723j607J138J856jk594q49J575J030k156j995j63
1424b557J617L11k433n14K632J835J16j063Q70L033N46k249r54J10O06j636l135
1441b865j175J407N56q32r80J790L277Q63j272Q09K336J049j923k522m2N77j066
1458a3k795j352J419J756j163q56J675K371J048j221p00J422J793j258j980nJ489
1475A630j82k052j339P07J709r05j779o85K157P04j328n52J423K389M52j455K1
1492I15K299Q61k019j875j46Q10j304k526j251R87J378m49j001J680L309J254
1508B922q85jJ524J014j134l175m98O19m21k671j733J044K159l46j118J056K434
1525G90J746q10j145J079J377p86j867q38R99N88j827j400K95J310J44j643l82
$$ y = [363, 574, -952, -997, 1288, 2932, 1209, -398, 740, 2596, 2595, 1, -848, 727, 1757, -399, -2394, -2557, -940, -629, -3062, -3576, -944, 891, 1007, -56, 814, 3847, 4393, 2144, 1190, 1300, 1906, 270, -2865, -4040, -2633, -2077, -2909, -3889, -2099, 1178, 2041, 769, 1578, 3914, 4963, 3040, 518, 476, 1053, -13, -2808, -4160, -2741, -985, -2148, -3004, -1329, 1042, 2090, 869, 169, 1591, 3384, 2126, 146, 141, 1630, 1448, -604, -1943, -1236, 473, -432, -2211, -2896, -739, -35, -1363, -1915, -492, 1897, 2349, 894, 915, 3214, 4075, 2056, 181, 35, 845, -459, -2985, -4236, -3249, -1871, -2320, -3321, -1641, 1668, 2922, 2037, 2036, 3560, 4574, 3440, 265, -233, 386, -35, -2706, -4439, -3395, -1236, -1582, -2700, -1644, 790, 2536, 1726, 581, 1660, 3037, 2251, 384, -454, 545, 1133, -694, -2094, -1799, -489, -345, -1988, -2370]
1542b370J420J285q02p40Q52J733R75j424n35J736P12r37k027n86J001m45k043
1559b195j329Q22J299J77p59P60K308J864p22o66P39J247r23k678j101M72l9j571
1577b295j850J134J903M93n96K91K079J801m37j662O09P73k32k224j433Q88R84
1594B26j354j298L64J522O56p14j046J631J466m69j048K0J452R89j311j348J017
1611G55P65k67k066j015Q25P48j156j686O54J931Q85j231N24J976J468l49j090
1628A671K7Q88o93k380j483j05N52r65j570R39J970J307k49J16J529J920l57j441
1646A676m21O45J72j993k141N44Q37q03q83j58J325J525m45j070J357J420K36
1663A823r01r34J449R12j183j307J23J358o96j590q88O05O26l81j454R8J586J348
$$ y = [-2370, -950, 335, -467, -1207, -355, 1378, 2353, 929, 394, 2130, 2842, 1905, -122, -708, 293, -152, -2195, -3524, -2702, -1403, -1226, -1985, -1225, 1083, 2947, 2225, 1559, 2298, 3545, 2622, -56, -1157, -685, -724, -2295, -4145, -3011, -1108, -615, -1211, -920, 1159, 2960, 2523, 861, 1470, 2243, 2011, -213, -1646, -758, 226, -1128, -2426, -2062, -540, 116, -598, -1644, -13, 1453, 984, -64, -44, 1408, 2397, 1086, -262, 755, 1520, 1253, -813, -1828, -1003, -255, -1411, -3097, -2443, -512, 373, -858, -334, 1642, 3110, 2761, 1671, 1698, 2586, 1893, -487, -1970, -2075, -1523, -2488, -4058, -3119, -1149, 158, -91, 25, 1554, 3474, 3117, 1676, 1255, 1900, 2072, 79, -2062, -1518, -681, -1484, -2367, -2525, -1200, 325, -120, -1190, 167, 1587, 1823, 922, -12, 1437, 2349, 1166, -141, -18, 1340, 644, -946, -1834, -1229, -603, -984, -2438, -2340, -754, 594]
1681E94o54k70J524J672J8j680m02J302k99j827k024PQ77n95j276J36J848J392
1699C43J69o28J168J958K1j509p28J09N01j233j986p6P80R2p66l91J504J487k49
1718E66n41L13J185J63p91j025N63O60n11j338j62P15O70j288p06P46N66q9p96
1737a100j19J534O22l74l92M72J529J31j436q35K97L14j004j925j23P81M19r54
1755b163k31J685J720N57o61P62J162K21j170j452j9N4j038j672m49J051N29n38
1773a652l29J470J242O69n31J9P75O66j024j143m5P35o28j239m62N13P03n81n92
1792a434J12J243M60p09o29J034J334k80m04l05J465K55j354j111K56K56n43j942
1810b296k83R88K33n6p5P91J695Q63p98K02Q74O17j032j749m04M20m35j723n42
$$ y = [594, -60, -330, 1194, 2866, 2884, 1204, 802, 2104, 1805, -22, -2046, -2039, -1162, -1757, -3033, -2897, -1049, 343, 512, -116, 1052, 3010, 3031, 1522, 794, 903, 1404, 171, -1815, -1891, -1111, -1019, -1785, -2176, -672, 815, 566, 25, 338, 1523, 1686, 895, -130, 433, 1093, 582, -756, -918, -203, 467, -821, -1527, -781, -215, -304, -1100, -1219, 315, 937, 563, 171, 643, 2172, 2303, 867, 32, 329, 643, -361, -2286, -2409, -1628, -1209, -2163, -2394, -709, 1011, 1568, 907, 1669, 2831, 3052, 1882, 430, 411, 465, -573, -2245, -2694, -1643, -1114, -1652, -1981, -511, 731, 1400, 869, 888, 1663, 2329, 1305, 162, 117, 852, 224, -1015, -1477, -964, -261, -842, -1434, -1322, -79, 381, -328, -957, 77, 1411, 1131, 727, 422, 1887, 2142, 788, -323, -67, 189, -354, -2296, -2579, -1591, -1358, -1414, -1489, -698, 997, 1860, 1062, 1264, 2138, 2755, 1723, -26, -430, -10, -445, -2168, -2710]
1829b710Q81Q53J11q74J281J469N90l40l71N96O87q09j498k88N83l7r69q35M62
1848a218J049k12n66j85J263R13r28m62M20J089J51r83m91J280L1p91q94P4O86
1867B26m59j220k20M64J051l49n05M41J576P64o30l35P42O27r25j889k31N38n85
1886i19o84r52Q11R37K97k72R88R97P53j53q82Q1L36l52j401n57L22k3o21n20
1906a814L61J120L60n13J1Q98O76k84n31k5Q59K97j340l74M77N36l75j168m38
1925a267R29J00j215m2O54Q91Pn13L24J512Q05n75n82J16K70n84j352o65M10j11
1945h88q49m91K87J215L94Q6K44Q85J040o3q58R2R1j32j299q68N0O71n30j008
1965a931M11J113M08K51n98P37Q59k27m66n32N61M93o75r65N22O30k22q72o10
$$ y = [-2710, -1829, -976, -865, -1739, -458, 1011, 1601, 1261, 890, 1486, 2173, 1364, -134, -422, 161, 124, -845, -1680, -1218, -169, -381, -947, -1132, 131, 1044, 116, -346, 74, 1163, 1314, 331, -160, 1120, 1151, 360, -534, -460, 226, -233, -1453, -1673, -1209, -158, -507, -1012, -571, 1005, 1769, 1139, 804, 1546, 2173, 1248, -641, -872, -334, -919, -1603, -2555, -1744, -807, -510, -782, 206, 1203, 1956, 1803, 921, 1002, 1338, 986, -415, -972, -650, -673, -1294, -1814, -1453, -333, 27, -486, -475, 423, 1099, 815, 284, 259, 1118, 1415, 75, -299, 178, 714, 339, -829, -1267, -338, -238, -1453, -1495, -841, 50, 57, -456, -132, 1380, 2185, 1610, 1028, 1144, 1414, 830, -522, -1187, -777, -888, -1737, -2228, -1941, -726, -332, -246, -2, 883, 1923, 1860, 1002, 1094, 1185, 1053, -246, -1114, -1064, -393, -923, -1931, -1520, -407, 1, 252, -346, 391, 1250, 1023, 557, 25, 586, 1079, 404, -561, -39, 591, 369, -503, -1113]
1984a113O58K66l82n45L42Q94M19q01J34R13O61m81l55m01O02j20j051p71LM96
2004f32j76q37K94R03Q24J25m83J073N05L06j176l16J33o0r76r76j31Q94k00n87
2024a493L98Q42Q52k52j8L13O09Q8q30m59M06L11r03o42K0M46K78p44l04P85N10
2045B13j69n94L8J190J08l10k99P25L51j01r62m15P35P5j246o63Q7L86L37r16
2065a430J61J131R31J2j14K48O76P9q24o34R5p4l85j380j60O59J46k95r0R08Q81
2086E41K18n95N89N29M52p48q48J07Jl2j141L5O05P6n11jK35N12L37m73j07N66
2108C47O13m32m54K25O44K2m93n96NK48l49j001J3M13N26o07j23Q66P26J12n1
2129F54j13O27J59r66j20k01k9J3j110k11L83L40J58l69P20P86L65o22J2L89L01
$$ y = [-1113, -455, -189, -571, -1116, -774, 120, 539, -262, -128, 785, 1446, 965, 610, 209, 811, 691, -360, -1131, -1128, -632, -808, -1645, -1351, -448, 376, 501, 18, 1091, 1596, 1902, 726, 410, 543, 483, -493, -1469, -1600, -706, -906, -1493, -1095, -253, 599, 347, 329, 642, 1251, 1339, 509, 50, 456, 767, -136, -778, -758, -312, -34, -778, -1082, -297, 213, 44, -550, -512, 678, 786, 476, 177, 902, 1253, 1152, 190, -225, 510, 585, -661, -1324, -1237, -851, -514, -1430, -1269, -138, 793, 805, 691, 939, 1615, 1694, 870, 236, 331, 257, -128, -1508, -1668, -1009, -863, -1158, -1248, -340, 541, 759, 164, 753, 1282, 1734, 986, 138, 245, 246, 214, -927, -892, -287, -211, -722, -723, -488, 24, 361, -112, -219, 347, 960, 528, 74, 299, 943, 965, 472, -124, -119, 129, -220, -1221, -1208, -795, -269, -876, -999, -133, 593, 705, 654, 541, 1168, 1327, 361, 241, 40, 11, 24, -1086, -1297, -914, -574, -416, -785, -65, 721, 1086, 464, 476, 865, 1166]
2150A166o53n77k82K73k48n34j94K21P90l85n0M00P83l72j04o52Q04L52o4p72
2170i8j22N13K48q10o90N34N10m10l76k81O92N0oJ13N7J083J77o63j19L53K58
2191A013k82j208PK24k33p26k61N32L80J34p0K99R86N85o09p9O5j51R0r59k50
2212e13L06k05n61m51N25O54k05j25K89R18J97n8l96J60K30l88k25m62M37M00
2232E27o28m68q2K30K55m40l52P95N86l95l75M33M53N81n37J28J48K8m09o47o78
2253h47M51N3n52k06l7O83L82j40R1P23L50k39l30J96P2N4j013k04p5L51o6p99
2275a102K67P26j73K16n1M56M46on77L4K42n8l67r04N52M19m61j59k38M50N61
2296B73m70m18O21L81K5j96k92L56N17l07l16Q0k5j6l97n06J45M19l99j57j01
$$ y = [1166, 513, -64, -346, -73, -321, -855, -1049, -828, -38, -423, -473, -73, 710, 338, 234, -418, 386, 738, 674, -98, -220, 293, 541, -269, -959, -425, 85, -325, -701, -982, -290, -240, -246, -133, -76, 1007, 1184, 521, 402, 755, 1013, 731, -477, -470, -246, -479, -1205, -1466, -934, -554, -420, -490, -191, 795, 1380, 771, 692, 757, 606, 696, -263, -513, -207, -412, -973, -1424, -899, -245, -450, -575, -286, 632, 829, 771, 375, 535, 765, 377, 152, -310, 127, 527, -101, -569, -651, -421, -166, -606, -958, -163, 423, 28, -347, 86, 539, 1120, 583, 711, 859, 887, 478, -169, -847, -396, -343, -895, -1101, -1138, -455, -73, -213, -122, 601, 951, 712, 382, 578, 650, 704, -309, -513, -588, -237, -303, -1102, -835, -109, -282, -66, -117, 339, 785, 779, 202, 236, 478, 420, 53, -851, -299, 120, -341, -500, -738, -288, 273, -197, -615, 6, 387, 412, 216, -76, 280, 797, 490, 174, 254, 229, 213, -184, -690, -545, -126, -525, -682, -783]
2317g83J080k10J83l4O77L40l44n99k4J85l46m21o79J90K67m2k97j3O91M65L9
2338C25K1J07N21O4o03m24Q4J30m68m49L66j47K36j55k26L87N82n79PL6O64k9
2360D50p8k18K51L64l80m44j5j17K93o88m08L84K91k7m69K30N79L25k59L75J67
2381F06M53r6m35l97K90j85o29n15OJ46K89j21j36O20L51J31l77N30L46l09K4
2402E92n08J65J65n60m81j46L11K52m45k0K50O66k18o1J61P6N24o41j69K32K21
2423C66j17l29k57N50j56j16m95J61k2L99n21J87N82K03J63j98k68O26k0o21k83
2444a66Q9J12l38k66m44N04L77k83k30O27P75j39r4k09L07K03m21m43k67L01l24
2465c29l20j08j02P78R4k42J33N37J88m91N6M47j49j45l95j04L30p0k24l55K12
$$ y = [-783, 297, 87, 270, 236, 913, 1253, 909, 310, 286, 471, 125, -296, -975, -785, -518, -560, -857, -870, -179, 286, 325, 346, 453, 974, 1038, 435, 11, 95, 225, -243, -692, -326, -473, -237, -392, -618, -231, 351, -228, -221, -185, 479, 450, 372, 154, 405, 769, 389, -55, -70, -187, 106, -582, -990, -606, -315, -342, -811, -581, -2, 323, 64, 439, 606, 1059, 963, 528, 131, 421, 236, -393, -908, -902, -756, -467, -588, -724, -104, 247, 378, 1, 531, 877, 568, 592, 84, 249, 414, -146, -627, -773, -462, -210, -655, -675, -425, 241, 23, -38, 123, 199, 723, 82, -87, 145, 366, 249, -80, -337, 213, 57, -59, -554, -393, -415, -16, -537, -350, 232, 435, 598, 400, 132, 758, 738, 117, -166, -77, 35, -303, -569, -1013, -509, -132, -415, -645, -18, 757, 618, 524, 315, 622, 825, 404, -39, -306, -5, -329, -649, -757, -859, -81, 13, -229, -96, 441, 629, 138, 194, 641, 492, 347, -48, -152, 178, 108, -116, -471, -259]
2486b59j40M65n29J11O15k65J73m23N72L39k05p1k66N55l8o18l63j75O35o16k06
2507g09l44N48K51j85J05M50O54J02m13o5K52j09j55p39q8J68J43m42l84K95N06
2528a59K7J15J72L63Pk03O7J82j0j90k19k65J61L27n91l24k3K86K48m2k09L54
2550G4K48k40m05L58M12K05q32J38N10O5l85n25P7K08J31o70j66N97J12K53m15
2571b50M03K71L47n04k93L00J25k45n78J8J90j04o0k38O6L79J66M6N7J14N30k75
2593D65m04K48j7k56m7j14k55L88k41j67j0M63j05%r1L54J44o8l82L38J35J50
2615E28k81n74J25N21k55o38R1J73p3J87l71M40L13L59j85k83O40K72o80j25J37
2636C21r5L3o40k93L79j34Qk15m0P74J54k00%L72j1r8P6r9M5J6o97J16k16N71
$$ y = [-259, -399, 66, -463, -352, 263, -2, 171, -252, 320, 659, 454, 383, 117, 672, 634, 16, -347, -522, 113, -503, -709, -1053, -505, -254, -439, -334, 116, 770, 872, 459, 394, 646, 537, 382, -357, -445, -277, -134, -576, -960, -665, -159, -132, -17, 155, 518, 525, 322, 389, 571, 561, 371, 152, -113, 48, 375, -216, -540, -563, -277, -29, -71, -280, 74, 322, 82, -323, 35, 447, 652, -180, -42, 468, 533, 148, -377, -300, -92, 39, -631, -797, -200, -88, 165, -250, 153, 424, 771, 267, -26, 274, 399, 154, -424, -406, -216, -320, -380, -618, -552, -173, -7, 39, 96, 210, 740, 465, 61, 309, 292, 36, -11, -125, -380, 8, -233, -400, -410, 53, -52, -52, -143, 211, 355, 287, -95, 243, 378, 528, 247, -327, -202, 319, 64, -574, -483, -310, -383, -196, -567, -127, 186, 545, 360, 77, 717, 989, 309, 184, 321, 226, 259, -381, -674, -295, -429, -421, -636, -676, 98, 252, 52, 52, 424, 413, 315, 391, 292, 337, 353, -344, -228, -444, 127]
2660A27n39j02j17M63L10j05m7K1L75J17l60o2J98J75n04n1oQ6k3k69j26J08K19
2683a12k49M3k84Q80M2k47j73M61R4k13K6k63j94J56k30l06o5M20j52N1q9K42
2705a62K90J03j88K11J76J51k49j9l87K46n26O9j12K80M6m1j79K22L28p0l77L99
2727B11J44ok17KM3o3j58k56j4ML30m50j57M14L81k71J95k92n7O31k30R3K38j08
2751D07j15l03QK33m31j47M2k05M9J52o5L95J18J1K97k67K14K13k78k12k84M5
2773a23L7j81l97K24L12j74m5N8M84K22k53K00k18J98J50k48k11k07J76j24j43
2794b63k7pL20j14k94J75J47K30o0l03O27O4j34j48j17KK34q1k68j60j1J09m04
2817d83O4o6N19q6K49j76K41P8j60K70k89L91l50R4n46K74k21J5k29J06J47j43
$$ y = [127, -412, -514, -631, -168, 142, 37, -10, 11, 386, 503, 143, 81, 279, 454, -50, -101, -107, -21, -44, -313, -439, -331, -112, -361, -318, -602, 278, 320, 73, -100, 361, 455, 242, 268, 5, -189, -33, -263, -569, -634, -214, -366, -315, -404, -162, 128, 231, 43, 254, 430, 581, 332, 313, -74, 172, -354, -285, -397, -117, -71, -112, -291, -69, 259, 189, -188, 211, 355, 349, 132, 134, 177, 114, -44, -300, -314, -310, 20, -430, -587, -173, 208, -63, 132, -160, -217, 414, 184, 277, 515, 407, 292, -11, -3, 230, -201, -348, -306, -511, -462, -310, -375, 20, 138, 149, 446, 179, 393, 606, 328, 116, -168, -123, -86, -267, -664, -440, -128, -302, -347, -289, 195, 417, 164, 364, 146, 344, 494, 246, 35, -172, 4, -120, -263, -290, -297, 23, -91, -385, -210, -63, 167, 107, -196, 431, 495, 361, 213, 96, 98, 332, 251, -17, -177, -188, -79, -483, -419, -485, 34, -52, 197, 21, 262, 340, 180, 450, 161, 552, 202, 296, -250, 24, -197, -182, -411, -305, -158, -301]
2839c01n4L40K31J70j02J10m5K37l59n20L77k51j13o2kJ33K79q2j03j28K04K00
2861A59J9j25L12K5m51L41k82j31K15k87K77j78N1k67L0n3J86L0J41j35L52J43
2883C72K45k53j23j25Q5j9k40j77K2J18l24J2j6O29j31k71K37N32k29k38qN8J0
2906A66K55m89l51L8L28j78j08K93M9m4J09p4J43M18l12o2r2K91m0o50K28L4n9
2929a07O2l49K0K73R4j86k3L62k05K54l65M05K42k11J30l57K11j53j6k09k40J30
2951b38k52K77J11j19L65j75R1J06L3J27j38n7j30L43k44k65l8n7K50n23R6mL49
2974i2p8L6J78O7L95m81J27k42J17J75k02n80P36m80L93m42j22O04k20k92K50
2995a53L09o1k5j96K23J30O7j03k3l45L16l32k33K25L1j3j71P7k3M77k55K09K26
$$ y = [-301, -355, -15, 216, 386, 284, 394, 349, 586, 227, -293, 84, -167, -280, -342, -344, -211, 68, -14, -117, -245, -41, 159, 178, 53, 365, 390, -61, 280, -2, -133, 82, -205, 72, -106, -55, -322, -292, -345, -159, -129, 12, -123, 229, 372, 617, 364, 241, 116, 201, 182, -58, -235, -213, -95, -419, -407, -423, 206, 75, -196, 41, 573, 344, 106, 98, 156, 166, 421, -68, -419, -381, -53, -231, -339, -46, 3, -41, 68, -6, 137, 555, 243, 181, 89, 380, 340, -310, -82, -48, -107, -45, -394, -374, -101, -7, -193, -216, 146, -59, 195, -170, 235, 477, 266, 396, 39, 250, 97, 81, -128, -368, -238, -490, -213, -102, -221, 144, -31, 60, 166, 199, 326, 188, 131, 1, 344, 100, -165, -203, -260, -10, -533, -437, -441, -92, -170, -134, 44, 111, 506, 25, 152, -90, 27, 202, 0, -580, 156, -324, 69, -373, -495, 109, -111, -403, -153, 156, 95, 70, -126, 97, 227, 294, 191, 168, -177, 139, -193, -426, -201, -170, -183, -354, -277, -300, 177, -78, 131, 357]
3018C57K35k31l8l03j15K7k28J72k25O6J82l06JL60J30o1J20l06O03l28M2k78
3040a24j80M58k42k43J21j01M03k22q4n9J7O91n72J70J76p4K0K69j79o3j05J40
3062B17M0o25L75p5j89p7J34j93K26L13m2l7K09J46k32J53q2j70q0r0R8j41j6
3085a38k56J05J98k6j50j51N87j38K17j68PK34N2k13k25n2N4r9j75J43J80k41
3107b55J37k9J12J51n8r4N0j72K11J20l0P6j61K14k68J73k70K88l17j2O3k14P2
3130b13J41J87L6J40r9L57k82J8k02j02Q5k35K19k41j3l5JJ84L19o5k00J87K61
3153D48m12P5K00l3J8n68K34J40j83n9P3j31J2J27j37J97L39J06n26J99O3rl65
3176a92K02l8R2o7M2q1j76j1M36k79j43J77o5J83k4K15q3K6k04Q0n6m7m9n2j53
$$ y = [357, 592, 361, 323, 20, -95, -68, -296, -124, -349, -283, -101, -407, -406, -46, 84, 23, 143, -163, 440, 112, 154, -124, -304, 154, -88, -331, -210, -311, 92, -130, -214, -273, -256, 435, -137, 33, 209, 135, 155, 424, 245, 182, 77, 217, 257, -368, 7, -68, -257, -334, -200, -393, -167, 146, 104, 67, 276, 422, 190, 343, 261, 91, 11, -79, 19, -122, -138, -394, -289, -91, -117, -267, -418, 169, 31, 248, 80, 87, 321, 373, 160, -65, -117, -63, -162, -337, -194, -14, -255, -118, -147, -35, 116, 58, -36, 14, -158, 53, 173, 143, 219, 58, 272, 4, 177, -93, 195, -122, -134, -71, -285, -213, -72, 115, 151, 291, 192, 549, 267, 285, 83, -19, 66, -169, 50, -191, -204, -239, -238, -54, 265, 200, 0, 187, 448, 36, 111, 311, 278, 296, -272, -38, 102, -81, -140, -67, -198, -186, -59, -196, 1, 340, 446, -80, 119, 182, 173, -192, 10, -28, 64, -3, 39, -42, -218, -229, 207, -72, -215, -38, -103, 80, 56, 271, 188, 214, 10, 90, 34, -13, -62, -114, -267]
3201b67J71j26q8L17l19O5J23j29N24k46P0L92l29K8J61k84j06K04l17n7J59j17
3223a71j5J41j60p4K96J91j20l2j2L40j62k45L09l43j65K35k67p4L60J99k24q0
3245g3LJ02J19j40j72L01k0J83j11k62Qj42L67j95k9p4j3rO5j03J84P2k08j1M12
3270B54P0l74K18j58O8P1l87K65J26l38k8j28K39j38J58j81M06K2j93K79k14j04
3292f7J80j31kk32J6p9R8J96k05L58k9Q0k72L22Qj09j19o1r6K96j2j20J11l8l8
3317E5l22J68R4l41L83j75R3L38k19k4J29m8M2j15j88L30k55r5j33J84J06r4j75
3340b62J3M20j25mJ21k08%J31J76j58Q5N8k58k50J98J1j02N4k08K74l78M29j97
3363a80j46K50L72j23o9m2j29j22J0L85m01L22j66J42k69j04K38l67Q3J39L23
$$ y = [-267, -96, -222, -310, 7, -312, -247, -124, -253, 271, 25, 95, 487, 158, 186, 347, 63, -43, 161, -156, -213, -54, -171, -186, -45, -205, -279, 17, 208, 88, 56, 44, 384, 222, -23, 286, -57, -222, 13, -254, -328, 32, 231, 7, -73, -70, 32, 151, 11, -161, 140, 120, 303, 192, -70, -62, -204, 163, -32, -61, -135, -148, -157, -92, -195, -11, 61, -147, -158, 254, 324, -50, 168, 10, 78, 149, -238, 27, 153, -185, -213, -341, -102, -240, -82, -263, 143, 165, -28, 251, 37, -67, 113, -18, -20, -252, -236, -315, -217, -21, -226, 132, 103, 183, -89, 233, 241, 132, 13, -48, -144, 152, 140, 20, 131, 93, 55, -267, -99, -5, -346, 37, -138, -45, 293, 74, 50, 179, 131, 173, 58, -130, 200, -55, -150, -283, -99, 7, -87, -262, -249, 171, 46, 42, 163, -45, -45, 86, 262, 104, 189, 247, -11, -261, -63, -52, -154, -100, -308, -34, -412, 17, -180, -326, -76, 296, 173, 104, 62, -67, -189, -179, 206, -195, 127, -39, 103, -166, -270, -32, -399, -316, -177, 146]
3384A46p3O8r3K98j19l26M8j3j16j07J24j82L30k86P0J63p0K34j16J75r4L1P7
3407A69K0k01m0J5P2jj0N3k65K58q3j56O2n8L4q2J28J38K73j71l73L85j79M8j4
3432B2j6q3K91m34K53j12m6J30j73J29k21K09m1K04m0J96l57N9J23O2j50k44o8
3455c07K49p6j84L05J03M5j55j00J66Mk12L05l8M6K7j24j58L07m78L14n1j07R0
3478b9o3J78j49p9J23K34p3p4M8j14R9k14j58K16lk46L18j41N9K58k80K32k2J51
3502B71q8k01M1k02M82k14j26K95k14k24J30p7k57M36JnJ15Mm1l24L64l56j5J73
3526c2J1K79n1Jl14K19k01q4L48j98q6N32m10m0Q4j26N2j12J85j2r2O1J2j09J41
3551E8m27N89m59N1p2K88jN3K4j08o3K33m9J8j30jr3M2j67J37nJ79j96p0Mj43
$$ y = [146, 73, 141, 48, 346, 227, -99, -51, -64, -180, -287, -163, -345, -15, -301, -231, -68, -138, 96, -20, 155, 61, 92, 169, 189, -12, -52, -37, 35, 34, 24, 77, -188, 70, -13, -169, -107, -165, -131, -213, -85, 53, 326, 155, -218, 167, -12, 36, 22, 6, -77, 214, -220, 33, -79, -125, 5, -168, -39, -260, -51, -92, 112, 72, 268, -89, -30, 93, 155, 5, -239, -307, -58, -134, -318, -13, 90, 135, -20, -120, 46, 50, -162, 143, 105, 151, 178, 54, -104, 203, -275, 39, -12, -119, -29, -92, 86, -63, -142, -19, 215, 142, 68, 116, 2, 101, -113, -271, -55, -58, -304, 14, -127, -68, 190, -90, 142, 120, 271, 183, -18, 23, -179, 303, 89, -37, 258, 44, -180, -50, -127, -384, 52, 53, 48, 163, 167, 126, -198, 166, -190, -205, -32, -21, 258, 207, 208, -106, 113, -88, -172, 176, -22, -108, 424, 14, -26, 58, -68, -16, -128, 57, 45, -47, 14, 26, -83, 58, -369, 220, -239, -188, -260, 28, 27, 80, 104, -4, -67, 166, 117, 135, 5, 4, -89, -47, -214, -77, -82, 97, -99, -169, -165, -308]
3577c08K23R8k12L67k12J15K7R4k14K18l03K7n5J89j24K54n5k59P8K5j6J74K5
3600A56q4k14K33Q9m22L05J3j95J50l56K09J78j65j32R0L90k98j26J31J42r7L32
3622C29m84L65n3l68K34j31n2L0K40l86J94p1M1K36n1K1K0m6L2j29j62K19m43
3645d15L73Q4q9l2K05l37J74M6p0k7M0J02N7j23j58J30J05j01L01l19K25l71K84
3668H4q0j30J9q3K40j93L41j26j00j21K81rj73J64p7J38k07Plm8L36n04K98k02
3692a48J62Rj22j65K62J39JO8m50L20q3L7j56M5J52L4J06k67J34R6j20k03M6M2
3716f1Q3k0j57K45k86K29j12L07k76j20J17K84j84J60q7l94K71m92O26l00J25
3737d2j11J90j01m5J85M1k54j09K43k42M85l47Kq0L23o6q8J3Q7n5J24j47j3k8
$$ y = [-308, -85, 13, -199, 168, -44, 71, 98, 192, -22, 196, -107, -80, -135, 54, -70, 184, 129, -130, -52, -27, -43, 131, 156, 72, -142, 91, 180, -242, 63, 76, -119, 31, -325, -116, 62, -103, -235, -145, 245, -53, -179, -48, 94, -3, 329, -155, 210, 157, -211, 23, -108, -160, -130, 110, -276, -82, -153, -112, 124, 73, 94, 114, 68, 100, -29, -191, 28, -415, -42, 42, -47, -79, 126, -211, -37, 9, -61, -88, -48, 54, 111, -12, -170, -40, 65, -36, 265, -54, 171, -200, 84, 4, -126, -107, -190, 50, -143, 198, 72, -28, -149, 132, 123, -50, 114, 37, 175, -32, -25, -28, -76, 260, -244, 54, -148, 14, 23, -99, -264, -2, 137, 138, 206, -244, 76, -7, 30, -126, -81, 71, 105, 211, -56, 78, 174, 54, -149, -103, -61, 22, 2, -155, 90, -196, 33, -79, 228, -48, -168, -51, 233, 49, 209, 122, -272, -1, -493, 133, -167, -42, -153, 37, -64, -109, 76, 117, -137, -246, -3, -245, 240, -107, -105, -185, 138, 72, -16, -3, 84, 29, 153, 6, -7, -35]
3761c5j79J70k01M03m16LK04J40l4j1J33l68k21K55J64M9j53j06M3J50j15P3m3
3784i5J98m29k5K50q9M62l23P5J45K86m08j28K36J07l59j25K15L3j96J66J81k38
3806f1q2J26m9q0J61o7K89k25M5Q2j7j43k3j40K62j03j54J53k7j05K5J81o9M8
3830B7J80q9j66J40P5j16mN9j2L7k14n1r4K96k75O3M48m19J58J53k28K93m33J29
3854d3J77j09l9J09J27J64o67L36k29M3l3J9J05k00K37k0n9J56j40K07Lo0j40
3877e6J80j40J15J15k63O3M8j31J38J01KL9k36J19j93K7P3L45l57K27l76j03L07
3900D4j86q2K16J33j66P8jJ8N5j37J06K01k33K39n21J63K18j5q0J39l31K22j66
3923h6r9k24M94o8l52N42j10o9k3Q4k46%q3M18j90rk7j48J56j20j38R6O3K13j08
$$ y = [-35, -214, -44, -245, 158, -258, -255, -51, 89, 55, 44, 177, -191, -412, -157, 7, 56, -97, -203, -160, -10, -125, -52, -95, 103, -326, -351, -101, -190, 272, -51, 24, 169, 455, 47, -81, 155, 262, -97, -222, -7, 26, -170, -4, 177, -61, -143, -17, -66, -146, 15, -52, 237, 12, 57, 139, 122, -21, -44, -184, 78, -25, -179, -26, -53, -158, -133, 48, -21, 27, 207, 118, -48, 92, 167, 51, 47, 106, 94, 131, -83, -134, -228, 68, -207, -144, 304, -115, 43, 196, -32, 261, -172, -43, 134, 25, -14, 95, 222, 386, -281, 55, -174, -131, -164, -145, -40, -240, -3, -23, -82, 74, -66, 141, 144, 84, -56, 124, -16, 99, 214, -49, 14, 62, -69, 69, 170, 172, 211, -25, 94, -99, -72, 1, 346, -11, 216, -160, -263, 44, -142, -224, -8, 125, -41, 37, 36, 54, 109, -28, 78, 279, 46, 285, -236, -73, 145, 130, 50, 189, -142, 80, -86, -185, -409, 85, 17, -335, 207, 97, 28, 5, 89, -157, -157, -240, 178, -12, -21, -48, -196, -40, -160, -298, -202, -139, 74, -34]
3948c4K40l78j5P0K08j07m2n6J67n5k7n9P7K39j09j46M1J55J05m42K66m36M40
3971A02l9p4Q9J26j58k03R2J1j48J92m9oJ92q5o4k9r6K12j8j84L73j60k25L29
3995A80k34J3J8j33m1J17J35L3k0N1K2J42l18J55k29J76L4J41k44o4J32n2qj86
4019a80M2K37o6K6K4l3o7J67k04O5j60K07j58K14j42k2k1j07K58o4J37j4k8k31
4043a20L00k73J88L5l9j14K97l46J82j02O8j17m6O5l06J9j10L51J64l86J79Q6
4065b5J01m1m9j43J4j25K99NJ27k74J49j14Q0k44J34l6L2l6K19n0lJ8j1k12J20
4090f5j5m1K54q3J67m58L07j78K78l47K66Q8k20o0L55k87j11J97j41K14j4p3o2
4113b9J45j84L68k29j83O3j22J68j65K31k4l35K3K35K20l04L4k4L6L6J6r4n3r8
$$ y = [-34, 206, -172, -187, -117, 91, -16, -58, -114, 53, -2, -29, -88, -11, 228, 119, -27, 14, 169, 274, -168, 98, -338, 102, 63, -11, 78, 204, 46, -157, -65, -54, -202, -10, -59, -65, 127, 42, -22, -51, -147, 65, 47, -137, 236, 76, -149, 180, -54, -41, -23, -156, -197, -80, 55, 88, 68, 119, 141, 283, -35, 120, -109, 67, 101, 242, -2, -66, 66, 14, 6, -180, -138, 99, 33, 59, 83, 50, -17, 150, -54, 11, -149, 58, -100, 114, -28, -50, -71, -178, 80, 16, 153, 139, 111, -120, 180, -93, 95, 130, 91, -23, 274, -72, 110, 8, 76, -41, -87, -22, -328, -309, -419, -68, 96, -290, -111, -25, 76, 35, -14, -157, -143, -268, 31, 36, 163, -111, 38, -76, 4, -240, -106, -142, -110, -146, 73, 23, 20, 38, 27, -185, -65, -80, -121, 133, 50, 217, -241, 66, -112, 166, -181, 85, 173, -47, -107, 248, -39, -150, 47, -94, 120, 106, 33, -29, 116, -68, 300, 71, -112, -49, -171, -3, -168, 63, 39, -296, -273, -38, 182, -122, -88, -112, -76, -40, -24, -118, -171, -269]
4137b69K69K06j44n2m86N22k54O36j26k71j92K00J04l34j23M27l39O4R9J0k3j03
4159a79M6P8J5J10k31L65r3L3n7l16M92j40l72J61K6k55K25K50r0q7Q2R7k09K15
4183A66r1k12K77m58J35K44q2J62q4j94J24j74L27k58J66l58L74j20K57M0J89
4204D30o54K0L67j83m3k2j9L32j3k92K63n00L09L21k95j21M3O2J93k19J34k21
4226a08K63j64j87J47J42l28j09L22K96J6k44K05l4j88q3j75N8K97n9j27j8L8
4248d0K92j56k40J96l3K57m35J67K1k82Q3K42j19J75J19m65M47j85m6R8j30nj57
4271a96K58Ok32K0k23L40m8J05Q8R6l51J46j86J33j22J65l0j82J13J89j56J34
4293F7j65qK24q9O1j40L03k81qK4J79q4j16J31j77m4l4n0R2J19J07k1nJ73J06
$$ y = [-269, 0, 206, 62, 10, -476, 46, -208, 428, 302, 31, -161, 39, 143, -191, -314, 113, -226, -162, -63, -53, -76, -179, -133, -55, -40, 70, -161, 204, 111, 144, 87, -229, 263, 123, -249, -88, -62, -317, -92, 158, 68, -19, 63, 160, -49, 166, 75, -137, 140, -318, -183, 61, -21, 141, 57, -137, -13, -187, 140, -118, 48, -310, 64, -56, 201, 241, 430, -224, -204, 163, -20, -63, -85, -104, 228, 215, -77, 186, -314, -5, 316, 21, -100, -57, 5, 198, -21, 113, -108, 155, -9, -196, -49, 93, -235, -344, -22, 274, 290, 46, 251, 217, 29, -54, -229, -171, 126, 67, -60, -78, -40, 252, 96, -144, 52, 19, 276, -159, 8, 29, -253, -170, 72, -47, 128, 247, -218, 229, 44, -2, 96, -34, -39, -196, 62, 68, -164, -144, -367, -27, -75, 30, 118, 214, -137, 9, -177, -44, -166, -1, -31, -213, -100, 89, -67, 67, -98, -106, 118, 29, 90, -50, 253, -28, -36, -12, 167, 83, -33, 98, -79, -123, -157, -207, -115, 4, 111, 90, 85, 258, 364]
4318C64p03M15l0k24J56l4J27j81R2j29J09j72J75K15l3l5R4k33p9J34K79l47
4340d0O7K5k00Q1J18j73P4J86k21J43m7j67q4K7J93K11l47J49K95j21j54j11J18
4363B2j05n2J13Kj32m0L04k6J83k5k40L1L6p6l63M62K3l85P8P8JP4R3qk73Q1O4
4390h0j31J33k29J84K15o0n5J23j79rO9J21J9K07q7m48l7K95j58l6J06P5l7m9
4414d8M8J24k41L25k40J28l4K5J32j64l40K71j98K21k74L92l53N1N0J15J71j45
4436A6J37l39K00l18L22k20J60j23J98J22k13J82j88j7L11N6j70k25K75k10J07
4457F3j65O2K73l71p1K02O3Q8P0k11J62j60k3J57j20kj37m6J00p1J44o7k9k01
4481b90K24J00k38R4J31m3Pm6m7J26j27R2J33j04J17J35m72L9K42j28K70k55Q5
$$ y = [364, -339, 76, 46, -178, -22, -56, 71, -110, -18, -147, -38, -210, -35, 180, 147, 112, 206, -27, -106, 28, 307, -40, 27, 52, -148, -67, 51, -122, -48, 138, -83, 60, 13, -154, -238, -211, -18, 193, -154, -5, 290, 169, 15, -96, 22, -83, -135, -22, -20, -152, -192, 112, 86, 269, 244, 4, 35, 71, -5, -368, 94, 117, -268, -190, -112, -111, -37, 56, 48, -225, -144, -80, -211, -78, -307, -123, 92, 32, -23, 100, -79, -88, -19, 102, 121, 328, 241, -207, -244, 51, -107, -143, -37, 38, 1, -48, 0, 124, -117, 208, -32, 96, 62, 87, 219, 55, -285, -14, -212, 9, -265, 127, -226, -175, -125, -10, 161, 16, 153, -186, 14, -304, 18, -202, -42, -165, 33, 155, -58, 124, -64, -81, 230, 286, 116, -109, 166, -44, 63, -102, -40, 233, -138, -209, -7, 56, 144, 214, 3, 165, 5, -18, 139, 19, 17, -120, -166, -66, -137, 7, -60, -89, -290, -66, 34, -204, -110, 21, -22, -15, -61, -108, 18, -109, -17, 116, 12, 129, 264, -208, -169, 73, -55, 215, -40, 45]
4504D5o9J3j30M12k95m9K3J09l04L32J30o2j59n3Q4k01J7R6m1j30J0J46K83j92
4528A5J88p6J25J38n24j13o6K42J51Q2j65J9J81l89K89l1p0J71j90kl1L8K58j70
4552G0n4K01N4k85k25J49R7j19K09j4k06K39m1Q5j33M0J40j73m8J68p2j46M43
4575C79o55K24r1L01j05J21j87N0J20l59N35l69mK44k05j57n3M0RL98j07j65M0
4598Dk49j11L50J10j38J11K83m08k27J55M95j98n5J30k18J9j5P0q2k37L32j17
4620DK5P0o9k8j40m2J04ML66k18j53R7j37K84l49J53K09o04M29J60k50K78r1J
4644A03k37j25N48l79L01k01J83m09R0K42n89N15K0j58l2K32m48K22J43M3Q3k65
4666a18Q7n9K39k00P5K1%j1j3j71K85l44K45j38k9p1L38j15K64l82K92n0k01K44
$$ y = [45, -24, -11, -141, 271, -24, -73, -50, 59, -245, 87, 217, 155, -4, -57, 27, -174, -157, -61, -102, -232, -222, -76, 207, 15, 203, 127, 252, 390, -134, -247, -313, -71, 80, 162, -3, 16, 197, -192, 97, 66, -4, 167, -23, -25, -56, -18, 240, 70, 16, 217, 271, -14, -239, -90, 7, -112, 97, 83, -123, 116, 75, 160, 27, 67, 207, 34, -14, 154, 82, -64, 379, -276, -52, -143, 158, 53, 174, -13, 37, 157, -202, 333, -36, -40, 204, -1, -158, -211, -171, -162, 236, 129, -36, 4, -245, -356, -6, 104, -34, 77, 360, -48, -275, -120, 375, 177, 122, 252, 34, 53, 38, 108, 26, -211, 121, 4, 29, 99, 30, 2, -138, -180, -76, -72, 294, 76, -77, 20, -117, 167, -182, -29, 180, -424, 5, 165, -85, 193, 102, 103, -134, -259, 289, -90, 211, 10, 193, -216, -126, 116, -473, 42, 62, -96, -128, 104, -344, -122, 21, 64, 147, -118, -31, -90, 149, -51, 24, 45, 45, 34, 21, -150, 135, -209, 36, -102, -131, -202, 136, 21, 285, -97, 195, 145, -56, 188]
4690A88j38l2m1n9K94k40j71J52M3r3l3R8LJ69l1k39k3J69q2J50k38J95q3J34
4714I2K3L4n41K63K3p7J50R7j86L72n2m24L05r1J38Q9k23j69L04j98l7J4R9j91
4738a86K22K1j12J95K34l82Q9j13J36j99p1Q3p3J3K77j72K31k07p5r5K58J80j27
4761A27j23ol5q3K2p8K29L9j79m3J69O5r6j70L6K64j58R7K3j30l0J49p1n8J55
4786A15m7r9l65L66J40L0k42L62K5m0k94K8L0M5k24K03j60J97k50J55K06k78J3
4809h4Q3K18l37K56l54O09m12o8K12k58J12j16k04M06J83j5l09J45p9O5J30m99
4831c16J62J30m0j63M25o2p5L24k20m18K94j50J97r4m9j57l4L88j83K6l71L31
4853e5Q7m5J32k42K46j11K9j6J47k11J90l54J9O6n4N3J11J00k57K95j07R6j92
$$ y = [188, 50, 18, -23, -82, 212, -28, -199, -47, -4, -97, -130, -32, -29, 140, 109, -130, -153, 16, -66, 84, -154, 41, -42, 92, 115, 149, -392, -129, -106, -183, -33, 64, -122, 250, 198, -226, 79, -12, 126, 215, -8, -177, 127, -71, -108, -94, 5, -186, 36, 57, -55, 140, 374, -8, 81, -32, 104, -95, -166, -83, -156, -143, 134, -38, 193, -14, -89, -184, 74, 254, 127, 4, -2, -37, -120, -98, -176, 53, 92, -87, -130, 39, 104, 8, -162, -126, 138, -20, 77, 100, -30, -60, 89, 18, -40, 115, 68, -31, -396, -30, 110, 140, -102, 260, 285, 245, -49, -21, 9, 54, -170, 33, -127, 70, -180, -25, 181, -97, -84, -1, 217, -120, 136, -218, 391, -21, -89, 123, -135, -23, -139, -343, 63, 246, 231, -78, 67, -12, 53, 183, -316, -154, -24, -64, -227, 198, 136, 61, 385, 165, -253, 41, -109, 88, -6, -55, -212, -246, 142, -41, -15, -386, -55, 32, -13, 119, -123, 123, 12, 41, 25, 172, -39, 151, -203, -184, -118, -172, -119, -8, 92, -165, 130, 23, 119, -73]
4876g3L93m20J77j24J84l7k42L96k80l35K17K83l4k08J75j45K72j78j03Q4J13
4897A15p2K66k31J3j2m34J70J05J12P7j39o1kK69j39L0J10k7l0O4k63q9K86j53
4921c5k44L56l43J75N8m8J97l69K80K5j02J6LJ98k0r7K48l36R9n5J46j81q3n9
4945a71j16M5K80r4J59M8J72jj54l7j06L3k6KN7J32m09L82j43j48j41L21J32l30
4969a13JmK0j7J47j40J20k3J12K5O0j79r9p8J76K1r3M1l22J63p8L53J8o7J25l87
4995b18J11j18K07J22k33Q0K9J90p4J05k67J50o2p9K29o4k84M82k37O7k1k85K14
5018D4R9m8j5n5k3Q0k0l0J7K25k43K01l09j2L77m05M1K7O8n0j43K22k89K18N2
5043B9J48j50K0j06K06k96K07oJ13l34J37K23k87L11j80m4j8j78K26j17K43m1
$$ y = [-73, 320, -100, 77, -47, 137, 100, -142, 254, -26, -361, -144, 139, 105, -103, 72, -73, 199, 21, -82, 2, 115, 43, 309, 78, 91, 79, -355, -185, -80, 32, 109, -30, -91, -93, 176, 37, 67, 177, 150, 120, 184, -79, -168, 118, -35, -279, 77, -266, -91, -33, -81, 116, -253, 27, 52, -50, -34, -31, 167, 147, 50, 298, -38, 61, 6, 152, -29, -112, -171, -287, -242, 38, -56, 103, 151, 323, 322, 168, 131, 25, 58, 32, 34, 91, 223, -186, 196, 53, -95, -236, 85, 217, -113, -112, -116, -96, -113, 34, -106, 14, -9, 103, 128, 188, 9, -90, -168, 8, 29, -64, -23, -345, -182, -260, 93, 111, 44, 169, -218, -107, -225, -18, 104, -129, -49, -20, 170, 96, 201, -66, 84, 22, -57, 172, 108, -176, 306, 69, 136, 115, -170, 44, 143, 95, 80, 25, 2, 82, 62, 32, 49, 274, 31, 232, -77, -89, 288, -117, -76, -49, 19, -31, -174, 48, -241, -23, 29, 177, 27, 47, -59, 147, -149, 58, 52, 165, -169, -32, 191, -96, 215, 35, -9, -27, -205, 21, -96, 147, 106]
5065A06k93J34J8K01%k27J31K46k75Q2p2k45K29k17O5k14L46k52J01K58p9J72
5087B15j34R8L6k28p5%J08k7j27J42J64l16o5L50K7j69O8k12J30o2K06O6j38J56
5111B13j5j57j84J25j15L12k51O7K23l03j07K69k96J64J24Q9j69J60k96l7M22
5132B38m20M56j48l39L10j45J84k89q4P0J66l8K39m10J59Q4J8j03k5j86M08j41
5154Dr2R7j41Q6k75K55K51jl71M24Q2m04J63N0l32K10j14J96j88J35L5j17R0k43
5178b00K17k17K76j73k24M17p7N4j36n7O7J75m4l95K69L5k23J97k56N18k39MJ32
5201A20N0j74L63l01J72j53j6J43k78P3M6j43q3J79j99L18M8K9j31O8o9n5O1j4
5225E4K42o6n2l23K9l2M6N9j72l1K12j42L91l42P4j54J88J39j31P0r6o4N7k0J46
$$ y = [106, -187, -53, -35, 166, 166, -61, 70, 316, 41, 123, 51, -194, 35, -182, -117, -331, 15, -237, -136, 122, 43, 215, 81, 179, 215, -13, -88, -88, 20, -7, -134, 8, 172, -144, -209, 141, 168, -1, 67, -145, -15, -77, 129, 195, 57, 213, 198, 41, -143, -18, -133, 179, -72, -5, 218, -85, -192, 77, -219, -55, 69, 158, -11, 149, -147, -184, 238, -182, 274, 126, -213, 97, -48, 136, -153, -237, -167, -1, -39, 200, -210, -51, 33, 51, -52, -77, -263, 145, 4, -88, 9, -132, -46, -321, -66, 185, 184, -187, 237, 319, -85, 78, 128, -204, 6, -108, 88, -100, 35, 70, -47, 43, -200, 17, -200, 76, -97, -321, 96, 19, 73, -63, -120, -53, 122, 78, -317, -48, -13, -236, -39, -295, 223, -16, -12, 120, 170, -4, 359, 58, 230, 77, 61, 204, -74, -1, 45, -98, -181, -2, -201, 117, 165, 194, 63, 131, 62, 7, 68, 54, 296, 230, 178, -145, -116, -148, -102, -43, -215, -246, -34, -176, 215, -127, -53, -207, -19, 120, -11, 59, -37, -101, -44, -64, 82]
5250H2o1p9M1l0p8n7J63k05K82o3r0J81P4k64K90r7j45j23N22j69mp8o8j66j62
5275c04M67l92l3L37j12l2J30O0l57Q3n4L6L26l31M04l24j56l5N9J86k38J87J30
5298C7l63L58J77q6l0J31o3k15O9m8k81L75nl2J95l90L01k06J2N7n3nj66L01q7
5323a7J2j59J72Jp8K5nJ21k03j92J38K38LL3m4J75l96L64K06o10K42n1J82j05
5347E2o9J37j87j33N01o44M1L08J91k52K48k16L8n4r2N2K4J76J03m37K35J55l1
5370A46j60L2l1J17p6l47L55q7RK73l22K59m89M11k6k15K76j42N3j35K5oK7q3
5394a36J5J92j5k15J63J43j10J55J03m25L73j57o1QKo6J20P6j61o8K39l14L33
5417A94m7o8J71j35p1k0k37O4O1k03L10j08J29j01m6L44N6R1l86k3J38r5J31j37
$$ y = [82, 21, -58, -17, -47, -125, -182, -19, -224, 58, -5, -95, 86, 160, -104, 186, 89, -56, -179, 343, 174, 170, 92, 24, -142, -304, 163, -229, -262, 75, -37, -69, 61, 121, -236, -153, -207, -171, 155, -176, 228, -96, -252, -287, -228, -42, -280, -93, 37, -326, 32, 209, 123, 93, 224, 161, -54, 15, -33, -314, 61, 56, 24, 219, -171, 130, -76, -64, -7, -60, -65, -231, 70, -17, -5, -164, 8, 9, -69, -44, -49, 72, -131, -323, -185, 53, 56, 89, 45, 220, -176, 188, 394, -216, 26, -25, 157, 52, -17, 120, -67, -200, 301, -343, -302, 6, 197, -55, 193, -23, 15, -39, -131, -79, -55, 121, 224, -213, 22, 177, 146, -14, 18, -13, 104, 28, -319, 36, -51, -42, 231, -91, 168, -321, 90, 64, -151, 125, -17, 36, -99, -74, -80, -53, -136, -121, 71, 56, -159, 4, 147, 37, 192, 295, -130, 243, 86, 25, 33, 35, -31, 89, 165, 4, -64, 175, -139, 194, 147, 79, 250, 115, 44, 24, -213, -149, -88, -291, 19, -89, 40, -61, -107, 237, 293, 384, -2, -25, 113, 18, 149, 12]
5441A2J79l62K8n7M4L01j46j38K26l38N30j47k28J52O8p7p7P4j37M88n97J2J70
5464b0l26J47L01j05O7k55J42k46M94j15J92k24J38Q7m96O0N9k5n0R3k5J41l55
5487c21L18r8O1j11L12p0p1O6j55K56p5j09K93m63k3J49j13K09K7l0J9q1O2K3
5511G5j9j82N7L7L23l30J08o2p2k17R0M09m43L8J39J42J97l36n1M3J25R1M2j81
5535B3J56k6r4k21J28j33J17J10j85P2J56m34J26k0N53k11M9j50r1L34l60J66
5557F5o8O5l30M18r9rj44J26n6n5M17k25l21K68J1K26L9j48k72K65J02j65k06
5580i6L0J22j78l1J1k7j07J86q5J49K1P8R6k68JN0J47j05j51L37j69j21J3K35
5604A38j37j32L11m15P1K76j35j8j40L78l54R3J04q0POL3p6O2k19J04L19j64J90
$$ y = [12, 191, -171, -143, -200, -156, 145, -1, -139, 87, -251, 279, 132, -96, 56, 124, 47, -30, 44, -93, 395, -202, -190, -20, -346, -199, 102, -3, 64, -191, -49, -295, 199, 84, 276, 52, 190, 277, -219, -159, -100, -125, -175, -82, -107, 34, -321, -3, -101, -40, -151, 161, 91, 20, 86, -69, 187, 112, 3, 296, -167, -190, -41, -154, 55, 82, 52, 71, -10, 52, 75, 56, -126, -69, -32, 291, -39, 69, 7, -65, -282, -192, 217, -226, -188, -49, 93, 290, -46, -97, -54, 71, 162, 204, 23, 179, 153, 59, -162, -34, -167, -50, 60, -125, -53, 103, -331, -205, -225, 328, 117, 166, 16, -75, 259, -101, 65, -3, 62, -268, 150, 51, 42, -102, 24, -32, -87, 330, 105, -216, 52, 63, 289, 328, 180, -92, 173, 275, 110, -96, -66, 56, -122, -153, -142, -169, -276, -90, -175, -26, -5, 73, 169, -99, -98, -48, 99, -6, -157, 180, 11, -110, -97, 138, 1, -131, 180, -235, -164, 112, -23, -41, -181, 197, -157, -64, 40, -40, -33, -27, 6, -70, -8, -227, -123, 196, 32, 222]
$$ [...]
8191G1
##END NTUPLES=NMR FID
##END=
