##TITLE=1H_DE-107k_EA_TFA
 200.13MHz, CDCl3,
 8 sc
 
 29.8.2025
##JCAMPDX= 6.0         $$ Bruker NMR JCAMP-DX V2.0
##DATA TYPE= NMR FID
##DATA CLASS= NTUPLES
##ORIGIN= UXNMR, Bruker Analytische Messtechnik GmbH
##OWNER= pz
$$ XWIN-NMR		Version 3.5
$$ Fri Aug 29 15:50:08 2025 Russian Standard Time (UT+4h)  she@DPX200
##.OBSERVE FREQUENCY= 200.1313
##.OBSERVE NUCLEUS= ^1H
##.DELAY= (6, 6)
##.ACQUISITION MODE= SIMULTANEOUS
##.ACQUISITION SCHEME= undefined
##.AVERAGES= 8
##.DIGITISER RES= 18
##SPECTROMETER/DATA SYSTEM= spect
##.PULSE SEQUENCE= zg30
##.SOLVENT NAME= CDCl3
##.SHIFT REFERENCE= (INTERNAL, CDCl3, 0, 14.3821)
##AUDIT TRAIL= $$ (NUMBER, WHEN, WHO, WHERE, WHAT)
$$ ##TITLE= Audit trail, XWIN-NMR		Version 3.5
$$ ##JCAMPDX= 5.01
$$ ##ORIGIN= Bruker BioSpin GmbH
$$ ##OWNER= she
$$ F:/spectra/data/she/nmr/H-C/1/audita.txt
$$ ##AUDIT TRAIL=  $$ (NUMBER, WHEN, WHO, WHERE, WHAT)
(   1,<2025-08-29 15:48:56.96 +0400>,<she>,<DPX200>,
      <created by zg, POWCHK disabled, PULCHK disabled
       configuration hash MD5:
       00 E9 B6 7A A2 85 ED C7 34 08 36 98 17 FE 4E 26
       data hash MD5: 16K
       22 CF 65 D3 E3 B5 C6 7A 81 ED 54 A5 61 4E A1 A8>)
$$ ##END=
$$ 
$$ hash MD5
$$ 48 EF EE 2E 8B 45 12 AB 2C BA 3C 75 FB 4D 38 1D
##$RELAX= 
##$RELAX= 
##$RELAX= 
##$RELAX= 
##$RELAX= 
##$RELAX= 
$$ Bruker specific parameters
$$ --------------------------
##$DU= <F:/spectra>
##$EXPNO= 1
##$NAME= <H-C>
##$PROCNO= 1
##$TYPE= <nmr>
##$USER= <she>
##$AMP= (0..31)
100 100 100 100 100 100 100 100 100 100 100 100 100 100 100 100 100 100 
100 100 100 100 100 100 100 100 100 100 100 100 100 100 
##$AQSEQ= 0
##$AQ_mod= 1
##$AUNM= <au_zg>
##$AUTOPOS= <>
##$BF1= 200.13
##$BF2= 200.13
##$BF3= 200.13
##$BF4= 200.13
##$BF5= 200.13
##$BF6= 200.13
##$BF7= 200.13
##$BF8= 200.13
##$BYTORDA= 1
##$CFDGTYP= 0
##$CFRGTYP= 5
##$CHEMSTR= <none>
##$CNST= (0..31)
1 1 145 1 1 1 1 1 1 1 1 1 1 1 1 1 1 1 1 1 1 1 1 1 1 1 1 1 1 1 1 1 
##$CPDPRG= <>
##$CPDPRG1= <>
##$CPDPRG2= <>
##$CPDPRG3= <>
##$CPDPRG4= <mlev>
##$CPDPRG5= <mlev>
##$CPDPRG6= <mlev>
##$CPDPRG7= <mlev>
##$CPDPRG8= <mlev>
##$CPDPRGB= <>
##$CPDPRGT= <>
##$D= (0..31)
0 0.7 0 0 0 0 0 0 0 0 0 0.03 0 0 0 0 0 0 0 0 0 0 0 0 0 0 0 0 0 0 0 0 
##$DATE= 1756468136
##$DBL= (0..7)
120 120 120 120 120 120 120 120 
##$DBP= (0..7)
150 150 150 150 150 150 150 150 
##$DBP07= 0
##$DBPNAM0= <>
##$DBPNAM1= <>
##$DBPNAM2= <>
##$DBPNAM3= <>
##$DBPNAM4= <>
##$DBPNAM5= <>
##$DBPNAM6= <>
##$DBPNAM7= <>
##$DBPOAL= (0..7)
0.5 0.5 0.5 0.5 0.5 0.5 0.5 0.5 
##$DBPOFFS= (0..7)
0 0 0 0 0 0 0 0 
##$DE= 6
##$DECBNUC= <off>
##$DECIM= 32
##$DECNUC= <off>
##$DECSTAT= 4
##$DIGMOD= 1
##$DIGTYP= 9
##$DL= (0..7)
0 120 120 120 120 120 120 120 
##$DP= (0..7)
150 150 150 150 150 150 150 150 
##$DP07= 0
##$DPNAME0= <>
##$DPNAME1= <>
##$DPNAME2= <>
##$DPNAME3= <>
##$DPNAME4= <>
##$DPNAME5= <>
##$DPNAME6= <>
##$DPNAME7= <>
##$DPOAL= (0..7)
0.5 0.5 0.5 0.5 0.5 0.5 0.5 0.5 
##$DPOFFS= (0..7)
0 0 0 0 0 0 0 0 
##$DQDMODE= 0
##$DR= 18
##$DS= 0
##$DSLIST= <SSSSSSSSSSSSSSS>
$$ [...]
##$SUBNAM0= <"">
##$SUBNAM1= <"">
##$SUBNAM2= <"">
##$SUBNAM3= <"">
##$SUBNAM4= <"">
##$SUBNAM5= <"">
##$SUBNAM6= <"">
##$SUBNAM7= <"">
##$SUBNAM8= <"">
##$SUBNAM9= <"">
##$SW= 18.0517328524113
##$SWIBOX= (0..15)
0 0 2 0 0 0 0 0 0 0 0 0 0 0 0 0 
##$SW_h= 3612.71676300578
##$TD= 16384
##$TD0= 1
##$TE= 0
##$TE2= 300
##$TE3= 300
##$TEG= 300
##$TL= (0..7)
0 120 120 120 120 120 120 120 
##$TP= (0..7)
150 150 150 150 150 150 150 150 
##$TP07= 0
##$TPNAME0= <>
##$TPNAME1= <>
##$TPNAME2= <>
##$TPNAME3= <>
##$TPNAME4= <>
##$TPNAME5= <>
##$TPNAME6= <>
##$TPNAME7= <>
##$TPOAL= (0..7)
0.5 0.5 0.5 0.5 0.5 0.5 0.5 0.5 
##$TPOFFS= (0..7)
0 0 0 0 0 0 0 0 
##$TUNHIN= 0
##$TUNHOUT= 0
##$TUNXOUT= 0
##$USERA1= <user>
##$USERA2= <user>
##$USERA3= <user>
##$USERA4= <user>
##$USERA5= <user>
##$V9= 5
##$VALIST= <valist>
##$VCLIST= <CCCCCCCCCCCCCCC>
##$VD= 0
##$VDLIST= <DDDDDDDDDDDDDDD>
##$VPLIST= <PPPPPPPPPPPPPPP>
##$VTLIST= <TTTTTTTTTTTTTTT>
##$WBST= 1024
##$WBSW= 4
##$XGAIN= (0..3)
0 0 0 0 
##$XL= 0
##$YL= 0
##$YMAX_a= 340462
##$YMIN_a= -294182
##$ZGOPTNS= <>
##$ZL1= 120
##$ZL2= 120
##$ZL3= 120
##$ZL4= 120
##$ABSF1= 10
##$ABSF2= 0
##$ABSG= 5
##$ABSL= 3
##$ALPHA= 0
##$AQORDER= 0
##$ASSFAC= 0
##$ASSFACI= 0
##$ASSFACX= 0
##$ASSWID= 0
##$AUNMP= <proc_1d>
##$AZFE= 0.1
##$AZFW= 0.1
##$BCFW= 1
##$BC_mod= 2
##$BYTORDP= 1
##$COROFFS= 0
##$CY= -3
##$DATMOD= 1
##$DC= 2
##$DFILT= <>
##$DTYPP= 0
##$F1P= 0
##$F2P= 0
##$FCOR= 0.5
##$FTSIZE= 0
##$FT_mod= 4
##$GAMMA= 1
##$GB= 0.15
##$INTBC= 1
##$INTSCL= 1
##$ISEN= 128
##$LB= 0.25
##$LEV0= 0
##$LPBIN= 0
##$MAXI= 10000
##$MC2= 0
##$MEAN= 0
##$ME_mod= 0
##$MI= 1.114404
##$NCOEF= 0
##$NC_proc= 0
##$NLEV= 6
##$NOISF1= 3.799351
##$NOISF2= 2.8
##$NSP= 1
##$NTH_PI= 0
##$NZP= 0
##$OFFSET= 14.38212
##$PC= 1
##$PHC0= -1559.578
##$PHC1= 9.79228
##$PH_mod= 1
##$PKNL= yes
##$PPARMOD= 0
##$PSCAL= 0
##$PSIGN= 0
##$REVERSE= no
##$SF= 200.129724274929
##$SI= 16384
##$SIGF1= 3
##$SIGF2= 2
##$SINO= 400
##$SIOLD= 16384
##$SREGLST= <1H.CDCl3>
##$SSB= 0
##$STSI= 0
##$STSR= 0
##$SW_p= 3205.1282051282
##$SYMM= 0
##$S_DEV= 0
##$TDeff= 0
##$TDoff= 0
##$TI= <>
##$TILT= no
##$TM1= 0
##$TM2= 0
##$TOPLEV= 0
##$USERP1= <user>
##$USERP2= <user>
##$USERP3= <user>
##$USERP4= <user>
##$USERP5= <user>
##$WDW= 1
##$XDIM= 8192
##$YMAX_p= 0
##$YMIN_p= 0
$$ End of Bruker specific parameters
$$ ---------------------------------
##NTUPLES= NMR FID
##VAR_NAME=  TIME,          FID/REAL,        FID/IMAG
##SYMBOL=    X,             R,               I
##VAR_TYPE=  INDEPENDENT,   DEPENDENT,       DEPENDENT
##VAR_FORM=  AFFN,          ASDF,            ASDF
##VAR_DIM=   8192,          8192,            8192
##UNITS=     SECONDS,       ARBITRARY UNITS, ARBITRARY UNITS
##FACTOR=    0.0002768,     1,               1
##FIRST=     0,             0,               0
##LAST=      2.2672688,     0,               0
##MIN=       0,             -294182,         0
##MAX=       2.2672688,     340462,          0
$$ Real data points
##PAGE= N=1
##DATA TABLE= (X++(R..R)), XYDATA
$$ [...]
1920e8j00L22m08N01n18K38k67K57O6mk7O0j27R7J65l25K71K4j65O9K29m93J32
1943f1n1J93Q9k61j62M2L52r2MJ3N9j59NJ82O3m12M58p9n07M63m1kj73R0L9k06
1969a54rJ60O4Q1r7k79L39j54L6J34k84L06m7j6k72L28j67K21j93Q2j65R8nj15
1993a08L62k60j72N11l39K8P3k05R8j32J18j62J01m4L38m06L75m17K88Q6l48j34
2015c49K86O3j26l6N7J36J14j22k2j66K85J66k07o3j9k9J2K70m38J9M1R6k25K04
2039e3P1K00k25K72k85L7q7N60k39N3k81J00j56r4L59k76J38k79K02J01k71J47
2061fk30K00J83j97K69l08K15J08o6k69J36k49J40J84k63R0R6j21N7N9K49j74
2083A03n1o7o3Kj9P7j25K06M6k43K97k73K36Q5l24N5M2L7k39L76m17K67j19k10
$$ y = [-58, -158, 164, -244, 257, -261, -23, -290, -33, 33, 29, 2, 62, -65, 32, 197, -128, 143, 167, 2, 71, 300, -193, -61, -112, 81, 170, -91, -253, -211, 141, 49, 53, 66, 125, -34, -29, 153, 216, -196, 262, 183, -324, 139, 98, 96, -77, 13, 52, -154, -163, -3, 61, 142, 45, -234, 105, -49, -13, 121, -163, 143, 96, 80, -192, 136, -31, 190, -3, 79, -86, 12, 7, -108, 254, -6, -178, 333, -6, 22, 95, -110, -12, -144, -26, -188, -87, -131, 207, -199, 176, -241, 47, 133, -215, -349, -63, 0, -126, -162, -105, 31, 145, 23, 1, -165, 120, 286, 79, 16, -3, -32, -20, 250, -188, -169, -128, -32, -257, -53, 18, 218, -7, 265, -20, 17, -70, 490, 251, 304, 23, 123, -33, -127, 232, -44, 94, -185, 17, 118, -153, -6, -236, -36, 147, -50, 219, -89, 126, 234, 168, -101, 35, -214, -74, 110, -153, -63, 33, -88, -31, 28, 277, 103, 52, -15, -78, -76, -95, -18, -143, 63, 109, -134, 163, -110, 126, 211, -113, -58, -16, 21, -218, 158, -259, 8, -111, -321]
2107c21N61k41j75J67J08j78L90m57nL15l71K87K26o97N57j25J2k02j5J67O2k72
2129b07K58l12L70mk5j65R9J19k02J52j42r3J36j54K37P5k74j40K52O1p6J20k64
2152a79L52o7j40n9j8P7Oq5L01Jl42J55O2j79n0Q1J48k23j4j01L43j83K44j6k30
2177a16K90N8k76P4R8m3K10j76j88N6q4Q6K4j02k02K61l73K29R3JJ6J10K5k29
2201a58m6K91j23J59J91k85j02K28p1J05p0J42m01kK79l53R2J64j02P7J14p1q8
2224c0J24J41j75J68k26K12j72k28J45j02k8L72R0j68k3M6l65M71m35K97Lj76
2246e9M2j62K64J43k65j65L43k73l7J97K45j86j5j42J28j1r0J88m7j10J29k14
2268i7M7J71j51J8M5k30N56l16r3N1j06K32k09k5j75K44mO4MM4q1q0J55j06k84
$$ y = [-321, 240, -1, -176, -9, 99, -79, 311, -146, -151, 164, -207, 80, 306, -391, 166, 41, 53, -149, -164, 3, 65, -207, 51, -261, 109, 105, 80, -85, 14, 133, -69, 83, -59, -152, -16, -170, 67, 142, -132, -272, -20, 41, -35, 85, -179, 173, 106, -34, -93, -111, -34, -28, -113, 188, 189, -153, 2, 64, -115, -165, -84, 64, -159, -173, -274, 69, -114, 130, 114, -116, 174, 232, -44, 30, 128, 85, 295, 119, -69, -13, -97, -11, 13, -89, -291, -30, -403, -174, -81, -80, -64, 46, 71, -158, -204, 87, -36, 123, 314, 29, -73, 155, 84, 189, 119, 261, -140, -142, 137, -216, -124, 40, -62, 15, 129, 58, -30, 94, 235, 60, 228, 2, 214, 42, -186, -41, -143, -171, 201, 291, 123, 100, 146, -219, 252, -183, 114, 117, -59, -17, -179, 85, 228, -37, -202, 141, -132, -169, 28, 273, 87, 72, -70, 58, 47, -43, 145, 98, -12, 117, -97, -50, 121, -30, -12, 33, -197, 359, 43, -50, 1, -105, 127, -82, -107, -282, -38, -42, 22, 26, 70, -11, -91, 64, -42, -326]
2293c26N6N00q8j42%m2J1L0J08m00L70j47R9N6l14KL23r1P8L52n60K32J59m41
2317a75p1M07k72K39p7P2j44j33R7q9K76j71k97K82n9J57J98m61J09P0N0k85J54
2340a23L99m52K21J32k45j40O0J40m2j06J3Q1J28J87j16n1k3P3j45k54K19J79
2362A35r2j66M35n9m10%K73j34Oj37K1K54L50l83O9p5J35k53k34L60l03M28j14
2385A06l51M47j33M9j06J01j48L31l19m1K64m41J24L36p3j91k0O9r4K46k34J75
2407I7q0J6m9J45m43L15k62m3M31k20K24j43j33L76j02k49K6K6n0J04O0j65M1
2430g8N3J8PkJ90j68j28J87r4j60M0qJ71K63n21j14M38r4j91R3j18J32P6L1j37
2455a14Q2J12j46O3l13N43l08j15M71n85K75J10l15M4K22L03m95K06l22L46j24
$$ y = [-326, -270, 230, 142, 0, 0, -42, -31, -1, 107, -293, 77, -70, 29, 85, -229, -227, 96, 5, 83, 435, -125, 107, 266, -175, -246, 161, -111, 128, 51, 123, -21, -154, -57, -146, 130, -41, -338, -56, -115, 42, 240, -221, -112, -42, 8, -277, -123, 276, -176, 45, 177, -68, -208, -148, -8, -50, -156, -143, -62, 66, 253, 137, 86, 63, 136, -9, -263, -44, 135, 43, -123, 312, 253, -157, -157, 116, -18, -12, -149, -128, 126, 476, 93, 162, 87, 222, -31, -265, 95, -208, 220, 106, -245, 202, 69, 118, 12, 113, -35, 296, -23, -64, 200, -241, -117, 219, 146, -45, -65, 4, -90, 156, -78, 97, 17, 33, -16, 129, -314, 1, -261, -304, 127, -93, 131, -12, -145, 231, 129, -120, -94, -68, -118, -14, 46, -119, -78, -25, -7, 0, -2, 188, 20, -108, 79, -15, -175, -135, -143, 28, 291, -230, -344, 94, 0, -191, -98, -216, -84, -8, 23, -114, -32, 80, -66, -3, -316, 227, -81, -196, 275, -310, -35, 75, -240, -196, 26, 329, -166, 40, -282, 64, -60]
2476f0J65j88M4j32j49K60k26K26j39K93j06J02pN2KR3m55L48k17M8m8mj38L00
2500F4j72J22J9l06M05j94mk94l8K07j94L94O8J82l49L45l90J65O7j76P1q9J44
2523D7J3O9J2j42lJ54l81J37p7Q8J04J76m18Q3K46m38M92j86J08k68J95L5mN6
2547I8k86P8O2j04K63k39L01r7MJ16Nm53J20J20L6R1j81K19l12J25jj98K29j97
2571b01J6o0K75LP6j52o8L2K1J04J8l44K19J32j92K6O1p4J16j68K1K11qk33m4
2596b13J08J11J88j55R1k79L35q8Q5rj17P6j93k8L49k99J2k01J70k19L18P7k91
2619a72J10N2j17J40k0N5k23K82k54M14k11rM9p8J5J14n8R1l72K47k38J79p8k9
2643a11l4L89j48j42oO9q4j34K47m41M71J09m7j24j43Q6J23j54jp8L99j53q1P8
$$ y = [-60, 105, -83, -39, -171, -320, -60, -286, -60, -199, 94, -12, 90, 83, 135, 137, 230, -225, 123, -94, -46, -94, -98, -236, 64, -108, 14, 33, -273, 132, -62, -66, -360, -398, -191, -385, 9, 77, 259, -90, 255, -135, 30, 97, -79, -8, -97, 47, 60, 129, 141, -1, -4, 150, -231, -94, -171, -83, 21, 197, -221, -138, 108, -330, 162, -24, 84, -184, 11, 46, 42, 98, -188, -110, -48, -152, 111, -128, 173, 76, 80, 196, 201, -252, -132, -12, 24, 115, -66, 153, -159, -34, -35, -233, -4, -201, -185, -245, 30, 33, 109, -43, -111, -79, -58, 46, 64, -280, -61, 71, -121, -95, -34, -108, 8, -160, -139, 72, 64, -169, -213, -105, 6, 194, 39, 130, -149, 186, 98, 183, 174, 57, 133, -60, -88, 261, -38, -26, -227, -57, -276, 42, 119, -172, -62, -10, -127, 13, -7, 48, -175, 107, -147, 267, 56, 47, 96, 18, 33, 147, 89, 180, -192, 55, -183, -4, -82, -111, -145, 244, 96, -46, -52, 17, -67, -201, 46, -395, 76, 185, 138, 14, -129, -43, 80, -74, -75, -153, 246, 93, 12, 90]
2667I0j69p0M2k6K42J42l6m45K85R6r3j01Q0m06L5N21m71J14O8J52Q5k15J01j88
2691a67K84j04q7L46k81j61K57R6l36K13M3M6k75K72k91J52j80J71j3K24m10L9
2713a62M4j67K27n4k4NK85k06J14j47M1L24j93l15Q5K10k20L39k71K85k70Q7m3
2736b6R7k76K95k14Q5L66j67p6N2l2l24K62j29K10r7k5J25m38J84K20j08j67K70
2759H7P1k57K88m4k27L55k37j75oK37j2k08J8M9M4j87j53N78l21J2r8K90R2j49
2783D7J0q6l4o7K45r3k9O7L10m80k68L43j6O0K76l97M97l02R7q4r9r9j8Q1P5K8
2809F4j66J16j53K26k76N6J40jM30n28P9k11M45l70J67K93m62L65l31o6N15m14
2831h2N5m1K00Rm2k84L89j82q4J12M5K69q05L04k31L80L8pj69M35k57k82L88l87
$$ y = [90, -79, -149, -107, -133, 109, 251, 215, -230, 55, 151, 58, -43, 37, -369, -334, 187, -284, -170, -102, 50, 135, -80, 21, -167, 117, 13, -74, 272, -9, -170, 87, 183, -153, 60, 103, 149, -126, 146, -145, 7, -173, -2, -15, 209, -201, -162, -118, -285, -58, -112, -136, -131, 154, -52, 62, -85, -44, 280, 87, -228, -143, 67, -153, 186, -85, 200, -70, 17, -26, 71, -205, 90, -124, -39, 327, 160, 84, 136, 104, -220, 42, -87, 123, 26, 1, 126, -312, -128, 92, -16, -183, 87, 158, -99, 189, 145, -82, 273, 36, -139, -145, 92, 80, -128, -110, -61, -17, -204, -357, 221, -100, -88, -186, 104, 196, 47, 57, -29, -63, -130, 115, 22, -7, 60, 370, -110, -378, -35, -51, 9, 285, -112, 385, 83, 180, 96, -3, -102, -120, -39, 36, 64, -102, 14, -139, 87, -189, -133, 7, 6, 436, -92, -13, -224, 221, -149, 18, 311, -151, 214, -117, -183, 332, -82, -27, -68, 132, 141, 99, -185, 204, 22, -62, 50, 95, 364, -441, -137, -368, 12, 50, 43, -126, 309, 52, -230, 158, -229]
2855b29J29K56l16L7J53P3m3j06J69j2k1p6Q5k59L3J92K2O7Q9j72K4r8jK2J0j33
2881a05K48k03J45J24k03N3Q0l96J77j0K28j80q1q1M8P3j3J87q8j02qJ27Kn9n5
2906i2J64qj62o9K80m8j51J60K50k66j43Q0j01K62j20J5j71K8j19J06M51k00l45
2929a99K21k21m7L18j02j49L60k37J42k10O9J16j43k25L68K45m31M77l02j12K4
2950c8K46L1l29L52l70J72J50k88L5K84k50j9K07k71M4m0Q4J75N0k77M4K1l20
2973c07K30j83L04j65K62j89k6J03k14K76j8m3J93j01N3j27L5k55R3p8L76j10
2995A09l85M34p6j76L26l25J80j07m0K08l28L14l04K11j93M2K14m35L56N9qj13
3017c7P3M6j6r4J1J51k84PL56j81M3j81L31q1J25k70k5R5L8k07J00j48J81j70
$$ y = [-229, -100, 156, -160, -123, 30, 103, 60, -46, 123, 111, 90, 14, 99, -160, -127, 65, 87, 154, 243, 71, 95, -3, -4, 18, 28, -105, 143, -60, 85, 209, 6, 59, 139, -257, -80, -90, 138, -42, -123, -204, -156, -83, -96, 91, 3, -99, -107, 20, 22, -37, -92, 72, 64, -98, -167, 113, 65, -86, 74, 324, 58, -85, -5, -106, 156, 36, 51, -120, -92, -211, -105, 346, 146, -199, 22, -199, -246, 72, -30, -179, 181, -56, 86, -124, -55, 61, -82, -307, 61, 306, -125, 352, 50, -62, -38, 208, 239, -90, 262, -108, 64, 214, -74, -39, 245, -5, -24, 183, -88, -44, -84, 0, 175, 225, -52, -8, 13, -307, -77, -260, 44, -121, 141, -48, -74, 29, -185, 91, 73, 30, 223, 122, 175, 48, 83, -172, -79, -157, 219, 109, -276, 158, 82, -94, 232, -93, 87, -20, -60, 148, -180, 134, -170, 41, -152, -110, 104, -331, 25, 84, 76, -37, 36, 82, 66, -28, -17, 134, -150, -143, 213, 32, 75, -106, 225, 144, 269, -1, -26, 69, 107, -100, 0, -148, 33, -137]
3041a37k9K98j79J3j0P1k28L56n0r1O0k31L63k19q8r5J38n8K22j43O2j36J97K09
3065B95k0l32jK23p6m36M02j75J32K20q9j03Jk07K89j95Q2K5J5k1n5MJ10j62k61
3090c35N90k28K02l63J54j66K52k17j8J72j11K55q4k01J98O8o7r0OJ23j74j3p2
3113a19O7k46N56n7j30l07RJ45L35l49J96j85Q3j51L8L86j4l63Q3K4R8p3j32K69
3137A63j30p4J50k1j50M1L2K01k65O5J02k17j13K33J3q9m3J42o2j58J11J34q1
3160a6ok70j02M90k87K71j39J53k63J93L60l67P9k48L62m05J05n2L90k37R2j63
3182f0jJ53n7m6K30k9k22J46j8r3k28K83j02M7J1P0j53J77m83M14oR5j30j38L83
3207B43q4L12o56Q9J66n9O4n0K41q5k71q1k7o3K45k78J26P9L9j17K29k69J51Q0
$$ y = [-137, -166, 132, -47, -34, -44, 27, -201, 155, 105, 14, 74, -157, 206, -13, -101, -196, -58, -116, 106, -37, 25, -111, 86, 295, 275, -57, -58, 165, 89, -347, 55, -120, 12, 232, 143, 40, 41, -166, 123, -72, 10, 35, 50, 29, -26, -22, 88, -74, -335, 255, 27, 229, -134, 20, -146, 106, -111, -129, 43, -68, 187, 103, -98, 100, 168, 101, 11, 17, 140, -34, -47, -119, -52, -298, 258, 201, 71, -236, -227, -82, 253, -96, 100, -85, -2, -153, -115, 271, 257, -106, -23, 1, 99, 26, -106, 163, 33, -41, 109, 88, -62, -21, 11, 212, -53, 12, 114, -103, -216, 17, 30, -59, -102, 40, -22, -180, -69, 65, -16, -22, -292, -394, 96, -191, 80, -59, 94, -169, 24, 384, 17, 96, -152, 210, -195, -90, -142, 248, 11, 103, -60, -61, 92, 35, -11, 219, 190, -32, 114, 96, 3, -225, 58, -44, 3, 14, 84, -69, 108, -375, 39, 33, 128, -2, -140, 243, 159, 471, -185, -96, 70, 11, 75, 25, 266, 181, -90, -171, -198, -261, -16, -294, -168, -89, -50, -167, 62, -207, -56, 24]
3231B4K18l73j16K43k31K83k9m01N66k33n8J63O0p7k84O32l82J4K0k42K24Mj01
3254g6j17J75J71k09k39M04K2j89J66m65N16j44J09l36Q9l4P0K59k63L03j17K04
3276B99q1l27q6Q7O5J80j73j82L14O7j2j35J51P7k98O6J64m4p6n9o3N7Q3o9K40
3301B45k25q1k50L91J88l57K4J18j10k64J56K02R3j28Q6L4l27M0K95o4k28K6J51
3324A5K04l41l6R7J83m2j76Q0K64o98L46J4K34M0k10J91J60m19J86o7n4J02j05
3347c2K95l74J40J80k92J0K84k92k01K38o3P7r8n6L5K41m6K06k40l0j05J44o3
3370d2J49m48M35k06M3O3RJ05r6Q5p1q1r0pj52J88K14k5k58R6K5q5K83j38l54
3395c58N81j63P3m9r3j61J84o4n3M46l35j99J72OK9j48l4L03j57Q7N6k7k44L5
$$ y = [24, 242, -131, -247, -4, -235, 48, 19, -382, 184, -49, -107, 56, 116, 39, -245, 387, 5, 19, 39, -203, 21, 25, -76, -193, -18, 153, -56, -295, 109, 131, -58, 108, -357, 159, 15, 124, -212, -123, -157, -87, 172, -91, 212, 95, 299, 218, -109, -195, -108, -43, 137, -36, -218, 96, 163, 151, 16, 167, 244, -54, 12, 176, 132, 56, -3, -66, -9, 74, 5, 245, 20, -61, -311, 80, 268, -89, -65, 53, -57, -321, -165, 37, 130, 2, 88, 122, -205, -165, 130, 66, -162, -136, 15, 219, -122, -158, -61, 122, 80, -96, -16, 248, -450, -104, -90, 144, 184, -26, 165, 325, -94, 92, 25, -29, 73, -32, 263, -111, 29, 209, -83, -73, 211, -81, -282, -44, -107, -30, -128, -184, -149, 92, 46, 252, 12, -18, -123, 21, -42, 107, -341, 94, -112, -69, -6, 3, 108, 12, 97, 26, -55, -145, -152, -304, -116, 98, 73, -185, -89, -64, -149, 134, -4, -358, 223, 60, 133, 84, -9, -170, 14, -50, -103, 343, 8, -191, -19, -13, 16, -132, -166, 137, -20, 67, 123, 96, -148, -113]
3419a13J50k0j43j15M38j30J18l61N92m00J30r5K85n17L52n9k10N0K52j94j40
3440a30K28o32O99l83J63K24j94p9k56K97J31l42K40J71q7m63K32K04j21Q4j45
3461a59K14j31r9R0K9j36N0N4j7K66o1j81l2R1k9K97l79J74J52k55J35l56j8M66
3485A65J39j73k71L14j94J39j41J15k01k0j5M15m33M3K2J87l41L02r4J83J24j94
3507G1K8j43M0Q0k09P0M1k3J23l41J60J78j13J42l8k42K29M0J2l2k88K85J51l43
3531a22O6J43P5m9j86j62j0K28j32l75N99Mk64O1J15mpj63L06Q0k64OJ07qj41
3556i7m0j31J70K04j6j76o4J18K16J44l11J6jr9J88p6j65J69l3N6l05K99p0j26
3580a30J98j63K69k01p5M7k23K89q5L3O7l5l7J34k87k04L39J70j17J55j11j92
$$ y = [-113, 37, 17, -126, -241, 197, 67, 185, -176, 416, 16, 146, 51, 336, -181, 171, 112, -98, -48, 204, 10, -130, 98, -534, 165, -218, -55, 169, -25, -104, -360, -63, 68, -274, -34, 137, 50, -413, -181, 23, -98, -14, -159, 55, -76, -175, -85, -56, -192, -142, -88, -105, 161, 100, -81, -113, -22, -51, 246, -133, 41, 193, -62, 73, -283, -301, 165, 304, 131, -140, 174, -20, 119, -22, 93, -108, -128, -143, 272, -161, -118, -96, 91, -250, 52, -42, 141, 265, 71, 99, -44, -4, 76, -133, -63, -22, -45, 78, -263, -103, 75, -38, 104, 66, -176, 53, 93, 105, 73, -215, 70, 221, -122, -56, 87, 162, 113, -73, -235, -245, -17, -149, -524, 75, 79, -185, -124, -9, -13, -20, -183, 123, 203, -61, -55, 52, 44, -97, -137, -268, -98, 106, 90, -86, -150, -32, 184, 328, 17, 33, 32, -67, 121, 45, -120, 49, 16, 72, -233, 66, -4, -130, 68, -95, 174, -27, -102, -55, -278, 11, -74, -41, 26, -9, -46, 88, -199, -403, -64, 106, -11, 144, 33, -159]
3602a59K91m59L97K59l47L4q1j45K37k1J7j28p4K34m73K46K32j08J01J85k24j19
3624a05K5J61m5K0p9J39K8k93J31J00k08K94m33K29K89k23k3k00O4J73J6j55J55
3647F0n4j16J7K25L4j17k10J44m8K95j75l4pn7K79k44q9N0pK00M4m5j4k44OK75
3673A68Mk03J45o1n3K97j21m00L30k46L09j28k07J6P1K43O5j40k69K43Rj17j96
3696b41M6QK27r7K01j19m91L43Q2P2K6L5N3j72j79K84q7j87J90q2N9J69j51J21
3720A10k5N9k06Kn9Kj54P5M48j61k00K09r8K23k35l2m3%K55m1j5j46j24n6L17
3745A05j09K04j3o7L32p00J65J18k10J73j36K13k65K10l63N81l20p3M2N3M3K16
3767A99M7k43k59M3J6l7L06j18r5K53J5r8j54nL55j27r8k99M62j97M5pj28K59
$$ y = [-159, 132, -327, 70, 329, -18, 16, -65, -210, 27, 6, 23, -105, -179, 55, -418, -172, 60, -48, 53, 238, 14, -105, -80, 81, 36, 56, -23, 116, 144, -149, -18, 82, -126, 168, -265, -36, 253, 30, 7, -193, -129, 44, 60, -95, 60, 6, -110, -93, 132, 166, 49, -161, -17, -65, 230, 55, 21, 14, -43, 236, -8, -97, -47, -54, 146, 190, 145, 131, -113, -107, 168, 172, -31, 114, 53, 0, 297, 176, -224, 106, -140, 169, 41, -166, -150, -79, 164, 229, 89, -180, 63, 72, -45, -241, -195, -187, 40, -57, 144, 25, -466, -123, -41, 31, 57, 92, 145, -27, -206, 78, -9, -196, -6, -88, -29, 140, -11, 110, 85, 144, -62, -60, -119, -117, -271, -196, 252, 91, -109, 100, 2, 225, -10, -42, -85, -85, 170, 129, 114, -32, -156, -212, 105, -4, 200, 187, 120, 452, -248, -83, 35, -175, -2, -138, 75, -190, 20, -343, 238, -82, -155, -113, -60, -17, 199, 246, 3, -256, -213, -197, -234, 72, -46, -141, 112, 127, 29, -125, -130, 225, 98, 0, -299, 163, -34, 11, 4, -124, 135]
3791A35j17J11J28k63m1K07l75r1J92J78J48l88k21J58M27j10l23K7K79j77K26
3812A10Q3k31n2K78n71N99k57p8p5J01k09L51K1R6j4p7m1j20nK76o7k12J09R0
3836A05k62J35K0k42M46o3kP5l28K1K32j1q2j02l9K03J06k43pn2K40j42j17K36
3860A27r8q4j4J56j22q7M4J67r3L05j71k82J83j3q0j56M65l10N6j03k28K80J10
3883E2j81j2M9J06J39M2m42M30j74O9P0k6J60l06rQO0n2r6K7J37j59r3K14O6Q8
3909A67p8j97J20Qr0K7Q4j56Q2R5R5k93n8J43n2O1Q7r5O7J06L3j34j72J74j48
3934a24k3K96Oj80K73l75P1k13M28R1m20km0P1L04l22M04k4j61k32q7K59l3JP8
3959D6o7r4j12K69J72j13k77Q0J31M8j89J14J29pj43j7k7R8m11K30K76j22j4J30
$$ y = [135, 18, 129, 257, -6, -47, 160, -215, -306, -114, 64, 212, -176, -397, -239, 188, 78, -245, -218, 61, -116, 110, 193, -38, -90, 188, -383, 216, -41, -119, -194, -93, -302, 49, 70, 166, 152, 75, 34, -86, -91, 185, 118, -94, 15, 105, -157, -22, -2, -244, 202, 139, 137, 212, -116, -95, 137, 126, 44, -58, -97, 106, 212, -31, -38, -90, 150, 8, -109, 127, 29, -55, -69, 87, -35, -122, -78, 89, -4, 301, 130, -152, 31, 18, -62, -218, 247, -63, -7, -110, -338, -58, 52, -129, -141, -92, 14, 153, 195, -247, 183, 9, 78, 148, 122, 282, -24, -33, -25, 35, -17, -113, -86, 51, -108, -201, 13, 79, 167, 89, -108, 12, 20, -70, -43, 41, -115, -33, 62, 157, -136, -194, -51, -103, -42, 45, -50, 17, 123, 156, 22, -150, 24, -124, -147, 149, 155, -25, 248, -127, -56, -269, 159, 250, -170, -172, -212, -141, 163, -159, 245, 221, 60, -172, -259, 0, -33, -32, 46, -21, -115, -227, 42, 214, 101, -176, -96, 35, 83, -106, 8, 137, 130, -13, -30, -57, 41, -370, -140, 136, 14, 0, 130]
3983A30j45j15J66r6l5K36j11P7j83M5p6p8J10J18L20m18J19j15J0P1R2l14J12
4006h0j4J20J97j85J42j98K97m55KK05N2k36j13L60rJ31j88K5Om7j48K38n7j74
4030a29m0j32j6M80o0n0k45K55M7j19j87L88k07o2O6LJ08j86K19k57J9L8n2J55
4054C6P2o8J35l57J42J77l70L96j84K65k29j33K68m32L65k13RJ80J67l43k40L40
4076a7Jj34K41K68l55J70J67n36J37Q8p8j01K37O7l80K5L08K0m46J11O1J20p3
4099i9q1K65k9n4KO1n1l2J45j66R8k64N43j23n5j57K82m53M9M0k18L40j06o3K36
4124A10k77J3J44k3r4L80j78k26K54j43n4P2m7k2p9R6QL58m03J63j90jJ58J08
4148A27j35N9K42L9l95J55n9p8k0p3K54j74J36k53L17j58k01K43k16K32j28k1
$$ y = [130, -15, -130, 36, -60, -95, 141, 30, 107, -76, -31, -107, -185, -75, 43, 363, -55, 64, -51, -41, 30, 122, -192, -80, -94, 26, 223, 38, 180, -18, 279, -176, -174, 31, 83, -153, -266, 94, 85, 216, 28, 53, 59, 12, -136, 102, 45, -129, -169, -301, -317, 163, 103, 53, -192, 63, 110, -9, -196, 192, -15, -77, -11, -8, 100, -86, 133, -124, -105, -67, -119, 36, 108, 40, 175, -182, -40, 137, -233, 163, -21, 244, 15, -118, 150, -282, 83, -130, -121, 59, 226, -117, -357, -17, -16, -150, 91, 359, 4, 174, 341, -195, -58, 30, -48, -149, 88, 155, -225, -200, 108, 128, -318, -207, -146, -26, -99, -180, 85, 56, 2, 4, 65, 14, -18, 127, -39, 59, -205, 338, 215, 160, 3, 285, -168, -119, -79, -297, 43, -63, -126, 110, -167, -154, -10, -33, -127, 253, 75, -151, 103, -40, -94, -22, -69, -91, -170, -74, -66, 292, -111, 52, -138, -139, 19, 127, -8, 51, 293, 332, -63, 92, 33, -45, -65, -138, 116, -58, 78, -175, 142, -16, -217, 26, -190, 42, -86, -107]
4170a07N0j2k1K49n7m4%N9j31o7K75l12R6Q1l0J43j88P3j92R9K8R2Q2N7m08L62
4196A77J38l32N1k97K12L9n29O44O5m51O8L44J83j76Q2o34K43J26j97L71J62m01
4218a12J74k7K20j22l91J14R6M6k14J98J07j41n1j39J59K46j57j27J53m7j30L51
4240B06k16J98k44J14P0p0Q5j22o1j21J51k24K81j80J00j6J45k37k08O03m55J96
4262eo6o8J5J37r5R7N3J2o9m87N04m7m5L47o26K98J9ol7jO2k81L24M5J01k33q4
4289a36P9j03J08j50J70L39k71j5J42k84Q1M4Ll2k50J27J30k39K93j42K74R7j36
4312A29l28K23o0k8L82m17L65m04J61k52J87P7k66J20Q1J69Q6m13K37j7k16L1
4334a53J54j32r6M1R6J00J08l24K47M2k21Q6R4J00k24p6L20q4m7j84r6L31j13
$$ y = [-107, -57, -69, -90, 159, 102, 58, 58, 117, -14, -81, 194, -118, -22, 59, 29, 172, -16, 57, -135, -36, -8, 84, 166, 223, -185, 177, 315, -17, 34, -263, -51, -12, -541, 103, 168, -283, -215, 129, 312, 136, 218, -416, -173, -47, -244, 127, 289, -112, 62, 35, 255, 133, -258, -144, -48, -2, -216, -18, 89, -52, -103, -242, -83, 163, 6, -121, 32, -15, -145, 206, -10, 188, -56, 58, 128, 58, 143, 21, -40, -161, -10, -234, 47, -133, -33, -49, 96, -141, -349, 254, -201, -5, -71, -139, -124, 13, -82, 15, 68, 80, 11, -476, 28, -19, -64, 283, -343, -45, -26, -32, -69, -70, -8, -289, 35, 80, 181, -52, -136, -57, -160, -52, -202, -32, 307, 36, 21, 163, -121, -40, 4, 7, -25, -275, -148, -18, -257, 36, -106, 168, 265, 129, -199, 24, -36, -64, 318, -99, 266, -138, 23, -229, -42, 35, -231, -111, -30, 139, 225, -188, 49, 32, -184, -153, 1, -131, -227, -186, -90, 10, 118, -206, 41, 83, -138, -52, 42, 142, -82, -158, 162, 78, 31, -153, -249, 82, -31]
4357c1K15m50L68n3j7R2o06O98j35j70K30j93K22m42K08j7J87j48k6J95k31K06
4379A02M7k84Q2O9o3K20j89m7j0j12P0L02k76J95J72j10L4k58Qo0P8J46k11R9
4403DkO3j4J20k6k87J51l15N88m24L29n3J31r2q2j51J24L7j44mK3R1P4m49M37
4428A29k23L29j97j79j65O6K80o1K82n02M63j20l08k1l7M65k37Q0J7k01J92p1
4450a9K41l95P9J77P6l38L02k93K77m48K10J03P3o7K23j27q4Q7k43J99k27J25
4472f9j63L67k41K0L2P8o8L8m7J44J28J18m39J46j55m2Q6L04j01OJ08j67j92L06
4496A97p0m19K57o4J57K87l27J42m0p6j08L6P0N1J21l07O6kq4k5L9k4J79p6k07
4521b27K65j27m2O4j06l2M38l09N6J43mk31J35j33R6m42L77p8J0J57l3J32N1j64
$$ y = [-31, 184, -266, 102, 49, 32, 124, -482, 216, 81, -89, 141, -52, 170, -272, -64, -81, 106, -42, -68, 127, -104, 102, 149, -135, -53, 16, -47, 173, -16, -63, -73, -185, -115, 187, -89, 106, 278, 168, 202, -56, -48, -108, -30, 116, -95, 4, 2, 65, 51, 171, 145, -142, 9, -306, 282, -142, 187, 134, 265, 173, 91, -60, 64, 101, -43, -47, -24, 67, 141, -308, 129, -94, 235, 38, -141, -306, -240, 40, -21, 261, -241, 222, 102, -206, -227, -264, 201, -36, 44, 61, -140, 52, -19, 222, -173, -94, 83, 159, -179, 123, -170, 107, -341, -131, -28, 45, -22, 201, 74, -10, 77, -166, 33, -194, -69, -232, 135, -106, -86, -54, 24, -44, -6, -53, 91, 219, 337, -102, 44, -111, -153, -67, 237, 136, 142, 250, 83, -109, 197, 127, -292, -35, -99, 58, 345, 18, 160, 120, 44, -64, -28, 42, 93, 214, -93, -27, -29, -113, -138, -99, -123, 56, -20, -227, 38, -89, -131, -67, -173, -205, 233, -76, -20, 123, 119, -112, 23, -110, -14, -456, -79, -157, -147, 10, -23, 109, 160, -4]
4545dj46L45m68L11N4n4J01j33K2K12k56K01j51k61M52j4o61K97J05Q0p7K54k26
4568a7j05L11j57m72K86K20m40M16l16K46j79L26k23o1J75k35K0K45k84Q8L54
4589A98j70Q7K3k84P1j5m6J37P3L8j8k48N8J51MJ4k61Q9J43M2O2j38R2j74K6O6
4615B0j50J23j12J18rK07j36j3j3l4J07K1N8j19n26M72j74J60r5O7O4kJ80l0k26
4640d2j8K07j44q4P5JK96j94J49j19l6l64K69K33l79K18J71k80M0n6K10o1Jj14
4664b1j23N9J56J26k0%k71L28j44n0j01k02J55M10n91J63J02q5J32o7r3J82oj2
4688B7J44J12j51j22k3k72K08q9l9L46j46O2J2j77lK8J11M9J80j14l1Q3j25M6
4712A16j38k9J8J01j3R4J50l45k94L97j86L72j05jl9k6l06K04J17Q5l78M32j95
$$ y = [-4, -150, 195, -273, 38, 92, 38, 139, 6, 28, 240, -16, 185, 34, -227, 225, 211, -450, -153, -48, 32, -45, 209, -17, -122, 189, 32, -440, -154, 66, -374, 42, -274, -28, -207, 119, -104, -165, 10, -225, -205, 40, -244, -156, 198, 28, 115, 138, -146, -75, -90, -136, 1, 74, 112, 94, -154, -96, 55, 59, 73, -188, -99, 44, 86, 148, 10, 102, -72, -46, 20, -130, -7, -119, -1, -10, 197, 61, 48, 35, 1, 108, 129, 187, 68, -458, 14, -160, 0, -95, -28, 36, 34, 214, 184, -42, -60, 147, 3, -81, -6, -5, 291, 97, 246, 127, 91, -273, -4, 229, -150, 68, 239, -41, -1, -57, 153, 92, 93, -21, -144, -85, 71, 197, 177, 177, -94, 234, 90, 40, -61, -263, -108, 302, -289, -126, -24, -109, 23, -44, -137, 45, 39, 27, 171, 283, 132, 10, -13, -285, -77, -166, -205, 141, -5, 57, 69, -108, -111, -83, 28, 77, 257, 143, 112, 195, 70, 116, -22, -51, -33, 68, 55, 149, 299, -46, -340, 57, -129, 243, 138, 137, 98, 72, -234, -30, 87, 172, -206, 226, 31]
4735C1K8k92J81O0o5R3j68J63m1J84j93P6k44r0M41j46K27k14J68kl72J66K83
4758B74j00pL5j81j01J33j4p0k79L78OK36k07K9k83K69j59j04L93l60O4J32k13
4781a29K51k16r4J98J05j79K11j95N9n7j03J26K58j34M5k17K32l08j0N11l98P6
4803C2lJ20j67M3j39j21R5J51J06l33O66k61k51j5R2o6K09r9k3K5r6J83q5M8K03
4828C14j93j0m05K47p5k3K06J7J31j48j22J80o5j3K1N2Lp7j66M04k97j26J80R6
4852A31J36l06j0Jj75K02q6K21j00J0ol4j94L4J72n1J60J00j25m37J33K21n0K7
4876b6P5Jl9m0Q6k18J84oK58r4j12nmq9k62K65k60P2MK45r6o6j0K2J36l1K61o3
4904A88k12K99k65K21J87l29j25J31O0k33J85l55M07m9l1l11K85k56K79J78j81
$$ y = [31, 59, -233, -52, 8, -57, 36, -132, 31, -10, 174, -19, 57, -187, -277, 164, 18, 245, 31, 199, 197, -175, -9, 274, 174, 167, 202, 21, -80, 53, 39, -31, -310, 68, 74, 310, 103, 132, -151, 118, -41, -145, 248, -112, -48, 84, -129, 122, -94, -188, 10, 115, -64, 147, -48, 11, -46, -149, -23, 235, 101, 146, -71, 161, -147, -157, 354, -44, 32, 29, 149, -18, 25, -114, -235, -140, 11, 117, -216, 450, 189, -62, -77, 15, -51, 158, 59, 36, 61, -35, 148, 63, 111, 314, 121, 111, -294, -47, -122, -145, 61, 78, 209, 61, -61, 119, 54, 41, 62, 114, 117, 40, -126, 278, -19, -145, 35, 131, 267, -39, -49, -48, -223, -21, -107, 114, 14, 24, 18, -16, -210, -176, -4, -55, 105, 205, 80, -357, -224, -3, -53, -26, 49, 50, 11, -29, 57, -161, 23, 17, 275, 181, 69, 64, 60, -29, -291, -26, -286, -214, -210, 35, -61, -127, -137, -115, 21, -10, 251, 188, -24, 275, 10, 231, 418, 89, -36, 95, 155, -78, 107, -248, 159, 110, 79, -232, 53, -203, 76, 254, 73]
4925G3J05j52p1K37o5R5q9j53J0K5l9P3J39j96j8j03K84j56J65j77k14J57om7
4949a23K41l77K08l4K46k05j13J2K07j05J42o5j91J50J01m21J54O0K04J2j54L06
4971B55k02j16L40N4l68J26m0j48J78o8n8J10J9J83m70m4L26m9P4r7p6J39j53
4994h5j52M94j79Oj29n3J99l19K81J31l4k71K04k1O6q9l01K82k24J66j41OJ64
5017AM7k78K02J84k52K2J33k9J08r4j96K65j09p9L8P6j77j99L68K5j10k77L49
5040A8K43k45J39k79M53n30P7K93k48L17j70J50k87p1K29r1k11K84k66J32o0K17
5062I4j99J31j67n6K94j99N1J48j28l5R5j40J93l98L94k26J97l0P2o5j57J6K07
5085I2j99j1J94k24J31L27k00k07N7j07p3J95K12r7M2mJL6k06N4L9k57K49J07
$$ y = [73, 178, 26, -45, 192, 127, 222, 133, -20, -10, 15, -24, 49, 188, -8, -26, -129, 155, -1, 164, -13, -227, -70, -76, -123, 118, -259, -51, -85, 161, -44, -157, -145, 62, -43, 99, 34, -157, -7, 94, -327, -173, -113, 91, 103, -51, 255, 53, -63, 277, 331, -37, 89, 49, -99, 79, 11, -47, 63, 82, 265, -205, -249, 77, 28, 102, 5, -71, 68, -85, -237, 257, 78, 84, -45, -98, 101, -218, 63, 194, 160, -111, 93, 72, 138, 49, -252, 30, -194, -28, -169, -163, 1, 48, -230, -28, 156, -96, -74, 59, 30, 138, 44, -152, 113, 4, -75, -37, 39, -138, -337, 31, 56, -54, -331, 18, 261, 16, 155, -124, 329, -201, -124, 169, -79, 238, 68, 218, -69, -140, 89, -2, -213, 71, -195, -63, -123, 94, -105, 26, -141, -197, 97, -102, -51, 97, -31, -66, 29, -111, 82, -316, 78, -148, 49, 19, 91, 26, -131, -115, 92, -107, -118, 76, -148, -17, 310, 110, -97, -40, -147, -220, -25, 187, 90, 132, 128, 129, 165, -41, 13, 52, -205, 44, 151]
5109A51j71J34o8k43L86j55N4O0J8l84N1o3L63j31k2J8l7k25Q7M84m69K11r2m1
5133h4J93j79j2L73k45p2L2k98O17j45q8J26j45J58n99N50n7k68J88J10k79l4
5155a58K90Q8k72o1J34q7J58j66j80N93n04K2L20j21Q1j94K87j88q4k6O4m5j54
5178b03L01r9n2P1K9q8L11m10K45l3j39j9N7J52j87k52N48k61Jk3O8J18K8j09
5202E4J14o2l4M53o47M7L07j01j56P6j16j4mj11J95l5J02J32r9j78P0R9j96M31
5226C27k72J09k71J94o0J96j94j67L50j80k3P5k17L23l36k26N70j78j85P0J0m7
5248a32J03J94J12k77R7j31k59J71J16J0l35K00K49P1l50L04k42J06R4n9O5k53
5270a46N2K58o3j08q0m4k37J97J19j3k07J43J32L3k06J59J53j84K61j86j23J83
$$ y = [151, -20, 114, 46, -197, 189, 34, 88, 148, 166, -218, -167, -230, 133, 2, -20, -2, -39, -264, -177, 307, -162, 49, -43, -84, 109, -70, -82, 291, 46, -26, 6, -292, 325, 180, 92, 218, 73, 231, -368, 182, 125, -143, 45, 155, -124, -158, 132, 220, -52, -113, 21, -66, 92, -74, -254, 339, -165, -143, 177, 56, 137, -57, 230, 42, -42, -68, -4, -49, -203, 98, -1, -53, 18, 47, -41, 270, -140, 105, 72, -67, -86, -29, 123, -64, -316, 232, -29, -28, -51, 17, 135, 163, 54, 168, 106, 72, 525, -122, -75, 232, 131, -25, 51, -65, -79, -83, -194, 1, -34, 68, 200, 101, -77, -7, 92, -104, 327, 55, 164, -107, 87, 27, 223, 29, -138, 212, 32, 9, 84, -133, 190, -146, -372, 198, 20, -165, -95, -85, -132, -29, 165, 277, 0, 97, -34, -293, -122, -6, 4, -331, -131, 118, 189, -161, 143, -99, 7, 101, 42, 107, -146, -94, 164, 101, -7, -87, -131, -368, -171, -52, -65, -272, -129, 3, 36, -170, -11, 142, -42, 219, 33, -90, 93]
5292I3k26J49q6j36K23p0L6K58k58P6o0k0p0K04l60M1L32j26L6l01J69Q3Kl3R6
5317E2J07l38L31l6j81K1j71L14k09L34k79L4K93l22m0J50N4N0j56nL9j30N6K36
5341B04k24j4Q2j33J55k50L23Q8l01k0L11j3p1j83j41R5l9L1J04k34J06J84j14
5364e4j1L4KL38j17j83j1M1J49j26Q7j14M3j54J60j26j30L19j58J41j8O2l55K12
5388C1o4L34l01j44RJ8J51K23l36j09K33r3j98J40L1L01m14L83O5n17L27o7j38
5411a35K21j12P9j03J83m7n4j19l6M36k83K3K76j96j4j70J47l3p3r5J59K3P5p5
5435G7o0J21l08J02p9K40k90K57l70R6J97K14l81J03K01J05k18J31k13K97k20
5456BL48m67J73j06J82j44J20l13L78k14q0o6M8J84l9K18j58k67J11J53q0L7n
$$ y = [93, -133, 16, -70, -206, 17, -53, -17, 241, -17, 59, -1, -21, -91, 113, -247, -206, 126, 0, 36, -265, -96, -13, -11, -44, 52, 159, -179, 152, 116, -65, -44, -215, 99, -110, 224, -55, -21, 272, -50, -90, 60, 114, 164, 8, 3, 42, -88, -32, 204, -20, -34, 48, -85, 70, -180, 143, 231, -70, -90, 221, 208, 137, -46, -187, -92, -131, -100, 4, -230, -124, 60, -54, -65, -31, -29, 309, 192, 9, -2, 39, 188, 62, 149, 35, 78, -76, 84, -42, -172, 147, -11, 130, 112, 174, -181, 31, -33, 301, 0, -144, -135, -117, 34, 257, -79, -188, 45, -48, -246, -106, -75, 226, -188, 195, 260, -257, 70, 3, -135, 86, -26, 53, -50, 133, 86, 32, -87, -123, 313, 30, 53, 329, 133, 119, -51, 96, 63, -10, -105, 54, 77, 152, 77, 17, 138, -170, -68, -147, 93, -197, 60, -310, -214, -17, 197, -184, -81, 120, 225, 7, 138, -75, 222, 2, 350, -117, 56, -50, 132, -12, 108, -205, 173, -41, -121, -187, -139, 45, 6, 224, 66, -201, -90, 63, -17, 20, 15]
5479A5J0J21k42J2K68l13J75k53L80n87O61l18KK01j54L0M0L17m31J61l6J60k56
5502c7K8l4Pj24L03k73K30k43J63O3j53R3k32K37m0L6l29M35J13m89Q0J90j01
5525g7K49j79J03J62k02O5Q1k30N9R6k20J67J54j33k62J26K97j4k65K25L2j59
5547G5j17p5L11k44J86j05j23J24j07J79o6R4k05J30K1j51J20N7j3j46m0R7k38
5570b36J79K24J14k96k6k33R0K66j12l81J45L80k39J81P9j38K61j40j11P2j0j75
5592a06K89K04m10r9J48O1K43l02KL09k79k68K06n9K02j01Q0J24k66J46j83R1
5614C2%o4k41K05L10k29j5J62j54J6RJ83j96J22k0j87M48m55J50J18m7l92K95
5637E0j44n1J04L66j79j98K1L04k82L3r0K20k65oJ99o4m28P92m53J76m3J2j2J00
$$ y = [15, 25, 146, -96, -84, 184, -129, 46, -207, 173, -414, 247, -71, -69, 132, -22, 8, 48, 365, -66, 95, 59, 219, -37, -9, -43, -36, -160, 143, -130, 100, -143, 20, 83, -70, 23, -209, 28, -12, 24, -305, 130, 243, -246, -166, 24, -77, 172, -7, 96, 258, 56, 121, 202, -28, 31, 127, -93, 74, 228, 95, -167, -41, 256, 242, -23, 202, 234, 75, -42, -117, 194, -50, 136, 31, -92, 32, -75, 104, 38, 132, -73, 57, 78, -73, 47, 104, 91, -55, -95, 2, -236, -57, 167, 281, -15, -41, -274, -184, 82, -30, -411, -266, 114, -125, 56, 135, -3, 258, 118, 7, 79, 69, -106, 183, 387, -23, -122, 26, 87, 330, 28, 30, 339, 60, -208, -2, -61, 141, 40, 120, 244, -22, 124, -59, 32, 32, -32, -273, -68, 242, 13, -2, 160, 6, 22, 31, 214, 18, 140, 120, -67, 381, -74, 76, 194, 147, -245, 50, -94, -145, -41, 325, 146, -52, -31, 273, -9, 24, -66, 154, -111, -117, 82, 18, -410, 382, -71, 105, 62, 74, 62, 162]
5661A62p1j38o4K49k40n9O7j04K30n49P03j94k17J24m9J01p9L42j18O3J5j60J45
5684A59j64O6N0J5K3jj62J24m6P8j18o7L05j39m47L61j7J82J66m61L0j35J06N2
5708d0n0J71k19J83J48k09M2Q3r3j37J14P7j73K39lR3l76P9l0L05m33M42m94K97
5732A6mJ37l19J49J59m85K21J98k57J83n6K98l77L69k29L9k97L67P1j08l65L44
5754E4k39PJ46k47K77O4j6K44j67k32L91m01K71k42M46n32K19O2K90k0m64KJ8
5777f9J69j71J89j38l7J26q5J55q9j12q4L3J81j69K85j07j99N2r7J78K64m13L2
5800a06j9L3K44l19O1j29K53k05K35k17J58P3l53K96qk43K72o1J11j64k14J37
5822a65K42k22m2J35l1K34k07N8O4N9ql7J84l17kj76L13j09J30Ok68J13R5n5o4
$$ y = [162, 91, -47, -111, 138, -102, -161, -94, -198, 32, -517, 186, -8, -225, -101, -150, -49, -128, 214, 96, 159, 174, 14, 159, -5, 61, 111, 126, 149, 148, -14, 110, 64, 142, 24, -43, 262, 123, -324, 37, 20, 202, 368, -93, -63, -198, -92, -40, -90, 81, -138, 45, 193, -16, 26, 109, 16, -121, -7, 70, -103, 136, 133, 226, -150, -71, -101, 204, -229, 213, -281, 16, 12, 149, -170, -21, 138, -347, -126, 72, -185, -2, -58, 240, -137, 232, 3, 42, -255, 112, 183, 75, -290, 54, -185, -178, -32, -279, -2, 62, 46, 290, 123, -109, 282, -119, 152, -90, 356, -176, 43, 105, 395, 375, -89, -87, -69, 100, -71, 118, -20, -57, 69, -16, 139, 50, -62, -146, -113, 68, -101, 184, 77, -122, -70, -167, 11, 275, -138, -106, -125, -92, 152, -167, -106, -235, 18, -187, 48, -169, -11, 62, -291, 5, -3, -246, 26, -35, 76, -88, -302, -165, 77, -145, -187, -52, -83, 151, -56, 2, 66, 125, 117, 80, 264, -53, -55, -231, 82, -27, 103, 109, -159, -46, 49, -6, -70]
5847g0P1J58l24L74r8k18K01N3n3k53K09o0m3j05J96l27J69j93M34k04K62j33
5869D6L7Rp8k4j21K67o8J20j37L1n3k12K02m1J6K0R3P0l32J15P2p6L00l3j30J53
5895B46k49J75m70J61L5K36k48m4K23q3j76M07l95J37L8L0R8m19K09K6K99m10
5917a74Q5J64k46M80l42j38P4Q7Ok33L91j06m1j83J98k38J30K0K26q4r0J95m20
5940b39J42K59q3q7n2k1N3j35K59ln04M12J51m9k23p5L90j75q0qK95j93Q7k69
5964a48K80l89KL10R1r9K5l4J48j75J06J8n2M8l3j50k3J13Q6k51K69k15N2k01
5988b22J62J62r6K78N0j86j57r1j5Pm8J90J40j45j21K32qk82L95l22lK17k89J03
6012d9N2R9l69L88J01n89K86M7j68K70o0J51j96q9J45R5j60J99j30j8k9r2k41
$$ y = [-70, 1, 159, -165, 209, 111, -107, 94, 147, 94, -159, 50, -10, -53, -158, 38, -289, -120, -313, 121, -83, 179, 46, 83, 92, 14, -10, -131, 136, 68, 188, 51, 82, 29, -183, 19, -22, -6, 14, 107, 177, -155, -40, 32, -44, 256, 223, 93, 246, -3, 172, -298, -137, -102, 134, -114, -158, 65, -18, -194, 213, -182, -45, -7, 23, 121, -298, -89, -63, 236, -174, -89, 75, -171, 309, -33, -171, -97, -10, -4, -237, 154, 48, 7, -176, 22, -216, -86, -66, 160, 76, -14, 181, -239, -97, 162, 79, -8, -60, -81, -28, -163, 96, 93, -411, 1, 152, 103, -120, -195, 195, 20, -60, -68, 227, 34, 121, -148, 132, -257, -255, 55, 146, 47, 72, 38, 186, 11, 117, 135, 83, 131, 98, -52, -75, 38, 124, -127, 142, -73, -21, -222, -60, 102, 6, 284, 334, 148, -9, -100, -115, -108, -156, 34, 174, 29, -92, 140, 132, -150, 245, -77, -80, 137, -152, -49, 3, 102, -267, 121, 222, -367, -81, -34, -202, 68, 8, 159, -37, -126, 19, 114, -46, 153, 23, 5, -24, -116, -357]
6035c57L60%J52r3k11Q5K1K62p5l06K6O4m3N5K72k36o3K94j75k23J72L9K64Q4
6059C68l59N4M6k01R4k37K51m9L5J3k3J13j2j04j5P3q2J01P0Rl36L12r7l58J87
6084a47J41J30l11L98j16l02R8K18O5n0k13O4n0K6L2n0J40K9j11j0K2j41R5K95
6108B52k54JJ33k6R9k06j9n3n6j02J44j55KK24k5j85L30j04j21J07j32J3M0K46
6132A53k48rQ1J57J03l63K12K1o2n9N0l72K55j36m2L22J5j9J12k35J3L43j98K55
6156C49m66nJ5p0J93o8J86N8l95O6Q3Q4J78k10Q5j9l6K05j60j40J03j42M2L76
6180C12m52k4P5R9J43m6R2j89j94K50P9j3l43J21K44m14J60k08L29k10Q2J62O4
6203A19Q2o08J99K88O8J2O4l35L38m07n7K81j67kJ42l4r4K12nJ49k9n9j16o8J35
$$ y = [-357, 3, 3, 155, 62, -149, -64, -43, 219, 144, -162, -136, -72, -115, -60, 212, -24, -87, 207, 32, -191, -19, 20, 284, 368, 9, 63, 109, -92, 2, -235, 16, -33, 2, 15, -8, 105, 93, -11, -26, 47, -35, 66, 136, 145, -191, 121, 24, -334, -147, -6, 124, -187, 211, 95, -207, -109, 109, 174, 124, -89, -25, -75, -49, -17, -67, 73, 102, -9, -19, 3, -138, -43, 252, -2, -1, 132, 106, 205, -1, -20, -73, -129, -231, -87, -242, -240, -16, -41, -226, 104, 0, -121, -14, -146, -133, -93, 153, -95, -104, -23, 134, 237, -126, 86, 107, 45, -14, 36, -336, -81, -217, -259, 63, 78, 59, 171, -64, -51, 292, 94, 349, -117, -122, -107, -177, 16, -52, 134, 192, -203, -137, -54, 30, 208, -2, 83, 64, 28, 233, 73, -67, 36, -106, -64, 312, -140, -164, -89, 10, 153, 107, 199, 10, -184, 66, 145, 132, -211, -90, 154, -260, -100, -308, 21, -189, -107, 55, 119, 201, -407, -208, 80, 148, 160, 224, -111, 227, -180, -237, 44, -123, -125, 17, -17, -111, 101, 96, 245, 216, 157, 41, -27, 108]
6228A08j46M4Q0O1l71L6o9N11m13N6K00l56K70l4j81L93q1r6J81j70j3j09O1J39
6252A01J01k30J62J6o7J11k46k0k21J09Q3q3l7K27M4J67k24j69l7K5K59l3j52
6275a14K46k32J21Q9J16k01n24L01O2J5J04k13P3J60RK08k64l7K15l64j7M13k86
6298a20J57j67J52J44j1k53j12P2K99m61K64j11J04k6J09j03PL24j52j02O0j83
6320a09J55m7K3k39M11l15j95L71q6q3K05o7j27r9R3O7R8K21l39N7K27k47J99
6343A74n11K66L6K0k24K47K65k46L2j67J22l62M34m6N8j11o8r4L19j81K51k57
6365d3J09P0q7j40J31K02k66J52k34J72m8Q2q0lj69N3K7J88J94l94R8k4k68L01
6389B3L5J56o6N4m05M2K67j27q1J74k22K28j46M4j60K80n58M32K56l68L36R3k36
$$ y = [108, -38, 6, 86, 147, -224, -188, -257, 254, -159, -103, 97, -259, 11, -23, -204, 189, 108, 12, 193, 23, 10, -99, -38, 101, 202, -28, 134, 150, 83, 194, -52, -72, -293, -184, -101, -184, -221, 6, 50, 217, -7, -176, -213, -188, 71, 38, -114, 132, -100, 21, 110, 226, 25, -499, -198, -136, -121, -17, -230, -157, 3, 12, 220, -44, -81, 134, -230, -247, 166, -120, 37, -130, 22, 166, 155, -98, -210, -138, 161, -300, -36, -147, -43, -69, 40, -63, -56, 268, 116, 14, 74, -109, 46, -1, 22, -217, 194, -121, -316, 55, -31, -114, 91, 24, -103, -202, -109, -42, 56, 277, -62, -5, 222, -25, 174, -337, -71, -35, -15, -239, 8, 273, 27, 59, -108, 14, -348, 86, 40, 98, -13, -81, -175, 144, -37, 214, -43, 66, 136, 49, -91, 40, 242, -24, 128, -106, 66, 18, 100, 20, 17, -152, -99, -72, 116, 310, -84, 14, -10, -278, 23, 58, 214, 148, 202, -203, -161, 106, -21, -102, 72, -150, 78, -68, -24, -184, 96, -462, -30, 226, -142, 194, 287, 51]
6412E1m7l5l3m4K52l8k48J54r1mJ29m2J47q2j59K54k20K8p0K9J53K76j89j53j85
6437a67J83k12L05k32n9L29p7K54l74j57J7K56q6r1M43k96P5r4O6K2r6rQ4J09
6461A93k52L9K52k69n0L4j3R7n6L6M7K38n9k53L35m49J68P6j43j2L9J43k91J49
6485an3K9j6j56J79k27N80k33l08K55q6P4J10k44K00q5j3j59J17l5k81M75m0j34
6509e2J71k12J12j74K88r4P7Q6q0k78O3K48k95K76j60L0J27r4l62L36j40J22j2
6532a7r6J95k50K52j41K5j9M8k0J90l67K05M67l83j36n8n8J6L86n00K36J19m9
6555D5j3p6J44j41J11j67J53k69K83K28m17R3j83P4K99n7Ql72N7j94O42j53j03
6578hK5Oj12J42l78L28j51P8o3J42J96j64j30M5K80j50j6k33M7k70M13R2l19N16
$$ y = [51, 4, -31, -64, -108, 144, 106, -142, 12, -79, -83, 46, 4, 151, 69, -90, 164, -56, -28, -98, -69, 84, 360, 171, 18, -167, 16, -196, 109, -123, -182, 147, 70, 324, -50, -207, -190, 66, -20, -111, 332, 36, 111, 17, 83, 105, 9, 0, 84, 193, -59, -20, 232, -37, -87, -53, -66, 31, -25, 11, 58, 296, 237, -16, 319, -130, 38, 114, -29, -41, -2, 141, -150, -1, -54, -25, -41, -197, -18, -245, 335, 102, -206, 49, -37, 37, 147, -97, 103, 18, 5, -154, -37, -72, -353, 122, 82, -52, 119, -93, 19, -155, 133, 39, 116, 202, 122, -156, -93, 155, -140, 136, -24, 6, 133, 39, -323, 13, -127, -5, -17, -113, 82, -168, 84, -57, -32, -51, -3, -23, 167, -200, 5, 472, 89, -47, -105, -163, -147, 239, -261, -25, 94, 45, 32, -44, 100, -41, 70, -97, 56, -213, 70, 298, -119, -26, -209, -135, 164, 107, 115, -257, -200, -394, 248, 95, -8, 17, 23, -89, 53, -325, 3, -148, -70, -133, 9, 205, 41, -89, -44, 236, 86, 70, -163, -116, -386, 27, 119, -200, 316]
6602C16k74j57J86l78M06j54l5L6J35j72L59k45K7J7Rj34K10n0N7j73k66L08j22
6625i4J22Q8r2L3l15L29p9JJ43j85P1Q6k51J05j76L12r7p3L14l23J26q5K87o2
6649A85k00j84K26n4k36L65k66K1K93R4l34K06J7k56K03k04Q6O3J32Nj46N6R4
6672A66j1j15k56K57K44j18o7j70J0J56j63K25l05j18J84R7j01J60l1j68R7Q1
6694E4J04K5M7k26j77K62k26Kn9K21J63k09j12K2J54M7L5p9P9r6kn3o9J35J14
6719A56k23J5R8J17j60K6%k08rL22l16L12j79k52L92R7j58n4K30k36K04j05j16
6742d7L22k90J24j00M5l22L9J47J8J17j74K86k19j5n4Q4K6K78l46J04J17m0j82
6765h2M22q2m46K27K27l06j17P0J72k33J78j62J66K5R1l31J92q4P5m3j90L25R7
$$ y = [316, 42, -115, 71, -307, 99, -55, -90, -54, 81, -91, 268, 23, 50, 67, 76, -58, 152, 102, 159, -14, -280, 28, -94, 28, 116, 24, 57, -258, 71, -8, -7, 136, -49, 22, 108, -143, -38, -214, 98, 1, -72, 242, -81, 45, -40, 247, 185, -15, -199, 27, -27, -263, 102, -164, -143, 150, 244, -90, 116, 133, -123, 80, -124, -38, 25, 157, 162, 16, 72, 166, 155, 40, -216, 41, 285, 167, 100, -70, -60, 96, -67, 158, -147, -265, -81, 16, -85, 75, 44, -124, -27, 54, 158, 183, 230, 4, -173, 89, -137, -135, -194, 27, 190, -19, -131, -109, 45, 92, 127, 48, 127, 31, 29, -24, -93, 42, 156, -67, -52, 46, 163, 3, 29, 29, -179, -188, 134, -182, 130, -49, -301, 91, 188, 30, -24, 206, -30, 174, 69, -47, 275, -15, 109, 9, 54, -268, -229, -82, -64, 53, -121, 165, -54, -69, -123, -39, -13, 265, -81, 23, 140, 100, -82, 340, 258, -188, 39, 266, -40, -157, -87, 85, -148, 30, -132, 34, 59, 150, -181, 11, -73, 2, -41, -231, 94, 191]
6788A91j01m4j80K14O8m47J80J54K8l6L0k15JK09q7L5OR1L69n71j8K8J12q2j00
6813a65p8K19Q0j10J67o5j16Q5J73k13j17K07k1k44O0k08K40J78j88K63l81J36
6835i8K18Rk33M60k81l3J17j43l9OL2j42K45J16r1l45K89k53K50k52K06J95l22
6858h9M6K13k41K8q8J25p5j37L41k55K51q2l0j7K08j35N9j22J56r3k49R5K43j03
6882D9mk27J12j45J27J43j24O3l2L3k27L96k82J53j14k22OK04q3L86m07L70j00
6905G5J2k6J23k01K8k47J41L10n1m8l23P7J51P4L4k34J02l6m5J31k31K04j67K23
6929G6j92m7J11p0n5J33k10J89K84l26J59p7j56K13p2p9J06L7k30K25j6J6M8k39
6953a72k0K86N3N4l10J75m3O0J04k90J55r8K70j22L0j59N6R3j63K32k11N7j79
$$ y = [191, 90, 46, -134, 80, 148, -299, -119, 35, 63, 27, 57, -158, -157, 52, -35, 0, 6, 97, 466, -105, -123, -95, 17, -65, -165, -243, -24, 56, -54, 113, 48, -68, 17, 190, -23, -140, 67, 46, -198, -138, -346, -106, 72, -116, 147, -234, -98, 120, 129, -104, 356, 75, 42, 159, 16, -23, -17, 15, -127, 118, 234, 143, -202, 87, -166, 84, -168, 38, 233, -89, -43, 170, -71, -43, -131, -6, -81, -218, 123, -132, 119, 37, 7, -10, 198, 63, 122, 0, 156, 63, -186, -91, 152, 49, 45, -182, -70, -215, -88, 55, -69, -6, -38, -5, -232, 164, -118, 35, -79, -301, -295, -91, -174, 212, -195, 175, 75, 87, 61, 184, -17, 11, -236, -95, 215, 164, 116, -207, -130, 21, 95, 129, -105, -3, -39, -84, 47, -184, 20, -147, 76, -116, -163, -52, -122, -177, -44, -254, -65, 219, -107, 52, -25, -181, 32, -40, -119, -13, 24, -206, 19, 3, 19, 67, -172, -192, 94, 147, 201, -109, 66, 23, 83, 187, -103, 52, -46, 224, 102, 132, -27, 29, 122, -41, 191, -20, 37, -142]
6976a42K37j7k46J14o1K17j61J12j4o7l7K6n2O3O1O1R7n50N10j75L44n18J89n2
7000f1J1j14J55j15L5K48k71L55k87P7j93j3L54j2J3k57j53J00p9J59j20K57j50
7023f1J33l19N1J10J01N7L1l01L43k74P9L02k35R5k68J72m9J10J91m57J11K98
7045B20k29KO5j93K80m49J96J12R8L0l01J59J23J09m57K60J01l6O1k50K30lq7
7068D1J51k97r7J66n0J33J51k93J89k3Q5r4O2J05O6l36n2j54L47J20j63r5Qq8
7092a18K33j44J55K2j92j23O1O5j9lK64M5m40j1K93J57j89K8K01k58j7r9q5L86
7116B12l10j53J42L93j78o3j00j77j0L41j15L12j83n1k86K16J23kk37K21r1J4
7138A8j0L0l4j68J67j92L22l71K89p9L08o03N08k66P6J26j69J75r7l2p1O2K49
$$ y = [-142, 95, 78, -168, -54, -115, 102, -59, 53, 39, -28, -65, -39, -91, -28, 33, 94, 191, -359, 151, -24, 320, -198, -9, -61, -50, -164, -9, -124, -89, 159, -112, 243, -44, 33, -160, -173, 181, 169, 182, -75, -228, -128, -207, -48, -168, 89, -61, 72, -247, -196, -86, 15, 72, 103, -198, 145, -129, -50, 252, 17, 112, -156, 16, -33, 77, 268, -189, -78, 220, -9, -7, 58, -135, 145, -304, -108, 4, 102, 132, -169, -10, 113, 222, -235, 25, 126, 90, 151, -99, 131, 128, 41, 192, -105, -202, -36, -86, 47, 198, -95, 94, 71, 156, 62, 124, 229, 295, -41, -93, -247, 100, 220, 57, -38, -30, -118, 115, -29, 126, 148, -44, -167, -106, -41, -60, -63, 201, 246, -194, -205, 88, 245, 56, 84, 285, 27, 10, -89, -174, 212, -98, -251, -109, 284, 106, 43, -57, -234, -244, 97, -18, 294, 111, 60, -226, -10, 113, 111, -126, 95, 4, 18, 8, 38, 4, -164, 3, -189, 133, -238, 51, -28, 280, -323, 185, -81, -5, 121, -48, 127, 30, -2, -73, -11, 238]
7161B38j38j12r5o8l2N05k63r2J68K78m86K16m6k76J81Q8k20J3R0k4j78K10J76
7184A33j28j42J65j96J81M7l3k41L28M4k37N7j00K95k45n2J81k7N9l03M26J3q4
7207A41J48k52j33J03P0q6j0ql79M65j79J10k13M39n70N11kl31Q1p3K46k28O6
7230h4p3J47k3J54j81K49J9k41N8o3J90k35J53j60L75r4k34m8q9j91N01l30L95
7253A95k19j59l5J84P2j45L49k64k81O5L98r3k97L09k14O3J06Q3Qn7j41J87j81
7276f7Lj77K26J15J02j49o1K46k78L0n5j23K86j46j58L11l30K99o6Q3j9k0r3J52
7300A11k12L58j80j69O7j7l92L52J99j87Q0n3K00k52q8J72P8k05J53Q4r8J43m43
7323b99J67N0k4r2J48J60j41j27K75k53J60J98j42p3j09N1j2k0k59M96j64O4J6
$$ y = [238, 100, -12, -107, -175, -207, 298, 35, -57, 111, 389, -97, 119, 73, -203, -22, 66, -154, -141, -51, -75, -253, -43, 133, 5, -137, 28, -168, 13, 60, 27, -214, 114, 158, -79, -22, -122, 173, -72, -124, 57, 30, 89, -214, 212, 225, 141, 289, 37, -96, 7, 77, -9, -19, -27, -406, 59, -120, -10, -223, 216, -354, 157, 155, -176, -95, -168, 78, -150, -84, -157, -10, -33, 121, -60, 189, 208, -33, 25, -38, 152, -83, 70, -90, 285, 191, -43, -91, -180, -371, 130, -200, 195, -24, -183, -218, -34, 38, -107, 242, -22, -303, -238, 160, 67, -230, 79, -135, -72, 34, 117, 125, 68, -73, 114, -67, -64, -241, -15, 100, 202, 53, -8, 238, -40, -10, -65, -188, 98, -48, -206, 105, -225, 74, 8, 91, 72, 52, -41, 111, -101, 257, 77, -92, -25, -42, -434, -82, 117, -70, 10, -43, 157, -95, -183, -11, 67, -138, 15, 99, 1, 144, -299, -132, -82, -106, -198, -50, 110, -31, -158, 117, -136, 24, 222, 80, 7, -102, -51, -63, -83, -342, 154, -10, 54, 70]
7346G0j06K00k84K14l33J90L7l78L5J88L01j85P4k21K03q9M01l89Q0R2Q3j58J01
7369A26k87K3K95k95J47o4K91j64k16J53j08J26j31p8L29p5j00J1K03p4j24l5
7391d7K1k8j52L39k98J76O7k7l9J6P3k15L8O8JJ22k89K42j73K16j84j0J49j51
7415h5L55l87J04R6j79J55j38k2L42k43J92j96k28M40J28m32J68k09L3P5N7L6
7437F2l70N04j25P0j58k8R2k32J90K4j15N5M3J12l16K49j35p5n1J01J7p8K56j74
7461h2K03o1k52QK13J72k79N5j07J31j58N8M5J0k15M0L01q8j24L03k37Kl6K89
7485A91N1m22L21k48K60m4j31j25J33K0K14j03j02L2j0K02k25l1J15n4M5M9n19
7508c81L16j08K71l0k25K18P5k64J52k53J09R8J41k52J50%K96o28K76k16j46N48
$$ y = [70, -36, 164, -120, 94, -239, -49, -12, -390, -355, -167, 134, -51, 23, -198, 5, -84, 317, -72, 8, 100, 183, 25, 126, -161, -138, 157, -138, 9, -55, 236, 72, -144, 9, -99, 27, -104, -182, 147, 72, -28, -17, 186, 112, -12, -47, -26, -54, -206, 133, -165, 11, 78, 51, 12, 28, 101, -114, -76, -8, -7, 115, -174, 68, -105, 111, -73, -83, 66, -85, 270, -117, -13, 83, -96, 59, -79, -101, 241, -2, 190, -6, -234, 206, 334, -98, 70, -139, -106, -31, 26, 62, -308, 196, 71, 141, -17, -45, 47, -185, 5, 29, -86, -31, 12, 124, -192, 57, -78, -153, -204, -103, -86, -164, 92, -82, 121, 60, -192, -184, 29, 201, -78, -23, -130, 1, -157, -99, -54, -44, -259, -219, 82, -6, -130, 173, -64, -62, -98, 191, 242, -180, 141, -107, 153, 109, -22, -147, -14, 6, 220, 117, 15, 47, 37, 239, 14, -17, 98, 44, 89, 138, -381, -65, -173, 98, 68, -157, 61, 136, -128, 24, -229, -120, -22, 119, -133, 17, 17, 313, -315, -39, -255, -401, 147]
7530A47k01q5Q5L08j3j93m53K21M03k41J72n1j55K15l47J56j17K73l25K15j32
7551a18J07k49J00q4J08J21J7N1N8o2J83k25J94o9j83k67L76r9P5j03J56j46J87
7574A28J34o27L98p5K7LK35m71O1K78j88r4J97J02o4O3l23K71p4K32k61L2K37
7597B21j56k72P8J12J8J0L4J72j25J66p5M0m24Q0K26j54K56n68M00p8k16J47j22
7620b30L87o7j18m42N72k08k6q0J26j2M6k05N86k65l4M2j59J24rk7K60m55j40
7643c34M71k15K51k01Q5k62K11J96j20l57L25L9k5j01J3R3k54J63J11r9J77Q2
7665B49l39J71K21n7q1j85k47J17L8K32j02j68R9j51p2K20O5m4n7J72J9J15j85
7688C0j29JJ17M4k02J48j74L60k91R7l62M21J07m98L78P8k01O2j37K50J19l42
$$ y = [147, -54, -139, -54, 254, 241, 48, -405, -184, 219, -22, 150, 99, -56, 159, -188, -32, -149, 124, -201, 14, -118, -11, -260, -160, -244, -136, -15, 2, 53, 111, 49, 232, 7, 201, 132, -51, -318, 58, -41, 34, -69, 87, -59, 128, 262, -365, 33, -42, -15, -12, 223, -248, -187, 91, -97, -191, 6, 108, 44, 107, -216, 55, -19, 213, -48, -16, 221, 65, -207, -129, -17, 1, 11, 45, 217, 92, 258, 183, 223, -201, -121, 105, -49, 207, -361, 39, -39, -255, -108, -230, 157, 90, -28, -470, 102, -106, -132, -212, -86, -98, -52, -257, 329, 64, 30, 72, -87, 37, 28, 1, 261, -194, -334, 137, -78, 173, -28, 57, -205, 6, 202, 82, -275, 50, 89, 64, -37, -24, 69, -185, -22, 89, -10, 167, 249, -90, 81, 302, 245, 164, -21, -268, -151, -113, 119, 17, -151, -52, -203, -275, -55, 10, -34, -91, 81, 100, 215, 30, -99, -98, 19, 63, -139, 9, -165, 195, -96, 1, -361, 60, 167, -331, 47, 125, -76, -14, -151, 99, 218, -124]
7710a24J76j15l4L1J31p4j85K03o6j7O7j05J08j14L84k77Q9j84J90j63O0R2k89
7733b16K21M6Q3j28L1L3p1%k25N62j46Ll50K9J11K2K49m33M2j50L42J50j37j15
7757d7K92p7o3j60j33K40j15K08o0pl31K59n2j77J82J18J1k85K69K0m4k87K62
7780B3j3K07lJ2j62k71M87j99l5j04j41j05R2L81n75O71m49N75k09j12k71l7J31
7803a07q4K85j6l30K36O8k53K43k89R1J32J19l0r3%L1L7j94K00J36j32o9Q2j14
7827e1N4J91k26j4o1K59k67K38J7j34j9Q4l1j26J00o5j3J09l6L0N7k05K64l02
7851a47j64K69J33L7j02j18j31L37k46r0J58j40J81J3M02p67N61q9j88l6J71J85
7873B29l69J62j79LJ58N2J88k03j59J90J26l33J92K17k78m0Q5l9Q4j50R1j32J90
$$ y = [-124, 52, -63, -97, -66, 65, -9, -194, 9, -57, -74, -7, -112, -4, -118, 266, -11, 78, -106, 84, -79, -19, 73, -216, 5, 51, 134, 6, 37, 70, -1, -1, -226, 336, 190, 193, -157, -128, -17, 5, 254, -179, -137, -287, 55, 205, 68, -47, 245, 168, 105, -55, -188, 52, -63, 145, 85, 78, -253, 6, -46, -223, -41, 77, 88, -197, 72, 92, 48, -239, 23, 10, 217, 214, 226, 64, -207, 280, 81, 46, -58, -199, -304, -212, 169, -406, 265, -184, 391, 182, 70, -201, -238, -107, -191, 94, 78, -252, -16, 52, -201, 42, -247, -156, -24, 95, 65, -28, -28, 3, 40, -154, 46, 182, 50, -19, 63, -51, 3, 194, -32, -46, -107, 152, -115, 123, 140, 6, -13, 71, 40, -86, 14, -51, -64, 45, 9, 39, 96, -109, 155, -147, -311, -42, 91, 128, 26, -92, -223, 114, -132, -222, -64, -204, -23, -10, 392, -375, 186, 97, -91, -127, 44, 229, -140, 22, -157, -154, 4, 56, 244, 41, -118, 72, 198, -135, 57, 274, -4, -44, 41, 2, 86, -64, 27, -105, 85]
7896H5n29J77Q1K00J45j27j91KR8L6J9M4Q7k00R9K16k27M9j89m9M2K46k35K05
7920H4k64J15L7k0J25o3k3K24k26j11N6Q6l00L32Q6r9j55L21k65m2R0k1j13l0
7944a76K65k81L13j80m7RL5K06j54J70m9K0k33L18j39j47P2k25O1L24j82J99k56
7967g7n8J91j46K32j92K1K97l3k68J49l85L65P9Qk44pk83L15J50j64J79k78K85
7990A36k06j41L68J50m13j11N17l32J3j84K17j15M7q2M93m67J63l1k67K93l3K10
8012B25j24j18l13N95k67J3K25j38j10K5j6K81j95p2K31o23N89m85J25J43J34
8033A25l11J61m8j24J69P9Jl09K59%j84Q1L16k70o6K2j10K08L12j72j59Q3R2q7
8057F8j42K94l45K37q4l01R7L03j6J81l47J08L7N7J73l42j65J23J03J12l36L06
$$ y = [85, -444, -267, -186, 14, 159, 32, -159, -157, -59, -23, -4, 40, 127, -73, 26, 242, 15, 64, -125, -174, -132, 114, -121, 84, -180, -65, -28, -48, 77, 14, -9, 215, -11, -122, -66, 20, -280, 52, 138, 39, -116, 205, -60, -102, -12, -33, -146, -176, 89, -192, 121, -59, -106, -97, -62, 144, -10, 160, 111, 131, -102, 216, 77, -70, 2, -223, -162, 162, -20, 179, -77, -135, 56, -90, 142, -50, -29, 268, 235, -33, 116, -269, 96, 175, 183, -61, -68, -351, -36, 114, -50, 129, -149, 136, -70, -211, 157, 307, -106, -217, 300, -32, -19, -203, 14, -101, -54, -136, 357, -110, 53, 22, -245, 48, 15, 225, 101, -17, -330, 265, -2, 11, 236, 98, -12, 13, -3, 278, 83, 11, 242, -381, 208, -277, -152, -9, 125, -186, -25, -73, -197, -28, 51, 52, -257, 2, 2, -182, -101, 215, -55, -121, -99, -209, -1, 311, 139, -20, 63, 155, 68, -74, 220, -125, 112, 28, -273, -176, 127, 111, 292, -55, 53, 90, 147, 320, -22, -187, -64, 39, 151, -185, 121]
8079A21k4J87l14J17k34J57j84k31K81J81n7m4n7k35L77j84J34k53M12J62k28
8100H4l01K17n9J15Q9j61j94j5L56k71L57k63J78J4L7j45q4Q6J74q5R3m30M7J97
8124C6J15k85j19J36K14l48L73Q7m58r3P6R1M41l43P3k39K46j59K92j17l8l8J54
8147I7j06J4m8L00k68N8l0oK19j52j83R0N2j72r3K84K47l02J93j23n5K0k49L89
8171A76J03l69o7L3J04J05j29j05J51j93R8J28q5M0OL48l74J64k99m7
$$ y = [121, 97, 284, -30, 87, -147, 10, -174, -405, -124, 57, 0, -44, -101, -336, 41, -143, -9, -262, 150, 312, 84, -217, 0, -59, 56, 145, -16, -210, -225, 131, -140, 217, -46, 132, 146, 183, 38, -46, 40, 214, 129, 222, -208, -161, 36, 151, -134, -253, -117, 97, -251, 122, 209, -249, -342, -266, -175, 266, -77, -4, -243, 3, -156, 136, 19, -19, -57, 97, -9, 5, -43, 257, -11, 47, 17, 11, 230, 78, -105, -15, 37, -135, -228, 56, 303, 1, 194, 71, 16, 36, -213, 176, 279, -90, -157, -124, -20, 85, -44, -149, 2, -191, -93, 35, -50, -10, -4, 344, -30, 134, -165, -212]
8191b12
$$ Imaginary data points
##PAGE= N=2
##DATA TABLE= (X++(I..I)), XYDATA
0@%%%%%%%%%%Qj6J6k0K8l2M0n6O4p2Q8j12J36j60J88k16K52k94L38l88M46n10
32b72N80o56P42q38R44j056J177j315J468j634J814k011K226k461K717k998L306
49A733l641M011m419M869n371N930o558P271q084R021j0119J1428j3016J4989
63H044j7517K0892k5653L2924m5525P3389k45857J34353M05412l46414j22331
74a28283J34428l1191q8148K58438M2772l29913p8928L42183P1930k21111q5731
85a13554Q1420O1749O5860o6908j54222N0688K05916n6616k00691N1851J52617
96G8110o2614l7776P7504q5789j02876J93949J33068k28662j53998K03093J34528
107A48537j34722p2135N3562k8686J1341J10340n2533j51404O8449J43753o7440
$$ y = [0, 0, 0, 0, 0, 0, 0, 0, 0, 0, 0, 8, -8, 8, -12, 16, -16, 24, -32, 32, -40, 48, -64, 72, -88, 100, -116, 136, -158, 180, -208, 238, -272, 308, -348, 394, -444, 500, -556, 621, -694, 774, -860, 954, -1057, 1169, -1292, 1425, -1573, 1733, -1908, 2103, -2316, 2553, -2818, 3112, -3446, 3825, -4259, 4762, -5357, 6071, -6945, 8044, -9473, 11419, -14234, 18690, -26835, 46554, -199303, -64950, 340462, -5952, -128283, 6145, -25046, -113194, 145244, 188016, -141897, -220825, 121358, 193288, -27823, -113554, -32134, 29615, 95475, 28567, -125655, -74967, 130949, 74333, -126358, -74507, 78110, 15496, -22280, 55224, -30565, -133441, 60508, 193576, -35086, -189084, 14009, 148537, 13815, -58320, -4758, -33444, -22103, 88237, 35704, -115700, -47251, 96502, 29062]
118B9062j06584O5299N8136n6695N540M5375p0338k7912J21644J8043j40054k4656
130h3140J21573L5163p8532l6947K0746J3731L1751J5788o3995l2997O4265K8441
142C5847l8571o052J1351j9410R443M8103k1119p0414L4863Q2798m9089q1349
154f3599M9193O7378l6590n0035J6076K3590o401N867R835k9978j6573L3537K3366
167B5666j0519k2891k0419K0929M5858j2377n6058K204N6976K92n5558P075M6388
180B7566k4101l3171L3753J4961l8139j311M2024n374m6990J0487N1810r262m1448
193a9195N129K4035N163p347j0156l118L932L800K973m424q322k261L777J2503
207F489n64k1070K803K4887k770j8131L363J2643Q69o995m18J739n490O009P624
$$ y = [29062, -77522, -12223, 45913, -10782, -5242, 40133, -30205, -58117, 63527, 81570, -58484, -83140, 38433, 73596, -4936, -41883, -21137, -7406, 24345, 40133, -23862, -56859, 7406, 35847, -2724, -8776, 2575, -16835, -7392, 40711, 19592, -50822, -15959, 66839, 17750, -63599, -14406, 52972, 16382, -33653, -17577, 6013, -388, 5479, 15314, -14664, -31237, 2300, 25666, 15147, -7744, -28163, -7234, 38624, 26247, -29811, -27607, 29369, 29661, -25897, -18822, 27566, 3465, -29706, 4047, 19008, -19131, -20442, 21582, 16208, -30782, -20295, 31515, 22253, -19195, -14066, 9969, 15132, 7785, -2371, -5489, -1557, 2243, 5216, 792, -7530, -9791, -6014, 6489, 5925, -15145, -12342, 12545, 9775, -8356, -4993, 7650, 8519, 1524, 1106, 2845, -2645, 3364, 10988]
222A0988j5950p798J4641M241r624m032L294K503o78M104J935j0869J755J6021
236A0531j831j1841L83P840M264o801q184N513L916m419k568r21J797P90l633
251e164N181K956r404K106J1296j416q388j439J0043L979j1152k553Q612j772
265B885l914J450j238r84o96R31L101n027l130P312J736l802q40J023M601Om001
282e87K632K51k581M397oo287k36L963J856n976m441Q085K776r775J460P493k567
299D57m158K670O210k336q594O263R453r198o795P454O211n896q115M831Q797
314G254r074o873J0544K507j0474j462J0592L400j2678k003J5943Qj4372M320
328b368J2011m637r742L364R004n661r177P334N055r711j271O797O62m784k023
$$ y = [10988, -4962, -12760, 1881, 6122, -3502, -7534, -4240, -1737, -2415, 1689, 3624, -7245, -5490, 10531, 8700, -3141, -2758, 5082, 9346, 2545, -5639, -126, 3790, -629, -3197, -4118, -2321, -1531, -5164, 17, 2973, -6431, -4325, 6971, 5555, -2833, -4272, 5771, 9750, -1402, -3955, 4657, 2885, -1029, 421, -817, -1801, -2497, -1566, 1535, -3492, -6622, 690, 2426, -1376, -2216, -1193, 3408, 3414, -587, 2045, 2296, -285, 4112, 4106, -2181, -2417, 1546, 3402, -2574, -7015, 1070, 3846, -5929, -4469, 3024, 457, -3701, -1031, 5179, 2843, -5751, 512, 9965, 767, -6028, 1426, 7637, 1741, -6374, -1543, 7254, -1820, -8693, 1851, 4358, -6116, -7578, 3014, 6414, -6264, -8267, 7676, 7684, -6688, -2368, 9643, 5006, -4736, -1372, 7632, 1971, -7206, 128, 5183, -4528, -5799, 998, 1660, -3124, -5147]
343e147M849L960m762j070L815N12M47j437n68L482k506l271L382L76l202j054
359b194P96R25j685j793M283j003l314M325J637l189J875K809j144l086J511N409
375F162l730p238O797L002q777m32O859k097o980K164Q512l831q130P868N779
390E928q567n00Q181j540n370K123M230k758l292L899n95o040M389K117o712J874
406b633N044m759l161P036J907p167L01R726l189r331R190N590j1858p88J1187
421G095l813r273M917O498p829m789R931K79j0210N059O880p819l57Q134k655
436B048o028M948N438p149l288R675j742j0152O877O362j0014k148Q938j969p602
451e806L853O323o181m069Q671O81q610N027O017p339j089P468j674o460L554
$$ y = [-5147, -298, 3662, -1100, -2170, 1645, 2157, 2604, 1167, 599, 4081, 1575, -1696, 1686, 2062, -1140, -2194, -1398, -473, -2158, -3951, 332, -671, -3985, 340, 1977, -1212, 663, 3472, 2328, -758, 753, 6162, 2432, -4806, 1991, 4993, -3784, -4216, 2643, 546, -6434, -4270, 4242, 411, -7719, 149, 5928, -2639, -3139, 5042, 3502, -1868, 255, 4485, 1727, -1565, 2334, 1739, -4301, 88, 2205, -4507, -2633, 2411, -2348, -5509, 1527, 3434, -3733, -3432, 6294, 3105, -6226, 2964, 8554, -3304, -4092, 7095, 3282, -5991, -1074, 5424, -2405, -7194, 2737, 3016, -7194, -2135, 4745, -3074, -3431, 4703, 2048, -3980, 968, 6406, -743, -4031, 5644, 3902, -6250, 627, 6989, -3025, -5173, 3765, 1796, -5806, -1953, 4370, -1811, -5880, 2791, 3472, -5138, -111, 5906, -1433, -2522, 4946, 3272, -3188, 366]
466C66N238n854m716P569N73q841L487N882o214j846N419m2m040J891M627l385
482A14l084O321K86o689L942M075n578j190M304j152m521J418M305l766m010O040
498H15Q76o155K840M884l683j547L930Q65l042k2L674j732l814L744R22m867Q26
515a486K877l081o30K214m99j737Q68K882j603k207M648L63m493K921K808l666
531A79j232K748N94k848r58L018j186l406K711P16l414J812K381j875l28J625
547E37P17j238P0K446n65k808K486M34k947P24J349j865m69N43N9o56j80J444
565H1n86j128K441k04j675J731Q46j612O38Q11l00q62m51J802j168k152J940K40
583C92k088R71Q46j470j20R42R22r01l01J735K81j632J129L70p83P91o12m99P27
$$ y = [366, 5604, -250, -4966, 2603, 3176, -5665, -2178, 3704, -2510, -4356, 1063, 1021, -3019, -1128, 3499, 114, -2970, 3351, 3637, -3052, 890, 4965, -613, -1803, 2501, 1349, -3172, -1754, 2551, -1215, -5225, 815, 1691, -4464, -1624, 3260, -423, -1970, 1960, 2825, -217, -239, 3435, 1703, -2111, 1633, 2555, -2312, -1486, 1391, -1690, -2320, -106, -605, -2342, -1474, 1408, -195, -2402, 2246, 2609, -1884, 1037, 3845, 179, -1053, 1695, 2289, -559, -1517, 1501, 315, -3091, -380, 336, -3078, -1266, 1115, -760, -1088, 537, 1254, 16, 86, 2532, 1967, -841, 1645, 2079, -868, -144, 1205, -660, -1129, -586, -527, -1183, -1363, 81, -505, -1633, 808, 604, -1071, 660, 1506, -106, 532, 1343, 1043, 181, -270, 1532, 364, -1788, 152, 392, -1696, -725, 121, -1349, -1469, -527, 395, -506, -807, 928, 1209, -423, 706, 1076, 293, 1084, 472, -27, 700]
602G00p57r75N25k5L24p24p90J782p18r03J929J20n16M82J16J44J49n17P06p9
622I73j283J155l77n91J23m51q43J058m45k09J4J19Q04k59m99J492o1q69J224
641A075qn85L36n26J41K1p52J85j34q89O58k59o13J006m89M74P18m88M34N28l43
662D90M31j61j46P24q05q47J446r86j015O70o26J67j37m39O86j45m9J056k10k6
682G8N15k52Q6R75r46J22L68o09L98r06m12L91p70nP49m45k88J94l5O32J91j86
704a55P90K31p06P37o28P9P29q81m51M98n38q7k8l66M59o59k6J370q81j59J015
725C43j21o4M27k6k71N10l75M51p97J42P17j091n32R48p07o17O24m56O20m66P49
746HO18r14qJ243q48k53J189n35l76K36K75k15o58o8Q26r61o90J338q77k77N91
$$ y = [700, -57, -1032, -507, -532, -208, -932, -1722, 60, -658, -1561, 368, 488, -28, 454, 570, 714, 863, 346, 1052, 973, -310, 845, 468, -123, 0, -451, -1294, -236, -681, -890, -876, -757, 47, -212, -711, 781, 720, -149, 1075, 1067, 482, 818, 292, 433, 454, -298, -113, -247, -1136, -478, -737, -1350, -344, -833, -359, 359, -129, 305, 833, 490, 921, 760, 614, 1338, 533, -314, 1132, 146, -869, -199, -825, -658, -795, -1234, -548, -693, -742, 314, 104, 78, 593, 341, 427, 1402, 456, 578, 946, 337, 735, -171, -583, -192, -962, -967, -218, -663, -951, -757, -792, -160, 31, -155, 635, 866, 160, 897, 269, 348, 1077, 196, -255, 243, -295, -382, -410, -776, -317, -976, -1002, 368, -513, -672, 343, 222, 158, 585, 559, 288, 798, 423, 874, 77, 219, 936, -155, -687, 261, -446, -1063, -439, -895, -275, -741, 8, 626, -288, -296, 947, 99, -154, 1035, 500, 124, 360, 635, 420, -238, -306, 520, -441, -1131, 207, -670, -947, -356]
767c56m23L73M88j68M38j65N16K85r95P04N51j332J6Q65o47n85J20j78J68m72
787g97M7P08j020R3J443m21m13J084k65M9M01k65N8m36l96O17p89K1Q73j353r
808g70K23n3j86J96J51J6Q4M15Q05q78P5J218p08k22O25n10k83k16j81K84n09
829d24j54L54p57Q5J137p53M55M55m09O1L89n1L26p03K20R13q60k57M78p46k65
850e06N05n19J81m3l20M57j45K72K94p16O91R84j166M7J017m29l43J80l53Q89
870I77j371o6Q71j024R2L27m07O1J44j50L40j29M15M87n12K62M42r04L11N15q76
891a95M34Po86K07r4J02Km80N48J19p82L78R96n82p8K96J49j1r6J00N29q49r5
914h1N69p47J20J47m68K21j29j21K37k17K75L47l02K27M20m50M2L87k40K11J46
$$ y = [-356, -779, -406, 82, -86, 352, 187, 703, 988, -7, 697, 1248, -84, -68, 797, 150, -435, -315, -493, -325, -797, -750, -42, -1062, -969, 474, 53, -360, 724, 459, 508, 909, 644, 702, 266, -130, 487, -302, -281, 592, -761, -770, -547, -600, -786, -590, -439, -423, -339, 76, 881, 3, 78, 1296, 588, 366, 991, 481, 198, -18, -199, 85, -424, -578, -224, -981, -896, 241, -512, -57, 398, -11, 50, 439, 388, 714, 11, 231, 1144, 284, 27, 505, -241, -506, -1, -520, -339, -382, -702, -245, -390, -118, 176, -540, 151, 1135, -31, 16, 1033, 604, 261, 441, 88, 977, -394, -460, 411, -613, -521, -194, -601, -540, -396, -546, -206, -335, 80, 567, 55, 317, 759, -145, 166, 681, -195, 239, 246, -440, -233, -327, -225, -223, -703, -155, -36, -818, -440, 556, -26, -104, 192, 341, 330, 234, 334, 863, 14, -81, 488, -259, -139, 8, -460, -239, -368, -489, -252, -469, -194, 153, -149, 78, 498, 48, 90, 477, 237, 448, 594]
935E94n05J06j02j07K07n24k21N16n94L34K47m23L28L08J00j55l98M82Q02q49
955A46J15Q61j027M67m79k81R3l17JL68k85j01L93n65M25K70m10K66P74n16J66
976C64L08l20J25j93p2k2m78K47N9m56m4J91j93L34n07K81N66m43Q2O61k18M8
998C20j47m3N17k81k61J53k72r8J0l76R8K35n55M59R8k24M29o9j46M37l21J15
1020G8L94k42J85M6j31Jl2p06K98L3n29M30l08K12Q9k35N8K95O8J77J43M2JO1
1044D28k41J76j79j32L35m91j35M8k74M64k15k33M17m28J30K13l0J33J35k52M40
1065C09J58m05M11O3n42K66k64k16N68o38%J21l61J48O22r11M83K77m32L52N6
1086F5k3M63n55L61J84m66L45j36l19j59J64o70N66o1p4K87k66R9K30m18M16K8
$$ y = [594, 89, 195, 93, -14, 193, -331, -552, -36, -630, -296, -49, -472, -144, 164, 264, 109, -289, 193, 995, 146, 261, 1122, 95, 562, 83, -198, -105, -422, -421, -53, -338, -439, -46, -611, -186, 84, -326, -60, 714, 198, 364, 672, 352, 477, 284, 212, 190, -288, -41, 18, -438, -482, -291, -484, -150, -657, -376, 190, -253, -171, 490, 272, 320, 173, 130, 647, 366, 105, 258, -14, -112, -102, -478, -380, -145, -700, -241, -143, -367, 62, -7, -153, 284, -37, 78, 472, 230, 415, 461, 330, 331, 299, -407, -109, -76, -605, -175, -483, -271, -182, -417, -359, -64, 4, 181, 324, 366, 367, 428, 187, 363, 184, 52, 387, -104, -239, -191, -465, -1, -216, -449, -32, -460, -330, -117, -147, -14, 121, -131, 309, 467, 62, 473, 536, -6, 260, -4, -220, 348, -290, -290, -169, -530, -382, 240, -671, -188, 89, -343, 9, 65, 42, 505, -50, 311, 495, 29, 374, 238, -81, -240, -76, -746, -180, -241, -315, -28, -294, -195, 35, -383, 33, 61]
1108F1o1L94n5j62K03j92m8J63m44J88j28m11L55J77r40P02j54j70O50l21J90
1129cL24m03K88K43m20J33J68N4l92L67n47M1j34m5L13k98j11K16q8Q1L55m43
1151c01N09K73q01N75rj61L41k44q4k18M0%J53n95N51k53p1K75l70K90L07k04
1173Cj60K95q6K54m8Q6q0K09o17O25l04l19L73m75J05J52k93L20j85l03O98n51
1195c01J35L64m4l5L07l82K96L54o34J09O4j58j89k33j25L88q2j06R7j51J65K5
1217a36p6N18k35M3pJ47k97L19k00K68m8m98K79p3k49J25j06j99K75L1k86L83
1239b2l98L88J26J14q5Rn8N61mm77o8k52J30n5n3rk13KK05q2j24K75K31k43J63
1264F1J62m6J78m05M64k1m06L54k51k08k10L0R4K66k34k40K53j46K42j82J07K66
$$ y = [61, 0, 394, 339, 177, 380, 188, 140, 303, -141, 47, -81, -492, -137, 40, -900, -198, -352, -522, 128, -193, -3, 321, -82, 206, 449, 29, 162, 330, 384, -8, 359, -188, -147, -281, -326, -13, -311, -422, -206, -294, -213, 142, -301, 208, 481, -320, 255, 246, 85, 426, 182, 98, -120, -80, -80, 73, -522, 29, -224, -295, -20, -390, -100, 207, 3, -157, 138, 52, 306, 258, 344, 264, 473, -144, 481, 177, -142, 231, -244, -139, 13, -280, 40, -145, -448, 250, -301, -166, 198, 154, 119, 426, 44, 340, 694, 60, 169, 233, 75, -114, -347, -472, -84, -166, -272, -175, -326, -161, -136, -212, 306, 71, 114, 107, 254, -43, 276, 76, 344, 296, -202, 77, 4, -245, -120, -226, -425, -150, -119, -405, -22, -420, -32, 94, 208, 123, 132, 74, 635, 631, 154, 86, -166, -36, -91, -144, -153, -366, -364, -159, -241, -365, -90, 141, -102, 61, 223, 177, 355, -50, 414, 393, -13, 341, 90, -118, -328, -298, -204, 62, -172, -412, -159, -305, -63, -245, -138, 128]
1286A28Q0q7r4L31J80k21k26q5J25m35L02N5l18L88l35K1n8k8O0J73J82j31j94
1309a87K51J60J00m52M77n20L43J67k19l22M3L30m78M06j64n0J50j97R4J12M3
1330H7RJ11j57L55j76P1n3k45J39J22r9Jj71k46J14n21L39K89j11q8J69j87L14
1353F6P6R4k13J71J73r2P1j35p3l03Q3rl31O28k77o05M75l08K69K95oJ27k4k74
1377a22J19L78l04K06j85n7J41l1k42L59m40r8N0j31j82M43q4l2L9j25K41M8L60
1400C51j33j03k0K36o54L39J54m03L85j55k7k73Q4J8rn1K32qj31J32o5K80J15
1423B94j68L39p8o9k03Q6j4o7j69j73l9M0k10K87P0Q7j19m1J07J33j16P4L02o8
1447B85j75j19j23L96l18O7K12k43m3R3j78p8N7k34K55K13k42M38q5p8R5j11J35
$$ y = [128, 208, 121, 27, 358, 538, 317, 91, 6, 131, -304, -2, 53, -265, 123, -212, -191, -249, -277, -217, -44, 138, 7, -187, 64, 224, 324, -128, 349, -171, 172, 339, 120, -202, -159, 171, -307, 99, -65, -115, 35, -162, -68, 44, 87, 96, 207, 50, 405, 229, 300, 247, 2, 141, 263, 164, 165, -6, -252, -138, -659, -320, -31, -142, -230, -61, -248, 66, 142, 236, 23, 194, 367, 275, 346, 211, 138, -165, -82, -91, -422, 206, -71, -676, -201, -509, -240, 55, 49, 176, 152, -122, -3, 375, 71, 277, 92, 35, 176, 145, -97, 262, -178, -276, -226, -357, -539, -96, -180, -212, -173, -298, -57, -9, 351, 218, 115, 95, 331, -323, 16, 170, -233, 152, -3, -30, -303, -219, -201, -210, -261, -29, -37, -168, -36, -101, 179, 294, 126, 465, 387, 318, 115, 201, 187, 120, -49, -222, -261, -221, -431, -144, -74, 13, -106, -147, -40, 93, -23, 51, 353, 285, 110, -9, -132, 264, -54, 13, 225, -18, -61, 32, -146, -224, -167, -401, -146, 67, -175, 263, 178, 100, 195, 84, 219]
1470B19k6L4k06Qk9Jj46q3M01l80M1Qj0J84L3m27M98Q6l5j61L82l78J09J64k28
1495E9K66j27k60M3j83L28k59j15m7j02M24j19L0qL99n04M5J8L11j50J70k81K52
1518A90j31k24Q4L04m89l7R2q7R2r4K95N2k94L85k03J44K60m14K79J85j58l9j06
1541H6j39k3l9j4L02l27j15j63K30j21J66P2L4j2j39L10j65M7Q1qj15K73k11j
1565IJ38r9m3q6k67K15k4k21K89K1k3M98l75J53j62q5K46m9j45n8r4K1L18m74
1589b97n7K16l81L64j09J48PJ08J35k3l01K7N09k06oQ2j85j56J33j01J26j29l0
1612a26K53l04J30k03N7L42l96K06q0K14R1JK08m26K16l2l6q2J01j31N1J26j39
1635D1j74L37k94j06j76J52K82j84J74m0M5J98l95L55j17J35k0J7j27n7R9k92
$$ y = [219, 193, 227, 21, 29, 0, 1, -145, -228, 173, -207, -166, -158, -168, 16, 49, -378, 120, 206, 171, 10, 392, 14, 123, 287, 59, 325, 198, -62, -19, -202, 126, -133, -248, -295, -397, 27, -92, -62, -70, 329, -175, -130, -112, 199, 49, 219, -62, 190, 59, -165, -81, 223, -266, -303, -211, -298, -206, -300, -5, 47, -247, 138, -65, 79, 339, -75, 204, 389, 231, 192, 86, -53, -76, -115, -129, 173, -154, -269, -432, -202, -323, -157, -85, -51, -63, -202, 108, -57, -10, 71, 63, -52, 221, 10, 9, 147, 48, 5, -81, -348, -133, -157, -378, -89, -68, -91, 407, 32, 185, 23, -62, 184, 135, -10, -68, -162, -141, 177, -297, -354, -138, -519, -155, -264, -116, -109, -1, 134, 111, -190, -163, 346, 140, 134, 216, 31, -125, 8, -93, 33, -96, -126, 127, -177, -47, -250, -193, 149, -247, -41, -121, 93, 184, 185, 393, -33, 183, 151, 115, 33, 134, 3, 54, 180, 41, -133, 204, -90, -196, -372, -220, 62, -122, 52, 12, 57, 255, -140, 215, 98, 233, 213, 230, 103, 46, 145, -147]
1657a47o7o7L31j94l7J65j59J9q7K01N7K06j76K68j97j97O8K15l83R6L7l51K58
1680a41j22J75R4n1p5K32k63QJ92j50M31k70OJ49j99K67r1j16j81K52l00o9L02
1703H0k92q9N4Q4J63k42L83j56O5J45r7q4O6K50k85m9j68J77N4j64k8K08jk14
1727a40J95n35M13oJ98j60J30r2P1k42J0K90j89L04r9l07K8J59m4j37r7J78k9
1750a01k1j35K04K01m4r8J12p1K42k47K02P0l58K52J24j43k12k15J96j33j26K83
1772a8j24O4q2J84k47K77J54J34m10Lj5L69j68j04J78l58J96J33j78O7P3n4o3
1795A1j76l8K74k73N8J48k34L65p8m0j04J33m7j5J73J06j44m69K98k30J38J26
1817a8j34J4K02k39j1M25r6j63J8J23o9R6l15M95r4k43P9k10J72l23L15K18M3
$$ y = [-147, -214, -281, 50, -144, -181, -16, -175, -156, -243, -42, 15, 221, 45, 313, 116, -81, -13, 202, -181, -85, -48, -399, -141, -263, -88, 6, -45, -120, 112, -151, -143, 49, -101, 330, 60, 66, 215, 16, 283, 192, 76, -105, 147, -153, -222, 80, -212, -301, -247, -163, 0, -242, 141, -15, 50, 195, 98, 14, 80, 330, 45, -4, -172, 5, 59, -105, -133, 75, 74, -140, 55, -480, -67, -73, 125, -35, 95, 3, 74, -168, -158, 132, -57, 247, 148, -159, -131, 28, -16, -153, -250, -72, -101, -122, -257, -53, 148, 104, 6, 118, 47, 289, 42, 244, 314, -44, 208, 332, 189, -23, -238, -42, -175, -301, -18, -142, -78, -160, 24, -223, 54, 208, 342, -68, -65, -80, 289, 121, 17, 195, -163, 33, 166, -12, 55, 128, 74, 11, -165, -203, 71, -202, -144, 4, -230, 135, 57, 17, -87, 46, -1, -16, 157, 263, 119, -350, -52, -282, -144, -18, -152, -138, 64, -175, -186, 239, 143, -20, -2, 121, 52, 148, -167, 328, 234, -9, 70, -140, 32, -291, 24, 242, 285]
1840B85j60j97M9j52J69l8K77j06k41n1K01J22J30O2m33kJ88l41J33mJ63J43k94
1863i7k9J38q8o0J06j20K47j50M9O1r4J0L2K35j38j71J53j7j84j10J72j73J4K23
1887Ij93L66j23l21J41R8l4K42l03k38M35p9j42K43J00m47M4J65n5j24K10l09
1909c15J84J16K38k6k09K12k31O4K32k12j31o8K08j92K7O4k55J24M20m47R0J47
1931D0j64J69o4j90L9K30J12J55m08mJ90qj88J02J76m91M07L06m26KK3Qj02K55
1955A69n5K54l15r7J94N7J5j47J77j37n6JM7l65N58k71m27J25Oj4K91J93j77N7
1979H3J70j72l07O80p8l01n4KJ1j0K97l20k53K89r0l21N04l20J06J23O8j2N9k46
2003i2L74M7n47J30J3N2K06k84J95N2n32K40K19P9k03n6p1K38l32O0rO6K22J4
$$ y = [285, 125, -72, -23, -175, -6, -44, 233, 127, -114, -165, 36, 158, 288, 350, -83, -85, 103, -238, -105, -109, 54, 197, -97, -126, 12, -76, -136, -30, -150, 97, -53, -4, 57, -37, -27, 5, 240, 102, -69, 84, 67, -117, -227, -55, -228, -214, 9, -184, 182, 59, -262, -121, -23, -57, 185, -118, -356, 79, 0, -142, 101, 201, -246, -202, -37, -92, -216, -6, -315, -131, -15, 223, 197, -12, 200, -31, 33, 265, 53, -78, -146, 62, -130, -103, -39, -294, -170, 250, -197, -107, 40, -124, 45, -19, -209, -170, 60, 172, 327, -81, -85, 105, 97, -91, 11, 187, -304, 103, 409, -17, -15, 8, 16, -86, 169, 114, 368, 53, -44, 150, 207, 222, 75, 252, 115, 59, 60, 107, -258, 300, 29, -398, -273, -267, -281, 10, 203, 26, 83, 253, 81, -226, 454, 376, 75, 21, 23, 34, 24, 321, 1, -252, 37, -53, -374, 130, -190, -84, 39, 107, 95, 154, -92, 282, 329, -218, -88, -75, -23, 183, -101, 94, 146, -386, -146, 73, 152, -51, -107, -178, 60, -272, -212, -221, -155, 67, 81]
2027H1pn9O5m9j51J20l3K99k60K36k84k7j59J35K58l55J98j38L38j64L34l09r6
2050b7O1Qnk41M88j83j80J73m09K95j47Q7R1p5K01j69N1L2N0j07N8mJ30j00r3
2075a5j3L11l38O0R9j4j44J57k96L90j18k66L07j42m9L31k1k85J07k39P8J61j64
2098a03L0J39n6J20k42O9j04K0k31M2J07J62Q3j66q1L49m47N29j56J88k88p8M31
2121C17j92k59M43j97j82j68J72k32K90O5K25m35J1J83k50J06j98K79m1K16j69
2142a6n7J66L5rl56K98k9J2l16K51o9K37m45J96o0J09J71k18m6M35l50J93k33
2165a01R5L0J21o7j25N2k6j45R5R1l45L23k29K2J39L4n5J05j35L9L05k33Q8k36
2189a58K26J22m45O8J88J40j27R8l40L2K14j03L0j23K89O1j75N7l69M29m6M2k36
$$ y = [81, 74, 15, 80, 31, -120, 0, -33, 266, 6, 242, -42, -69, -228, -93, 165, -190, 8, -130, 208, 44, 378, 69, -27, 34, 42, 37, -204, 284, 101, -79, 94, -315, -20, -167, -80, 11, -64, 137, -32, 19, 51, 101, -6, 52, 48, 178, 78, -15, -28, 283, -55, 5, 104, 90, -54, 103, -193, 197, 79, -187, 120, -22, -71, 260, 239, -46, 61, -178, -100, 61, -103, -73, 66, 10, 130, -112, -43, -147, -127, -358, -316, -209, -47, 36, -130, -211, 138, -309, 220, 64, 252, -36, -114, 317, 125, -134, 309, 112, -70, -238, -66, -298, -8, 57, 282, -153, -142, 41, -209, -103, -301, -22, -63, 153, -16, -73, 93, 128, 119, -237, 61, 32, 44, -272, -21, -90, 147, -298, -102, -162, -53, 118, -100, -146, 289, -61, 132, -101, -6, 24, 145, 78, -47, 5, -21, -166, -71, 20, -325, -2, -231, -209, -70, -36, -91, 14, -121, -82, 223, -10, 78, -158, 68, 190, -255, -187, 1, 141, 14, 112, -228, -196, 18, -85, -55, -178, 111, 172, -3, 54, -315, 114, 68, 110, -126]
2212a26K78K51p3m87K52j36j17O5j33J28K08n2M2j2j64n0Q1J36n1K86l10o6KM31
2236C83l76l6j11J9J41l87K26L27j97j2N1P1k33K93l9j67J91L6n8k08K25Q8l2
2259A95k30J60o7k22K55m77L48J59m30K44L8O0P1l1j74J56q5k04M13L7Kl02K75
2282A91l22N8k96M3K95K3K1K30j17o1Jl08O26j94j75J59l40K86l39K80L7k6n7
2305A5j33k50L10J4l2J98N8l25J52j51MJ00k13K08L9R9OK28k16k17l5J59p4P6
2329B0R1j50N9l6j72J25j3q5L28k29pK58l13K32K2k20J92k21L16l72p0K40R4J76
2353B65k34k7k7m4o4jR5j46J03J81l43M64k29P1k16L75k06K03n8k76K11p3j83
2376a59J03J03o9J4J19o0k95Q3K42J01k14l7K11k99j78J51L06m12P1L8K70J8k63
$$ y = [-126, 152, 403, 330, -157, 95, -41, -158, -93, -226, -98, 110, 58, 100, 88, -76, -126, -45, 91, 40, 326, 16, -50, -48, 383, 7, -29, -140, -121, 20, -367, -141, 186, -11, -23, 28, 99, -134, 159, 120, -47, 144, 180, 122, -86, 139, 227, 195, -35, 125, 58, -164, 91, -386, -38, 121, -309, -65, -27, 33, 104, 73, -101, 55, -30, -234, 179, 216, 218, -84, 191, -131, -73, -369, -326, -31, -8, 13, 243, 126, 65, 66, -242, 384, 190, 15, 174, -166, 120, -219, 61, 98, 72, 15, -118, -368, -58, -44, -76, 122, 180, -145, 7, -144, -140, -40, -253, -45, -6, 93, 99, 327, 111, -106, -141, 18, -56, 20, 111, -39, 20, -16, -188, -63, -76, -161, 167, -62, -69, 189, -124, 108, 130, -90, 102, -119, 197, -175, -245, -5, 89, 265, 31, 4, -23, -67, -131, -132, -37, -183, -80, 101, -242, 222, -7, 64, -152, 223, 17, 220, 162, -114, 97, 24, -159, -56, 47, -22, -8, 111, 51, -244, -161, 81, 182, -32, -69, 142, -157, -335, -184, 122, -290, -219, -181, 89, 107, -156]
2399a56K34O5j88J78k13n2R3j58K86J95j35r5Q1K0p9P9k50M6k26L53k57l2J78
2422c3Q4j48rM2j37L43k01J59j11O0Q1k14N7K69j82J4k3L9J79j74r5J9o7K23l18
2447a43K72r4K4P2l4k25L7J24k55J93K44j45q1K31l31N0k9K57k81J47l59L70l5
2470IJ2j63M54l78J05J57l35r4L4N24k74l0J90o5j93k9P1K47l51J77M0N2J7Q6
2494B63j89j44L4j10N9KQ2O8l1J9P8Q3k54m8J2J27k30L19m89M02O1k00j7L4P2
2519Ck33M01L0j72k06K64j55K68l69M0L6QK9J50k92J69K3J81J40m82Q1K66j11
2542F9o2j91J4n1K15O7K18l63OK21k5j70J55k49K77l25QJ71N9K70k28M9j20J97
2566B12k74m4J92n4p7M27l02j43J0J63K32j86k33L5j28P4m0J54J45j45O8k50K31
$$ y = [-156, 78, 143, -45, 133, -80, -132, -39, -197, 89, 284, 149, 54, 135, 155, 76, 155, -95, -49, -275, 78, -179, -211, -33, 51, -97, -106, -64, -201, 142, -59, 100, -11, 49, 130, -84, -27, 242, 60, 74, 51, 90, 269, 95, 0, 19, -48, 175, -143, 129, 35, 59, 131, 97, -128, -91, 33, -222, -29, 215, 70, -11, 220, -111, -61, -90, 167, -114, 33, -326, 44, 9, 21, -142, 312, -66, 39, 196, -139, -233, -199, 325, 51, 21, 211, 146, -47, -76, -5, 242, -109, 68, 108, 160, 177, 263, 74, -70, -36, -146, -87, -85, -3, 65, 34, 53, 131, 214, -40, -88, -76, 51, -179, 140, -349, 53, 114, -86, -103, -69, 3, -230, 171, 201, 29, -177, 87, -68, 200, -169, -129, -93, -85, -56, 94, -198, -29, -6, 175, 315, -167, -86, 180, 69, 7, -184, -170, -221, -6, 61, 279, -84, -78, 143, 118, -52, 103, -146, 131, -194, -186, -15, 44, 314, 86, 135, 15, 212, -62, -106, 86, 32, -45, 382, 80, -63, -53, 110, 342, 156, -77, -42, -170, -96, -136, 18, 163, 18, 86, -164, 67]
2589F7P0p4k9k77L01l14J25J99J52j25k24Q9R8n2M7j78R6J30J16j10l3jp1J33
2613A35j42j87L22m14L01K59k76j58J10J99l4J49n17L90J87l01j43J47k30L26
2633A23j52m4K31k15K70j91m8K46k10K73j20k05rP6J0j62L34k86%n7L76J2q8l43
2657a79J84L8O2k08QK43l78K5K41J00k09M93m19M0n4j68R8L12l85K30k42L0J30
2680hK05o4k57K66o9j55J67k67M0L01j69j62MJ97j79J06M5pk85L33j37J48P9m0
2704I2K93m76K45k44J02j45P1L0kN7q7mJ81j85K41q5j31K87l43M1J35k79K79l62
2728b89L57j68K81k99N2J01qk31J09J54J19j88j33J76o3j40K17Q0j32J30k83M65
2750C07m11J31P4L2j25pJ47J13l17k46M33r0j94M54l28K01k54J16%n8K63l08J94
$$ y = [67, 137, 63, 34, -243, 58, -256, -131, 68, 220, 95, -129, -40, 58, 6, 53, -125, -29, 101, 217, 107, 74, 73, 2, 135, -7, -194, 128, -286, 15, 274, -2, -160, -50, 149, 115, 264, -253, 137, 324, 23, -120, 27, -203, 123, -29, -73, 158, -57, 213, 22, -26, 220, 10, 283, 163, -42, -51, 25, 35, -127, 207, -79, -79, -136, 240, 252, 164, -179, 5, 43, 105, -103, -95, 148, -230, -205, 36, 136, -73, 420, 1, 41, -13, -181, -83, 229, -156, 74, -168, -138, -8, 197, 133, -124, 142, 73, -82, 85, -182, -142, 159, -10, -172, -168, 29, -150, -44, 1, -6, -291, 42, -95, 53, 132, 92, 385, -91, 154, -90, 12, -133, -62, -32, -34, 23, -64, -68, 113, -72, 169, 84, -47, 240, -103, -62, 73, -206, 73, -289, 68, -100, 181, -118, -66, 35, 27, -204, -95, 59, 178, -10, -143, 33, -30, -170, 47, 127, -5, 125, -158, 307, -104, 27, 101, 133, 8, 1, 148, 261, -56, -302, 131, 41, -153, 301, -27, 174, -80, 36, 36, -22, 241, -67, 127]
2773A27m2r1J10j66J19p4j49K40k31K28M5Qk32J52J20j67%k84K92k00K56j65r
2796a13K27k88K83r1J29k31m4K73m04K51J88j77Q5n75O27J34j48J75q9l70M0r
2818a27N1n0L39n17K98J86R7n9p4k07N2N2M1l55J49K26j8Nk30J9QN4K60k74K53
2843A79k71J36p5R5o4K26k31J40p5J0k43K9L41j81j3j20K93pl09J78j3p9J13j52
2867i3K34k1l48L48j2q4l7J2R6k32L45j1k51k17M72j00o3l66M89j64J6K3K6j94
2891a32J37N5J32j44j08J29O9j90n3J07Q6J06l46J61O6L07m92K56q0Q5k86J92
2913E7J25R3k42m2L08l48mm7K54j20j03K17O6k03J22Q1m27K79r6R1j02j79L50
2936A30p7r1j47L04m1O2rj90J05J76Mj73j74O0K90K9k59J92k95OJ92o6j06j1O0
$$ y = [127, 85, -6, 104, -62, 57, -17, -166, 74, -157, 71, 116, 124, -108, 44, 164, -3, -3, -287, 5, -195, 61, -104, -113, 114, -174, 109, 18, 147, -84, -128, 145, -259, -8, 180, 3, 88, -487, 140, 274, 126, 301, 212, -158, -118, -127, -76, -126, 213, -304, -6, 180, 277, 218, 144, -63, -11, 41, 82, -273, -124, 102, 84, 89, -141, -122, -114, -60, 200, -74, 179, -92, 44, -31, 64, 0, 226, -5, 135, 60, 70, -173, -144, 197, 16, 3, -117, 176, 169, -140, 38, 25, -54, 59, -93, 141, 120, -228, 120, 108, 24, -13, -1, 95, -137, 208, 197, -54, -271, 201, 101, 38, -328, 161, -3, 13, 36, 62, -132, 5, 60, 192, 48, -60, 69, 138, -52, -105, 2, 88, 194, -152, 9, 75, 382, -110, 146, 66, 151, -135, 57, 182, 275, 33, -9, 299, -49, -53, -100, 154, 34, -69, 148, 214, 11, 133, 214, -213, 66, -30, 61, -41, -220, 130, 53, -38, -185, 119, 78, 140, 131, -59, 46, 222, 226, 53, -121, -61, 229, 258, -1, 191, -104, -98, 94, 28, -78, -89, -29]
2961b9k66L94m17M62j3J73l89J19J71n2l18N05j90j21j4N6P4N6l88M55k42J64
2983A90l22J61j59P6K03k81k9M42K5n02J46j44J15j94Q4L22j65j81O1R7j61n2
3005b68L01o0j25L00Q7l83K07L0k08K07l55L64j25L17n3m81R6k5J63K9p9o8L99
3028B70k08j0J59m00Q5M23l69J12k38L05k91K84j08J13k9j99K14k46J08J02j4
3049F3r5J35L1l45L64k01o6Q0J40Qj5J65l68L51l48K74l66K17J4j22J9J68k47
3072a44K52J25m83J91J44j37L09k43o8m7O7R7j97J02n0J84k24K41R3k20l5j86
3094b29L46o7J20r3K21m00q0K60M7j85J0O0k78L07R8r7J33k5j50J50j56J38k98
3117a68L72k68L45k16Pk8K54j38m96M07M2k19L4M8l3j1L8o2l1J6P1K19j51r7o
$$ y = [-29, -295, 99, -318, 144, 131, 304, -85, 34, 205, 153, -165, 340, 150, 29, 15, 71, 145, 201, -187, 268, 26, 190, -132, 29, -130, -54, 149, -132, -161, 281, 306, -196, -50, -194, -79, -273, -189, 133, -32, -213, -152, -55, -216, -268, 33, -27, -152, 148, 235, -148, 59, 89, -119, 88, -267, 97, -28, 289, 236, -245, -149, -174, -11, 18, -61, -129, 270, 62, 52, 211, -189, -104, 319, -50, 62, -176, 129, -162, 122, 14, 127, 98, -101, 113, -133, -25, 77, 63, -32, 103, 134, -211, 153, -48, -114, -34, 106, 114, 99, 264, -104, 247, -101, 173, -193, 24, 38, -84, -65, 103, -144, 108, 233, -250, -59, 85, -52, 257, 14, -54, -101, -34, 63, -134, -32, -82, 102, -122, 119, 212, -8, -43, -229, 117, 50, 170, 77, 298, -102, -182, 78, 125, -60, -50, 10, -268, 39, 137, 40, 173, 148, -2, 148, -8, 130, -168, 204, -64, 281, 65, 72, 44, 298, 160, -336, 71, 113, -106, -72, -24, -57, -68, -30, -92, -123, -107, -36, 183, 32, -65, -71]
3142g1J21j04J40P1l10j0M19k15j64L13k08k4n6R3J17Q1k21j35L16j81Q3j04n7
3165a06J26K8M7j69P5q1J12K4L5k20J9L63m05K78k27j83J24j2l4K52k1r6J85l8
3189G6l00K75o7Q2j88P0O2q6M5J40R1k77K44l1k67J88P7r2L8j83J46M6L6j29k6
3214c0m4J86l9j33P1l2P2N0M3j55K5j76L68N3m13J92J08j67j43K81k98K22n4J42
3238A29j79mL4J6J81p8J36l31j2K17m2J0j65J25j83K7n2J05j61J11l6k5J80r9
3262i6m9J69k40K00J00j14L3o9l2J59M0l85O82m55J89j91P1R9k46K82k90r6J32
3285a07J02q5K70k78R2J46k59O8oJ50o8k9kl0K67k8k7j72R4k60n7J23L5K9M9l6
3311a9j55L31j87NJ35j00j01J42M5P2m64K51J00J25j05J16k30K40k51J60j64j45
$$ y = [-71, 50, -54, 86, 157, -153, -163, 256, 41, -123, 190, -18, -42, -98, -5, 112, 193, -28, -163, 153, -28, 55, -49, -106, 20, 48, 95, -74, 1, -80, 32, 56, 91, -129, -110, 253, -152, 126, -101, -284, -160, -172, -206, 46, 25, -71, 114, 76, -224, 51, -16, 66, -122, -52, 10, -76, -31, 109, 200, -77, 167, 136, -131, 57, 134, 42, 80, -103, 43, 89, 125, -4, -30, -74, 112, 73, -60, 11, -21, 51, 101, 144, -11, 14, -162, 206, 259, -154, 38, 146, -21, -164, 117, -181, 41, -13, 129, -50, -54, -20, -4, 177, 99, 235, -96, -108, 109, 67, 77, -88, 37, -146, -119, -171, -66, -227, -116, -152, -177, 3, -96, -145, 24, -216, -16, 84, -30, 3, -66, -98, 61, 101, -284, 398, -57, 132, -59, 12, 111, -135, 147, -143, -239, -107, -5, -90, 180, -98, -6, 140, -119, -51, -57, 93, 25, -4, -6, -36, 231, 203, 176, 4, 98, -162, -219, -96, -61, -32, 17, -19, -174, 157, -30, -25, 110, 10, -91, 51, 96, 168, -296, -45, 55, 180, 75, 191, -39, 201, -50, 110, -54, -199]
3333a99M8L01k37O7q2j2K05R2j93q7O3p3p5M11O5n76O6J12j15K19j29J80K01j52
3357A00m2m3j22L4K5n6L00n3j99O1k03K01J03J5o7r3J55R6n8r2k68L70O3l82m4
3382a99L0J13j49J86K65m16K0K59k05K00l50Q2L55j85R0J60j99O0k40N5K55j97
3404a0J15l98J35K60j16l39M79M3l01K5J7j1J63l84L05j1N7J24k7j00j10L67k92
3427in1J05k64K1P0R8j68K03M2k83K7J65N3J04Kk58K61j41J24j58K47j24j51P2
3451a3J76l08q0K44j43j22K53L5L6k28J97n5Q9J20m2q6Oo9l7K9K8O9k00P9J68
3476A46m33M08m0l6k07K95N1j98J74j90J12j01j17K20M8o0J77k50kk3n5k5j54
3499b60K32k25K31q3J28j38K14Q0J6j6k27l3j4K67j23q0n4j1K65j06j29J34j76
$$ y = [-199, -151, 150, -87, -20, -102, -114, 91, 183, -10, -97, -34, -107, -182, 229, 294, -282, -216, -104, -219, 0, -129, 51, 252, 100, 58, 15, -107, -73, -48, -104, 196, 143, -56, 5, -198, 3, 106, 121, 54, -39, 116, 212, 154, 62, -206, 164, 227, -155, -199, -169, -56, -205, -19, 246, -170, -150, 109, -96, 104, -246, -164, 191, 6, 96, 256, 57, 117, -123, -68, 187, -10, 105, -293, -158, 102, -14, -353, 126, 169, -132, -107, -90, -101, 62, -322, -17, -28, 29, 153, 126, 26, -84, 283, -9, -60, 45, -219, -198, -128, -30, -198, 5, 47, -236, -209, -44, 9, 113, 115, -143, 118, -23, 101, -57, 190, 66, -85, -13, 163, -145, -225, 19, -124, -246, 7, 42, 78, -150, 47, -8, 81, 201, 159, 73, 79, 10, -27, 2, 30, 99, -101, -22, 146, -287, 121, 81, 45, -162, 133, 184, -14, 160, -30, 82, -19, -136, 84, 132, 72, 249, -1, -3, -26, -81, -106, -260, -28, -253, -22, -105, 23, -115, 99, 179, 195, 179, -48, -81, -95, 172, 49, -31, -85, -96, 169, 63, -66, 68, -108]
3522a08K37n0k02K65l7p5R8l4j7N4k81M5J0K40j61j62q9N91j50l02O7K83j51O3
3546A34k66J73K06j8m04L00nm0n7k83M28j64P1q6m05M61J1l2J1l05K84m4L34m29
3570a25J44K9m6R0R0k84K87r9k08L39k34nr6K23j6nj31J42j66J5K75k18J43l08
3594a64K74l66L11rJ86k13j27M4nN9J8o9k14K54Q2j10R4J03j69K23J3l62J55k5
3618a7J26o1j71J34M2m8l4K09j58o3R2l8j93J91j53J1J60j00j85L78p7j16J37
3641F6K52m13K00N4k37J10k23K11j64J03J6J35J57k59j45J03J14m3L2o9j28J63
3663C5J35k19K3J47l41L29l64K88j73q4M26N7m48L92m2m82K03K71j73K1R1pK70
3686C55n22K58k36o1J42P3J11n7k49K61J4k56J72k28J85L14m32L44j84Q5k01M06
$$ y = [-108, 129, 79, -123, 142, 105, 30, 128, 94, 77, 131, -150, -105, -95, 145, -16, -178, -267, 324, 174, -128, -61, 222, 71, 134, -132, 41, 247, 229, -175, 125, 120, 80, 23, -260, 168, 4, 75, -11, -416, 45, 56, 24, 35, -270, 14, -30, 304, -125, 19, 48, 2, 92, 182, -102, 185, 86, -122, 217, -17, -22, -118, 105, 89, 84, -47, 95, -71, -56, 219, 1, 144, -164, 110, -256, 55, 46, 232, 19, -108, -64, -69, -10, 8, -61, -275, -21, 61, -49, 45, 148, -21, 202, 215, -147, 8, -17, 109, 48, -123, 11, 53, 5, -29, 180, 22, -41, 51, 13, -180, 11, -142, -131, 29, -71, -256, 122, 45, -71, 66, 318, -95, 105, 159, -78, 32, -191, 20, -144, -41, -25, 110, 267, 8, -137, -34, 80, 37, 69, 0, -128, 35, 170, -49, -26, 121, -220, 109, -255, 33, -140, -224, 202, 259, -189, 203, 161, -321, -118, 153, -20, 1, 92, 85, 355, -167, 91, -145, -206, -64, 9, 120, 63, -186, 75, 89, -167, 5, -223, -38, 276, -156, 188, 4, 89, -112, 294]
3708B94l60o7J58o1K30k41m9n0K8J74r9M83m88J55j06k42J87J3l2j21K44k10J68
3731Hl8J56o5K8k45J11J19mj83K70m23L36j4k93K50o2J87k0l3M5k05j23P3O6M63
3756D04j94r6o2j63J83l16L37j02PP3j19K74k54P4m1j1l4j91Q0K72k67J29m9L7
3780b9R9k59J29J34l22J73K77j88j32K22k7k52J44K9o9J45J31k79J48j87j01j96
3802d10L21K65Pj53J35n9q4k77K62L87n31k4P7J46P1k91L83j82R2k46J70O7n10
3825c84M48k54L49j15J86k23Rk09K06M6kJ84k62m8k3J03M1j58J17k6R2m8k7R8
3849A00J65O5m59J9K61j40k12K33m6J07k24J55k19K37k69K50k38L05k92M5K77
3870A20r9J27l74K27P7l73K86Ml4J11j9J18n06K30M5J93K25k84l7k36M15j18p6
$$ y = [294, -66, -133, 25, -36, 194, -47, -96, -146, -118, 56, -43, 440, -48, 107, 1, -241, -54, -41, -73, -194, 50, -160, 8, -30, 126, 61, 89, -156, -45, 74, 70, -113, 157, -266, 70, 56, -237, 13, -49, 138, 118, 85, 130, -75, -198, -125, -59, 404, 210, 114, 52, -111, 72, -244, 93, -9, -2, 71, -48, 226, -28, 46, 5, -6, -40, -231, -151, 121, -146, -17, -66, -29, 70, -189, -60, 74, -248, -75, 202, 14, -118, 104, 77, -175, -31, -2, -71, 74, 205, -74, 74, -113, -214, -410, -89, 176, 183, 30, 165, 106, 22, -255, 7, 394, -137, -161, -84, 62, 133, -158, 225, 43, 135, -111, 59, 126, -384, 64, -190, 159, 44, 230, 7, 16, -193, 13, 59, 57, 241, -21, -69, -92, 11, 52, -106, 11, -15, 77, 29, 2, 100, 265, 330, -129, -110, 151, 11, -201, 32, -14, 93, -131, 24, -195, 42, -227, 23, -215, 90, -202, -157, 120, 21, 148, -226, 1, 78, -295, -9, -5, -39, 72, 53, 171, -335, -105, -60, 133, 358, 74, 37, -199, 216, 98, 22]
3893B2J12k81M8K54j6l2k86J12k09M5K07O4p4r0K1R2k43M07L6k36K36Ql9k38K81
3918B01j26j04J47k31N2k5L21k21J60k26K30j36p2J60j17O5K35j13l95J70Q1k61
3940b05J18K24j01j18l4J48j00J19j26M26m76K24Lj1k7o3J21J6l28R4K01J49k98
3963d4P0l37K19k29K36J19o1L3k55K51J34k71R4J15j61RJ84J13Q0k51j17K68j49
3986E0q9q9K10j66J4q0M04m37J57J3l09M15j8n6K6j70J3J47L5P3%k75j2m7L77
4011A86j78n1J83j10o9j11O3J0K69j80L16m05r8J59J37k53J8J81k14k5M46k40
4033C4R5j95j13J92J13l1p3J93m48L78j14J46k84R2j58N00j9k88j65J36K1N2m2
4056B2k06J7L2P1Q9M6j41M24o32O7O0K58J06O3o6j07n6n9j4nJ0k20J50J60k8K95
$$ y = [22, 134, -147, -99, 155, 139, 107, -179, -67, -276, -231, -24, 40, -34, -124, -103, -11, -254, 153, 189, -47, 189, 197, 158, -80, 201, 75, -29, 118, -113, -61, -86, 235, 14, 174, -52, 178, 42, -30, 130, 13, 78, 313, 200, -195, -25, 56, -205, -87, 137, 36, -82, -116, 32, -68, 51, -75, 351, -125, 99, 102, 91, 64, 1, 122, 138, -190, -96, 105, 254, -44, 26, -311, -92, -321, -85, 34, -27, 6, -249, 2, 136, -135, -41, 74, -87, -78, 106, 219, 299, 48, -69, 199, 50, -39, -128, 82, -84, -70, -150, 254, -183, -26, -13, -322, 93, 75, 19, 45, -125, -112, 35, 70, 143, 143, -132, -144, -191, 186, 8, -43, 140, 30, -39, -150, -87, -77, 192, 12, 328, -77, -175, -16, 121, -132, -114, 67, -147, -172, 274, 34, 129, -66, -179, 13, 126, 95, 22, 215, -233, 145, 31, 177, -107, -15, -173, 327, 308, 20, -145, -9, 12, 64, 22, -184, -167, -135, -64, 25, 71, -70, 354, -278, -211, -151, 107, 213, 276, 210, 103, 47, -12, -26, -31, -21, -241, -91, 69, 41, 336]
4082C36m10J91k7K36m51o6J12Rk00M16k77J89P0l67K40L1P5j76P1j16J95Mj92
4105a07Q1rj03K2M66m41PK11j97J98n04N35l0j48k67L02j2OM0o4J03j33J11k72
4129b05N04l60n9J31k11M36k56j71J0O4L7N9j88J6J79K2j69P5p0J92NJ71k27N1
4153C6j8N5k01J65J84K2k46j4J22p3L9k42L70m22M2J57k02Q8J29j83K98j10L6
4176C2O7k45j60K87r9L38j05p9j58J11K23j35j54J69l62M10lQ3m76K69R2j74j35
4199b04O7Q9mL59l05M7Q9k44J90k21P7K48k99K52ON8k39OJ19P4j99J24p4J44k13
4224e3l04L19P1oqL6k15L17j21l12L40J90j33m43L50J64r6k43Q7K56O8l69K09
4247A04j61j8j30J28N9J28k11p0J65j03LN0k19K31p6r7J5K14j16J07j20N0N5K01
$$ y = [336, -74, 117, 90, 326, -125, -191, -79, -70, -270, 146, -131, 58, 128, -239, 1, 32, 107, -69, 2, -114, 81, 85, -107, -26, -35, -138, -116, 350, -91, -84, 127, -70, 128, -376, 159, 129, -19, -286, 16, 4, 10, 50, -14, 89, -44, 67, -205, 299, -61, -120, 11, -200, 236, -20, -191, -181, -117, -80, -21, -209, -193, -14, 8, -161, -86, -156, 36, 41, 212, -15, 36, 18, 73, -128, 37, 221, 243, -3, -17, 105, 32, 71, -171, 199, -223, -181, -24, -226, -138, -9, -192, 106, -4, 32, 99, -146, -306, -19, -118, 220, 115, 36, -122, -11, 212, 77, -77, 92, -270, 140, 137, 220, -256, 13, 105, -69, -204, -137, -48, -52, 307, 2, 49, 138, -106, 84, -137, -60, 188, -111, 141, 147, 205, -34, -28, 91, 165, -34, 90, 16, 160, -53, -357, -38, 33, 27, 19, 55, -160, 157, 36, -276, 64, 254, 121, -322, 28, 192, 96, -147, -60, 196, 264, -105, 104, -57, -75, -205, -77, -18, 110, -101, -171, -6, -109, -106, -56, -275, -44, -120, -217, -202, 12, -104, 3, -117, -67, -12, 189]
4271A89l46j17L43j53j11Q5N4l4K02R1j99N5n2L4l01L03j76L52k50K5N3J88l49
4294a14L16k08J18m66L63Q2n3j22K18J00k58K99l58K50k33L59m27O3O5P5J8k27
4316a40M24j64K1k50J87K52q9l94K21J3l0J7l9N3o8J81j53J1k24J24J4k27K09
4339e1J9o1j02N05l51J19N6k16On9J88o6q3J24K8k15J76K6J04j72P5L7k31N0K7
4364f7K4O2m5kJ12J46l35j05J31k8K7J27m3p7K18j66p5J14K69k53l73J74K53l13
4388b25K50o8J20l8n7R2J20m32K49k64J15J14J11j88K9J93k23J14J44K53l52r1
4410c4k33L08p2k68K55k3J98O7k11J55n6q8r8kL8M79n30j29K69oP7p8q6J64rl68
4436b81M19k74L3j6R1p3J16J45k42j46K88J69l24O8J82k01M5j82j58J59J88L1
$$ y = [189, -157, -274, 69, -84, -195, -110, -56, -90, 112, 203, 4, 59, 7, 41, -260, 43, -133, 219, -31, -6, 47, 235, -114, 202, -6, 112, -354, 9, 91, 38, -84, 134, 234, -24, 275, -83, 167, -66, 293, -134, -71, -6, 69, 87, -140, 284, 120, 141, -109, 78, 330, 241, -153, 68, 81, 51, 68, 29, 82, 14, 195, 42, 53, -171, -47, -33, -260, -51, -32, -93, -195, 310, -41, 78, 134, -82, -76, -135, 53, -13, -96, 28, 56, -159, 17, 43, 147, -25, 50, 87, -144, -94, -67, -43, 19, -26, -28, 84, 230, -105, -210, -79, -107, -80, 47, 4, -73, 145, -21, -96, 18, 287, 34, -339, -165, 88, -225, 25, -43, 77, 39, -18, 74, 194, -238, 11, -253, -138, -24, 87, -101, -72, 121, -102, 12, 156, 409, 57, -34, -267, 41, -31, -299, -44, -67, 131, 198, -13, 142, 86, -2, -100, -102, -64, 415, -115, -244, 25, 19, 96, 18, -68, 96, 87, -281, 138, -136, -103, -119, -28, -101, 15, 160, -82, -228, 60, 229, -95, -27, 155, -46, -1, -183, -341, -182, 6, 37]
4458C7q5J90j74J57p4k7R3l58L71k39M8J73k21P7q8J11k51J07J98L4k89J44L4
4481c2J5K43J3o01N14k1J34l66q7Q8j46L18J8l31K32K65m17L19J1l31J50r1J61
4504E8K18m84M0j4RM18k76J16Q8j88q2M77q33N99j21p5K37j10oj03K6j16j2M5
4528h9M18p27M92l08L45j84k74M40j53K26k53Q2j6q7j34J48M2j21J42J45m15M26
4550A45ll59J00K34j98M09m63O6j72L08j29K04j40k77L91Mq1k12J12O6J37j34
4572Hj18M6K04l15P4J02Q9k18J67M8j70j19K24Q4p8j10j80K20L62k85Mr6PO5j32
4597a17J98q0k44K80K1N3r8MN9l0Q9j36L3l9nQ5K1m04K17P3J64J14k73l5J37O5
4623A52k10l7L50k81K9L2J6j02K19Q0j65k15L2J45JM2o6O0p1k31L65k44m1K62
$$ y = [37, -48, 142, -32, 125, 51, 24, 117, -241, 130, -109, -61, 112, -109, -32, -120, -9, -260, -153, 45, 79, -210, -66, -32, -17, 226, 239, -362, 152, 131, 265, -101, -188, -100, -246, 72, 90, -241, -9, 256, -161, 158, 169, -162, -12, -103, 58, 276, -208, -168, -182, -173, 245, -31, 85, 173, -15, -97, 380, -453, 146, 25, -50, 187, 77, 71, -32, -6, -122, -134, -89, 329, -398, 94, -214, 131, -53, -327, 113, -40, 186, -67, 15, -1, -88, -222, -74, -32, -153, -11, 134, -281, 145, 142, -217, -117, 117, -81, 328, -135, -69, -241, 67, -62, 142, 2, -275, 116, 120, 39, -173, -61, 5, 142, 8, -110, -64, 140, -175, -101, 1, 90, -128, 39, 87, -83, -202, 22, 106, 28, -82, -262, -42, 320, 35, 39, -57, -50, 15, -117, 81, 1, -243, 37, 58, 111, 13, 17, 76, 46, 135, -1, 32, -7, -12, 73, 94, -310, -93, -20, 144, 258, -15, -50, 87, 152, -58, -95, 255, -26, 3, 35, 51, -51, 168, 248, 83, -132, -100, 45, 46, 88, 22, 82, 11, -220, 145, -99, -140, 122]
4647A22k12K94J18k83J16J1j61J29J0r9k73K28l06M36J4j33k82K45j7O7l8P8p7
4670a3k0J24M7o1P0j60j18R8k45M64j59o3j40K45Q7k05RK06l69M7J78J17j45j
4694gq7K27k63Q4J01m1N4l1k74j90O23l92J09K31J25k80J98k45J45j27K57k47
4716c0l4K74l19m2K3j65L59k8K18k21j58J75l1j43J83j26J69o1K8%k8j80J41n5
4740e1J06j58j2Q3Oj70Q8j00J32p8j08P31n58K12K3o0j33K44l87K34R5j60J40
4763A19k23L97m41K40j79J80%j87L61j36k12M06k91k36M03k48O7K65l26R7o9K06
4785A93k07J39j21j39J20q2J60j25r6J60K29l42K4o7J06m9J9J25J11k13J38j44
4807f1O8o9J14k77L66j75K27l13LK30l7j3K97k25l05r0L17m2J61L9k62J62j04
$$ y = [122, -90, 204, 322, 39, 155, 166, 5, 134, 144, 45, -228, 0, -306, 130, 144, 11, -271, -26, -43, 24, -14, 64, -13, -33, 91, 138, 77, 147, -13, -131, -33, -278, 186, 27, -36, -176, 69, 156, -49, -40, 166, -203, -156, 22, 139, -6, -7, -94, 133, -130, -46, 55, 14, 68, 37, -237, -427, 196, -196, -87, 144, 269, -11, 187, -58, 87, -40, 217, -30, -64, 210, -109, -151, -128, -293, 66, 38, 256, 35, -123, 52, 21, -122, 61, -65, 104, 43, 71, 71, 43, -137, 4, -51, 55, -103, -115, -32, -26, -196, -108, -208, -76, -154, -262, 469, -89, 123, 146, 86, -47, 197, -190, 44, 139, -21, 119, -104, 293, -148, 92, -87, 93, 93, -94, 267, 131, -81, 325, 34, -202, 201, -47, 20, 285, -41, 56, -13, 193, -14, 125, 4, -135, -15, -97, 63, -62, -158, 2, 231, -111, -87, -154, -48, -97, -78, 47, 158, -55, 83, -61, 7, -62, 52, -225, 141, -34, 193, -120, -117, 113, 76, 63, 360, 135, -170, -260, 57, 15, 176, 215, -47, 115, 11]
4830A1K43o41M79N2k53K02m8O6k21P5j41L29p9j53J73O8k70J32N8m5j19n8J80
4853D0L0Ql3j93N4L71m63K31k15J36J21j53J50j0l13O7K94r4J20J08j43j80K01
4876A34J18k68N6k18K87l44K38Jj37K5K36j46j42J85r3j58K31Q9J1o6k30M23k89
4899e7Q4j48M27j85k25L31M6n54L50J28j86r5K26j66O3k45L29Q4k02L03k31J48
4921B25l01P2J59l37j15L1K01k0j96L79o9l11J43K60j57k6j60J95L1r0j20L0K11
4944C5k97R8L00l09J32p1L03Pk54J53j90K28j28K2k85J71J22o8R2k25p8L07j0
4967E5j18J02n5J72j12pl05L88j10r0l4J81n7j4k48J81J82k57J94n4M4k60L16
4990I4j79M28l96R0o8OK0J72J75n13M11j17k05K89k95KJ91j12j95K96k12L2L09
$$ y = [11, 254, -387, 92, 144, -109, 93, 45, 111, -110, -35, -176, 153, 74, -79, 94, 162, -108, 24, 82, 37, -82, -140, 40, 70, 78, 45, -148, -94, 277, -186, 45, -170, -34, 87, -66, 84, 74, -239, -172, 122, 28, 148, 256, 113, -67, 134, 252, -16, 40, -178, 109, -235, 3, 4, -133, -108, 128, -18, -160, 25, -68, -226, 5, 94, 105, 39, -191, 232, -57, 27, -121, 306, 121, -104, 227, 273, -281, 69, 197, 11, -84, 142, -24, 39, -206, 123, 207, 5, 308, 77, 225, -76, -4, 155, -182, -297, -266, -65, -85, -281, 98, 29, -282, -139, 121, -36, -62, -222, -27, 4, -86, -206, -176, 35, -262, -164, 136, -173, -41, -112, 191, 198, -56, 97, -93, 135, 7, 29, -256, -85, 37, -31, 61, -164, -242, 65, 55, -63, 39, -16, 156, 44, 37, -268, 120, 10, -80, -114, 67, 10, -4, -252, -71, 111, -146, 48, -6, 38, -222, 94, -85, 343, -53, 37, -31, -25, -5, 167, 342, -171, 240, 123, -82, 207, -88, -86, 105, -7, -202, 94, -118, -86, 223]
5013B23m80M68l5k21j01l32O50j74J04o1p7J07o2J37J55n14J95N7K62l33k36K57
5035a1J49j81J76Jj08j12k41Q4J59N8o1j82M88k42K9j76J73J42lj43J47o6q1J41
5059A40o7k8j83J29j29KK9J78k85L9M96m13N6J90l31J55n6J83n0q4J34o9k04L18
5083A50k48K9K09k84K54k84K94j0J3l66J7L65J64l81J89j2j22j9J3k13K37j0q5
5106a00R4r7R2k81M97p0j64J56k0K2p0l3J70Jk59K18Ll61K82q8N3Kj12K15n1L6
5132A35j51J24p2J20k32O5N2K5qo4J6j60J0K39j06J62k03l3l6P5J04l28K98j0
5156B2k48J16KJ4R9J35rk94M16r5o4j06j81K26j11J13r8j60J78Q5lQ5k65j01J45
5181i9J21O9Lp1r7l2l5J18L5J85J2k60J80Lk83J69R7J9j83J27j22q5J68n5r1O0
$$ y = [223, -257, 211, 176, -45, -146, -478, 172, -2, 102, 41, -36, 71, 9, 146, 301, -213, -18, 39, 301, -32, -268, -11, 138, -43, 133, 134, 26, -86, -327, -243, -84, -26, -87, -269, 219, -23, 6, -170, 3, 145, 142, -1, 146, 80, -1, 140, 73, 45, -138, -9, -138, -136, -107, 71, -214, -175, 321, -92, -36, 154, -177, -22, -78, 105, 55, -29, 105, 36, -168, 150, -98, -69, 140, -144, 110, -174, 120, 110, 123, -243, -226, 139, 303, -78, 111, 99, -23, -42, -29, -242, -5, -15, -100, -6, -103, -11, -292, 205, 135, -29, 127, 107, 129, 59, 26, 196, 197, -62, 156, 159, -202, 80, -8, 45, 47, -65, 150, 99, 135, -16, 108, 36, 156, -76, -11, 41, 66, 58, -6, 10, -150, -140, 99, -7, 155, -48, -81, -117, -42, 62, -266, 32, 22, -226, -110, -108, -94, 5, 140, 131, -163, 253, 158, 94, -12, -193, 33, -78, 35, -63, -223, -45, 40, 37, 122, -143, -244, -99, 22, 91, 94, 23, -74, -106, -141, -23, 12, 197, 209, -51, 129, 132, -151, 18, 115, 134, -49, 78, -44, -129, 39, -16, -107, -47]
5207d7o1L19j98K1J13m5j24J40k48k6K36M4k0k8p5o0j2J85k20K17j45R1o9J54
5231A42j81J59k73M0n1m5L83O0n52K15p1K82J4Q1j77l06R7K24p2J19k32K02O4
5254A22pr6k86K08J83j33J71l37J56k13K94o3j7o0K89Ll09J13j95L11j24n5p2
5277a17J55J49O3n28L12m3K9j2Q3l22K03r1J34n2R5J98j78k22L03Oj3n1k69K34
5301F6k55J74n3L20k4n65K97Qk43K14k09L19k50j15Q6L18J31j34R2k93q6L36j32
5324BP3rO1j5J94j78l87K98o2J24Kj49K35l48n3J01L0k08L35Q2J96j58l65m0K09
5349c0l9K05l1o4j09M43n06o9K47n8j37J71J75k16J8n3M5J61QK6l81J45qO6q6
5374g7K22j79Q8p1n2N2n9P8R4j52p8K42k73J93r9o9k36R0L42mn7J5k6N0l60M90
$$ y = [-47, -108, 211, 13, 34, 147, 102, -22, 118, -130, -156, 80, 124, 104, 76, 1, -59, -71, 114, -106, 111, -34, 57, -12, 142, -39, 120, -153, -113, -164, -209, 174, 234, -318, -103, -174, 108, 122, 203, 26, -280, -183, 41, -31, 88, -144, 58, 122, 115, 19, -267, -59, 124, -9, 162, -175, -19, -232, 62, -1, -18, -78, 211, 214, -95, 18, -177, 134, 10, -45, -117, 38, 187, 250, -278, 34, -9, 20, 8, 91, -231, -28, -119, 15, -37, 58, 256, 78, -144, 159, 165, 152, 101, -168, 66, -189, -15, -68, 252, 228, -337, -40, -32, -275, -61, -270, 49, -201, -316, -230, 88, 219, 85, 177, -116, -202, 134, 2, 75, 66, 127, 112, 306, 128, -259, 39, -23, 101, 103, -46, 189, -159, -212, -111, -81, -289, 46, 128, 324, 166, -199, -239, -30, -69, 136, 105, 41, -68, 375, -131, -200, 47, -11, -148, 23, 198, -18, 0, -53, -8, 153, 161, 187, -194, -49, -57, 9, -77, 145, -34, 54, -17, -69, -17, -76, 2, 96, -56, -134, 108, -165, 28, -71, -140, -376, -286, 56, 52, -5, 10, -16, 34, -326, 164]
5400A64m4l1k40K51j41J16L4q9n2J79k80J7J66n1l31K67P5j89rJ59m5K53k01j31
5424a53L85m9k10j71J52J78K8K4k82K7P2L2K03l31J38n6J88j98J42j04J28pR2
5447B28j02r5k82L28m99M94M0o1J44m45M20j24R9n1k80n3L67r2R8k57o7LJ03J28
5471D4j01m0j66L93q1k03p7j5L87k6l92j5L47q0l2J27J7j72J62j07r7K64K04j40
5495B01k4r2J00j03j54R2k18N51m11m5J71j90N2J31L0o7M2j32L5q5r8j20M62p6
5519E2q3L0J43j70k99M34J57l30J59o4K32k57j90Q9K91j65j20J22n9K59n0k03
5541b2Q7L5k68J45k77L06K10k01r3K53ok30k59M20r3J70k95j02K98j05k2Q8n6
5564a7J52l48L38jo7k04K52k54q3K71j28j75L14k35L71k20P8j24M1k5j23J43K05
$$ y = [164, 120, 89, -151, 100, -41, 75, 109, 20, -32, 147, -133, -116, 50, -1, -332, -65, 10, -179, -188, -29, -74, 179, -22, -153, 232, 183, -27, -198, -46, 132, 160, 184, -98, -71, 1, 33, 236, -95, 43, -13, 175, -23, 119, 15, 143, 136, 228, 126, 31, -251, 77, -422, 72, 112, 51, 195, -250, 170, 46, 145, 94, -186, -239, 128, 36, 134, -123, -190, -187, -84, 44, -57, -97, -263, 130, 49, -154, -231, -246, 141, 115, -277, -292, 55, -25, -57, 70, 87, -85, 77, -30, -127, 137, 341, 201, 177, 85, 185, 82, -72, 20, -198, 353, -58, -103, 68, -122, -70, 61, 91, 24, 66, -66, -31, -116, -214, -334, 128, 52, -31, -1, 142, -28, -327, 107, 264, -66, 93, 29, 261, 4, -186, -97, 194, 29, -91, 31, -28, 231, 181, -22, 65, 100, -168, -23, -300, 6, 216, 15, -78, 175, 169, -61, -320, 100, 7, 177, -118, -220, 78, -27, -49, 39, -17, 135, -213, 125, 124, 57, -147, 105, -149, -232, 39, -89, -264, 50, -185, 186, -34, 44, -80, -39, -64, -187, -44, 161]
5587A61j03j33J88J32Q7m30J53j07L13k14J27K17o36M26k07O5N1j51K01J27l68
5608a01Q0J95j78N5k1%k38K18j44J95k07L6L13j11O3m4j72L7k6K77q9n7P0m86
5632c35L76J8j8j94K75k68K32j8q5N5o3O6Q8r4N2l6k31L41j53K1j92K92J59l44
5656e6J13j81K18K09k32j68J93j08k8r5P4o5N8j85L27k12J34K91k11l8k12K70
5678I6q9k0j07j93M41o5%l08K31J79j81j77K52J85j16Q0k66l4J74l96J54L23k93
5701a30L7J10n2j4j46K99N2k49J5j26M3N9K40N3k97K44j47O9j12rk58K15m0L09
5725A65l48K03j35J5J02J7p5j31K05J99j86l6M2k28J47M9J44l28J59J45J21n39
5747b93K25K80k1m94J27L22k15K53n43K46L30o8q4k07J47J8L0r5O5q8J49j83r0
$$ y = [161, 58, -75, 113, 245, 332, -98, 55, -52, 261, 47, 174, 391, -245, 181, -26, 39, 90, -61, 140, 267, -101, -21, 174, -4, 51, 30, 30, -208, 10, -134, 61, -146, -110, 203, 92, 155, 111, -61, -24, -50, 227, 138, 81, 151, -335, 41, 59, 41, -153, 122, -146, 86, 68, -17, 38, -25, 41, 129, 35, 87, 51, -180, 161, 8, 29, -163, 129, 288, -56, 57, -124, 94, 303, 71, -97, 96, -12, -40, -135, -61, -126, -68, -253, 74, -138, -4, 287, 76, 38, -174, 96, 7, -13, -120, -313, 128, 63, 63, -245, -14, 165, -16, -193, 59, 244, 128, 208, -58, -92, 82, -314, -160, 163, -130, -93, 17, -35, -49, -195, 104, 156, -93, -78, -204, -161, -102, 138, 191, -106, 138, -9, 60, -52, -61, -319, -104, -144, 165, -183, 20, -115, -100, 2, 19, -56, -187, 18, 217, 31, -5, 37, -191, -44, 5, 149, -179, -20, 125, 246, -293, -68, 212, 191, -303, -176, 146, -69, 184, -359, -113, 217, 149, 65, -142, 5, 23, 53, -42, 23, -65, 84, -99, -189]
5770a89J77q8K38p5k91L39j20l43L06K02j23j5K52k41o0j63M75m01J57o4K38o1
5792A50n3mK68M0k59q0J19N7n71M35Q6n4k28j24J18J7J2L06j57p3j8r2K4L9jK9
5818a4j11J16m2M0j24J04L03m8k08q7J16J49j08J60l23K86o2k46K35k58L1o2L03
5841A50j15j88M6J59K5k84J42J4l6M1K59n05L75j16l8J77r9K04m09K18J9K51k74
5864A6j33J00K4J30j61J58j80pM6J44j82Q3L3j22P8q4N2j79J86j76L01j15J0N2
5888G4k07J70j47O0J86k79J05L5J1p9r0L13q1l07K78Oo2K51l00K89j90R1l30L42
5912A39k22K23l26J9K69p5k02L37j58j88J37O8n3n4J01k4J70r3j47O6j68K70j39
5935e0k69L37J00l24Q8J21j42J95K47m67R2J58k13K79j45j67n1K09J39j11P9j84
$$ y = [-189, -12, -100, 138, 63, -228, 111, -9, -352, -46, 156, 33, 18, 270, 29, -31, -194, 281, -120, 37, -27, 211, 150, 97, 93, 361, 401, 142, 62, 181, 238, -333, 102, 188, 134, -94, -218, -100, -83, -71, 235, 78, 5, -13, -105, -81, -42, -43, -14, -125, -9, -51, -11, -135, -31, 272, 224, 16, -71, 45, 194, 86, 246, -77, 209, 147, -99, 136, -122, -91, -153, 150, 35, -153, -107, 52, 77, -207, -65, -51, -87, -46, 213, -292, 83, -33, -71, 106, 7, 211, -198, 20, 39, 290, 16, -117, -17, 7, 137, -24, 134, -46, -53, -7, 137, -45, 38, 71, -51, 27, -57, -5, -184, 2, -174, 127, 12, 22, 74, -133, 37, -110, -50, 136, -143, -38, -3, 8, -71, -161, 152, 71, -236, 42, 48, -14, 237, -63, 226, 36, 127, -203, 139, -83, 140, -186, -167, 102, 27, -175, 162, 4, -184, -47, 21, -32, -86, 15, -9, 161, 68, -79, -13, -181, 89, -50, -319, 18, 118, -206, -118, 3, -139, 56, 303, -164, -72, 86, -127, 152, 7, -160, -211, -2, 137, 26, 105, -79]
5957g9P5m3J04J35j79j06N0Q4K7n0j01M6L8n7J63j3J3j55q3OM20l56J02k13n1
5982b23K02j01r5K24J02k94K78k06M2M7M7j83K27j67P6P2j26M1N6j6j95K57k70
6005b05L21l05J26N0n1p5K95j40n5L3k2N8Q5l39K38J68j83j13k9J80k76N15m89
6028b13J19L59Nj2j78J51P0k13l44K34J56k10K58k58J21j21O5n8K28l30K01j01
6050g1J09n17L82K70J55l01J54k32P3L8n0k0l5j23J17K67Ql11P1j19L25l07n8
6073a75Q9L88m50K55P4k23O2J5j88N0q1O9K3o0j7O8J3k47L00J8Q1o6m1Q3j82J42
6099@L13n09K25J5l19K57J49j91J40j98K57j42J86j02n6j51q0J95K07r4J36k74
6121c6o4L59k58j26K15n0qk6p5J02L10l03n7K5K44jk54p3O0J32P8m36K35L2J04
$$ y = [-79, -4, -47, 57, 192, 13, -93, -43, 41, 68, 18, -83, -37, 1, -56, 107, 94, 107, -48, -131, -125, 295, -61, 41, -172, -223, -21, -122, -217, 7, 109, -185, 93, -113, -71, -24, 23, -160, 67, -100, -24, 48, -78, -37, 19, 3, -192, 65, -205, 116, -189, -63, -13, -64, -139, 156, 16, -39, -6, -28, 30, 115, -224, 14, 182, -1, -114, -143, 37, -239, 276, -213, -94, 265, 270, 258, 80, 231, 301, 88, -256, -22, 134, -76, 182, -76, 45, -76, -11, -69, 159, -171, 30, -71, 38, -479, -97, 173, 328, 27, 181, -51, 22, 60, 10, -10, -45, -168, -51, 216, 224, -87, -16, -135, 190, -117, -175, -86, 302, -148, 107, 181, -42, 20, 35, -153, -103, -184, -115, -92, -152, -169, -101, -88, -335, -35, -17, 64, -2, -43, 40, -142, 0, 313, -196, 29, 44, -275, -18, 131, -60, 80, -118, 139, -3, 183, 81, 25, -126, -206, -11, 196, 102, 238, -36, -100, 259, 1, -125, 90, 40, 32, 6, -69, 33, 343, 40, -17, 8, 252, 251, -3, -76, -16, 116, 194, -242, -7, 25, 129]
6146A29j29J35q4J03o9k23J58k56r3M55j33k96N00m61K67k0N8J2l13J58j7j0j24
6169b53M05k75J24k06J07L01j55j97p2J15K61j00k58M02k50Q0k71L71j23L6J01
6190A43K2j33M6j29O6J2j34M0J04Jj58K24k04o9K05j51L66j66l10J35nJ65k4M1
6214H7p2J27k15K12k59J84J11j85O1n0K3K46r4k05r2J88J71rn97K67J55j13J39
6237H0lk01J80J63k55kj19N5J96j45p7m0j53K49o8K09Lo5K4P4o1j56qJ60m7p9
6263h6Q7K73k59R5k79R6K71k49q2J48jk31r7Q4M1M37k38j25J75j29N6K4R3r0j48
6288a34J69j57O7K0L3j63J34M3n9L8j59O6q3J16j16K71k47L26k58J19J40r0K8
6311A04J45k98J37j12J04k45pK56k40K14mK42r3l59K15J29l00J35j16K37k23J29
$$ y = [129, 0, 135, 51, 154, 85, -138, 20, -236, -329, 126, -7, -303, 197, -264, 3, -17, 41, 53, -260, -102, -119, -129, -253, 152, -123, 1, -205, -98, 203, 48, -149, -221, -106, 155, 55, -203, 199, -51, 29, -242, 129, 6, 42, 143, 165, 32, 78, -51, 15, 27, -107, -67, 37, 38, -120, 104, -100, -169, 36, -115, 251, 85, -225, -90, -95, 70, 46, 87, 15, 142, -73, 139, -120, 64, 175, -10, 51, 1, 24, 270, 176, -29, -121, 67, 238, 229, -368, -101, 54, -59, 80, 77, -124, 56, 219, -36, -38, -157, -102, 94, -51, -128, -168, -321, -72, -140, 69, 72, 7, 31, 105, 44, -112, -120, 40, -7, -86, 1, 274, 15, 110, -169, -73, 198, -51, -133, 15, 14, -217, -314, -230, -189, 248, 10, -115, 60, -69, -13, 11, 104, 14, -134, 35, -122, -55, -35, -2, -165, -31, 12, -47, -9, -168, -102, -185, -69, -185, 86, -161, 165, -93, 26, 166, 76, 104, 249, -49, 88, -24, 80, -165, -172, 84, -156, 58, 54, 296, 203, -156, 59, 188, -112, 23, -93, 144, -79, 50]
6333E0k64J95J27p9j75K21m4K04j72J13k15O4j19j38J01r3L95O7M1m55J40L22
$$ y = [50, -214, -19, 108, 29, -146, 75, 31, 235, 63, 176, -39, 25, -94, -232, -131, -224, 171, 238, 279, -176, -36, 286]
$$ [...]
8191A79
##END NTUPLES=NMR FID
##END=
