##TITLE=1H_DE-107_oil_TFA
 200.13MHz, CDCl3,
 8 sc
 
 29.8.2025
##JCAMPDX= 6.0         $$ Bruker NMR JCAMP-DX V2.0
##DATA TYPE= NMR FID
##DATA CLASS= NTUPLES
##ORIGIN= UXNMR, Bruker Analytische Messtechnik GmbH
##OWNER= pz
$$ XWIN-NMR		Version 3.5
$$ Fri Aug 29 15:27:36 2025 Russian Standard Time (UT+4h)  she@DPX200
##.OBSERVE FREQUENCY= 200.1313
##.OBSERVE NUCLEUS= ^1H
##.DELAY= (6, 6)
##.ACQUISITION MODE= SIMULTANEOUS
##.ACQUISITION SCHEME= undefined
##.AVERAGES= 8
##.DIGITISER RES= 18
##SPECTROMETER/DATA SYSTEM= spect
##.PULSE SEQUENCE= zg30
##.SOLVENT NAME= CDCl3
##.SHIFT REFERENCE= (INTERNAL, CDCl3, 0, 14.3821)
##AUDIT TRAIL= $$ (NUMBER, WHEN, WHO, WHERE, WHAT)
$$ ##TITLE= Audit trail, XWIN-NMR		Version 3.5
$$ ##JCAMPDX= 5.01
$$ ##ORIGIN= Bruker BioSpin GmbH
$$ ##OWNER= she
$$ F:/spectra/data/she/nmr/H-C/1/audita.txt
$$ ##AUDIT TRAIL=  $$ (NUMBER, WHEN, WHO, WHERE, WHAT)
(   1,<2025-08-29 15:26:09.78 +0400>,<she>,<DPX200>,
      <created by zg, POWCHK disabled, PULCHK disabled
       configuration hash MD5:
       00 E9 B6 7A A2 85 ED C7 34 08 36 98 17 FE 4E 26
       data hash MD5: 16K
       EF 3A 3E 18 5B 48 7C 32 5D 18 5C D8 2A CF F8 AE>)
$$ ##END=
$$ 
$$ hash MD5
$$ 7E 7A 30 23 21 6F 99 A5 35 97 03 D3 D1 24 5A 18
##$RELAX= 
##$RELAX= 
##$RELAX= 
##$RELAX= 
##$RELAX= 
##$RELAX= 
$$ Bruker specific parameters
$$ --------------------------
##$DU= <F:/spectra>
##$EXPNO= 1
##$NAME= <H-C>
##$PROCNO= 1
##$TYPE= <nmr>
##$USER= <she>
##$AMP= (0..31)
100 100 100 100 100 100 100 100 100 100 100 100 100 100 100 100 100 100 
100 100 100 100 100 100 100 100 100 100 100 100 100 100 
##$AQSEQ= 0
##$AQ_mod= 1
##$AUNM= <au_zg>
##$AUTOPOS= <>
##$BF1= 200.13
##$BF2= 200.13
##$BF3= 200.13
##$BF4= 200.13
##$BF5= 200.13
##$BF6= 200.13
##$BF7= 200.13
##$BF8= 200.13
##$BYTORDA= 1
##$CFDGTYP= 0
##$CFRGTYP= 5
##$CHEMSTR= <none>
##$CNST= (0..31)
1 1 145 1 1 1 1 1 1 1 1 1 1 1 1 1 1 1 1 1 1 1 1 1 1 1 1 1 1 1 1 1 
##$CPDPRG= <>
##$CPDPRG1= <>
##$CPDPRG2= <>
##$CPDPRG3= <>
##$CPDPRG4= <mlev>
##$CPDPRG5= <mlev>
##$CPDPRG6= <mlev>
##$CPDPRG7= <mlev>
##$CPDPRG8= <mlev>
##$CPDPRGB= <>
##$CPDPRGT= <>
##$D= (0..31)
0 0.7 0 0 0 0 0 0 0 0 0 0.03 0 0 0 0 0 0 0 0 0 0 0 0 0 0 0 0 0 0 0 0 
##$DATE= 1756466769
##$DBL= (0..7)
120 120 120 120 120 120 120 120 
##$DBP= (0..7)
150 150 150 150 150 150 150 150 
##$DBP07= 0
##$DBPNAM0= <>
##$DBPNAM1= <>
##$DBPNAM2= <>
##$DBPNAM3= <>
##$DBPNAM4= <>
##$DBPNAM5= <>
##$DBPNAM6= <>
##$DBPNAM7= <>
##$DBPOAL= (0..7)
0.5 0.5 0.5 0.5 0.5 0.5 0.5 0.5 
##$DBPOFFS= (0..7)
0 0 0 0 0 0 0 0 
##$DE= 6
##$DECBNUC= <off>
##$DECIM= 32
##$DECNUC= <off>
##$DECSTAT= 4
##$DIGMOD= 1
##$DIGTYP= 9
##$DL= (0..7)
0 120 120 120 120 120 120 120 
##$DP= (0..7)
150 150 150 150 150 150 150 150 
##$DP07= 0
##$DPNAME0= <>
##$DPNAME1= <>
##$DPNAME2= <>
##$DPNAME3= <>
##$DPNAME4= <>
##$DPNAME5= <>
##$DPNAME6= <>
##$DPNAME7= <>
##$DPOAL= (0..7)
0.5 0.5 0.5 0.5 0.5 0.5 0.5 0.5 
##$DPOFFS= (0..7)
0 0 0 0 0 0 0 0 
##$DQDMODE= 0
##$DR= 18
##$DS= 0
##$DSLIST= <SSSSSSSSSSSSSSS>
$$ [...]
##$SUBNAM0= <"">
##$SUBNAM1= <"">
##$SUBNAM2= <"">
##$SUBNAM3= <"">
##$SUBNAM4= <"">
##$SUBNAM5= <"">
##$SUBNAM6= <"">
##$SUBNAM7= <"">
##$SUBNAM8= <"">
##$SUBNAM9= <"">
##$SW= 18.0517328524113
##$SWIBOX= (0..15)
0 0 2 0 0 0 0 0 0 0 0 0 0 0 0 0 
##$SW_h= 3612.71676300578
##$TD= 16384
##$TD0= 1
##$TE= 0
##$TE2= 300
##$TE3= 300
##$TEG= 300
##$TL= (0..7)
0 120 120 120 120 120 120 120 
##$TP= (0..7)
150 150 150 150 150 150 150 150 
##$TP07= 0
##$TPNAME0= <>
##$TPNAME1= <>
##$TPNAME2= <>
##$TPNAME3= <>
##$TPNAME4= <>
##$TPNAME5= <>
##$TPNAME6= <>
##$TPNAME7= <>
##$TPOAL= (0..7)
0.5 0.5 0.5 0.5 0.5 0.5 0.5 0.5 
##$TPOFFS= (0..7)
0 0 0 0 0 0 0 0 
##$TUNHIN= 0
##$TUNHOUT= 0
##$TUNXOUT= 0
##$USERA1= <user>
##$USERA2= <user>
##$USERA3= <user>
##$USERA4= <user>
##$USERA5= <user>
##$V9= 5
##$VALIST= <valist>
##$VCLIST= <CCCCCCCCCCCCCCC>
##$VD= 0
##$VDLIST= <DDDDDDDDDDDDDDD>
##$VPLIST= <PPPPPPPPPPPPPPP>
##$VTLIST= <TTTTTTTTTTTTTTT>
##$WBST= 1024
##$WBSW= 4
##$XGAIN= (0..3)
0 0 0 0 
##$XL= 0
##$YL= 0
##$YMAX_a= 119600
##$YMIN_a= -156956
##$ZGOPTNS= <>
##$ZL1= 120
##$ZL2= 120
##$ZL3= 120
##$ZL4= 120
##$ABSF1= 10
##$ABSF2= 0
##$ABSG= 5
##$ABSL= 3
##$ALPHA= 0
##$AQORDER= 0
##$ASSFAC= 0
##$ASSFACI= 0
##$ASSFACX= 0
##$ASSWID= 0
##$AUNMP= <proc_1d>
##$AZFE= 0.1
##$AZFW= 0.1
##$BCFW= 1
##$BC_mod= 2
##$BYTORDP= 1
##$COROFFS= 0
##$CY= -3
##$DATMOD= 1
##$DC= 2
##$DFILT= <>
##$DTYPP= 0
##$F1P= 0
##$F2P= 0
##$FCOR= 0.5
##$FTSIZE= 0
##$FT_mod= 4
##$GAMMA= 1
##$GB= 0.15
##$INTBC= 1
##$INTSCL= 1
##$ISEN= 128
##$LB= 0.25
##$LEV0= 0
##$LPBIN= 0
##$MAXI= 10000
##$MC2= 0
##$MEAN= 0
##$ME_mod= 0
##$MI= 1.114404
##$NCOEF= 0
##$NC_proc= 0
##$NLEV= 6
##$NOISF1= 3.799351
##$NOISF2= 2.8
##$NSP= 1
##$NTH_PI= 0
##$NZP= 0
##$OFFSET= 14.38212
##$PC= 1
##$PHC0= -1569.308
##$PHC1= 27.39228
##$PH_mod= 1
##$PKNL= yes
##$PPARMOD= 0
##$PSCAL= 0
##$PSIGN= 0
##$REVERSE= no
##$SF= 200.129724274929
##$SI= 16384
##$SIGF1= 3
##$SIGF2= 2
##$SINO= 400
##$SIOLD= 16384
##$SREGLST= <1H.CDCl3>
##$SSB= 0
##$STSI= 0
##$STSR= 0
##$SW_p= 3205.1282051282
##$SYMM= 0
##$S_DEV= 0
##$TDeff= 0
##$TDoff= 0
##$TI= <>
##$TILT= no
##$TM1= 0
##$TM2= 0
##$TOPLEV= 0
##$USERP1= <user>
##$USERP2= <user>
##$USERP3= <user>
##$USERP4= <user>
##$USERP5= <user>
##$WDW= 1
##$XDIM= 8192
##$YMAX_p= 0
##$YMIN_p= 0
$$ End of Bruker specific parameters
$$ ---------------------------------
##NTUPLES= NMR FID
##VAR_NAME=  TIME,          FID/REAL,        FID/IMAG
##SYMBOL=    X,             R,               I
##VAR_TYPE=  INDEPENDENT,   DEPENDENT,       DEPENDENT
##VAR_FORM=  AFFN,          ASDF,            ASDF
##VAR_DIM=   8192,          8192,            8192
##UNITS=     SECONDS,       ARBITRARY UNITS, ARBITRARY UNITS
##FACTOR=    0.0002768,     1,               1
##FIRST=     0,             0,               0
##LAST=      2.2672688,     0,               0
##MIN=       0,             -156956,         0
##MAX=       2.2672688,     119600,          0
$$ Real data points
##PAGE= N=1
##DATA TABLE= (X++(R..R)), XYDATA
$$ [...]
$$ plain form
1868 -90 393 -63 -118 52 228 48 -68 262 -27 -46 -138 -45 -468 -119 -35 -329 -110 -26 125 -250 -12 183
1890 183 -16 206 177 -124 145 -16 40 -9 -229 -224 -106 -39 -248 -46 -41 -10 -34 -50 -16 128 156 262 235 259 317
1915 317 15 151 -45 -35 12 -135 -500 -165 -170 -330 -253 -103 -89 49 231 -12 397 216 158 138 153 112 -214
1938 -214 75 -43 -53 77 35 -228 -318 -291 54 -32 -109 14 325 90 71 144 74 99 259 219 -179 -228 -226 32 -72
1963 -72 -269 99 -47 -366 -117 24 -37 106 318 -108 70 374 284 88 153 172 292 -340 -37 73 -162 -378
1985 -378 -28 -138 149 103 -1 33 117 -100 -204 -218 418 276 -143 -243 -211 -335 -37 -36 20 -144 -18 61 -14
2008 -14 -123 45 -27 -5 68 25 57 115 -129 -105 202 -184 119 -180 -81 77 99 375 200 86 243 28 30 -213
2032 -213 14 231 -63 141 18 -210 -81 -150 -350 -153 65 -87 -11 99 130 -143 -130 309 -161 116 140 -273
$$ packed form
1868i0M83m56n5J70J76j80j16L30k89j9r2R3m23L49Q4k94K19Q4J51l75K38J95
1890A83j99K22k9l01K69j61N6m9k20NJ18O7k09K02NL1k4j6L4J44K8J06k7K4N8
1915C17l02J36j96J0M7j47l65L35nj60P7J50J4J38J82k43M09j81n8k0J5m1l26
1938b14K89j18j0J30m2k63r0K7L45q6p7J23L11k35j9P3p0K5J60m0l98m9KK58j04
1963g2j97L68j46l19K49J41o1J43K12m26J78L04r0j96O5J9J20o32L03J10k35k16
1985c78L50j10K87m6j04L4Q4k17j04j4O36j42m19j00L2j24K98JN6j64J26P9p5
2008a4j09J68p2K2P3m3L2N8k44K4L07l86L03k99R9J58K2K76j75j14J57k15Kk43
2032b13K27K17k94K04j23k28J29o9k00J97K18j52P6J10L1k73J3M39m70K77K4m13
$$ plain form
2054 -273 -129 61 -263 -204 -233 -270 -77 -156 232 -193 58 82 206 429 70 201 -22 211 -46 -120 -139 -294
2076 -294 -108 -416 -103 -353 -56 -91 -126 -49 100 -55 -11 230 93 178 -8 -101 -102 296 -288 -307 -56 -308 -138
2099 -138 -118 -126 -92 -203 13 85 45 144 115 43 155 -76 248 272 28 -150 30 58 56 118 -19 -99 -287 -93 101
2124 101 -114 -10 -46 -103 -199 270 -71 -89 -48 -125 -70 20 -4 -170 256 -178 193 372 89 -14 -80 145 -26
2147 -26 153 153 35 -115 -10 -117 -57 -79 -223 132 47 -308 45 -156 89 193 -42 -90 -163 -142 55 -178 119
2170 119 -151 -91 104 70 29 -84 -84 -117 2 -4 -178 -99 -1 87 33 208 169 213 233 -66 46 -54 -274 -186 7
2195 7 121 -54 -152 107 -137 112 222 186 -36 247 -79 5 -28 -121 -185 150 -328 -84 -137 -159 -76 42 -137 129
2219 129 75 207 77 116 67 43 209 91 -74 -206 -208 16 78 281 25 -161 -281 -265 -15 -121 22 -114 99
$$ packed form
2054b73J44J90l24N9k9l7J93p9L88m25K51K4J24K23l59J31k23K33k57p4j9j55
2076b94J86l08L13k50K97l5l5P7J49j55M4K41j37Q5j86r3jL98n84j9K51k52J70
2099a38K0qL4j11K16P2m0R9k9p2J12k31L24K4k44j78J80K8kO2j37q0j88J94J94
2124A01k15J04l6n7r6M69l41j8M1p7N5R0k4j66M26m34L71J79k83j03o6K25j71
2147b6J79%j18j50J05j07O0k2j44L55q5l55L53k01K45J04k35m8p3K1J97k33K97
2170A19k70O0J95l4m1j13%l3J19oj74P9R8Q8n4J75l9M4K0k99J12j00k20Q8J93
2195GJ14j75r8K59k44K49J10l6k22K83l26Q4l3r3o4L35m78K44n3k2Q3J18j79K66
2219A29n4J32j30L9m9k4J66j18j65j32kK24O2K03k56j86j20J6K50j06J43j36K13
$$ plain form
2242 99 75 -40 -49 -285 16 -15 -113 -160 -130 79 31 65 76 69 272 295 -16 125 146 238 281 38 -213 33 -5 106
2268 106 105 -275 255 74 -36 15 -62 -65 -199 54 161 12 231 37 -220 103 39 13 -255 114 167 122 -157
2291 -157 164 141 -40 -147 37 161 148 64 -202 43 148 -121 84 -15 -135 291 -157 103 -17 -86 399 -127
2313 -127 -60 -199 -8 286 218 211 30 192 73 442 -9 168 190 -1 -154 62 -508 -76 -131 -58 80 118 -51
2336 -51 143 2 -38 176 -94 74 51 51 212 -106 33 229 -60 26 -200 90 143 -102 -24 29 17 16 27 19 6
2361 6 319 48 -77 146 -86 32 -98 -204 177 167 -95 -83 -208 -57 -76 52 -465 341 150 10 -87 -72
2383 -72 146 -192 -5 27 -192 86 29 -167 -19 76 -29 56 41 -126 83 -3 -92 -165 3 47 180 -149 -44
2406 -44 83 -105 53 -102 54 43 42 -64 37 -96 48 -210 -98 170 -231 -3 -92 -3 78 110 -443 -61 -105
$$ packed form
2242I9k4j15rk36L01l1r8m7L0K09m8L4J1pK03K3l11J41K1R2M3k43k51K46l8J11
2268A06jl80N30j81j10N1p7lj34K53J07j49K19j94k57L23o4k6k68L69N3m5k79
2291a57L21k3j81j07J84J24j3q4k66K45J05k69K05r9j20M26m48K60j20o9M85n26
2313a27O7j39J91K94o8pj81J62j19L69m51J77K2j91j53K16n70M32n5P3J38L8j69
2336e1J94j41m0K14k70J68k3%J61l18J39J96k89Q6k26K90N3k45P8N3j2jJ1qj3
2361FL13k71j25K23k32J18j30j06L81j0k62J2j25J51j9J28n17Q06j91j40r7J5
2383g2K18l38J87L2k19K78n7j96J48R5j05Q5j5j67K09q6q9p3J68M4J33l29J05
2406d4J27j88J58j55J56j1jj06J01j33J44k58J12K68m01K28q9Q9Q1L2n53L82m4
$$ plain form
2429 -105 -124 -21 -120 40 170 318 -117 -87 200 82 150 -110 30 -245 -197 -88 -77 -220 56 166 205 107 248
2452 248 -241 236 32 341 38 -54 -54 122 -212 243 -7 -109 -52 -262 89 0 133 167 255 33 23 90 146
2475 146 403 182 -179 36 383 -201 -227 30 6 -189 111 184 -82 -46 -158 222 182 153 -119 -31 24 -34 -171
2498 -171 -65 136 59 61 -201 -202 -53 -286 -17 -25 10 10 -40 -39 292 -19 198 -33 136 13 305 -62 45 -57
2522 -57 -109 188 -221 -157 -16 -86 0 -40 -143 -52 57 -250 60 20 161 63 109 -169 -202 -117 67 113 -262 -31
2546 -31 -373 270 58 -36 96 -39 91 -207 110 -227 -245 142 -68 -142 -136 161 21 -222 -104 -9 2 -34 -93
2569 -93 34 155 19 -245 81 155 -77 -16 -165 57 -116 85 77 101 95 65 -6 89 59 29 -9 -9 156 114 75 111
2595 111 -342 -28 210 -189 -136 -61 -59 262 -277 84 -27 141 53 36 100 -92 -127 -132 -17 -76 -202 50 -123 -207
$$ packed form
2429a05j9J03r9J60J30J48m35L0K87j18O8k60J40k75M8J09J1j43K76J10L9r8J41
2452B48m89M77k04L09l03r2%J76l34M55k50j02N7k10L51q9J33L4Q8k22j0O7N6
2475A46K57k21l61K15L47n84k6K57k4j95L00P3k66L6j12L80m0k9k72Q8N5n8j37
2498a71J06K01p7Kk62jJ49k33K69qL5%n0JL31l11K17k31J69j23K92l67J07j02
2522e7n2K97m09O4J41p0Q6m0j03R1J09l07L10m0J41r8M6k78l3Q5J84M6l75K31
2546c1l42O43k12r4J32j35J30k98L17l37j8L87k10p4OK97j40k43J18R5J1l6n9
2569i3J27J21j36k64L26P4k32O1j49K22j73K01qK4ol0p1R5l0l0l8%J65m2l9L6
2595A11m53L14K38l99N3P5KL21n39L61j11J68q8j7O4j92l5nJ15n9j26K52j73q4
$$ plain form
2619 -207 61 -112 -86 72 110 40 124 -53 198 -73 -59 111 -4 137 162 56 177 74 -52 37 78 -100 -161
2642 -161 -211 -59 61 93 144 201 -79 267 46 -86 -183 -62 40 32 -38 12 -333 10 -137 -77 -205 40 -105
2665 -105 -271 63 -38 116 -53 -39 -60 86 108 299 94 62 -272 -33 -150 4 -256 126 -224 18 -31 -30
2687 -30 77 -225 -56 -94 -123 -238 105 5 64 -45 207 77 -33 171 -149 -59 -294 -58 -159 -31 -322 141
2709 141 -12 -198 145 152 144 98 -196 217 406 -234 5 -132 -164 -34 104 62 155 -181 17 -155 62 -31 6
2732 6 -164 26 185 -193 168 -6 146 133 297 -153 20 14 56 39 -148 97 -233 -8 -10 -301 -230 -198 -76 -64
2756 -64 120 -174 66 -199 -12 316 205 110 6 -62 163 264 276 42 -68 19 172 -170 35 7 -72 -49 -302
2779 -302 71 46 293 -208 62 19 417 287 79 45 107 -51 47 143 -138 -114 -374 -202 78 -91 -196 118
$$ packed form
2619b07K68j73K6J58L8p0Q4j77K51k71J4J70j15J41K5j06J21j03j26Q9M1j78o1
2642a61n0J52J20L2N1N7k80L46k21j32r7J21J02qp0N0l45L43j47O0j28K45j45
2665a05j66L34j01J54j69J4k1J46K2J91k05l2l34K39j17J54k60L82l50K42m9J
2687c0J07l02J69l8k9j15L43j00N9j09K52j30j10K04l20R0k35K36j01J28k91M63
2709A41j53j86L43Pqm6k94M13J89o40K39j37l2J30J38m2R3l36J98j72K17r3L7
2732Fj70J90J59l78L61j74J52j3J64m50J73oM2j7j87K45l30K25kk91P1L2J22J2
2756f4J84k94K40k65J87L28j11r5j04o8K25J01J2k34j10Q7J53l42K05k8p9K3k53
2779c02L73k5K47n01K70m3L98j30k08l4O2j58R8R6k81K4k60J72K80j69j05L14
$$ plain form
2801 118 -32 -70 1 67 -116 -78 79 107 -151 -374 -141 33 -43 146 11 -1 -149 18 -133 -19 -247 194
2823 194 220 25 108 51 -56 -34 76 -134 53 -158 -35 44 197 247 -154 67 136 -29 -192 189 275 -125 -77
2846 -77 46 -145 99 -277 38 -46 -123 -208 -117 -24 -218 -120 161 41 -55 -145 55 -95 -200 -114 101 -71 64
2869 64 -195 -38 120 -208 52 -223 318 66 246 -13 -179 -124 317 172 133 52 -335 -226 -33 -97 36 -9
2891 -9 -346 28 -66 79 106 32 317 79 153 212 -112 -37 -105 63 -89 -271 196 11 -240 -124 30 -136 10
2914 10 -99 126 8 55 185 -286 93 68 173 -93 102 -81 44 40 -14 85 36 63 129 -10 -327 127 105 -14
2938 -14 -256 52 -71 92 -121 119 180 -148 -19 -467 -5 92 66 72 -2 -143 -156 -153 -280 138 -216 -396 62
2961 62 11 -214 140 -169 -3 -322 6 -103 -445 37 -17 -192 -79 -31 -186 -61 34 169 53 -241 -112 -128
$$ packed form
2801A18j50l8P1O6j83L8J57K8k58k23K33J74p6J89j35j2j48J67j51J14k28M41
2823A94K6j95Q3n7j07K2J10k10J87k11J23P9J53N0m01K21O9j65j63L81Q6m00M8
2846g7J23j91K44l76L15q4p7q5R1R3j94R8K81j20r6r0K00j50j05Q6K15j72J35
2869F4k59J57J58l28K60k75N41k52J80k59j66N5M41j45l9q1l87J09J93o4J33m5
2891il37L74r4J45K7p4K85k38P4N9l24P5o8J68j52j82M67j85k51J16J54j66J46
2914A0j09K25j18M7J30m71L79k5J05k66J95j83J25mn4R9m9K7O6j39l17M54k2j19
2938a4k42L08j23J63k13K40O1l28J29m48M62R7k6Op4j41j3Lj27M18l54j80M58
2961F2n1k25L54l09J66l19L28j09l42M82n4j75J13M8j55J25R5J35j16k94J29j6
$$ plain form
2983 -128 41 143 -66 -88 55 173 183 133 -36 -256 -74 -20 -76 -223 -94 98 -111 148 -34 -246 -92 126
3005 126 57 14 -217 -190 -120 -159 119 292 254 179 64 273 211 165 -129 -70 231 -6 161 -94 -128 118 -35 30
3029 30 123 -69 -48 89 -73 56 59 -347 103 -182 -182 40 -54 -98 -237 -153 -72 -157 -177 84 -108 -90 -31 168 -179
3054 -179 286 181 78 -163 24 24 -372 -142 -333 -93 -249 -27 -141 -149 -256 12 320 48 159 -178 26
3075 26 83 43 -82 280 148 -169 -217 184 -42 61 133 95 190 -123 -42 16 98 -6 200 -20 -158 -117 184 -2
3099 -2 28 -59 29 167 -27 -278 -65 -107 -16 134 57 24 -238 59 38 74 -159 -106 -26 322 -47 265 64 126 53
3124 53 69 270 -45 187 -35 16 53 70 10 -23 -309 26 206 -10 -177 -89 -5 -35 50 -251 95 264 200 -42
3148 -42 -50 -143 -32 120 323 76 -208 46 94 79 -4 -142 -67 156 -114 -37 212 242 31 103 90 181 183 205 281 -59
$$ packed form
2983a28J69J02k09k2J43J18J0n0j69k20J82N4n6j47J29J92k09K59j82k12J54K18
3005A26o9m3k31K7P0l9K78J73l8p5j15K09o2m6k94N9L01k37J67k55l4K46j53O5
3029C0R3j92K1J37j62J29Lm06M50k85%K22r4m4j39Q4Q1q5k0K61j92J8N9J99l47
3054a79M65j05j03k41J87%l96K30j91K40j56K22j14qj07K68L08k72J11l37K04
3075B6N7m0j25L62j32l17m8M01k26J03P2l8R5l13Q1N8Q2j04K06k20j38M1L01j86
3099bL0q7Q8J38j94k51K13m2R1J50p7l3k62K97k1L6k33N3Q0L48l69L12k01O2p3
3124E3J6K01l15K32k22N1L7J7o0l3k86L35J80k16j67Q8Q4l0Q5l01L46J69o4k42
3148d2qr3J11J52K03k47k84K54M8j5q3j38P5K23k70P7K49L0k11P2j3R1KK2P6l40
$$ plain form
3174 -59 -85 39 21 -91 123 17 -95 177 64 92 65 4 150 -156 5 47 -107 32 -50 -51 -68 -6 -49 25 -46
3199 -46 4 -205 20 226 -15 -28 7 161 -133 -54 45 206 187 98 -84 -52 -181 -197 26 54 -81 -122 -170 90
3223 90 163 -59 -84 -68 299 170 -60 71 179 -95 49 66 -197 -69 -80 111 -185 -81 -21 -83 77 -306 -95
3246 -95 54 138 32 49 218 -53 15 -3 -34 -50 18 -149 342 -37 -288 153 104 -38 -244 56 -44 346 -21
3269 -21 -103 14 -15 -170 -257 -92 -80 -17 -40 24 102 83 197 -250 9 -242 157 -291 -64 158 65 363 -49 -123
3293 -123 298 85 65 -46 -160 347 -157 122 42 -79 211 -89 23 69 -63 268 28 -242 257 97 -148
3314 -148 226 -323 -167 -21 303 -261 27 8 -112 -65 -102 -153 14 -56 30 -48 30 71 -95 85 177 -23 36 226
3338 226 127 54 53 -234 18 97 90 57 -138 6 -147 -110 -53 -33 -98 75 -55 -101 34 53 198 22 128 -82 23
$$ packed form
3174e9k6J24j8j12K14j06j12K72j13K8k7o1J46l06J61M2j54J39q2jj7O2m3P4p1
3199d6N0k09K25K06k41j3L5J54k94P9R9J61j9q9j82L2j29j6K23K8j35m1m8K60
3223I0P3k22k5J6L67j29k30J31J08k74J44J7k63J28j1J91k96J04O0o2J60l83K11
3246i5J49Q4j06J7J69k71O8j8l1j6O8j67M91l79k51M41m9j42k06L00j00L90l67
3269b1q2J17k9j55q7J65J2O3k3O4P8j9J14m47K59k51L99m48K27K22r3K98m12p4
3293a23M21k13k0j11j14N07n04K79q0j21K90l00J12M6j32L31k40k70M99j60k45
3314a48L74n49J56J46L24n64K88j9j20M7l7n1J67p0Q6p8P8M1j66J80R2k00N9J90
3338B26r9p3jk87K52P9pl3j95J44j53L7N7K0o5J73j30m6J35J9J45j76J06k10J05
$$ plain form
3363 23 -220 120 -59 49 272 127 239 -10 104 -139 10 -312 -185 58 -180 242 344 -42 25 -165 139
3384 139 -215 260 -93 -24 238 187 95 50 187 -44 11 -205 -9 -21 -248 96 -22 114 -153 191 -61 -266
3406 -266 -31 11 221 -4 -45 -113 -279 153 -163 107 -173 -104 27 -237 -107 148 47 165 109 27 -77 203
3428 203 -75 -32 -162 -59 82 379 80 -194 -18 -165 260 175 -185 3 233 -5 167 -40 0 -161 39
3449 39 -219 131 137 -4 107 -6 -56 -158 -17 98 172 -143 -18 -90 306 140 -230 -20 16 89 -88 162 -154
3472 -154 89 -273 -55 -144 -92 -54 123 219 57 7 -177 -121 -24 -15 209 1 47 -75 -59 99 -171 -109 -120 -31 86
3497 86 285 -112 128 -386 137 43 -202 45 226 -118 103 -149 -120 -280 -382 71 -115 -161 -283 119 147 123
3519 123 177 -46 82 74 162 62 -307 72 -142 -112 -72 -164 21 221 65 -116 -15 114 -242 -138 210 -39
$$ packed form
3363B3k43L40j79J08K23j45J12k49J14k43J49l22J27K43k38M22J02l86O7j90L04
3384A39l54M75l53O9K62n1r2m5J37k31N5k16J96j2k27L44j18J36k67L44k52k05
3406b66K35M2K10k25m1o8j66M32l16K70k80O9J31k64J30K55j01J18n6q2j04K80
3428B03k78M3j30J03J41K97k99k74J76j47M25q5l60J88K30k38J72k07M0j61K00
3449C9k58L50Oj41J11j13n0j02J41J15P4l15J25p2L96j66l70K10L6P3j77K50l16
3472a54K43l62K18q9N2L8J77R6j62n0j84N6R7RK24k08M6j22J6J58k70O2j1Q9J17
3497H6J99l97K40n14N23r4k45K47J81l44K21k52K9j60j02M53j86m6j22M02K8k4
3519A23N4k23J28qQ8j00l69L79k14L0M0r2J85K00j56j81J01J29l56J04L48k49
$$ plain form
3541 -39 -98 199 -76 -41 107 71 -229 3 -50 43 -137 258 -146 -46 -4 23 -144 -200 -78 -169 187 30 -48 197
3565 197 -39 64 205 -17 33 -130 -74 -208 211 139 107 197 194 -142 127 -181 291 -8 -101 -57 31 -82 -80 424
3589 424 -226 28 -68 -119 294 -235 -310 43 -105 -73 94 -3 176 -156 -67 -143 55 65 173 227 116 204 50
3612 50 -59 -26 7 21 99 140 27 82 -46 -11 77 196 -157 106 19 -132 103 -24 -225 103 28 311 -208 -342
3636 -342 -184 -54 183 -223 -134 54 -75 -50 -93 8 -220 -174 -35 -239 -79 151 95 201 48 25 154 -209
3658 -209 -265 -43 50 99 -138 57 -273 -9 -18 -242 -145 -129 180 15 57 -79 175 -208 28 77 218 -82 -24
3681 -24 160 84 170 102 -46 281 -233 137 1 -189 166 115 -236 -78 -5 31 -36 -229 10 48 -186 -203 204
3704 204 189 -70 19 -193 -280 68 -123 144 134 145 16 -123 -119 -68 109 -129 -268 -52 -280 -48 88 101 76
$$ packed form
3541c9n9K97k75L5J48l6l00K32n3R3j80L95m04J00M2K7j67n6J22r1L56j57p8K45
3565A97k36J03J41k22N0j63N6j34M19p2l2R0ll36K69l08M72k99r3M4Q8j13KN04
3589D24o50K54r6n1M13n29p5L53j48L2J67r7J79l32Q9p6J98J0J08N4j11Q8j54
3612E0j09L3L3J4P8M1j13N5j28L5Q8J19l53K63q7j51K35j27k01L28p5K83n19j34
3636c42J58J30K37m06Q9J88j29K5m3J01k28M6J39k04J60K30n6J06j53k3J29l63
3658b09n6K22R3M9k37J95l30K64rk24R7J6L09j65M2j36K54l83K36M9J41l00N8
3681b4J84p6Q6o8j48L27n14L70j36j90L55n1l51J58P3L6o7j93K39L8k34j7M07
3704B04j5k59Q9k12q7L48j91K67j0J1j29j39MN1J77k38j39K16k28K32J36J3k5
$$ plain form
3727 76 101 116 174 -33 98 201 290 -59 -11 134 -142 -195 81 200 48 -217 -199 65 -39 -292 -219 237 192
3750 192 138 8 165 -147 175 14 152 69 198 125 -12 -228 -101 -195 -10 42 -229 226 148 387 110 160
3772 160 -87 -25 185 90 143 -134 65 -74 -144 -171 -110 -36 -98 17 371 -112 175 -50 241 -30 114 -65 72
3795 72 91 116 -137 -90 32 -57 122 -55 47 -38 -42 -94 -342 -2 -234 83 -94 -12 -6 -43 -9 -55 139 -144 36
3820 36 258 -186 -14 -175 196 90 276 14 97 79 75 212 -144 142 34 -179 -419 -100 257 -123 -198 256
3842 256 1 170 102 12 19 -215 188 141 60 -68 118 -81 40 -96 103 30 112 -293 -35 91 11 -105 -132
3865 -132 206 -44 -113 -143 -182 -82 -21 4 -107 -23 97 -56 -367 -46 96 261 80 55 233 77 110 115 27 12
3889 12 -260 40 118 176 111 33 -169 -98 -134 -356 30 -156 110 68 134 134 47 -175 -12 -54 37 -101 -70 -239 -237 223
$$ packed form
3727G6K5J5N8k07J31J03Q9l49M8J45k76n3K76J19j52k65J8K64j04k53P3M56m5
3750A92n4j30J57l12L22j61J38q3J29p3j37k16J27r4J85N2k71M55p8K39k77N0
3772A60k47O2K10r5N3k77J99j39p0k7O1P4o2J15L54m83K87k25K91k71J44j79J37
3795G2J9K5k53M7J22q9J79j77J02q5mn2k48L40k32L17j77Q2Ol7L4m6J94k83J80
3820C6K22m44J72j61L71j06J86k62Q3j8mJ37l56K86j08k13k40L19L57l80p5M54
3842B56k55J69o8r0Pk34M03m7q1j28J86j99J21j36J99p3Q2m05K58J26q0j16k7
3865a32L38k50o9l0l9J00O1K5j11Q4J20j53l11L21J42J65j81k5J78j56L3Nq8j5
3889A2k72L00P8N8o5p8k02P1l6k22L86j86K66m2O6%q7k22J63m2R1j38L1j69KM60
$$ plain form
3915 223 -77 -37 5 124 44 -163 -59 35 43 -12 145 72 -210 -20 171 -90 172 -300 -194 -282 9 -95 -47
3938 -47 194 13 115 -229 4 222 55 115 111 -74 153 96 58 -27 -187 -185 -89 -44 -129 121 217 -129 -35 -59 160
3963 160 241 -128 -66 -179 99 130 -73 -123 39 79 -28 -78 32 65 -36 109 188 141 -68 55 -126 142 -135
3986 -135 -29 -90 -96 -65 -217 -118 121 18 -50 122 10 27 -55 27 -24 61 -119 7 -371 -87 112 36 37 93 76
4011 76 -84 36 8 -162 42 -62 -79 -14 55 -152 40 -130 122 284 -141 77 -134 17 -56 6 -138 -42 -66
4034 -66 146 111 18 177 215 43 -68 122 36 2 25 -346 164 -76 66 217 45 -131 -88 122 -152 19 -230
4057 -230 82 -1 144 68 35 -21 -116 254 109 65 14 4 -22 210 -136 73 85 -176 -117 -102 104 -211 -36 46
4081 46 156 50 -93 79 -106 105 103 -115 -39 35 39 -11 17 -82 -97 -45 158 13 -131 -64 -211 159 123 281 -166
$$ packed form
3915B23l00M0M2J19q0k07J04R4Qn5J57p3k82J90J91k61K62m72J06q8K91j04M8
3938d7K41j81J02l44K33K18j67O0mj85K27n7l8q5j60KR6M5q5K50R6l46R4k4K19
3963A60Q1l69O2j13K78L1k03n0J62M0j07n0J10L3j01J45P9m7k09J23j81K68k77
3986a35J06o1oL1j52R9K39j03o8J72j12J7q2Q2n1Q5j80J26l78K84J99p6JN6j7
4011G6j60J20k8j70K04j04j7O5O9k07J92j70K52J62m25K18k11J51p3O2j44R6k4
4034f6K12l5r3J59L8j72j11J90q6l4K3l71N10k40J42J51j72j76M3K10k74J71k49
4057b30L12q3J45p6l3n6r5L70j45m4n1j0k6K32l46K09J2k61N9J5K06l15J75Q2
4081D6J10j06j43J72j85K11kk18P6P4Mn0K8r9j5N2K03j45j44O7j47L70l6J58m47
$$ plain form
4106 -166 197 -56 -59 -61 6 239 -82 -28 -300 48 -109 67 -20 27 -94 74 -46 -44 137 -74 98 99 -108 101
4130 101 92 -138 -105 154 106 -195 -108 -79 -141 -50 -71 26 232 -41 -58 126 55 -114 -163 193 71 26 13 67 -314
4155 -314 -242 5 -173 126 -14 249 204 -9 28 -50 184 -196 -71 41 -107 -201 43 -216 145 -47 79 230
4177 230 -24 35 80 62 -25 -85 100 -48 -220 -25 -1 37 6 90 -70 -199 146 40 55 62 -191 17 66 63 19
4202 19 66 -275 190 -47 96 63 164 285 -69 16 127 -98 -14 276 180 -183 86 118 497 -68 294 -223
4224 -223 111 8 -45 205 11 -100 -190 -139 -170 62 -5 -46 35 170 47 -223 164 72 101 -211 -197 36 -83
4247 -83 62 -132 14 -308 -206 -85 -121 -224 345 220 -97 78 -146 37 -21 275 40 -142 318 -82 213
4268 213 -31 -14 -142 11 78 76 -241 27 151 -154 31 -47 -48 -221 26 111 -15 -58 -47 159 -8 -276 -33
$$ packed form
4106a66L63k53lkO7K33l21N4k72L48j57J76q7M7j21J68j20KJ81k11J72Jk07K09
4130A01rk30L3K59m8l01Q7K9o2R1k1R7K06k73j7J84p1j69m9L56j22m5j3N4l81
4155c14P2K47j78K99j40K63m5k13L7p8K34l80J25J12j48r4K44k59L61j92J26J51
4177B30k54N9M5j8q7o0J85j48j72J95K4L8l1Q4j60j29L45j06J5Pk53K08M9lm4
4202A9M7l41M65k37J43l3J01J21l54Q5J11k25Q4K90r6l63K69L2L79n65L62n17
4224b23L34j03n3K50j94j11r0N1l1K32o7m1Q1J35j23k70L87r2K9l12J4K33j19
4247h3J45j94J46l22J02J21l6j03N69j25l17J75k24J83n8K96k35j82M60m00K95
4268B13k44J7j28J53O7kl17K68J24l05J85p8jj73K47Q5j26m3J1K06j67k68K43
$$ plain form
4291 -33 128 191 -45 -50 175 190 170 -249 163 -113 184 87 133 150 -379 144 78 39 -7 171 76 -190 -10 5 33
4316 33 -55 27 -270 -273 -138 -111 -192 -13 53 79 117 111 205 4 102 79 220 -28 10 -80 116 124 -60 -153 180 189 122 3
4344 3 -29 19 295 203 -102 54 -212 -22 5 -504 -166 74 261 -229 -62 -240 -162 148 -313 15 165 -165
4366 -165 -27 38 -251 -226 -80 -57 101 120 31 -7 170 182 -62 20 212 215 92 -73 -32 165 133 4 105 -52
4390 -52 -71 10 -129 28 -110 41 -44 -179 -176 12 -215 68 -86 -130 -133 -39 -64 -85 -147 -191 111 -103 127 243 59
4415 59 71 43 -63 -32 -16 189 21 16 -48 -151 140 28 296 -114 234 -32 -163 -7 -25 -5 -347 -169 -7
4438 -7 111 -39 -114 124 221 -280 301 30 37 277 36 74 -96 -122 -62 -152 -61 -176 -154 -65 -189 220 116 -163
4462 -163 -56 247 29 176 104 -118 30 135 -38 58 -70 8 132 -173 -50 -121 -164 -186 11 -84 -3 147 254
$$ packed form
4291c3J61O3k36nK25J5k0m19M12k76K97r7M6J7n29N23o6l9m6J78r5k66J80J5K8
4316C3q8Q2k97lJ35K7q1J79O6K6L8oR4k01R8k3J41k48L8r0J96Qj84r3L33Ro7j19
4344Cl2M8K76r2l05J56k66J90K7n09L38K40J87m90J67j78P8L10m61L28J50l30
4366a65J38O5k89K5J46K3J58J9q9l8J77J2k44Q2J92Lj23j65M1J97l2j29J01j57
4390e2j9Q1j39J57j38J51q5j35LJ88k27K83j54m4lR4k5k1o2m4L02k14K30J16j84
4415E9J2k8j06L1J6K05j68no4j03K91j12K68m10L48k66j31J56j8K0l42J78J62
4438gJ18j50p5K38R7n01N81k71PK40k41L8j70k6O0r0R1j15K2Q9j24M09j04k79
4462a63J07L03k18J47p2k22J48J05j73R6j28P8J24l05J23p1m3k2J97r5Q1J50J07
$$ plain form
4485 254 63 -6 -116 -67 157 -100 38 54 -381 225 121 304 267 236 40 -286 -221 -102 316 10 -44 17 66
4508 66 205 113 190 -57 -93 -142 -145 -180 -51 -126 128 -23 130 -308 -40 118 -319 -130 205 -36 160 -31 26
4531 26 16 -109 -133 -41 -379 25 -67 71 -41 110 45 -60 -73 313 30 -156 46 303 53 41 -65 -21 87
4554 87 201 131 149 113 38 -91 -116 235 162 22 -139 -196 -69 -208 -236 144 -37 -240 114 121 -257 46 -166 236
4578 236 -84 -151 -75 -74 53 -58 27 320 -136 242 -34 -208 105 -149 80 -184 -27 -23 141 -138 -293 -129
4600 -129 -385 275 28 -75 -99 -326 -77 20 -173 16 -332 -40 86 -101 318 -28 -166 192 2 43 -114
4621 -114 8 -40 -6 -33 114 -51 -8 75 238 25 97 85 -131 -118 64 118 116 -228 -308 -112 -222 -105 -241 26
4645 26 5 -4 -161 133 -134 -108 -376 -53 82 154 -173 -137 -47 124 112 77 -79 186 48 226 -81 -41 125 -122
$$ packed form
4485B54j91o9j10M9K24k57J38J6m35O06j04J83l7l1j96l26O5J19M18l06n4O1M9
4508F6J39r2P7k47l6m9ll5J29p5K54j51J53m38K68J58m37J89L35k41J96j91N7
4531B6j0j25k4R2l38M04r2J38j12J51o5j05j3L86k83j86K02K57k50j2j06M4J08
4554H7J14p0J8l6p5j29k5L51p3j40j61n7J27j39k8L80j81k03L54Pl78L03k12M02
4578B36l20o7P6JJ27j11Q5K93m56L78k76j74L13k54K29k64J57MJ64k79j55J64
4600a29k56O60k47j03k4k27K49R7j93J89l48K92J26j87M19l46j38L58j90M1j57
4621a14J22m8L4k7J47j65M3Q3J63k13P2j2k16J3J82N4kl44q0J96j10J17j36K67
4645B6k1rj57K94k67K6k68L23J35P2l27L6R0J71j2l5j56K65j38J78l07M0J66k47
$$ plain form
4669 -122 128 -39 68 -392 59 -121 -165 26 4 -97 93 132 -65 -181 -41 276 52 -57 55 -279 38
4690 38 353 186 -243 -163 129 28 -231 43 -86 -49 121 67 -20 108 -185 185 -38 9 -61 -146 -180 138 114
4713 114 -20 27 -41 -78 -192 131 -167 90 90 -124 -18 125 16 -75 -149 -66 -70 52 -134 -35 -82 72 89 -239
4737 -239 185 -166 107 -169 -47 33 67 -241 36 93 -161 -208 -144 13 144 -76 145 -202 -127 -150 331 -59
4759 -59 16 22 -50 86 -155 -52 41 119 -27 -96 -76 236 -102 145 -77 -69 -51 69 133 -117 -156 -24 -21 117 222
4784 222 58 -64 -9 -174 27 -48 -85 -172 -89 -4 58 -6 120 32 -70 -39 -263 67 170 33 -266 207 -97
4807 -97 -92 106 33 124 -149 -266 145 -187 260 -127 -171 269 -42 50 52 241 -85 84 4 359 -30 -184 10
4830 10 1 262 -59 -14 -298 144 -92 -37 -226 -180 34 -64 118 -84 178 -72 -100 15 -133 147 -94 181 108
$$ packed form
4669a22K50j67J07m60M51j80m4J91k2j01J90L9j97j16J40L17k24j09J12l34L17
4690C8L15j67m29Q0K92j01k59K74j29L7J70n4q7J28k93L70k23M7p0q5l4L18k4
4713A14j34M7o8l7j14L23k98K57%k14J06J43j09r1p4Q3mJ22j86R9m7J54J7l28
4737b39M24l51K73k76J22Q0L4l08K77N7k54m7O4J57J31k20K21l47P5k3M81l90
4759e9P5Op2J36k41J03R3P8j46o9K0L12l38K47k22QJ8J20O4k50l9J32LJ38J05
4784B22j64j22N5j65K01p5l7q7Q3Q5O2o4J26q8j02L1k24L30J03j37k99M73l04
4807i7NJ98p3R1k73j17M11l32M47l87m4M40l11R2KJ89l26J69q0L55l89j54J94
4830A0rK61l21M5k84M42k36N5j89M6K14r8J82k02K62k50k8J15j48K80k41K75p3
$$ plain form
4853 108 -86 -62 163 -11 -69 52 9 23 176 -49 135 -118 -114 7 92 16 182 -89 -94 101 212 -65 82
4876 82 -33 -34 -56 -38 30 -243 -240 -124 -49 -35 -150 8 44 90 9 -29 198 227 -28 -228 87 -24 -11 1 56 -188
4902 -188 -214 12 -85 -185 -41 -233 -84 58 -38 -287 238 -194 19 -4 3 -6 76 313 -124 200 121 254 -13
4925 -13 220 -32 -127 183 -36 -246 -79 82 63 -66 -18 -92 123 -56 -219 -28 157 319 -20 -181 148 -178
4947 -178 -297 -54 139 39 43 -218 -84 148 -87 -91 -118 43 108 279 -147 -100 -20 -151 -29 -20 -47 -2 -136 -111
4971 -111 -319 -45 -187 168 27 161 -137 63 -13 -21 -19 186 -114 120 -62 110 135 182 -67 269 25 -117
4993 -117 230 -128 352 -173 -287 -127 -85 -41 170 -100 70 38 121 -30 114 -251 -6 252 -140 -145 -85 -54 -102
5016 -102 -43 -199 30 -94 16 -252 53 -97 199 -150 274 87 85 88 25 139 16 26 -83 37 197 120 -139
$$ packed form
4853A08j94K4K25j74n8J21m3J4J53k25J84k53MJ21Q5p6J66k71nJ95J11k77J47
4876H2j15jk2J8O8k73LJ16P5J4j15J58L6M6q1l8K27K9k55k00L15j11J3J2N5k44
4902a88k6K26r7j00J44j92J49J42r6k49N25m32K13k3PrQ2K37m37L24p9J33k67
4925a3K33k52r5L10k19k10J67J61j9j29M8p4K15j79j63J91J85J62l39j61L29l26
4947a78j19K43J93j00Mk61J34K32k35mk7J61O5J71m26M7Q0j31J22Rk7M5j34K5
4971a11k08K74j42L55j41J34k98K00p6qKK05l00K34j82J72K5M7k49L36k44j42
4993a17L47l58M80n25j14J60M2M4K11k70J70l2Q3j51J44l65K45K58l92nO0L1m8
5016a02N9j56K29j24J10k68L05j50K96l49M24j87kLo3J14j23J0j09J20J60p7k59
$$ plain form
5039 -139 -39 14 37 -107 -20 -8 103 302 61 290 -7 159 134 -71 -28 -309 399 -133 148 269 177 21
5061 21 -82 116 -53 -148 207 -27 63 21 -93 56 -25 79 -76 414 62 -30 -279 7 -278 -236 96 104 -295
5084 -295 217 33 61 -197 -20 -60 -76 295 25 114 239 150 195 191 -67 -3 195 -27 122 95 -49 -2 45 -134
5108 -134 261 98 130 -197 -89 -25 -95 157 24 -290 -7 -177 -189 -75 -168 -198 122 37 -83 59 -38 71 -146
5131 -146 -123 -179 159 51 42 21 214 252 -20 161 -30 62 -156 -132 216 -164 -87 -47 144 -42 -11 -290 454 -98
5155 -98 -106 280 169 -240 -52 33 84 -17 73 -237 -155 322 153 139 -238 -149 -136 -71 -224 -100 -240 -3 -170 -229
5179 -229 -287 209 -80 -6 -64 -270 -6 306 52 216 -220 -351 -89 -86 12 66 28 76 -147 97 -144 131 107
5202 107 -43 75 72 -64 -97 -109 42 135 -209 84 -84 257 -144 97 163 -230 88 9 -208 -187 140 53 253
$$ packed form
5039a39J00N3K3j44Q7J2J11J99k41K29k97J66k5k05M3k81P08n32K81J21r2j56
5061B1j03J98j69r5L55k34R0m2j14J49q1J04j55M90l52r2k49K86k85M2L32Ql99
5084b95N12j84K8k58J77m0j6L71k70Q9J25q9M5mk58O4J98k22J49k7j44M7M7j79
5108a34L95j63L2l27J08O4p0K52j33l14K83j70j2J14r3l0L20q5j20J42r7J09k17
5131a46K3n6L38j08rk1J93L8k72J81j91R2k18K4L48l80P7M0J91j86L1k79P44n52
5155i8qL86j11m09J88Q5N1j01R0l10Q2M77j69j4l77Q9J3O5j53J24j40K37j67n9
5179b29n8M96k89P4n8k06K64L12k54J64m36j31K62LR8N4l8M8k23K44k41K75k4
5202A07j50J18lj36l3j2J51R3l44K93j68L41m01K41O6l93L18p9k17K1L27q7K00
$$ plain form
5225 253 99 190 26 352 222 13 232 89 -263 -143 -157 218 53 92 29 121 -275 -159 113 273 68 -52
5247 -52 -16 141 -181 -85 -305 483 -30 -34 141 2 240 8 117 84 -60 97 -139 -47 -12 107 -22 -45 -92
5270 -92 -38 219 88 25 -82 71 -9 -138 62 66 -38 -23 166 -44 157 125 4 181 23 -38 75 -26 -91
5293 -91 178 -112 -61 216 -106 2 188 98 -27 -76 163 -10 -6 86 -23 -101 188 59 -53 215 180 -60 172
5316 172 -4 28 154 59 58 30 12 21 171 -267 -68 282 97 147 -27 119 12 -113 -125 -159 -187 -68 151 -119
5340 -119 141 30 258 -168 -120 -293 32 -279 -21 302 -130 -44 -292 167 8 -50 84 -220 -32 -58 -10 203
5362 203 -92 181 -117 -39 -27 -17 -175 -215 -71 103 77 -155 -64 29 -28 220 -211 -58 55 65 -31 -202 -144 71
5386 71 328 15 -159 74 62 10 -111 -270 -52 60 -181 5 -90 0 267 -111 -33 -21 133 -32 -100 145 175
$$ packed form
5225B53j54R1j64L26j30k09K19j43l52J20j4L75j65L9o3R2l96J16K72J60k05j20
5247e2L6J57l22R6k20P88n13mJ75j39K38k32J09l3j44J57k36R2L5J19j29k3m7
5270i2N4K57j31o3j07J53q0j29K00Mj04J5J89k10K01l2j21J77j58o1J13j01o5
5293i1K69k90N1K77l22J08J86r0j25m9K39j73MR2j09p8K89j29j12K68l5k40K32
5316A72j76L2J26r5jk8j8RJ50m38J99L50j85N0j74J46j07j25j2l4k8J19K19k70
5340a19K60j11K28m26M8j73L25l11K58L23m32Q6k48M59j59n8J34l04J88k6M8K13
5362B03k95K73k98P8J2J0j58m0J44J74k6k32R1R3n7K48m31J53J13J0r6j71N8K15
5386G1K57l13j74K33j2n2j21j59K18J12k41J86r5R0K67l78P8J2J54j65o8K45L0
$$ plain form
5409 175 137 105 -344 -59 60 -175 63 203 52 -168 239 -3 -242 181 323 176 -151 42 -106 26 -118
5430 -118 178 279 -37 -223 -138 249 -86 -132 35 -198 -31 -66 108 -118 -51 -131 -103 -186 -180 3 81 -70 -9 24
5454 24 -176 28 -262 35 111 -174 -174 90 -146 19 -51 108 135 -56 -108 -154 -84 -206 -236 247 229 -62 -183 229
5478 229 -69 88 112 -27 -126 129 62 8 5 162 -48 114 -7 250 127 -112 279 25 -155 0 72 -55
5500 -55 8 147 -88 103 -149 127 -24 -131 -136 16 -19 -244 -239 328 2 -100 -71 6 90 -204 -132 -78 413 -100
5524 -100 -2 -130 -104 1 136 -335 -117 103 -128 -66 72 -225 -169 31 74 -94 -28 163 -42 177 101 40 -175
5547 -175 -15 243 -317 -243 -29 124 162 -130 -11 15 47 27 -127 -160 -168 101 178 345 -45 -156 -29 83 -220
5570 -220 -136 -173 -55 160 -161 -62 102 -161 -39 39 123 -194 30 -143 -79 240 -57 68 201 82 141 -30
$$ packed form
5409A75l8l2m49K85J19k35K38J40j51k20M07k42k39M23J42j47l27J93j48J32j44
5430a18K96J01l16j86Q5L87l35m6J67k33J67l5J74k26O7q0K8q3OJ83P8j51O1L3
5454B4k00K04k90K97P6k85%K64k36J65p0J59K7j91n2m6P0j22l0M83j8k91j21M12
5478B29k98J57K4j39r9K55o7n4lJ57k10J62j21K57j23k39L91k54j80J55P2j27
5500e5O3J39k35J91k52K76j51j07nJ52l5k25NN67l26j02K9P7Q4k94P2N4M91n13
5524a00R8j28K6J05J35m71K18K20k31O2J38k97N6K00M3j68O6J91k05K19p6o1k15
5547a75J60K58n60P4K14J53L8k92J19K6L2k0j54l3qK69P7J67l90j11J27J12l03
5570b20Q4l7J18K15l21R9J64k63J22P8Q4l17K24j73O4L19k97J25J33j19N9j71
$$ plain form
5592 -30 56 -158 292 -111 181 -1 -161 75 275 -138 -189 293 29 -202 1 -115 13 -2 -133 -260 133
5613 133 14 28 -52 327 58 -30 -341 -178 -83 -244 -104 -22 -39 -35 56 -291 241 97 11 108 64 50 -94 59
5637 59 -101 -192 -71 8 -15 159 48 85 50 243 99 77 -211 -134 -58 -105 -112 142 84 -33 110 162 403 -61 11
5662 11 103 -28 -163 -117 -53 -106 -110 89 201 -98 55 101 -136 136 271 173 -56 -12 -192 -28 -56 -63 2 20 -92
5687 -92 70 -30 41 15 24 22 37 11 -85 76 -121 17 74 -55 13 -357 225 -131 170 7 9 -99 18 254 -67
5712 -67 -21 68 17 -148 55 -37 -142 8 -37 -47 53 219 187 -46 121 98 -182 -52 66 -38 -95 -268 -143
5735 -143 -252 -20 58 -6 -135 63 -204 -39 124 -11 26 104 -142 -235 62 -13 -75 28 -2 145 75 78 -213 -243
5759 -243 -15 -28 149 79 89 -65 -93 -66 -161 12 -239 -111 152 -16 -43 77 -190 -268 106 94 -54 -8 -217
$$ packed form
5592c0Q6k14M50m03K92j82j60K36K00m13n1M82k64k31K03j16J28j5j31j27L93
5613A33j19J4q0L79k69q8l11J63R5j61J40Q2j7MR1l47N32j44q6R7m4j4j44J53
5637E9j60r1J21P9k3J74j11L7l5J93j44k2k88P7P6m7pK54n8j17J43N2K41m64P2
5662A1R2j31j35M6O4n3mJ99J12k99J53M6k37K72J35r8k29M4j80J64k8pO5J8j12
5687i2J62j00P1k6RkJ5k6r6J61j97J38N7j29O8l70N82l56L01j63Kj08J17K36l21
5712f7M6Q9n1j65K03r2j05J50m5j0J00J66l2k33J67k3k80J30J18j04n7j73J25
5735a43j09K32P8o4j29J98k67J65J63j35L7P8k46r3K97p5o2J03l0J47p0Lk91l0
5759b43K28j3J77p0J0j54k8K7r5J73k51J28K63j68k7J20k67p8L74j2j48M6k09
$$ plain form
5782 -217 -85 114 8 187 135 84 18 -94 6 -106 -78 106 -43 24 -258 -101 5 172 106 162 -133 201
5804 201 -80 -57 322 -304 82 -72 -52 -34 -75 99 -146 1 -196 -11 -32 -143 -59 45 -112 -343 39 -121
5826 -121 -98 67 -149 -68 -131 -129 -287 -90 -91 -17 -103 206 10 127 -19 64 79 16 83 89 113 230 58 -74 136
5851 136 122 -246 -149 87 11 -183 -130 333 122 204 136 -146 43 -124 22 93 10 -1 -181 -6 154 112 375
5874 375 -33 -49 210 108 -35 -103 -69 109 -168 -390 71 163 28 -112 128 -55 -167 211 79 54 -155 2
5896 2 -58 115 -193 -95 198 -42 -36 -135 -308 83 0 75 -136 23 163 -101 -15 256 -91 90 53 -77 -206 -64
5920 -64 -46 -232 -312 60 -14 -35 -219 -85 -160 -182 138 -82 -325 -144 -31 -71 24 -65 18 141 -18 -62 -35 0 -255
5945 -255 34 -130 -90 45 52 88 -57 -60 214 13 -31 103 -83 172 44 25 -72 -44 112 -42 -113 76 -91 143
$$ packed form
5782b17J32J99j06J79n2n1o6j12J00j12K8J84j49O7k82J57J06J67o6N6k95L34
5804B01k81K3L79o26L86j54K0J8m1J74k45J47j97J85k1j11Q4J04j57k31L82j60
5826a21K3J65k16Q1o3Kj58J97jP4q6L09j96J17j46Q3J5o3O7OK4J17j72j32K10
5851A36j4l68R7K36p6j94N3M63k11Q2o8k82J89j67J46P1q3j1j80J75J60m2K63
5874C75m08j6K59j02j43o8L4J78k77k22M61R2j35j40K40j83j12L78j32k5k09J57
5896Bo0J73l08R8K93k40Or9j73L91q3P5k11J59J40k64Q6K71l47J81l7j30j29J42
5920f4J8j86q0L72p4k1j84J34p5k2L20k20k43J81J13m0R5q9Q3J23j59m4K7L5k55
5945b55K89j64M0J35PL6j45lK74k01m4J34j86K55j28j9r7K8J56j54p1J89j67K34
$$ plain form
5969 143 -215 -207 -94 62 -178 -142 220 -166 80 134 40 -178 -19 -67 -193 -109 -57 23 175 -122 -10 286 312
5992 312 -213 127 -21 -133 -259 -94 -222 112 -67 188 123 -101 100 54 -21 -108 90 14 12 91 174 -361 -76
6015 -76 73 36 160 157 -83 -262 29 -81 -372 -137 69 174 -232 5 172 6 80 -85 125 220 -67 159
6037 159 37 -175 122 12 168 -48 -218 52 -25 -26 -265 147 331 25 151 -249 -88 -70 -104 95 13 -195
6059 -195 17 178 -14 -40 235 258 -4 -55 -43 107 -121 -106 171 -199 -3 182 -30 -12 9 64 -54 95 66
6082 66 74 -145 15 -2 64 116 83 39 29 115 107 -272 54 13 -173 206 -228 102 -65 -108 14 -24 -289 -261 -167 96
6108 96 66 229 5 65 -140 168 127 -108 119 -95 -101 -87 235 249 -48 166 38 18 85 52 -306 -68 17 46
6132 46 -331 -75 9 147 201 -39 -122 -93 130 -134 166 -85 -203 231 -82 -193 -17 112 115 81 -56 63 -38
$$ packed form
5969A43l58QJ13J56k40L6L62l86K46N4r4k18J59m8j26Q4N2Q0J52k97J12K96K6
5992C12n25L40j48j12j26J65j28L34j79K55o5k24K01m6p5q7J98p6kP9Q3n35K85
6015g6J49l7J24lk40j79K91j10k91K35K06J05m06K37J67j66P4j65K10R5k87K26
6037A59j22k12K97j10J56k16j70K70p7jk39M12J84l06J26m00J61J8l4J99q2k08
6059a95K12J61j92k6K75K3k62n1J2J50k28J5K77l70J96J85k12J8K1N5j18J49k9
6082F6Qk19J60j7O6N2l3m4j0Q6ql79L26m1j86L79m34L30j67m3J22l8k65K8R4K63
6108I6l0J63k24O0k05L08m1k35K27k14oJ4L22J4k97K14j28k0O7l3l58K38Q5K9
6132D6l77K56Q4J38N4k40q3K9K23k64L00k51j18M34l13j11J76J29Ll4j37J19j01
$$ plain form
6155 -38 42 -29 3 191 53 -56 -108 193 196 297 -9 12 -105 63 -195 -92 34 39 13 -185 63 -32 7 185
6179 185 -196 -118 131 -178 267 89 78 -138 153 60 -284 54 -66 97 -155 11 35 -8 -81 194 144 14
6201 14 190 -73 -56 -183 116 12 10 1 144 81 141 -38 -166 -180 -185 -46 234 305 41 -21 149 119 -87 -17 -242
6226 -242 -63 -88 -4 -45 -7 477 146 -39 6 223 -64 -120 -192 -112 85 -10 -93 205 129 -135 78 -16 -243 -220
6250 -220 -53 -87 149 94 41 324 162 130 112 -17 -223 -291 129 -255 87 -133 221 -139 -5 -54 -74 220 -188
6273 -188 -51 -91 -55 -90 232 39 -106 -26 358 -54 -113 -43 144 -28 -56 20 2 -10 -56 -72 -115 15 72 141 -127
6298 -127 -94 58 232 170 92 -76 144 55 -103 -63 85 116 58 -196 -156 171 -46 -186 -268 -185 -91 38 -68 90
6322 90 80 -55 25 137 22 -107 -104 196 -208 13 20 244 14 46 41 191 70 -69 -67 92 176 22 -50 -123 184
$$ packed form
6155c8Q0p1L2J88j38j09n2L01LJ01l06K1j17J68k58J03J26Nk6j98K48r5L9J78
6179A85l81P8K49l09M45j78j1k16K91r3l44L38j20J63k52J66K4m3p3K75n0j30
6201A4J76k63J7j27K99j04krJ43o3O0j79j28j4nJ39K80P1k64o2J70l0k06P0k25
6226b42J79k5Q4m1L8M84l31j85M5K17k87n6p2Q0J97r5q3K98p6k64K13r4k27K3
6250b20J67l4K36n5n3K83j62l2j8j29k06o8M20l84L42k20L54l60J34m9k0K94m08
6273a88J37m0L6l5L22j93j45Q0L84m12n9P0J87j72k8P6j8j2m6j6m3J30N7O9k68
6298a27L3J52J74o2p8j68K20q9j58M0J48L1n8k54M0L27k17j40q2Q3R4J29j06J58
6322I0j0j35Q0J12j15j29LL00m04K21PK24k30L2nJ50j21j39KJ59Q4j54p2p3L07
$$ plain form
6347 184 59 -130 -282 -18 107 -145 -158 -237 -135 144 198 -77 171 -135 -72 44 3 112 130 46 -175 63
6369 63 -5 -18 165 133 74 352 40 40 166 115 -62 -16 -182 -96 -22 14 -16 -349 -119 56 244 -198 -103 -62 304
6394 304 -19 -1 -59 63 121 -37 -56 19 -29 -257 -166 10 154 92 39 157 62 -93 -174 -93 -24 -221 268 -29
6418 -29 198 -45 -98 -26 -177 -228 85 57 15 196 138 -154 115 -62 -54 80 -142 71 -132 89 42 171 -267
6441 -267 -115 -156 156 12 -171 -115 -110 -25 226 318 -51 179 -58 48 -97 47 -211 102 202 -5 -81 -109 67
6464 67 -10 -19 120 -125 28 -124 -40 190 -72 102 -34 184 -44 -209 265 101 -89 -44 -68 -221 -11 227
6486 227 -38 -49 -116 56 -224 84 10 -322 83 219 362 165 107 66 63 153 154 119 230 101 16 -125 -328 19
6510 19 81 51 -46 100 -53 150 -149 35 -134 311 185 -181 -82 -36 30 -78 -55 -31 51 136 110 99 98 -19 3
$$ packed form
6347A84j25j89j52K64J25k52j3p9J02K79N4k75K48l06O3J16m1J09J8q4k21K38
6369F3o8j3J83l2n9K78l12%J26n1j77M6j66Q6P4L6l0l33K30J75J88m42R5M1L66
6394C04l23J8n8J22N8j58j9P5m8k28R1J76J44o2n3J18r5j55q1Q1O9j97M89k97
6418b9K27k43n3P2j51n1L13k8m2J81n8k92K69j77QJ34k22K13k03K21m7J29m38
6441b67J52m1L12j44j83N6NQ5K51R2l69K30k37J06j45J44k58L13J00k07p6k8J76
6464F7p7rJ39k45J53j52Q4K30k62J74j36K18k28j65M74j64j90M5k4j53K10K38
6486B27k65j1o7J72k80L08p4l32M05J36J43j97n8m1lR0Jl5J11j29q5j41k03L47
6510A9O2l0r7J46j53K03k99J84j69M45j26l66R9M6O6j08K3K4Q2Q5k6j1jj17K2
$$ plain form
6535 3 128 131 60 -61 -165 -55 -180 -65 199 -87 121 -259 -144 38 69 143 178 -261 -54 14 338 69 -81
6558 -81 83 -132 -242 129 -173 123 -7 -32 25 36 -165 -150 113 408 272 -104 260 134 -159 -95 125 -236
6580 -236 217 -49 105 289 22 -135 182 30 -20 -135 -139 226 164 -29 46 -41 59 98 88 -74 -174 -22 172
6603 172 -28 -244 -218 -351 -159 -134 14 -251 85 55 -31 -59 71 11 31 -62 26 -221 -43 -54 90 -80 -19 7
6627 7 46 -39 -3 65 118 -196 -54 232 -49 18 -64 -28 2 -94 272 98 -50 133 5 -11 -83 110 -155 -42 -153
6652 -153 175 73 43 202 72 109 108 304 97 58 -35 138 -2 166 -90 -53 86 -94 -230 -2 31 86 -65
6675 -65 176 -50 -120 189 -179 -150 163 153 41 248 -150 -81 -81 157 184 -196 -143 128 -90 174 -46 -100 -4 -8
6699 -8 -429 120 68 5 21 233 -52 -93 -138 -119 354 110 -87 -235 -23 35 92 169 162 -23 60 142 49 68 237 -167
$$ packed form
6535CJ25Lp1j21j04J10j25J15K64k86K08l80J15J82L1P4L5m39K07O8L24k69j50
6558h1J64k15j10L71l02K96j30k5N7J1k01J5K63K95j36l76L64j26k93O4K20l61
6580b36M53k66J54J84k67j57L17j52n0j15mL65o2j93P5q7J00L9j0j62j00J52J94
6603A72k00k16K6j33J92K5J48k65L36l0q6k8J30o0K0r3Q8k47J78j1J44j70O1K6
6627GL9q5L6O8N3l14J42K86k81O7q2L6L0r6L66j74j48J83j28j6p2J93k65J13j11
6652a53L28j02l0J59j30L7jJ96k07l9r3J73j40J68k56L7J39j80j36K28L3N5j51
6675f5K41k26p0L09l68K9L13j0j12K07l98O9%K38K7l80N3K71k18K64k20n4R6m
6699hm21N49n2o3J6K12k85m1m5J9M73k44j97j48K12N8N7P7pj85Q3Q2r3J9J69m04
$$ plain form
6725 -167 -98 -191 -232 99 -173 180 88 -130 171 -13 -73 -191 47 -101 100 29 48 15 -154 -113 33 242 160
6748 160 155 54 72 -14 244 -199 -258 -240 76 290 -244 366 -64 -43 173 -212 -10 90 -53 326 388 70 201
6771 201 -258 12 -163 87 144 -18 165 -19 4 133 131 -181 -17 34 47 -64 -107 79 399 80 -276 27
6793 27 -127 89 188 -135 94 64 -65 95 90 -257 64 -271 6 -121 -165 49 -147 11 -101 -172 -186 -299 112
6816 112 -11 0 -70 58 11 -224 149 61 -140 274 -96 -87 -37 204 -157 -222 -234 157 86 27 -250 60 100 -232
6840 -232 100 -14 -288 134 240 44 -132 -167 -113 -98 150 -158 -199 -275 297 -43 69 116 32 82 202 89 -221
6863 -221 160 143 -24 64 0 47 -56 7 -210 -110 -161 29 -31 -189 137 -52 -83 198 -288 -9 -231 97 -3
6886 -3 232 -10 -96 -104 -36 -207 103 111 -141 -63 -59 -167 78 -72 290 127 23 -207 100 109 -234 244 -190 -99 132
$$ packed form
6725a67O9r3m1L31k72L53r2k18L01j84o0j18K38j48K01p1J9l3j69M1J46K09q2
6748A60nj01J8q6K58m43n9J8L16K14n34O10m30K1K16l85K02J00j43L79O2l18J31
6771B01m59K70j75K50N7j62J83j84K3J29kl12J64N1J3j11m3J86L20l19l56L03
6793B7j54K16R9l23K29l0j29J60nl47L21l35K77j27m4K14j96J58j12p1j4j13M11
6816A12j23J1p0J28m7k35L73q8k01M14l70RN0K41l61o5j2L91p1n9k77L10M0l32
6840b32L32j14k74M22J06j96j76l5N4J5K48l08m1p6N72l40J12M7q4N0J20j13l10
6863b21L81j7j67Q8o4M7j03O3k17J00n1J90o0j58L26j89l1K81m86K79k22L28j00
6886cK35k42q6qO8j71L10Qk52P8Mj08K45j50L62j63j04k30L07Rl43M78m34R1K31
$$ plain form
6911 132 40 -44 -15 264 13 -46 337 -221 -37 -206 190 50 -47 163 -145 231 -24 -252 8 -111 68 54
6933 54 131 39 -124 -71 160 82 57 124 16 11 -54 14 8 -104 -98 43 165 17 -161 -112 139 137 -91 103 -31 212
6959 212 236 78 186 -235 -129 75 -16 -220 -252 -278 -113 79 -47 -34 -157 138 -6 -111 -91 120 22 107 108
6982 108 -93 -135 18 -76 280 -141 298 -73 104 -39 -105 249 77 305 -255 2 322 -14 188 166 -80
7003 -80 -52 -58 -265 -203 130 20 -44 -254 -150 167 30 13 156 29 15 -49 341 -42 206 132 75 189 -257 140
7027 140 76 -195 -183 12 -177 -7 77 -117 29 138 -94 152 6 -34 -36 -163 10 53 186 -61 -70 200 -142
7050 -142 41 123 88 -130 105 104 126 -52 -156 37 163 46 16 329 136 363 -73 70 -30 -7 -83 297 126
7073 126 -27 32 108 59 -38 -179 18 -10 -94 163 -162 23 188 -26 -139 -44 77 -24 91 -40 164 -183
$$ packed form
6911A32r2q4K9K79k51n9L83n58J84j69L96j40r7K10l08L76k55k28K60j19J79j4
6933E4P7r2j63N3K31p8k5O7j08no5O8oj12OJ41J22j48j78M9K51kk28J94j34K43
6959B12K4j58J08m21J06K04r1k04l2k6J65J92j26J3j23K95j44j05K0K11r8Q5J
6982A08k01m2J53r4L56m21M39l71J77j43o6L54j72K28n60K57L20l36K02k2k46
7003h0K8ok07O2L33j10o4k10J04L17j37j7J43j27j4o4L90l83K48p4n7J14m46L97
7027A40o4k71J2J95j89J70Q4j94J46J09k32K46j46m0kj27J73M3J33k47rK70l42
7050a42J83Q2l5k18K35jK2j78j04J93J26j17l0L13j93K27m36J43j00K3p6L80j71
7073A26j53N9P6m9r7j41J97k8q4K57l25J85J65k14j13R5J21j01J15j31K04l47
$$ plain form
7095 -183 104 64 -254 270 110 -58 -232 23 -59 143 67 -172 -311 158 184 -87 -120 -41 -101 -53 -14 -71 -128 70
7119 70 -76 -72 -1 -186 39 -48 164 -68 -11 45 34 -232 70 -62 66 -7 -289 -100 89 -222 103 101 -179 129
7143 129 149 16 -236 -45 262 -228 156 210 -232 -48 -323 292 16 -182 98 197 -334 -151 -195 -140 111 -203
7165 -203 80 5 -86 242 -98 -162 -58 -59 214 -113 -68 9 60 26 -50 130 -220 -82 -106 4 54 -199 -236 60
7189 60 -3 3 -56 -94 -83 -85 86 32 -243 96 -89 71 -56 -191 -6 -70 -176 -119 -28 -130 -209 140 41 37 133 165
7215 165 118 25 124 -59 30 -154 92 -88 -367 -40 -254 21 195 215 -39 -122 -21 -136 -106 -84 -270 167 31
7238 31 -53 -19 -55 109 54 145 119 -127 -58 101 -246 80 205 57 301 -98 -198 -231 -50 132 -66 82 -173
7261 -173 -231 -52 363 -53 45 -265 82 -121 -115 -160 -250 -17 -57 -53 198 15 -93 64 253 197 75 -44 -248
$$ packed form
7095a83K87m0l18N24j60j68j74K55q2K02p6k39j39M69K6k71l3P9o0M8L9n7n7J98
7119G0j46MP1j85K25q7K12k32N7N6j1k66L02j32J28p3k82J89J89l11L25kk80L08
7143A29K0j33k52J91L07m90L84N4m42J84k75O15k76j98K80R9n31J83m4N5K51l14
7165b03K83p5r1L28l40o4J04jK73l27M5P7N1l4p6J80l50J38k4J10N0k53l7K96
7189F0o3On9l8J1kJ71n4k75L39j85J60j27j35J85o4j06N7R1j02p9L49r9mR6L2
7215A65m7r3R9j83Q9j84K46j80k79L27k14K75J74K0k54q3J01j15L0K2j86M37j36
7238C1q4L4l6J64n5R1k6k46O9J59l47L26J25j48K44l99j00l3J81J82j98J48k55
7261a73n8J79M15m16R8l10L47k03Om5r0K33m0MK51j83j08J57J89n6j22j19k04
$$ plain form
7284 -248 8 -289 44 -63 234 -159 -111 -71 -20 -29 82 -40 -104 97 99 -185 -122 -81 123 -70 -489 -133 201
7307 201 25 -186 -231 -32 98 -246 -12 142 -157 -23 -85 -14 -87 185 -165 -45 60 165 144 -174 39 173
7329 173 -109 3 -107 46 40 -52 -68 196 -70 51 -37 26 -24 -151 90 0 82 -308 284 101 -3 38 -162
7352 -162 -160 6 141 -11 147 -98 -148 -79 -26 -100 139 -61 -137 -24 -261 -70 74 -346 58 98 7 207 -131
7375 -131 68 228 179 113 -43 36 84 -158 -126 46 87 -9 105 -171 -122 -100 -96 111 135 -65 -167 -24 -75 83
7399 83 -175 -107 -113 -152 20 -261 94 28 77 296 146 -41 -46 129 88 -154 21 -85 26 70 165 81 28 52 58 8
7425 8 -205 90 116 -205 -206 27 -219 -10 260 126 172 -189 73 -22 -207 4 108 106 139 -208 113 -200 324
7448 324 -133 141 -127 53 61 -53 -22 -230 81 -5 -47 107 181 15 -83 -201 164 -105 69 -255 144 -16
$$ packed form
7284b48K56k97L33j07K97l93M8M0N1rJ11j22o4K01Kk84O3M1K04j93m19L56L34
7307B01j76k11m5J99J30l44K34J54k99J34o2P1p3K72l50J20J05J05k1l18K13J34
7329A73k82J12j10J53or2j6K64k66J21q8O3n0j27K41r0Q2l90N92j83j04M1k00
7352a62KJ66J35j52J58k45n0O9N3p4K39k00p6J13k37J91J44m20M04M0r1K00l38
7375a31J99J60m9o6j56P9M8k42L2J72M1r6J14k76M9K2MK07K4k00j02J43n1J58
7399H3k58O8ol9J72k81L55o6M9K19j50j87nJ75m1k42J75j06J11M4R5q4n3K4On0
7425Hk13K95K6l21jK33k46K09K70j34M6l61K62r5j85K11J04kL3l47L21l13N24
7448C24m57K74k68J80Qj14L1k08L11q6m2J54P4j66r8j18L65k69J74l24L99j60
$$ plain form
7470 -16 39 29 -47 18 -523 -53 32 -40 59 30 -55 -101 -79 268 55 146 -2 149 -17 -64 7 293 174 -123 -16
7495 -16 99 54 -198 79 4 15 166 -177 -111 -190 300 75 -133 101 -319 -282 -11 -77 143 -187 167 -174 156
7518 156 144 95 -31 -174 -48 128 127 18 53 121 273 -97 -275 156 -88 171 106 35 -91 -4 -38 88 5 -69
7542 -69 123 31 96 105 123 10 -195 -49 -53 -92 -13 45 -13 43 -158 16 -55 -48 102 77 -36 -41 -29 128 -104 -136 175
7569 175 -47 133 -234 -200 15 -71 -20 132 262 105 20 -10 72 188 -62 -82 104 -254 -91 -55 -19 -29 -118 -123
7593 -123 80 5 -4 -294 -289 -154 -30 99 270 -140 80 122 -166 -188 -138 124 63 151 59 -315 -157 -77 -110 244
7617 244 117 176 77 -151 -11 -177 -30 -62 -28 211 75 165 -57 295 -147 128 -148 -187 208 27 -38 123
7639 123 -14 -16 183 -1 -97 178 131 150 -13 -31 214 65 88 112 61 -20 92 63 -232 3 -11 128 -91 119
$$ packed form
7470a6N5j0p6O5n41M70Q5p2R9k9q5m6K2L47k13R1j48J51j66m7P1K86j19k97J07
7495a6J15m5k52K77p5J1J51l43O6p9M90k25k08K34m20L7K71o6K20l30L54l41L30
7518A56j2m9j26j43J26J76jj09L5O8J52l70j78M31k44K59o5p1j26Q7l4J26q3p4
7542f9J92r2O5RJ8j13k05J46ml9P9N8n8N6k01J74p1PJ50k5j13nJ2J57k32l2L11
7569A75k22J80l67L4K15q6N1J52J30j57q5l0Q2J16k50k0J86l58J63L6L6j0q9n
7593a23K03p5rk90NJ35J24J29J71m10K20M2k88k2N0K62o1Q8r2l74J58Q0l3L54
7617B44j27N9r9k28J40j66J47l2L4K39j36R0k22L52m42K75k76l9L95j81o5J61
7639A23j37kJ99j84r6K75m7J9j63j8K45j49K3K4n1q1J12k9k95K35j4J39k19K10
$$ plain form
7663 119 64 -186 -66 -294 -131 -53 -167 -98 -271 88 -202 -18 -118 48 -25 24 -232 -50 14 -51 110 -133
7685 -133 115 -62 -4 19 137 -297 372 -22 91 -43 112 -274 -4 -185 -16 -445 112 238 101 -129 -93
7706 -93 174 -245 120 383 18 -75 -159 14 451 131 153 -145 -77 -135 115 101 -23 -161 4 -164 -130 -121 21
7729 21 162 -135 140 -35 19 19 -38 128 -303 -365 156 -12 -31 -119 -81 47 -119 -138 -191 -44 238 -74 -50 42
7753 42 76 85 -425 -14 -303 75 -248 -61 -33 119 -40 -163 49 11 -215 48 42 117 5 -217 104 235 -15
7776 -15 85 -96 203 28 100 -16 282 358 -142 -33 -2 -275 140 -200 -115 -45 -41 196 -47 117 -13 127 163
7799 163 149 -135 131 -164 10 -15 18 -337 30 -160 169 -189 -77 -99 74 -145 -74 81 58 290 -195 20
7821 20 19 27 105 196 -216 -187 193 150 -110 288 134 222 93 -71 -2 -165 -30 -2 94 110 63 -191 225 -16 -15 49
$$ packed form
7663A19n5k50J20k28J63P8j14O9j73L59k90J84j00J66p3M9k56J82O4o5J61k43
7685a33K48j77N8K3J18m34O69l94J13j34J55l86K70j81J69m29N57J26j37k30L6
7706i3K67m19L65K63l65r3q4J73M37l20K2k98O8n8K50j4j24j38J65j68L4RJ42
7729B1J41k97K75j75N4%n7J66m31o2N21j68j9q8L8J28j66j9n3J47K82l12K4R2
7753D2L4Rn10M11k89L78l23J87K8J52j59j23K12l8k26K63oP5j12k22L21J31k50
7776a5J00j81K99j75P2j16K98P6n00J09L1k73M15l40Q5P0MK37k43J64j30J40L6
7799A63j4k84K66k95J74k5L3l55L67j90L29l58J12k2J73k19P1J55k3K32m85K15
7821B0jQP8R1m12K9L80m3k60L98j54Q8j29j64O9j63J35K8R6J6m7k54M16k41JO4
$$ plain form
7847 49 -137 263 57 87 106 -219 91 -35 -81 97 -91 -125 -41 39 -140 51 -21 -156 62 -112 67 -72 303
7870 303 -83 -170 112 211 14 -283 145 59 -286 -383 237 4 11 173 -349 24 65 197 -140 80 -30 -253
7892 -253 -216 48 7 -55 -75 -32 -58 134 225 -106 180 154 -163 19 65 286 47 -83 -77 23 78 33 231 13
7916 13 115 175 18 286 53 167 247 138 17 -115 -480 -204 128 279 83 49 -172 82 57 -118 147 104
7938 104 -246 52 -69 25 -78 -277 91 -30 16 384 -65 -213 -36 -203 179 156 161 217 90 197 75 29
7960 29 80 -179 -7 -153 -13 54 203 -128 -201 1 35 -59 -100 -16 177 -39 124 133 -246 129 -260 -103 139
7983 139 -240 86 -23 -202 -164 -134 -79 -129 -234 -126 -6 19 143 -81 33 -11 19 -34 -241 -61 51 -55 -181
8006 -181 -49 63 -387 374 -85 -129 -200 104 313 116 -123 -202 19 125 128 -102 61 -266 131 191 64 61 117
$$ packed form
7847D9j86M00k06L0J9l25L10j26m6J78j88l4Q4Q0j79J91p2j35K18j74J79j39L75
7870C03l86q7K82R9j97k97M28q6l45r7O20k33PJ62n22L73M1J32l37K20j10k23
7892b53L7K64m1o2k0M3k6J92R1l31K86k6l17J82M6K21k39j30OJ00N5m5J98k18
7916A3J02O0j57K68k33J14Q0j09j21j32l65K76L32J51j96l4k21K54k5j75K65m3
7938A04l50K98j21R4j03j99L68j21M6L68m49j48J77j67L82k3NN6j27J07j22m6
7960B9N1k59J72j46J40O7J49l31p3K02L4r4m1Q4J93k16J63Rl79L75l89J57K42
7983A39l79L26j09j79L8L0N5n0j05J08J20K5J24k24J14m4L0n3k07J80J12j06j26
8006a81J32J12m50P61m59m4p1L04K09j97k39p9K21J06Lk30J63l27L97O0j27lN6
$$ plain form
8029 117 -292 -147 41 113 131 -18 85 218 -161 -146 -100 -119 308 -60 124 -130 -286 -193 -53 104 -109 131
8051 131 -33 56 184 34 84 -245 -234 93 78 55 -206 378 109 79 27 2 -100 10 -147 -138 -39 66 -47 -60
8075 -60 174 248 -176 -152 203 -219 256 157 -165 155 445 -8 196 -1 108 -148 -28 -323 -169 -249 70 257
8097 257 -76 76 115 -2 -17 226 -26 133 215 -387 -177 -20 85 -86 46 -247 -310 131 13 126 -87
8118 -87 -43 42 165 99 118 151 -105 -58 26 2 40 -76 24 -11 -222 281 46 77 -166 64 -163 201 -89 -166
8142 -166 56 140 -5 -48 -203 -37 -160 261 212 -26 14 83 21 22 26 111 -228 -129 -91 -106 150 -58 -220 85 169
8167 169 -41 76 -127 -340 22 -94 167 36 91 -236 -8 211 6 60 -236 -298 -183 100 204 -23 245
8188 245 -8 -364 168
$$ packed form
8029A17m09J45J88P2J8j49J03J33l79J5M6j9M27l68J84k54j56R3J40J57k13K40
8051A31j64Q9J28j50N0l29J1L27j5k3k61N84k69l0n2k5j02J10j57RR9J05j13j3
8075f0K34P4m24K4L55m22M75r9l22L20K90m53K04j97J09k56J20k95J54q0L19J87
8097B57l33J52L9j17j5K43k52J59Q2o02K10J57J05j71J32k93o3M41j18J13k13
8118h7M4Q5J23o6J9L3k56M7Q4k4L8j16J00l5k11N03k35L1k43K30k27L64k90p7
8142a66K22Q4j45m3j55J66j23M21m9k38M0O9o2JMQ5l39R9L8j5K56k08j62L05Q4
8167A69k10J17k03k13L62j16K61j31N5l27K28K19k05N4k96o2J15K83J04k27K68
8188B45k53l56N32
8191A68
$$ Imaginary data points
##PAGE= N=2
##DATA TABLE= (X++(I..I)), XYDATA
$$ plain form
0 0 0 0 0 0 0 0 0 0 0 0 0 0 8 -8 8 -8 16 -16 16 -24 25 -32 40 -48 56 -64 72 -85 97 -112 128 -145 165 -188
34 -188 212 -238 268 -300 334 -373 416 -462 513 -569 626 -692 766 -843 929 -1024 1128 -1242
52 -1242 1371 -1512 1672 -1850 2054 -2288 2559 -2882 3265 -3741 4339 -5119 6187 -7747 10248
67 10248 -14911 26663 -125844 -156956 52095 19983 -24938 -75870 -61577 4509 97417 74803
79 74803 9027 5771 65904 62865 36341 12850 -14861 -19569 21732 12232 -37461 -55109 -28993
92 -28993 -14180 -23536 -32354 -19832 -11571 4739 23570 14127 4304 33129 48111 22690 -738
105 -738 9232 23753 11609 -13453 -32181 -46825 -27525 8834 -5024 -40222 -23743 11974 19371
118 19371 10340 11139 21663 27174 24208 9201 -12494 -6789 13527 -1188 -25306 -19687 -8655
$$ packed form
0@%%%%%%%%%%%%Qj6J6j6K4l2L2m0M9n7P2q8J04j20J36j57J82k09K40k73L10l53
34a88M00m50N06n68O34p07P89q78R75j082J195j318J458j609J772j953K152k370
52a242K613k883L184l522L904m342M847n441O147p006Q080r458J1306j3934J7995
67A0248k5159M1574j52507l1112K09051l2112m4921n0932J4293O6086R2908k2614
79G4803o5776l256O0133l039k6524k3491k7711m708M1301r500m9693j7648K6116
92b8993J4813r356q818J2522Q261J6310J8831r443r823K8825J4982k5421k3428
105g38R970J4521j2144k5062j8728j4644J9300L6359j3858l5198J6479L5717P397
118A9371r031P99J0524N511k966j5007k1695N705K0316j4715k4118N619J1032
$$ plain form
131 -8655 -8734 -10381 -4277 7972 11263 5960 3460 2775 8932 15714 3661 -7144 -2705 -1927 -7706
146 -7706 -9396 -3530 2201 -3372 -8969 -2690 157 3607 9661 3809 -832 5935 7120 2268 2013
161 2013 6711 9267 -1031 -10775 -8859 -5556 -4141 -6189 -14259 -10710 2027 1666 -2840 3158 14932
176 14932 19644 9034 2969 11466 13023 3371 -5654 -12464 -9335 -5960 -15777 -20635 -12578 -2166
190 -2166 1315 -4902 -3312 11940 19458 17270 13024 7327 8988 10986 1688 -5570 -5806 -7449 -11412
205 -11412 -17405 -16826 -8225 -3627 -2753 -1183 -574 6464 12252 7623 6351 11121 11959 7355 -465 -2065
221 -2065 3927 821 -7106 -9271 -8030 -4534 -7116 -14317 -8741 2071 1239 -3536 -2561 7583 17155
236 17155 11313 4083 8041 10659 8739 167 -7943 -4507 -2306 -10849 -16032 -12548 -5301 -889 -3970
$$ packed form
131h655p9j647O104J2249L291n303k500o85O157O782j2053j0805M439P78n779
146g706j690N866N731n573n597O279K847L450O054n852m641O767J185m852k55
161B013M698K556j0298r744J916L303J415k048q070L549J2737l61m506N998J1774
176A4932M712j0610o065Q497J557r652r025o810L129L375r817m858Q057J0412
190b166L481o217J590J5252P518k188m246n697J661J998r298p258k36j643l963
205a1412n993N79Q601M598Q74J570O09P038N788m629j272M770Q38m604p820j600
221b065N992l106p927k165J241L496k582p201N576J0812q32m775R75J0144R572
236A7155n842p230L958K618j920q572q110L436K201q543n183L484P247M412l081
$$ plain form
251 -3970 -1668 6678 9622 9866 8576 5449 8468 7995 -100 -4896 -5341 -4185 -4048 -8577 -8842 -3218
267 -3218 -561 1120 290 -320 5825 7953 1635 -213 2838 4084 2220 -4063 -3914 1411 430 -2225
283 -2225 -3673 -2763 2345 1255 -5347 -3146 2733 3312 338 -2537 1708 7111 3600 683 1452 1161
299 1161 2907 -965 -6786 -5093 -2006 -4234 -6303 -6433 -1272 4816 3695 3165 5345 7535 10666 6168
315 6168 -583 574 1587 -3689 -9063 -10343 -6105 -3508 -6797 -5932 -579 3568 5977 4145 3289 9178
331 9178 9707 3512 91 687 3058 316 -6559 -6752 -2931 -3154 -4707 -6324 -4156 1794 1100 -2794
347 -2794 -384 4227 6440 4979 1514 3894 6610 4488 1821 -636 -1316 186 -2999 -7779 -6867 -4947
363 -4947 -3976 -4398 -5100 -1237 2814 3789 4790 5442 7111 9292 5921 1091 1315 1686 -723 -5192 -8698
$$ packed form
251c970K302Q346K944K44j290l127L019m73q095m796m45J156J37m529k65N624
267c218K657J681q30o10O145K128o318j848L051J246j864o283J49N325r81k655
283b225j448R10N108j090o602K201N879N79k974k875M245N403l511k917P69k91
299A161J746l872n821J693L087k228k069j30N161O088j121n30K180K190L131m498
315F168o751J157J013n276n374j280M238K597l289Q65N353M147K409j832q56N889
331I178N29o195l421N96K371k742o875j93L821k23j553j617K168N950o94l894
347b794K410M611K213j461l465K380K716k122k667k457o80J502l185m780R12J920
363d947R71m22p02L863M051R75J001O52J669K181l371m830K24L71k409m469l506
$$ plain form
380 -8698 -6316 -3523 -5270 -5493 -3208 1086 4441 1367 461 6172 8353 4445 813 -295 2739 1699
396 1699 -3444 -4103 -2330 -1227 -1656 -4986 -3773 1547 1507 -1437 -1247 822 3362 1990 -109 1512
412 1512 2896 2003 1260 -1328 -979 1916 -78 -3296 -3211 -1860 -392 -1357 -2406 -34 1237 2096 2298
429 2298 329 1487 5245 3245 -1413 -1913 -454 -51 -2868 -4974 -2257 -1152 -1688 -1653 -1326 2551 5660
446 5660 3140 936 2941 4809 2522 -1539 -2150 188 -1963 -4742 -4308 -3808 -1530 164 -1724 -868
462 -868 2697 4241 3582 1678 2293 4094 1569 -1048 -328 -1204 -829 -258 -3433 -4749 -2254 -330 -1293
479 -1293 -2844 -1241 1939 663 -679 1240 2988 4112 4025 1062 989 3994 2723 -766 -3522 -1524
495 -1524 -416 -4960 -7298 -3290 -1468 -2124 -1410 -652 2207 5439 4464 2873 3738 5049 3707 -1062
$$ packed form
380h698K382K793j747k23K285M294L355l074r06N711K181l908l632j108L034j040
396A699n143o59J773J103m29l330J213N320m0k944J90K069K540j372k099J621
412A512J384q93p43k588L49K895j994l218Q5J351J468r65j049K372J271Q59K02
429B298j969J158L758k000m658n00J459M03k817k106K717J105n36L5L27L877L109
446E660k520k204K005J868k287m061o11K338k151k779M34N00K278J694j888Q56
462h68L565J544o59j904O15J801k525k617P20q76L75N71l175j316K495J924r63
479a293j551J603L180j276j342J919J748J124q7k963p3L005j271l489k756J998
495a524J108m544k338M008J822o56P14P58K859L232r75j591Q65J311j342m769
$$ plain form
511 -1062 -2122 151 -1769 -4651 -4506 -4681 -3105 -885 -946 -305 860 2398 2722 1152 1820 3979 2250
528 2250 309 18 -773 -668 389 -892 -1782 -1146 214 -461 -3203 -2401 932 631 -846 -597 589
545 589 2053 2288 202 908 2594 2920 624 -1787 -828 1106 -2299 -4491 -2542 -678 -18 -933 -900
562 -900 1473 2669 1859 1001 892 2654 2528 -1165 -2667 -1310 -1271 -1844 -1788 -1150 -85 576 545 1237 673
581 673 2169 3129 804 -338 675 110 -828 -1844 -2095 -773 -120 -1025 -1479 -886 744 1837 -313
598 -313 -512 1849 2219 995 -339 176 2149 938 -952 -247 363 528 -891 -3334 -2253 -201 -695
615 -695 -1894 -1317 485 1777 619 341 2489 2909 2495 1802 641 402 476 -1444 -2599 -2443 -1743 -1835
633 -1835 -2885 -2574 -722 564 1057 1572 1288 2312 3541 2110 904 698 891 618 -1459 -2436 -1328
$$ packed form
511a062j060K273j920k882J45j75J576K220o1O41J165J538L24j570O68K159j729
528B250j941k91p91J05J057j281q90O36J360o75k742Q02L333l01j477K49J186
545E89J464K35k086P06J686L26k296k411R59J934l405k192J949J864O60r15L3
562i00K373J196q10q58j09J762j26l693j502J357L9n73N6O38J065O61l1O92n64
581F73J496R60k325j142J013n65r38j016k51J322O53r05m54N93J630J093k150
598c13j99K361L70j224j334N15J973j211j890P05O10J65j419k443J081K052m94
615f95j199N77J802J292j158k78K148M20m14o93j161k39P4j920j155J56P00r2
633a835j050L11J852J286M93N15k84J024J229j431j206k06J93k73k077r77J108
$$ plain form
650 -1328 -1115 -2066 -2318 -1725 330 691 -880 -379 1162 2203 1627 176 504 2702 1572 -236 -203 44
668 44 296 -438 -1737 -1111 -553 -860 -1560 -1768 -680 522 -119 -95 1396 1798 1976 1484 410 955 1216
687 1216 116 -564 -1622 -1429 -772 -1444 -2027 -827 -214 581 506 -11 1565 1806 1297 510 -282 361 771
706 771 -1087 -1939 -956 -310 -350 -935 -544 1170 1545 675 102 513 1120 890 -640 -1109 -197 -177 -975 -1187
726 -1187 -497 533 462 -673 7 274 520 379 -336 90 678 434 99 -197 69 1227 462 -548 -408
745 -408 -215 -171 -1008 -1533 -1192 -172 -390 -574 -104 884 2119 1832 943 1363 1925 1125 32 -1154 -680
764 -680 -453 -2058 -2632 -1437 -751 -93 -837 -456 1490 1822 1289 1208 1209 1812 1241 -293 -617 -332 -44 -643
784 -643 -1247 -1527 -342 -763 -1112 -478 -373 221 487 -348 29 1130 1253 1336 413 377 1424 766 149 -327
$$ packed form
650a328K13r51k52N93K055L61j571N01J541J041n76j451L28K198j130j808L3K47
668D4K52p34j299O26N58l07p00k08J088J202o41K4J491M02J78m92j074N45K61
687A216j100o80j058J93O57o72n83J200O13P95p5n17J576K41n09p87p92O43M10
706G71j858q52R83O46m0n85L91J714L75q70n73M11O07k30j530m69R12K0p98k12
726a187O90J030p1j135O80K67K46j41p15M26N88k44l35k96K66J158p65j010J40
745d08J93M4q37n25L41J020k18j84M70R88J235k87q89M20N62q00j093j186M74
764f80K27j605n74J195O86O58p44L81J946L32n33q1JO03n71j534l24K85K88n99
784f43o04k80J185m21l49O34J05N94K66q35L77J101J23Q3r23l6J047o58o17m76
$$ plain form
804 -327 -656 -283 -1052 -1940 -1619 -723 -600 -693 -973 378 1422 1125 622 1280 1603 1490 180 -646 91 80
824 80 -1073 -1451 -1193 -504 -34 -525 -323 617 790 741 211 273 569 667 -156 228 -487 -95 157 -439 -539
845 -539 32 148 -153 -189 -253 585 762 -507 -442 -153 -44 425 -464 -512 525 14 -241 -504 -176 480 332
866 332 -758 -551 179 600 354 -529 410 1096 589 27 -125 460 542 -227 -1067 -949 -476 -674 -904 -1057
886 -1057 -272 469 154 472 739 1159 1398 722 -103 408 171 -764 -931 -1384 -1132 -245 -1148 -1166 -379 207
906 207 587 300 136 1097 1236 950 369 -63 640 938 -412 -700 -143 -294 -505 -1234 -1148 -195 -346 -597
926 -597 -480 32 790 558 -196 428 1555 1004 380 350 407 627 -170 -699 -735 -975 -486 -1031 -1599 -459 282
947 282 -6 187 363 1045 1268 928 647 677 241 326 -11 -951 -759 -395 -528 -1166 -724 -244 815 -103 175
$$ packed form
804c27l29L73p69q88L21Q96J23r3k80J351J044k97n03O58L23j13j310q26P37j1
824H0j153l78K58O89M70m91K02R40J73m9n30O2K96R8q23L84p15L92K52n96j00
845e39N71J16l01l6o4Q38J77j269O5K89J09M69q89m8J037n11k55k63L28O56j48
866C32j090K07P30M21k46q83R39O86n07n62j52N85Q2p69q40J18M73j98k30j53
886a057P85P41l15L18K67M20K39o76q25N11k37r35j67m53K52Q87r03j8P87N86
906B07L80k87j64R61J39k86n81m32P03K98j350k88N57j51k11p29Q6R53j51k51
926e97J17N12P58k32p54O24J127n51o24l0N7K20p97n29l6k40M89n45n68J140P41
947B82k88J93J76O82K23l40k81L0m36Q5l37r40J92L64j33o38M42M80J059r18K78
$$ plain form
968 175 500 553 484 86 -394 343 528 -205 -672 286 502 443 -172 -101 241 142 -259 -645 -180 291 213 -634
990 -634 -312 107 581 200 -230 569 864 -56 -141 64 -263 8 -82 -471 -254 47 251 588 -29 327 829
1011 829 344 -68 -117 -301 -150 -471 -1261 -658 147 -44 -255 -344 406 1130 494 501 559 788 502 -306 -616 23
1033 23 -53 -723 -972 -835 124 291 -681 -171 590 689 61 191 280 491 672 284 126 73 261 52 -443 -185
1055 -185 -191 -551 -650 -822 -736 -130 -94 0 229 148 735 839 506 816 1143 715 152 -403 -406 -76 -631 -1197 -954
1078 -954 -503 -146 -111 -521 364 1081 691 555 479 1027 858 117 -171 202 -296 -239 -607 -683 -384 0 -817
1099 -817 -481 -48 409 234 -162 92 438 516 194 363 73 113 319 -166 -161 -78 -48 5 -774 -551 -212 -34
1121 -34 -188 -227 -324 204 585 -126 34 574 315 19 -217 -17 337 -53 -495 -448 -331 9 124 -356 162
$$ packed form
968A75L25N3o9l98m80P37J85p33m67R58K16n9o15P1L42r9m01l86M65M71p8q47
990f34L22M19M74l81m30P99K95r20q5K05l27K71r0l89K17L01K04L37o17L56N02
1011H29m85m12m9j84J51l21p90O03Q05j91k11q9P50P24o36PN8K29k86q08l10O39
1033B3p6o70k49J37R59J67r72N10P61R9o28J30Q9K11J81l88j58n3J88k09m95K58
1055a85ol60r9j72Q6O06L6R4K29q1N87J04l33L10L27m28n63n55lL30n55n66K43
1078i54M51L57L5m10Q85P17l90j36p6N48j69p41k88L73m98N7l68p6K99L84q17
1099h17L36M33M57j75l96K54L46P8l22J69k90M0K06m85NQ3L0N3p79K23L39J78
1121c4j54l9r7N28L81p11J60N40k59k96k36K00L54l90m42M7J17L40J15m80N18
$$ plain form
1142 162 413 645 111 -260 288 556 -228 -297 -167 -160 -268 -481 -520 108 256 254 76 242 443 548 -87 85
1164 85 317 -84 12 -366 -355 -156 -485 -204 -525 -482 -36 89 -259 -142 45 425 325 0 412 687 324
1185 324 207 84 -214 428 24 -791 -199 -273 -427 -641 -621 -15 239 9 105 363 649 988 740 249 309
1206 309 263 -253 -348 -335 -902 -505 -720 -799 -31 -8 358 79 95 547 615 536 321 425 399 303 -199 -80 53
1229 53 12 -275 -188 -551 -70 149 -109 -278 299 188 289 -364 114 495 163 454 3 214 319 394 -290
1250 -290 -211 -355 -282 -591 -569 -528 8 -79 -162 205 256 421 532 272 331 359 306 -192 -228 -180 1 -203 -520 -340
1274 -340 -83 367 181 92 165 464 359 85 -312 -5 62 -238 -306 -77 -332 -1 127 -68 287 209 -137 -9
1296 -9 144 487 263 -204 -86 22 229 -98 -69 -139 220 -184 -418 -141 -196 167 86 -336 44 247 287 446
$$ packed form
1142A62K51K32n34l71N48K68p84o9J30Pj08k13l9O28J48kj78J66K01J05o35J72
1164H5K32m01R6l78J1J99l29K81l21M3M46J25l48J17J87L80j00l25M12K75l63
1185C24j17j23k98O42m04q15N92p4j54k14K0O06K54k30R6K58K86L39k48m91O0
1206C09m6n16r5J3n67L97k15p9P68K3L66k79J6M52O8p9k15J04k6r6n02J19J33
1229E3m1k87Q7l63M81K19k58j69N77j11J01o53M78L81l32K91m51K11J05P5o84
1250b90P9j44P3l09K2M1N36q7q3L67N1J65J11k60N9K8n3m98l6M8J81k04l17J80
1274c40K57M50j86q9P3K99j05k74l97L07O7l00o8K29k55L31J28j95L55p8l46J28
1296iJ53L43k24m67J18J08K07l27K9p0L59m04k34K77n5L63q1m22L80K03M0J59
$$ plain form
1318 446 447 207 196 -221 -101 -62 -247 -218 -436 -487 -373 -144 11 -138 62 235 487 600 219 538 566 474 -77
1341 -77 -124 -133 21 -547 -594 -734 -386 -30 -578 -628 41 293 129 255 419 512 559 186 23 118 285 10 -329
1364 -329 -341 38 -21 -436 -419 -292 -254 -26 -113 17 232 64 518 111 305 695 476 -16 -109 -121 -180 -285 -543
1387 -543 -405 -332 -394 -303 -333 -34 336 216 309 148 393 504 449 -46 -16 22 25 -200 -96 -106 -10 -553 -332 329
1411 329 81 119 -32 105 201 24 143 -103 194 251 -35 -144 -87 -67 1 323 -82 -264 -60 -16 122 237
1433 237 -88 3 221 -208 162 254 89 171 -221 -215 491 -34 -302 -102 -191 108 112 -152 -149 591 216 296 82 61
1457 61 362 45 -361 -125 -93 -452 -671 -361 -183 92 -179 321 81 640 482 18 92 361 328 -105 -337
1478 -337 -398 -47 -388 -319 -194 -290 -333 -276 -16 50 114 255 214 193 405 641 465 115 -110 174 -22 -105 -377
$$ packed form
1318D46Jk40j1m17J20L9j85K9k18n1J14K29J55j49K00J73K52J13l81L19K8r2n51
1341g7m7rJ54n68m7j40L48L56n48n0O69K52j64J26J64R3M7l73j63R5J67k75l39
1364c29j2L79n9m15J7J27L8K28q7J30K15j68M54m07J94L90k19m92r3j2n9j05k58
1387e43J38P3o2R1l0K99L70j20R3j61K45J11n5m95L0L8Lk25J04j0R6n43K21O61
1411C29k48L8j51J37R6j77J19k46K97N7k86j09N7K0O8L22m05j82K04M4J38J15
1433B37l25R1K18m29L70R2j65Q2l92OP06n25k68K00q9K99Mk64LP40l75Q0k14k1
1457F1L01l17m06K36L2l59k19L10J78K75k71N00k40N59j58m64P4K69l3m33k32
1478c37o1L51l41O9J25r6m3N7K60O6O4J41m1k1K12K36j76l50k25K84j96q3k72
$$ plain form
1501 -377 -393 -210 -216 -469 -357 -275 -44 69 -21 214 623 162 106 218 448 260 -9 -95 -258 -217 -164 -480 -582
1524 -582 -241 -51 -117 -118 -19 143 345 240 314 44 114 66 154 -30 279 -23 -83 -293 -68 -175 -180 -198 -106 -30 288
1549 288 148 33 -193 177 239 -70 70 38 -22 176 -342 -207 29 97 -254 -426 -141 28 -16 -62 68 302
1571 302 16 257 10 -3 95 -73 13 -253 -99 69 -31 -196 78 -37 27 60 272 168 21 150 187 -67
1593 -67 -160 -31 -154 -577 -245 -81 -223 -130 -204 -145 117 264 278 172 356 433 253 61 10 -76 -224 -189 -244 -95
1617 -95 -239 -440 -406 -194 -66 9 97 -158 219 236 164 291 300 205 90 -132 -166 238 -265 -517 -229 -412 -272
1640 -272 -225 -407 -261 79 -5 353 126 557 364 134 91 284 -207 114 -176 -475 -548 -140 1 -79 -381 -254
1662 -254 169 179 120 159 338 212 223 3 147 277 341 -195 -349 85 192 -182 -230 -17 -131 -65 -124 -134 -63
$$ packed form
1501c77j6J83ok53J12Q2K31J13r0K35M09m61n6J12K30j88k69q6j63M1N3l16j02
1524e82L41J90o6jR9J62K02j05P4k70P0m8Q8j84L09l02o0k10K25j07nj8R2P6L18
1549B88j40j15k26L70O2l09J40l2o0J98n18J35K36O8l51j72K85J69m4m6J30K34
1571C02k86K41k47j3R8j68Q6k66J54J68j00j65K74j15O4L3K12j04j47J29L7k54
1593f7r3J29j23m23L32J64j42R3p4N9K62J47J4j06J84P7j80j92n1q6j48L5n5J49
1617i5j44k01L4K12J28P5Q8k55L77J7p2J27Rr5j15k22l4M04n03k52K88j83J40
1640b72M7j82J46L40q4L58k27M31j93k30m3J93m91L21k90k99p3M08J41q0l02J27
1662b54M23J0n9L9J79j26J1k20J44J30O4n36j54M34J07l74m8K13j14O6n9j0P1
$$ plain form
1685 -63 -27 206 54 -12 115 100 -196 216 249 118 -173 -347 -195 -249 113 -23 -223 -47 143 -37 -76 46
1707 46 329 61 -43 -117 -92 -54 -56 -255 -122 86 62 -81 -430 -111 308 145 127 333 386 -108 -366 14 -100
1730 -100 -227 203 -368 -328 -60 -11 -148 -197 106 144 414 -44 15 -163 256 242 94 -88 106 97 -62 -359 -259
1753 -259 -260 28 -173 -101 12 -8 265 2 -46 319 363 -13 28 282 157 104 -166 -400 -232 -147 -239 -233 -86 41
1777 41 -125 136 369 54 240 240 -267 202 333 -43 294 -284 4 -16 -344 -101 -248 -80 -45 -115 20 132
1799 132 -245 -16 312 234 429 507 107 64 -107 25 206 -29 -58 -102 17 -162 -375 -414 81 118 17 266
1821 266 152 157 84 -120 90 153 199 -30 -84 -128 63 -165 -348 -99 4 54 -6 168 -167 350 206 5 66
1844 66 -52 -76 227 -9 238 77 -245 139 -125 5 94 16 149 166 24 37 -2 62 -124 18 -58 -81 -157 31
$$ packed form
1685f3L6K33j52o6J27j5k96M12L3j31k91j74J52n4L62j36k00J76J90j80l9J22
1707D6K83k68j04p4K5L8kj99J33K08k4j43l49L19M19j63j8K06N3m94k58L80j14
1730a00j27M30n71M0K68M9j37m9L03L8K70m58N9j78M19j4j48j82J94rj59k97J00
1753b59jK88k01P2J13k0K73k63m8L65M4l76M1K54j25n3k70k34J68Q5r2OJ47J27
1777D1j66K61K33l15J86%n07M69J31l76L37n78K88k0l28K43j47J68L5p0J35J12
1799A32l77K29L28p8J95P8m00m3j71J32J81k35k9m4J19j79k13l9M95L7j01K49
1821B66j14Np3k04K10O3M6k29n4m4J91k28j83K49J03N0o0J74l35N17j44k01O1
1844F6j18k4L03k36K47j61l22L84k64J30Q9p8J33J7j42J3l9O4j86J42p6k3p6J88
$$ plain form
1868 31 -115 -154 -207 133 287 11 -313 296 23 239 -9 379 132 20 -64 -290 -371 48 -27 -103 -105 -99 -11 -150
1892 -150 6 -146 276 250 106 305 223 330 243 84 46 -262 -68 -336 -63 -216 -98 -349 -213 13 136
1913 136 8 5 190 196 61 424 26 -81 156 137 -91 -58 44 -121 -164 -150 -161 15 -114 -171 -31 24 163 58
1937 58 152 189 96 214 318 -7 80 -14 -153 -202 -219 -285 94 -212 -445 90 -31 -20 62 -54 282 332 256 170 -33
1962 -33 -255 258 147 37 40 -109 170 -154 -66 -239 188 275 74 -115 -139 222 94 -75 2 18 70 72 -271 -199
1986 -199 60 -86 18 42 8 -35 -115 25 -145 -127 -63 196 11 198 52 -198 30 101 -68 18 -200 24 152
2009 152 35 -282 53 -153 20 -24 195 231 126 158 -47 -221 -275 -21 -122 -271 -4 -156 204 -84 -24 97
2031 97 318 228 22 233 328 37 -52 29 146 26 -96 -39 -136 -192 339 -224 -50 200 114 326 -46 -80 198
$$ packed form
1868C1j46l9n3L40J54k76l24O09k73K16k48L88k47j12q4k26q1M19p5p6kOQ8j39
1892a50J56j52M22k6j44J99q2J07q7j59l8l08J94k68K73j53J18k51J36K26J23
1913A36j28lJ85Oj35L63l98j07K37j9k28L3J02j65m3J4j1J76j29n7J40N5J39j05
1937E8R4L7r3J18J04l25Q7r4j39m9j7o6L79l06k33N35j21J1Q2j16L36N0p6q6k03
1962c3k22N13j11j10Lj49K79l24Q8j73M27Q7k01j89k4L61j28j69P7J6N2Kl43P2
1986a99K59j46J04K4l4m3q0J40j70J8O4K59j85J87j46k50K28P1j69Q6k18K24J28
2009A52j17l17L35k06J73m4K19L6j05L2k05j74n4K54j01j49K67j52L60k88O0J21
2031I7K21r0k06K11R5k91q9Q1J17j20j22N7r7n6N31n63J74K50q6K12l72l4K78
$$ plain form
2054 198 117 51 -50 201 -39 -159 -110 -35 -253 -316 63 -211 197 -123 -5 147 44 356 354 240 119 35 198
2077 198 251 214 50 72 60 -53 -43 -110 -437 -135 -31 -9 290 -81 335 -28 89 -21 -5 264 -77 -102 -26
2100 -26 152 -183 -199 14 -42 -59 -58 -66 -15 354 82 199 283 44 61 -63 -84 209 -182 -9 -191 -42 157 -228
2124 -228 -82 -224 -127 -164 91 -7 -128 305 -292 -183 36 3 160 -253 -25 -76 49 -144 69 -91 -61 146
2146 146 -32 12 21 175 102 -43 22 -149 -133 33 -265 -207 -5 67 247 -173 -66 38 -90 -119 166 172 397 44
2170 44 -60 125 242 217 312 -330 -121 54 -22 -237 -124 116 -32 112 105 -90 68 309 361 79 270 105
2192 105 -13 -76 90 -43 182 -72 -168 -295 48 -274 -11 139 276 187 205 464 177 258 140 178 41 3
2214 3 -147 18 -235 -73 -231 -44 -383 -160 -26 61 -205 46 395 140 109 426 -126 -126 75 -109 -109 72 -197
$$ packed form
2054A98q1o6j01K51k40j20M9P5k18o3L79k74M08l20J18J52j03L12kj14j21q4J63
2077A98N3l7j64K2j2j13J0o7l27L02J04K2K99l71M16l63J17j10J6K69l41k5P6
2100b6J78l35j6K13n6j7JqN1L69k72J17Q4k39J7j24k1K93l91J73j82J49J99l85
2124b28J46j42R7l7K55r8j21M33n97J09K19l3J57m13K28n1J25j93K13j60L0K07
2146A46j78M4RJ54p3j45O5j71J6J66k98N8K02P2J80m20J07J04j28k9K85OK25l53
2170D4j04J85J17k5R5o42K09J75p6k15J13K40j48J44pj95J58K41N2k82J91j65
2192A05j18o3J66j33K25k54r6j27L43l22K63J50J37q9J8K59k87Q1j18L8j37l8
2214Cj50J65k53J62j58J87l39K23J34Q7k66K51L49k55l1L17n52%K01j84%J81k69
$$ plain form
2237 -197 -228 -368 -51 -169 -109 -114 144 251 23 69 44 -36 219 -19 197 8 -8 -49 -16 142 19 83 -114 -16
2261 -16 89 -267 -14 -4 130 87 65 125 287 -278 -243 -81 97 -351 26 353 -93 61 -137 29 -49 58
2283 58 -30 -39 31 135 -101 190 94 -48 16 98 48 -64 60 40 319 -262 144 313 150 60 -105 -83 -149 -299
2307 -299 9 -215 32 -64 -84 29 200 -119 151 62 122 442 21 4 -62 248 79 -148 215 -109 101 30
2329 30 11 186 -62 18 -326 -118 -59 -26 -114 7 41 32 298 91 215 177 -8 130 88 -147 217 -186 -186 -209 -19
2354 -19 -5 -112 -187 -218 47 11 -42 82 -167 35 388 25 -99 57 113 273 -31 53 -288 21 -177 -58 16
2377 16 121 45 -205 34 6 114 198 12 208 48 201 219 -108 -58 165 -114 -259 -95 72 -102 406 74
2399 74 -109 152 249 -110 27 -131 74 127 -25 36 41 128 66 -135 -13 152 -53 121 53 264 58 190 -15
$$ packed form
2237a97l1j40L17j18O0nK58J07k28M6k5q0K55k38K16j89j6m1L3J58j23O4j97R8
2261a6J05l56K53J0J34m3k2O0J62n65L5J62J78m48L77L27m46J54j98J66p8J07
2283E8q8rP0J04k36K91r6j42O4Q2n0j12J24k0K79n81M06J69j63r0j65K2o6j50
2307b99L08k24K47r6k0J13J71l19K70q9O0L20m21j7o6L10j69k27L63l24K10p1
2329C0j9J75k48Q0l44K08N9L3q8J21L4rK66k07J24l8j85J38m2k35L64m03%k3J90
2354a9J4j07p5l1K65l6n3J24k49K02L53l63j24J56N6J60l04Q4l41L09j98J19P4
2377A6J05p6k50K39k8J08Q4j86J96j60J53J8l27N0K23k79j45J64J67j74N08l32
2399G4j83K61R7l59J37j58K05N3j52O1NQ7o2k01J22J65k05J74o8K11k06J32k05
$$ plain form
2422 -15 15 201 -88 -152 -206 -26 -19 -90 8 -71 239 46 -80 8 -54 -33 -193 -106 2 -113 97 -150 -38 53 -133
2447 -133 -141 -112 110 27 -191 -91 -82 -161 96 109 152 199 -61 30 27 117 136 40 4 86 2 -38 1 15 -87 -59 114 -120
2475 -120 98 31 71 262 239 165 15 -119 72 -143 90 -99 -37 -154 -307 -63 -172 115 -37 -75 -194 -8
2497 -8 34 143 37 -286 -8 73 -3 2 44 -43 4 -127 48 33 -47 -182 -34 -228 9 -50 10 -277 -36 114 281
2522 281 81 30 -15 -253 164 55 86 -211 147 -178 -96 -458 -185 27 114 166 165 -191 167 -25 31 -19 -69 -59
2546 -59 -145 176 -84 -137 -292 -6 -47 -167 -116 101 187 -91 -150 3 95 90 260 -29 81 166 42 8 -4 -66 154
2571 154 -70 -86 -89 -300 273 -57 -182 -13 54 -181 22 100 127 26 -58 -262 -243 -84 234 -312 405 -2 52
2594 52 158 328 402 16 359 -26 51 -29 -286 -51 43 176 78 -64 -28 121 320 123 77 45 169 259 142
$$ packed form
2422a5L0J86k89o4n4J80Pp1R8p9L10j93j26Q8o2K1j60Q7J08j15K10k47J12R1j86
2447a33qK9K22q3k18J00Rp9K57J3M3M7k60R1lR0J9r6l6Q2q4m0L9J4j02K8J73k34
2475a20K18o7M0J91k3p4j50j34J91k15K33j89O2j17j53K44j09K87j52l8j19J86
2497hM2J09j06l23K78Q1p6NM2q7M7j31J75j5q0j35J48j94K37n9O0k87K41J50J67
2522B81k00n1m5k38M17j09L1k97L58l25Q2l62K73K12Q7N2jl56L58j92N6n0n0J0
2546e9q6L21k60n3j55K86m1j20N1K17Q6k78n9J53R2nJ70k89J10Q5j24l4j2o2K20
2571A54k24j6lk11N73l30j25J69O7k35K03P8K7j01q4k04J9J59L18n46P17m07N4
2594E2J06J70P4l86L43l85P7q0k57K35R4J33r8j42L6J49J99j97m6l2J24R0j17
$$ plain form
2617 142 -66 -58 -336 54 72 201 -206 205 -31 -88 -26 38 -266 -225 276 150 135 67 112 -8 125 1 -181
2640 -181 -139 -306 -201 -204 -156 -2 -35 -59 -22 -28 102 3 -58 130 -140 317 358 219 25 130 89 169 68 -122 -398
2665 -398 -341 -367 129 -17 -176 166 -165 70 183 20 47 131 29 132 -140 37 156 -31 71 -313 -16
2686 -16 291 -26 -91 -233 -224 -93 -82 129 -260 -29 221 82 238 -237 38 -136 -113 -110 72 -106 46 -60 -159
2709 -159 64 68 90 274 -33 -165 60 112 70 -12 118 -85 -116 -16 -32 -171 -203 -75 13 -32 -121 35 280 -68
2733 -68 148 -207 -19 -165 -134 -98 -133 -167 80 -50 105 29 126 -31 38 163 216 77 -172 -25 1 -45 41 19
2757 19 -114 134 -258 -43 27 74 63 -108 181 91 1 -42 276 -62 -98 50 105 -47 38 71 5 -111 -92 -36 -183
2782 -183 203 -173 104 27 -70 118 450 297 -20 145 -146 -98 -87 131 32 -57 -164 -146 4 -441 94 -53
$$ packed form
2617A42k08Qk78L90J8J29m07M11k36n7O2O4l04M1N01j26j5o8M5j20J33j24j82
2640a81M2j67J05lM8J54l3k4L7oJ30r9o1J88k70M57M1j39j94J05m1Q0j01j90k76
2665c98N7k6M96j46j59L42l31K35J13j63K7Q4j02J03k72J77J19j87J02l84K97
2686a6L07l17o5j42RJ31J1K11l89K31K50j39J56m75K75j74K3LJ82j78J52j06r9
2709a59K23MK2J84l07j32K25N2m2q2J30k03l1J00j6j39l2J28Q8m5q9J56K45l48
2733f8K16l55J88j46L1L6l5l4K47j30J55p6R7j57O9J25N3j39k49J47K6m6Q6k2
2757A9j33K48l92K15P0M7j1j71K89r0r0m3L18l38l6J48N5j52Q5L3o6j16J9N6j47
2782a83L86l76K77p7r7J88L32j53l17J65k91M8J1K18r9q9j07J8J50m45N35j47
$$ plain form
2804 -53 49 -83 71 -21 38 66 377 249 133 -129 -327 -89 -93 -292 -115 -91 29 -131 148 -45 291 152
2826 152 -193 152 -168 95 -13 97 -129 68 124 -234 123 108 150 110 99 8 132 -106 213 38 66 225
2848 225 137 -340 -115 -12 70 90 -168 -95 -102 -7 -6 32 144 95 213 -119 100 121 14 216 -58 -233 -59 -341
2872 -341 -46 282 -122 197 -95 -4 -40 224 -102 -65 -56 195 39 165 -59 89 -62 61 -132 -283 -119 -159
2894 -159 -103 -58 -104 -100 88 -43 -41 -13 198 183 176 -9 -81 192 110 -104 74 -212 -66 181 151 6 -73 139 3
2919 3 17 30 108 165 196 -48 -15 -150 -238 -274 -171 -232 -484 172 -53 -80 -41 -176 -109 36 15 266 255 -100 27
2944 27 31 201 -17 -53 18 312 53 131 -238 27 -1 -183 -115 35 -34 -52 -132 -47 125 -103 107 40 -240 56
2968 56 169 -21 64 -52 257 -142 148 -60 -168 -52 -34 -375 -259 -36 -33 33 299 46 146 58 23 211 57
$$ packed form
2804e3J02j32J54r2N9K8L11j28j16k62j98K38mj99J77K4J20j60K79j93L36j39
2826A52l45L45l20K63j08J10k26J97N6l58L57j5M2m0j1r1J24k38L19j75K8J59
2848B25q8m77K25J03Q2K0k58P3pR5JL8J12m9J18l32K19K1j07K02k74j75J74k82
2872c41K95L28m04L19k92R1l6K64l26L7RK51j56J26k24J48j51J23j93j51J64m0
2894a59N6M5m6MJ88j31KK8K11j5pj85p2K73q2k14J78k86J46K47l0j45p9K12j36
2919CJ4J3P8N7L1k44L3j35q8l6J03o1k52O56k25k7L9j35O7J45k1K51j1l55J27
2944B7MJ70k18l6P1K94k59P8l69K65k8j82O8J50o9j8q0Q5J72k28K10o7k80K96
2968E6J13j90Q5j16L09l99K90k08j08J16J8l41J16K23LO6K66k53J00q8l5J88j54
$$ plain form
2991 57 13 217 292 -384 30 -218 -63 -204 64 218 46 48 274 84 103 137 100 -163 -90 247 -58 -19 -23 -134
3015 -134 109 -97 -62 44 45 -332 -293 -89 98 -159 -87 5 -277 124 -16 -64 -97 327 -296 28 69 37 254
3038 254 42 4 70 -14 -31 -5 -15 14 -105 -26 -111 -154 -194 305 -412 -1 103 -13 208 -116 446 184 160 9
3062 9 74 -227 -96 2 44 -68 -180 235 -45 29 -93 -93 -125 53 64 55 54 125 94 -128 9 -55 297 80 -176 169
3088 169 59 -217 -286 33 -212 -4 73 -109 39 -140 -91 169 -99 23 -102 224 -40 -98 82 -121 -35 -83
3110 -83 -86 -16 69 26 -84 114 34 -29 -142 -75 44 114 43 -36 -251 -49 -332 38 -71 -249 -16 -149 -40 108
3134 108 144 129 27 -61 229 88 -87 135 113 -49 64 -162 -42 -94 100 306 -120 212 -13 312 39 -256
3156 -256 -172 13 -17 -5 36 233 -223 -39 -317 41 66 17 125 5 -30 -7 374 -80 166 -1 272 187 -98
$$ packed form
2991E7m4K04P5o76M14k48J55j41K68J54j72KK26j90J9L4l7k63P3L37l05L9mj11
3015a34K43k06L5J06Jl77L9K04J87k57P2R2k82M01j40m8l3M24o23L24M1l2K17
3038B54k12l8O6q4j7K6j0K9j19P9q5m3m0M99p17M11J04j16K21l24N62k62k4j51
3062IO5l01J31R8M2j12j12M15k80P4j22%l2J78J1rjP1l1k22J37o4L52k17k56L45
3088A69j10k76o9L19k45K08P7j82J48j79M9K60k68J22j25L26k64n8J80k03Q6m8
3110h3lP0Q5m3j10J98q0o3j13O7J19P0p1p9k15K02k83L70j09j78K33j33J09J48
3134A08L6j5j02q8K90j41j75K22k2j62J13k26J20n2J94K06m26L32k25L25k73k95
3156b56Q4J85l0J2M1J97m56J84k78L58K5m9J08j20l5K3L81m54K46j67K73q5k85
$$ plain form
3179 -98 31 113 76 -229 88 -36 -73 -210 -62 -61 -112 63 95 43 29 6 12 187 216 148 46 -100 -194 -117 -201 103
3205 103 83 -169 -66 -198 329 175 16 28 13 177 376 205 -106 -200 -166 143 10 -92 -73 128 -64 -78
3227 -78 1 159 -32 127 1 -69 93 -53 246 95 173 -59 -15 94 -56 -206 224 227 32 209 -176 -162 225
3250 225 -53 -211 82 -167 -103 -218 -131 52 48 239 -100 87 90 157 94 -66 -68 -269 -223 33 -26 -164 73 339
3274 339 29 -174 -200 -137 -113 136 -191 -216 -90 65 127 62 -47 -45 -222 -71 -56 24 44 65 -143 0 -275 -80
3298 -80 52 2 44 -236 -62 162 75 63 44 19 121 -13 174 127 -101 369 16 -43 -77 -89 -34 105 -57 124
3322 124 4 -127 -232 -137 -27 9 340 37 201 265 -42 59 55 40 -48 -211 55 71 -80 -175 368 -26 -137
3345 -137 233 -71 -64 262 59 -2 91 -6 -13 -70 41 384 67 -190 0 -33 -338 -129 -36 122 -150 25 64 227
$$ packed form
3179i8J29Q2l7l05L17j24l7j37J48Jn1J75L2n2j4k3OJ75K9o8j02j46r4P7q4L04
3205A03k0k52J03j32N27j54j59J2j5J64J99j71l11r4L4L09j33j02J9K01j92j4
3227g8P9J58j91J59j26p0J62j46K99j51P8k32M4J09j50j50M30Lj95J77l85J4L87
3250B25k78j58K93k49O4j15Q7J83mJ91l39J87LO7o3j60kk01M6K56n9j38K37K66
3274C39l10k03k6O3K4K49l27k5J26J55O2o5j09Kj77J51J5Q0K0K1k08J43k75J95
3298h0J32n0M2k80J74K24q7j2j9k5J02j34J87m7k28M70l53n9l4j2N5J39j62J81
3322A24j20j31j05R5J10L6L31l03J64O4l07J01mj5q8j63K66J6j51r5N43l94j11
3345a37L70l04PL26k03o1R3r7pn7J11L43l17k57J90l3l05K09R3J58k72J75L9J63
$$ plain form
3369 227 10 7 183 182 -116 -115 12 159 -78 -259 189 -184 90 32 -202 -146 220 92 70 -48 159 97 3 -60
3393 -60 -2 184 48 -171 114 42 -59 -191 32 -167 -5 319 -66 8 96 -97 258 95 -123 25 -94 80
3415 80 215 32 -22 -289 5 235 67 -120 -66 -180 35 -18 77 -22 131 -66 83 -114 -362 11 47 40 59
3438 59 111 108 157 -75 -68 98 71 -202 -146 -251 -65 -91 226 -71 -37 219 -288 -87 -262 -58 16 28 -73 -70 71
3463 71 154 100 -174 20 112 47 -155 140 -105 -105 80 91 -117 -112 -14 -86 -121 -7 -48 302 135 -7 177 -32 125
3488 125 180 187 -30 -90 131 -147 86 42 -188 -113 -59 284 90 -23 -92 -107 -68 -93 -183 -99 125 62 -203 -52 235
3513 235 20 -49 -139 5 7 -104 -303 22 76 -45 231 136 -187 209 130 -98 -212 79 -77 -28 -121 51 -131
3536 -131 102 -36 -142 168 -256 -246 -150 -100 -23 0 -162 -21 -116 -277 199 31 210 -282 -256 38 -56 404 -6
$$ packed form
3369B27k17lJ76jk98JJ27J47k37j81M48l73K74n8k34N6L66j28k2j18K07o2r4o3
3393f0N8J86j36k19K85p2j01j32K23j99J62L24l85P4Q8j93L55j63k18J48j19J74
3415H0J35j83n4k67K94K30j68j87N4j14K15n3R5r9J53j97J49j97k48L73L6pJ9
3438E9N2lM9k32PJ66k7k73N6j05J86k6L17k97L4K56n07K01j75K04P4J2j01LJ41
3463G1Q3n4k74J94R2o5k02K95k45%J85J1k08NR8p2l5J14m1L50j67j42J84k09J57
3488A25N5Pk17o0K21k78K33m4k30P5N4L43j94j13o9j5L9k5r0Q4K24o3k65J51K87
3513B35k15o9r0J44Kj11j99L25N4j21K76r5l23L96p9k28j14K91j56M9r3J72j82
3536a31K33j38j06L10m24J0R6N0P7K3j62J41r5j61M76j68J79m92K6K94r4M60m10
$$ plain form
3559 -6 83 -39 -200 -42 56 256 -267 249 -247 192 -47 287 120 -9 -39 154 88 -50 -116 -129 -29 -52 -97
3582 -97 -137 -164 -98 -87 -99 -99 69 -39 -65 -30 34 1 4 -25 122 103 35 147 175 -15 35 -61 186 59 126 63 -52
3609 -52 -2 -298 223 -213 -114 54 -259 207 -246 -98 68 -288 167 28 181 122 -115 -32 273 34 149 96
3631 96 -24 -191 -19 -199 75 13 -174 110 193 -15 -45 308 63 -26 -129 66 -190 12 74 123 69 -335 -141
3654 -141 -139 -92 105 5 245 114 -73 144 67 -28 342 -74 -62 -48 -34 62 66 -187 178 130 -47 74 170 -48
3678 -48 -119 121 141 -98 351 37 235 208 113 -70 -85 68 99 -3 -49 -106 -274 -158 80 -144 -258 256 -123
3701 -123 194 -180 29 10 -237 11 115 54 97 149 297 53 -112 39 -140 -28 -87 -125 -78 -23 6 26 -243
3724 -243 -171 129 235 174 -56 -88 46 -210 35 -273 225 99 58 -86 23 65 249 -66 -43 -53 -74 -249 -16
$$ packed form
3559fQ9j22j61J58R8K00n23N16m96M39k39L34j67j29l0J93o6j38o6j3J00k3m5
3582i7m0k7O6J1j2%J68j08k6L5O4l3Lk9J47j9o8J12K8j90N0r6K47j27O7o3j15
3609e2N0k96N21m36R9J68l13M66m53J48J66l56M55j39J53n9k37Q3L05k39J15n3
3631I6j20j67J72j80K74o2j87K84Q3k08l0L53k45q9j03J95k56K02O2M9n4m04J94
3654a41KM7J97j00K40j31j87K17p7r5L70m16J2J4J4R6Mk53L65m8j77J21R6k18
3678d8p1K40K0k39M49l14J98k7r5j83j5J53L1j02m6n7j68J16K38k24j14N14l79
3701a23L17l74K09j9k47K48J04o1M3N2J48k44j65J51j79J12n9l8M7N5K9K0k69
3724b43P2L00J06o1k30l2J34k56K45l08M98j26m1j44J09M2J84l15K3j0k1j75K33
$$ plain form
3747 -16 61 45 -176 -25 259 -131 252 78 112 -88 90 -172 -194 -22 -117 113 -122 5 13 95 -42 -13 -138
3770 -138 4 42 -184 -6 -135 184 60 145 -131 -72 -94 -117 161 -26 -6 140 29 -70 155 183 9 15 162
3793 162 227 181 285 -103 -12 0 21 -41 -193 -209 137 -34 250 19 76 -79 267 203 -151 -312 54 115 230
3816 230 249 -72 77 192 253 236 -3 27 -81 -24 145 -7 110 -40 -107 -174 326 -136 -121 116 28 -266 235
3839 235 213 -239 181 -276 121 -124 -74 165 -8 -275 -112 214 111 26 72 272 -175 -142 -245 -103 -12 -226
3861 -226 168 -102 232 268 300 24 4 -186 -122 199 148 98 -30 46 -13 -31 10 -137 6 -30 -10 68 -26 208 8
3886 8 -131 -177 63 -66 199 -6 -209 -118 180 -299 42 1 170 -77 -73 6 -15 -132 157 -10 37 -149 -78 -23
3910 -23 148 -65 1 -59 207 -7 111 -85 187 -160 -134 115 -33 98 104 61 188 -240 -160 251 -230 202 -57
$$ packed form
3747a6P7j6k21J51K84l90L83j74L4k00J78k62k2J72r5K30k35J27QQ2j37K9j25
3770a38J42L8k26J78j29L19j24Q5k76N9k2k3K78j87K0J46j11r9K25K8j74OJ47
3793A62O5m6J04l88R1J2K1o2j52j6L46j71K84k31N7j55L46o4l54j61L66O1J15
3816B30J9l21J49J15O1j7k39L0j08N7J69j52J17j50o7o7N00m62J5K37q8k94N01
3839B35k2m52M20m57L97k45N0K39j73k67J63L26j03q5M6K00m47L3j03J42R1k14
3861b26L94k70L34L6L2k76k0j90O4L21n1n0j28P6n9j8M1j47J43l6K0P8r4K34k00
3886Hj39m6K40j29K65k05k03R1K98m79L41m1J69k47MP9k1j17K89j67M7j86P1N5
3910b3J71k13O6o0K66k14J18j96K72l47K6K49j48J31Om3J27m28Q0M11m81M32k59
$$ plain form
3933 -57 2 38 235 -67 110 28 52 51 66 -10 -43 39 99 -62 -13 20 193 -55 -37 155 143 -227 115 218 78
3958 78 -61 -81 -144 -4 -82 -52 -160 -33 190 -133 -54 -97 30 -196 -174 132 126 221 88 -47 -115 291 -132 89
3982 89 -8 14 -144 53 -86 -138 -108 -78 96 61 46 98 161 -75 -6 56 0 -89 -75 -84 60 -177 -252 178 -36 -261
4008 -261 -206 146 28 -149 -311 -150 -115 -208 -9 -149 61 243 108 298 -91 -128 357 159 155 220 24 147
4030 147 -318 -32 -29 203 96 104 238 166 42 -167 -107 6 -116 -210 4 42 -46 114 -3 -32 54 -194 66 -172
4054 -172 -115 42 -102 46 -224 -86 4 -99 55 -14 -156 312 117 -248 -203 198 48 -11 -121 -30 -106 -9 95
4077 95 225 -12 -25 47 83 -177 68 74 -134 -178 50 106 -12 -72 3 222 74 -139 -124 -133 -122 30 49 -157 -156 -7
4103 -7 -5 143 -26 -94 -206 27 -75 -105 -146 -1 22 50 -9 95 121 -99 -225 -117 -249 23 -105 144 -127 -39
$$ packed form
3933e7N9L6J97l02J77q2K4jJ5p6l3Q2O0j61M9L3J73k48J8J92j2l70L42J03j40
3958G8j39k0o3J40p8L0j08J27K23l23P9m3J27k26K2L06oR5j33j35o8M06m23K21
3982H9r7K2j58J97j39n2L0L0J74l5j5N2O3k36O9O2n6q9J4rJ44k37p5M30k14k25
4008b61N5L52j18j77j62J61L5r3J99j40K10J82j35J90l89l7M85j98mO5j96J23
4030A47m65K86LK32j07QJ34p2j24k09O0J13j22r4K14L8q8J60j17k9Q6k48K60k38
4054a72N7J57j44J48k70J38R0j03J54o9j42M68j95l65M5M01j50n9j10R1p6R7J04
4077I5J30k37j3P2L6k60K45Ok08m4K28N6j18o0P5K19j48k13J5rJ1J52J9k06JJ49
4103gKJ48j69o8j12K33j02l0m1J45K3K8n9J04K6k20j26J08j32K72j28K49k71Q8
$$ plain form
4127 -39 218 -80 14 42 -96 73 -101 -148 18 55 -184 223 -86 -140 83 103 27 163 3 -6 -102 -8 -130 -40
4151 -40 -12 -47 -65 -188 -201 -295 90 -263 -17 -149 -142 -127 305 236 60 89 193 -25 -123 61 -415 -100 -78 178
4175 178 99 86 37 -30 -94 -89 -149 -193 -153 -123 74 151 -49 -52 -32 -166 126 -51 -267 -54 -153 -65 -388 -230 203 -29
4201 -29 222 73 155 -82 61 -320 -93 -148 -190 -80 -109 -84 -181 12 -21 -60 198 71 92 -69 29 -94 63 -160
4225 -160 -56 -165 84 30 39 24 173 172 -4 -232 437 -54 -296 -112 -421 -1 -36 83 -71 -108 -43 -3 -69 80
4249 80 54 -55 110 -208 1 25 -147 304 -58 -383 -56 145 -84 -23 1 -133 84 -40 -44 121 -203 -16
4271 -16 38 -233 -155 -139 145 -39 -102 -24 -54 -126 -128 -8 264 154 -167 -192 51 241 -90 -7 -92 47 44 -20 358
4296 358 74 90 -23 223 -99 -87 -109 11 -79 182 52 -20 96 72 301 -231 -181 -270 -183 -7 80 5 95 35
$$ packed form
4127c9K57k98R4K8j38J69j74m7J66L7k39M07l09n4K23K0p6J36j60rr6R4j22R0
4151d0K8l5j8j23j3r4L85l53K46j32PJ5M32o9j76K9J04k18r8J84m76L15K2K56
4175A78p9j3m9o7o4No0m4M0L0J97P7k00lK0j34K92j77k16K13r9Q8l23J58M33k32
4201b9K51j49Q2k37J43l81K27n5m2J10k9K5r7J93l3l9K58j27K1j61R8j23J57k23
4225a60J04j09K49n4Rj5J49jj76k28O69m91k42J84l09M20l5J19j54l7O5M0o6J49
4249H0k6j09J65l18K09K4j72M51l62l25L27K01k29O1K4j34K17j24mJ65l24J87
4271a6N4k71P8J6K84j84o3P8l0p2kJ20K72j10l21k5K43J90l31Q3q5J39lo4L78
4296C58k84J6j13K46l22J2k2J20r0K61j30p2J16k4K29n32N0q9Q7J76Q7p5R0o0
$$ plain form
4320 35 -228 -138 -98 -164 -62 -197 -198 -175 78 -46 148 -19 141 206 207 -51 92 -88 -141 -201 -32 160 130 107 91
4345 91 -278 38 -44 5 -126 -25 -59 27 -109 -202 157 156 -70 121 335 -194 129 -276 -179 87 -190 39 -16
4368 -16 -116 -85 -100 264 9 -50 -306 -38 -302 -64 93 214 58 -112 111 -23 -10 -145 82 -117 98 -179
4390 -179 -137 44 -153 265 80 -106 193 -48 -126 178 -190 149 81 86 -152 -276 -130 125 -111 -305 185 -209
4412 -209 -222 -131 98 191 -30 9 37 117 -304 71 -250 217 -76 52 110 23 -262 31 121 6 34 -185 -153 143
4436 143 58 294 -22 164 140 -151 29 -93 288 253 295 -11 -150 248 236 41 280 45 -84 9 -76 33
4458 33 -376 -65 -26 31 68 138 -25 121 -43 -98 -136 -418 -85 100 52 202 -103 -279 -197 73 -80 -177 78
4481 78 -134 -164 -165 -459 171 -41 141 54 -18 -12 -183 -95 -94 -29 -348 97 -21 -234 -109 19 59 -4 56 305 -15
$$ packed form
4320C5k63R0M0o6J02j35jK3K53j24J94j67J60O5Jk58J43j80n3o0J69J92l0k3j6
4345I1l69L16q2M9j31J01l4Q6j36r3L59jk26J91K14n29L23m05R7K66k77K29n5
4368a6j00L1j5L64k55n9k56K68k64K38J57J21j56j70K23j34J3j35K27j99K15k77
4390a79M2J81j97M18j85j86K99k41p8L04l68L39o8Nk38j24J46K55k36j94M90l94
4412b09j3R1K29R3k21L9K8Q0m21L75l21M67k93J28N8q7k85K93R0j15K8k19L2K96
4436A43q5K36l16J86k4k91J80j22L81l5M2l06j39L98j2j95K39k35j29R3q5J09
4458C3m09L11L9N7L7P0j63J46j64n5l8k82L33J85m8J50l05j76Q2K70j53r7K55
4481G8k12l0jk94O30k12J82q7p2Oj71Q8JO5l19M45j18k13J25J28M0o3O0K49l20
$$ plain form
4506 -15 13 72 222 387 -225 -23 -321 -202 118 -111 -32 88 157 -178 233 -12 -99 -107 40 55 -126 64 79
4529 79 67 11 0 38 -2 -13 123 69 -28 46 141 72 -114 -359 -209 247 235 178 104 186 -213 126 -214 232 18
4554 18 149 -161 -50 -107 4 -1 310 -90 -53 -92 -273 -80 -31 52 101 245 10 179 -119 158 -19 -267 -175
4577 -175 80 -236 37 -261 172 125 -156 -20 165 213 16 44 -33 369 123 138 -99 -153 158 -145 222 148
4599 148 234 110 25 -47 58 -85 -32 -127 -127 29 -132 197 34 -278 -82 -49 -7 -96 210 -68 194 -72 -138 -13
4623 -13 261 -218 127 -101 2 143 -21 -26 -83 -25 -56 74 -181 -66 -70 28 -85 -138 107 263 -21 85 -12 -10
4647 -10 -45 -301 -248 225 177 19 -58 -159 -3 53 -224 -14 -27 -235 -83 57 -33 -134 -24 49 -177 -78 -196
4670 -196 110 -22 -377 213 31 -19 -212 -111 82 5 187 151 106 -188 -85 -92 -53 -22 294 -73 62 -112 15
$$ packed form
4506a5K8N9J50J65o12K02k98J19L20k29P9J20O9l35M11k45q7qJ47J5j81J90J5
4529G9j2n6j1L8m0j1J36n4r7P4R5o9j86k45J50M56j2n7p4Q2l99L39l40M46k14
4554A8J31l10J11n7J11nL11m00L7l9j81J93M9Q3M9J44k35J69k98K77j77k48R2
4577a75K55l16K73k98M33m7k81J36J85M8j97K8p7M02k46J5k37n4L11l03L67p4
4599A48Q6j24q5p2J05j43N3r5%J56j61L29j63l12J96L3M2q9L06k78K62k66o6J25
4623a3K74m79L45k28J03J41j64nn7N8l1J30k55J15mR8j13n3K45J56k84J06r7K
4647a0l5k56N3M73m8j58p7j01J56N6k77K10j3k08J52J40r0j01J10P3k26R9j18
4670a96L06j32l55N90j82n0j93J01J93p7J82l6m5k94J03pL9L1L16l67J35j74J27
$$ plain form
4693 15 155 -1 330 -31 -134 -206 186 410 -128 -164 -115 269 -37 -177 -128 -106 -90 1 -126 -240 -185 -237 156
4716 156 195 140 -52 -410 50 39 70 -6 -168 227 -274 27 -98 137 -69 176 199 -99 72 144 71 -66 -22
4739 -22 -59 17 -8 -32 -72 162 -107 120 -159 -99 -220 -21 20 187 175 -12 187 1 29 25 -53 -127 -45 -98 -112 -143
4765 -143 -8 -203 -134 341 42 144 -168 -44 222 -94 300 110 -98 -36 -243 252 -174 156 -247 -59 137
4786 137 72 -232 61 -277 -117 -133 -232 57 102 -252 -92 -3 -109 99 -113 30 -28 -96 -82 53 -114 300 -138
4809 -138 63 -413 -10 -75 38 119 -161 37 -79 133 220 34 67 -85 -180 185 145 -40 86 121 -174 93
4831 93 -130 234 -81 144 -1 94 83 35 -149 193 100 -64 45 42 15 102 126 72 261 -195 -47 -167 -73 -74 276
4856 276 -136 72 14 -57 190 -175 53 -198 -10 42 -46 -124 -130 139 22 30 29 128 -311 125 -305 113 112 -262 -45
$$ packed form
4693A5J40j56L31l61j03p2L92K24n38l6M9L84l06j40M9K2J6R1j27j14N5n2L93
4716A56L9n5j92l58M60j1L1p6j62L95n01L01j25K35k06K45K3k98J71P2p3j37M4
4739b2l7P6k5k4m0K34k69K27k79O0j21J99M1J67j2j87J99j86K8mp8p4Q2n3j4l1
4765a43J35j95O9M75k99J02l12J24K66l16L94j90k08O2k07M95m26L30m03J88J96
4786A37o5l04K93l38J60j6r9K89M5l54J60Q9j06K08k12J43n8o8J4J35j67M14m38
4809a38K01m76M03o5J13Q1k80J98j16K12Q7j86L3j52r5L65m0j85J26L5k95K67
4831I3k23L64l15K25j45R5j1m8j84L42r3j64J09lk7Q7K4n4J89m56J48j20R4jL50
4856B76m12K08n8p1K47l65K28k51J88N2q8p8oK69j17QjR9m39M36m30M18jl74K17
$$ plain form
4881 -45 -138 -222 -248 -2 60 27 -89 138 -2 335 194 -36 -248 82 268 -265 192 -119 -151 -196 -162 -264 -219
4904 -219 -107 -171 112 5 -140 -131 -110 -93 34 161 52 -60 -31 16 45 5 340 -9 -302 70 -24 -133 100
4927 100 98 90 -129 -81 124 2 -12 126 -165 -64 83 62 286 -98 28 -154 -195 -128 -83 -20 61 -75 -182 -173 8
4952 8 83 98 -119 -22 195 246 -37 -89 -130 -128 -93 -118 -104 29 96 -203 83 90 -196 -131 196 -124 99 -46 -22 62
4978 62 -87 76 -105 -185 -276 -60 -134 -193 -17 46 -141 -70 -91 51 214 -14 202 -221 -8 111 -18 -70 124
5001 124 6 -88 280 -199 122 102 -154 112 128 -55 -12 37 95 37 -113 -37 -35 122 214 -564 14 -160 -205 -138
5025 -138 -114 58 117 125 -268 -262 -73 -211 352 -90 141 -326 -65 -40 286 -137 -126 -47 -318 -216 3 -24 -100 26
5049 26 206 4 133 -101 -241 -57 302 215 48 8 125 195 -275 -4 -114 11 150 -83 66 -16 65 50
$$ packed form
4881d5r3q4k6K46O2l3j16K27j40L37j41k30k12L30J86n33M57l11l2m5L4j02M5
4904b19J12o4K83j07j45RK1J7J27J27j09j12K9M7K9m0L35l49k93L72r4j09K33
4927A00kqk19M8K05j22j4J38k91J01J47k1K24l84J26j82m1O7M5O3Q1j36j07RJ81
4952HP5J5k17R7K17N1k83n2m1KL5k5J4J33O7k99K86Pk86O5L27l20K23j45K4Q4
4978F2j49J63j81q0r1K16p4n9J76O3j87P1k1J42J63k28K16m23K13J19j29n2J94
5001A24j18r4L68m79L21k0k56K66J6j83M3M9N8n8j50P6KJ57R2p78N78j74m5O7
5025a38K4J72N9Ql93OJ89j38N63m42K31m67K61K5L26m23J1P9k71J02K19k7p6J26
5049B6J80k02J29k34j40J84L59q7j67m0J17P0m70K71j10J25J39k33J49q2Q1j5
$$ plain form
5071 50 12 74 69 141 6 248 -15 2 -145 -159 111 47 -229 157 -173 -135 90 112 -81 0 85 84 -109 -133 95
5096 95 -2 -116 98 -320 -249 260 -201 115 230 56 91 0 -213 -129 99 -215 62 -36 47 58 167 41 -92
5119 -92 -191 -33 -54 -189 189 -80 -80 33 -168 -282 85 -300 -91 128 91 -87 175 -261 -175 69 61 -187 -1
5142 -1 42 -195 -197 -219 131 -78 133 211 -55 7 120 -101 21 -63 18 -341 -117 113 -30 98 66 115 -271 -28
5166 -28 22 221 236 177 -141 273 57 74 -33 -16 253 4 26 -224 -163 -31 23 -144 -265 -39 -76 98 86 -120
5190 -120 88 26 225 133 -67 231 33 -84 -95 -25 230 -109 46 87 107 -309 -198 -13 41 66 -25 -121 119
5213 119 -19 -239 -72 92 68 47 -266 -93 113 -99 189 208 -57 76 -191 -13 118 42 163 6 -130
5234 -130 321 83 -45 221 47 178 -52 -88 -108 21 53 -327 -150 -128 45 28 -129 198 -182 150 -30 -247
$$ packed form
5071E0l8O2nP2j35K42k63J7j47j4K70o4k76L86l30L8K25K2j93Q1Q5jj93k4K28
5096I5r7j14K14m18P1N09m61L16J15j74L5r1k13Q4K28l14K77r8Q3J1J09j26j33
5119i2r9J58k1j35L78k69%J13k01j14L67l85K09K19l7j78K62m36Q6K44qk48J86
5142aM3k37kk2L50k09K11P8k66O2J13k21J22q4Q1l59K24K30j43J28l2M9l86K43
5166b8N0J99J5n9l18M14k16J7j07J7K69k49K2k50O1J32N4j67j21K26l7J74j2k06
5190a20K08o2J99r2k00K98j98j17j1P0K55l39J55M1K0m16J11J85N4K5r1r6K40
5213A19j38k20J67J64k4k1l13J73K06k12K88J9k65J33k67J78J31p6J21j57j36
5234a30M51k38j28K66j74J31k30l6k0J29L2l80J77K2J73j7j57L27l80L32j80k17
$$ plain form
5256 -247 17 -231 -207 251 236 -53 -251 -202 -213 -15 97 -203 11 95 69 84 117 41 16 -26 72 53 209 -72
5280 -72 -284 66 83 81 -72 -54 116 -69 190 -97 -128 167 83 114 -215 91 -30 -180 35 -159 7 126 -13
5303 -13 166 87 -164 51 -124 -7 23 122 -13 -98 -160 170 -171 -28 -182 153 235 -220 -10 -249 8 268
5325 268 154 82 47 -141 -202 -25 7 -225 31 -67 113 25 -381 89 105 -168 -116 56 76 -92 -10 182 -55
5348 -55 -244 -269 -106 -4 140 -155 -43 -154 171 -82 -18 -178 -282 -11 -102 -193 38 37 114 382 -63 -204 -121
5371 -121 -174 -20 -167 -35 -29 171 -60 -26 302 87 -34 108 65 -283 -157 -16 94 32 -26 143 143 -137 -181
5394 -181 -32 -137 -98 33 -129 125 -179 -31 -51 -184 -295 6 -54 97 -204 127 -28 -42 -26 -143 241 63
5416 63 243 -356 60 33 174 70 -22 -240 -90 16 122 -125 -128 -10 32 -186 -210 137 -105 106 79 -134 86
$$ packed form
5256b47K64k48K4M58j5k89j98M9j1J98J12l00K14Q4k6J5L3p6k5m2R8j9J56k81
5280g2k12L50J7kj53J8J70j85K59k87l1K95q4L1l29L06j21j50K15j94J66J19j39
5303a3J79p9k51K15j75J17L0R9j35q5o2L30l41J43j54L35Q2m55K10k39K57K60
5325B68j14p2l5j88o1J77L2k32K56r8J80q8m06M70J6k73N2J72K0j68Q2J92k37
5348e5j89k5J63J02J44k95J12j11L25k53O4j60j04K71r1r1K31jP7K68m45j41Q3
5371a21n3J54j47J32OK00k31L4L28k15j21J42m3l48J26J41J10o2n8J69%k80m4
5394a81J49j05L9J31j62K54l04J48k0j33j11L01o0J51l01L31j55j4J6j17L84j78
5416F3J80n99M16k7J41j04r2k18J50J06J06k47lJ18M2k18k4L47k42K11k7k13K20
$$ plain form
5439 86 133 -70 111 5 41 31 -132 364 23 -332 66 49 24 173 32 -239 -195 -45 79 177 -270 -252 36
5462 36 -78 -105 52 -40 221 63 12 155 -75 -269 -106 77 -59 -74 -123 -115 -113 337 58 7 -170 195 -100 61
5486 61 -3 113 145 224 312 -119 -218 -8 136 -2 70 -155 -199 -112 -76 -267 19 16 -72 -342 -26 5 -164 258 169
5511 169 22 8 10 52 59 143 -54 -137 65 55 -198 122 -39 297 60 -131 -58 240 154 22 -149 -191 -67 -123
5535 -123 -85 -42 156 277 -40 -113 165 4 333 -5 -16 193 -56 166 89 -12 -151 43 -25 -31 93 127 -150
5558 -150 -189 12 229 -74 -66 -13 -365 118 -48 182 141 10 -33 165 72 -143 -49 176 -69 117 111 -78 -58 48
5582 48 -122 -42 43 -2 26 -108 -106 99 -117 135 197 121 215 125 -124 95 -140 72 50 30 41 -108 136 -44 236
5607 236 -289 31 150 255 -155 -328 115 35 33 108 -183 6 81 0 -143 -6 -237 -6 116 319 -99 -4
$$ packed form
5439H6M7k03J81j06L6j0j63M96l41l55L98j7k5J49j41k71M4J50J24R8m47J8K88
5462C6j14k7J57r2K61j58n1J43k30j94J63J83j36j5m9QKM50k79n1j77L65k95J61
5486F1o4J16L2P9Q8m31r9K10J44j38P2k25m4Q7L6j91K86lq8k70L16L1j69M22q9
5511A69j47j4KM2PQ4j97q3K02j0k53L20j61L36k37j91P3K98q6j32j71m2J24n6
5535a23L8M3J98J21l17p3K78j61L29l38j1K09k49K22p7j01j39J94o8oJ24L4k77
5558a50l9K01K17l03QN3l52M83j66K30m1j31m3J98r3k15R4K25k45J86oj89K0J06
5582D8j70Q0Q5m5K8j34KK05k16K52O2p6R4r0k49K19k35K12k2k0J1j49K44j80K80
5607B36n25L20J19J05m10j73M43q0kP5k91J89P5q1j43J37k31K31J22K03m18R5
$$ plain form
5629 -4 107 12 -64 -24 38 42 13 -89 -133 124 -107 76 -117 -420 -61 -256 42 50 -58 -190 -124 -66 -176 135 118
5654 118 -118 -90 -155 59 21 137 25 373 151 -69 116 120 -129 -72 85 20 -57 191 -109 -50 -19 -32 -184 63
5678 63 -31 -62 -58 -61 19 177 98 13 77 -58 8 -19 -4 307 63 13 62 -103 -3 117 214 -61 -8 -89 -109 -108 -296
5705 -296 149 264 49 -172 -78 65 -262 -94 203 20 -36 209 -45 312 -145 96 277 181 84 -65 -10 -304
5727 -304 -118 -63 125 37 -65 44 225 1 172 114 132 -96 175 -148 -39 78 67 144 91 73 -211 90 222
5750 222 56 -87 89 -95 -42 105 -86 22 -370 -86 56 -117 299 90 23 -151 -108 33 284 -246 -170
5771 -170 221 -128 -149 -54 -209 295 86 -178 93 108 -253 -293 -74 -98 340 -158 -17 -233 -238 -66 -36 -140 -59
5794 -59 148 -237 -44 -160 -71 -24 117 113 -412 123 -45 78 -26 -33 28 139 33 -122 12 103 -140 240 -5
$$ packed form
5629dJ11r5p6M0O2Mk9j02m4K57k31J83j93l03L59j95K98Qj08j32O6N8j10L11j7
5654A18k36K8o5K14l8J16j12L48k22k20J85Mk49N7J57o5p7K48l00N9L1j3j52K47
5678F3r4l1MlQ0J58p9q5O4j35O6k7J5L11k44n0M9j65J00J20R7k75N3q1k0Jj88
5705b96M45J15k15k21R4J43l27J68K97j83n6K45k54L57m57K41J81r6r7j49N5k94
5727c04J86N5J88q8j02J09J81k24J71n8J8k28K71l23J09J17j1P7n3j8k84L01J32
5750B22j66j43J76j84N3J47j91J08l92K84J42j73M16k09o7j74M3J41K51n30P6
5771a70L91l49k1R5j55N04k09k64K71J5l61m0K19k4M38m98J41k16nJ72L0j04Q1
5794e9K07l85J93j16Q9M7J41mn25N35j68J23j04pO1J11j06j55J34R1k43L80k45
$$ plain form
5817 -5 -61 -11 -190 133 247 -238 -82 -53 -119 16 124 -78 188 85 -102 -19 -100 25 -170 104 -52 210 -89
5840 -89 128 273 -24 155 184 47 -22 -183 -13 -26 149 193 -74 -141 -72 220 -60 226 -64 -25 117 -15 -48
5863 -48 4 -212 145 -106 -58 -94 -20 -292 -237 136 124 -187 105 234 187 366 57 -85 32 -1 28 70 157 -281
5887 -281 94 75 -59 -12 118 -14 301 18 114 -57 89 -46 272 -46 47 182 -190 61 -83 19 -170
5908 -170 50 -137 88 -265 -98 190 9 184 0 -45 -148 -125 -185 87 -142 -108 -61 13 -387 -20 -285 -61
5930 -61 -102 63 230 41 -116 67 -138 -329 -83 -136 -283 156 111 -196 63 -85 -183 -94 11 -172 111 -27
5952 -27 76 67 20 20 66 187 13 198 32 24 8 -126 91 -268 13 -234 -78 86 -104 -171 -140 116 201 28
5976 28 35 -39 -43 3 6 -130 142 -220 -100 -71 -60 263 -60 -10 74 -62 84 -331 -166 60 145 -177 63 -228 49
$$ packed form
5817en6N0j79L23J14m85J56K9o6J35J08k02K66j03j87Q3q1J25j95K74j56K62k99
5840h9K17J45k97J79K9j37o9j61J70j3J75M4k67o7O9K92k80K86k90L9J42j32l3
5863d8N2k16L57k51M8l6P4k72N5L73j2l11K92J29m7J79l09j42J17l3K9M2Q7m38
5887b81L75j9j34M7J30j32L15k83R6j71J46j35L18l18R3J35l72K51j44J02j89
5908a70K20j87K25l53J67K88j81J75j84m5j03K3o0K72k29L4M7P4m00L67k65K24
5930f1m1J65J67j89j57J83k05j91K46n3j47M39m5l07K59j48r8Q9J05j83K83j38
5952b7J03rm7%M6J21j74J85j66qj6j34K17l59K81k47J56J64j90o7L1K56Q5j73
5976B8Pp4mM6Lj36K72l62J20K9J1L23l23N0Q4j36J46m15J65K26Q5l22K40k91K77
$$ plain form
6001 49 133 -186 34 -105 91 117 -8 -4 51 205 26 -199 12 -259 -49 191 -152 -2 -1 58 111 -406 -105
6024 -105 97 -103 35 65 43 -106 -231 -45 -25 174 -4 36 -224 16 -136 -111 -40 154 6 -6 -96 -3 200
6047 200 52 213 -8 -33 -245 -137 -146 -30 181 -222 279 63 34 -20 -16 -185 43 58 -222 -83 -134 33 -46
6070 -46 172 -175 -41 -34 -143 3 -104 104 55 197 -16 31 -135 -12 -223 155 -167 -2 -123 157 -118 -81
6092 -81 -11 111 111 -147 47 111 -77 176 101 -11 -307 -127 49 -83 125 -242 -113 -50 -144 225 77 98 149
6115 149 -235 -129 276 -13 -141 -58 69 58 124 -101 11 -82 -283 141 174 5 241 -53 -104 -32 -308 -32
6137 -32 228 132 16 202 72 -232 -111 106 -20 66 -173 169 54 -94 140 -110 -13 79 -54 107 114 -39
6159 -39 118 91 -169 -7 38 -197 26 8 -54 -50 -202 83 89 -159 -174 1 172 -82 42 67 -152 -262 148 -73
$$ packed form
6001D9Q4l19K20j39J96K6j25MN5J54j79k25K11k71K10K40l43J50JN9N3n17L01
6024a05K02k00J38L0k2j49j25J86K0J99j78M0k60K40j52K5P1J94j48j2r0R3K03
6047B00j48J61k21k5k12J08rJ16K11m03N01k16k9n4Mj69K28J5k80J39n1J67p9
6070d6K18l47J34Pj09J46j07K08m9J42k13M7j66J23k11L78l22J65j21K80k75L7
6092h1P0J22%k58J94O4j88K53p5j12k96J80J76j32K08l67J29O3r4L69j48K1N1
6115A49l84J06M05k89j28Q3J27j1O6k25J12r3k01M24L3j69K36k94n1P2k76K76
6137c2K60r6j16J86j30l04J21K17j26Q6k39L42j15j48K34k50R7R2j33J61Pj53
6159c9J57k7k60J62M5k35K23j8o2Mj52K85Ok48j5J75J71k54J24K5k19j10M10k21
$$ plain form
6183 -73 30 218 40 55 41 72 77 -126 314 202 158 -12 415 214 15 -163 80 62 -183 341 27 -274 32
6206 32 49 241 -182 -188 139 10 -219 1 -8 -180 2 -74 -34 -68 -5 -48 121 -185 -65 -95 -209 94 -139 -87
6230 -87 -34 -179 -91 36 -10 50 -196 214 -350 -56 -41 176 75 201 81 22 53 263 84 92 -40 -107 -165 274
6254 274 157 -324 -204 -310 -253 -30 240 8 55 -29 8 -138 15 226 -119 -279 -357 -63 203 -40 76 175
6276 175 163 59 157 -31 27 -372 -44 -279 -71 -170 -33 301 -7 -8 50 163 132 -49 68 100 91 166 -100 59
$$ packed form
6183g3J03J88j78J5j4L1Nk03M40j12m4j70M27k01j99j78K43j8k45N24l14l01L06
6206C2J7J92m23oL27j29k29K20rj72J82p6M0l4O3m3J69l06J20l0j14L03k33N2
6230h7N3j45Q8J27m6O0k46M10n64K94J5K17j01J26j20n9L1K10j79Qj32o7n8M39
6254B74j17m81J20j06N7K23K70k32M7q4L7j46J53K11l45j60p8K94K66k43J16R9
6276A75j2j04R8j88N8l99L28k35K08r9J37L34l08jN8J13l1j81J17L2rP5k66J59
$$ [...]
8191E9
##END NTUPLES=NMR FID
##END=
