##TITLE=1H_DE-107_oil2_TFA
 200.13MHz, CDCl3,
 8 sc
 
 3.9.2025
##JCAMPDX= 6.0         $$ Bruker NMR JCAMP-DX V2.0
##DATA TYPE= NMR FID
##DATA CLASS= NTUPLES
##ORIGIN= UXNMR, Bruker Analytische Messtechnik GmbH
##OWNER= pz
$$ XWIN-NMR		Version 3.5
$$ Wed Sep  3 14:17:37 2025 Russian Standard Time (UT+4h)  she@DPX200
##.OBSERVE FREQUENCY= 200.1313
##.OBSERVE NUCLEUS= ^1H
##.DELAY= (6, 6)
##.ACQUISITION MODE= SIMULTANEOUS
##.ACQUISITION SCHEME= undefined
##.AVERAGES= 8
##.DIGITISER RES= 18
##SPECTROMETER/DATA SYSTEM= spect
##.PULSE SEQUENCE= zg30
##.SOLVENT NAME= CDCl3
##.SHIFT REFERENCE= (INTERNAL, CDCl3, 0, 14.3821)
##AUDIT TRAIL= $$ (NUMBER, WHEN, WHO, WHERE, WHAT)
$$ ##TITLE= Audit trail, XWIN-NMR		Version 3.5
$$ ##JCAMPDX= 5.01
$$ ##ORIGIN= Bruker BioSpin GmbH
$$ ##OWNER= she
$$ F:/spectra/data/she/nmr/H-C/1/audita.txt
$$ ##AUDIT TRAIL=  $$ (NUMBER, WHEN, WHO, WHERE, WHAT)
(   1,<2025-09-03 14:16:27.18 +0400>,<she>,<DPX200>,
      <created by zg, POWCHK disabled, PULCHK disabled
       configuration hash MD5:
       00 E9 B6 7A A2 85 ED C7 34 08 36 98 17 FE 4E 26
       data hash MD5: 16K
       97 C1 1E 33 B1 85 3D 16 91 F9 2C 16 82 3E 3E 8C>)
$$ ##END=
$$ 
$$ hash MD5
$$ 99 0C 9D 58 A8 64 F4 59 7C 75 0B 49 94 97 D7 E0
##$RELAX= 
##$RELAX= 
##$RELAX= 
##$RELAX= 
##$RELAX= 
##$RELAX= 
$$ Bruker specific parameters
$$ --------------------------
##$DU= <F:/spectra>
##$EXPNO= 1
##$NAME= <H-C>
##$PROCNO= 1
##$TYPE= <nmr>
##$USER= <she>
##$AMP= (0..31)
100 100 100 100 100 100 100 100 100 100 100 100 100 100 100 100 100 100 
100 100 100 100 100 100 100 100 100 100 100 100 100 100 
##$AQSEQ= 0
##$AQ_mod= 1
##$AUNM= <au_zg>
##$AUTOPOS= <>
##$BF1= 200.13
##$BF2= 200.13
##$BF3= 200.13
##$BF4= 200.13
##$BF5= 200.13
##$BF6= 200.13
##$BF7= 200.13
##$BF8= 200.13
##$BYTORDA= 1
##$CFDGTYP= 0
##$CFRGTYP= 5
##$CHEMSTR= <none>
##$CNST= (0..31)
1 1 145 1 1 1 1 1 1 1 1 1 1 1 1 1 1 1 1 1 1 1 1 1 1 1 1 1 1 1 1 1 
##$CPDPRG= <>
##$CPDPRG1= <>
##$CPDPRG2= <>
##$CPDPRG3= <>
##$CPDPRG4= <mlev>
##$CPDPRG5= <mlev>
##$CPDPRG6= <mlev>
##$CPDPRG7= <mlev>
##$CPDPRG8= <mlev>
##$CPDPRGB= <>
##$CPDPRGT= <>
##$D= (0..31)
0 0.7 0 0 0 0 0 0 0 0 0 0.03 0 0 0 0 0 0 0 0 0 0 0 0 0 0 0 0 0 0 0 0 
##$DATE= 1756894586
##$DBL= (0..7)
120 120 120 120 120 120 120 120 
##$DBP= (0..7)
150 150 150 150 150 150 150 150 
##$DBP07= 0
##$DBPNAM0= <>
##$DBPNAM1= <>
##$DBPNAM2= <>
##$DBPNAM3= <>
##$DBPNAM4= <>
##$DBPNAM5= <>
##$DBPNAM6= <>
##$DBPNAM7= <>
##$DBPOAL= (0..7)
0.5 0.5 0.5 0.5 0.5 0.5 0.5 0.5 
##$DBPOFFS= (0..7)
0 0 0 0 0 0 0 0 
##$DE= 6
##$DECBNUC= <off>
##$DECIM= 32
##$DECNUC= <off>
##$DECSTAT= 4
##$DIGMOD= 1
##$DIGTYP= 9
##$DL= (0..7)
0 120 120 120 120 120 120 120 
##$DP= (0..7)
150 150 150 150 150 150 150 150 
##$DP07= 0
##$DPNAME0= <>
##$DPNAME1= <>
##$DPNAME2= <>
##$DPNAME3= <>
##$DPNAME4= <>
##$DPNAME5= <>
##$DPNAME6= <>
##$DPNAME7= <>
##$DPOAL= (0..7)
0.5 0.5 0.5 0.5 0.5 0.5 0.5 0.5 
##$DPOFFS= (0..7)
0 0 0 0 0 0 0 0 
##$DQDMODE= 0
##$DR= 18
##$DS= 0
##$DSLIST= <SSSSSSSSSSSSSSS>
$$ [...]
##$SUBNAM0= <"">
##$SUBNAM1= <"">
##$SUBNAM2= <"">
##$SUBNAM3= <"">
##$SUBNAM4= <"">
##$SUBNAM5= <"">
##$SUBNAM6= <"">
##$SUBNAM7= <"">
##$SUBNAM8= <"">
##$SUBNAM9= <"">
##$SW= 18.0517328524113
##$SWIBOX= (0..15)
0 0 2 0 0 0 0 0 0 0 0 0 0 0 0 0 
##$SW_h= 3612.71676300578
##$TD= 16384
##$TD0= 1
##$TE= 0
##$TE2= 300
##$TE3= 300
##$TEG= 300
##$TL= (0..7)
0 120 120 120 120 120 120 120 
##$TP= (0..7)
150 150 150 150 150 150 150 150 
##$TP07= 0
##$TPNAME0= <>
##$TPNAME1= <>
##$TPNAME2= <>
##$TPNAME3= <>
##$TPNAME4= <>
##$TPNAME5= <>
##$TPNAME6= <>
##$TPNAME7= <>
##$TPOAL= (0..7)
0.5 0.5 0.5 0.5 0.5 0.5 0.5 0.5 
##$TPOFFS= (0..7)
0 0 0 0 0 0 0 0 
##$TUNHIN= 0
##$TUNHOUT= 0
##$TUNXOUT= 0
##$USERA1= <user>
##$USERA2= <user>
##$USERA3= <user>
##$USERA4= <user>
##$USERA5= <user>
##$V9= 5
##$VALIST= <valist>
##$VCLIST= <CCCCCCCCCCCCCCC>
##$VD= 0
##$VDLIST= <DDDDDDDDDDDDDDD>
##$VPLIST= <PPPPPPPPPPPPPPP>
##$VTLIST= <TTTTTTTTTTTTTTT>
##$WBST= 1024
##$WBSW= 4
##$XGAIN= (0..3)
0 0 0 0 
##$XL= 0
##$YL= 0
##$YMAX_a= 98829
##$YMIN_a= -129699
##$ZGOPTNS= <>
##$ZL1= 120
##$ZL2= 120
##$ZL3= 120
##$ZL4= 120
##$ABSF1= 10
##$ABSF2= 0
##$ABSG= 5
##$ABSL= 3
##$ALPHA= 0
##$AQORDER= 0
##$ASSFAC= 0
##$ASSFACI= 0
##$ASSFACX= 0
##$ASSWID= 0
##$AUNMP= <proc_1d>
##$AZFE= 0.1
##$AZFW= 0.1
##$BCFW= 1
##$BC_mod= 2
##$BYTORDP= 1
##$COROFFS= 0
##$CY= -3
##$DATMOD= 1
##$DC= 2
##$DFILT= <>
##$DTYPP= 0
##$F1P= 0
##$F2P= 0
##$FCOR= 0.5
##$FTSIZE= 0
##$FT_mod= 4
##$GAMMA= 1
##$GB= 0.15
##$INTBC= 1
##$INTSCL= 1
##$ISEN= 128
##$LB= 0.25
##$LEV0= 0
##$LPBIN= 0
##$MAXI= 10000
##$MC2= 0
##$MEAN= 0
##$ME_mod= 0
##$MI= 1.114404
##$NCOEF= 0
##$NC_proc= 0
##$NLEV= 6
##$NOISF1= 3.799351
##$NOISF2= 2.8
##$NSP= 1
##$NTH_PI= 0
##$NZP= 0
##$OFFSET= 14.38212
##$PC= 1
##$PHC0= -1571.35
##$PHC1= 28.39228
##$PH_mod= 1
##$PKNL= yes
##$PPARMOD= 0
##$PSCAL= 0
##$PSIGN= 0
##$REVERSE= no
##$SF= 200.129724274929
##$SI= 16384
##$SIGF1= 3
##$SIGF2= 2
##$SINO= 400
##$SIOLD= 16384
##$SREGLST= <1H.CDCl3>
##$SSB= 0
##$STSI= 0
##$STSR= 0
##$SW_p= 3205.1282051282
##$SYMM= 0
##$S_DEV= 0
##$TDeff= 0
##$TDoff= 0
##$TI= <>
##$TILT= no
##$TM1= 0
##$TM2= 0
##$TOPLEV= 0
##$USERP1= <user>
##$USERP2= <user>
##$USERP3= <user>
##$USERP4= <user>
##$USERP5= <user>
##$WDW= 1
##$XDIM= 8192
##$YMAX_p= 0
##$YMIN_p= 0
$$ End of Bruker specific parameters
$$ ---------------------------------
##NTUPLES= NMR FID
##VAR_NAME=  TIME,          FID/REAL,        FID/IMAG
##SYMBOL=    X,             R,               I
##VAR_TYPE=  INDEPENDENT,   DEPENDENT,       DEPENDENT
##VAR_FORM=  AFFN,          ASDF,            ASDF
##VAR_DIM=   8192,          8192,            8192
##UNITS=     SECONDS,       ARBITRARY UNITS, ARBITRARY UNITS
##FACTOR=    0.0002768,     1,               1
##FIRST=     0,             0,               0
##LAST=      2.2672688,     0,               0
##MIN=       0,             -129699,         0
##MAX=       2.2672688,     98829,           0
$$ Real data points
##PAGE= N=1
##DATA TABLE= (X++(R..R)), XYDATA
$$ [...]
1831D9N4L0M8j62J64k65P1j50J62n2L4k2k23M13k63J66M3J6k74L49P3k37k17M80
$$ 49 103 133 181 19 183 -82 -11 -161 1 -51 -17 -39 -262 151 -112 54 97 113 -161 188 261 24 -193 287
1855B87j85j2q4K3j04l80K77O5J83m1j84K90k67J52j65k2J48k47M28k12j62L24
$$ 287 102 90 6 29 -75 -455 -178 -113 70 29 -155 135 -132 20 -145 -167 -19 -266 162 -50 -212 112
1877A12k4j12P1j48J13J42r3j2k5l15M43l23j99O43j54m4k96J72P3m3o3J89j11
$$ 112 88 -24 47 -101 12 154 61 49 24 -291 152 -171 -370 273 119 75 -221 -49 24 -19 -82 107 -4
1900dRj4K30j66P0k07k6j9q7K42k75M32j74j31J0k49K70l2k3P7J96j28m6J04q1
$$ -4 5 -9 221 55 125 -82 -108 -127 -214 28 -247 185 11 -120 -110 -359 -89 -121 -144 -67 129 1 -45 59 -22
1925b2n7M5J76jn9K86k57L12l67qk00J41Q8k05L06j4k14m4oj17L91o6j48Q8P7
$$ -22 -79 -34 142 141 82 368 111 423 56 48 -152 -11 77 -128 178 164 -50 -94 -100 -217 174 108 -40 48 125
1950A25k40N5J25l3M7l16J86K7p8K36l47L06k12M65o51L85j11K03k80qK88Jj29
$$ 125 -115 -60 65 32 79 -237 -51 -24 -102 134 -213 93 -119 346 -305 80 -31 172 -108 -116 172 173 44
1973D4j98J05k31R7j39K46J26j24J23p8j2n9K73j09k28K35PJ04l97M43k77pM3
$$ 44 -154 -49 -280 -183 -322 -76 50 -74 49 -29 -41 -100 173 64 -164 71 78 182 -215 228 -49 -56 -13
1996a3k7P7J19l07K98l7j30q0L39l03J60m99O05k84J47l5m6P3k93K76p6J66j41
$$ -13 -40 37 156 -151 147 110 -20 -100 239 -64 96 -403 202 -82 65 30 -16 57 -236 40 -36 130 -11
2019a1Q1J05l0k74q1J05J73K52k28k80K57j3k58k6N82l82M42m01J09j5j2k27K7
$$ -11 70 175 145 -129 -210 -105 68 320 92 -188 69 56 -202 -228 354 -28 414 13 122 107 95 -132 -105
2042a05J37j6J84l48O6K00j62J84j49l2J88k46K40k61L8K58k45O4k97K93J67P4
$$ -105 32 16 200 -148 -82 118 -44 140 -9 -41 147 -99 141 -120 -82 176 -69 -5 -302 -9 158 232
2064B32k39L9j02M3o3K06j24J74j78J5P1j8K3j7O7j25q8R5o9j04K16l2K13O3l46
$$ 232 -7 32 -70 -27 -90 116 -8 166 -12 3 74 56 79 62 129 4 -84 11 -58 -162 54 22 235 298 -48
2089d8K06k11K74k59j16J25K54o8k3k70K91k53J37j33J10j44rJ68K77j81r8K2
$$ -48 158 -53 221 -38 -154 -29 225 157 134 -136 155 -98 39 -94 16 -128 -137 31 308 127 29 51
2111E1m7k35K91o3Q7j01P4RR6j70j61N9J12m3j81K42m9J17J32l33K12j10K89n17
$$ 51 4 -231 60 -3 84 -17 57 66 162 -8 -169 -110 2 -41 -222 20 -29 88 220 -113 99 -11 278 -239
2135b39K76M2l4k7Qo9n5M8k3L7P3j85L27j20k08P1j1J63L4j73L99j61j83j75M33
$$ -239 37 79 45 18 26 -43 -98 -50 -73 -36 37 -148 179 59 -149 -78 -89 74 108 -65 334 173 -10 -185 248
2160B48j06n8k29m8J98j73L30j09p0J4j7j63RQ5k5O9j8J37j52K3K96m43O6L24
$$ 248 142 84 -145 -193 5 -168 162 53 -17 -3 -20 -183 -174 -89 -114 -45 -63 74 -78 -55 241 -202 -136 188
2184A88k87L03l64q0L18j00p2J27j07J85j5rn1P8j89P5N9J2r1l01L66j41l1l5
$$ 188 -99 204 -160 -240 78 -22 -94 33 -74 111 96 87 36 114 -75 0 59 71 -20 -321 45 -96 -127 -162
2208a62K65l2m7j7l3L3j36P2qJ50k67M41l95J48j18RJ9L43j53L7j87j20K33l2
$$ -162 103 71 24 7 -26 7 -129 -57 -65 85 -182 259 -136 12 -106 -97 -78 265 112 149 -38 -158 75 43
2232D3mj40K16j51o9LL62o2k42q0P0R0Q0q8j33K27j70P9J8O5N1k66K17ll00K88
$$ 43 39 -101 115 -36 -105 -102 260 198 -44 -124 -54 36 116 28 -105 122 -48 31 49 114 165 -101 116 113 -187 101
2258A01KJ7n2k30J41k2J45j02j59PK53k20P3L92m26L7J37k85J16J19K02k92K03
$$ 101 103 120 68 -162 -21 -43 102 0 -159 -152 101 -119 -46 346 -80 -43 94 -191 -75 44 246 -46 157
2281A57j11l0O1j83n3j18n0L75J78j81k16K34p8J69q8j78J67k24K4J5J55j00P3
$$ 157 46 16 77 -106 -159 -277 -327 48 226 45 -171 63 -15 154 66 -112 55 -169 -145 -130 25 -75 -2
2304bk05K52k45o1L94k32L36k12o9j27J01O2M5q0K42j12j74L7J64k30j15J10P5
$$ -2 -207 45 -200 -261 133 -99 237 25 -44 -171 -70 -8 37 -43 199 87 -87 -50 114 -116 -231 -121 -46
2327d6J07L3q1Q7om03L68M6J00k69J24l0l7J09q7K0k56M74l23K32n1K3q8j66R4
$$ -46 61 94 13 100 94 -309 59 105 205 -64 60 30 -7 102 15 35 -221 253 -70 162 111 134 46 -120 -26
2352b6L0Rj67j03M43R7k96k8J29k08J80J35m5k5O6k13R7l09L58R7j11k27J43%
$$ -26 4 13 -154 -257 186 283 -13 -41 88 -120 60 195 150 125 191 -22 75 -234 124 221 110 -117 26 26
2376B6l52L13J9jM9m0j96N0k0o2J06N0m8K21j03j10j4J13j86o3M34m5r1jMn1j00
$$ 26 -326 -13 6 5 54 14 -182 -132 -152 -214 -108 -58 -106 115 12 -98 -112 1 -185 -248 186 141 50 49 53 2 -98
2403i8J32J59k72J65L9l48L70J04l08J65k70K73p4k32M5R4J84k77P8j44L97l57
$$ -98 34 193 -79 86 125 -223 147 251 -57 108 -162 111 37 -195 -150 -56 128 -149 -71 -215 182 -175
2425a75J25K8j73J77K13k12J26j98j74K92J34j93L7k18P3J74n3R4k5q6J82j24
$$ -175 -50 -22 -195 -18 195 -17 109 -89 -263 29 163 -30 7 -211 -138 36 -17 77 52 -34 148 24
2447B4k02J47M7jQJ64r1O6l1j59J00j97J22PP8K80l29k65L09J83k01l49M19o6
$$ 24 -178 -31 16 15 23 187 96 162 131 -28 72 -125 -3 4 82 362 33 -232 77 260 59 -290 129 63
2471F3k09J13j91P1R3K36M6k30Q8oj38o5N4j70M31j7j27j96nJ94r5P7J85j47o8
$$ 63 -146 -33 -224 -153 -60 176 222 -8 80 74 -64 -129 -75 -245 186 169 42 -154 -159 35 -60 17 202 55 -13
2496a3o2N9J37k45K78R6J85j17l61K63n6k91K41P4l92L15J13k03Q0j54PJ07j72
$$ -13 -75 -16 121 -124 154 250 435 318 -43 220 164 -127 114 188 -204 111 224 21 101 -53 -46 61 -111
2519a11L25k12K04l35J15M5O6j0j53K50l79K05j90j1M59l28j10j41K73K35j79
$$ -111 214 2 206 -129 -14 31 97 87 -66 184 -195 10 -180 -191 268 -60 -170 -311 -38 197 18
2540A8j04J90N4l42O5K46j73j39N9J32m0RN7J30j12J9J28j33Qj34NK40k44K4J28
$$ 18 -86 104 158 -184 -119 127 -46 -185 -126 6 -34 -25 32 162 50 69 197 64 72 -62 -57 183 -61 -37 91
2565I1j75lK69k10j84L74j16l51N22l64P7n5l8J18j17M14n8k02j1P7o6q9L57k62
$$ 91 -84 -87 182 -28 -212 162 46 -305 217 -147 -70 -125 -163 -45 -162 252 194 -8 -19 58 -8 -97 260 -2
2589bJ96q2J20n4k68O0M13n29J35j30M63n69J27J31Q2k14J40j66J38j72JK61j02
$$ -2 194 112 232 178 -90 -30 383 -146 -11 -141 322 -247 -120 11 93 -121 19 -147 -9 -181 -180 81 -21
2612b1%M3%j78M20j18Lj4j08J92j12k07R4J10l10K06q3K46k30k60K24R2L05n97
$$ -21 -21 22 22 -156 264 146 149 135 27 219 107 -100 -6 104 -206 0 -83 163 -67 -327 -103 -11 294 -303
2636c03J77N7k8J30j58K06O3O4j74J2N4j3J08j94k31K35k10J20L8j49J33J46l41
$$ -303 -126 -69 -97 33 -125 81 144 208 34 46 100 87 195 1 -230 5 -205 -85 -47 -196 -63 83 -258
2659b58j4K76J78O0l92p0L00k8n1J01O2j09Q0j96j67J41J28j95L92k65P3l31M77
$$ -258 -272 4 182 242 -150 -220 80 52 1 102 164 55 135 -61 -228 -87 41 -154 238 -27 46 -285 192
2682A92k95J36PL1L2j70N1mJ60Ok37J34l5j3K04j29J27j08j54j94M40k95J64K16
$$ 192 -103 33 40 71 103 -67 -16 -20 140 146 -91 43 8 -5 199 70 197 89 -65 -259 181 -114 50 266
2706B66m27j11J51N0p3J74J1k77J52j36K20J00q4j23j73J13k5J31j04r0N71m12
$$ 266 -161 -272 -121 -71 -144 30 41 -236 -84 -220 0 100 16 -107 -280 -167 -192 -61 -165 -255 316 -96
2728i6K74k48PJ62k74L20l74M54l97Q6PN5J68j92J38o1j83K29k6k65K53j39KJ13
$$ -96 178 -70 -63 99 -175 145 -229 225 -172 -86 -79 -24 144 -48 90 29 -154 75 49 -216 37 -102 -100 13
2752A3j06K09q4J44o3m9j5Q6j85p4Q3j10J24J53j82P8k11K10l8o7K59m35K04j96
$$ 13 -93 116 32 176 113 64 49 135 -50 -124 -41 -151 -27 126 -56 22 -189 21 -17 -84 175 -260 -56 -252
2776b52N05k06J23J83n06K74k76K77m48N35j21Q4k24j1K06k7N4k71J72O3l4l11
$$ -252 253 47 170 353 -153 121 -155 122 -326 209 88 172 -52 -63 143 116 170 -101 71 134 100 -211
2798b11Q9l3Q2jK0p2O9N8j50K92q9J28j69j44p8J04R7k20J94L4l50L92K49j84
$$ -211 -122 -155 -73 -74 -54 -126 -57 1 -149 143 54 182 13 -131 -209 -105 -8 -228 -34 0 -350 42 291 107
2822A07m4j58K30R9m65J10K30O8l43L49k21QJ32M2j2j6N3j67R4q9P5j41j26J70
$$ 107 63 -95 135 234 -231 -121 109 177 -166 183 -38 -30 102 144 132 116 169 2 96 7 82 -59 -185 -15
2846a5J00j99J64j67RM9P6r5J76k0J21l30j22K16J42j31J64n9K2k32j11K85j87
$$ -15 85 -114 50 -117 -108 -59 17 -78 98 78 199 -131 -253 -37 105 -26 138 79 101 -131 -242 43 -144
2869a44P4r4J19L0r6J52q1m7P9M8j6R1j28K06j03kj79r2K08R4j94K07j73o9J26
$$ -144 -70 -164 -45 -15 -111 41 -40 -87 -8 40 24 115 -13 193 90 88 -91 -183 25 119 -75 132 -41 -110 16
2894A6j48J29j35K20P1J32k55j29J91j59K3J30j3p5M3l5j53o0J88N5j39L80k00
$$ 16 -132 -3 -138 82 153 285 30 -99 92 -67 -44 86 73 -2 41 6 -147 -207 -19 36 -103 277 77
2917G7L5j21P0j81K00j02J10m3K17k01l42L00K42l25K07j44k49M26k4j83j86L18
$$ 77 112 -9 61 -120 80 -22 88 45 262 61 -281 19 261 -64 143 -1 -250 176 152 -31 -217 101
2939A01l49L15k68K40l9O0j26P1J11l01M05o9k30K09j39K68k36lO7k17r8N5J83
$$ 101 -248 67 -201 39 0 60 -66 5 116 -185 220 151 -79 130 -9 259 23 20 87 -130 -228 -173 10
2962A0j8K55j66j0k4R3o1M9j87K2m6j78%K59K5K06l2j43k3j27N9J25%k2r3J27
$$ 10 -8 247 81 71 47 140 79 128 -59 -37 -83 -261 -261 -2 23 229 197 54 31 -96 -37 88 88 66 -27 100
2988A00p8Q2n1m4M8N9j05k26J49K3L8j39L05k37J1J95j32l30M48k51K9J81L38
$$ 100 22 104 53 9 57 116 11 -215 -66 -43 -5 -144 161 -76 -65 130 -2 -332 116 -135 -106 75 413
3011D13k15n32R5K13J36l5l5J31m78N08l29j9N01l70J28r6k24Q8M15n05j1K29
$$ 413 198 -334 -239 -26 110 75 40 171 -307 201 -128 -147 354 -16 112 16 -208 -120 295 -210 -221 8
3033HJ49j69k18J35K54l41j60L11k42M3N09j61k60L21l71O8P3k6K34k24Or2J53
$$ 8 157 -12 -230 -95 159 -182 -342 -31 -273 -230 279 118 -142 179 -192 -124 -51 -77 157 -67 -61 -153 0
3056@lMM2Lm6J45J6l71L47n0L0j39p4Q8L3J06N8q6n5k43J22j56J67K7k19J93J79
$$ 0 -3 1 43 46 0 145 161 -210 137 87 117 -22 -96 -8 25 131 189 103 48 -195 -73 -229 -62 -35 -254 -61 118
3083A18m45K68J92k35O2K57m03K05J06k52J0J15lj63j15N44k03J15m32J9N24k62
$$ 118 -327 -59 133 -102 -40 217 -186 19 125 -127 -117 -2 -5 -168 -283 261 58 173 -259 -240 284 22
3105B2j22K07J10j10k15Q1q9J78j67L79l30J37m24K79q4P8K49l59L56j87l7k46
$$ 22 -100 107 217 107 -108 -27 -116 62 -105 274 -56 81 -343 -64 -148 -70 179 -180 176 -11 -48 -294
3127b94J27k06M35m20N61k47O5M9j64O8J29J56k75q2K29l10J15J16L51n82J64
$$ -294 -167 -373 62 -358 203 -44 21 70 -94 -26 103 259 -16 -98 131 -179 -64 52 403 -179 -15
3148a5m0R3m1o4J54P9k78K07k30L03j39J82j03j99L01l04j44N0N2K95k05J70o
$$ -15 -55 38 -3 -67 87 166 -112 95 -135 168 29 211 108 -91 210 -94 -238 -188 -136 159 -46 124 118
3171A18j82rO3m9J26J96k69Q9j39K0j32J15J90m15J25J78J9j2J47n26M95l25j35
$$ 118 -64 -73 -10 -59 67 263 -6 83 -56 -36 -168 -53 137 -278 -153 25 44 32 179 -347 148 -177 -312
3194c12L75J89r9j47O2l16M01o8j41j5j54L43l28M43j93O2j19J1K9j68K85Rj44
$$ -312 63 252 153 6 68 -248 153 85 -56 -71 -225 118 -210 233 40 102 -17 -6 23 -145 140 149 5
3217EK44k94J62j14j20J69Qj24o6Q7J84j32R3O3m9k93K42r7P3n3j73L39K0j15
$$ 5 249 -45 117 3 -117 52 60 -64 -130 -43 141 9 102 165 116 -177 65 -32 41 -12 -185 154 174 59
3241E9j30j0L96k86k20L77J5j86j72J28J6J03k98K31m5K9J60l42J60N5O2J43n7
$$ 59 -71 -81 315 29 -191 186 201 15 -157 -29 -13 90 -208 23 -22 7 167 -175 -15 40 102 245 188
3264A88k96K33j56R6Q2k74K27k83J21p4R4O4L86l98k12Nn1J80K91K0r1l2k3L8
$$ 188 -108 125 -31 65 147 -127 100 -183 -62 -136 -42 22 408 10 -202 -197 -248 -68 223 243 152 120 97 135
3288A35j04Oq3J75k01m6J13J54l03L2J24Q4%k8o1J3M7k7J52j40k7J63l16K76k24
$$ 135 31 37 -46 129 -72 -118 -5 149 -154 -122 2 86 86 58 -3 10 57 30 182 42 15 178 -138 138 -86
3313h6J02k33K30o7j89L57j39K29k39j29J74j56M5L75k02l5J40N2l07L51l0l72
$$ -86 16 -217 13 -54 -243 114 -25 204 -35 -164 10 -146 -101 274 72 37 177 229 -78 273 243 -129
3335a29J95Kj14L36j95N2k41K06j20r0l2R7J22J2j25L29l06j3K0J0j10J82r8J23
$$ -129 66 68 -46 290 95 147 -94 112 -8 -98 -130 -33 89 101 -24 305 -1 -14 6 16 -94 88 -10 113
3359A13k99K30J30l27r0M18Jj30l9q2K1O1K67k85K67l07J02P2j69j28R5J35J4
$$ 113 -186 44 174 -153 -243 175 176 46 7 -75 -54 7 274 -11 256 -51 51 123 -46 -174 -79 56 70
3382G0l09P09m54K21l15J55j99J16j8m5j02J90j45o1L36jj14j4M5K23n22K37l
$$ 70 -239 470 16 237 -78 77 -122 -6 -24 -69 -171 19 -126 -187 149 148 34 20 65 288 -234 3 0
3405@p0J85N6j15m0N4j40K43k39R8j02J28J63O1l44M1r5J87k74O7K86j02k01J53
$$ 0 -70 115 171 56 16 70 -70 173 -66 32 -70 58 221 282 -62 -21 -116 71 -203 -136 150 48 -153 0
3429@J26j51p3P5Q4L7K3k97M14k47J14k2j61K45j07Q0j17k23J77J83l85L31R3
$$ 0 126 -25 -98 -23 61 98 121 -176 238 -9 105 83 -78 167 60 140 23 -200 -23 160 -225 106 199
3452A99k02J82k33L3l4n5P3P1j36J84k19%j82O50k26l2n6j09Q1J40l9q8J2l24
$$ 199 -3 179 -54 -21 -55 -110 -37 34 -102 82 -137 -137 -319 331 105 73 17 -92 -11 129 90 2 14 -310
3476c10K58j44K29J24l6j38K14n2j87M5j93K50J9l04K05QK16m4j94M2r3k4L07
$$ -310 -52 -196 33 157 121 -17 197 145 -42 3 -190 60 79 -225 -20 -12 204 160 -34 8 -85 -109 198
3499A98j42r9J22j41J38j30J19R8j71j33p6L12k71K35J47M4l7j93l38L94j4o3
$$ 198 56 -43 79 -62 76 -54 65 163 -8 -141 -217 95 -176 59 206 250 213 20 -318 76 62 -1
3521ak18K91j67J45M8J52l36J5L5j1j57K16J48k94J19np0Q1l7O0l3J72k15N5j38
$$ -1 -219 72 -95 50 98 250 -86 -71 -36 -47 -204 12 160 -134 -15 -20 -90 -9 -46 14 -19 153 -62 -7 -145
3546a45J40M04l06j31L25j87j49K30rk70J20J20k98J87k11J55N6p8J33l15J37
$$ -145 -5 399 93 -38 287 100 -49 181 172 -98 22 142 -156 31 -180 -25 31 -47 86 -229 -92
3567i2J18K54l31J76j30M0k34K16O4r1r1m5L14l37L32l46O3K79j77J61j36J93
$$ -92 26 280 -51 125 -5 35 -199 17 81 -10 -101 -146 168 -169 163 -183 -120 159 -18 143 7 200
3589B00k56q4J90r9L05o2J8M4pk22k2j32M4L56o33M95j14J08p1P2J64l49L6K61
$$ 200 -56 -140 50 -49 256 194 212 256 249 27 5 -127 -83 273 -360 135 21 129 58 130 294 -55 -19 242
3613B42n69M30p9L8o5Q2k2k78J78M2l1L5J72q9r8j40K94J5l06K28l0k22J97oL
$$ 242 -327 103 24 62 -3 79 57 -221 -43 -1 -32 3 175 86 -12 -152 142 157 -149 79 49 -173 24 18 21
3638B1j4jk62L31p3K80q1k75J86r5jJ03k80M9O6N01l50q0j73K67J66o4j9n5J10
$$ 21 7 6 -256 75 2 282 201 -74 112 17 16 119 -161 -112 -46 455 105 25 -148 119 285 221 202 147 257
3663B57l02j54O8J38j18J48j61M45j84k14j08M74k03k3rp4K05m98L87J1p1j32
$$ 257 -45 -199 -131 7 -111 37 -124 321 137 -77 -185 289 86 63 54 -20 185 -313 74 85 14 -118
3685a18L35k78Q1j78M37m27j24P7K22J25l7k80m4R2L65l03J82j5k84K13j27J64
$$ -118 217 -61 20 -158 279 -148 -272 -195 27 152 115 -165 -209 -117 248 -55 127 112 -172 41 -86 78
3707G8K82l92j11K44l03J75l09K61Q0q8J82k6K7j02J31l6k68L34j45q3L1K25k30
$$ 78 360 -32 -143 101 -202 -27 -336 -75 5 -83 99 73 100 -2 129 93 -175 159 14 -69 -38 187 -43
3730d3K7o7R8n0N3Q9j93K55j78J49k73K47q4qQ9j78R3K2k38O7K9K42j11J37l7
$$ -43 -16 -83 15 -35 18 107 -86 169 -9 140 -133 114 30 22 111 -67 26 48 -190 -123 -94 148 37 174 137
3755A37l34J78j11J13j33Q3J07j44m6K79n5Q4j41j49N04q3k49j64N1K60J13j33
$$ 137 -197 -19 -130 -17 -150 -67 40 -104 -150 129 74 158 17 -132 372 289 40 -124 -73 187 300 167
3777A67k6l18J43n0K97L2k48k5r4L5l7K52O2n6k35O7L26l72k6J58l98M73J0n6
$$ 167 141 -177 -34 -84 213 245 -3 -28 -122 -87 -124 128 190 134 -101 -34 292 -80 -106 52 -346 127 137 81
3801H1n9K06r7j46P7j91J21j20lJ00J67k50L42j45p6K11n39K0M03J0k37J93P1
$$ 81 22 228 131 -15 62 -129 -8 -128 -131 -31 136 -114 228 83 7 218 -321 -301 102 112 -125 68 139
3824A39k39K83o2p7l3J26j59J5K83k38M0j73Q1k08L88j19j29N8k0K5l18J43L15
$$ 139 -100 183 121 44 11 137 -22 -7 276 38 78 -95 -14 -222 166 47 -82 -24 -44 -19 -337 -194 121
3847A21k48K13o1r6j8R9p9j20N03l13K01l56J47l27K83K54n49J50J40J83k21N6
$$ 121 -127 86 25 -71 -89 10 -69 -189 314 1 202 -154 -7 -334 -51 203 -346 -196 -56 127 -94 -38
3869c8J77k41L11j14j58J46k4j17L7m0k2j07J86j29O6j23J11p5J76K52m86L73
$$ -38 139 -102 209 95 -63 83 59 -58 -21 -61 -83 -190 -4 -133 -67 -190 -79 -154 22 274 -212 161
3891A61j80j5L3Q7j32K19n6l30K50j14j23L76N3m24L00r8qj23R6k05J13j26J36
$$ 161 -19 -34 -1 86 -46 173 117 -213 37 -77 -200 176 229 -195 105 7 -1 -124 -28 -233 -120 -246 -110
3914a10K47l45J89m3qQn5%oK14k92J47J22q9L12j97J30j85N4n5r8K00j75m2J52
$$ -110 137 -208 -19 -62 -70 -62 -117 -117 -123 91 -201 -54 68 -21 291 94 224 39 93 38 -60 140 -35 -77 75
3939G5K95m35J20nk31K02M7k17MJ78j92J5l0J03J6J30N1j43J57J02k50N7j22J39
$$ 75 370 -65 55 50 -181 21 68 -149 -145 33 -159 -144 -174 -71 -55 75 126 -17 140 242 -8 49 -73 66
3963F6J4j56J36j89K01k22K33k1m1j96J3R6r9J40l10O39j08j87J40o4l66K89r4
$$ 66 80 -76 60 -129 72 -150 83 62 21 -175 -162 -66 -165 -25 -335 304 196 9 149 85 -281 8 -86
3986h6J75K4l29L68j89k6j0J3L62l12Q4J20L0k40K18l81J16J83j69K46m5j19m0
$$ -86 89 113 -216 152 -37 -63 -73 -60 302 -10 74 194 224 -16 202 -179 -63 120 -49 197 152 33 -7
4009gK02j36J03j25j72K53l11J16K19k96L24k17q5J07k07K92K2j88J01J37k48
$$ -7 195 59 162 37 -135 118 -193 -77 142 -154 170 -47 -132 -25 -232 60 82 -106 -5 132 -116
4030a16J61j84K85m4l05n7K05J99m3L9k21J8J28q4k65M70P0n3p5j46lk22J98O8
$$ -116 45 -139 146 102 -203 -260 -55 144 101 140 -81 -63 65 -19 -284 186 256 203 128 -18 -21 -243 -45 23
4054B3k38K79l32K06k55M62k18M1P2K17l93K74p0K5j12Q3kk05J43j70K8p9J0K55
$$ 23 -215 64 -268 -62 -317 145 -73 -32 40 257 -136 138 68 93 -19 64 62 -143 0 -170 -142 -221 -211 44
4078D4M6k39L59l18J51K06k76J01j15j22M3K00o1K14k85J74P4l25O7K00M2Om30
$$ 44 90 -149 210 -108 43 249 -27 74 -41 -163 -120 80 19 233 -52 122 196 -129 -62 138 180 186 -244
4101b44J05k67K80J78R3k22j0k44L04O5m4P3p6j62L23Pj20l41K10J43k58K96j64
$$ -244 -139 -406 -126 52 145 -77 -87 -331 -27 38 -6 67 -9 -171 152 159 39 -302 -92 51 -207 89 -75
4124g5J74J33j89K43l71p4K95J8q4Q3K6l32J17Q3N0o6l4k50J02K27k8j2j52q2
$$ -75 99 232 43 286 -85 -159 136 154 70 153 179 -153 -36 47 97 31 -3 -253 -151 76 48 36 -116 -198
4148a98L74l48K07j02n0M08l65M9J16%o5j2q6K79l38K86k21J22O5k8l39M18j84
$$ -198 176 -172 35 -67 -117 291 -74 -25 91 91 26 14 -72 207 -131 155 -66 56 121 93 -246 172 -12
4171a2L6l9n1Q4l5m9j03j37K88J55l44K32j59J54k35J59j65M09k54k09j15K03
$$ -12 24 -15 -66 18 -17 -66 -169 -306 -18 137 -207 25 -134 20 -215 -56 -221 188 -66 -275 -390 -187
4193a87K81k25P0j8J88l17K16l2O6L06k22l5k29j14K55l6j7K17p9k23nM2L44k99
$$ -187 94 -131 -61 -79 109 -208 8 -24 42 348 126 91 -138 -252 3 -33 -50 167 88 -135 -140 -98 246 -53
4217e3M9j45o2N5L26j01m4J97p2k37O6k49J96K01j29M0o4J68k60J90k05J11J4
$$ -53 -4 -149 -211 -156 170 69 25 222 150 -87 -21 -270 -74 127 -2 38 -26 142 -118 72 -133 -22 -8
4240hJ7J94k62r8L78r5k08J56rj81O2m4K18j90K07k79J0J44j46J90Q4l46R5K91
$$ -8 9 203 -59 -157 221 126 -82 74 65 -116 -54 -98 120 -70 137 -142 -132 12 -134 56 140 -206 -111 180
4264A80k52k8p2L4K05j77l1L29k99K60k68L51j66Q1J00k05l1l20K74r1j5J84O0
$$ 180 -72 -100 -172 -138 67 -110 -141 188 -111 149 -119 232 66 147 247 42 11 -309 -35 -126 -141 43 103
4287A03j07J02k76O86n58k53L60j49J21L31m55K70m31J11L09l36M43q3m82K87
$$ 103 -4 98 -178 508 -50 -303 57 -92 29 360 -95 175 -256 -145 164 -172 271 188 -294 -7
4307gl3K3pL92m68k4P3j25J88p2P0m6j15K82O3k61q6M5L08n9k27kL9K89k24J47
$$ -7 -40 -17 -24 368 -100 -124 -51 -176 12 -60 10 -36 -151 131 194 -67 -153 -108 200 141 -86 -88 -49 240 16 163
4333A63J4k77OK0j87K64j87Q3J67l83J49M97l93m8J70J06j32K15n4l4o4l52K66
$$ 163 177 -100 -94 -74 -261 3 -184 -101 66 -317 -168 329 -64 -112 58 164 32 247 193 159 95 -257 9
4356IP3n5Q1n0J7j17O6L9j0R6r9j93K58j52r6J74J4j83L65j97j18J65N7j59O6
$$ 9 82 27 108 58 75 -42 24 63 53 149 50 -143 115 -37 -133 41 55 -128 237 40 -78 87 144 -15 51
4381E1J12l73K73j67R3K40n01P6kJ85O5N2l8j56m8J24J18k0p0jj62M40j3m1j56
$$ 51 163 -210 63 -104 -11 229 -272 -196 -198 -13 52 104 66 -90 -138 -14 104 84 14 13 -149 291 278 237 81
4406H1N4j57N4L39l31k24jK52Q9Kl34L33J2j32j51K22j70N1NJ80j55R6rJ26j91
$$ 81 135 -22 32 371 40 -184 -185 67 156 158 -176 157 169 37 -114 108 -62 -11 -6 174 19 115 106 232 41
4431D1j08j15K17L5l2MJ29k63K76m00N9K24q4P3KP8k78J72j22j38L39k63J84j98
$$ 41 -67 -182 35 70 38 42 171 -92 184 -216 -157 67 -17 56 58 136 -142 30 -92 -230 109 -154 30 -168
4455a68K23M3l23K82r1lM8J39J80m41n5L49n4k91K0J88k04M7nJ23q5J18K51k89
$$ -168 55 98 -225 57 -34 -37 11 150 330 -111 -166 183 129 -162 -142 46 -158 -111 -116 7 -78 40 291 2
4479Bo1L3N0j36J24M7k20K69J8k07J0K05J17k03K6n6L2N1M6k32M3K90k65mj05
$$ 2 -59 -26 24 -112 12 59 -161 108 126 -81 -71 134 251 48 74 18 50 101 147 -85 -42 248 -17 -21 -126
4504a26J47J96p2j81J56l76M38J08n82K89j14oK01q1J42r8k53J68J30K4m3o3R9
$$ -126 21 217 145 -36 120 -256 182 290 -292 -3 -117 -123 78 -3 139 41 -212 -44 86 110 67 4 103
4527A03j71M3Q9lr2r8J30N3m7Q8q3r3r4l6Q3K5Q8m6P4o7J7k19K02J00P7j17K0
$$ 103 -68 -25 64 61 -31 -129 1 54 7 95 12 -81 -175 -211 -128 -103 -15 -61 13 -54 -37 -256 -54 46 123 6 26
4554B6J16k26J67J00k59j62K84O2l75L05j1p3j34K05K95J11l21K6k87L97l03Q4
$$ 26 142 -84 83 183 -76 -238 46 108 -267 38 27 -46 -180 25 320 431 110 136 -151 246 -57 27
4576B7K71n97K58K1m2r4J37J99L2k71J31j03p1J5M2n3J55j01J83k18N1Jp9K9k50
$$ 27 298 -299 -41 -20 -62 -156 -19 180 212 -59 72 -31 -102 -87 -45 -98 57 -44 139 -79 -28 -27 -106 -77 -327
4601c27K73J37N7j85p6lO5J70j83L00l44J58o9N9p5k15K90q0K8r7J88K6l9R1O5
$$ -327 -54 83 140 -45 -121 -124 -59 111 -72 228 -116 42 -27 32 -43 -258 32 -48 -20 -117 71 97 58 149 214
4626B14j68Q9j26O6j31J66qj65Q1j7l0j18o3J43k9J20k90J99k38K73J61J8r3M6
$$ 214 46 135 9 75 -56 110 102 -63 18 1 -29 -147 -210 -67 -96 24 -266 -67 -305 -32 129 147 54 100
4650A00k33R8L14m49K45R8j28r8K73k27p7K9O9O3N6k76L67j53k79L10k07K27k21
$$ 100 -133 -35 279 -170 75 173 45 -53 220 -7 -84 -55 14 77 133 -143 224 71 -208 102 -105 122 -99
4673i9P6K07l35J56J76k70L03n39K94r0J06J1N6R2l24J42m2L76j55j49J00l12
$$ -99 -23 184 -151 5 181 -89 214 -325 -31 -121 -15 -4 52 144 -180 -38 -80 296 141 -8 92 -220
4695b20K78o6J53l11K74R6k41n0J86J10j54K1l5l34K29J94q0J01K8n41L69j83
$$ -220 58 -8 145 -166 108 204 -37 -87 99 209 55 76 41 -293 -64 130 50 151 179 -362 7 -176
4717a76R4oJ60J85m71K52j85K84p6l30K09k6J46j00J26l09P5J36p6J49m8J16p1
$$ -176 -82 -88 72 257 -214 38 -147 137 61 -269 -60 -86 60 -40 86 -223 -148 -12 -88 61 13 129 58
4740E8Nj60qK59j80q5Q1L15m3j18l11J71J08L3%j40m9J42R2P3l16K10j97p1kJ38
$$ 58 63 -97 -105 154 -26 -111 -30 285 242 124 -187 -16 92 125 125 -15 -64 78 170 243 -73 137 -60 -131 -133 5
4766En5Jj10K19l1j65K39m4J20j86o7j34K36PJ18j49j20K05j98M14o5m10J01J22
$$ 5 -50 -49 -159 60 29 -136 103 59 179 -7 -74 -208 28 35 153 4 -116 89 -109 305 240 -170 -69 53
4790E3k79L88k71K41n4j7K0j36M5J45J06m18J75J38Q7l89J73O8l09K59j61j39
$$ 53 -226 162 -109 132 78 61 81 -55 -10 135 241 -177 -2 136 223 -166 7 75 -234 25 -136 -275
4812b75Q6M18k80L29l49o1J2K03k47J46P2j25L15k44J18j89q9N1m5K10p9J21l6
$$ -275 -189 229 -51 278 -71 -132 -120 83 -164 -18 54 -71 244 0 118 -71 -160 -109 -154 56 -23 98 62
4835F2O2o3pK03n19N16k62j39K56j20J08m04M10R5j82J15j74K2l8L0J91j31l5
$$ 62 124 61 54 257 -262 254 -8 -147 109 -11 97 -307 103 198 16 131 -43 -21 -59 -29 162 31 -4
4858dK92k54P9N0r6k1j46KQ8N6k91K02k03J79J98l4j68l7M4O9k26L85J47l42R0
$$ -4 288 34 113 163 67 46 -100 -98 -10 46 -245 -43 -246 -67 131 97 -71 -108 -64 5 -221 164 311 -31 59
4883E9M9j57RL3o6M7j4J58k03Q0J78p2j28J03J13l4l4k36J51K92k81k07K58p7
$$ 59 108 -49 -40 -7 -73 -26 -40 118 -85 -5 173 101 -27 76 189 155 121 -115 36 328 47 -160 98 21
4907B1n9l8RK89l60K15j6L2j18J16Qk58n8K67j23L9J21Q8k71L28l57J73o6Q5J11
$$ 21 -38 -76 -67 222 -138 77 61 93 -25 91 99 -159 -217 50 -73 -34 87 175 -96 232 -125 48 -18 67 178
4932A78j2k80O6J5r3J89Pj63K36m9m55J26L87j11j15q4L72l07K94j9J8J61o38
$$ 178 166 -114 -48 -33 -126 63 70 -93 143 94 -361 -235 152 41 -74 -158 214 -93 201 182 200 361 -277
4955b77M75l15K8K81j16l13J22J69J37j58N4p8l69O1K47K9r6J08j49P3J4l9J24
$$ -277 198 -117 -89 192 76 -237 -115 54 191 33 87 9 -360 -299 -52 -23 -119 -11 -160 -87 -73 -112 12
4978A2L1k68J55J19q2J70l8K7j4q7q5k1K39P2l73N71k81l0j71k81J63J77M0j56
$$ 12 43 -225 -70 49 -33 137 99 126 112 25 -60 -81 158 230 -143 428 147 117 -54 -335 -172 5 45 -111
5002a11j65L45k36J70j16P5m2O0n4K25k76K07k87M8J18K06r2j37Q2N5L8k39K75
$$ -111 -276 69 -167 3 -113 -38 -80 -20 -74 151 -125 82 -205 -157 -39 167 75 -62 20 75 113 -126 149
5025A49k30Q2J40k87J03J0J0L7p9Q7J48m19L19j33j58K42k29k90N79j82j1k9K08
$$ 149 -81 1 141 -146 -43 -33 -23 14 -65 22 170 -249 70 -63 -221 21 -208 -498 81 -101 -112 -141 67
5048F7K6k03R2o7J68l9J8pJ29l56J27O4J08j96P5j22l6J71J61j36Q1k20M19j04
$$ 67 93 -110 -18 -85 83 44 62 55 184 -172 -45 19 127 -69 6 -116 -152 19 180 44 125 -95 324 220
5072B20k93K95k26J99l78L87K4l63R9j75J98o2K42j78J30pk1j16J94j47Oq2J96
$$ 220 -73 222 -4 195 -183 204 228 -135 -36 -211 -13 -75 167 -11 119 112 91 -25 169 22 28 -54 142
5095A42k21m1J55j50J80N1k49J88r0j29J66%j58J59j55M2n0lJ62J08k97J67Q3
$$ 142 -79 -120 35 -115 65 116 -133 55 -35 -164 2 2 -156 3 -152 -110 -160 -163 -1 107 -190 -23 60
5118F0J73l28q7p8o5L94j75K57k78J43K06l84K42m0k07K57j65J2P4J26m11R8K19
$$ 60 233 -95 -182 -260 -325 69 -106 151 -127 16 222 -162 80 40 -167 90 -75 -63 11 137 -274 -176 43
5141D3j06J09j59l0K75k47K4K54o5r5no1Q1J49j27o2L4o8K54l11k7L33k96J00
$$ 43 -63 46 -113 -143 132 -115 -91 163 98 3 -2 -63 18 167 40 -22 12 -56 198 -113 -140 193 -103 -3
5165cj60J21J49o2J71J50n38J39N1j56J95k81M19k17j06K0L8J09J83k44KQ4j88
$$ -3 -163 -42 107 45 216 366 -172 -33 18 -138 57 -224 195 -22 -128 -108 -70 39 222 -22 -20 64 -124
5188a24j33J34K77j14L5p2j28J73j96Nk5K97j08K33l77K08m46N09j88K2M7j52
$$ -124 -257 -123 154 40 75 3 -125 48 -148 -143 -168 129 21 254 -123 85 -361 148 -40 -18 29 -123
5210a23J52J05j97O9L1q9J25k15L4M3Rl9o5J42L27m72J40rL73k37Q5j46J8J12
$$ -123 29 134 -63 6 37 -52 73 -142 -108 -65 -56 -95 -160 -18 309 -163 -23 -32 341 104 189 43 61 173
5234A73j52N8K40l70J72k80L34j51K50k91P8L4k38K87l13L31l17J65j85K68j51
$$ 173 21 79 319 -51 121 -159 175 24 274 -17 61 95 -143 144 -169 162 -155 10 -175 93 -58
5255e8M5k10L41j68R3l9N0J98l45j52K68QQ1j78j24R9J46k52K57K71q6l60N3L89
$$ -58 -13 -223 118 -50 43 4 54 252 -93 -245 23 31 112 -66 -190 -91 55 -197 60 331 245 -115 -62 327
5279C27j75j26j59K01j60J14n6l3O9J84o4k77J91J88k61o7k4J28J57L1m69J04
$$ 327 152 26 -133 68 -92 22 -34 -67 2 186 122 -155 36 224 -37 -104 -128 0 157 188 -281 -177
5301a77rJ02K70l03J21O4M7m41L98l21L25J84k63J08j13K45m88K75j03P0O3k5
$$ -177 -186 -84 186 -117 4 68 115 -326 72 -249 76 260 -3 105 -8 237 -251 24 -79 -9 54 29
5323B9k5L8l77O47l76p0K22j95K0j24J31l9P7m9J35j05Q0j2r4o0J03J34k07K15
$$ 29 4 42 -335 312 -64 -134 88 -107 -87 -211 -80 -119 -42 -91 44 -61 19 7 -87 -147 -44 90 -117 98
5347I8q4L2J47j30o0N3n7j07J84j75K3J97j46j83J21O6MM2l1J3j74K74j50P0J99
$$ 98 14 46 193 63 3 56 -1 -108 76 -99 -76 121 -25 -208 -87 -21 -17 25 -6 7 -167 107 -43 27 226
5372B26k10O4MMj48K04J72k88mj18qk8L87k48J2l7k10L79j58j3k18R3K17r8L33
$$ 226 16 80 84 88 -60 144 316 28 24 -94 -102 -130 257 9 21 -16 -226 153 -5 -18 -236 -143 74 -24 309
5397C09m09L42l9k81M2J97k94N02k31k51R7l1q6K32p4p0q3J77K84l72J73m3j61
$$ 309 -100 242 203 -78 -36 161 -133 369 138 -113 -16 -47 -133 99 25 -45 -128 49 333 -39 134 91 -70
5420g0j1j11K2n2L61k22j15L86k44L59j93k36O7p8k22N92j53j92M1K09j93K00
$$ -70 -81 -192 -170 -222 139 -83 -198 188 -56 303 110 -126 -59 -137 -359 233 80 -112 -71 138 -55 145
5442A45M6j04k46KK46j44J83k28k2J45k75K92N4r3j18K68M9j22q2J63o2j68Q9
$$ 145 191 87 -159 -157 89 -55 128 -100 -122 23 -252 40 94 1 -117 151 200 78 -4 159 97 -71 18
5465A8j95M80n52K30M3j71K44n8oN8l9Km6R3J17k26L02k35J00k82j2K53m2k10
$$ 18 -177 303 -249 -19 24 -147 97 39 33 91 52 54 8 101 218 -8 294 59 159 -123 -135 118 76 -134
5489a34J57k29J59R5jQ4J77l87N5o4P2Q6j13j76M72l41J55m2q9o6K27Pj17l79
$$ -134 23 -206 -47 48 47 131 308 -79 -24 -88 -16 70 -43 -219 253 -88 67 25 -64 -130 97 104 -13 -392
5513c92J51L64q0K11j47j01k00P5L0J4J40k57K26M42o01R1R5k43M31P9l33O0q9
$$ -392 -241 123 43 254 107 6 -194 -119 -89 -75 65 -192 34 476 -125 -34 61 -182 249 328 -5 55 -34
5536c4J63l7P3o3jJ28J45m32Q6P5O8q5j24q8K18l06N02k23l2j14K08k23m1L7J65
$$ -34 129 92 165 102 101 229 374 -58 28 103 171 86 -38 -126 92 -214 288 65 33 -81 127 -96 -137 -100 65
5561F5j31N2l6L0J09j33j5L83l40K6l72L87k54J85j90K64k3m6R8k06N07m62J30
$$ 65 -66 -14 -50 -20 89 -44 -59 324 -16 10 -362 25 -229 -44 -234 30 7 -39 59 -147 360 -102 28
5584B8P2J65j52qO6l16K20j17j0M9J65k50J37J3k22J91M0M1m5L9l75J55K88O0
$$ 28 100 265 113 105 171 -145 75 -42 -52 -3 162 -88 49 62 -160 31 71 112 67 106 -269 -114 174 234
5608B34j87j34K71k77k81M64m09K92o3K54Q5j41J53m7j02j11K62p4j10J77P6j79
$$ 234 47 -87 184 -93 -374 90 -319 -27 -90 164 249 108 261 214 112 1 263 189 79 256 332 153
5630A53k20j39J20J39j98M31k76l2O7N5j66J55q6R6J47j38j59P6K74k21j11J15
$$ 153 -67 -206 -86 53 -145 286 10 -22 45 100 -66 89 3 99 246 108 -51 25 299 78 -33 82
5652H2L1mn3j03j99K28P6Q2j24o3L8J18p7R1j33O8q9K46j62j71J90J34l50K75
$$ 82 113 109 56 -47 -246 -18 58 140 16 -47 -9 109 32 123 -10 58 -31 215 53 -118 72 206 -144 131
5676A31k25m0K27RJ43k81J23O8n5n0n6j22m9M33q1l2k48J71K1o7j34J55p9J36
$$ 131 -94 -134 93 102 245 -36 87 155 100 50 -6 -128 -177 256 175 143 -105 66 87 20 -114 41 -38 98
5700I8K4j50K3O8K34r9l10J57k93k11N19j1j05K91l36Rj06L57j39j3j77K05O6
$$ 98 122 -28 -5 63 297 198 -112 45 -248 -459 60 49 -56 235 -101 -92 -198 159 20 7 -170 35 101
5723A01p3j48K02k42L11j69O0J96k42M5j12K43m00L04J09j56k8j78J36n2J7J00
$$ 101 28 -120 82 -160 151 -18 42 238 -4 41 -71 172 -228 76 185 29 1 -177 -41 -93 -76 24
5745B4J06P6k65K75l60j68M6J62K1J22P2k48J38j38k2J12J11o2J90r2k93K65n7
$$ 24 130 206 -59 216 -144 -312 -266 -104 -83 39 111 -137 1 -137 -159 -47 64 2 192 100 -193 72 15
5768A5j17M03l46J6p3O1K57k19q1N9q7JJ71k44R4n2R3lK73l07o8K01j21K32k5
$$ 15 -102 301 -45 -29 -102 -41 216 -3 -84 -25 -112 -111 60 -184 -90 -142 -49 -52 221 -86 -154 47 -74 158 133
5793A33Q8l92J32K07j36k2qkP1J19l36K21k07L6M0M9Q1k06R4n5p7l3L20L0j23
$$ 133 221 -171 -39 168 32 10 2 0 71 190 -146 75 -132 -96 -56 -7 74 -132 -38 -93 -170 -203 117 147 24
5818B4J84k22J07j22R5r5j13l5K26Q3j41o0l6K10R1p1k4J1j98j60K71j25M42k64
$$ 24 208 -14 93 -29 66 -29 -142 -177 49 132 -9 -69 -105 105 196 125 101 112 -86 -246 25 -100 342 78
5842G8l9j76J71Q7j31P1J2j72j00J67oK41n02K97J19j42k34K55k2L5O2j02m6r4
$$ 78 39 -137 34 121 -10 61 73 -99 -199 -32 -38 203 -299 -2 117 -25 -259 -4 -26 9 71 -31 -77 -171
5866a71J72K42j96J6k65n1L79m2lj46r1n7K69k67L41M2l37j0J55K08m06K58j49
$$ -171 1 243 47 63 -202 -253 126 84 81 -65 -156 -213 56 -211 130 172 -165 -175 -20 188 -218 40 -109
5889a09q0M40l18k13M09j8N7R0j07j26m2JN2n1J40l71L32M2o6M0l23K93rj05L4
$$ -109 -189 251 -67 -280 129 111 168 258 151 25 -17 -16 36 -15 125 -246 86 128 62 102 -221 72 63 -42 -8
5914hj47K55k94J65j47K24r2L27r8n10L35M5n8J76j34o6K34j80o1o0J77r6K20
$$ -8 -155 100 -194 -29 -176 48 -44 283 185 -325 10 55 -3 173 39 -27 207 27 -34 -94 83 -13 207
5937B07n5j85k4J49k83L40K7q6k28K89J48l50R5J34l2l62j7J34L14l73J3R6J98
$$ 207 152 -33 -57 92 -191 149 176 90 -138 151 299 -51 44 178 146 -216 -233 -99 215 -158 -145 -49 149
5960A49O0k82J05K16m14M0N3J61l8k66K74r4j53J6K64N7n6j28j68L96k63J23j28
$$ 149 209 -73 32 248 -166 -126 -73 88 50 -216 58 -36 -189 -173 91 148 92 -36 -204 192 -71 52 -76
5983g6K49l84M04j65P2j80j64J31o0K92j02j35J63m3K29j35k38o1J9J0J88P2j47
$$ -76 173 -211 193 28 100 -80 -244 -113 -173 119 17 -118 45 2 231 96 -142 -203 -184 -174 14 86 -61
6006f1J87l16J46mK20k55M9K9r7j00P2J90O7j05J29m10N11L2j33K1o7j05k01K81
$$ -61 126 -190 -44 -48 172 -83 -34 -5 -102 -202 -130 60 127 22 151 -259 252 284 151 172 105 0 -201 80
6030H0k16K19k29K10k58K60J60l90M53m05K96l99K84J43p6l22K62j5r9J05K06
$$ 80 -136 83 -146 64 -194 66 226 -164 289 -116 180 -219 65 208 132 -190 72 57 -42 63 269
6051B69k16nj72J11r1J51j36lm2J48q9O8j61J52J46k59K45p6J25k5o8j87Q2j58
$$ 269 53 48 -124 -13 -104 47 -89 -92 -134 14 -75 -7 -168 -16 130 -129 116 40 165 140 72 -115 -33 -191
6075a91K58l8K25l20J61pj26J92n6k7j80M15l29J88j59K58l13j22J5L22p5j21
$$ -191 67 29 254 -66 95 88 -38 154 98 71 -109 306 -23 165 6 264 -49 -171 -156 166 91 -30
6097c0k07J66l2J99K11l23q8J53n4K64n0o21O48O8k19M9q2k33K08l27L07J05k77
$$ -30 -237 -71 -103 96 307 -16 -104 49 -5 259 209 -412 236 304 85 134 52 -181 27 -300 7 112 -165
6120a65Q5K18j62N7j41L2j2p6J31L5J47L3k19kL12p78O08J04r6Q4J03k98j19L26
$$ -165 -80 138 -24 33 -108 -76 -88 -164 -33 2 149 182 -37 -39 273 -505 103 207 111 195 298 0 -119 207
6144B07j46j63L0Q5K07m80L34j98qK34j90j11J95M1k96J59K31N5j01K14l76J78
$$ 207 61 -102 -72 13 220 -260 74 -124 -132 102 -88 -199 -4 37 -259 -100 131 186 85 299 -77 101
6166A01j40j85M62j36k56K04j32K21oj01K3j77K05j85M8KK63R7k00m4j07K19j51
$$ 101 -39 -224 238 102 -154 50 -82 139 133 32 55 -122 83 -102 -54 -52 211 308 108 64 -43 176 25
6189B5k0j10K09k90p0L43j29K04l57L10Kj89M29k16j89p4O3P4k39J29K19k75L3
$$ 25 5 -105 104 -186 -256 87 -42 162 -195 115 117 -72 357 141 -48 -122 -59 15 -224 -95 124 -151 -118
6212a18j7K03M9pK8K13l72J42o5j04L19l56J00k37Q0j1N1j04L1J74N1r5K8j30
$$ -118 -135 68 117 110 138 351 -21 121 56 -48 271 -85 15 -222 -142 -153 -102 -206 -175 -1 50 -45 -17 -147
6236a47J04J62R3k09l6P7j23m1L21q0j43J82k26J10J67j26L9k35K67j90q0O2L05
$$ -147 -43 119 212 3 -33 44 -79 -120 201 121 -22 160 -66 44 211 85 124 -111 156 -34 -114 -52 253
6259B53n47M81m0k22j58K21%j54K23j41R5O0J29j12M1k14J85K3J77l35m8J41O7
$$ 253 -294 187 147 -75 -233 -12 -12 -166 57 -84 11 71 200 88 129 -85 100 123 300 -35 -83 58 125
6282A25o4l53N19k28k75K42J87k87K40j95J77J03k83K04n7J30l51K86l64K14R5
$$ 125 61 -292 227 -1 -276 -34 153 -134 106 -89 88 191 -92 112 55 185 -166 120 -244 -30 65
6303F5k51J20j01j52J65M49l32o5K12j23j92K47p6K35k1j66p7l9j6k7L25J72k48
$$ 65 -186 -66 -167 -319 -154 295 -37 -102 110 -13 -205 42 -34 201 180 14 -63 -102 -118 -145 180 352 104
6326A04j03j46J89k49K72M7k45L39K23m62oL8k31N13m47M65n15Q3K32j69j0MJ78
$$ 104 1 -145 44 -205 67 114 -131 208 431 -31 -37 1 -230 283 -164 301 -214 -131 101 -68 -78 -74 104
6349A04R2q2l29L26r0J0Om1Q8JJ57r3r2J49k02j07M17l05j0K2j58K83k53Q2n0
$$ 104 196 114 -215 111 21 31 37 -4 84 85 242 149 57 206 4 -103 314 9 -1 21 -137 146 -107 -25 -75
6374g5P1M8j21K37m6jj05j63K39j81J84p3mm9J31j87J61k6q7K00j83r5K58j98
$$ -75 -4 44 -77 160 114 113 8 -155 84 -97 87 14 10 -39 92 -95 66 40 -47 153 -30 -125 133 -65
6398f5K29j89N3j86K27k28J78m0Q5k54K23J31k06K5m5q7J02L54n32J37L85k78
$$ -65 164 -25 28 -158 69 -159 19 -21 64 -190 33 164 -42 -17 -62 -149 -47 307 -225 -88 297 19
6420A9r0M52j11m26L01j72j7Q8Q1k74K32p6N1j84p1K73k07J64j04N5o1p9J09M1
$$ 19 -71 381 270 -156 145 -27 -44 44 125 -149 83 7 58 -126 -197 76 -131 33 -71 -16 -77 -156 -47 -6
6444fJ89k84l4M0Q5J48k07j09M0N1q6J34q9J43j75K77J6n0j14J33j37m7J57k08
$$ -6 183 -101 -135 -95 -10 138 -69 -178 -138 -87 -173 -39 -128 15 -160 117 133 83 -31 102 -35 -82 75 -133
6468a33L1L08j31J5L6K0j73L6Oo7K2K14j33K27l84L1K7mJ63j76J0n9J50o9p5J7
$$ -133 -102 206 75 90 126 146 -27 9 15 -52 -30 184 51 278 -106 -75 -48 -52 111 -65 -55 -114 36 -33 -108 -91
6494i1R7O3M7k05p3J41J83k34R5p3J65J47n49K90K12k81kj06J46m1K50m8k90M22
$$ -91 6 69 116 -89 -162 -21 162 -72 23 -50 115 262 -287 3 215 -66 -68 -174 -28 -69 181 133 -157 265
6518B65k65P6p5n0kR3J93n58L08j24J39J32j52M9l8J99L8j49n1J43l92K55J02
$$ 265 0 76 1 -49 -51 42 235 -323 -15 -139 0 132 -20 29 -9 190 228 79 28 171 -221 34 136
6541A36l10L91l53K92p9m8J35K0j80J07j18j40Q8R1K1k6J42m28K65r5J96k24J8
$$ 136 -174 217 -136 156 77 29 164 184 4 111 -7 -147 -59 32 53 27 169 -259 6 -89 107 -117 -99
6564i9K02j98J86m5j28K15k25K69k42l2O2J13N1q6l07N3p4L46J66l59kJ99r8J78
$$ -99 103 -95 91 46 -82 133 -92 177 -65 -97 -35 78 129 43 -264 -211 -285 61 227 -132 -134 65 -33 145
6588A45l46J97O4Ol0j97L31Mj74m3K59K1l08J25Nj91K0J88J79k39J30Mr7j55l9
$$ 145 -201 -4 60 66 36 -161 170 174 0 -43 216 237 -71 54 59 -132 -112 76 255 16 146 150 53 -102 -141
6613a41J3j3L2J2J84k47K86j92J00R2l16J85j17J48j67K78k2j87J42k17r7J30
$$ -141 -128 -141 -109 -97 87 -160 126 -66 34 126 -190 -5 -122 26 -141 137 115 -72 70 -147 -244 -114
6635a14L83l79K35k3J9k60J22O6p6K10l82O7K86j07k99K72R6l1j97O4N2K04k30
$$ -114 269 -110 125 102 121 -139 -17 49 -27 183 -199 -132 154 47 -252 20 116 85 -112 -48 4 208 -22
6658b2J11L01l75j1qk29J66m6j1L12l24K26J1Por1j13J91j91k47K73J26r6J14
$$ -22 89 390 15 4 -4 -233 -67 -113 -124 188 -136 90 101 108 102 11 -102 89 -102 -349 -76 50 -46 68
6682F8j05MM07n87K00O2j68K92j55j86K48j18q0J41r4k9J04o7l5J24j76J88kK79
$$ 68 -37 -33 374 -213 -13 49 -119 173 18 -168 80 -38 -118 23 -71 -100 4 -63 -98 26 -150 38 36 315
6706C15n08l5K93j77J39j73K16O8J5j57q3k44L74P1m00J89J01j2K71n6r4l38M05
$$ 315 -193 -228 65 -112 27 -146 70 138 153 -4 -87 -331 43 114 -286 -97 4 -8 263 207 113 -225 180
6729A80j81K0P4nk92L64j45Q0k44K24o0M8j65J29k4m4r6J50J22l23N88k96m9J10
$$ 180 -1 19 93 88 -204 160 15 95 -149 75 15 63 -102 27 3 -41 -137 13 135 -188 400 104 55 165
6753A65j32J7j22R4o5J82n3O1L6k69J66L3M7l17J61n3R3m01L67N39o85P7K04j73
$$ 165 33 50 -72 22 -43 139 86 147 183 -86 80 113 160 -157 4 -49 44 -357 10 549 -136 -59 145 -28
6777b8l4O3k1L49o2k52j04M48m18O5K8M1r7j2N0N6j8j18J59k41j02K76J14j85
$$ -28 -62 1 -20 329 267 15 -89 359 -59 6 34 75 -22 -34 16 72 54 -64 95 -146 -248 28 142 -43
6801d3J58q1j92K00l30R6L7K20n0j27M5Q2K8k24m7M08l46J38o0J1j04M11n11L10
$$ -43 115 34 -158 42 -288 -192 -155 65 15 -112 -67 15 43 -181 -228 180 -166 -28 -88 -77 -181 230 -281 29
6825B9L05l88J95j64k91M06j58J34Q7k91l6L12l11O3J91j37R0j42J88m6J62k72
$$ 29 334 -54 141 -23 -314 92 -66 68 155 -136 -172 140 -171 -108 83 -54 36 -106 82 36 198 -74
6847g4l4J06m0J01K1j48k51N57n34P0K35J6k55p0K37N2rK7J8O9R2l07K7n0J64
$$ -74 -108 -2 -42 59 80 -68 -319 238 -296 -226 9 25 -230 -300 -63 -11 -20 7 25 94 186 -121 -94 -144 20
6872B0j83K50k08K93o9j52n1J16j16J08n0N2l10K49K27k05Q1j53J14r5K21J0k05
$$ 20 -163 87 -121 172 103 -49 -100 16 -100 8 -42 10 -300 -51 176 -29 52 -101 13 -82 139 149 -56
6895e6J6P9P2l59K46N8M0j82L81l63j76L74k8N6k55K61j81M6J1N9K16l20Q2Nj93
$$ -56 -40 39 111 -248 -2 56 96 -86 295 -68 -244 130 102 158 -97 164 -17 29 40 99 315 -5 77 82 -111
6920a11pJ9J28k63L54j30j97K66k08K7J20k2K06j80p3K74j73Qn2K40j89l61L3
$$ -111 -118 -99 29 -234 120 -10 -207 59 -149 -122 -2 -24 182 2 -71 203 30 38 -14 226 37 -324 -291
6943b91K63L6p8p9K26l18K32Nl6p9j13O3Q2j60M33j58J12j61j68J23j45J59p2
$$ -291 -28 8 -70 -149 77 -241 -9 -4 -40 -119 -232 -169 -87 -247 186 28 140 -21 -189 -66 -211 -52 -124
6966a24Q8l7P0j28l8K30R7M8l46L22j26m5P4J07k02P5n9j52j20J82P0J75m54L01
$$ -124 -36 -73 -3 -131 -169 61 158 206 -140 182 56 11 85 192 -10 65 6 -146 -266 -84 -14 161 -293 8
6990Hj07l2J25J22j53J62k94K20j32N0J03k42N04l32K6k4k73rK07n8J91j7Mj82
$$ 8 -99 -131 -6 116 -37 125 -169 51 -81 -31 72 -170 334 2 28 4 -269 -278 -71 -129 62 45 49 -133
7014a33K93j50j7p7n3N9j00p3K22K10l28P6J72k90R6L2oJ06J3K41l76J12o3N8
$$ -133 160 10 -7 -84 -137 -78 -178 -251 -29 181 -147 -71 101 -189 -93 -61 -67 39 52 293 -83 29 -34 24
7038B4J29j94R1J81m05J35M6j70J68J5O4j40L24n05K63Q1m9l4q5K01k88Q2j20
$$ 24 153 -41 50 231 -174 -39 7 -163 5 20 84 -56 268 -237 26 107 58 24 -61 140 -148 -66 -186
7061a86J83J13l58n5L52k7K62l08K0K26k53j08J37K56P5j47j46p0N2K0j0J1m2
$$ -186 -3 110 -248 -303 49 22 284 -24 -4 222 -31 -139 -2 254 329 182 36 -34 18 38 28 39 -3
7084cJ9q7J33k9M1k4Rl34J79K31j8l85J24L11j64j07K24m9k83K65J56o5l7j5r1
$$ -3 16 -71 62 33 74 50 59 -275 -96 135 117 -268 -144 167 3 -104 120 71 -212 53 209 144 107 92 1
7109Am5K20m38K14r0Q9L6p3J07j95M76j9j91m0J04mk11l0K58m41M12j16J3Jj66
$$ 1 -44 176 -262 -48 -138 -49 -13 -86 21 -174 302 283 92 52 156 152 -59 -89 169 -272 140 24 37 38 -128
7134a28j11M84k45K53m31K35o9q1M65k7n20P5M36l30L8r2J01k59L20j77Q4j71
$$ -128 -239 245 0 253 -178 57 -12 -93 372 345 -175 -100 336 6 44 -48 53 -206 114 -63 21 -150
7156a50J53L28m35l6J77j48K14o0l66K43k48K17o3q4K29K37l53qL0L08j45K33
$$ -150 3 331 -104 -140 37 -111 103 43 -323 -80 -328 -111 -174 -258 -29 208 -145 -153 -123 185 40 273
7178B73k39l4m5j08K17J17k4n3l44K02Mj47L98l73kl5M76j79k64K44j10J6k27
$$ 273 34 0 -45 -153 64 181 157 104 -240 -38 -34 -181 217 -156 -158 -193 283 104 -160 84 -26 -10 -237
7201b37N73j68l16K3R3K01j90l5J57k26L8K7m4N6mJ9J45j01R4j53j49J62M19m23
$$ -237 336 168 -148 -125 -32 169 -21 -56 101 -125 -87 -60 -104 -48 -52 -33 112 11 105 -48 -197 -35 384 -39
7225c9m1K9R5k2j22J87N5M6n5P7k23K50j02n6J43k02n9l9q9M16k53o4LJl4L26
$$ -39 -80 -51 44 22 -100 87 142 188 133 210 -13 237 135 79 222 20 -39 -78 -167 249 -4 -68 -65 -64 -98 228
7251B28j77j49Q1r7J89O2j79J3O3j53k49J47K58p7J3J05j91J18J03j8j85n9J18
$$ 228 51 -98 -17 -114 75 137 -42 -29 34 -119 -368 -221 37 -40 -27 78 -113 5 108 90 -95 -154 -36
7274c6j4p5J4M73m69J66j57K54j43J38l39J26K56p2k9l42L12k4J16l54J86J59
$$ -36 -50 -125 -111 362 -107 59 -98 156 13 151 -188 -62 194 122 93 -249 63 39 155 -199 -13 146
7296A46l54K72k18K31l26K84n5l48L33j13J92O6j23p4N4M9K06k51j18K6J26M64
$$ 146 -208 64 -154 77 -249 35 -20 -368 -35 -148 44 110 -13 -87 -33 16 222 -29 -147 -121 5 469
7318D69k41k54j46K59Mj57J15k66M56l81P8J81k84M6J84j05O1J15k20J48k8j52
$$ 469 228 -26 -172 87 91 -66 49 -217 239 -142 -64 117 -167 -121 63 -42 19 134 -86 62 34 -118
7340a18k7N37n98J79Q7Kj6j58O8J24j90K65K31l53R6j33KN1r9j55J26l4L4M8P2
$$ -118 -145 392 -206 -27 60 62 46 -112 -44 80 -110 155 386 33 129 -4 -2 49 -50 -205 -79 -113 -79 -31 41
7365D1J4l33K3K93K49k05m8q0QJ01l43J67K73O2j94M4j90L69k84J12L3L15n94
$$ 41 55 -278 -255 38 287 82 34 -46 -38 63 -280 -113 160 222 28 72 -118 251 -33 79 112 427 -167
7388a67K1lL03K50m08J32J8j85j80J93o8o0j5L0J79j51R5m8K48q1k02L68j39J70
$$ -167 -146 -149 154 404 -4 128 146 -39 -219 -26 -94 -154 -169 -139 40 -111 -16 -64 184 103 -99 269 130 300
7412C00L0l80J06j55k03M92m28K40J75k43J13k90L97j72L67l16p6L01l95J87j41
$$ 300 330 -50 56 -99 -302 190 -238 2 177 -66 47 -243 154 -18 349 33 -43 258 -137 50 -91
7433i1K82l4n4K40l25J74%j23K2oKl06L47N3j31o5o5J98k96L0R6Q1lJ10Jk26P9
$$ -91 191 157 103 343 18 192 192 69 91 85 87 -219 128 181 50 -15 -80 118 -178 -148 -52 29 26 136 137 -89 -10
7460a0O7j07l3L9o7J42o9K05k60K96J0k81Q4J35l37K15j87N9J70N3k96L4K87q2
$$ -10 57 -50 -83 -44 -111 31 -38 167 -93 203 213 -68 16 151 -186 29 -158 -99 71 124 -172 -138 149 67
7484F7n8k28R1K81l15L32r6k87K86K36rJ9m77L8J84j53M1m0K62l32K77nk76M4
$$ 67 9 -219 -128 153 -162 170 74 -213 73 309 300 319 -158 -120 64 -89 -48 -88 174 -158 119 114 -162 -118
7508a18J53R6j64L0K9l66M73j52l0J44J06l77L58j08j2m4r1K88k41j95K07k3J11
$$ -118 35 131 -33 -3 26 -340 133 -19 -49 95 201 -176 182 74 62 18 -73 215 -26 -221 -14 -37 74
7531G4J4l8l49K09N3o9j23L6J56J06J38o1k77o5K53m11M14l12N8RJ08Q3J55j54
$$ 74 88 50 -299 -90 -37 -106 -229 -193 -37 69 207 146 -131 -196 57 -354 60 -252 -194 -185 -77 6 161 7
7555GK04j70l92L91j05J33j45K70j63J67j35r7q2J10j97K09J9r1J13m0P3Qj65
$$ 7 211 41 -351 40 -65 68 -77 193 30 197 62 -35 -117 -7 -204 5 24 -67 46 6 79 87 -78
7578g8K1K54j90p1J36L6r8K25l53J04J02J26j79J35j00k03K30n9K9P2r1J08j20
$$ -78 -57 197 7 -64 72 108 10 235 -118 -14 88 214 35 170 70 -133 97 38 67 139 48 156 36
7601C6j52J75M7J33l84Q3n6O0p1L5L6j14M57j91K64k95k62J95J41j03k2J41l4
$$ 36 -116 59 106 239 -145 -62 -118 -58 -129 -94 -58 -172 285 94 358 63 -199 -4 137 34 12 153 119
7624A19p7M1k49J11M8p3L08o24O43k24j7j37N7J71M9l70NK63o7k6M40m72p2K65
$$ 119 42 83 -166 -55 -7 -80 228 -396 247 23 6 -131 -74 97 146 -224 -219 44 -23 -49 391 -81 -153 112
7648A12k41K31k33L1j61n2K76J65j96k63P0J53p8K61l57J82K01j72O4M1L17k74
$$ 112 -129 102 -131 -100 -261 -313 -37 128 -68 -331 -261 -108 -186 75 -282 -100 101 -71 -7 34 351 77
7670G7J11r7j34qJ44l9qj25K57l61K53J3J23m06L05n7r2j37R3K10j43J83l17l0
$$ 77 188 91 -43 -51 93 54 46 -79 178 -183 70 83 206 -200 105 48 -44 -181 -88 122 -21 162 -155 -185
7694a85N3J36m0L72l93O1j41J6R2J89J05k63k3mO9p1J97j84l6J68j0l55J50K05
$$ -185 -132 4 -36 336 -57 4 -137 -121 -29 160 265 2 -21 -25 44 -27 170 -14 -50 118 108 -247 -97 108
7718A08P2l03L31k9k58J95n9k6n3j02m9L05j41K52l03Q2P2l90N54m85P5K82l97
$$ 108 180 -123 208 179 -79 116 57 31 -22 -124 -173 132 -9 243 -60 22 94 -296 258 -227 -152 130 -267
7741b67L36l04K52J03k58J85j70J09K06l97N09j77j09J41j45N2J04n3j15j20J89
$$ -267 69 -235 17 120 -138 47 -123 -14 192 -205 304 127 18 159 14 66 170 117 2 -118 71
7762G1l33J04K24k39K55j07K7K19j61j12J3j16L75l09K37p5r6K21o5k94M34n45
$$ 71 -262 -158 66 -173 82 -25 2 221 60 -52 -39 -155 220 -89 148 73 -23 198 133 -161 273 -272
7784b72K58J34l02L79P1n9j96mN8J9j03nJ13j51j61J28J36r6K50k9j01m14J96
$$ -272 -14 120 -182 197 268 209 13 9 67 86 -17 -22 91 -60 -221 -93 43 -53 197 168 67 -347 -151
7807a51K19r4K8m5j00K9R1J06k57P0K28k7n7j49K2M9q2J93m5j04q2K00n3j53K70
$$ -151 68 -26 2 -43 -143 -114 -23 83 -174 -104 124 97 40 -109 -87 -38 -120 73 28 -76 -158 42 -11 -164 106
7832A06k50M09j36n1n0L5l34J62K69l68K22k88K88J6l23K37L9M4J84j96l3r3p8
$$ 106 -144 265 129 78 28 63 -271 -109 160 -208 14 -274 14 30 -293 -56 -17 27 211 15 -18 -111 -189
7855a89L09k46j57L54R7l31O4J50R9Qkj65Oo1K37j31l07O9L55m3n55J62N26l38
$$ -189 120 -126 -283 71 168 -163 -99 51 150 158 156 -9 -3 -64 173 42 -265 -196 159 116 -439 -277 249 -89
7879h9K28j09J20j71K16k86M4p3J25N6l16N06j75j25Q3j1o2K9K18l13K89Q7k09
$$ -89 139 30 150 -21 195 -91 -47 -120 5 61 -255 251 76 -49 34 23 -39 -10 208 -105 184 271 62
7902F2k75L74m3n1M0K25k94l8l04K26J13P6n4K0j6J22j32l41M35QN8k91k1L14
$$ 62 -213 161 118 67 107 332 38 0 -304 -78 35 111 57 77 61 183 51 -290 145 153 211 -80 -101 213
7926B13j09j04M0J34l65r7L34p9j65J28KJ93j49K74j39k13O2l3LL0J00j49R4j69
$$ 213 104 0 40 174 -191 -288 46 -33 -198 -70 -68 125 -24 250 111 -102 -40 -73 -70 -40 60 -89 5 -164
7950a64L14p8q3p4p0L3l18M91k3q7L27l13J39r8k2j19J87r9q9m8J68j21K93k78
$$ -164 150 72 -11 -85 -155 -122 -440 51 28 -59 268 -45 94 -4 -26 -145 42 -57 -146 -194 -26 -147 146 -132
7974a32Q4J00j62J05J63l81K65M5k56L08k33j32J76k15M20k30M5q3J68j31R0l51
$$ -132 -48 52 -110 -5 158 -223 42 87 -169 139 -94 -226 -50 -265 155 -75 -30 -113 55 -76 14 -337
7996c37O43j16k94qj20L50k8n3J45o6j53j78L59p8j22j78K02m1O4j17J16K87k96
$$ -337 306 190 -104 -112 -232 118 90 37 182 116 -37 -215 144 66 -56 -234 -32 -73 -9 -126 -10 277 -19
8019a9Q7j96J4J63L90k87j58K01j43p9j41J02JM6K04O9l38O2O8q9m8M1n2J6l6
$$ -19 68 -128 -114 49 439 152 -6 195 52 -27 -168 -66 -65 -19 185 254 -84 -22 46 -43 -91 -50 -102 -86 -122
8044a22K37r2M5j71j26J84O8p5M0N7j01LJ66j82j34N6j16M43k30oR0r7K4j8lO
$$ -122 115 23 68 -103 -229 -45 23 -52 -12 45 -56 -53 113 -69 -203 -147 -263 180 -50 -56 34 -63 -39 -57 -60 -54
8070e4K73j30l34K74Oj13o6K58Q8k99K6K13l15J27O1j12J29j44P6k60L61k40J41
$$ -54 219 89 -245 29 35 -78 -144 114 202 -97 -71 142 -173 -46 15 -97 32 -112 -36 -296 65 -175 -34
8093c4J68j10J51k89J07J34l96L25J36M2k48K30l22o6J64qJ56r6k30K68o6K03
$$ -34 134 24 175 -114 -7 127 -269 56 192 234 -14 216 -106 -172 -8 -16 140 44 -186 82 16 219
8115B19l36K31j90j13J25j54M29j53j74J3K40Qj8j03K2kO1q9o5K5J28k87Q7M4
$$ 219 -117 114 -76 -189 -64 -218 211 58 -116 -103 137 145 127 24 46 44 105 16 -49 -24 104 -183 -96 -52
8139e2J43n0j10J23k2M8k01L47k13P2J99j49l7j99L48j46l59K26Q1M8r2j71K64
$$ -52 91 41 -69 54 32 80 -121 226 13 85 284 135 98 -101 247 101 -258 -32 49 97 5 -166 98
8162I8R9m07L5L99O9l25Qp1J71L1p1k05J36K40k54L42j53k80N31k80l14q3N08
$$ 98 197 -210 -175 224 293 -32 -24 -95 76 107 36 -169 -33 207 -47 295 142 -138 393 113 -201 -284 224
8185B24j74k34K77l11M18N
$$ 224 50 -184 93 -218 200 205
8191B05
$$ Imaginary data points
##PAGE= N=2
##DATA TABLE= (X++(I..I)), XYDATA
0@%%%%%%%%%%%%Qj6J6j6K4l2L2m0M8n6P2q8J04j20J36j55J79k08K40k72L09l50
$$ 0 0 0 0 0 0 0 0 0 0 0 0 0 8 -8 8 -8 16 -16 16 -24 24 -32 40 -48 56 -64 72 -83 96 -112 128 -144 165 -185
34a85L94m46N01n61O30p04P84q72R68j073J187j311J449j600J762j941K139k356
$$ -185 209 -237 264 -297 333 -371 413 -459 509 -564 623 -688 761 -839 923 -1018 1121 -1235
52a235K597k865L163l498L878m311M814n405O107o957Q016r377J1199j3786J7769
$$ -1235 1362 -1503 1660 -1838 2040 -2271 2543 -2862 3245 -3712 4304 -5073 6126 -7660 10109
67A0109k4760M0645j46945q748J84749p0504j1813J477k0507j177J05802M0015
$$ 10109 -14651 25994 -120951 -129699 55050 -15454 -27267 -25790 -46297 -47474 58328 98343
79I8343n0294m5472J6978K514K3156J3283m7615n8110K3614L2946k380k2866k0943
$$ 98343 48049 2577 19555 22069 45225 58508 10893 -47217 -23603 9343 6963 -15903 -36846
92c6846j7845J4654L9854J7290l2812j1303L2625J8051j944J4781m666l0010l920
$$ -36846 -54691 -40037 -183 17107 -15705 -27008 5617 23668 21724 36505 31839 1829 -2091
105b091K8534L458l2455j9996j62j0099J0638L0192j1376l1709J1862L2003R545
$$ -2091 26443 29901 -2554 -22550 -22712 -32811 -22173 8019 -3357 -35066 -23204 8799 18344
118A8344l153j460k562L11Q045l083k1006l733J3903p487j3616N879N514o092
$$ 18344 15191 13731 11169 11480 19525 16442 -4564 -8297 5606 -1881 -15497 -9618 -4104 -10196
132a0196k944J0221J5686j144j3703k390P963Q975q41j2888l968P368m91o374
$$ -10196 -13140 -2919 12767 11623 -2080 -4470 3493 12468 11627 -1261 -5229 2139 1648 -4726
146d726j229M215K797m880k125N184O29N37K974l371O01O979r12m488L39K044
$$ -4726 -5955 -1740 1057 -3823 -5948 -764 -135 402 3376 5 606 7585 6673 2185 2524 4568
162D568N05m438n068j353q65L280P99q284k14R628M360n40J135L220M475k226
$$ 4568 5073 635 -4433 -5786 -6651 -3371 -2572 -10856 -11070 -1442 2918 2378 3513 6733 11208 8982
178H982m629J707J563l541o756p085K610L789o694l916N606P360J819m618P31
$$ 8982 4353 6060 7623 4082 -2674 -9759 -7149 -3360 -10054 -13970 -8364 -1004 815 -3803 -3072
193c072J0165M866j713l316k464L193m6q016l580L230j558n223l401K017N142
$$ -3072 7093 11959 10246 6930 4466 7659 7613 -403 -3983 -753 -2311 -7534 -10935 -8918 -3776
208c776M92j164J615K135M608K138l751J529L665j112k022j656p85K58j968k902
$$ -3776 -3284 -4448 -2833 -698 3910 6048 2297 3826 7491 6379 4357 2701 1916 2174 206 -2696
224b696j938j550J975K65m499J491N492J205j305O20M821N508j714l884J33J607
$$ -2696 -4634 -6184 -4209 -3944 -8443 -6952 -1460 -255 -1560 -940 3881 9389 7675 3791 3924 5531
240E531R67m549o313L52K551l910l541J573M434K381j735P92M192K526J21k018
$$ 5531 6498 1949 -4364 -4012 -1461 -5371 -8912 -7339 -2905 -524 -2259 -1467 2725 5251 5372 3354
256C354j243K657j97n912j742K070L14k071k053K025K433o85J25M05K99K275K57
$$ 3354 2111 4768 4571 -1341 -3083 -1013 -699 -2770 -4823 -2798 -365 -1050 -925 -520 -221 2054 2311
273B311k510K18J670q3k81j379k17P66L8j6j420k035K440J021k571q70K146J710
$$ 2311 -199 19 1689 1606 1325 -54 -271 495 533 517 -903 -2938 -498 523 -2048 -2918 -772 938
291I38L1j959J128L453O9j725j917k60K229k073l844P25K039q15j301k63L349
$$ 938 969 -990 138 3591 3660 1935 18 -242 1987 -86 -3930 -3205 -1166 -1981 -3282 -3545 -196
308a96L367j284r68J393K020L91l422k375J984K13l529k270P63K610R6j808J406
$$ -196 3171 1887 919 2312 4332 4723 1301 -1074 910 1123 -2406 -4676 -3913 -1303 -1207 -3015 -1609
325a609K229O82J11j02N29J214n24j753k3l38J80l51j232n57O8J01N53j155n86
$$ -1609 620 1302 1413 1311 1840 3054 2530 777 754 416 596 245 -987 -1544 -1476 -1375 -822 -1977 -2563
344b563J704K73m71M78R39J671N78j147j01J500p5p78k448k97J492j080l339j4
$$ -2563 -859 -586 -1057 -579 360 2031 2609 1462 1361 2861 2786 2008 -440 -737 755 -325 -3664 -3678
362c678J852P20r19n09J999K073K88j60J23P39J081j747k081R83J73j419j807
$$ -3678 -1826 -1106 -2025 -2534 -535 1538 1826 1666 1789 2528 3609 1862 -219 764 937 -482 -2289
379b289k58R66L25q29M68J111P04N31q25L50J522O5j019k23M91Mo21o00L0l64
$$ -2289 -2547 -1581 -1256 -2085 -1617 -506 198 729 -96 254 1776 1841 822 599 1090 1094 473 -127 -97 -461
399d61m4K76j073l68J302L62o53j05J27J162J85k02N2J09N59m6j267m42J161l50
$$ -461 -505 -229 -1302 -1670 -368 -6 -659 -764 -637 525 710 508 560 669 1228 1182 -85 -527 634 284
419B84j616m37Q92Q87n17l29P90Q98n3j69n82P74J034j267j402N17L50K5j027
$$ 284 -1332 -1769 -877 10 -507 -836 -46 852 799 630 48 822 1856 589 -813 -296 54 79 -948
438i48m54J128O6l79M28J8P76P20p39o01N20K88m59n17%Rk02o61L37Q8L3P76l54
$$ -948 -1402 -274 -208 -587 -159 -141 635 1355 616 15 535 823 364 -153 -153 -144 -346 -1007 -670 -582 -549 227 -127
461a27J79J32R26k51k58n85N99p7j22l75m79N98J67r20n58R81K26o61j85J68J077
$$ -127 52 184 1110 859 601 16 615 538 416 41 -438 160 327 -593 -1151 -170 56 -605 -790 -622 455
482D55l81l39L65P34N95o30q94M69O49o54o23n73N84n9p43p14J088L90j63J75
$$ 455 74 -265 100 834 1429 799 -95 374 1023 369 -254 -827 -243 -302 -1045 -1759 -671 -281 -444 -269
502b69J74M81O22k25J70k70n3k23o59K1J41k33l77k00j29K55P56k72K68O8O7M78
$$ -269 -95 386 1008 783 953 683 630 407 -252 -231 -90 -323 -700 -900 -1029 -774 -18 -290 -22 46 113 591
524E91l50j42J18M03j39l99jj61N12m52o39M60N6J97p44o5Q17m3K2k19M43M16
$$ 591 241 99 217 620 481 82 81 -80 432 -20 -659 -199 -143 54 -690 -755 62 19 41 -178 265 681
546F81R9q32J9O61l03n00k14L49R0n61l54L04N65p7j34J83M16J42l45l0K08Kk38
$$ 681 780 -52 -33 628 325 -175 -389 -40 50 -511 -865 -561 4 -73 -207 -24 392 534 189 159 367 369 131
569A31m28k9L72l65K09J25l09J96K69J82j65q2J5L54l47J0m58NK28m2j49M77j35
$$ 131 -297 -326 46 -319 -110 15 -294 -98 171 353 188 106 121 475 128 138 -320 -315 -87 -129 -278 199 64
592F4L6l66k02M80J18l03K2N37k09o8r5RQ8K79l36k44J50k8q4k36n3M83J18m92
$$ 64 100 -266 -468 12 130 -173 -151 386 177 109 14 23 111 390 54 -190 -40 -68 -152 -388 -441 42 160 -332
616c32o0M75K97j72N4l92O56j92p1k29k13J64j88m02K53J02K84l04j51M31M51
$$ -332 -392 83 380 208 262 -130 526 334 263 34 -179 -15 -203 -605 -352 -250 34 -270 -421 10 461
637D61j78L8o7J34k55j05K26m94L76L5on62J98J81m6o3lJ25J54k21L5L79pj29
$$ 461 283 321 254 388 133 28 254 -240 136 171 165 -397 -199 -18 -64 -127 -130 -5 149 -72 -37 342 335 206
661B06j84n0K10J30j23j01j85L30k45j6K3M6j30j58J98j72L58R0j45j33L68j12
$$ 206 22 -28 182 312 189 88 -97 233 -12 -28 -5 41 -89 -247 -49 -221 137 227 82 -51 317 205
683B05j65R5k63jj3J88k55J98J11l53K18k21J61K62m4j44k8o1K42j47M1j78P7
$$ 205 40 135 -128 -129 -142 46 -209 -11 100 -253 -35 -256 -95 167 123 -21 -49 -110 132 -15 26 -152 -75
706g5k56m3L38J08K1l14N1K9J34J64k79k7J47J16k72L32q4k9j81J34r6L10j57
$$ -75 -331 -374 -36 72 93 -221 -170 -141 -7 157 -122 -149 -2 114 -158 174 90 61 -120 14 -82 228 71
729G1R2j90p1O5J01l10K5K47k19K12J33l28L10l33q8L58j61N3J08m3m8k4%K94
$$ 71 163 -27 -98 -33 68 -242 -217 30 -189 23 156 -172 138 -195 -283 75 -86 -33 75 32 -16 -40 -40 254
753B54k64P6J94Q0j60k6N4j10m6j42n1L8q3j0K44k59M23j40k87M11l11K71R1p2
$$ 254 -10 66 260 340 180 154 208 98 52 -90 -141 -103 -186 -196 48 -211 212 72 -215 196 -115 156 247 175
777A75j11o5p6M1k2j49L02k56J0M07n05R7J75O0k37K36jk1K06j20n5k42R3p4k2
$$ 175 64 -1 -77 -36 -58 -207 95 -161 -151 256 -249 -152 23 83 -154 82 81 60 266 146 91 -151 -58 -132 -154
802a54J22q6R9j31k8J70L7O3j2l2j85J76J64j1j13K89o43L17j63J64J56l56J26
$$ -154 -32 -118 -19 -150 -178 -8 29 92 80 48 -137 39 203 192 79 368 -275 42 -121 43 199 -157 -31
825c1M4pr7K52l23P7M26k30j7K34M0m48n4K45k89J4K35K4L4j27K2j1j75N3r2R8
$$ -31 13 6 -91 161 -162 -85 341 111 94 328 368 -80 -134 111 -178 -164 71 95 129 2 24 13 -162 -109 -201 -103
851a03JK62j51P0m0k63K65K05l47K4p3J2K6O6oK17l43K6k8J45R4r6J93p1lk06
$$ -103 -102 160 9 79 39 -224 41 246 -101 -77 -150 -138 -112 -46 -52 165 -178 -152 -180 -35 59 -37 156 85 82 -124
877a24K77o6mJ71k63J61j37J49q7k64J87k6lK93j46j88J75k70J58N6M7j82k2j56
$$ -124 153 87 83 254 -9 152 15 164 77 -187 0 -26 -29 264 118 -70 105 -165 -7 49 96 -86 -108 -264
901b64M38k3j41j99L2N2J7M40p34O50q6P3l22L20l13J81m07M36L6j06J23p2j30
$$ -264 174 151 10 -189 -157 -105 -88 352 -382 268 182 255 -67 253 -60 121 -286 150 186 80 203 131 1
924AR4LJ64J6k35p6R4k77J35RO4K13n38L63j74J6K34j04j1J63k85k3O2L35j85
$$ 1 95 98 262 278 43 -33 61 -216 -81 -72 -8 205 -333 30 -144 -128 106 2 -9 154 -131 -154 -92 243 58
949E8J2p0J3l1K73l10k95L39Q0O8l67QK68j00R5m6O7J23k59j25J33J91J33l63
$$ 58 70 0 13 -18 255 -55 -350 -11 69 137 -230 -222 46 -54 41 -5 62 185 -74 -199 -66 125 258 -105
973a05j24J29J41lk55L62O1l05K7J07q2Q8J61p7j55Q3j80K48k0l95M3P15n67J93
$$ -105 -229 -100 41 38 -217 145 206 -99 -72 35 -47 41 202 125 -30 53 -127 121 101 -294 -251 464 -103 90
997I0J50k89L3j07r1J67J40m83N62j33j02K92L7k77o2K00j87k95K17J28j88M04
$$ 90 240 -49 -16 -123 -214 -47 93 -390 172 39 -63 229 266 -11 -73 127 -60 -355 -138 -10 -198 206
1019B06k90J91O1l83J41j50K9L02k26N4K16o3M2m07R2Q2J98m23N27l23J75J33
$$ 206 -84 107 168 -215 -74 -224 -195 107 -119 -65 151 88 130 -277 -185 -103 95 -328 199 -124 51 184
1041A84j9l11K62k77QJ01j0j15K11l3L3o1l54M85l29L39r0j67P5J80j78j8j20
$$ 184 165 -146 116 -161 -153 -52 -62 -177 34 1 34 -27 -381 104 -225 114 24 -143 -68 112 -66 -84 -204
1064b04k5M40l47J98r4m4L4k6J27j94Q6o1L43l57J45r5j61L2M01k50J35j28J18
$$ -204 -229 211 -136 62 -32 -76 -42 -68 59 -135 -49 -110 233 -124 21 -74 -235 -203 198 -52 83 -45 73
1087G3o1j12k5J72O1j34J69J44l56j35O0J22K64m02L30k17J83k92J06O9OK2j92
$$ 73 12 -100 -125 47 108 -26 143 287 -69 -204 -144 -22 242 -160 170 -47 136 -156 -50 19 25 47 -145
1110a45P2K3P7N4j57J76l26K68r8r3KJ52q4l5J50l08K56K34j99Oq0J27l46K84
$$ -145 -73 -50 27 81 -76 100 -226 42 -56 -149 -147 5 -79 -114 36 -272 -16 218 19 25 -55 72 -274 10
1134A0J18p3Jm5L1k5j04J43k16L88r6k41K01j13K63j97j16r3Q6K51q4J67j94N9
$$ 10 128 55 56 11 42 17 -87 56 -160 228 132 -109 92 -21 242 45 -71 -164 -78 173 89 256 62 121
1158A21l01K26J04k31L43j25l74K38n8O0n9J70j22qJK00l82J88kJ90k02J11j58
$$ 121 -180 46 150 -81 262 137 -237 1 -57 3 -56 114 -8 -16 -15 185 -197 -9 -11 179 -23 88 -70
1181g0J96j21l38N5K55j52N8K27l11L43j05mr8K34k41j58J0L1Q6R9J32k14L86
$$ -70 126 5 -333 -278 -23 -175 -117 110 -201 142 37 33 -65 169 -72 -230 -220 -189 -103 -4 128 -86 300
1204C00l52k42L04j00L3J29o6K12j52n9k1K5N7J80p7k73L07j56k24K23r0J15k1
$$ 300 -52 -294 10 -90 -57 72 6 218 66 7 -14 11 68 248 171 -102 205 49 -175 48 -42 73 52
1227E2l04K32j18M23l50j5O4M9J97m56PJ94J4K96l99K45l51J67N1l1k63M90J8
$$ 52 -252 -20 -138 285 -65 -80 -16 33 230 -226 -219 -25 -11 285 -114 131 -220 -53 -2 -33 -296 194 212
1250B12m64L33k74M98k20M1n2k2M7j63k64J39K67L3j36J45k31K65J31j00l03O2
$$ 212 -252 81 -193 305 85 126 74 52 99 -64 -328 -189 78 111 -25 120 -111 154 285 185 -118 -56
1272e6k22L50K0q7j75M11n12M11l22Q5J81j6o4k04M03m47j1J91R9Q9o1j68RN3
$$ -56 -278 72 92 5 -170 241 -271 140 -182 -97 84 68 4 -200 203 -244 -255 -64 35 124 63 -105 -96 -43
1296d3J99k53K16j98K04l62K17k15L57L05m70pJ35K50m31Q7K38k70k6j41M0J31
$$ -43 156 -97 119 -79 125 -237 -20 -235 122 427 -43 -50 85 335 -96 -9 229 -41 -67 -208 -168 -37
1318c7k81K65N0j79K37J07JJ11l05K49k67j12N8K27r6j43J16n3r1K14j12R9J12
$$ -37 -318 -53 -3 -182 55 162 163 274 -31 218 -49 -161 -103 124 28 -115 1 -52 -143 71 -41 58 170
1341A70j74N3j4k40M89k27p4p9J53O0l07K46j71K5j0o%J65L7J6l35K68k39K16
$$ 170 -4 49 35 -205 284 57 -17 -96 57 117 -190 56 -115 -90 -100 -106 -106 59 96 112 -223 45 -194 22
1365B2J22R9l59J2J03J8K04j31l27j37J66J71J41o6l5M7J47j06o2k26J96K03m69
$$ 22 144 243 -116 -104 -1 17 221 90 -237 -374 -208 -37 104 38 3 50 197 91 29 -197 -1 202 -267
1388b67L30J64R1L6l51k8K38j93j99J45p3K44j60P7O8l68M29m60K08pJ46J39n04
$$ -267 63 227 318 354 3 -25 213 20 -179 -34 -107 137 -23 54 122 -246 183 -277 -69 -76 70 209 -295
1411b95M69k56L04j97o3K49m14M97k61J83j22m53M83l05M24l31N1K15l60L77k43
$$ -295 174 -82 222 25 -38 211 -203 294 33 216 94 -359 124 -181 243 -88 -37 178 -182 195 -48
1432d8J30o8P6J07l48k11L31J3j52J08M3M8j84K34l4J5J27j88n0J72l97L86Q7
$$ -48 82 14 90 197 -151 -362 -31 -18 -170 -62 -19 29 -155 79 45 60 187 -1 -51 121 -276 110 197
1455A97j6L9j38j37R4k19J41k30J85J64r0R4j42j68L98Kj83l8p4L01l85N27m27
$$ 197 181 220 82 -55 39 -180 -39 -269 -84 80 -10 84 -58 -226 172 174 -9 -47 -121 180 -205 322 -105
1478a05K20o6r3K88n7j05K89k06j37k31K14r4k23L41k42j94M88q4k46M92l74M1
$$ -105 115 49 -44 244 187 82 371 165 28 -203 11 -83 -306 35 -207 -401 87 3 -243 249 -125 -84
1500h4J58k31K35R8k54K34J31j37l17L44j82k48M32p9K3p1M5q7PRj07K6q9N4J26
$$ -84 74 -157 78 176 -78 156 287 150 -167 177 -5 -253 179 100 123 52 97 10 17 26 -81 -55 -144 -90 36
1525C6Op3Q2k37J94l6q6NN0JR4n7l6j59J5L60j04k0j23K36o5j93K44j83j18K56
$$ 36 42 -31 51 -186 8 -28 -114 -109 -59 -58 36 -21 -57 -216 -201 159 55 35 -88 148 83 -110 134 -49 -167 89
1551H9O5j48K90k14l43K05K97j73n8j74J07J76k54J61j78L66j31k0j84K61j34
$$ 89 154 6 296 82 -261 -56 241 68 10 -164 -57 119 -135 26 -152 214 83 63 -121 140 6
1572Fj27J69q3qj88K90n9o9K75j08k96K49j80PL47j43j28J15k3K42k37Q4oj29
$$ 6 -121 48 -35 -43 -231 59 0 -69 206 98 -198 51 -129 -122 225 82 -46 69 46 288 51 135 129 0
1596@K52k09j16nj00M60m28J12J63l29L22k65R4O2k60J10J44K1M2%q0K91q9m5
$$ 0 252 43 -73 -78 -178 282 -146 -34 129 -200 122 -143 -49 13 -247 -137 7 28 70 70 -10 281 192 147
1620A47n6m7o4J66n9j23J16j95K60q0q2N5qj67L01MlM1Q8j89o4O2j3k47k5L47
$$ 147 91 44 -20 146 87 -36 80 -115 145 65 -17 38 30 -137 164 168 165 206 294 105 41 103 90 -157 -182 165
1646A65r9j73l8K41k8k31J2K59j39L7L72n05n3R7k59M88Q1l17o4K09P7J09ll91
$$ 165 66 -107 -145 96 68 -163 -151 108 -31 6 378 -127 -180 -83 -342 146 227 -90 -154 55 132 241 238 -153
1670a53L57o20L96L7N7k78K27Q2j89J57O9J27l11j85J79K84O7l14l6j51K29L0
$$ -153 204 -416 -20 17 74 -204 23 105 -84 73 142 269 -42 -227 -48 236 303 -11 -47 -198 31 61
1692F1j4J49j58j31n9K88j02P4k88o8L75k07L7j21R7m3N4n0J30J3j10r7K44k26
$$ 61 47 196 38 -93 -152 136 34 108 -180 -248 127 -80 -43 -164 -67 -110 -56 -106 24 37 -73 -170 74 -152
1716a52k14K29%K28Q9k6k58L64k86n4J60j74J28k1L5j23J98m57M76l23K43N7n0
$$ -152 -366 -137 -137 91 180 154 -104 260 -26 -80 80 -94 34 13 48 -75 123 -334 142 -181 62 119 69
1739F9k37K61j37k45K59l0J82k93K62k39J88k55K98J85j10k80L37l86K89r3KJ06
$$ 69 -168 93 -44 -289 -30 -60 122 -171 91 -148 40 -215 83 268 158 -122 215 -171 118 25 27 133
1761A33l9j87J98k54J20j16PP5P4k8R7j0O6L4k70J38j16L39Q8o04K21n7J20k14
$$ 133 94 -93 105 -149 -29 -145 -138 -63 11 -17 80 70 136 170 -100 38 -78 261 349 -255 -34 -91 29 -185
1785a85J63m8O3j63L28l67K94K5k25K23J13k75j63J81k1J90j03j78J93k92K83
$$ -185 -22 -70 -7 -170 158 -209 85 110 -115 108 221 -54 -217 -36 -57 133 30 -148 45 -247 36
1806C6m4Qj03J97L2j05j68j49M43j16O5j4j54R1J25J10m50L13l17J32J44J32l21
$$ 36 -8 0 -103 94 126 21 -147 -296 147 31 96 82 -72 19 144 254 -196 117 -200 -68 76 208 -113
1829a13r1M38j21l23J65J2J14Nq1J20j28K02k99O8N2L39l45L9k67M49j39O7j57
$$ -113 -204 234 113 -210 -45 -33 81 86 5 125 -3 199 -100 -32 20 359 14 53 -214 235 96 163 6
1852FQ3P4j7l60M12j72l23J59l4J68j54J62j90K35L7Pk65L61k27J65k32K62j95
$$ 6 89 163 146 -214 198 26 -297 -138 -172 -4 -158 4 -186 49 86 93 -172 189 -38 127 -105 157 -38
1875c8p6L6O7m0J97n7k77o1L76j59j5j53M11k93J25k52N71m54J59J52j78M4k73
$$ -38 -114 -78 -11 -51 146 89 -188 -249 127 -32 -47 -200 211 -82 43 -209 362 -92 67 219 41 85 -188
1898a88K94k34O1p0L1J72k50J42r8j75L34mJ54k7K44n92K89j59P0J1J8j52K17
$$ -188 106 -128 -67 -137 -106 66 -184 -42 -140 -315 19 15 169 142 386 -206 83 -76 -6 5 23 -129 88
1921H8Po2r0p7J50K74l58K21j84K20l24J19K0j43K5Q3j99L8J60K68j89k18J13
$$ 88 95 33 -57 -134 16 290 -68 153 -31 189 -135 -16 4 -139 -114 -31 -230 -192 -32 236 47 -171 -58
1944e8J88k27J29P1k04J36kj71L36k97j04M34k74l9J41K0j47O0J24j68Om1J54
$$ -58 130 -97 32 103 -101 35 33 -138 198 -99 -203 231 -43 -82 59 79 -68 -8 116 -52 -46 -87 67
1967F7j16P9r0j83L73j67K30m36K40n2Q3j36%N7J68l9k38J79k77M41k96J76J27
$$ 67 -49 30 -60 -243 130 -37 193 -243 -3 -55 28 -108 -108 -51 117 78 -160 19 -258 183 -113 63 190
1990A90j54j22Q0M8j15Q5L90k85O4k42J13J11J90l91R1l7oJ58J16l75J56j80K3
$$ 190 36 -86 -6 42 -73 12 402 117 181 -61 52 163 353 -38 53 16 10 168 284 -91 65 -115 -92
2013i2J84j42K25K4k7l50M34l39J30j58oKL7Pk9K07j50n4K28j37k29K40P3r1J2
$$ -92 92 -50 175 199 172 -178 256 -83 47 -111 -117 -115 -78 -71 -100 107 -43 -97 131 -6 -235 5 78 -13 -1
2038ak2k98J46j8L28k35R1L59k98r2J85o1J81O4j79j02p5K39j88Mo4q9J54j09
$$ -1 -23 -321 -175 -193 135 -100 -9 350 52 -40 145 84 265 329 150 48 -27 212 24 28 -36 -125 29 -80
2062h0P7J47k73N99o10K2K90j82R9J6j98K44k23J47J27j17k0k80K05j5J05J92
$$ -80 -3 144 -129 470 -140 -118 172 -10 89 105 -93 151 -72 75 202 85 65 -215 -10 -25 80 272
2084B72J13m44k8O3m4L34k96O5n5J24K3k11k3L03r6K7j58J9k05Q5j15N3K52J23
$$ 272 385 -59 -87 -24 -68 266 -30 35 -20 104 127 -84 -107 196 100 127 -31 -12 -217 -132 -247 -194 58 181
2108A81k37K64k69K79k12o7K40l86M68j97m7R3J8m14L10j50J83N4pj02j45J68
$$ 181 -56 208 -61 218 6 -61 179 -207 261 64 17 110 128 -286 24 -126 57 111 104 2 -143 25
2130B5j39N2J73o1J19k62J83o3j25J75K5r7K06l31J78J15j38j5j21J14k62L02
$$ 25 -114 -62 111 50 169 -93 90 27 -98 77 102 5 211 -120 58 173 35 20 -101 13 -249 53
2152E3j15l0j89L95q2K9j41o3J73J11j35K0j07j3r2K54Qo0Kk3k08L20k37P8K12
$$ 53 -62 -92 -281 114 32 61 -80 -143 30 141 6 26 -81 -94 -186 68 76 16 18 -5 -213 107 -130 -52 160
2177A60l36K24r6P1J40j86M5k66K44N5j22O2J48q2l6K09j07n1p8r2j89J20j18
$$ 160 -176 48 -48 23 163 -23 22 -244 0 55 -67 -5 143 61 25 234 127 76 -2 -94 -283 -163 -281
2200b81O6L52j95j5P4l7k0j19j3M89j87j09qJ46j9J01l18J47K1j49j1J61k81J24
$$ -281 -215 137 -58 -73 1 -36 -56 -175 -188 301 114 5 -3 143 124 225 -93 54 75 -74 -85 76 -205 -81
2224h1q6L63k95r3J61o2K7K04k12J6J0J58n7J76k14L3K86m76L00m16Q4M1Q9j98
$$ -81 -167 196 -99 -192 -31 -93 -66 138 -74 -58 -48 110 53 229 15 48 334 -142 158 -258 -174 -133 -44 -242
2248b42J81J31Q1m21M32qK3k30L93m12R7j62m4K40L61l28r8J91j32K4k0l54L75
$$ -242 -61 70 151 -270 162 154 177 -53 340 -72 25 -137 -181 59 420 92 -6 185 53 77 57 -297 78
2271G8j2m2j83l9L2K13J09j47L3j23k9M15l92L20r9M3k31K8J58r0R0p6J62l0k74
$$ 78 66 24 -159 -198 -166 47 156 9 42 -81 -110 305 -87 233 134 177 -54 -26 132 42 132 56 218 188 -86
2296h6q5K77n7O5%Nl09J18n5J38l5n0Q6m6o1K3R5P9j02k17K59j76N2o5l0P9n7
$$ -86 -171 106 49 114 114 119 -190 -72 -127 11 -24 -74 12 -34 -95 -72 23 102 0 -217 42 -134 -82 -147 -177 -98 -155
2323a55M47k85p7m4L64m03J61m0L20k28m9K7j90R1K93k89K2K77m09O2K44k72K05
$$ -155 292 7 -70 -114 250 -153 8 -32 288 60 11 38 -152 -61 232 -57 -35 242 -167 -105 139 -133 72
2346G2Rk46K61j66lJ16O7k53O4R1m5n3l5J55k14M19p5j43J8J19j83j22K77J9l23
$$ 72 81 -165 96 -70 -73 43 110 -143 -79 12 -33 -86 -121 34 -180 239 164 21 39 158 -25 -147 130 149 -174
2371a74O8K44l27M38r7j58k2K82r1j43j7P2j07k13L20J05j00k68J56R2J77j01
$$ -174 -106 138 -189 249 152 -6 -28 254 163 20 3 75 -32 -245 75 180 80 -188 -32 60 237 136
2393A36P7j18J8k50N6J79j05P9O7k98J00K36j81j81K89j81j99J64J34KK4p5J68
$$ 136 213 95 113 -137 -81 98 -7 72 139 -159 -59 177 -4 -185 104 -77 -276 -112 22 24 48 -27 141
2416A41n1J98k12J76l34J29L2k20J64j30Q7J87o8J03o9p8j44J79l7j18l1o3l0
$$ 141 90 288 76 252 -82 47 79 -141 23 -107 -20 167 99 202 133 55 -89 90 53 -65 -96 -159 -189
2439a89L43j52l02K40j02Q8j42K19M1k05J41J1j17K65j49j47lJ74k47J77K51j54
$$ -189 154 2 -300 -60 -162 -74 -216 3 44 -161 -20 -9 -126 139 -10 -157 -160 14 -233 -56 195 41
2461D1j89J58N0j49J15j38l4J19P4J8n2P2k9L%j40N9k2K5J30j64O7J24m2N0j24
$$ 41 -148 10 60 -89 26 -112 -146 -27 47 65 13 85 56 59 59 -81 -22 -44 -19 111 -53 14 138 96 146 22
2487B2J27q0M8j77j90L01j35j07N2J88n3j36Q5J66j65K57p7k60O9J10Q0j51k6
$$ 22 149 69 117 -60 -250 51 -84 -191 -139 49 -4 -140 -55 111 -54 203 126 -134 -65 45 125 -26 -52
2510e2J81q2J1j37J64j9q2M3J41k09J76j16r4L2K26l95n0L0R9j0K14j03M9q2K11
$$ -52 129 47 58 -79 85 66 -16 27 168 -41 135 19 -75 -43 183 -212 -262 -232 -133 -143 71 -32 17 -65 146
2535A46k21J43l1l03N21k30k52R0K34k4k81N8J46j11K24m21L71k94R3J58nj64
$$ 146 -75 68 37 -266 255 25 -227 -137 97 73 -208 -150 -4 -115 109 -312 59 -235 -142 16 11 -153
2557a53J92Kmj02J63k23Rll3R9K46j12k49k9K58O6k18J20l05J85J90k52O5J30
$$ -153 39 41 37 -65 98 -125 -116 -119 -152 -53 193 81 -168 -197 61 127 -91 29 -276 -91 99 -153 -88 42
2581D2k31J02O5J08j74J48m2l86M43k76J97J90j86L1J4n5o5K29K1l64n0L23m13
$$ 42 -189 -87 -22 86 -88 60 18 -368 75 -201 -4 186 0 31 45 -10 -75 154 175 -189 -239 84 -329
2604c29J62%K06l3J8n1r3J19nJ11j46J7R7o9j63J67N2k10J89J6o0q0L68l31J5
$$ -329 -167 -167 39 6 24 -27 -120 -1 -6 105 -41 -24 73 4 -159 8 60 -150 39 55 -5 -85 283 -48 -33
2629c3Q6P9k18J14k1k02L10m0r4k5r5J89k4j20N4K48m3M0nl93J26K03j34o6M33
$$ -33 53 132 -86 28 7 -195 115 75 -19 -44 -139 50 26 -94 -40 208 165 205 200 -193 -67 136 2 -64 369
2654C69l46r2J53O0k82o9L20j31J05j75J57K8j89O8K25j62j67k92L84J4p3N2L70
$$ 369 23 -69 84 144 -138 -207 113 -18 87 -88 69 97 -92 -24 201 39 -128 -420 -36 -22 -95 -43 327
2677C27j38k73J36J23M8k24J55Nj63J94k31L4J84j73L0j58N8j4J59m7k08K10m
$$ 327 189 -84 52 175 223 -1 154 159 -4 190 -41 -7 177 4 34 -124 -66 -80 79 32 -176 34 30
2700C0l5n3K18m23Q9J71k27K68n1O7j11J84j51o9j23J5J14l77K93L54j48n3J3
$$ 30 -5 -58 160 -263 -174 -3 -230 38 -13 54 -57 127 -24 -93 -216 -201 -87 -464 -171 183 35 -18 -5
2723eJ20l19J73qJ27j28o6j17J01M2J57M7j99k26J90N6OK41q1l56k1K55rK57l2
$$ -5 115 -204 -31 -39 88 -40 -106 -223 -122 -80 77 124 -75 -301 -111 -55 -49 192 111 -245 -266 -11 -20 237 205
2748B05l83K67j15P7M1q6j20k2K04J45k16qJ18j62k10M01n6j89K2L75n01K71J89
$$ 205 -178 89 -26 51 92 6 -114 -136 68 213 -3 -11 107 -55 -265 136 80 -109 -87 288 -213 58 247
2771B47l35r7J98j9n0L34k46K14J48k84n3Q1k95J25j85J63L9l79M41k23j58M35
$$ 247 -88 -185 13 -6 -56 278 32 246 394 110 57 138 -157 -32 -217 -54 -15 -394 47 -176 -334 101
2793A01o9j0j03m4r2P4K52j43j08JQ6%J61j75K0Q3j82K08p4J07l64K70J36k24
$$ 101 32 22 -81 -125 -217 -143 109 -34 -142 -141 -55 -55 106 -69 -49 34 -148 60 -14 93 -271 -1 135 -89
2817h9J56k21RJ12k77R4L7N96l88j07j11RL67k78Q1J45k56o1M52l34J25r3oK01
$$ -89 67 -154 -145 -33 -310 -216 -179 417 29 -78 -189 -180 187 -91 -10 135 -121 -182 270 -64 61 -32 -38 163
2841A63l8k04J30n6p4K68k80K58n18LL90Nl88K53K39l8j51J76r4J21j53R4Q9m28
$$ 163 125 -79 51 -5 -79 189 -91 167 -351 -348 42 47 -341 -88 151 113 -38 138 44 165 12 106 195 -233
2865b33L07ok91M20o3n00M32q0K20q0n4r1J6k4m66O93j81k7K9J16O0q0R4j78k38
$$ -233 74 68 -223 197 134 -366 66 -14 206 126 72 -19 -3 -27 -493 200 19 -8 21 137 197 117 211 33 -205
2890b05N5Q9m6O7l1J50L32l91O7k01K7L48j96jl31K96k83R1l0M08j39M1j66J27
$$ -205 -150 -61 -107 -40 -71 79 411 20 87 -114 -87 261 65 64 -267 29 -254 -163 -193 215 76 117 -49 78
2914G8J00K7l74K63Q1J6m6j45J51j46J1J63j39j99o8M01l32J89N8P8j71l20J93
$$ 78 178 205 -169 94 175 191 145 0 151 5 16 179 40 -159 -227 174 -158 31 89 167 -4 -324 -131
2937a31N4K75j45n4J25pk1j21j3L57n72K37K5J70n7k24L57m63L68Nk43K23k26
$$ -131 -77 198 53 -1 124 117 96 -25 -38 319 -253 -16 9 179 122 -102 255 -208 160 165 -78 145 -81
2960h1nJ95k44K33k77J21j2J74j66P9j42p0K36J42m30L04J38j35M6j56K66m36
$$ -81 -86 109 -135 98 -179 -58 -70 104 -62 17 -125 -195 41 183 -247 57 195 60 106 -50 216 -220
2982b20K49L6J06j28k13K6J28N2J72m0l37J72k28K40K54l08j7K84j74R5j60j76
$$ -220 29 65 171 43 -170 -144 -16 36 208 168 -169 3 -225 15 269 -39 -56 228 54 149 -11 -187
3004a87K91m8J95k4j22K3j31o8J43j07k56L59L0J06q1j71J09k04jM2M39m91J55
$$ -187 104 56 251 227 105 128 -3 -71 72 -35 -291 68 98 204 123 -48 61 -143 -144 -102 337 -154 1
3027Aj74K58L7L3k86oK51O6p1J03k96P0K02k71O9JK06o8k67qR5M6N5K09J29m47
$$ 1 -173 85 122 155 -131 -137 114 180 109 212 -84 -14 188 -83 -14 -13 193 125 -142 -150 -55 -9 46 255 384 -63
3053f3K38j33k8j51J88nn1j71K96L9j17j4m8J81j40j23OJ73r3o4L38j11k69J82
$$ -63 175 42 14 -137 51 46 -5 -176 120 159 42 28 -20 161 21 -102 -96 77 -16 -80 258 147 -122 60
3077F0j49R9q8q1K35j31j5j93l5M27m4j6l74K74j62L65m73J5L41k20K99n5l3J3
$$ 60 -89 10 -78 -159 76 -55 -70 -263 -298 129 85 69 -305 -31 -193 172 -301 -286 55 -165 134 79 46 59
3101E9L12k29k6j78q3M31k99q0j60L68R2j37j99M79l85k3P7J31k60K45k17J41
$$ 59 371 142 116 -62 -145 286 -13 -93 -253 115 207 70 -129 350 -35 -58 19 150 -110 135 -82 59
3123E9q6P6K3o4J72p9l9J57l49j03L66p8k74K00k6J78K1k84j71J62j11L19n1P9
$$ 59 -27 49 72 8 180 101 62 219 -130 -233 133 55 -219 -19 -45 133 154 -130 -301 -139 -250 69 18 97
3147I7R3j74Q4q0l5J6J03O8J6l36J66J05M6k07n9K76j15j63K69m1j80P2j89K31
$$ 97 190 16 100 20 -15 1 104 172 188 -148 18 123 169 -38 -97 179 64 -99 170 129 -51 21 -168 63
3171F3k78L84l80M3L09o4J14o9j15K30r6j93R7p3R5k78K95j73J2k8L01j40Q0j59
$$ 63 -215 169 -211 -168 141 77 191 122 7 237 141 -52 45 -28 67 -211 84 -89 -77 -105 196 56 136 -23
3195b3j55L31p1o3J26L4l4L1q4m9jr2j83J24Q1l2Q2J41n03M42l47M61m24j19K32
$$ -23 -178 153 82 19 145 179 145 176 92 43 42 -50 -233 -109 -28 -60 22 163 -340 102 -245 216 -208 -327 -95
3220i5r7J37O0n9N5l8N1J35j55J52j66L8p9k12K34k8K9n1p6M2M45l01k47J11J5
$$ -95 -192 -55 5 -54 1 -37 14 149 -6 146 -20 18 -61 -273 -39 -67 -38 -89 -165 -123 322 21 -226 -115 -100
3245a00O2J1J32l15K59L5J1o9n6k2J31j3J09j94k18K1K30J25q1k0L9j19L5J51
$$ -100 -38 -27 105 -210 49 84 95 26 -30 -52 79 66 175 -19 -237 -216 14 139 58 38 77 -42 -7 144
3269A44k54M63k23j16jk6J23n8q2J73J04p4j31K1j8Oj61l47O26O7j02m15M42j57
$$ 144 -110 353 130 14 13 -13 110 52 -30 143 247 173 42 63 45 51 -110 -457 169 236 134 -281 161 4
3293Dmj08K88n3P9k88JM6j27L17j72K9J02M8j07j81J69j15j4MK46k38k45L54M7
$$ 4 0 -108 180 127 206 -82 -81 -35 -162 155 -17 12 114 162 55 -126 43 -72 -86 -82 164 -74 -319 35 82
3318H2p6p7J99j69J53k14Q2K12l0J9m99K48K5K80l52K60q7r0J01q3J4j65K43j94
$$ 82 6 -71 128 -41 112 -102 -20 192 162 181 -318 -70 -45 235 -117 143 56 -34 67 -16 -2 -167 76 -118
3342a18J46kk0K26k21n8j7J54N6k31J55P0l38J19J99J89l31j95N98j31k06k59
$$ -118 28 26 6 232 11 -47 -64 90 146 -85 70 140 -198 -79 120 309 -22 -217 381 250 44 -215
3364b15M02k66Jk20J78j54L21l9K30l48q3J19K99l19L80j95j99k07M49j02k59
$$ -215 187 -79 -78 -298 -120 -274 47 8 238 -110 -193 -74 225 -94 286 91 -108 -315 134 32 -227
3385b27L03J00k50p4J23L62l82L8p2J8L7pJ15l23Q2J81J29j17J28m45L78j18L49
$$ -227 76 176 -74 -148 -25 337 -45 -7 -79 -61 -24 -31 84 -239 -157 24 153 36 164 -281 97 -21 328
3408C28l56j59J17K06nr6j40K81Q9l74M50k41j62q4K52k64P5K53l35Q6K14L9j26
$$ 328 -28 -187 -70 136 131 35 -105 176 265 -109 341 100 -62 -146 106 -158 -83 170 -165 -79 135 174 48
3431D8p0K16k60N7J3ql28M34J10k01K26J3j68N2j75K64l45K29j76q8L9K66J4j29
$$ 48 -22 194 -66 -9 4 -4 -332 102 212 11 237 250 82 134 -41 223 -122 107 -69 -157 -118 148 162 33
3455C3P2J10m42K79L9k52K02n0k65K61JP6kl5o0j26K80k90O1m9N9m6J27J09Q7
$$ 33 105 215 -227 52 91 -161 41 -9 -274 -13 -12 64 62 27 -33 -159 121 -169 -108 -157 -98 -144 -17 92 179
3480A79j65p4J31O1k00J3L1J53k24K98k27K26m20K3Q1p9M36m43K63N2l56N75l66
$$ 179 14 -60 71 132 -68 -55 -24 129 -95 203 -24 202 -218 -195 -114 -193 243 -200 63 115 -241 334 -32
3503c2j94L49P4J01j45m19L98l9K4K2k69j51L26Q3j85M52n22J2L4O5O3o3L7j1
$$ -32 -226 123 197 298 153 -266 132 93 117 139 -130 -281 45 128 -57 395 -127 -115 -81 -16 47 -16 21 10
3527A0O2R8j00p7K3J86k10l4J31k6l36L06M1K00j26j94k88M59J18l47k1J15K87
$$ 10 72 170 70 -7 16 202 -8 -42 89 63 -273 33 74 274 148 -46 -334 125 243 -104 -125 -10 277
3550B77o4l55J79j32m3M8p0P5J42Ok5j00p9K54k32K35k88K83j77j6O8j14K47L8
$$ 277 213 -142 37 -95 -138 -90 -160 -85 57 63 38 -62 -141 113 -119 116 -172 111 -66 -82 -14 -128 119 157
3574A57r4p6j06J20r0O3K5j7j35L66k2k92K47k69q2K11j37J51K16j82l39L33O1
$$ 157 63 -13 -119 1 -89 -26 -1 -18 -153 213 191 -101 146 -123 -205 6 -131 20 236 54 -285 48 109
3597A09k16J63l99K70J94j51J48j69J25r4L3j6L0o5J30j79K55l5k21K06j44K61
$$ 109 -107 56 -343 -73 121 -30 118 -51 74 -20 13 -3 27 -38 92 -87 168 133 -88 118 -26 235
3619B35k29K1O8m4j39J13k41K25j02J7n9L61l04j6J73k1R3r8K82j63j35l9k13
$$ 235 6 27 95 51 -88 25 -216 9 -93 -76 -135 226 -78 -94 79 58 151 53 335 172 37 -2 -215
3642b15P8J90J03l48J59K96k28K77l87J43j3k2k07K54J53l60M53k84k51L8L42
$$ -215 -137 53 156 -192 -33 263 35 312 -75 68 55 33 -174 80 233 -127 326 42 -209 -171 171
3663A71l98J75k9N3j52K71j49J78rk0j9j26%k9J37M7J03k53J57j53k13K8J60J4
$$ 171 -227 -52 -81 -28 -180 91 -58 120 111 91 72 -54 -54 -83 54 101 204 -49 108 -45 -258 -230 -70 -56
3687e6k77M21j00L2j64K06q2l8j13M08o9k10K02j01R5j52k53K33j12J71j95J31
$$ -56 -333 88 -12 20 -144 62 -20 -58 -171 237 168 -42 160 59 154 2 -251 -18 -130 41 -154 -23
3709b3J84r1N1j1j25P0J61k42J33r0j20m0J41M3k94K62K3j12K20j02k40K71j92
$$ -23 161 70 121 110 -15 55 216 -26 107 17 -103 -143 -2 41 -253 9 32 -80 140 38 -202 69 -123
3732a23K11j19j2K51j24k84M21m0q7K44l48M1P4j42k64K63K69k36K02k68k7K40
$$ -123 88 -31 -43 208 84 -200 221 181 94 338 -10 31 105 -37 -301 -38 231 -5 197 -71 -98 142
3754A42m1j60o5J85P7j64P4K7j61J88k9q9k50K20J37J17j00m30M24k17K35j40
$$ 142 101 -59 -124 61 138 -26 48 75 -86 102 73 -16 -266 -46 91 208 108 -322 102 -115 120 -20
3776b0j02N7J89k94K30K07k66O6o1n0J14j35j00M0K99qO6l61K44n9P1q2k00K64
$$ -20 -122 -65 124 -170 60 267 1 67 6 -44 70 -65 -165 -125 174 166 232 -129 115 56 127 45 -155 109
3800A09pL5j68J20j11r0J63J36k15j33k32L23J31q0L3n1nJ00p0M5j15M5l2m6L3
$$ 109 102 137 -31 89 -22 -112 51 187 -28 -161 -393 -70 61 -19 14 -37 -42 58 -12 33 -82 -37 -69 -115 -82
3825h2K22j81r9J06n5J00N1l60M7K50k08K91j70m9J79j90J99l0M3j67oN1K37k90
$$ -82 140 -41 -140 -34 -89 11 62 -298 -251 -1 -209 82 -88 -137 42 -148 51 21 64 -103 -109 -58 179 -111
3849a11l4J1P9k14J78o0J04J10L20k66p1K39j62J76n96K83r3Q6l8j82K95o5m7
$$ -111 -145 -134 -55 -269 -91 -151 -47 63 383 117 46 285 123 299 -297 -14 -107 -21 -59 -241 54 -11 -58
3872e8R0p4J06J81q7rO3J0l48L20k04LK8l28K49J07k37K98pl38K94k1N8j69O6
$$ -58 32 -42 64 245 158 149 212 222 -126 194 -10 -7 21 -307 -58 49 -188 110 103 -235 59 38 96 -73 -7
3897gm1j07K13J61k43r7k4J40K52k4j32L1j83j12Q4L21L0k00j70Q2J1L8j81J32
$$ -7 -48 -155 58 219 -24 -121 -145 -5 247 223 91 122 -61 -173 -89 232 262 62 -108 -26 -15 23 -158 -26
3921b6O9Q8K2l53K9J69K38l81K17O5j46j16L04q8L7J5k90R6p6J3L24k02R2j27
$$ -26 43 131 153 -200 -171 -2 236 -145 72 137 -9 -125 179 91 128 143 -147 -51 -127 -114 210 8 100 -27
3945b7J21k03m7P8j29K53j81n5K61k1l11M53j19j5j50J39k30K61o9pM9o5J50j85
$$ -27 94 -109 -156 -78 -207 46 -135 -190 71 50 -261 192 73 58 -92 47 -183 78 9 2 51 -14 136 -49
3969d9L21j86r1j17J54j36j55L33q2J93j02l88K25K17k52p5L23q2jk61L39k08
$$ -49 272 86 -5 -122 32 -104 -259 74 -8 185 83 -305 -80 137 -115 -190 133 51 50 -211 128 -80
3991h0J47r0M3J4R3J47k15K72l19K73k98k33R9J10J9l7j19L37J05m45rk8K27j64
$$ -80 67 -23 20 34 127 274 59 331 12 285 -13 -246 -147 -37 -18 -55 -174 163 268 -177 -186 -214 13 -151
4015a51K21j73j02J86P4l2l32L32pO6m8R7j33R9J4j55J5q6q4M32k15m7L40m48
$$ -151 70 -103 -205 -19 55 23 -309 23 16 82 34 131 -2 97 111 -44 -29 -115 -199 233 18 -29 311 -137
4039a37R2J33j83j33L07R6l21j10K11K68m76K0J56Q6k20j40K17J65qo9j1L65k20
$$ -137 -45 88 -95 -228 79 175 -146 -256 -45 223 -253 -233 -77 9 -211 -351 -134 31 23 -46 -57 308 88
4062H8j95J98J81j76k19j12J27m5L38j66l01L28L8J55m18K26J19p1K7l31K23r3
$$ 88 -107 91 272 96 -123 -235 -108 -153 185 19 -282 46 84 239 -179 47 166 95 122 -209 14 -79
4084g9O3J19k29N3J68R7q6k60L32q5o0q5Q6j33J27J65k93J10J38j78j76J99J15
$$ -79 -16 103 -126 -73 95 192 106 -154 178 93 33 -52 34 -99 28 193 -100 10 148 -30 -206 -7 108
4107A08mk40P8L43m8k72J12j44J03p4k02K03j02M48j66k05J59j37K6o2p5M08m86
$$ 108 104 -136 -58 285 237 -35 77 -67 36 -38 -240 -37 -139 309 143 -62 97 -40 -14 -76 -151 257 -229
4130b29J18J45N9J29k01n0M0J00k09J6R1r1J76q3j26K09o2P9N6j77J29k93J34
$$ -229 -111 34 93 222 21 -29 11 111 -98 -82 9 -82 94 11 -115 94 32 111 167 -10 119 -174 -40
4153d0j14L95j45j80k8K79j37L6K70m34J76j31L28l38NJ01l4n5K21k35k9j7R9
$$ -40 -154 241 96 -84 -112 167 30 66 336 -98 78 -53 275 -63 -58 43 9 -46 175 -60 -89 -106 -7
4176gj76K92j26L1j54J87j9oj48m6l5L11l8k59J73J19J7k70k6J55J26J17j55k45
$$ -7 -183 109 -17 14 -140 47 28 22 -126 -172 -207 104 66 -193 -20 99 116 -154 -180 -25 101 218 63 -182
4200a82K31k98K13k11M99j26l79K96J08k30J56L7j6LK20l93L5j12M38l09%j7K05
$$ -182 49 -249 -36 -247 252 126 -253 43 151 -79 77 114 98 101 321 -72 -37 -149 289 -20 -20 -37 168
4223A68l86M02l40K10j44M9n5J52NJ9k80K59k51L20k40L24j37L9k07J92j08j59
$$ 168 -218 184 -156 54 -90 -41 -96 56 61 80 -200 59 -192 128 -112 212 75 114 -93 99 -9 -168
4245a68J18M2o8p5Q8m6K22j83K99k30j76J68J55j17q8J36k53K10qj38P5P8J4J34
$$ -168 -50 -8 -76 -151 -63 -109 113 -70 229 -1 -177 -9 146 29 -59 77 -176 34 26 -112 -37 41 55 189
4269A89l50J73K19l17K85j41j8l71M15k25P6M5K49j41k24K00O9l29J27o1k23L53
$$ 189 -161 12 231 -86 199 58 40 -331 84 -141 -65 -20 229 88 -136 64 133 -196 -69 -130 -353 0
4291@J59j82K19k00N5O8l25J67J60l59Q0J1L07j25q6j61K35N7m03M99k7k56O7
$$ 0 159 -23 196 -4 51 119 -206 -39 121 -238 -158 -147 160 35 -51 -212 23 80 -323 176 149 -107 -40
4314d0q3J70J16j55N8k21J65k83L04R6j65r1q8J04K24j26q5K30l0p4K41j79p3
$$ -40 -123 47 163 8 66 -155 10 -273 31 127 -38 -129 -217 -113 111 -15 -100 130 100 26 267 88 15
4337A5l4N7r2QK51k32K14k00j18J28P3l8m6L9j90J59j91L19j01k83K05Q4p7M5
$$ 15 -19 38 -54 -46 205 -27 187 -13 -131 -3 70 32 -14 25 -165 -6 -197 122 21 -262 -57 27 -50 -5
4361eN0j41QJ68R%m2J11K5j52J7J7mL6K5j77KK25m14J26J93j18j69j3K52m2j78
$$ -5 45 -96 -88 80 89 89 47 158 183 31 48 65 61 97 122 -55 -53 172 -242 -116 77 -41 -210 -223 29 -13 -191
4388a91J94j39K36Lj52K35l64M06m52K14kJ40k37L32k36L3k73J18N4QJ20p5q5
$$ -191 3 -136 100 103 -49 186 -178 228 -224 -10 -12 128 -109 223 -13 20 -253 -135 -81 -73 47 -28 -113
4411a13L63k78j61L86l97L32l8m0p1j34J37j20r4L85M2j64n8oK10m34L98p2l09
$$ -113 250 -28 -189 197 -200 132 94 54 -17 -151 -14 -134 -228 157 199 35 -23 -29 181 -253 145 73 -236
4434b36Q7J18J13l03J43K15J83n12r9L02k43K41p9J39N1p6k1N3j22J84j43J41
$$ -236 -149 -31 82 -221 -78 137 320 -192 -291 11 -232 9 -70 69 120 44 23 76 -46 138 -5 136
4456A36J44r3j48M9j1j47q9L88j57J1j55j0P9M06j24j66k05l84N27Mj90K67j42
$$ 136 280 187 39 88 77 -70 -159 229 72 83 -72 -82 -3 403 279 113 -92 -476 51 55 -135 132 -10
4479a0m5o5J14M5O1k1k15j40Q3J92J40j09j74K27m4J94l65K81k58j9n6L98j55
$$ -10 -55 -120 -6 39 100 79 -136 -276 -193 -1 139 30 -144 83 39 233 -132 149 -109 -128 -184 214 59
4502E9N7j40k05L37j07J14k96K53j67lJ45m73M68k5l0k31J29K89k95N7j69J03
$$ 59 116 -24 -229 108 1 115 -181 72 -95 -98 47 -426 42 17 -13 -244 -115 174 -121 -64 -233 -130
4524a30K02l31M2J49J41J52n0L15l66L9j98J75j03k10J03m7J25l11L94k47K09
$$ -130 72 -259 -217 -68 73 225 175 490 124 163 -35 140 37 -173 -70 -117 8 -303 91 -156 53
4545E3o0j89J39j56K02J5R3j5j23M1J1O1m55N27l2J93m67k0j5l7J74k50L69j17
$$ 53 -7 -196 -57 -213 -11 4 97 82 -41 0 11 72 -383 144 112 305 -162 -182 -197 -234 -60 -310 59 -58
4569e8j34J09m7JK59l37K08p3J04j83L26j20J60k99J54p5j06N0N3j00L1J67l9
$$ -58 -192 -83 -130 -129 130 -207 1 -72 32 -151 175 55 215 -84 70 -5 -111 -61 -8 -108 -77 90 51
4592E1l9J06j78L6J58k71K6m0J47J59l20J37J57k5k70K36k09P8m0l81P19k86K3
$$ 51 12 118 -60 -24 134 -137 -111 -151 -4 155 -165 -28 129 104 -166 70 -139 -61 -101 -482 237 -49 -26
4615b6J27m3j1kQ3k20N3m3Q1K95l17r2N1J29J45Q9k24j84L55k78j8j6l6O9j2K56
$$ -26 101 58 47 45 128 -92 -39 -82 -1 294 -23 -115 -64 65 210 299 75 -109 246 -32 -50 -66 -102 -33 -45 211
4641B11k57o2J8j34l0L29J46k12r0J07J22K7k09l9R0r0K07j54k14K22k92L96k02
$$ 211 -46 -108 -90 -224 -254 75 221 9 -81 26 148 175 -34 -73 17 -73 134 -20 -234 -12 -304 92 -110
4664a10PJ32N9j47J38M32m46K3J4k05K20j06L4j48j20K33j43j01L89k82K15K78
$$ -110 -103 29 88 -59 79 511 65 88 102 -103 117 11 45 -103 -223 10 -133 -234 155 -127 88 366
4686C66l48k9QN8J07lj36P1K14l51J05j50Q5j41K6L7J49k22P2n1O6L4J80k38M3
$$ 366 18 -11 -3 55 162 159 23 94 308 -43 62 -88 -3 -144 -118 -81 68 -154 -82 -133 -67 -33 147 -91 -48
4711d8Q2J8k7j62L62j84O9lk14J74l30K40J08Lk61N0k03L81L2j24k52L04K60o4
$$ -48 34 52 25 -137 225 41 110 107 -107 67 -263 -23 85 88 -173 -123 -326 55 87 -37 -289 15 275 211
4735B11k85k71M80k61K00j67n1P1RJ53l53N33l32L47j51%m10L41J1j11N6k48N00
$$ 211 -74 -345 135 -126 74 -93 -144 -73 -64 89 -264 269 -63 284 133 133 -277 64 75 -36 20 -228 272
4758B72n04L93j30j57m1K85o3l56L52j60J67j85N9j37K43l20O18m34j13N98l59
$$ 272 -232 161 31 -126 -167 118 55 -301 51 -109 58 -127 -68 -205 38 -282 336 -98 -211 387 28
4779B8Ml2J72k1q5M2O2N7j24l72J81N4mk35L98K3j31j8K18l10P3O2k63L73j01
$$ 28 32 0 172 151 66 108 170 227 103 -269 -88 -34 -38 -273 125 148 17 -1 217 -93 -20 42 -221 152 51
4804E1j20J65K5j00o7J07j34n7J07J31j85K01Q6k11RJ19O0k02j11L08j38j40J30
$$ 51 -69 96 121 21 -46 61 -73 -130 -23 108 -77 124 210 -1 8 127 187 -15 -126 182 44 -96 34
4827C4kk24J85Q6k8K38o00L09n4n0L2j63K29j34N5J33J33j74j77K21j19K83l46
$$ 34 32 -192 -7 79 51 289 -311 -2 -56 -106 -74 -237 -8 -142 -87 46 179 5 -172 49 -70 213 -133
4850a33K97p6k4p5K56j86j91j48K74L2q9pk22L36p9j81L08k15J74O3N9m28O6K53
$$ -133 164 88 64 -11 245 59 -132 -280 -6 26 -63 -70 -292 44 -35 -216 92 -123 51 114 173 -255 -189 64
4874F4j70P8j29J98p2J84l45L35q1j07K53k76N8l31K21K60k38k5K77j57J86j75
$$ 64 -106 -28 -157 41 -31 153 -192 143 62 -45 208 -68 -10 -341 -120 140 -98 -123 154 -3 183 8
4896HJ99J82p33N54j93om3K27Jl76J43J82R8j50j7j55O8K11k44K19j30J80m34
$$ 8 207 389 -344 210 17 11 -32 195 196 -180 -37 145 243 93 76 -79 -11 200 -44 175 45 225 -209
4919b09J83k90M01m5l9j74P9n5K90m1m9j26K34R0l79K94k70J64P8k51J76M6oj0
$$ -209 -26 -316 85 40 1 -173 -94 -149 141 100 51 -75 159 249 -130 164 -106 58 136 -115 61 107 101 91
4943I1j04K30k2m0L5l23L9RJ02r0j01J83O1k04lM0L02k03k4l5J33n9j44j59K83
$$ 91 -13 217 195 155 190 -133 -94 -85 17 -73 -174 9 70 -134 -137 -97 205 2 -22 -57 76 17 -127 -286 -3
4968cN3N9k18m4R4j12J85J04j63J86K67l98K63k80q6Nl3K73j18j85J8L21o5n03
$$ -3 50 109 -109 -153 -59 -171 14 118 -45 141 408 10 273 -7 -93 -88 -121 152 34 -151 -133 188 123 -380
4992c80N54k93K3K69Pj03K0J63k55K9k48K22J37K7j70K20k45J86k95J17p0K81
$$ -380 174 -119 -96 173 180 77 97 260 5 34 -214 8 145 172 2 222 -23 163 -132 -15 -85 196
5014A96k78J54l16K34J04j14J03j01J36l7l42L13j20J24R8l36K54O0p2j73j6K00
$$ 196 -82 72 -244 -10 94 -20 83 -18 118 81 -261 52 -68 56 154 -182 72 132 60 -113 -129 71
5036G1L29l04k32L2K9M9J85k6j00k01K18k09J11m0o0O8J63k40J05K70l94J39J80
$$ 71 400 96 -136 -104 -75 -26 159 133 33 -168 50 -159 -48 -88 -148 -80 83 -157 -52 218 -176 -37 143
5059A43k87L58j93K16k20n2n6l9J86PQ9n3j12M4L26m89K44L8m21Q3L90n0m68K72
$$ 143 -144 214 21 237 17 -35 -91 -130 56 63 152 99 -13 31 357 -132 112 150 -271 -188 202 152 -316 -44
5083d4QR9j07N4P1k89K4K99k57R7Q5J96k87L7J3J39j88J98j72r8K10m1J01k84
$$ -44 -36 63 -44 10 81 -208 -184 115 -142 -45 40 236 -51 -14 -1 138 -50 148 -24 -122 88 47 148 -136
5107a36o8q8L97N6j77kJ36k72n4R4p9J0L70j10P1l47J11l9J28j32J20q3l13M76
$$ -136 -204 -292 105 161 -16 -18 118 -154 -208 -114 -193 -183 187 77 148 -199 -88 -127 1 -131 -11 -94 -407 69
5131F9l3k9k36L70o1n9J90k99j15K33K44k47J03J29m89K02k0J02l81J56K36q1
$$ 69 36 7 -229 141 80 21 211 -88 -203 30 274 27 130 259 -230 -28 -48 54 -327 -171 65 -16
5153a6J74Rj14j62j28K53j36Q0j7M1J57j61m2J9j0K6J05j56J78j28J89j65P1j96
$$ -16 158 167 53 -109 -237 16 -120 -40 -57 -16 141 -20 -62 -43 -53 -27 78 -78 100 -28 161 -4 67 -129
5177a29J23KL5o8J42j27o8J57l9p3L14j92l94L67m8J19k03K87r5j31K24j08q1
$$ -129 -6 -4 31 -37 105 -22 -90 67 28 -45 269 77 -317 50 2 121 -82 205 110 -21 203 95 14
5200A4O7J04j98N1j81L53j17Q7p8j13QK9q7J86j62J83l14K17K1K32k35J21l63
$$ 14 81 185 -13 38 -143 210 93 180 102 -11 -3 26 -61 125 -37 146 -168 49 70 302 67 188 -175
5223a75J07O1n1J44o7K13k51L27o10M41j75J14j71m5J47l8k37L68k73P7J19J7
$$ -175 -68 -7 -58 86 19 232 -19 308 -302 139 -36 78 -93 -138 9 -29 -266 102 -171 -94 25 42
5245D2J73p2q3pJ90l60J47J48k21p3K92m12o3K18M4j11K53j39K09j66j49O8J38
$$ 42 215 143 60 53 243 -117 30 178 -43 -116 176 -236 -299 -81 -37 -148 105 -34 175 9 -140 -72 66
5268F6L2M1Lj9j96k8m2M4Q0j16P7N1N4Q2J93l84J35l29N26J0l04n4K43j88O9j17
$$ 66 98 139 142 123 -73 -101 -143 -99 -19 -135 -58 -7 47 129 322 -62 73 -256 270 280 -24 -78 165 -23 46 -71
5294g1J09j55R9K27l58L45j40l42J59J21o2K29k80J%K70j61L9p7P8j43r5J32L
$$ -71 38 -117 -18 209 -149 196 56 -286 -127 -6 -68 161 -119 -118 -118 152 -9 30 -47 31 -112 -207 -75 -72
5318g2Q3l7j54L39k26p7l2J26j4O8K31l23J8J35K8k1Q1j95j01L49o13K43N2Rk2
$$ -72 11 -26 -180 159 -67 -144 -176 -50 -64 4 235 -88 -70 65 93 72 153 -42 -143 206 -407 -164 -112 -103 -125
5343a25L2K89k07O2Q2j13M5k21M8J74K98j66l91L65j62r3l3M2Q8j6nP4J74n1k80
$$ -125 -93 196 -11 51 133 20 65 -156 -108 66 364 198 -193 172 10 -83 -116 -74 14 -2 -7 67 241 190 -90
5368i0j05K38l8P6j58M8k56M55j76P8Oj10J10r0j52J63QJ1Jk6Q8Q1p4R3k8j46
$$ -90 -195 43 5 81 -77 -29 -285 170 -6 72 78 -32 78 -12 -164 -1 7 18 19 -7 81 162 88 181 153 7
5394Gk00M38k00j39J31l2j33J5M6K22l64K63j73J14n2r0J08K00r1k8k7J3L25l64
$$ 7 -193 245 45 -94 37 5 -128 -113 -67 155 -209 54 -119 -5 -57 -147 -39 161 70 42 15 28 353 -11
5418a1J31J61o05K96p6K0K62l42J00J4O6j00J58L3m53J09L15M1R4j82j96k2L46
$$ -11 120 281 -324 -28 -104 -84 178 -164 -64 -50 16 -84 74 107 -346 -237 78 119 213 31 -165 -187 159
5441A59n2q3p8O3J35j6k68K26j04N2J20k01K6L4orJ35j44J2k62K84N9K28n42K70
$$ 159 107 24 -54 9 144 128 -140 86 -18 34 154 -47 -21 13 7 -2 133 -11 1 -261 23 82 310 -232 38
5466C8P5l00L34l64PL24o9k50J72rK54k87k7K14r6j35J81l3k8Op0K64k11J06j90
$$ 38 113 -187 147 -217 -210 114 45 -205 -33 -42 212 -75 -102 112 16 -119 62 29 1 7 -63 201 -10 96 -94
5491i4L3m4K31j98K30l86K53j30P6r2L2P5K68j39Q9j84LqJ76j92J0K58l65J70
$$ -94 -61 -105 126 -72 158 -228 25 -105 -29 -121 -89 -14 254 115 204 20 23 15 191 -1 9 267 -98 72
5515G2k87K36L6J31j17m7j03J80n1q6j01l6K47m5N7K31k41J7k92J34K44k70J21
$$ 72 -215 21 57 188 71 24 -79 101 50 -36 -137 -173 74 29 86 317 76 93 -199 -65 179 -91 30
5538C0M2j6Nj71J27mJ16j46L6K40k61J17j20J35O2l2o9j52o9K45k75M5K54k30
$$ 30 72 56 61 -110 17 13 129 -17 19 259 -2 115 -5 130 192 160 91 -61 -130 115 -160 -115 139 -91
5562i1j2j83K83j83K29l6k14J78o6O5J94l87K13r9NJ28j30J09j63J64J21M2j09
$$ -91 -103 -286 -3 -186 43 7 -207 -29 -95 -30 164 -223 -10 -109 -104 24 -106 3 -160 4 125 167 58
5585E8L8j74K52l8K3k0k24L7MJ12p8J79j87j16J78k15K07r1K53j45l18J35r9K97
$$ 58 96 -78 174 136 159 139 -85 -48 -44 68 -10 169 -18 -134 44 -171 36 -55 198 53 -265 -130 -229 68
5609F8j18L77m65J99J67k35j25Q3R9J4J25l52K29j65mj45O2J10M3J14n2j38J48
$$ 68 -50 327 -138 61 228 -7 -132 -49 50 64 189 -163 66 -99 -103 -248 -186 -76 -33 81 29 -109 39
5632C9J43j33M2Q8Q1k74N0O5j92K5M6R8m5k23P5J39ll3k34L67J14k02R6k7m8K10
$$ 39 182 49 91 179 260 -14 36 101 -91 -66 -20 78 33 -190 -115 24 21 -12 -246 121 235 33 129 102 54 264
5658B64l22K26k15k5j63J87O8k4J19j47L0m6J01j00J83j17m0J56l49O8Q1q2J94
$$ 264 -58 168 -47 -72 -235 -48 20 -4 115 -32 -2 -48 53 -47 136 19 -21 135 -214 -146 -65 -147 47
5681D7j04J56N0j35K70j64k21J90k3o1J0o5m5M1J9J18j95L1K72k08N3o4R5k25
$$ 47 -57 99 149 14 284 120 -101 89 66 5 15 -50 -95 -54 -35 83 -112 -81 191 -17 36 -28 67 -158
5705a58L73j82l12R6N1K65j23J9j68O3J74q5J27k87L26j73j65K18n0RJ01k07l2
$$ -158 215 33 -279 -183 -132 133 10 29 -139 -76 98 13 140 -147 179 6 -159 59 9 18 119 -88 -120
5728a20pm7M9K2j65K81K09J25j57m17j9J11m3K98l08K14j26M2j0J05j20J52k09
$$ -120 -127 -174 -125 -103 -268 13 222 347 190 -227 -246 -135 -178 120 -188 26 -100 -58 -68 37 -83 69 -140
5751a40K08k11%j14R0K03q6K52l18j0J65k83R0K04k15M20m89J35K3L8J06o4j14
$$ -140 68 -143 -143 -257 -167 36 -50 202 -116 -126 39 -244 -154 50 -165 255 -234 -99 -76 -38 68 4 -110
5774a10K1k3P5r1K24m09J60L78l57M9L0J56l9K7n2j38L1r8J71n1p3J41k25J36
$$ -110 -89 -112 -37 -128 96 -313 -153 225 -132 -83 -53 103 64 91 39 -99 -68 -166 5 -46 -119 22 -203 -67
5798f7K57q1j06r0N3L9RJ78k36J16j62J17L1p2Q7M0j44oL07l13k57K46J74k96
$$ -67 190 109 3 -87 -34 5 14 192 -44 72 -90 27 58 -14 73 113 -31 -37 270 -43 -300 -54 120 -176
5822a76R7K47n2j26K01j03M9j45k7J50P8q8k2l3k38K78j18JR0k20M3j68J01L49
$$ -176 -79 168 116 -10 191 88 137 -8 -35 115 193 105 83 50 -188 90 -28 -27 63 -157 -114 -282 -181 168
5846A68j86P1k80M43l32K69j14K26m28L22j92R9J13j30N4l20K70r9R8q2K6J68
$$ 168 -18 53 -227 216 -116 153 39 265 -163 159 -33 66 179 49 103 -217 53 -46 52 -30 -4 164
5868A64l55J53M5o6J05j82M19k03J12j66l9j59L2L05k48L20l39J7n9J94J1o5l6
$$ 164 -191 -38 7 -59 46 -136 283 80 192 26 -13 -172 -140 165 -83 237 -102 -85 -144 50 61 -4 -40
5891d0K31j70R3k8R1l06oJ99k42Q1K4j16M83l13k00K67j15J64p7J92k78J1J01
$$ -40 191 21 114 86 177 -129 -135 64 -178 -97 -73 -189 294 -19 -219 48 -67 97 20 212 -66 -55 46
5914D6J72k90L0m6K0N5J75m11N65m02J50r6Oj99L95j52Qj79L39l38K17O9k34J69
$$ 46 218 -72 -42 -88 -68 -13 162 -249 316 -86 64 -32 -26 -225 170 18 26 -153 186 -152 65 134 -100 69
5938F9R0r7J12k57J57r3pP7J78k35m3O6j23J10l9mk59M05m8r2n6K46J2j38R5l44
$$ 69 159 62 174 -83 74 -19 -26 51 229 -6 -49 17 -106 4 -35 -39 -298 107 59 -33 -89 157 169 31 126 -218
5964b18J83q1J36JN0J71l07M38k18O4k30K67k80K9P0j67o0J22j57O0J87R7rl60
$$ -218 -35 -116 20 21 71 242 -65 373 155 219 -11 256 -24 5 75 -92 -152 -30 -187 -127 60 157 148 -212
5988b12J49J77m6r7J10K7k63j9J10j9Q7kJ97m01K1J70L9l9j30n2j49R7R0R4L5
$$ -212 -63 114 68 -29 81 108 -155 -174 -64 -83 4 2 199 -202 -181 -11 28 -11 -141 -193 -342 -245 -155 -61 -26
6013b6k25K88p9q5R4J95l9n9Q8k63K89m51L21K12j31J03k0k64o6j20K19K24l89
$$ -26 -251 37 -42 -127 -33 162 123 64 152 -111 178 -273 48 260 129 232 212 -52 -118 -238 -19 205 -184
6036a84L07l08J85J94k12J42k66J71l1K62j63j35R4j06o7PK9J84n0q6K5R6j64
$$ -184 123 -185 0 194 -18 124 -142 29 -2 260 97 -38 56 -50 -117 -110 -81 103 53 -33 -8 88 -76
6059g6j71R6K08R4Ok31p0j2q9k3M9m2L36l08K17k01L6m8K14j76N7L29k35J85j83
$$ -76 -247 -151 57 151 157 -74 -144 -156 -245 -268 -219 -261 75 -233 -16 -217 -181 -229 -15 -191 -134 195 -40 145 -38
6084c8L08l90L90j71j48q9k4L46k52K83j15n9K4j10j48K11k61L18P3l33M00r6
$$ -38 270 -120 270 99 -49 -138 -162 184 -68 215 100 41 65 -45 -193 18 -243 75 148 -185 215 119
6106A19Q0m36N48m17K37P0j98K82k87k6N7J92l33O5j80J42O2J36J40k51Q1j29
$$ 119 199 -237 311 -106 131 201 3 285 -2 -28 29 221 -112 -47 -227 -85 -23 113 253 2 83 -46
6128d6K22j82L5L5%k3j76j56j21L29K74k16q2k97J97J99k20J53r0K87m9j09m8
$$ -46 176 -6 29 64 64 41 -135 -291 -412 -83 191 -25 -107 -404 -207 -8 -228 -75 -165 122 73 -36 -84
6151h4j15j64K55L74Pk44J89l48J0J94r1n0q1Q3J78j56j49K13Q4j50L06k23P1
$$ -84 -199 -363 -108 266 273 29 218 -130 -120 74 -17 -67 -148 -65 113 -43 -192 21 105 -45 261 38 109
6174A09mr1j11K36l57j0K97L0q0m6K65m07J79N5j69j03P9M1K24j50J37j32j65
$$ 109 105 14 -97 139 -218 -228 69 99 19 -27 238 -169 10 65 -104 -207 -128 -87 137 -13 124 -8 -173
6197a73K73m82M16k41L6J69k71L81m7j53J72j78K41k6J3Lk44M8L12J6k23j71K15
$$ -173 100 -382 34 -207 -171 -2 -273 108 61 -92 80 -98 143 117 130 133 -111 -63 249 265 42 -129 86
6220H6J15k0k73J3K90r5j48j36j34M45l38J97r4J5J09q7K5J52ql7L2l65J56P9
$$ 86 201 181 -92 -79 211 116 -32 -168 -302 143 -195 2 -92 -77 32 -55 -30 122 114 77 109 -256 -100 -21
6244b1K11l02N0N9P7m2k03K34j62k7R2J21o7K52l35jK03J8q9K2K05n99L47M4k73
$$ -21 190 -112 -62 -3 74 32 -171 63 -99 -126 -34 87 20 272 -63 -64 139 157 68 90 295 -304 43 87 -186
6269a86K30j18J39q6L32k16K24n1m85L52l47L35J6q4Q2Mj64J91M8k43J20m0p8
$$ -186 44 -74 65 -21 311 95 319 268 -217 135 -212 123 139 55 137 141 -23 168 216 -27 93 53 -25
6292b5kj47L58l86L91j28j26Q9q2Q6j99J81J12J84l54j50K97l51J45J50M2j02
$$ -25 -27 -174 184 -202 189 61 -65 24 -58 28 -171 10 122 306 -48 -198 99 -252 -107 43 85 -17
6314a7j53m1J97q4O6J58k18n5M30k83J05m20J50J85J66l79L93j32l2p4k86K00
$$ -17 -170 -211 -14 -98 -32 126 -92 -147 283 0 105 -315 -165 20 186 -193 200 68 36 -38 -324 -124
6336a24K45j19J01j65L03p6j8m4l8jJ98k01k69L43N6l82K21J0k72L31l40N10m71
$$ -124 121 2 103 -62 241 165 147 103 65 64 262 61 -208 135 191 -191 30 40 -232 99 -241 269 -202
6359b02K01k98J21J62Q6j54NJ35l11L05J54J12k29m28M13J54m96M74k50J51j48
$$ -202 -1 -299 -178 -16 70 -84 -79 56 -255 50 204 316 87 -341 72 226 -270 204 -46 105 -43
6380d3M91m72L33j81l06J09l5jR4q8q3J22L21j08J14k61n6p2K9j5J21R8R6k68
$$ -43 448 -24 309 128 -178 -69 -104 -105 -11 -99 -182 -60 261 153 267 6 -50 -122 -93 -108 13 111 207 -61
6404f1R8k06K14J90k33j74L07k12J04o6j48M07k94J54j83J78n0q5J3J10N6k79
$$ -61 37 -169 45 235 2 -172 135 -77 27 -39 -187 220 -74 80 -103 75 25 -60 -47 63 119 -160
6426a60l4K85j53O8r4Q7j43J56j40kK60k33K33m7J8n1M0J00n9j93J74k82O7M1
$$ -160 -194 91 -62 6 -88 -1 -144 12 -128 -130 130 -103 130 83 101 50 90 190 131 -62 112 -170 -103 -62
6450f2O4J95k26j37J07J99j68J99l60j60K38J4J10r4j66L23l0j48m0j40L13n9
$$ -62 2 197 -29 -166 -59 140 -28 171 -189 -349 -111 -97 13 -81 -247 76 46 -102 -142 -282 31 -28
6472b8P8j11k9Q5j51J01J82k65Q6R6k02M29r9K74l22j04J10oj32j62L27q3m3j7
$$ -28 50 -61 -90 -5 -156 -55 127 -138 -52 44 -158 271 172 446 124 20 130 124 -8 -170 157 74 31 14
6496A4p1L23l4m07J08QJ14K17m14K16k14J81j09N2lO3j74OJ89p6k17Q5J94k73
$$ 14 -57 266 232 -175 -67 -59 55 272 -142 74 -140 41 -68 -16 -19 44 -130 -124 65 -11 -228 -143 51 -222
$$ [...]
8191A3
##END NTUPLES=NMR FID
##END=
