##TITLE=1H_DE-106oil_TFA2
 200.13MHz, CDCl3,
 8 sc
 
 15.8.2025
##JCAMPDX= 6.0         $$ Bruker NMR JCAMP-DX V2.0
##DATA TYPE= NMR FID
##DATA CLASS= NTUPLES
##ORIGIN= UXNMR, Bruker Analytische Messtechnik GmbH
##OWNER= pz
$$ XWIN-NMR		Version 3.5
$$ Fri Aug 15 14:10:52 2025 Russian Standard Time (UT+4h)  she@DPX200
##.OBSERVE FREQUENCY= 200.1313
##.OBSERVE NUCLEUS= ^1H
##.DELAY= (6, 6)
##.ACQUISITION MODE= SIMULTANEOUS
##.ACQUISITION SCHEME= undefined
##.AVERAGES= 8
##.DIGITISER RES= 18
##SPECTROMETER/DATA SYSTEM= spect
##.PULSE SEQUENCE= zg30
##.SOLVENT NAME= CDCl3
##.SHIFT REFERENCE= (INTERNAL, CDCl3, 0, 14.3821)
##AUDIT TRAIL= $$ (NUMBER, WHEN, WHO, WHERE, WHAT)
$$ ##TITLE= Audit trail, XWIN-NMR		Version 3.5
$$ ##JCAMPDX= 5.01
$$ ##ORIGIN= Bruker BioSpin GmbH
$$ ##OWNER= she
$$ F:/spectra/data/she/nmr/H-C/1/audita.txt
$$ ##AUDIT TRAIL=  $$ (NUMBER, WHEN, WHO, WHERE, WHAT)
(   1,<2025-08-15 14:09:22.43 +0400>,<she>,<DPX200>,
      <created by zg, POWCHK disabled, PULCHK disabled
       configuration hash MD5:
       00 E9 B6 7A A2 85 ED C7 34 08 36 98 17 FE 4E 26
       data hash MD5: 16K
       FC B3 19 10 11 8E 2A AD 1D 56 70 EF 38 96 B7 AF>)
$$ ##END=
$$ 
$$ hash MD5
$$ CD 45 12 D9 CD 39 33 56 A2 3C 44 29 53 F1 B0 DA
##$RELAX= 
##$RELAX= 
##$RELAX= 
##$RELAX= 
##$RELAX= 
##$RELAX= 
$$ Bruker specific parameters
$$ --------------------------
##$DU= <F:/spectra>
##$EXPNO= 1
##$NAME= <H-C>
##$PROCNO= 1
##$TYPE= <nmr>
##$USER= <she>
##$AMP= (0..31)
100 100 100 100 100 100 100 100 100 100 100 100 100 100 100 100 100 100 
100 100 100 100 100 100 100 100 100 100 100 100 100 100 
##$AQSEQ= 0
##$AQ_mod= 1
##$AUNM= <au_zg>
##$AUTOPOS= <>
##$BF1= 200.13
##$BF2= 200.13
##$BF3= 200.13
##$BF4= 200.13
##$BF5= 200.13
##$BF6= 200.13
##$BF7= 200.13
##$BF8= 200.13
##$BYTORDA= 1
##$CFDGTYP= 0
##$CFRGTYP= 5
##$CHEMSTR= <none>
##$CNST= (0..31)
1 1 145 1 1 1 1 1 1 1 1 1 1 1 1 1 1 1 1 1 1 1 1 1 1 1 1 1 1 1 1 1 
##$CPDPRG= <>
##$CPDPRG1= <>
##$CPDPRG2= <>
##$CPDPRG3= <>
##$CPDPRG4= <mlev>
##$CPDPRG5= <mlev>
##$CPDPRG6= <mlev>
##$CPDPRG7= <mlev>
##$CPDPRG8= <mlev>
##$CPDPRGB= <>
##$CPDPRGT= <>
##$D= (0..31)
0 0.7 0 0 0 0 0 0 0 0 0 0.03 0 0 0 0 0 0 0 0 0 0 0 0 0 0 0 0 0 0 0 0 
##$DATE= 1755252561
##$DBL= (0..7)
120 120 120 120 120 120 120 120 
##$DBP= (0..7)
150 150 150 150 150 150 150 150 
##$DBP07= 0
##$DBPNAM0= <>
##$DBPNAM1= <>
##$DBPNAM2= <>
##$DBPNAM3= <>
##$DBPNAM4= <>
##$DBPNAM5= <>
##$DBPNAM6= <>
##$DBPNAM7= <>
##$DBPOAL= (0..7)
0.5 0.5 0.5 0.5 0.5 0.5 0.5 0.5 
##$DBPOFFS= (0..7)
0 0 0 0 0 0 0 0 
##$DE= 6
##$DECBNUC= <off>
##$DECIM= 32
##$DECNUC= <off>
##$DECSTAT= 4
##$DIGMOD= 1
##$DIGTYP= 9
##$DL= (0..7)
0 120 120 120 120 120 120 120 
##$DP= (0..7)
150 150 150 150 150 150 150 150 
##$DP07= 0
##$DPNAME0= <>
##$DPNAME1= <>
##$DPNAME2= <>
##$DPNAME3= <>
##$DPNAME4= <>
##$DPNAME5= <>
##$DPNAME6= <>
##$DPNAME7= <>
##$DPOAL= (0..7)
0.5 0.5 0.5 0.5 0.5 0.5 0.5 0.5 
##$DPOFFS= (0..7)
0 0 0 0 0 0 0 0 
##$DQDMODE= 0
##$DR= 18
##$DS= 0
##$DSLIST= <SSSSSSSSSSSSSSS>
$$ [...]
##$SUBNAM0= <"">
##$SUBNAM1= <"">
##$SUBNAM2= <"">
##$SUBNAM3= <"">
##$SUBNAM4= <"">
##$SUBNAM5= <"">
##$SUBNAM6= <"">
##$SUBNAM7= <"">
##$SUBNAM8= <"">
##$SUBNAM9= <"">
##$SW= 18.0517328524113
##$SWIBOX= (0..15)
0 0 2 0 0 0 0 0 0 0 0 0 0 0 0 0 
##$SW_h= 3612.71676300578
##$TD= 16384
##$TD0= 1
##$TE= 0
##$TE2= 300
##$TE3= 300
##$TEG= 300
##$TL= (0..7)
0 120 120 120 120 120 120 120 
##$TP= (0..7)
150 150 150 150 150 150 150 150 
##$TP07= 0
##$TPNAME0= <>
##$TPNAME1= <>
##$TPNAME2= <>
##$TPNAME3= <>
##$TPNAME4= <>
##$TPNAME5= <>
##$TPNAME6= <>
##$TPNAME7= <>
##$TPOAL= (0..7)
0.5 0.5 0.5 0.5 0.5 0.5 0.5 0.5 
##$TPOFFS= (0..7)
0 0 0 0 0 0 0 0 
##$TUNHIN= 0
##$TUNHOUT= 0
##$TUNXOUT= 0
##$USERA1= <user>
##$USERA2= <user>
##$USERA3= <user>
##$USERA4= <user>
##$USERA5= <user>
##$V9= 5
##$VALIST= <valist>
##$VCLIST= <CCCCCCCCCCCCCCC>
##$VD= 0
##$VDLIST= <DDDDDDDDDDDDDDD>
##$VPLIST= <PPPPPPPPPPPPPPP>
##$VTLIST= <TTTTTTTTTTTTTTT>
##$WBST= 1024
##$WBSW= 4
##$XGAIN= (0..3)
0 0 0 0 
##$XL= 0
##$YL= 0
##$YMAX_a= 230268
##$YMIN_a= -181782
##$ZGOPTNS= <>
##$ZL1= 120
##$ZL2= 120
##$ZL3= 120
##$ZL4= 120
##$ABSF1= 10
##$ABSF2= 0
##$ABSG= 5
##$ABSL= 3
##$ALPHA= 0
##$AQORDER= 0
##$ASSFAC= 0
##$ASSFACI= 0
##$ASSFACX= 0
##$ASSWID= 0
##$AUNMP= <proc_1d>
##$AZFE= 0.1
##$AZFW= 0.1
##$BCFW= 1
##$BC_mod= 2
##$BYTORDP= 1
##$COROFFS= 0
##$CY= -3
##$DATMOD= 1
##$DC= 2
##$DFILT= <>
##$DTYPP= 0
##$F1P= 0
##$F2P= 0
##$FCOR= 0.5
##$FTSIZE= 0
##$FT_mod= 4
##$GAMMA= 1
##$GB= 0.15
##$INTBC= 1
##$INTSCL= 1
##$ISEN= 128
##$LB= 0.25
##$LEV0= 0
##$LPBIN= 0
##$MAXI= 10000
##$MC2= 0
##$MEAN= 0
##$ME_mod= 0
##$MI= 1.114404
##$NCOEF= 0
##$NC_proc= 0
##$NLEV= 6
##$NOISF1= 3.799351
##$NOISF2= 2.8
##$NSP= 1
##$NTH_PI= 0
##$NZP= 0
##$OFFSET= 14.38212
##$PC= 1
##$PHC0= -1563.396
##$PHC1= 17.39228
##$PH_mod= 1
##$PKNL= yes
##$PPARMOD= 0
##$PSCAL= 0
##$PSIGN= 0
##$REVERSE= no
##$SF= 200.129724274929
##$SI= 16384
##$SIGF1= 3
##$SIGF2= 2
##$SINO= 400
##$SIOLD= 16384
##$SREGLST= <1H.CDCl3>
##$SSB= 0
##$STSI= 0
##$STSR= 0
##$SW_p= 3205.1282051282
##$SYMM= 0
##$S_DEV= 0
##$TDeff= 0
##$TDoff= 0
##$TI= <>
##$TILT= no
##$TM1= 0
##$TM2= 0
##$TOPLEV= 0
##$USERP1= <user>
##$USERP2= <user>
##$USERP3= <user>
##$USERP4= <user>
##$USERP5= <user>
##$WDW= 1
##$XDIM= 8192
##$YMAX_p= 0
##$YMIN_p= 0
$$ End of Bruker specific parameters
$$ ---------------------------------
##NTUPLES= NMR FID
##VAR_NAME=  TIME,          FID/REAL,        FID/IMAG
##SYMBOL=    X,             R,               I
##VAR_TYPE=  INDEPENDENT,   DEPENDENT,       DEPENDENT
##VAR_FORM=  AFFN,          ASDF,            ASDF
##VAR_DIM=   8192,          8192,            8192
##UNITS=     SECONDS,       ARBITRARY UNITS, ARBITRARY UNITS
##FACTOR=    0.0002768,     1,               1
##FIRST=     0,             0,               0
##LAST=      2.2672688,     0,               0
##MIN=       0,             -181782,         0
##MAX=       2.2672688,     230268,          0
$$ Real data points
##PAGE= N=1
##DATA TABLE= (X++(R..R)), XYDATA
$$ [...]
$$ plain form
1839 319 471 133 -20 -57 -221 -203 -65 173 -75 11 87 4 -80 40 240 256 136 2 -188 -112 -222 101 -96
1862 -96 101 66 -37 179 374 313 41 22 -305 -52 -313 54 43 12 -80 391 97 -69 61 148 99 -613 -315
1885 -315 -68 -436 -142 291 2 -28 373 290 157 518 254 7 -145 -282 -154 -335 -378 -108 -255 -239 -141 -338
1907 -338 22 302 58 171 221 327 -52 55 -90 488 173 327 -150 44 -168 4 -131 -453 -173 -336
1927 -336 -560 -511 -192 291 372 19 369 225 147 624 431 187 54 4 -331 -347 -358 -144 -122 -388 -434 -285 -188
1950 -188 85 316 172 335 -62 -118 -188 318 56 168 250 60 -160 -165 30 -124 -395 6 -109 -403 -91 -90
1972 -90 -57 202 285 344 67 376 508 -22 107 56 -146 -106 58 -16 205 -254 -338 75 -164 81 170 -133 -37
1995 -37 178 -62 -53 -108 10 376 -80 -172 137 100 101 262 119 -44 -130 -329 -251 -72 46 4 -176 142 -341 -258
$$ packed form
1839C19J52l38j53l7j64J8J38K38k48Q6P6q3q4J20K00J6j20j34j90P6j10L23j97
1862i6J97l5j03K16J95o1k72j9l27K53k61L67j1l1r2M71k94j66J30Q7m9p12K98
1885c15K47l68K94M33k89l0M01q3j33L61k64k47j52j37J28j81m3K70j47J6R8j97
1907c38L60K80k44J13N0J06l79J07j45N78l15J54m77J94k12J72j35l22K80j63
1927c36k24M9L19M83Q1l53L50j44p8M77j93k44j33n0l35j6j1K14K2k66m6J49R7
1950a88K73K31j44J63l97n6p0N06k62J12Q2j90k20nJ95j54k71M01j15k94L12J
1972i0L3K59Q3N9k77L09J32n30J29n1k02M0J64p4K21m59q4M13k39K45Q9l03R6
1995c7K15k40Rn5J18L66m56r2L09l7JJ61j43j63q6j99P8J79J18m2j80L18m83Q3
$$ plain form
2019 -258 19 17 154 -230 43 -64 -48 37 4 239 254 -180 61 76 -15 -106 -11 -96 -329 -269 -142 -140 -355 -94 283
2044 283 -340 311 72 125 334 289 153 -140 21 -322 -10 -239 -2 -79 -312 -249 -326 -20 104 70 -120 52
2066 52 -115 -117 237 362 174 87 505 119 43 176 135 -127 -274 16 -230 -515 -355 -336 -231 73 374 -121
2088 -121 281 501 293 70 304 162 -220 -17 459 90 -187 28 -395 -273 213 -71 -57 -325 72 -192
2108 -192 -60 100 334 84 444 277 173 87 -71 244 -101 24 10 -19 130 -509 -281 -282 -73 -32 -41 -31 54
2131 54 160 117 321 75 161 17 148 239 -138 186 98 206 -61 -49 4 279 2 65 -76 -162 -146 82 54 -27
2155 -27 -86 167 99 28 101 183 142 -60 96 22 193 -111 92 352 -240 -115 -109 35 8 -52 92 32 126 -115 -42
2180 -42 -63 68 91 -73 277 126 279 39 195 -32 -10 -118 -347 -11 13 -85 -42 -200 -24 259 91 246
$$ packed form
2019b58K77kJ37l84K73j07J6Q5l3K35J5m34K41J5r1r1R5q5k33O0J27Kk15K61L77
2044B83o23O51k39N3K09m5j36k93J61l43L12k29K37p7k33O3p7L06J24l4j90J72
2066E2j67kL54J25j88q7M18l86p6J33m1k62j47K90k46k85J60J9J05L04L01m95
2088a21M02K20k08k23K34j42l82K03M76l69k77K15m23J22M86k84J4k68L97k64
2108a92J32J60K34k50L60j67j04q6j58L15l45J25j4k9J49o39K28jK09M1rJ0Q5
2131E4J06m3K04k46Q6j44J31R1l77L24q8J08k67J2N3K75k77O3j41q6J6K28k8q1
2155b7n9K53o8p1P3Q2m1k02J56p4J71l04K03K60n92J25OJ44k7o0J44o0R4k41P3
2180d2k1J31K3j64L50j51J53k40J56k27K2j08k29L36K4r8M3j58J76K83j68J55
$$ plain form
2202 246 4 186 113 237 -45 214 46 -44 110 52 -41 -470 -335 7 -157 -30 -31 -313 -173 -1 -49 -49 -80
2225 -80 443 171 302 237 360 11 -151 42 125 -406 -79 8 -465 -129 32 -110 -168 42 72 -53 -123 55
2247 55 -108 159 25 159 124 89 -147 -62 82 221 -302 -293 187 -136 -344 -330 70 -349 -262 323 -5 38 170
2270 170 146 250 143 285 -169 -50 -113 -168 -279 -230 -84 -243 -221 -208 116 114 78 316 -32 -131 80 -111 52
2293 52 306 71 97 -311 215 -144 -107 18 -7 -213 -30 -22 143 -65 122 -290 -71 -239 -219 -90 -80 230 1
2316 1 103 -164 -121 139 104 11 79 -77 86 39 -254 -33 -23 8 81 88 -64 -13 164 63 -67 -54 -132 95 27
2341 27 -29 -247 3 -182 -155 -89 -333 -75 -128 -147 -204 63 5 225 264 -146 -3 128 36 116 316 146 -45 243
2365 243 6 -29 -122 293 24 -49 -186 390 -429 -102 -140 -178 -132 178 -244 333 165 146 84 -81 128 -76 88
$$ packed form
2202B46k42J82p3J24k82K59j68r0J54n8r3m29J35L42j64J27jk82J40J72m8%l1
2225h0N23k72J31o5J23l49j62J93Q3n31L27Q7m73L36J61j42n8K10L0j25p0J78
2247E5j63K67j34J34l5l5k36Q5J44J39n23RM80l23k08J4M00m19Q7N85l28M3J32
2270A70k4J04j07J42m54J19o3n5j11M9J46j59K2J3L24kl6K38l48r9K11j91J63
2293E2K54k35K6m08N26l59L7J25k5k06J83QJ65k08J87m12K19j68K0J29J0L10k29
2316AJ02k67M3K60l5r3O8j56J63m7k93K21J0L1P3Pj52N1J77j01j30J3p8K27o8
2341B7n6k18K50j85K7O6k44K58n3j9n7K67n8K20L9m10J43J31r2Q0K00j70j91K88
2365B43k37l5r3M15k69p3j37N76q19L27l8l8M6L10m22N77j68j9o2j65K09k04J64
$$ plain form
2388 88 97 11 -88 35 -289 -452 70 -80 56 -250 -386 -20 56 -25 282 21 -15 142 -135 9 253 78 -274
2411 -274 -21 -26 -182 -80 -198 -155 -225 -273 206 -353 -410 170 93 183 -57 94 -55 229 -195 -73 49 -25 -34 74
2435 74 -152 -371 -56 -110 56 -197 -10 -331 -266 -56 90 99 116 30 -52 -43 102 189 -156 180 136 -109 -182 115
2459 115 -43 -180 73 -10 -303 -202 -72 153 10 -181 -51 -308 -204 84 2 16 -65 -99 198 38 -31 146
2481 146 203 93 56 -53 -8 -103 -122 -39 -116 15 33 232 341 303 -174 -89 -19 88 88 287 -181 -252 -46 -96 -112
2506 -112 -137 95 -142 -197 -236 -13 -102 89 25 -460 151 25 142 -33 314 -347 -113 -9 -204 -37 105 -141
2528 -141 -186 3 48 -146 -90 124 185 -130 68 -35 -217 -129 16 27 166 213 35 115 -130 -180 -23 -102 -264
2551 -264 -136 -126 -175 -36 -81 -35 -91 -103 71 -52 57 163 121 -57 150 169 157 134 55 -182 -74 -147 -155 -246 151
$$ packed form
2388H8Rq6r9J23l24j63N22j50J36l06j36L66P6q1L07k61l6J57k77J44K44j75l52
2411b74K53nj56J02j18M3p0m8M79n59n7N80p7R0k40J51j49K84m24J22J22p4rJ08
2435G4k26k19L15n4J66k53J87l21O5K10J46RJ7q6q2RJ45Q7l45L36m4k45p3K97
2459A15j58j37K53q3k93J01J30K25j43j91J30k57J04K88q2J4q1l4K97j60o9J77
2481A46N7j10l7j09M5r5j9Q3p7J31J8J99J09l8m77Q5P0J07%J99m68p1K06n0j6
2506a12k5K32k37n5l9K23q9J91o4m85O11j26J17j75L47o61K34J04j95J67J42k46
2528a41m5J89M5j94N6K14O1l15J98j03j82Q8J45J1J39M7j78Q0k45n0J57p9j62
2551b64J28J0m9J39m5M6n6j2J74j23J09J06m2j78K07J9j2k3p9k37J08p3qr1L97
$$ plain form
2576 151 237 223 170 -109 -71 34 84 149 98 -90 102 109 -221 24 224 -12 -15 190 -108 -35 266 -189 -275 -25
2600 -25 -322 49 -81 -30 35 -43 75 88 176 82 -141 -42 16 133 -210 51 -60 -159 -324 48 7 175 75 158
2624 158 -235 41 -62 322 98 -11 -63 -123 125 48 -24 142 -125 109 68 -222 -116 -130 -20 -4 139 89 5
2647 5 -43 108 171 -103 358 315 -77 48 -198 -97 124 -47 64 46 15 -46 -292 -97 -138 59 11 190 169 -82
2671 -82 195 -65 -136 -161 12 96 127 -179 -2 15 -97 -194 -283 -164 130 152 -95 2 119 -42 36 154 93 92 3
2696 3 144 140 -5 -49 128 -313 171 62 25 -112 -256 80 191 34 187 82 95 87 51 27 416 -56 -11 188
2720 188 97 -96 201 171 75 100 -205 -218 -62 -61 -75 -9 -49 -138 -198 78 -31 20 -29 92 -28 -178 86 -39 306
2745 306 66 157 -247 -285 -72 -149 -88 -277 247 -54 1 -21 -227 256 74 -117 313 -120 -62 -129 185 -78 -40
$$ packed form
2576A51Q6j4n3k79L8J05N0O5n1j88J92Pl30K45K00k36lK05k98P3L01m55q6K50
2600b5k97L71j30N1O5p8J18J3Q8r4k23R9N8J17l43K61j11r9j65L72m1J68j00Q3
2624A58l93K76j03L84k24j09n2o0K48p7p2J66k67K34m1k90J06j4J10J6J43n0q4
2647Em8J51O3k74M61m3l92J25k46J01K21j71J11j8l1o1k46J95m1J97m8J79k1k51
2671h2K77k60p1k5J73Q4L1l06J77J7j12r7q9J19K94K2k47R7J17j61P8J18o1jq9
2696CJ41mj45m4J77m41M84j09l7j37j44L36J11j57J53j05J3ql6k4L89m72M5J99
2720A88r1j93K97l0r6K5l05j3J56Jj4O6m0q9o0K76j09N1m9J21j20j50K64j25L45
2745C06k40R1m04l8K13p7O1j89N24l01N5k2k06M83j82j91M30m33N8o7L14k63L8
$$ plain form
2768 -40 82 -194 150 -62 269 70 42 -143 -83 -111 61 -125 -39 12 -198 141 -11 -95 142 14 46 -135 89
2791 89 52 -153 6 -75 81 94 17 -186 101 -344 -229 -22 76 -177 -18 155 -237 216 -44 26 -135 61
2813 61 107 145 -53 9 -1 -245 29 -177 -122 188 192 -104 23 35 -237 25 101 257 205 4 -29 220 18 -195
2837 -195 -177 -82 104 -27 39 170 -57 -48 34 15 -186 131 -123 113 -364 -14 268 250 39 -54 -280 15 100
2860 100 -59 -235 279 -14 -325 99 -18 -50 193 -97 -20 246 0 -305 17 161 255 -112 163 52 288
2881 288 17 11 -56 159 173 -69 -199 -66 -78 -48 -34 -62 144 -197 37 174 -208 -57 -95 -104 165 33 -47 252
2905 252 277 -132 -106 -135 45 -301 -196 109 -259 57 172 115 29 -25 -99 -83 31 -57 40 66 162 43 -108 -72
2929 -72 -34 182 -59 -15 6 14 45 -56 -33 124 230 -80 94 159 -10 148 -22 -99 65 -77 -36 89 134 -76
$$ packed form
2768d0J22k76L44k12L31j99k8j85O0k8J72j86Q6N1k10L39j52q4K37j28L2j81K24
2791H9l7k05J59q1J56J3p7k03K87m45J15K07R8k53J59J73l92M53k60P0j61J96
2813F1M6L8j98O2j0k44K74k06N5L10Mk96J27J2k72K62P6J56n2k01l3K49k02k13
2837a95J8R5J86j31O6J31k27RQ2j9k01L17k54K36m77L50K82j8k11r3k26K95Q5
2860A00j59j76N14k93l11M24j17l2K43k90P7K66k46l05L22J44R4l67K75j11K36
2881B88k71oo7K15J4k42j30J33j2L0J4k8K06l41K34J37l82J51l8rK69j32q0K99
2905B52K5m09K6k9J80l46J05L05l68L16J15n7q6n4p4J6J14q8R7K6R6j19j51L6
2929g2L8K16k41M4K1QL1j01K3J57J06l10J74O5j69J58j70p7J64j42M1J25M5k10
$$ plain form
2953 -76 109 134 149 -102 -75 322 57 -10 -5 -40 -266 -34 58 109 262 29 76 -81 -139 15 75 -111 -31 -230 9
2978 9 19 226 65 -52 -79 -199 75 -44 173 98 -146 247 210 31 268 227 181 114 -192 36 36 254 -103 -379
3002 -379 -79 37 -106 -119 -112 -126 23 91 -38 -202 -92 79 -21 -115 79 89 1 303 -324 -317 -267 287 -101 -12
3026 -12 -1 -44 229 165 39 -26 129 -172 282 -10 47 3 -77 -310 -99 -86 -177 -98 -70 -186 -156 76 107 -248 68
3051 68 40 -241 252 234 29 103 368 150 -171 -9 -60 -129 77 194 -3 -240 -107 -242 1 98 -65 -56 -189
3074 -189 91 -49 -18 -133 37 -170 67 204 -98 -113 -177 94 44 13 124 47 -45 -235 -95 2 -127 78 -25
3097 -25 -176 158 -133 -214 140 -135 -38 30 -192 121 56 137 63 422 -13 131 -100 40 48 143 -91 112 -106
3120 -106 27 92 230 154 -31 43 -22 -143 -119 246 -121 -226 -54 -53 170 80 -30 75 -134 -26 129 -342 178
$$ packed form
2953g6J85K5J5k51K7L97k65o7Nl5k26K32R2N1J53k33M7j57n8J54O0j86Q0j99K39
2978IJ0K07j61j17k7j20K74j19K17p5k44L93l7j79K37m1m6o7l06K28%K18l57k76
3002c79L00J16j43j3Pj4J49O8j29j64J10J71j00r4J94J0q8L02o27PN0N54l88Q9
3026a2J1m3K73o4j26o5J55l01M54k92N7m4q0k33K11J3r1P9K8j16L0K32L1l55L16
3051F8k8k81M93j8k05P4K65k18l21J62n1o9K06J17j97k37J33j35K43R7j63Rj33
3074a89K80j40L1j15J70k07K37J37l02j5o4K71n0l1J11p7r2j90J40R7j29K05j03
3097b5j51L34k91q1L54k75R7O8k22L13o5Q1p4L59m35J44k31J40QR5k34K03k18
3120a06J33O5J38p6j85P4o5j21K4L65l67j05J72JK23r0j10J05k09J08J55m71N20
$$ plain form
3143 178 340 127 -12 167 193 42 34 19 122 -32 63 -183 17 -204 78 134 -243 183 -204 -158 -85 69 -173
3166 -173 -237 -114 19 331 184 153 108 143 -140 21 7 -177 -135 170 -39 126 57 312 35 -87 0 -200 -129
3189 -129 14 3 119 70 115 -182 165 -140 36 114 -45 105 -5 -80 -192 48 35 213 -113 73 117 135 88
3212 88 206 71 45 108 -195 342 2 96 -18 -98 -17 -108 250 89 33 190 -33 129 -34 236 -80 103 -43
3235 -43 -298 183 -131 64 -119 -52 179 -70 -303 -221 82 -45 78 75 30 81 -348 -60 -62 -118 71 -89 84
3258 84 29 122 -29 92 91 128 1 42 40 254 102 -78 -72 28 19 -7 112 136 95 19 -75 -15 -2 -16 -103 46 170
3285 170 78 204 -165 26 -70 -57 31 -82 -78 -86 0 302 273 113 -32 180 -13 -208 94 20 7 -129 28 -43
3309 -43 -67 252 21 -126 -40 202 33 -152 -91 57 25 222 14 -302 265 35 174 -67 -153 70 -80 16
$$ packed form
3143A78J62k13j39J79K6j51qj5J03j54R5k46K00k21K82N6l77M26l87M6P3J54k42
3166a73o4J23J33L12j47l1m5L5k83J61j4j84M2L05k09J65o9K55k77j22Q7k00P1
3189a29J43j1J16m9M5k97L47l05J76P8j59J50j10p5j12K40j3J78l26J86M4J8m7
3212H8J18j35k6O3l03N37l40R4j14q0Q1r1L58j61n6J57k23J62j63K70l16J83j46
3235d3k55M81l14J95j83O7K31k49k33Q2L03j27J23lm5N1m29K88kn6J89j60J73
3258H4n5R3j51J21jL7j27M1kK14j52j80OJ00rk6J19K4m1p6r4O0J3j4q7J49J24
3285A70r2J26l69J91r6J3Q8j13MqQ6L02k9j60j45K12j93j95L02p4j3j36J57p1
3309d3k4L19k31j47Q6K42j69j85O1J48l2J97k08l16N67k30J39k41q6K23j50R6
$$ plain form
3331 16 49 51 177 -102 -52 -55 25 101 -148 -265 63 -78 -353 38 50 -25 -60 63 -148 -56 100 291 333 -12 -239
3356 -239 438 15 26 83 5 -15 -139 212 -138 426 -10 -187 30 455 -107 -19 102 -208 20 95 -98 -88
3378 -88 190 -65 265 47 183 -236 -83 -100 93 99 -178 -5 104 59 -182 -115 -124 11 240 107 20 -127 -13
3401 -13 -60 -34 259 6 37 -243 103 166 45 -73 -18 200 -69 234 -144 -20 -24 -83 -37 -81 180 90 59 -61
3425 -61 78 199 160 44 -38 -320 -168 256 -193 60 -80 -83 35 -69 149 281 -69 8 24 -48 -277 146 262
3448 262 28 15 22 -94 -230 -39 -9 -128 -214 -62 14 177 -158 24 112 -74 -3 242 166 -136 27 -36 -237
3471 -237 -160 -63 18 91 119 -176 54 -4 -43 -141 54 4 -127 300 179 39 -181 138 284 -50 -141 469 91
3494 91 -277 -56 -67 -150 -66 -1 -205 11 -192 -55 -40 116 -51 -59 -453 -47 11 8 49 -194 53 28 -113 -113 4
$$ packed form
3331A6L3KJ26k79N0lQ0P6k49j17L28j41k75L91J2p5l5J23k11R2J56J91M2l45k27
3356b39O77m23J1N7p8k0j24L51l50N64m36j77K17M25n62Q8J21l10K28P5j93J0
3378h8K78k55L30k18J36m19J53j7J93Ok77J73J09m5k41O7rJ35K29j33q7j47J14
3401a3m7K6K93k53L1k80L46O3j21j18N5K18k69L03l78J24mn9M6m4K61r0l1j20
3425f1J39J21l9j16q2k82J52M24m49K53j40lJ18j04K18J32l50P7J6p2k29M23J16
3448B62k34j3Pj16j36J91L0j19q6J52P6J63l35J82Q8j86P1K45p6l02J63o3k01
3471b37P7R7Q1P3K8k95K30n8l9r8J95n0j31M27j21j40k20L19J46l34r1O10l78
3494I1l68K21j1q3Q4O5k04K16k03J37J5J56j67ql94M06N8lM1k43K47k5j41%J17
$$ plain form
3519 4 28 -129 105 47 6 -90 30 274 140 -105 -22 133 -129 12 36 -285 236 -39 -93 3 110 59 163 -160
3543 -160 -41 -373 27 -291 126 16 167 84 366 79 -81 167 94 217 -61 -55 -238 -96 80 -194 -12
3564 -12 88 -129 -131 -37 -72 71 273 -30 -50 -237 124 -36 107 79 102 -219 -110 72 -101 30 -114 -235 -213
3587 -213 -33 130 -223 120 -111 -25 -126 -69 139 15 93 -61 -41 -54 22 174 86 -182 -218 129 318 -108 -74
3610 -74 -33 84 -81 -23 196 -94 37 -142 146 -3 -119 -200 -93 -69 54 -172 195 49 -220 -43 142 64
3632 64 310 -280 109 -193 24 261 -20 -40 -93 -34 -94 175 -148 -4 137 -3 -67 -23 -252 131 -142 -38
3654 -38 -38 100 24 187 -36 97 165 15 -71 58 184 41 111 19 -279 -63 59 81 -136 -95 208 114 -33 106
3678 106 416 -26 -119 -176 113 -109 -7 206 -93 259 225 73 -143 31 195 -158 218 303 39 102 45 213
$$ packed form
3519DK4j57K34n8m1r6J20K44j34k45Q3J55k62J41K4l21N21k75n4R6J07n1J04l23
3543a60J19l32M00l18M17j10J51q3K82k87j60K48p3J23k78Oj83J42J76k74J82
3564a2J00k17kR4l5J43K02l03k0j87L61j60J43k8K3l21J09J82j73J31j44j21K2
3587b13J80J63l53L43k31Q6j01N7K08j24P8j54K0j3P6J52q8k68l6L47J89m26L4
3610g4M1J17j65N8K19k90J31j79K88j49j16q1J07K4J23k26L67j46k69J77J85p8
3632F4K46n90L89l02K17K37k81k0n3N9o0K69l23J44J41j40o4M4k29L83k73J04
3654c8%J38p6J63k23J33O8j50q6J29J26j43P0r2k98K16J22K2k17M1L03r4j47J39
3678A06L10m42r3n7K89k22J02K13k99L52l4j52k16J74J64l53L76Q5k64O3n7J68
$$ plain form
3700 213 84 -29 -76 -259 86 -85 -19 37 -326 65 -74 -116 99 -165 -97 356 -56 -40 128 -110 -123 113
3722 113 -185 -186 303 37 5 -256 91 -164 -314 189 130 44 -34 102 153 39 -72 52 -66 -135 118 208 -104
3745 -104 -35 -80 -178 -333 75 26 136 8 -159 9 256 -112 -84 192 -199 -73 37 59 -93 -33 -339 -19
3767 -19 -265 78 -236 -118 97 -140 -77 -228 279 -147 114 203 -147 111 54 31 122 -142 -94 9 45 187 -76
3790 -76 -164 9 0 -18 -75 -23 197 205 -111 -266 209 -70 -200 -142 49 114 -76 -327 -88 3 62 59 -77 -194 107
3815 107 -45 47 79 214 -162 -54 -118 -39 224 2 15 -92 -100 -240 -36 -153 -51 4 11 -460 -96 -12 -35 -290
3839 -290 -212 164 -42 -40 -94 179 -48 -73 20 48 18 -83 44 -56 61 14 20 -131 141 -179 -50 -250 -16 37
3863 37 -162 -92 41 -124 -146 -84 -64 38 -101 -54 -171 13 -131 118 -8 81 -22 -73 71 -70 120 -115 24
$$ packed form
3700B13j29j13m7j83L45j71O6N6l63L91j39m2K15k64O8M53m12J6J68k38j3K36
3722A13k98jM89k66l2k61L47k55j50N03n9q6p8J36N1j14j11J24j18o9K53R0l12
3745a04O9m5r8j55M08m9J10j28j67J68K47l68K8K76l91J26J10K2j52O0l06L20
3767a9k46L43l14J18K15k37O3j51N07m26K61Q9l50K58n7k3R1k64M8J03L6J42k63
3790g6q8J73rj8n7N2K20Ql16j55M75k79j30N8J91O5j90k51K39R1N9lj36j17L01
3815A07j52R2L2J35l76J08o4P9K63k22J3j07qj40K04j17J02N5Pm71L64Q4k3k55
3839b90P8L76k06Kn4K73k27k5R3K8l0j01J27j00J17m7Oj51K72l20J29k00K34N3
3863C7j99P0J33j65k2O2K0J02j39M7j17J84j44K49j26Q9j03n1J44j41J90k35J39
$$ plain form
3886 24 -314 9 1 225 -148 92 133 -154 109 -148 18 -29 -13 -74 -69 -58 106 128 -205 132 -105 293 28 9
3910 9 100 85 -3 108 237 179 -55 -117 -30 -249 123 -131 132 -11 -205 15 39 94 101 5 16 243 -74 365 244
3935 244 336 -119 218 77 137 105 102 95 -189 -196 -39 -11 -96 258 4 -264 294 -213 -162 50 -160 -173 -111 69 12
3960 12 -3 103 -12 48 -7 -66 -142 -34 242 -385 116 -1 -181 147 -93 49 -42 -65 126 -229 -142 -47 22 -412
3984 -412 -70 65 -67 -23 96 95 103 -24 -43 199 -258 -131 317 122 65 -130 245 35 55 124 189 241 76 173
4008 173 334 -80 26 -273 59 -133 -294 -27 186 103 50 196 30 154 -279 119 271 -251 -115 53 229
4029 229 -127 -267 -149 -125 -32 -128 -179 -302 -146 -159 -179 -151 -257 -52 54 59 41 103 -45 91 131 -65 -196 54
4053 54 -44 -189 -128 209 -9 -64 69 -242 35 -32 -145 -75 -148 135 13 -33 -106 -83 268 -246 81 32 -81 190
$$ packed form
3886B4l38L23qK24l73K40M1k87K63k57J66m7J6o1NJ1J64K2l33L37k37L98k65j9
3910IR1j5q8J11J29n8k34o2Q7k19L72k54K63j43j94K20K4N5Pr6J1K27l17M39j21
3935B44R2m55L37j41O0l2lpk84pJ57K8q5L54k54k68N58n07N1K12k10j3O2J80n7
3960A2j5J06j15O0n5n9p6J08K76o27N01j17j80L28k40J42r1k3J91l55Q7R5O9m34
3984d12L42J35j32M4J19jQj27j9K42m57J27M48j95n7j95L75k10K0O9O5N2j65R7
4008A73J61m14J06k99L32j92j61K67K13q3n3J46j66J24m33L98J52n22J36J68J76
4029B29l56j40J18K4R3r6n1j23J56j3k0K8j06K05J06Nj8O2j48J36M0j96j31K50
4053E4r8j45O1L37k18n5J33l11K77o7j13P0p3K83j22m6p3K3L51n14L27m9j13K71
$$ plain form
4077 190 -62 0 -9 181 14 -169 83 -96 54 -48 -109 -45 -114 -205 -70 -47 -195 -77 -81 53 62 -158 121 -99
4101 -99 2 -70 -114 66 1 -130 205 121 -122 -48 33 176 186 125 80 166 77 323 116 30 -185 2 16 102 -109
4126 -109 235 -74 -43 -111 211 -92 94 -50 -72 -51 336 120 281 183 -9 140 185 313 24 -193 -14 27
4148 27 13 23 22 -84 -8 -190 -107 5 -37 273 141 48 -10 102 48 -377 -74 -58 -244 145 -23 -121 105 -13
4172 -13 -277 -226 138 20 105 -131 -102 -42 -48 32 -241 -92 -80 -165 70 32 143 -37 -253 0 -203 -196 -137 -230 -212
4197 -212 289 279 16 325 167 42 17 -127 228 -93 9 -9 225 -149 70 217 -124 -78 -96 122 -16 -88
4219 -88 60 6 -123 -121 -82 -186 54 -129 162 90 144 34 39 138 -10 -157 233 -98 -29 -53 22 27 159 414 -190
4244 -190 224 188 68 349 70 -6 -170 -72 -95 79 -131 44 17 19 186 163 -116 66 -73 156 -337 -454 196
$$ packed form
4077A90k52O2rJ90j67j83K52j79J50j02o1O4o9r1J35K3j48J18mJ34Rk20K79k20
4101i9J01p2m4J80o5j31L35q4k43P4Q1J43J0o1m5Q6q9K46k07q6k15J87J4Q6k11
4126a09L44l09L1o8L22l03J86j44k2K1L87k16J61r8j92J49M5J28k89k17J79M1
4148B7j4J0jj06P6j82Q3J12m2L10j32r3n8J12n4m25L03J6j86L89j68r8K26j18
4172a3k64N1L64j18Q5k36K9O0oQ0k73J49J2q5K35l8J11j80k16K53k03PN9r3J8
4197b12N01j0k63L09j58j25k5j44L55l21J02j8K34l74K19J47l41M6j8K18j38p2
4219h8J48n4j29KL9j04K40j83K91p2N4j10NR9j48j47L90l31O9k4P5NJ32K55o04
4244a90M14l6j20K81k79p6j64R8k3J74k10J75k7KJ67k3k79J82j39K29m93j17O50
$$ plain form
4267 196 104 254 -213 222 -9 -23 47 -49 147 -128 95 -79 98 -58 -239 6 -42 -33 -153 163 -88 45
4289 45 -371 135 210 37 -132 3 40 119 41 -21 -40 -66 14 176 -78 -95 115 -75 259 -181 -70 88 130 -70
4313 -70 8 274 69 22 265 -70 131 22 -306 256 -33 -191 18 -35 115 49 118 102 276 26 233 150 21
4336 21 -17 -2 16 -5 107 81 -70 -38 141 368 -108 -14 179 -89 -24 63 -206 -230 12 84 49 -56 -196 -145 -56
4361 -56 99 118 -38 85 275 -127 -90 -72 -183 -182 37 69 112 148 -24 -57 31 168 -4 120 65 -31 172 40
4385 40 58 -94 -119 331 -309 -52 7 -185 -3 -222 -7 -41 252 -136 -36 1 175 286 345 -91 -189 70 113
4408 113 32 299 -157 -78 -37 78 2 22 -10 -172 112 -334 -14 -179 88 -137 -205 28 112 29 -44 -161 27
4431 27 -200 -157 -201 -87 -48 59 -67 -49 272 -65 -177 -61 -25 137 97 -103 12 -248 -223 1 44 80 -25
$$ packed form
4267A96r2J50m67M35k31j4P0r6J96k75K23j74J77j56j81K45m8Rj20L16k51J33
4289D5m16N06P5j73j69J35L7P9p8o2j9k6Q0J62k54j7K10j90L34m40J11J58M2k00
4313g0P8K66k05m7K43l35K01j09l28N62k89j58K09n3J50o6O9j6J74k50K07q3j29
4336B1l8J5J8k1J12k6j51L2J79K27m76R4J93k68O5Q7k69k4K42P2l5j05j40N1Q9
4361e6J55J9j56J23J90m02L7J8j11JK19L2M3L6j72l3Q8J37j72J24n5r6K03j32
4385D0J8j52k5M50o40K57N9j92J82k19K15l4K93l88J00L7J74J11N9m36r8K59M3
4408A13q1K67m56P9M1J15p6K0l2j62K84m46L20j65K67k25o8K33Q4q3p3j17J88
4431B7k27M3m4J14L9J07j26J8L21l37j12J16L6J62m0k00J15k60K5K24M3L6j05
$$ plain form
4454 -25 -36 -5 44 -52 42 -38 -109 193 68 128 -215 113 -66 46 185 -270 13 144 123 -48 -2 48 -245 22
4478 22 52 -39 -13 50 -84 -208 -67 93 31 -166 -16 -182 -50 70 209 68 251 -397 162 203 -330 23
4500 23 -66 -226 101 0 65 -126 8 100 212 4 98 47 -172 216 179 201 -7 246 -15 -136 61 -217 94
4523 94 -74 -199 -23 -59 55 -108 -32 -109 -29 15 104 -40 167 61 -355 -100 -22 80 -125 24 -82 -97 -52
4546 -52 -88 -120 92 11 89 -1 -386 -160 74 26 -142 -174 -132 240 -69 211 313 -37 217 16 113 156 24 47
4570 47 -69 166 -161 -181 52 -294 89 9 103 125 270 206 86 -14 91 89 -169 138 33 -235 -230 -185 30 382
4594 382 -64 -144 96 81 60 22 -267 188 -103 -233 -11 138 -5 116 25 -430 -162 275 47 60 168 63
4616 63 83 -74 -113 164 63 68 90 -184 -66 -294 150 181 280 -103 -65 104 -119 -243 -116 102 -23 35 161
$$ packed form
4454b5j1L1M9r6R4q0p1L02j25O0l43L28j79J12J39m55K83J31k1j71M6N0k93K67
4478B2L0r1K6O3j34j24J41J60o2j97J50j66J32J20J39j41J83o48N59M1n33L53
4500B3q9j60L27j01O5j91J34R2J12k08R4n1k19L88l7K2k08K53k61j21J97k78L11
4523I4j68j25J76l6J14j63P6p7Q0M4Q9j44K07j06m16K55P8J02k05J49j06j5M5
4546e2l6l2K12q1P8r0l85K26K34m8j68l2M2L72l09K80J02l50K54k01R7M3j32K3
4570D7j16K35l27k0K33l46L83q0R4K2J45o4j20j00J05kk58L07j05k68NM5K15L52
4594C82m46q0K40j5k1l8k89M55k91j30K22J49j43J21r1m55K68M37k28J3J08j05
4616F3K0j57l9K77j01NK2k74J18k28M44L1R9l83L8J69k23j24J27K18j25N8J26
$$ plain form
4639 161 56 -303 175 235 -34 199 -66 -124 154 97 -175 -172 209 -48 63 18 8 -194 298 -26 24 134 -119
4662 -119 -290 241 140 -149 -222 -46 -92 30 4 122 352 7 -14 390 32 201 -12 -322 135 51 -138 -166
4684 -166 -145 -330 37 25 56 -56 183 33 -39 214 28 95 112 63 48 -7 -184 139 54 24 172 192 -246 -121
4708 -121 13 -281 -57 -141 101 -60 95 -215 94 -50 -5 -110 -62 198 219 170 -185 129 52 -131 -300 -121
4730 -121 -25 -74 -69 -154 -184 -154 -253 -334 -6 99 -20 209 129 241 -222 47 -68 -443 107 -59 -48 -163 -230 206
4754 206 -111 3 227 -225 -99 -201 2 118 -43 2 -63 152 222 -169 168 57 173 -143 235 107 -210
4775 -210 -92 22 6 -58 -31 76 174 -129 -2 305 -62 6 -7 81 88 3 97 -6 -67 -76 -248 -157 -73 27 -19 -204
4801 -204 64 -54 209 125 -25 224 46 -8 -1 238 32 -231 -72 -59 172 -71 -173 -148 78 -238 -23 13
$$ packed form
4639A61j05l59M78O0k69K33k65n8K78n7k72LL81k57J11m5j0k02M92l24N0J10k53
4662a19j71N31j01k89p3J76m6J22k6J18K30l45k1M04l58J69k13l10M57q4j89k8
4684a66K1j85L67j2L1j12K39j50p2K53j86O7J7m9j5n5j77L23q5l0J48K0m38J25
4708a21J34k94K24q4K42j61J55l10L09j44M5j05M8K60K1m9l55L14p7j83j69J79
4730a21R6m9Nq5l0L0r9q1L28J05j19K29q0J12m63K69j15l75N50j66J1j15o7M36
4754B06l17J14K24m52J26j02K03J16j61M5o5K15P0l91L37j11J16l16L78j28l17
4775b10J18J14j6o4K7J07R8l03J27L07l67O8j3Q8Pq5R4j03o1rj72R1Q4J00m6j85
4801b04K68j18K63q4j50K49j78n4PK39k06k63J59J3K31k43j02K5K26l16K15L6
$$ plain form
4823 13 0 -267 116 -65 124 124 18 -281 62 -72 -202 -119 -110 -111 -117 36 -238 -8 15 -76 -223 -199 -169 35 -188
4848 -188 279 42 -7 33 -152 64 -94 -35 144 -143 100 123 -176 -37 86 -67 81 99 131 -203 -54 142
4870 142 221 109 -37 -326 -37 88 245 78 28 197 240 -63 -318 -3 -20 -27 -62 -12 132 49 -28 -113 -43 -7
4894 -7 232 -232 85 90 124 108 177 401 -61 -38 61 2 -125 -283 235 160 -230 -71 55 -77 53 -20 -252 18
4918 18 17 41 -11 -294 -96 34 30 191 218 -176 67 64 -79 -448 11 10 -90 -157 -87 190 -52 284 -59 -102 -36
4943 -36 56 -154 -216 67 -93 201 127 30 -20 5 -132 19 -39 -135 12 -172 51 5 27 -17 191 142 -306 264
4967 264 86 71 -93 62 35 -136 38 133 88 39 -108 -272 96 9 95 104 -66 42 74 221 -120 4 53 102
4991 102 333 -65 49 199 -90 -95 64 280 -70 5 -132 -57 -228 -224 120 98 -55 -114 -81 54 331 -244 -71
$$ packed form
4823A3j3k67L83j81J89%j06k99L43j34j30Q3RjoJ53k74K30K3r1j47K4L0K04k23
4848a88M67k37m9M0j85K16j58N9J79k87K43K3k99J39J23j53J48J8L2l34J49J96
4870A42P9j12j46k89K89J25J57j67n0J69M3l03k55L15j7pl5N0J44q3p7q5P0L6
4894gK39m64L17NL4j6O9K24m62K3R9n9j27j58N18p5l90J59J26j32J30p3k32K70
4918A8jK4n2k83J98J30mJ61K7l94K43lj43l69M59jj00o7P0K77k42L36l43m3O6
4943c6R2k10o2K83j60K94p4r7n0K5j37J51n8r6J47j84K23m6K2m4K08m9m48N70
4967B64j78j5j64J55k7j71J74R5m5m9j47j64L68q7Q6Rj70J08L2J47l41J24M9M9
4991A02K31l98J14J50k89nJ59K16l50P5j37P5j71ML44k2j53n9L3J35K77n75J73
$$ plain form
5014 -71 399 86 23 215 -136 63 -138 -53 -19 -30 202 107 168 -38 88 -54 -21 98 -196 159 86 -4 -55 142
5038 142 210 57 -30 -46 39 30 50 32 301 -194 -91 -71 127 148 145 86 127 61 204 -256 -158 207 -54 -166 29
5063 29 81 -97 -287 -207 26 -28 -98 -27 -162 144 118 123 -24 -12 66 -131 -70 -32 159 -151 173 -138 93 -64
5087 -64 120 12 20 68 -91 59 6 -12 -8 147 93 -220 -20 -7 -12 163 -183 -139 135 12 -59 -100 -271 -112 -181
5112 -181 323 202 -41 106 -49 68 -278 -110 -241 49 -131 -118 -27 -102 -12 89 -162 -67 -101 68 63 -133 154
5135 154 42 116 87 -189 33 -172 34 -35 18 200 95 -64 -106 -111 -91 179 67 -119 243 -1 117 -58 381
5158 381 73 2 -16 -40 113 -8 35 163 -47 35 237 131 -49 -107 26 -99 29 41 8 -169 140 -424 -40
5181 -40 -82 14 -156 73 187 -84 83 -18 26 -140 70 46 -170 208 215 15 -129 -18 144 -239 30 9 -212
$$ packed form
5014g1M70l13o3J92l51J99k01Q5L4j1K32r5O1k06J26j42L3J19k94L55p3r0n1J97
5038A42O8j53q7j6Q5rK0j8K69m95J03K0J98K1ln9M1o6J43m60R8L65k61j12J95
5063B9N2j78j90Q0K33n4p0P1j35L06k6Nj47J2P8j97O1L8J91l10L24l11K31j57
5087f4J84j08QM8j59J50n3j8MJ55n4l13K00J3nJ75l46M4K74j23p1m1j71J59o9
5112a81N04j21k43J47j55J17l46J68j31K90j80J3R1p5R0J01k51R5l4J69nj96K87
5135A54j12P4k9k76K22k05K06o9N3J82j05j59m2nK0K70j12j86L62k44J18j75M39
5158C81l08p1j8k4J53j21M3J28k10Q2K02j06j80n8J33j25J28J2l3j77L09n64L84
5181d0m2R6j70K29J14k71J67j01M4j66K10k4k16L78Pk00j44J11J62l83K69k1k21
$$ plain form
5204 -212 -217 -37 104 -215 4 56 237 -59 -20 -110 167 241 32 -31 -61 -31 30 18 -333 -76 12 -59 60 -34 -126
5229 -126 86 -164 53 4 186 -170 -97 186 -101 -38 110 -278 -223 26 37 -34 -346 -373 58 225 -35 -116 227
5252 227 -234 98 -22 -191 -19 32 -209 235 -21 140 83 -61 -156 -150 -22 31 -28 133 -107 -92 -305 119 42
5275 42 136 34 -185 105 -201 -20 343 285 -215 -65 47 59 -172 -4 -221 42 -145 98 -168 -35 111
5296 111 -307 -122 -204 -484 112 -129 213 355 188 114 -88 345 -27 -224 16 -243 -110 106 -280 -72 -51
5317 -51 -91 -62 45 47 31 106 -150 -17 -136 7 35 12 -84 -226 11 -59 -120 275 113 -25 -148 -298 254 -42
5341 -42 -113 -49 -27 -86 -227 68 105 -56 -99 -46 205 73 -147 35 302 -110 181 -24 -53 -320 16 -203 -29
5364 -29 -204 -22 152 143 123 102 -178 60 168 22 -32 -16 -56 -213 122 -233 161 -113 -143 -28 -139 -17 -12 37
$$ packed form
5204b12nJ80J41l19K19N2J81k96L9r0K77P4k09o3l0L0O1j2l51K57Q8p1J19r4r2
5229a26K12k50K17m9J82l56P3K83k87O3J48l88N5K49J1p1l12k7M31J67k60q1L43
5252B27m61L32j20j69J72N1k41M44k56J61n7j44r5OJ28N3n9J61k40J5k13M24p7
5275D2R4j02k19K90l06J81L63n8n00J50J12J2k31J68k17K63j87K43k66J33J46
5296A11m18J85q2k80N96k41L42J42j67p4k02M33l72j97K40k59J33K16l86K08K1
5317e1m0K9J07Kj6P5k56J33j19J43K8k3r6j42K37p0o1L95j62j38j23j50N52k96
5341d2p1O4K2n9j41K95L7j61m3N3K51j32k20J82K67m12K91k05k9k67L36k19J74
5364b9j75J82J74rk0k1k80K38J08j46n4J6m0j57L35l55L94k74l0J15j11J22NM9
$$ plain form
5388 37 22 -155 35 -37 -25 145 91 -345 68 -39 54 -145 124 -253 122 -44 -23 104 45 -210 229 -56 14
5411 14 72 149 -84 119 168 -174 156 126 98 181 -122 -13 -42 76 -19 108 240 -135 180 -237 -42 -127 -297
5434 -297 64 -108 -33 127 -78 235 -25 24 -178 120 -40 15 -165 48 -315 -88 75 -188 5 -54 71
5455 71 -149 115 362 113 -45 60 -34 68 147 -24 77 -58 -43 -45 -173 -139 186 229 -30 -72 155 -285 169
5478 169 -52 67 -86 352 -140 -54 1 -130 155 -42 208 -57 -125 36 136 -111 -5 22 11 163 -11 -123
5500 -123 184 -159 227 -98 15 73 5 -41 23 -259 187 -221 -134 -57 166 -73 282 -103 231 94 12 -186
5522 -186 -141 -37 -46 79 89 243 -233 -71 -211 -167 420 -125 152 -90 -54 148 90 76 -119 74 49 159 -107
5545 -107 -52 -5 266 208 50 -53 102 -164 -83 184 -137 74 95 -71 162 5 -23 53 16 156 -213 -43 -4
$$ packed form
5388C7j5j77J90p2J2J70n4m36M13j07R3j99K69l77L75j66K1J27n9k55M39k85P0
5411A4N8P7k33K03M9l42L30l0k8Q3l03J09k9J18r5J27J32l75L15m17J95q5j70
5434b97L61j72P5J60k05L13k60M9k02K98j60N5j80K13l63K27J63k63J93n9J25
5455G1k20K64K47k49j58J05r4J02P9j71J01j35J5kj28L4L25M3k59m2K27m40M54
5478A69k21J19j53M38m92Q6N5j31K85j97K50k65o8J61J00k47J06K7j1J52j74j12
5500a23L07l43L86l25J13N8o8m6O4k82M46m08Q7P7K23k39L55l85L34j37q2j98
5522a86M5J04rJ25J0J54m76J62j40M4N87n45K77k42L6K02n8j4j95J93k5J10k66
5545a07N5M7K71n8j58j03J55k66Q1K67l21K11K1j66K33j57k8P6l7J40l69J70L9
$$ plain form
5568 -4 -61 -116 -25 -91 -159 159 94 259 306 -102 -76 209 -64 72 -52 37 266 270 -130 -53 40 -210 -38 -40 -48 -2 -5
5595 -5 -82 -204 66 34 152 363 -38 -232 102 51 282 -140 146 -115 38 242 14 -114 -81 212 -52 -116
5617 -116 -174 -98 -12 50 101 58 -30 147 29 -110 -91 68 -107 -139 -71 81 39 -246 -99 -150 -42 73 38 73 111
5642 111 7 -244 176 -238 224 378 -42 -61 -119 90 -66 147 36 -292 -3 -225 -264 77 -2 92 36 28 53
5665 53 191 -94 -38 13 95 120 -44 72 -106 237 20 -104 -28 -185 -64 46 129 77 -5 26 -214 27 -147
5688 -147 30 140 -35 -226 248 32 -114 -266 19 113 -196 87 -154 -112 14 257 30 -124 -107 -74 -67 -54
5710 -54 -115 -12 24 -127 -78 -69 117 171 220 -387 -22 134 176 111 -99 -19 -159 124 281 299 122 133 -172 115
5734 115 -22 95 -217 -113 -143 -199 202 -293 -337 -56 17 78 58 193 136 -11 -308 -43 68 63 -74 95 -48
$$ packed form
5568dn7n5R1o6o8L18o5J65M7m08K6K85k73J36j24Q9K29Mm00P7R3k50J72kqM6l
5595ep7j22K70l2J18K11m01j94L34n1K31m22K86k61J53K04k28j28L3K93k64o4
5617a16n8P6Q6O2N1m3q8J77j18j39J9J59j75l2O8J52m2k85J47n1J08J15l5L5L8
5642A11j04k51M20m14M62J54m20j9n8K09j56K13j11l28K89k22l9L41p9R4n6qK5
5665E3J38k85N6N1Q2K5j64J16j78L43k17j24P6j57J21J10Q3n2q2L1k40K41j74
5688a47J77J10j75j91M74k16j46j52K85R4l09K83k41M2J26K43k27j54J7L3PJ3
5710e4o1J03L6j51M9RJ86N4M9o07L65J56M2o5k10Q0j40K83J57J8j77J1l05K87
5734A15j37J17l12J04l0n6M01m95m4K81P3O1k0J35n7j47k97K65J11nj37J69j43
$$ plain form
5757 -48 -207 82 61 -97 -160 -109 -48 -32 -55 234 -138 9 215 -58 -14 126 164 82 251 -129 -124 247 -80 140
5781 140 65 11 -96 123 19 -16 117 -123 -232 -305 131 88 -230 -13 -63 5 94 33 157 140 77 98 -122 -129 125
5806 125 -186 55 72 44 60 114 -318 50 -25 166 79 -149 89 170 186 -11 -41 -240 -163 -102 136 -75 48 35
5830 35 -27 -316 -20 -157 -128 -174 172 -181 365 -5 -186 -45 82 178 46 -89 -375 -43 241 -70 146 228
5852 228 -49 -1 -26 155 6 -24 -50 195 -51 -260 -107 153 -102 -91 448 111 -1 -25 80 -101 146 33
5874 33 81 -38 -175 138 353 -77 -298 31 -217 148 32 -164 -92 -37 -275 42 -17 -168 59 -4 -89 -53 126
5897 126 108 -110 308 -167 139 59 -67 381 7 -144 35 -113 46 -79 19 -15 -30 -222 -260 -67 -125 116
5919 116 -182 20 -184 -169 -98 -158 -39 103 -152 11 79 -207 -5 55 34 76 -17 -171 -49 25 -13 -97 -10 49
$$ packed form
5757d8j59K89k1j58o3N1O1J6k3K89l72J47K06k73M4J40L8q2J69l80NL71l27K20
5781A40p5n4j07K19j04l5J33k40j09p3M36m3l18K17n0O8Q9o1J24j7o3K1k20pK54
5806A25l11K41J7k8J6N4m32L68p5J91q7k28K38Q1J6j97l0j99P7O1K38k11J23j3
5830C5o2k89K96j37K9m6L46l53N46l70j81J41J27R6j32j35k86L32K84l11K16Q2
5852B28k77M8k5J81j49l0k6K45k46k09J53K60k55J1N39l37j12k4J05j81K47j13
5874C3M8j19j37L13K15m30k21L29k48L65j16j96P2N5k38L17n9j51K27o3q5L6J79
5897A26j8k18M18m75L06q0j26M48l74j51J79j48J59j25R8l4j5j92l8J93n8K41
5919A16k98K02k04J5P1o0J19J42k55J63O8k86K02O0k1M2r3j54J22P4l8q4Q7N9
$$ plain form
5943 49 -256 -125 17 -63 261 -146 -40 43 68 106 -65 60 -61 139 -238 157 148 390 65 62 122 108 200 -18
5967 -18 -217 -125 65 224 228 70 -38 198 -81 61 -18 1 141 -10 -47 6 310 -260 -56 61 -14 -133 4
5990 4 -25 152 -135 73 11 51 56 -65 -24 -115 28 -30 26 133 -263 105 64 10 204 -206 -131 191 -130 9 115
6015 115 -66 -51 167 -60 15 -204 -192 45 -31 -43 -52 45 102 151 -155 -63 -275 53 -9 -125 -34 224 116 133 139
6040 139 -216 -48 -289 -144 203 185 -128 246 -212 62 81 -179 -91 -33 273 -105 -104 27 124 -302 181 53
6062 53 89 -35 -9 -156 11 63 121 114 31 39 -62 -80 320 -18 -13 -29 -142 70 -217 -206 188 -80 174 142 26
6087 26 50 -121 344 204 284 236 -32 -46 -172 43 78 -3 -41 45 41 -67 53 -74 156 -48 1 -10 -70 43 8
6112 8 15 -117 -29 101 15 -286 37 -100 84 -36 -30 -192 144 20 -274 -39 -182 -128 -70 64 -59 30 -52 -276
$$ packed form
5943D9l05J31J42q0L24m07J06Q3K5L8j71J25j21K00l77L95rK42l25lO0j4R2k18
5967a8j99R2J90J59Mj58j08K36k79J42p9J9J40j51l7N3L04n70K04J17p5j19J37
5990Dk9J77k87K08o2M0Nj21M1r1J43n8N6J07l96L68m1n4J94m10P5L22l21J39J06
6015A15j81J5K18k27P5k19J2K37p6j2rR7N7M9l06R2k12L28o2j16R1K58j08J7O
6040A39l55J68k41J45L47j8l13L74m58K74J9k60Q8N8L06l78JJ31R7m26M83j28
6062E3L6j24K6j47J67N2N8pq3Qj01j8M00l38Nj6j13K12k87J1L94k68K54l2j16
6087B6K4j71M65j40Q0m8k68j4j26K15L5q1l8Q6mj08J20j27K30k04M9j1o0J13l5
6112HPj32Q8J30q6l01L23j37J84j20Oj62L36j24k94K35j43N4N8J34j23Q9q2k24
$$ plain form
6136 -276 67 -111 -75 106 -176 -142 37 -157 -12 -386 5 17 -4 308 -215 -168 -322 150 -221 175 161 -32
6158 -32 -233 162 63 -145 -55 198 33 23 196 -33 114 53 121 -367 -143 6 153 -35 51 156 48 359
6180 359 133 10 72 -167 380 -65 -150 -76 -148 -257 -4 109 -64 130 33 -23 -113 -55 64 -190 -196 66 48 284
6204 284 124 -85 -106 380 -67 137 15 6 -165 -126 130 33 -1 -174 240 -32 64 137 41 -292 -81 7 -32 70
6228 70 -94 -33 45 -99 148 129 -29 -5 -113 54 -250 180 5 -102 94 -50 -46 148 156 163 -128 -10 185 -181
6252 -181 127 -3 -205 38 109 72 -146 133 -110 340 100 -44 -1 53 -61 -54 111 -143 -31 -73 16 -160 -19
6275 -19 42 -66 -183 -337 75 60 230 -257 55 -254 54 194 72 118 -76 -63 48 -92 -168 101 -129 -145
6297 -145 120 72 51 -118 -93 -12 -165 -97 -188 -81 194 87 48 -71 -63 -117 153 -123 143 -32 -175 -124 117 203
$$ packed form
6136b76L43j78L6J81k82L4J79j94J45l74L91J2k1L12n23M7j54M72l71L96j4j93
6158c2k01L95r9k08R0K53j65j0J73k29J47o1O8m88K24J49J47j88Q6J05j08L11
6180C59k26j23O2k39N47m45q5P4p2j09K53J13j73J94r7n6r0N8J19k54oK62j8K36
6204B84j60k09k1M86m47K04j22rj71L9K56r7l4j73M14k72R6P3r6l33K11Q8l9J02
6228G0j64O1P8j44K47j9j58K4j08J67l04M30j75j07J96j44MJ94QPk91J18J95l66
6252a81L08j30k02K43P1l7k18K79k43M50k40j44M3N4j14PJ65k54J12m2Q9j76J41
6275a9O1j08j17j54M12j5J70m87L12l09L08J40j22M6j94J3J11j40p6K69k30j6
6297a45K65m8k1j69K5Q1j53O8r1J07K75j07l9j19Qn4K70k76K66j75j43N1K41Q6
$$ plain form
6321 203 -72 59 -227 44 -137 -30 264 -324 211 -117 40 174 -13 212 137 299 -241 -136 133 -205
6341 -205 -13 177 -19 -53 -197 -17 -145 -96 -21 88 -8 87 -57 -36 37 -23 7 -244 -289 80 128 258 107 -38
6365 -38 -488 93 -10 41 -234 -212 119 -62 -119 227 122 115 23 -8 -37 65 168 51 35 -168 84 67 -48 -67
6389 -67 221 -235 24 147 -25 207 -319 -85 -73 -8 43 -538 -204 214 -96 80 38 181 -166 -39 -98 47
6411 47 -30 -43 -287 72 70 -268 110 -29 15 -148 -145 -184 65 -252 -120 95 26 -27 -57 -238 52 172 -40 -18
6435 -18 -153 6 163 -86 -198 75 9 -70 -136 93 52 30 -76 63 31 21 -43 100 -136 108 245 -148 371
6458 371 -266 -227 40 139 57 26 -142 182 102 85 -48 -8 -235 250 153 25 18 -60 -56 -133 186 0 35 -65 92
6483 92 199 -171 67 27 -2 29 -125 -197 76 132 -95 168 134 261 117 94 60 63 -259 33 2 111 387 8
$$ packed form
6321B03k75J31k86K71j81J07K94n88N35l28J57J34j87K25p5J62n40J05K69l38
6341b05J92J90j96l4j44J80j28M9P5J09r6R5j44K1P3o0L0k51m5L69M8J30j51j45
6365c8m50N81j03N1k75K2L31j81n7L46j05pr2l1k9J02J03j17j6k03K52j7j15j9
6389f7K88m56K59J23j72K32n26K34J2O5N1n81L34M18l10J76m2J43l47J27n9J45
6411D7p7j3k44L59kl38L78j39M4j63Ll9K49l17J32K15o9n3l0j81K90J20k12K2
6435a8j35J59J57k49j12K73o6p9o6K29m1k2j06J39l2j0o4J43k36K44J37l93N19
6458C71o37L9K67R9q2l1j68L24q0j7j33M0k27M85r7j28pp8Mp7L19j86L5j00J57
6483I2J07l70K38m0k9L1j54p2K73N6k27K63l4J27j44k3l4Ll22K92l1J09K76l79
$$ plain form
6507 8 -35 -34 -29 31 74 194 -44 67 -51 89 129 -18 128 15 -72 -112 -121 -186 -113 134 193 -49 -46 -62 -93 76 -79
6534 -79 115 82 -104 -226 186 22 -41 105 -29 68 116 291 212 60 185 -35 -2 58 16 271 -3 -78 -63 -185
6558 -185 -107 60 22 -98 -14 22 -15 -124 10 106 -21 61 148 -184 -111 97 -116 -165 -150 -72 -108 -32 -92 -49 -202
6583 -202 -106 -81 -175 -2 -8 96 177 128 64 -14 -80 118 3 58 -207 -268 118 -3 138 -40 100 -234 52 -31
6607 -31 76 -20 152 -220 138 -34 201 14 -110 55 -23 134 75 -454 -11 -103 -173 36 114 -106 36 -55 166
6630 166 -76 63 -71 -187 -156 -59 -48 237 -150 333 -31 94 -203 -34 61 -86 163 146 265 -1 -134 131
6652 131 -70 7 -108 -44 220 11 187 -78 -3 -147 68 -119 24 -184 -308 -8 40 192 -119 -33 82 504
6674 504 205 4 -5 102 -286 -111 86 243 -41 114 44 122 19 35 41 -143 30 124 -59 23 59 26 141 67
$$ packed form
6507Hm3JNO0M3J20k38J11j18J40M0j47J46j13q7m0ro5P3K47N9k42Lj6l1J69j55
6534g9J94l3j86j22M12j64o3J46j34R7M8J75p9j52J25k20L3O0m2K55k74p5J5j22
6558a85P8J67l8j20Q4L6l7j09J34R6j27Q2Q7l32P3K08k13m9J5P8l6P6o0M3j53
6583b02R6K5r4J73oJ04Q1m9o4p8o6J98j15N5k65o1L86j21J41j78J40l34K86q3
6607c1J07r6J72l72L58j72K35j87j24J65p8J57n9n29M43r2p0K09P8k20J42r1K21
6630A66k42J39j34j16L1R7J1K85l87M83l64J25k97J69R5j47K49j7J19k66j33K65
6652A31k01P7j15O4K64k09J76k65P5j44K15j87J43k08j24L00M8J52l11Q6J15M22
6674E04k99k01rJ07l88J75J97J57k84J55p0P8j03J6Oj84J73R4j83Q2L6l3J15p4
$$ plain form
6698 67 85 0 -179 -44 -205 -153 -197 213 174 -136 -16 20 47 -21 100 -224 146 54 125 139 84 -29 -154 -72 36
6723 36 -119 -44 102 -233 184 256 24 -251 18 189 -62 89 100 33 244 6 117 12 115 246 101 -2
6745 -2 -29 -51 140 -55 -159 94 16 -72 -49 -46 64 115 -85 -93 -107 87 -154 148 149 130 68 -29 116 -122 -109 -153 -64
6772 -64 -36 -10 -257 113 -174 -214 -128 -154 91 14 89 -297 58 262 -169 -151 150 -66 -90 105 -214 268 31
6795 31 -62 15 -129 -176 74 -243 105 -93 51 -15 -274 -198 215 66 8 138 5 -98 -44 146 -101 -4 -42
6818 -42 393 -230 -16 -14 24 -38 -163 80 229 186 63 4 -63 114 105 -204 21 24 392 -59 107 257 -17 115
6842 115 -13 -82 234 148 26 -30 34 122 -205 -224 -13 -160 -117 -127 -63 -399 -12 -21 48 206 -22 55 59 152 20
6867 20 -116 -72 20 48 65 -89 -245 -47 308 -410 -91 336 40 42 -6 79 -14 -60 -188 -139 -9 -130 227 143
$$ packed form
6698F7J8q5j79J35j61N2m4M10l9l10J20L6K7o8J21l24L70r2P1J4n5j13j25Q2J08
6723C6j55P5J46l35M17P2k32k75K69J71k51J51J1o7K11k38J11j05J03J31j45j03
6745bk7k2J91j95j04K53p8q8K3LJ10N1k00qj4J94k41L02Jj9o2r7J45k38J3m4Q9
6772f4K8K6k47L70k87m0Q6k6K45p7P5l86L55K04m31J8L01k16k4J95l19M82k37
6795C1r3P7j44m7K50l17L48j98J44o6k59P6M13j49n8J30j33j03N4J90k47R7l8
6818d2M35o23K14KL8o2j25K43J49m3j23n9o7J77rl09K25LL68m51J66J50k74J32
6842A15j28o9L16q6j22n6O4Q8l27j9K11j47M3j0O4l36L87rO9J58k28P7MR3j32
6867B0j36M4R2K8J7j54j56J98L55p18L19M27k96Km8Q5r3m6j28M9J30j21L57q4
$$ plain form
6891 143 55 -52 44 -51 43 -224 -49 -35 -375 39 -118 -263 -86 136 77 50 -95 -12 160 22 257 45 -205
6914 -205 176 -19 -252 -38 144 165 353 127 105 217 -138 112 -79 -77 134 5 37 -149 -122 60 108 17 -71
6937 -71 75 192 111 -146 -86 11 108 218 -24 -82 -73 107 -97 20 -349 46 -151 68 156 118 303 34 -132
6960 -132 75 -79 -239 95 78 -156 -52 -245 60 -158 168 159 46 137 34 -166 -39 119 1 -129 -8
6981 -8 88 5 -227 14 -131 74 235 56 29 -111 -194 -74 206 49 -116 125 -62 89 11 -256 12 -6 -80
7004 -80 -53 122 81 85 68 85 -166 -59 138 -102 4 109 -137 -129 -155 -282 44 154 181 108 45 -50 -189 250 -333
7029 -333 -139 -189 -267 18 -199 -75 -68 -35 -139 55 -67 221 160 -334 97 195 -77 100 148 266 130 208 140
7052 140 -89 -114 -7 -108 -2 84 55 97 -101 -47 -37 -34 -173 -65 45 127 -77 8 7 -127 166 18 136 36
$$ packed form
6891A43q8j07R6r5R4k67J75J4l40M14j57j45J77K22n9k7j45Q3J72j38K35k12k50
6914b05L81j95k33K14J82K1J88k26k2J12l55K50j91KK11j29L2j86K7J82M8r1q8
6937g1J46J17q1k57O0R7R7J10k42n8RJ80k04J17l69L95j97K19Q8l8J85k69j66
6960a32K07j54j60L34j7k34J04j93L05k18L26rj13R1j03k00J27J58j18j30J21
6981hR6q3k32K41j45K05J61j79k7j40q3J20K80j57j65K41j87J51p8k67K68j8p4
7004h0K7J75m1Mj7J7k51J07J97k40J06J05k46Qk6j27L26J10K7p3o3r5j39M39n83
7029c33J94n0p8K85k17J24PL3j04J94j22K88o1m94M31R8k72J77M8J18j36P8o8
7052A40k29k5J07j01J06Q6k9M2j98N4J0Lj39J08J10Q2k04Q5jj34K93j48J18j00
$$ plain form
7076 36 -57 -261 -289 -216 87 66 232 -16 106 -12 172 54 138 111 -134 -127 187 28 -23 -103 3 17 74 35 68
7101 68 -258 127 164 -35 -79 -127 -78 -232 -163 45 216 216 87 -58 -33 164 207 54 103 120 197 172 -223 4 -193
7126 -193 -198 57 -361 60 -48 79 -93 159 -25 52 -72 -235 50 -51 97 -27 205 129 152 -269 -192 60
7148 60 -195 277 68 -162 -107 55 -292 22 -86 -202 -120 -48 -115 80 -126 194 -247 115 79 -29 -29 106 38
7171 38 -129 -65 -68 120 -30 -73 -97 -18 112 -185 164 32 51 59 61 -177 -296 32 -42 -40 -181 77 247 18 82
7196 82 156 -181 -66 199 -271 148 119 -181 191 82 -42 71 -169 -86 -113 -14 -31 -64 -6 -323 152 17 -88
7219 -88 -259 -54 -331 51 105 -37 216 187 121 160 -82 -90 194 -455 107 232 43 232 -222 -86 -13 109 79
7242 79 7 -179 -126 23 -63 320 -14 -315 208 -149 77 103 32 -108 -109 17 -13 -179 8 -82 119 152 -71 -211
$$ packed form
7076C6r3k04k8P3L03k1J66k48J22j18J84j18Q4k7k45PL14j59n1q0J06J4N7l9L3
7101F8l26L85L7j99m4m8M9j54O9K08J71%j29j45K5J97M3j53M9J7P7k5l95K27j97
7126a93nK55m18M21j08J27j72K52j84P7j24j63K85j01J48j24K32p6K3m21P7K52
7148F0k55M72k09k30N5J62l47L14j08j16Q2P2o7J95k06L20m41L62l6j08%J35o8
7171C8j67O4lJ88j50m3k4P9J30k97L49j32J9QKk38j19L28p4Kj41K58J70k29O4
7196H2P4l37J15K65m70M19k9l00L72j09j24J13k40Q3k7R9j7l3N8l17M75j35j05
7219h8j71K05k77L82N4j42K53k9o6L9k42qK84o49N62J25j89J89m54J36P3J22l0
7242G9p2j86N3J49q6L83l34l01N23l57K26K6p1j40jJ26l0j66J87r0K01L3k23j40
$$ plain form
7266 -211 56 96 67 261 -101 -63 -58 -108 -82 135 -112 -2 164 332 136 -244 -32 -97 93 -99 105 7 137
7289 137 54 54 -220 -308 -22 164 69 112 177 -141 -208 -59 -73 -135 110 33 -24 -151 44 -53 -166 8 -43 -233 -97
7314 -97 89 -10 -118 -70 -43 -16 -62 226 -108 23 23 10 30 204 -112 106 -5 85 -120 -132 -153 -59 212 -99 -94
7339 -94 15 -244 76 -136 46 239 118 101 16 32 -19 -98 51 -11 -26 -92 -211 23 -73 -93 -189 217 50 -336
7363 -336 -176 17 51 213 -37 -25 -91 -139 234 20 -51 -381 -87 146 150 88 -24 -85 -85 11 144 108 -163 192
7387 192 85 79 10 -58 153 199 -112 8 -98 -120 178 -16 141 -410 129 -1 234 29 9 -159 -147 -192 132
7410 132 21 17 47 101 -152 -211 9 106 -107 172 170 -187 339 53 -135 -74 -4 -56 73 -60 -119 79 -42 305
7434 305 267 232 99 7 70 -27 23 155 -132 76 -128 218 -139 -201 -48 -147 -208 -240 -106 -109 21 -114 -212 -38
$$ packed form
7266b11K67M0k9J94l62L8Nn0K6K17k47J10J66J68j96l80K12o5J90j92K04r8J30
7289A37q3%k74q8K86J86r5M3O5l18o7J49j4o2K45p7n7j27J95r7j13J74n1j90J36
7314i7J86r9j08M8K7K7m6K88l34J31%j3K0J74l16K18j11R0k05j2k1R4K71l11N
7339i4J09k59L20k12J82J93j21j7q5J6n1p9J49o2j5o6j19K34r6k0r6M06j67l86
7363c36J60J93L4J62k50J2o6m8L73k14p1l30K94K33Mo2j12o1%R6J33l6k71L55
7387A92j07oo9o8K11M6l11J20j06k2K98j94J57n51N39j30K35k05k0j68J2m5L24
7410A32j11mL0N4k53n9K20R7k13K79kl57N26k86j88O1P0n2J29j33n9J98j21L47
7434C05l8l5j33r2O3r7N0J32k87K08k04L46l57o2J53r9o1l2J34lJ30j35r8J74
$$ plain form
7458 -38 -11 -63 55 65 164 -25 258 106 -193 -67 -154 -233 107 -28 -91 10 -1 14 177 -318 -158 -120 -228 273
7482 273 -16 -122 -142 167 119 -30 121 204 -288 -331 41 40 -144 72 -12 -29 -49 159 6 88 3 7 -30 -129 -45
7507 -45 -88 -51 -204 120 43 275 -26 93 -19 98 234 190 -77 22 -54 40 -315 13 165 -130 -61 -138 147
7530 147 20 -52 -16 -145 33 -226 -101 -74 -214 -26 -169 93 198 57 49 -236 -31 125 100 -117 -93 147
7552 147 -25 9 163 126 127 76 12 -198 -28 -45 -121 170 -39 -207 64 -266 -128 15 194 -140 -226 -22 188
7575 188 260 -346 30 -19 116 30 96 82 115 246 -16 72 94 230 38 115 57 -54 106 131 20 204 -51 -136
7599 -136 39 -132 85 67 -194 91 -88 -34 23 155 -167 -102 15 141 116 -180 -15 -74 -186 -165 75 -91
7621 -91 -76 89 -224 1 -144 -190 -16 115 -243 135 -253 312 -92 -63 -97 -44 -152 -29 -99 158 -224 259
$$ packed form
7458c8K7n2J18J0R9j89K83j52k99J26q7p9L40j35o3J01j1J5J63m95J60L8j08N01
7482B73k89j06k0L09m8j49J51Q3m92m3L72jj84K16q4j7k0K08j53Q2q5Ml7r9Q4
7507d5m3L7j53L24p7K32l01J19j12J17J36m4k67R9p6R4l55L28J52k95O9p7K85
7530A47j27p2L6j29J78k59J25K7j40J88j43K62J05j41qk85K05J56k5k17K4K40
7552A47j72L4J54l7Jn1o4k10J70j7p6K91k09j68K71l30J38J43J79l34q6K04K10
7575A88P2o06L76m9J35q6O6j4L3J31k62Q8K2J36j92P7n8j11J60K5j11J84k55q5
7599a36J75j71K17j8k61K85j79N4N7J32l22O5J17J26k5k96J65n9j12K1K40j66
7621i1J5J65l13K25j45m6J74J31l58L78l88N65m04K9l4N3j08J23p0K57l82M83
$$ plain form
7643 259 43 191 121 -292 223 7 66 -196 -74 -370 -72 130 -166 133 134 -148 -18 -180 -131 -44 -205 -54
7665 -54 102 -60 208 18 154 266 -139 190 -148 38 -210 -141 1 -177 153 169 116 75 227 -121 184 -54
7687 -54 2 0 96 -108 -27 88 182 -33 -24 21 -311 -40 59 -76 144 172 321 -272 208 37 -194 68 283 -24
7711 -24 -114 201 -174 184 -124 15 -42 131 -131 -46 137 -35 -31 -58 -30 29 91 -93 123 268 304 33 12 92
7735 92 190 99 -49 213 -72 -99 19 -88 -86 -17 -257 -94 173 -54 167 -173 164 237 -62 -87 29 -129 -149
7758 -149 -33 169 -82 -264 210 234 274 7 -65 143 -139 -79 4 -37 -52 89 -4 186 80 -66 62 169 112
7781 112 -52 -32 -48 158 -211 24 -251 55 11 69 -61 -1 79 115 70 -38 22 -9 45 88 87 -73 250 -60 -92
7806 -92 -230 -131 -183 -160 19 39 5 -236 -30 33 -137 -110 -199 -7 320 -4 239 -244 -141 51 25 37 110 9
$$ packed form
7643B59k16J48p0m13N15k16N9k62J22k96K98K02k96K99Jk82J30j62M9Q7j61J51
7665e4J56j62K68j90J36J12m05L29l38J86k48O9J42j78L30J6n3m1J52l48L05k38
7687e4N6kR6k04Q1J15R4k15RM5l32K71R9j35K20K8J49n93M80j71k31K62K15l07
7711b4r0L15l75L58l08J39n7J73k62Q5J83j72Mk7K8N9O2j84K16J45L6k71k1Q0
7735I2R8r1j48K62k85k7J18j07KO9k40J63K67k27K21l40L37P3k99k5J16j58k0
7758a49J16K02k51j82M74K4M0k67p2K08k82O0Q3m1j5J41r3J90j06j46J28J07n7
7781A12j64K0j6K06l69K35k75L06m4N8j30O0Q0L6m5j08O0l1N4M3jj60L23l10l2
7806i2j38R9n2K3J79K0l4k41K06O3j70K7q9J92L27l24K43m83J03J92k6J2P3j01
$$ plain form
7830 9 60 -12 136 -49 263 -65 36 -281 -9 106 -63 -286 -55 18 -103 142 -42 -47 48 83 129 163 83 -167
7854 -167 51 -150 -109 50 -245 -79 -68 -37 -241 -8 -224 50 -215 -6 -178 -55 7 167 47 112 307 148
7876 148 -235 -18 79 36 297 -101 -170 177 31 15 -301 16 169 36 -92 -168 -16 -92 305 -101 159 184
7898 184 -282 62 -173 -20 157 -165 -156 -122 148 162 348 -6 -122 -165 37 -158 -17 -21 -269 -43 107 -36
7920 -36 -93 79 12 -265 18 162 164 -125 -74 5 -149 -33 -155 16 202 -314 -47 105 109 151 16 189 179 398
7944 398 -33 -206 -106 -231 -139 -86 -184 6 -146 248 -190 51 52 7 117 -218 68 150 -155 217 -20 -28 -64
7967 -64 30 81 -97 -210 141 50 10 -57 -72 -182 150 124 233 246 -18 41 158 -66 283 109 -33 -51 0 -62
7991 -62 69 95 -79 139 -43 -336 145 32 104 49 -64 -113 -62 -36 -241 34 -192 47 -48 -76 -34 -136 -94 -90
$$ packed form
7830IN1p2J48j85L12l28J01l17K72J15j69k23K31P3j21K45j84nR5L5M6L4q0k50
7854a67K18k01M1J59k95J66J1L1k04K33k16K74k65K09j72J23O2J60j20O5J95j59
7876A48l83K17R7m3K61l98o9L47j46j6l16L17J53j33j28p6J52p6L97m06K60K5
7898A84m66L44k35J53J77l22RL4K70J4J86l54j16m3K02j95J41mk48K26J50j43
7920c6n7J72o7k77K83J44Kk89N1P9j54J16j22J71J86n16K67J52MM2j35J73j0K19
7944C98m31j73J00j25R2N3r8J90j52L94m38K41Jm5J10l35K86Q2l05L72k37ql6
7967f4R4N1j78j13L51r1m0o7j5j10L32k6J09J3k64N9J17k24L49j74j42j8N1o2
7991f2J31K6j74K18j82k93M81j13P2n5j13m9N1K6k05K75k26K39r5k8M2j02M2M
$$ plain form
8015 -90 189 193 -65 60 112 74 68 44 -28 18 -87 -167 -46 -23 -98 255 165 -37 -102 49 18 -190 -52 25 -159 205
8041 205 182 200 -114 36 178 -144 69 -62 8 -53 23 76 -70 -30 -8 97 150 -167 49 186 22 115 -28
8064 -28 -398 -178 57 51 -193 62 120 -375 190 53 109 -68 -105 -136 -30 -179 44 147 -129 -228 107 96 -29
8087 -29 -218 -83 52 88 -129 88 -67 -145 66 172 165 -128 -36 -363 -59 -45 -129 -5 -101 186 172 -28 66 -114
8111 -114 10 121 11 34 173 191 -10 -131 110 137 22 1 -53 -60 120 -22 71 124 180 15 -63 77 186 262
8135 262 32 -165 -136 -157 -30 -314 -201 61 5 9 156 -47 -106 88 61 266 -162 -153 -73 301 -381 58 -45
8158 -45 42 -94 -140 25 31 149 -86 75 -259 30 -116 -45 -371 -33 87 -95 -77 61 -62 -178 -28 -39 -49
8181 -49 121 41 -61 -105 -242 55 -45 27 -99 117
$$ packed form
8015i0K79Mk58J25N2l8ok4p2M6j05q0J21K3p5L53r0k02o5J51l1k08J38P7j84L64
8041B05k3J8l14J50J42l22K13j31P0o1P6N3j46M0K2J05N3l17K16J37j64R3j43
8064b8l70K20K35ok44K55N8m95N65j37N6j77l7l1J06j49K23J03k76r9L35j1j25
8087b9j89J35J35L6k17K17j55p8K11J06pk93R2l27L04J4q4J24r6K87j4k00R4j80
8111a14J24J11j10K3J39J8k01j21K41K7j15k1n4pJ80j42R3N3N6j65p8J40J09P6
8135B62k30j97K9k1J27k84J13K62n6MJ47k03n9J94k7K05m28RQ0L74o82M39j03
8158d5Q7j36m6J65OJ18k35J61l34K89j46P1l26L38J20j82J8J38j23j16J50j1j0
8181d9J70q0j02m4j37K97j00P2j26K16
8191A17
$$ Imaginary data points
##PAGE= N=2
##DATA TABLE= (X++(I..I)), XYDATA
$$ plain form
0 0 0 0 0 0 0 0 0 0 0 0 8 -8 8 -8 16 -16 24 -24 32 -40 48 -56 64 -79 88 -104 120 -142 164 -188 214 -245
32 -245 278 -314 356 -399 448 -503 562 -628 698 -778 861 -955 1055 -1165 1288 -1419 1564
49 1564 -1723 1897 -2091 2303 -2542 2810 -3111 3452 -3844 4301 -4837 5481 -6270 7261 -8552
64 -8552 10307 -12852 16875 -24237 42110 -181782 -93149 199949 -119593 -118625 76020 44812
76 44812 -63598 36947 45803 55847 122818 47414 -91428 31416 97112 -71705 -86047
87 -86047 94108 29911 -130232 -71745 39776 -8310 -66684 -34464 20226 -974 -41735 1449
99 1449 86873 67941 2743 22396 61813 17836 -12000 18130 16462 -18924 -51823 -95643 -68928
112 -68928 12270 -10018 -56522 25099 63692 -27767 -18606 98483 80873 -10192 18780 51743
$$ packed form
0@%%%%%%%%%%Qj6J6j6K4l2M0m8N6p2Q8j04J20j43J67j92K24k62L06l52M02m59
32b45N23n92O70p55Q47r51J065j190J326j476J639j816K010k220K453k707K983
49A564l287L620l988M394m845N352n921O563p296Q145r138J0318j1751J3531j5813
64h552J8859k3159K9727m1112O6347k23892Q8633K93098l19542R68J94645l1208
76D4812j08410J00545Q856J0044O6971p5404j38842J22844O5696j68817j4342
87h6047J80155o4197j60143N8487J11521m8086n8374L2220N4690k1200m0761M3184
99A449Q5424j8932o5198J9653L9417m3977k9836L0130j668l5386l2899m3820K6715
112f8928Q1198k2288m6504Q1621L8593r1459R161J17089j7610r1065K8972L2963
$$ plain form
124 51743 -23464 -52080 583 2372 -24591 -20524 -28917 -33979 -10117 -2605 -5083 18187 28553
137 28553 -3038 -15945 26065 50049 16880 59 25416 18330 -24334 -25280 13060 6626 -40065
150 -40065 -38933 -14844 -30758 -27473 15126 20374 7147 23311 22649 7331 27143 45037 19213
163 19213 644 6240 -19661 -51782 -25380 -570 -25724 -25681 1784 -9230 -20042 8842 30795
176 30795 24287 17229 18743 13062 4762 9560 12376 -484 -5984 -6986 -19346 -23305 -12882 -10025
190 -10025 -17433 -18714 -8434 -4927 -7452 15045 33376 15964 13234 32414 17524 -2717 14502
203 14502 22037 -8363 -27758 -19565 -27054 -39422 -18075 -2114 -15798 -7122 12588 2710 5711
216 5711 34912 34759 14006 15947 19777 -1096 -12298 2097 -2500 -22229 -13080 -5178 -25209 -22967
$$ packed form
124E1743p5207k8616N2663J789k6963M067q393n062K3862P512k478K3270J0366
137B8553l1591j2907M2010K3984l3169j6821K5357p086m2664r46L8340o434m6691
150d0065J132K4089j5914L285M2599N248j3227J6164o62j5318J9812J7894k5824
163A9213j8569N596k5901l2121K6402K4810k5154M3K7465j1014j0812K8884K1953
176C0795o508p058J514n681q300M798K816j2860n500j002j2360l959J0423K857
190a0025p408j281J0280L507k525K2497J8331j7412k730J9180j4890k0241J7219
203A4502P535l0400j9395Q193p489j2368K1347J5961j3684Q676J9710r878L001
216E711K9201j53k0753J941L830k0873j1202J4395m597j9729R149P902k0031K242
$$ plain form
230 -22967 985 -3205 -14355 317 11239 2383 6076 24982 21088 7481 17945 18724 -2343
243 -2343 1394 12104 -9584 -27238 -18309 -17176 -28365 -19164 478 -2405 -6772 11439 18292 7696
257 7696 18160 30684 17481 6370 8624 948 -13501 -14318 -9033 -14860 -16899 -5446 -6675 -14433
271 -14433 32 11772 618 -905 13587 12908 1400 3867 12038 3333 -3760 6372 5893 -6387
285 -6387 -644 1460 -14690 -16309 -3688 -5701 -13046 -4419 6087 1518 1027 13932 13914 5844 13639
300 13639 14049 -1223 -3534 989 -8162 -17184 -11748 -6298 -11121 -9894 2966 4573 1182 11058 13029
315 13029 3541 7760 13950 4304 -5453 -2990 -3173 -11849 -10133 1342 -2019 -9497 -177 1524 -6848
330 -6848 601 10193 3438 -1096 5359 6510 -388 2034 10528 5479 -1472 2481 -2378 -12626 -6798
$$ packed form
230b2967K3952m190j1150J4672J0922q856L693J8906l894j3607J0464P79k1067
243b343L737J0710k1688j7654Q929J133j1189R201J9642k883m367J8211O853j0596
257G696J0464J2524j3203j1111K254p676j4449q17N285n827k039J1453j229p758
271a4433J4465J1740j1154j523J4492o79j1508K467Q171q705p093J0132m79j2280
285f387N743K104j6150j619J2621k013p345Q627J0506m569m91J2905j8q070P795
300A3639M10j5272k311M523r151r022N436N450m823J227J2860J607l391R876J971
315A3029r488M219O190r646r757K463j83q676J716J1475l361p478R320J701q372
330f848P449R592o755m534O455J151o898K422Q494n049o951L953m859j0248N828
$$ plain form
345 -6798 -1974 -9637 -11707 -5063 -2667 -4558 2465 13344 11616 7637 11841 8443 1878 7319 7085
360 7085 -5573 -10380 -7757 -10954 -15965 -8960 1136 -2988 -5526 3561 4575 706 9929 14470 6061
375 6061 3288 6080 1989 -3815 1257 6608 -1647 -7713 -4301 -7969 -11796 -2493 -388 -7390 -5649
390 -5649 -22 -423 494 10112 15648 8850 5161 8152 2930 -1511 3840 319 -9210 -9779 -8626 -12080
406 -12080 -11365 -1340 4716 -441 -867 5673 3569 3103 11878 11083 1502 477 731 -4691 -5233 2317
422 2317 3846 -5254 -8051 -2445 -4375 -5183 2569 2733 -2871 -1186 599 -1845 1858 9994 9704 1132
438 1132 706 3726 -2440 -3989 3262 -57 -8300 -6684 -5912 -7518 -1953 7400 6363 -457 1930 4989
454 4989 -222 1839 9317 2421 -5591 -3064 -3858 -7890 -2719 4752 946 -3655 -736 2164 -1644
$$ packed form
345f798M824p663k070O644K396j891P023J0879j728l979M204l398o565N441k34
360G085j2658m807K623l197n011P005J0096m124k538R087J014l869R223M541q409
375F061k773K792m091n804N072N351q255o066L412l668l827R303K105p002J741
390e649N627m01R17R618N536o798l689K991n222m441N351l521r529n69J153l454
406a2080P15J0025O056n157m26O540k104m66Q775p95r581j025K54n422n42P550
422B317J529r100k797N606j930q08P752J64n604J685J785k444L703Q136k90q572
438A132m26L020o166j549P251l319q243J616P72j606N565R353j037o820K387L059
454D989n211K061P478o896q012K527p94m032N171P471l806m601K919K900l808
$$ plain form
469 -1644 1785 7983 2571 -2015 414 -1961 -4432 2063 5356 332 -4277 -1843 -1049 -3816 365
484 365 5071 -984 -4761 -1639 -2406 -1881 6317 9621 3625 -227 2620 1488 -3391 460 4199 -4268
500 -4268 -7992 -4819 -8055 -7409 2579 4976 415 2067 5944 3346 1172 7326 8401 -614 -2368
515 -2368 -1302 -5781 -4481 814 -1390 -5329 -3461 -2336 -2880 -756 4435 4391 -375 -596 389 -419 2979
532 2979 6395 4885 1739 -144 -356 -875 -2067 101 1059 -4939 -8085 -5804 -5112 -2627 2508 4736
548 4736 2750 2068 4569 4864 2731 5822 6747 -843 -4406 -2573 -3789 -4491 -1836 -1880 -3712 -2814 -156
565 -156 -635 -71 4610 4808 -807 -532 2776 301 671 4525 1682 -2348 -1139 301 -2304 -1559 3606
582 3606 986 -6783 -4571 -316 -3330 -1669 4242 3049 -706 1571 3154 212 1311 5515 2050
$$ packed form
469a644L429O198n412m586K429k375k471O495L293n024m609K434P94k767M181
484C65M706o055l777L122p67N25Q198L304n996l852K847j132m879L851L739q467
500d268l724L173l236O46R988K397m561J652L877k598k174O154J075r015j754
515b368J066m479J300N295k204l939J868J125n44K124N191m4m766k21R85q08L398
532B979L416j510l146j883k12n19j192K168R58n998l146K281O92K485N135K228
548D736j986o82K501K95k133L091R25p590l563J833j216p02K655m4j832Q98K658
565a56m79N64M681J98n615K75L308k475L70L854k843m030J209J440k605P45N165
582C606k620p769K212M255l014J661N911j193l755K277J583k942J099M204l465
$$ plain form
597 2050 -4009 -1642 -566 -4977 -2521 1950 -500 -1554 1431 852 -611 1609 4390 905 -2494
612 -2494 605 882 -2868 -1011 1445 -1323 -2307 -162 234 -637 1366 3754 277 -3051 1149 2016
628 2016 -2456 467 2933 -643 -2180 137 -1432 -2174 936 2097 -2401 -2731 1241 -1266 -3529 2633
644 2633 3930 75 2329 3359 -372 46 3028 510 -2573 -1062 -226 -4075 -3995 -258 -1062 -1636 1033
661 1033 1080 139 2061 2538 1132 1461 1690 1638 723 -358 607 625 -1258 -2074 -1530 -1831 -2136 -1478 -263
680 -263 -1349 -1752 498 375 -813 3207 4844 2072 2179 3199 688 -478 743 -159 -2450 -2026 -1838
697 -1838 -5195 -5130 -153 -23 -871 2055 2696 759 1419 2189 1272 1722 1968 1219 -1106 -1692 234 -735
715 -735 -1948 -297 -87 -1373 -1776 -1288 -186 -782 -559 897 -181 -476 2712 2515 595 2041 2603
$$ packed form
597B050o059K367J076m411K456M471k450j054K985n79j463K220K781l485l399
612b494L099K77l750J857K456k768r84K145L96q71K003K388l477l328M200Q67
628B016m472K923K466l576j537K317j569p42L110J161m498l30L972k507k263O162
644B633J297l855K254J030l731M18K982k518l083J511Q36l849Q0L737q04n74K669
661A033M7r41J922M77j406L29K29n2r15j081R65J8j883q16N44l01l05O58J215
680b63j086m03K250j23j188M020J637k772J07J020k511j166J221r02k291M24J88
697a838l357O5M977J30q48K926O41j937O60P70r17M50K46p49k325n86J926r69
715g35j213J651K10j286m03M88J102n96K23J456j078k95L188j97j920J446N62
$$ plain form
732 2603 -658 -1185 1248 314 -1780 -1157 -1180 -4207 -3484 1141 363 -253 2985 2609 -1000 415 2260
749 2260 924 318 1338 -284 -3289 -1988 290 -635 -260 2705 1439 -1438 -149 902 172 393
765 393 877 -172 -2158 -838 935 -595 -781 2122 203 -2026 -26 1387 347 421 750 -959 -1936
782 -1936 201 1806 376 1000 2306 -450 -2433 -173 658 -298 -4 -342 -2153 -3156 -1785 718
798 718 601 2210 3418 477 -543 1496 1833 1300 1327 332 -1772 -3151 -2022 -925 -1552 -266 901
815 901 -1597 -2013 764 1212 1218 1745 1523 151 -303 932 1861 703 1446 1073 -2744 -3117 -724 -428 -1444
834 -1444 -716 -1144 -2848 -2673 -125 1395 1907 3191 2581 106 39 2475 2021 784 1019 -744 -2757
851 -2757 -3417 -2128 -927 -1267 -228 -95 -1992 -1094 1346 1159 1221 2348 1396 -241 61 1276 1701 850
$$ packed form
732B603l261n27K433r34k094O23k3l027P23M625p78o16L238l76l609J415J845
749B260j336o06J020j622l005J301K278r25L75K965j266k877J289J051p30K21
765C93M84j049j986J320J773j530j86K903j919k229K000J413j040P4L29j709r77
782a936K137J605j430O24J306k756j983K260Q31r56K94l38j811j003J371K503
798G18j17J609J208k941j020K039L37n33K7r95k104j379J129J097o27J286J167
815I01k498m16K777M48ON27k22j372m54J235R29j158P43l73l817l73K393K96j016
834a444P28m28j704J75K548J520N12J284o10k475o7K436m54j237K35j763k013
851b757o60J289J201l40J039J33j897Q98K440j87O2J127r52j637L02J215M25q51
$$ plain form
869 850 1019 -92 -2623 -2010 -105 -1268 -1419 -439 -1522 -2621 -1445 1148 1945 1628 2384 1291 -780
886 -780 313 1857 571 416 582 -1467 -3201 -2085 -317 59 502 799 -338 -1587 250 1313 377
903 377 1201 1223 -452 -1373 -727 418 930 837 412 -522 -1175 -611 448 -183 137 -110 -1418 -1381 -734 1148
923 1148 1914 984 640 715 -1018 -284 933 122 -304 12 -1491 -2476 -740 1321 1468 867 1426 701 -887
942 -887 795 1420 -139 229 486 -2328 -2869 -705 -208 -327 417 853 -311 -442 1661 1481 635 1680
960 1680 880 -1399 -862 444 110 -166 125 -187 -1124 -1670 -444 -25 -329 164 -379 -1490 -776 827
978 827 1846 1956 1719 1745 649 -417 698 930 -755 -766 -952 -3267 -2755 -899 -494 -676 -2 822 -68
997 -68 276 2263 2323 1310 2195 1064 -1409 -303 783 -594 -904 -338 -616 -2157 -1480 370 -895 -519
$$ packed form
869H50J69j111k531O13J905j163j51R80j083j099J176K593P97l17P56j093k071
886g80J093J544j286j55J66k049j734J116J768L76M43K97j137j249J837J063r36
903C77Q24K2j675r21O46J145N12r3m25r34o53N64J059o31L20k47j308L7O47J882
923A148P66r30l44P5j733P34J217q11m26L16j503r85J736K061J47o01N59p25j588
942h87J682O25j559L68K57k814n41K164M97j19P44M36j164j31K103j80q46J045
960A680q00k279N37J306l34k76K91l12r37n46J226M19l04M93n43j111P14J603
978H27J019J10k37K6j096j066J115K32j685j1j86k315N12J856M05j82O74Q24q90
997f8L44J987O0j013Q85j131k473J106J086j377l10N66k78j541O77J850j265L76
$$ plain form
1015 -519 677 -529 -1650 1138 1805 473 1562 2379 1190 42 816 747 -409 -331 -370 -2196 -2860 -957
1033 -957 -831 -1402 299 660 163 95 1088 1382 1366 1542 1086 -342 -383 -53 -509 -895 -155 -645 -1068 -1169
1053 -1169 -678 17 128 -163 318 29 -433 667 734 423 610 1019 309 -226 -38 580 -199 -582 -28 -804
1073 -804 -1329 -197 -289 -533 972 775 260 179 486 612 -118 243 386 -732 -685 -132 -730 -450 759 341
1093 341 -83 93 303 725 430 92 459 88 -501 -503 -366 -216 202 116 194 -393 -554 389 -283 -161 835
1114 835 413 -600 511 675 -171 554 1348 45 -483 236 -186 -1608 -1030 -119 -1288 -1950 -90 -242
1132 -242 -423 1486 1535 851 850 1752 845 -17 454 628 -1191 -988 -489 -1628 -1145 -70 -741 -946 -144 158
1152 158 -194 66 1300 1433 -64 449 976 268 484 1320 400 -438 65 -356 -1421 -1368 -686 -1097 -1743
$$ packed form
1015e19J196j206j121K788O67j332J089Q17j189j148P74o9j156P8l9j826o64J903
1033i57J26n71J701L61m97o8R93K94j6J76m56j428m1L30m56l86P40m90m23j01
1053a169M91O95J11k91M81k89m62J100O7l11J87M09p10n35J88O18p79l83N54p76
1073h04n25J132r2k44J505j97n15q1L07J26p30L61J43j118M7N53n98K80J209m18
1093C41m24J76K10M22k95l38L67l71n89kJ37J50M18q6P8n87j61R43o72J22R96
1114H35m22j013J111J64q46P25P94j303n28P19m22j422N78R11j169o62J860j52
1132b42j81J909M9o84jR02r07q62M71J74j819K03M99j139M83J075o71k05Q02L02
1152A58l52K60J234J33j497N13N27p08K16Q36r20q38N03m21j065N3O82m11o46
$$ plain form
1171 -1743 -893 -226 -958 372 2003 1470 1316 2088 1323 216 638 532 -198 -1556 -1091 -1034 -1627 -720 -43
1190 -43 -708 -97 370 -19 -269 807 944 918 393 451 388 -275 906 853 -230 -69 -386 -1171 -761 -520 -235
1211 -235 -477 -988 -701 -156 -527 791 1266 998 1377 727 89 130 399 111 -323 -1001 -839 -940 -1338 -151
1231 -151 428 225 392 462 28 471 706 653 253 -546 -438 -28 -625 -112 568 -110 -124 116 -196 21 171
1252 171 796 244 -460 17 -109 -574 467 1042 -98 -261 -203 -489 -517 497 206 -454 -549 -213 -373 -586
1272 -586 905 1367 717 451 517 23 125 402 76 -628 -1175 -858 -1144 -1124 223 343 -268 8 578 69
1292 69 1065 1404 1080 268 250 192 -484 -547 240 199 -1095 -644 -575 -1277 -410 35 -76 -163 207 230 -68 707
1314 707 1706 1485 544 679 194 -406 -58 208 -939 -1081 -1308 -1382 -1363 -509 435 76 -92 813 833 610 1028
$$ packed form
1171a743Q50O67p32J330J631n33j54P72p65j107M22j06p30j358M65N7n93R07O77
1190d3o65O11M67l89k50J076J37k6n25N8o3o63J181n3j083J61l17p85M10K41K85
1211b35k42n11K87N45l71J318M75k68L79o50o38M1K69k88m34o78J62j01l98J187
1231a51N79k03J67P0m34M43K35n3m00p99J08M10n97N13O80o78j4K40l12K17J50
1252A71O25n52p04M77j26m65J041N75j140j63N8k86k8J014k91o60r5L36j60k13
1272e86J491M62o50k66O6m94J02K77l26p04n47L17k86K0J347J20o11K76N70n09
1292F9R96L39l24q12j8n8o76o3P87m1j294M51O9p02Q67M45j11q7L70K3k98P75
1314G07R99k21r41J35m85o00L48K66j147j42k27p4J9Q54R44l59j68R05K0k23M18
$$ plain form
1335 1028 1105 817 653 36 -353 -729 -57 3 -373 -1051 -596 -737 -752 -19 -36 -258 43 -62 -222 419 912
1356 912 1116 1035 126 378 98 -579 -103 -245 -732 -1004 -876 -1259 -621 -193 497 469 94 924 507 81 842
1377 842 907 157 54 -201 -768 -660 -410 312 -216 -417 297 -184 -178 567 326 80 -429 -36 -228 77 466
1398 466 381 82 22 374 -486 -197 160 -160 -227 -215 -276 -369 196 394 742 355 72 554 -93 -75 343 -133
1420 -133 -778 -818 -752 -585 -301 -104 531 346 606 888 434 338 1034 313 -316 -96 -456 -570 -504 -192 -40
1441 -40 -178 -295 253 -473 -61 542 227 -9 809 308 -190 637 536 307 234 419 -7 -459 -375 -540 -814
1462 -814 -435 -210 -531 -266 -71 64 664 822 724 581 343 627 638 403 19 -635 -798 -772 -783 -766 -151 -105
1484 -105 -472 112 157 224 909 639 442 400 482 200 -437 790 471 -149 -22 -240 -825 -946 -43 -629 -351
$$ packed form
1335A028P7k88j64o17l89l76O72O0l76o78M55j41j5P33j7k22L01j05j60O41M93
1356I12K04q1r09K52k80o77M76j42m87k72J28l83O38M28O90k8l75Q30m17m26P61
1377H42O5p50j03k55n67J08K50P22n28k01P14m81OP45k41k46n09L93j92L05L89
1398D66q5k99o0L52q60K89L57l20o7J2o1r3N65J98L48l87k83M82o47J8M18m76
1420a33o45m0O6J67K84J97O35j85K60K82m54r6O96p21o29K20l60j14O6L12J52
1441d0j38j17N48p26M12O03l15k36Q18n01m98Q27j01k29p3J85m26m52Q4j65k74
1462h14L79K25l21K65J95J35O00J58r8j43k38K84J1k35l84o54j63K6j1J7O15M6
1484a05l67N84M5O7O85k70j97m2Q2k82o37J227l19o20J27k18n85j21R03n86K78
$$ plain form
1505 -351 -110 -340 -528 155 681 735 722 977 263 215 846 449 -422 -93 9 -874 -685 -569 -328 -365 -246
1526 -246 111 24 -15 315 439 -44 514 123 -246 88 187 -72 209 106 -143 -174 -362 -427 146 -374 -66 -31
1548 -31 -515 -474 -113 342 210 390 259 63 -328 57 36 -525 161 90 -449 -484 418 106 38 352 366 -91
1570 -91 -218 399 289 54 148 -232 -1468 -379 -48 65 -203 310 139 108 151 473 -43 50 227 -79 -316
1591 -316 17 11 -213 186 373 -551 -405 -95 -334 -117 160 2 -17 -152 387 125 512 652 787 105 130
1612 130 70 -151 19 -421 -505 -338 -353 -537 -520 -67 134 264 329 428 -13 655 681 509 186 -120 -433 -243
1634 -243 -227 -349 -330 -120 -298 -264 -452 47 -23 122 127 -54 -117 180 421 155 851 529 314 -33 -115 70 -24
1657 -24 -472 -196 -566 -837 -297 -114 -54 276 536 267 436 207 496 283 325 -46 -104 -161 -261 -432 -248 -54
$$ packed form
1505c51K41k30j88O83N26N4j3K55p14m8O31l97q71L29J02q83J89J16K41l7J19
1526b46L57q7l9L30J24m83N58l91l69L34R9k59K81j03k49l1j88o5N73n20L08L5
1548c1m84M1L61M55j32J80j31j96l91L85k1n61O86p1n39l5R02l12o8L14J4m57
1570i1j27O17j10k35R4l80j236J089L31J13k68N13j71l1M3L22n16R3J77l06k37
1591c16L33ok24L99J87r24J46L10k39K17K77j58j9j35N39k62L87J40J35o82K5
1612A30o0k21J70m40q4J67j5j84J7M53K01J30O5R9m41O68K6j72l23l06l13J90
1634b43J6j22J9K10j78L4j88M99p0J45Nj81o3K97K41k66O96l22k15l47q2J85r4
1657b4m48K76l70k71N40J83O0L30K60k69J69k29K89k13M2l71n8n7j00j71J84J94
$$ plain form
1679 -54 -83 -564 -79 260 281 -2 183 146 77 -419 336 196 -171 347 525 108 14 -131 62 -137 -98 -135 -471
1702 -471 -270 43 -35 -63 323 136 -241 225 114 -20 -139 201 -69 -438 -201 104 -28 -111 429 104 21
1723 21 234 417 136 323 18 -280 -428 -109 -97 -636 3 126 -249 -213 305 195 85 277 137 183 -99
1744 -99 -64 -13 41 70 217 -267 -220 -143 -174 -255 -280 -365 -36 -172 -134 119 306 653 226 254 285 211 358 423 29
1769 29 -66 -142 -363 -240 -359 -212 137 -126 -316 -163 62 36 451 258 629 97 74 70 228 -2 -89 218 -414
1792 -414 -296 -178 -220 -249 -225 -282 -380 -379 -15 148 210 381 460 268 479 316 189 29 -70 -129 -425 -385 -265 -355
1816 -355 -302 50 276 52 -184 -14 -124 171 470 210 -90 -123 79 354 -142 358 103 -364 -352 147 -27
1837 -27 -63 -100 -274 -349 -21 -148 -190 -271 72 121 -29 191 21 173 -29 134 -231 -265 -409 -241 24 87 514
$$ packed form
1679e4k9m81M85L39K1k83J85l7o9m96P55j40l67N18J78m17r4j45J93j99L9l7l36
1702d71K01L13p8k8L86j87l77M66j11j34j19L40k70l69K37L05j32q3N40l25q3
1723B1K13J83k81J87l05k98j48L19J2n39O39J23l75L6N18j10j10J92j40M6k82
1744i9L5N1N4K9J47m84M7P7l1q1k5q5L29j36L8K53J87L47m27K8L1p4J47O5l94
1769B9r5p6k21J23j19J47L49k63j90J53K25k6M15j93L71n32k3mJ58k30q7L07o32
1792d14J18J18m2k9K4n7r8JL64J63O2J71P9j92K11j63j27j60r9n9k96M0J20r0
1816c55N3L52K26k24k36J70j10K95K99k60l00l3K02K75m96N00k55m67J2M99j74
1837b7l6l7j74p5L28j27m2q1L43M9j50K20j70J52k02J63l65l4j44J68K65O3M27
$$ plain form
1860 514 247 132 -91 195 252 92 217 -241 -167 -294 -308 34 -207 279 348 -110 398 384 237 211 -79 50
1882 50 -393 -229 23 -103 -11 1 182 -310 -85 -221 125 260 131 -227 -108 36 44 166 265 472 74 115
1904 115 155 -226 -300 51 -162 -341 -298 -317 -370 -71 214 104 197 47 338 358 436 451 61 102 -188 -186 -386 -321
1928 -321 -141 -344 -337 -603 65 -269 -132 280 365 -332 356 147 243 75 216 318 144 -48 254 -21 -110 -48
1950 -48 -34 -535 -349 -230 -243 -172 63 98 6 76 256 263 65 183 -82 133 -103 -59 -161 -193 23 -254 -428 -171
1974 -171 -40 -209 -11 326 78 86 174 50 389 341 397 317 -92 -13 160 43 86 -49 -83 -212 -45 -558 -327
1997 -327 209 87 372 -42 45 71 -41 156 115 67 144 -40 -65 437 239 94 85 142 41 -67 -24 -95 -26 19
2021 19 -243 -264 -295 -25 -38 58 40 219 -82 48 181 262 117 -3 -156 260 -73 -3 -203 209 88 -188 -210
$$ packed form
1860E14k67j15k23K86N7j60J25m58P4j27j4L42k41M86O9m58N08j4j47k6k90J29
1882E0m43J64K52j26R2J2J81m92K25j36L46J35j29l58J19J44QJ22R9K07l98M1
1904A15M0l81p4L51k13j79M3j9n3K99K85j10R3j50K91K0P8J5l90M1k90Kk00O5
1928c21J80k03Pk66O68l34J37M12Q5o97O88k09R6j68J41J02j74j92L02k75q9O2
1950d8J4n01J86J19j3P1K35L5r2P0J80Pj98J18k65K15k36M4j02l2K16k77j74K57
1974a71J31j69J98L37k48QQ8j24L39m8N6q0m09P9J73j17M3j35l4j29J67n13K31
1997c27N36j22K85m14Q7K6j12J97m1m8P7j84k5N02j98j45rN7j01j08M3p1O9M5
2021A9k62k1l1K70j3R6j8J79l01J30J33Q1j45j20j53M16l33P0k00M12j21k76k2
$$ plain form
2044 -210 94 -29 -493 118 -254 -44 -204 -77 278 190 294 374 247 401 425 238 193 100 -434 -380 -174 29
2066 29 -271 -140 -54 -169 -29 170 97 -30 156 319 87 -22 180 1 -37 62 104 -38 -274 -74 -30 -365
2088 -365 69 -269 -162 -167 38 -160 137 517 165 438 367 133 132 273 182 -206 -254 24 -400 -427 48 -19 -237
2111 -237 108 223 227 -18 369 98 415 90 -143 11 -50 6 239 104 -98 -27 -94 35 -118 -14 122 -147
2133 -147 -99 298 65 -59 18 368 111 288 -76 127 282 245 -31 -115 -114 -123 65 -118 -41 -164 140 74 -203
2156 -203 -33 -47 -115 -7 -136 267 -190 7 154 -55 164 181 -13 -66 175 286 244 89 -121 -400 -134 -120
2178 -120 133 45 -238 12 40 -140 49 189 117 -89 -53 -51 396 45 -108 68 -48 120 -109 -59 -229 -195 -145
2201 -145 -210 -202 -107 -44 -301 -38 -103 13 304 -105 128 111 164 54 374 -215 116 -119 -156 -90 -191 -35 14 -99
$$ packed form
2044b10L04j23m64O11l72K10j60J27L55q8J04Q0j27J54K4j87m5r3n34N4K06K03
2066B9l00J31Q6j15J40J99p3j27J86J63k32j09K02j79l8R9M2j42k36K00M4l35
2088c65M34l38J07nK05j98K97L80l52K73p1k34jJ41r1l88m8K78m24k7M75o7k18
2111b37L45J15Mk45L87k71L17l25k33J54o1N6K33j35k02P1o7J29j53J04J36k69
2133a47M8L97k33j24P7L50k57J77l64K03J55l7k76q4JrJ88j83P7j23L04o6k77
2156b03J70j4o8J08j29M03m57J97J47k09K19J7j94n3K41J11m2j55k10k79K66J4
2178a20K53q8k83K50K8j80J89J40p2k06L6KM47l51j53J76j16J68k29N0j70L4N0
2201a45o5QR5O3k57K63o5J16K91m09K33j7N3j10L20n89L31k35l7O6j01J56M9j13
$$ plain form
2225 -99 -35 -10 -17 290 -156 6 101 179 -143 -15 285 42 -46 249 95 115 44 43 -320 -143 -140 -278 -397 -1 143
2250 143 479 26 -5 -50 96 190 38 27 -108 111 14 -251 -57 -138 -27 112 -18 -194 -3 124 18 144
2272 144 11 -79 -125 289 97 89 -66 320 -161 -190 44 -69 -285 -97 -42 -155 -390 -43 -41 -41 75 171 -4 -72
2296 -72 294 6 -139 -9 0 179 -53 88 257 -148 -175 -112 -28 -157 -61 -35 260 65 65 58 -104 -213 315 27
2320 27 227 115 143 69 160 295 -80 -50 -212 -179 189 55 -65 -126 -39 -135 -473 -169 -209 -17 -90 161 -10 -190
2344 -190 -73 35 124 -156 193 28 32 122 -48 146 -1 34 -124 -179 -56 237 73 -35 332 119 175 232 9
2367 9 217 60 95 182 186 -178 142 45 -180 -78 -212 -87 158 100 -397 160 279 132 148 -58 -104 309 59
2390 59 186 144 -161 309 -175 -183 3 -349 -171 -17 -131 -171 29 -207 48 -7 155 -106 127 337 118 184
$$ packed form
2225i9O4K5pL07m46J62R5P8l22J28L00k43q8K95j54K0p1jl63J77Lj38j19L96J44
2250A43L36m53l1m5J46R4j52j1j35K19r7k65J94q1J11J39j30j76J91J27j06J26
2272A44j33r0m6M14j92qj55L86m81k9K34j13k16J88N5j13k35L47K%J16R6j75o8
2296g2L66k88j45J30RJ79k32J41J69m05k7O3Q4j29R6K6K95j95%pj62j09N28k88
2320B7K00j12K8p4R1J35l75L0j62L3L68j34j20o1Q7r6l38L04m0J92p3K51j71j80
2344a90J17J08Q9k80L49j65MR0j70J94j47L5j58n5J23K93j64j08L67k13N6N7k23
2367IK08j57L5Q7Ml64L20r7k25J02j34J25K45n8m97N57J19j47J6k06m6M13k50
2390E9J27m2l05M70m84qJ86l52J78J54j14m0K00k36K55n5J62k61K33K10k19O6
$$ plain form
2412 184 123 324 -85 15 29 -275 -95 -183 -240 -221 -355 -101 129 -193 -296 -73 28 395 89 49 90 48 290
2435 290 -29 375 92 -103 -76 -131 -56 7 -89 -107 -128 27 -163 75 74 95 36 24 -76 101 -207 -303 33 68 71
2460 71 -102 -8 -4 75 -227 -13 -69 20 10 114 -161 -187 101 -145 183 359 -179 51 -29 42 59 -40 24 -42 287
2485 287 -71 106 -100 174 -50 -115 -166 103 47 60 -138 -259 70 0 -96 63 -26 -106 -262 145 13 30 129
2508 129 212 -45 145 -4 -101 -24 -28 -91 99 -52 22 162 -91 22 69 -62 150 43 65 -15 -13 11 273 -180
2532 -180 -189 215 -305 -368 -186 -139 -274 205 70 94 245 -110 87 116 217 49 -74 284 -88 -19 60 -57 -149
2555 -149 67 -50 128 -217 -97 31 128 210 -177 -37 -107 414 -112 -107 326 143 -269 308 -80 -108 374 -200
2577 -200 -55 -38 -84 -11 -101 33 -148 -293 -112 -251 -11 197 63 1 -142 19 14 -242 153 -132 -50 12 3 -54
$$ packed form
2412A84o1K01m09J00J4l04J80q8n7J9j34K54K30l22j03K23J01L67l06m0M1m2K42
2435B90l19M04k83j95K7n5P5O3r6j8k1J55j90K38jK1n9j2j00J77l08r6L36L5L
2460G1j73R4MP9l02K14n6Q9j0J04k75k6K88k46L28J76n38K30q0P1J7r9O4o6L29
2485B87l58J77k06K74k24o5n1K69n6J3j98j21L29p0r6J59q9q0j56M07j32J7R9
2508A29Q3k57J90j49r7P7mo3J90j51P4J40k53J13M7j31K12j07K2q0KK4K62m53
2532a80rM04n20o3J82M7j35M79j35K4J51l55J97K9J01j68j23L58l72O9P9j17r2
2555a49K16j17J78l45J20J28R7Q2l87J40p0N21n26NM33j83m12N77l88k8M82n74
2577b00J45J7m6P3r0J34j81j45J81j39K40K08j34o2j43J61nk56L95k85Q2O2rn7
$$ plain form
2601 -54 -202 -98 387 -81 86 -93 -49 18 -63 145 87 367 332 62 -47 -13 -5 48 -93 53 -394 45 -177
2624 -177 -242 13 191 -22 -57 25 161 62 -139 400 414 -319 77 -62 271 9 -63 -282 20 97 -69 42
2646 42 -128 -137 -25 -191 -346 11 -185 19 171 104 -33 172 15 -310 14 -73 171 -63 75 -129 -182 318
2668 318 -142 39 -149 83 -194 36 -2 -280 -82 -44 204 192 -146 -149 -69 -168 -177 -74 -7 363 -268 114 -91
2691 -91 152 24 -159 -60 -156 59 -122 209 40 -114 -8 -147 -55 32 314 -195 328 -80 117 -61 -246 -25
2713 -25 -46 -71 -128 -117 -3 -182 -2 -164 -55 45 100 114 109 20 175 -95 -9 36 -82 80 -7 -286 -95 -247
2737 -247 -408 154 44 -113 124 193 -32 86 -154 -90 -113 41 39 49 7 32 -106 -13 184 179 -44 -151 41 72
2761 72 -122 -150 67 33 54 133 240 161 -29 -126 -242 181 115 -6 29 24 -214 -188 -24 -166 42 -17 174 -344
$$ packed form
2601e4j48J04M85m68J67j79M4O7q1K08n8K80l5k70j09L4QN3j41J46m47M39k22
2624a77o5K55J78k13l5Q2J36r9k01N39J4p33L96j39L33k62p2k19L02P7j66J11
2646D2j70rJ12j66j55L57j96K04J52o7j37K05j57l25L24q7K44k34J38k04n3N00
2668C18m60J81j88K32k77K30l8k78J98L8K48j2l38lQ0r9rJ03O7L70o31L82k05
2691i1K43j28j83R9r6K15j81L31j69j54J06j39R2Q7K82n09N23m08J97j78j85K21
2713b5k1k5n7J1J14j79J80j62J09J00N5J4nq9J55k70Q6M5j18J62q7k79J91j52
2737b47j61N62j10j57K37O9k25J18k40O4k3J54kJ0m2K5j38R3J97nk23j07J92L1
2761G2j94k8K17l4K1P9J07p9j90r7j16M23o6j21L5nk38K6J64j42K08n9J91n18
$$ plain form
2785 -344 253 -50 -77 39 141 350 -20 125 187 -58 -140 -95 163 98 99 -250 446 -176 -78 167 -273 -126 -61
2808 -61 54 -57 -93 18 185 164 151 3 158 12 -39 -25 145 341 99 51 42 -183 -12 102 85 150 251 -7
2832 -7 -338 20 142 -31 29 46 -225 307 189 175 -159 154 33 -26 29 -7 -13 35 -228 73 65 -51 -201 394
2856 394 121 -15 75 113 -227 -21 -177 -60 105 -64 251 18 57 22 -46 133 97 -243 187 121 26 -266 27
2879 27 -212 -217 23 280 130 104 -109 -254 -63 -8 129 -3 -251 -59 -173 130 161 115 221 -195 -57 -97 -10
2902 -10 63 259 -38 -190 141 65 58 76 188 -13 -254 165 -87 -95 -115 122 28 -131 51 -148 -132 62 49 -40
2926 -40 31 -136 -124 96 7 -60 -307 45 61 -21 -308 219 55 -85 -79 -135 -98 -224 190 76 -116 43 29 -89
2950 -89 -77 6 68 170 168 44 -54 143 -91 -21 188 -232 438 -125 31 -166 4 -73 185 85 -392 -40 -378
$$ packed form
2785c44N97l03k7J16J02K09l70J45O2k45q2M5K58o5Jl49O96o22R8K45m40J47O5
2808f1J15j11l6J11J67k1j3j48J55j46n1J4J70J96k42m8rk25J71J14j7O5J01k58
2832gl31L58J22j73O0J7k71N32j18j4l34L13j21n9N5l6oM8k63L01qj16j50N95
2856C94k73j36R0L8l40K06j56J17J65j69L15k33L9l5o8J79l6l40M30o6r5k92K93
2879B7k39nK40K57j50k6k13j45J91N5J37j32k48J92j14L03L1m6J06m16J38m0Q7
2902a0P3J96k97j52L31p6pJ8J12k01k41M19k52qk0K37r4j59J82j99J6J94j3q9
2926d0P1j67J2K20q9o7k47L52J6q2k87N27j64j40On6L7j26M14j14j92J59j4j18
2950h9J2Q3O2J02kj24r8J97k34P0K09m20O70n63J56j97J70p7K58j00m77L52l38
$$ plain form
2973 -378 162 14 -19 203 59 83 12 242 -225 17 0 -411 123 -199 -82 -88 112 -117 -131 -71 171 -1 -125
2996 -125 -175 -103 207 -129 31 386 -119 488 95 291 305 82 -53 -35 165 -132 25 16 -65 -70 -39 94 -83
3019 -83 156 287 88 162 10 -79 56 -93 -62 -111 -86 -539 46 -61 -360 189 159 156 -171 177 -93 -1 -241
3042 -241 86 -64 24 227 -127 89 169 19 70 79 -107 -277 128 -106 -32 2 87 76 -49 -15 255 132 74 163
3066 163 41 -192 105 -108 -286 195 68 -132 -112 70 -66 89 -52 -72 211 302 -122 89 -50 73 -185
3087 -185 199 -243 -73 -372 -139 -99 -70 33 -176 -293 24 61 -218 -100 28 32 88 -37 65 -41 -6 -70 -11
3110 -11 169 373 26 -71 22 171 83 69 -101 -89 20 -29 -112 -48 144 100 41 -10 -239 160 31 -494 40 -135
3134 -135 181 12 -106 76 -442 10 -47 121 -182 210 59 57 -127 19 94 -11 140 -22 46 126 -127 -125 119
$$ packed form
2973c78N40j48l3K22j44K4p1K30m67K42j7m11N34l22J17oK00k29j4O0K42j72j24
2996a25n0P2L10l36J60L55n05O07l93J96J4k23j35J8K00k97J57rq1nL1J33j77
3019h3K39J31j99P4j52q9J35j49L1m9K5m53N85j07k99N49l0ll27L48k70R2k40
3042b41L27j50Q8K03l54K16Q0j50N1Rj86j70M05k34P4L4Q5j1j25L4K70j23n8Q9
3066A63j22k33K97k13j78M81j27k00K0J82j36J55j41k0K83R1m24K11j39J23k58
3087a85L84m42J70k99K33M0K9J03k09j17L17L7k79J18J28MN6j25J02j06L5o4N9
3110a1J80K04l47r7R3J49q8j4j70J2J09m9q3O4J92m4n9n1k29L99j29n25N34j75
3134a35L16j69j18J82n18M52n7J68l03L92j51kj84J46P5j05J51j62O8Q0k53KK44
$$ plain form
3157 119 -46 -111 103 -102 -294 73 -29 -99 -17 188 214 325 -174 -116 -53 -319 41 -71 77 232 89 131
3179 131 190 -90 -50 200 -111 -210 -143 -196 -191 -55 45 -111 -6 376 -6 -48 319 91 18 370 36 -79 73
3202 73 -39 -166 -173 -133 18 -123 103 -72 -144 -4 251 82 -13 56 186 121 6 186 -56 201 163 104 145 197
3226 197 227 -8 60 290 3 4 109 119 -19 54 -109 -21 275 154 72 89 -244 -112 131 -31 -27 -29 -65 -8 11
3251 11 56 172 -57 -111 -73 -81 -22 24 -8 73 -91 -303 231 67 -86 -7 -16 18 2 241 407 -123 102 -73 -331
3276 -331 5 149 118 -133 147 -118 -6 74 -54 -227 71 187 19 88 37 35 -256 127 -31 -325 -317 158 -100
3299 -100 -149 -97 189 118 200 -29 124 91 -177 177 -187 197 69 15 180 -100 -157 205 -326 -25 -147 151
3321 151 66 -174 25 55 -21 -103 -142 -250 65 -126 -109 40 197 113 71 98 -169 28 -234 -35 -214 -231 -128
$$ packed form
3157A19j65o5K14k05j92L67j02p0Q2K05K6J11m99N8O3k66L60j12J48J55j43M2
3179A31N9k80M0K50l11r9O7n3NJ36J00j56J05L82l82m2L67k28p3L52l34j15J52
3202G3j12j27pM0J51j41K26j75p2J40K55j69r5O9J30o5j15J80k42K57l8n9M1N2
3226A97L0k35O8K30k87JJ05J0j38P3j63Q8K96j21q2J7l33J32K43j62Mkl6N7J9
3251A1M5J16k29n4L8qN9M6l2Q1j64k12N34j64j53P9rL4j6K39J66n30K25j75k58
3276c31L36J44l1k51K80k65J12Q0j28j73K98J16j68O9n1kk91L83j58k94QM75k58
3299a00m9N2K86p1Q2k29J53l3k68L54l64L84j28n4J65k80n7L62n31L01j22K98
3321A51q5k40J99L0p6q2l9j08L15j91J7J49J57q4m2K7k67J97k62J99j79j7J03
$$ plain form
3344 -128 -29 -108 -60 84 8 -47 -144 309 -146 21 158 -30 59 125 28 -122 -29 -77 -60 76 -50 187 -123 -31
3368 -31 111 40 30 21 -73 10 -203 190 215 -57 13 -110 -40 19 -23 -101 -137 -206 29 -40 -224 -176 -100 96 32 23 -224
3395 -224 106 106 -180 50 70 -148 -69 170 9 115 54 -57 120 -185 -251 -134 161 -271 56 -17 -277 -97
3417 -97 158 -281 100 31 -260 23 -135 -108 -196 -114 -163 184 147 102 66 60 79 20 -112 -16 -212 -222 -283 214 173 -2
3443 -2 373 -148 109 244 183 142 191 -6 282 37 -233 116 49 -73 49 59 -358 -161 -182 110 -14 -47 -286
3466 -286 71 -19 -76 78 -40 -112 -15 230 -138 -135 237 -296 -6 -176 -340 -21 -109 -57 -3 -21 60 150 -106 -143
3490 -143 186 -154 72 221 -74 158 -35 4 137 -138 -36 -43 4 -87 182 -258 23 -34 -33 61 70 -16 -36 12 24
3515 24 -88 -103 73 -150 -185 170 -94 2 -178 -61 163 -93 -22 -105 -32 -182 -157 -34 175 47 56 294 -99
$$ packed form
3344a28R9p9M8J44p6n5r7M53m55J67J37j88Q9O6r7j50R3m8J7J36j26K37l10R2
3368c1J42p1j0rr4Q3k13L93K5k72P0j23P0N9m2p8l6o9K35o9j84M8P6J96o4rk47
3395b24L30%k86K30K0k18P9K39j61J06o1j11J77l05o6J17K95m32L27p3k60J80
3417i7K55m39L81o9k91K83j58K7q8Q2m9L47l7m5l6oJ9n9j32R6j96j0o1M97m1j75
3443bL75n21K57J35o1m1M9j97K88k45k70L49o7j22J22J0m17J97k1K92j24l3k39
3466b86L57r0n7J54j18p2R7K45l68LL72n33K90j70j64L19q8N2N4j8Q1R0k56l7
3490a43L29l40K26J49k95K32j93L9J33k75J02pM7r1K69m40K81n7JR4Rq6k0M8J2
3515B4j12j5J76k23l5L55k64R6j80J17K24k56P1q3P3j50K5J23K09j28RK38l93
$$ plain form
3538 -99 76 2 -162 -309 12 -95 -106 11 329 -25 64 26 79 139 -47 101 38 -75 126 -4 113 -12 -62
3561 -62 232 -130 -316 -105 17 -76 -121 -70 5 -216 -42 17 143 130 16 7 123 88 58 -62 -72 168 -19 130
3585 130 -89 279 -199 -12 -109 -171 89 -63 -189 311 -117 -195 31 -8 79 -105 101 -199 120 -102 30 12
3607 12 99 210 102 -123 -231 123 -16 220 137 -29 32 -279 -96 -276 97 207 13 149 -31 111 7
3628 7 223 190 226 -23 47 -155 -31 -2 46 -45 -9 -191 9 -104 142 76 -119 -167 -22 -168 -120 386 -44 -185
3652 -185 3 -24 -2 48 12 309 -106 131 -82 60 -76 -118 111 17 -169 135 -66 -29 -198 -19 -8 -128 292
3675 292 -19 -155 99 -129 -22 179 -208 -158 83 -32 169 -9 36 98 93 -127 -29 112 146 150 155 125 -71 -149
3699 -149 -126 -92 26 -27 73 33 -128 -69 118 -87 -36 184 -192 -136 153 -246 141 86 -27 -72 31 19 -145
$$ packed form
3538i9J75p4j64j47L21j07j1J17L18l54Q9l8N3O0j86J48o3j13K01j30J17j25n0
3561f2K94l62j86K11J22r3m5N1P5k21J74N9J26j3j14rJ16l5l0j20j0K40j87J49
3585A30k19L68m78J87r7o2K60j52j26N00m28p8K26l9Q7j84K06l00L19k22J32j8
3607A2Q7J11j08k25j08L54j39K36q3j66O1l11J83j80L73J10j94J36j80J42j04
3628GK16l3L6k49P0k02J24K9M8r1L6j82K00j13K46o6j95m8J45j46M8N06m30j41
3652a85J88k7K2N0l6K97m15K37k13J42j36m2K29r4j86L04k01L7j69J79J1j20M20
3675B92l11j36K54k28J07K01l87N0K41j15K01j78M5O2nk20R8J41L4MNl0j96p8
3699a49K3L4J18n3J00m0j61N9J87k05N1K20l76N6K89l99L87n5j13m5J03j2j64
$$ plain form
3722 -145 -199 25 89 98 255 77 84 -149 -72 -72 25 -88 86 19 -151 -72 -65 244 92 280 215 -191 -61 -121 0
3747 0 -185 95 -227 70 -346 108 26 -21 -302 -89 -62 208 -117 -239 -79 176 -162 -9 225 20 152 -364
3769 -364 77 -124 30 183 -138 125 -168 -91 115 94 -17 60 46 78 -77 -182 -17 -106 -192 -136 10 -98 209
3792 209 -75 -60 -127 -12 -165 65 -162 -137 -7 98 119 -239 -99 41 275 63 114 -104 25 74 40 -223
3814 -223 -186 140 -20 -60 106 247 222 180 117 182 124 -40 -147 70 -12 -160 -131 76 -39 -100 -82 20 279 35
3838 35 -41 -230 -48 -85 -59 -5 94 -132 109 77 -89 -44 -169 -3 -128 -113 78 5 68 -62 125 174 -131 91
3862 91 -73 -100 -8 215 64 191 115 124 90 45 112 -4 -117 -1 -69 -38 -240 -272 67 -230 41 -106 -20 95
3886 95 -262 -4 -150 123 78 -145 -120 -82 213 222 -54 -16 64 119 186 68 70 123 261 -124 209 8 -145 -212 -207
$$ packed form
3722a45n4K24O4RJ57j78Pk33P7%R7j13J74o7j70P9PL09j52J88o5m06J30o0J21
3747@j85K80l22K97m16M54q2m7k81K13K7K70l25j22J60K55l38J53K34k05J32n16
3769c64M41k01J54J53l21K63k93P7K06k1j11P7j4L2j55j05J65q9q6N6J46j08L07
3792B09k84J5o7J15j53K30k27K5J30J05K1l58J40J40K34k12N1k18J29M9l4k63
3814b23L7L26j60m0J66J41k5m2o3O5n8j64j07K17q2j48K9K07j15o1J8J02K59k44
3838C5p6j89J82l7K6N4R9k26K41l2j66M5j25J66j25J5J91p3O3j30J87M9l05K22
3862I1j64k7R2K23j51J27p6Rl4m5O7j16j13J16o8L1k02l2L39k97K71j47Q6J15
3886I5l57K58j46K73m5k23K5L8K95Rk76L8Q0N5O7j18KN3J38l85L33k01j53o7N
$$ plain form
3911 -207 124 -138 178 -80 26 -114 173 -90 -20 -105 -69 268 112 251 164 87 -8 -136 -334 -201 -13 24
3933 24 12 -52 153 40 -94 19 -61 -169 -275 276 36 -53 -53 -67 -61 -68 31 24 199 -211 22 -149 131 -210 53
3958 53 22 143 145 220 -35 80 -156 10 11 134 -59 -43 -94 -189 -16 317 -97 -508 -31 -150 26 408 -296
3981 -296 -5 74 -127 -89 -311 -70 31 -88 64 -88 14 97 361 -89 -214 -63 32 193 -265 146 107 -41
4003 -41 10 63 -191 -190 33 125 -23 -212 -70 155 6 -109 -183 76 117 34 42 -19 256 -207 89 94 205 -43 -132
4028 -132 153 56 160 58 245 -83 56 115 33 58 -127 49 -18 134 163 -20 -166 266 -137 92 79 -159
4050 -159 226 113 168 71 -140 -141 126 171 -86 116 -117 22 -27 -9 -24 -228 -32 -44 -66 200 -40 -43 13 119
4074 119 84 51 251 9 78 56 -15 -139 157 33 -7 -35 -48 139 -185 32 235 229 113 -313 -87 -68 139 -105
$$ packed form
3911b07L31k62L16k58J06j40K87k63P0q5L6L37j56J39q7p7r5j28j98J33J88L7
3933B4j2o4K05j13j34J13q0j08j06N51k40q9%j4OpR9pJ75m10K33j71K80l41K63
3958E3l1J21KP5k55J15k36J66JJ23j93J6n1r5J73L33m14m11M77j19J76L82p04
3981b96K91P9k01L8k22K41J01j19J52j52J02Q3K64m50j25J51R5J61m58M11l9j48
4003d1N1N3k54JK23R2j48j89J42K25j49j15p4K59M1q3Qo1K75m63K96NJ11k48q9
4028a32K85r7J04j02J87l28J39N9q2K5j85J76o7J52K9j83j46M32m03K29j3k38
4050a59L85j13N5r7k11jK67M5k57K02k33J39m9J8j5k04J96j2k2K66k40lN6J06
4074A19l5l3K00k42O9k2p1j24K96j24m0k8j3J87l24K17K03oj16m26K26J9K07k44
$$ plain form
4098 -105 -188 6 163 66 218 -75 -123 -150 154 -248 -33 31 122 -239 -28 287 -88 319 -39 276 -146 69
4120 69 -163 70 56 -213 -96 22 -27 30 89 -76 180 156 -79 257 -128 -97 238 28 161 175 -70 -69 -111 -105
4144 -105 155 -76 173 -381 -33 364 106 -24 -73 35 -23 218 -221 -28 -119 374 33 -69 247 213 126 83
4166 83 387 -49 -150 7 120 -159 -20 -266 -154 164 -217 1 -4 14 -39 87 -107 14 -130 218 -70 87
4188 87 -11 -89 -19 -102 118 -102 -125 -85 155 -56 -47 -183 217 11 -195 -148 26 109 -13 23 -173 191 178 203 105
4213 105 -179 -144 -12 330 256 -350 33 187 170 -89 182 118 82 -106 13 220 154 177 101 54 64 146 -51 41
4237 41 -35 -128 304 -88 -88 -169 75 18 -57 46 -6 27 -19 50 282 197 131 -40 115 -314 -142 127 -138 72 -51
4262 -51 168 -12 45 -77 -125 -52 -46 34 -118 -127 -116 22 -21 157 8 -169 155 92 54 73 82 155 47 -137 -19 57
$$ packed form
4098a05q3J94J57r7J52k93m8k7L04m02K15O4R1l61K11L15l75M07l58L15m22K15
4120F9k32K33j4k69J17J18m9N7N9j65K56k4k35L36l85L1L35k10J33J4k45Jm2O
4144a05K60k31K49n54L48L97k58j30m9J08n8K41m39J93r1M93l41j02L16l4q7m3
4166H3L04m36j01J57J13k79J39k46J12L18l81K18nJ8n3J26j94J21j44L48k88J57
4188H7r8p8P0q3K20k20k3M0K40k11Rj36M00k06k06M7J74Q3j22L6j96L64j3K5r8
4213A05k84L5J32L42p4o06L83J54j7k59K71o4l6j88J19K07o6K3p6m7J0Q2j97R2
4237D1p6r3M32l92%q1K44n7p5J03n2L3m6O9K32q5o6j71J55m29J72K69k65K10j23
4262e1K19j80N7j22m8P3OQ0j52rJ1J38m3J78j49j77L24o3l8J9RP3j08j84J18P6
$$ plain form
4288 57 11 -239 245 0 -44 3 -455 -55 -311 145 141 187 13 64 40 47 -135 127 -33 49 -93 -6 -104 -91 -7
4313 -7 47 92 -89 -160 35 141 -59 -129 113 -130 68 476 67 155 48 52 294 52 -167 -156 -411 -122 158
4336 158 -73 -43 -170 -147 200 298 108 -228 -96 86 -40 19 30 85 -72 126 89 -135 -200 48 -23 -47 -46 229
4360 229 -22 62 102 122 386 -29 -2 -117 174 -61 132 481 24 -150 -80 -52 -96 41 -271 -149 213 -84
4382 -84 -48 194 39 98 134 178 -143 68 -202 -52 32 -35 63 76 -70 112 26 30 264 -64 -48 -65 3 -38 -249
4407 -249 -87 -20 -119 213 18 138 107 -99 106 107 116 10 -31 -117 -124 25 -179 43 51 12 -79 15 127 -252 97
4432 97 227 -150 -122 108 18 -221 -109 28 304 -78 -223 -55 -138 -4 148 101 -96 -76 -333 110 160 294
4454 294 53 -47 -175 236 10 115 -22 239 32 217 -100 -14 99 101 -49 -18 172 103 -99 -16 -158 -220
$$ packed form
4288E7m6k50M84k45m4M7m58M00k56M56mM6j74N1k4Pj82K62j60Q2j42Q7r8J3Q4
4313gN4M5j81p1J95J06k00p0K42k43J98M08m09Q8j07MK42k42k19J1k55K89K80
4336A58k31L0j27K3L47R8j90l36J32J82j26N9J1N5j57J98l7k24o5K48p1k4JK75
4360B29k51Q4M0K0K64m15K7j15K91k35J93L49m57j74P0K8m4J37l12J22L62k97
4382h4L6K42j55N9L6M4l21K11k70J50Q4o7R8J3j46J82q6MK34l28J6j7O8m1k11
4407b49J62O7r9L32j95J20l1k06K05JRj06m1q6pJ49k04K22Ql9r1R4J12l79L49
4432I7J30l77K8K30r0k39J12J37K76l82j45J68q3J34J52m7j97K0k57M43N0J34
4454B94k41j00j28M11k26J05j37K61k07J85l17Q6J13Kj50L1J90o9k02Q3j42o2
$$ plain form
4476 -220 43 43 319 -43 -191 197 -1 244 -121 89 167 -94 251 -183 72 10 176 94 -37 199 137 170
4498 170 37 148 -43 31 51 56 89 84 -179 -26 165 24 -123 -112 151 21 -27 94 -107 -36 -215 17 -59 47
4522 47 163 -26 -73 -79 57 -65 -25 218 -208 -34 -504 -29 68 269 -113 87 -82 81 -48 233 122 -88
4544 -88 -258 181 -35 -109 46 -55 -55 -304 -149 75 -107 -224 -29 -178 -144 -173 -35 -225 127 69 -163 155
4566 155 -116 266 108 -141 36 184 -25 43 19 -98 -136 -61 -288 -160 113 -62 12 -62 6 37 -5 60 137 272
4590 272 -137 -139 34 18 186 174 -179 99 -283 -104 135 165 207 -204 -267 109 189 -146 -326 -19 -109 80 -50
4613 -50 139 207 -34 74 50 -54 -154 84 53 187 -1 48 -58 54 -95 -295 223 68 -29 54 -240 34
4635 34 -269 -45 -13 6 -234 -70 126 -149 17 -106 8 124 187 -151 -13 -119 -192 80 -100 61 328 12
$$ packed form
4476b20K63%K76l62j48L88j98K45l65K10P8k61L45m34K55o2J66q2j31K36o2L3
4498A70j33J11j91P4K0NL3nk63J53J91j41j47J1K63j30m8J21k01P1j79K32p6J06
4522D7J16j89m7oJ36j22M0K43m26J74m70M75R7K01l82K00j69J63j29K81j11k10
4544h8j70M39k16p4J55j01%k49J55K24j82j17J95j49L4k9J38j90L52n8k32L18
4566A55k71L82j58k49J77J48k09O8k4j17l8P5k27J28K73j75P4p4O8L1m2O5P7J35
4590B72m09kJ73j6J68j2l53K78l82J79K39L0M2m11o3L76Q0l35j80L07r0J89j30
4613e0J89O8k41J08k4j04j00K38l1J34j88M9j06J12j49k00N18j55r7Q3k94K74
4635C4l03K24L2J9k40J64J96k75J66j23J14J16O3l38J38j06p3K72j80J61K67l16
$$ plain form
4657 12 -121 95 71 -221 15 -83 77 6 -65 -56 -231 137 250 50 -92 -155 -18 123 -53 100 39 -36 -90 -151
4681 -151 25 3 232 33 207 174 -2 -31 29 -78 -217 -226 145 125 -94 70 -102 103 199 40 119 110 -4 378
4705 378 -180 -160 204 -46 -193 66 112 -36 73 -308 -247 186 -247 -24 215 -6 120 4 -19 -97 -93 146
4727 146 272 378 -156 90 79 290 -56 83 65 -113 94 -210 -85 -91 -95 -19 52 15 -77 -157 255 259 -3 2 41
4752 41 -87 -63 -2 -110 63 -104 2 -92 -136 7 182 46 -17 -41 95 86 -36 -143 -57 -73 -2 139 -168 272
4776 272 -102 -9 297 155 -170 -10 -23 -28 -58 -33 165 69 -29 -63 286 -231 77 244 108 191 -84 139 91 88
4800 88 -96 18 21 25 -14 -79 -55 44 7 -5 -35 177 80 9 -52 -7 -230 -72 -18 -154 99 -165 309 -21 -160 27
4826 27 110 51 -123 -70 30 40 -300 -86 211 31 130 -107 42 -121 32 82 40 -27 -409 -85 103 -87 -46
$$ packed form
4657A2j33K16k4k92K36r8J60p1p1Rj75L68J13k00j42o3J37J41j76J53o1p5n4o1
4681a51J76k2K29j99J74l3j76k9O0j07j39rL71k0k19J64j72K05R6j59P9rj14L82
4705C78n58K0L64k50j47K59M6j48J09l81O1M33m33K23K39k21J26j16k3p8MK39
4727A46J26J06n34K46j1K11l46J39j8j78K07l04J25omP6P1l7r2q0M12Mk62NL9
4752D1j28K4O1j08J73j67J06r4m4J43J75j36o3k4J36rj22j07Q6j6P1J41l07M40
4776B72l74R3L06j42l25J60j3nl0K5J98r6r8l4L49n17L08J67j36Q3k75K23m8l
4800H8j84J14LMl9o5K4R9l7j2l0K12r7p1o1M5k23J58N4j36K53k64M74l30j39J87
4826B7Q3n9j74N3J00J0l40K14K97j80R9k37J49j63J53N0m2o7l82L24J88j90M1
$$ plain form
4849 -46 58 164 14 142 -89 -36 -63 26 -131 308 208 -240 -79 257 20 -20 97 -80 48 56 -75 -216
4871 -216 -97 108 -70 -2 102 -16 163 -45 99 137 -273 159 187 94 61 147 3 226 -65 59 19 -245
4893 -245 -90 -97 6 -13 -4 202 -75 -67 23 8 108 275 -134 -3 340 -59 139 144 -169 -12 -42 -158 125 176
4917 176 -3 197 57 -214 -39 121 -99 105 98 -11 112 52 50 -48 40 -39 -125 -121 135 131 102 59 -40 -12 90 -222
4943 -222 232 88 30 -29 242 270 101 23 -159 185 -16 -12 207 216 -95 19 15 90 -435 -122 -129 -11 197 -94
4967 -94 -95 -184 -295 -232 176 -75 -43 61 14 170 234 -190 -156 -57 -196 -227 -79 -29 71 -97 2 -230 88 40 -84
4992 -84 76 26 -140 -263 12 -88 89 270 154 19 -37 -27 98 -106 -77 -95 -63 -165 -67 -48 -163 -84 85
5015 85 -39 35 -13 -258 -149 -84 157 183 -116 241 -23 170 -269 116 -38 -71 45 228 -56 -99 77 52 -68
$$ packed form
4849d6J04J06j50J28k31N3k7Q9j57M39j00m48J61L36k37m0J17j77J28Qj31j41
4871b16J19K05j78O8J04j18J79k08J44L8m10M32K8r3l3Q6j44K23k91J24m0k64
4893b45J55pJ03j9RK06k77QR0j5J00J67m09J31L43l99J98Nl13J57l0j16K83N1
4917A76j79K00j40k71J75J60k20K04pj09J23o0kr8Q8p9q6MK56mk9m3r9K8J02l12
4943b22M54j44n8n9K71K8j69p8j82L44k01MK19Rl11J14mP5n25L13pJ18K08k91
4967i4jq9j11O3M08k51L2J04m7J56O4m24L4R9j39l1J48N0J00j68R9k32L18m8j24
4992h4J60n0j66j23K75j00J77J81j16j35n6J0J25k04K9j8L2j02R8J9j15P9J69
5015H5j24P4m8k45J09O5K41K6k99L57k64J93m39L85j54l3J16J83k84m3J76k5j20
$$ plain form
5038 -68 43 53 201 -93 103 -228 -100 -94 -94 -92 -67 -162 -123 -98 -105 -142 66 168 30 -16 118 54 -183 -99 -217 -94
5064 -94 -346 136 128 58 -10 -234 -52 3 1 -100 -42 366 139 -114 -49 19 -34 -81 -53 -129 139 212 -233 -55 -71 4
5090 4 227 -184 -201 -152 -78 344 -125 -106 52 -26 144 78 59 158 -365 -3 117 14 -51 230 -130 -387 -17 -80
5114 -80 107 -78 -59 61 12 60 192 89 66 -214 -49 84 -184 32 25 86 -152 -139 7 58 36 47 -99 125
5138 125 -64 104 220 237 -295 -225 -4 -68 62 -3 152 54 238 -90 65 61 -87 8 105 -178 211 105 -131
5161 -131 9 -254 140 382 -73 -13 56 -13 23 189 104 -96 52 -114 -95 120 -165 341 -143 -10 32 15 99
5184 99 71 -43 -117 16 86 265 -96 -37 -73 75 107 70 -249 147 -70 -373 81 -84 -49 170 -105 -90 2 -12
5208 -12 -131 171 19 158 139 15 97 -50 -96 -6 -61 -21 26 132 -69 111 79 -43 -189 -49 -119 114 108 110 -40
$$ packed form
5038f8J11J0J48k94J96l31J28O%KK5r5L9K5pl7K08J02j38m6J34o4k37Q4j18J23
5064i4k52M82qp0o8k24J82N5kj01N8M08k27k53O5O8n3m7K8p6K68P3m45J78j6P5
5090DK23m11j7M9P4M22m69J9J58p8J70o6j9R9n23L62J20j03o5K81l60k57L70o3
5114h0J87j85J9J20m9M8J32j03k3k80J65J33k68K16pO1k38J3J46N1k2J1j46K24
5138A25j89J68J16J7n32P0K21o4J30o5J55r8J84l28J55mj48R5R7k83L89j06k36
5161a31J40k63L94K42m55O0O9o9L6J66q5k00J48j66J9K15k85N06m84J33M2j7Q4
5184I9k8j14p4J33P0J79l61N9l6J48L2l7l19L96k17l03M54j65L5K19k75J5R2j4
5208a2j19L02j52J39j9j24Q2j47m6R0n5M0M7J06k01J80l2j22j46J40p0K33oKj50
$$ plain form
5233 -40 173 126 141 -42 164 238 111 -15 -56 152 -78 46 -232 -54 -3 73 26 76 -276 58 159 -78 134
5256 134 -48 -145 20 182 119 -197 197 -73 -120 -38 352 54 -143 158 -65 -148 -98 26 182 -72 -228 69
5278 69 -147 -123 -42 -213 -45 -153 72 159 -16 115 -50 159 244 -84 116 174 -318 92 -173 243 12 42
5300 42 182 44 202 138 -82 -216 47 -154 136 -33 -144 233 -91 95 260 23 -163 133 -145 70 193
5321 193 -324 32 22 257 70 -359 62 -318 127 134 52 325 304 25 72 90 -31 314 -83 182 -89 -373
5343 -373 -48 38 -38 147 -89 -135 92 49 -70 222 115 135 90 -34 140 -66 79 -161 220 143 61 60 -18 -185
5367 -185 56 32 -16 -105 31 79 32 -157 20 26 31 60 -56 -143 311 56 150 97 -41 -69 -7 80 -17 80 -8 154
5393 154 277 105 -202 -154 -184 -37 3 -150 64 261 24 -10 72 200 178 178 20 -20 -104 -164 49 -6 -134 49
$$ packed form
5233d0K13m7J5j83K06P4j27j26m1K08k30J24k78J78N1P6m7N0l52L34J01k37K12
5256A34j82r7J65J62o3l16L94k70m7Q2L90k98j97L01k23q3N0J24J56k54j56K97
5278F9k16K4Q1j71J68j08K25Q7j75J31j65K09Q5l28K00N8m92M10k65M16k31L0
5300D2J40j38J58o4k20j34K63k01K90j69j11L77l24J86J65k37j86K96k78K15J23
5321A93n17L56j0K35j87m29M21l80M45Pq2K73k1k79M7J8j21L45l97K65k71k84
5343c73L25Q6p6J85k36m6K27m3j19K92j07K0m5j24J74k06J45k40L81p7q2jp8j67
5367a85K41k4m8q9J36M8m7j89J77ONK9j16q7M54k55R4n3j38k8O2Q7r7R7q8J62
5393A54J23j72l07M8l0J47M0j53K14J97k37l4Q2J28k2%j58m0q4o0K13n5j28J83
$$ plain form
5417 49 65 -122 -9 175 -53 -124 -185 91 -89 71 133 -103 147 29 -52 144 60 -197 -63 1 -307 78 128
5440 128 32 55 -101 25 234 77 153 -97 -58 -57 -118 38 -206 -131 -160 196 -99 24 -52 -149 -84 166 -197 145
5464 145 13 -79 -106 24 155 -357 -184 -8 137 251 45 -219 -68 111 -51 -268 139 -363 -157 82 93
5485 93 90 173 119 72 -26 -159 243 207 18 168 -152 -156 -136 -55 -109 17 -45 -291 62 105 -23 113 144 -3 67 45
5511 45 99 -244 63 37 -95 -52 -234 -235 -49 82 -64 -159 -18 -48 -184 99 133 9 -227 169 -35 -97 61
5534 61 210 -24 93 -137 113 132 88 -80 125 -36 -308 144 247 -63 -30 198 -26 190 261 -43 272 -65
5556 -65 62 304 -67 39 -42 47 104 -63 57 -30 -64 -12 -58 8 27 -187 -42 89 104 156 166 5 -72 -41 122
5581 122 -135 13 32 27 -13 -33 43 114 -46 -141 -52 -181 230 -82 -220 218 53 -73 210 1 58 64 26 -242
$$ packed form
5417D9J6j87J13J84k28p1o1K76j80J60O2k36K50j18q1J96q4k57J34O4l08L85N0
5440A28r6K3j56J26K09j57P6k50L9Jo1J56k44P5k9L56k95J23p6r7O5K50l63L42
5464A45j32r2k7J30J31n12J73J76J45J14k06k64J51J79j62k17M07n02K06K39J1
5485I3lQ3n4m7r8j33M02l6j89J50l20mK0Q1n4J26o2k46L53M3j28J36L1j47P0k2
5511D5N4l43L07k6j32M3j82jJ86J31j46r5J41l0j36K83L4j24k36L96k04o2J58
5534F1J49k34J17k30K50J9m4j68K05j61k72M52J03l10L3K28k24K16P1l04L15l37
5556f5J27K42l71J06q1Q9N7j67J20q7l4N2m6O6J9k14J45J31J5N2J0j61p7L1J63
5581A22k57J48J9nm0k0P6P1j60r5Q9j29M11l12j38M38j65j26K83k09N7Ol8k68
$$ plain form
5605 -242 126 -83 24 64 -78 -57 -107 148 -260 292 80 -117 69 -153 -266 -22 110 -51 178 37 10
5626 10 139 64 142 -99 -54 -270 -156 113 28 88 -192 128 71 -79 205 120 30 -8 9 179 -116 -131 -129 154 34
5651 34 -134 121 6 132 -231 2 -246 23 264 -30 101 -32 -31 -17 -116 91 -49 -21 98 -140 55 -359
5673 -359 -79 191 -101 -137 13 200 206 98 -37 327 20 78 -5 -106 141 98 179 -190 110 -225 59 -4 -139
5696 -139 195 -12 105 -186 -36 -148 230 49 -143 -85 -61 25 -93 28 -36 344 214 360 -121 112 29 7
5718 7 244 55 -88 -210 -344 -40 -31 -2 -145 -111 128 75 7 -8 -112 33 19 189 147 19 -241 -82 18 -72
5742 -72 65 -153 132 -163 106 -75 -204 -213 32 -186 182 -227 -118 41 125 100 -302 189 -39 -71 -9 96
5764 96 -107 20 138 35 -77 266 -172 -17 82 -107 27 -185 -233 -95 41 36 -33 14 -25 -56 -8 16 -38 -126
$$ packed form
5605b42L68k09J07M0j42K1n0K55m08N52k12j97J86k22j13K44J32j61K29j41k7
5626A0J29p5P8k41M5k16J14K69q5O0k80L20n7j50K84q5r0l8J7J70k95j5KK83j20
5651C4j68K55j15J26l63K33k48K69K41k94J31j33JJ4r9K07j40K8J19k38J95m14
5673c59K80K70k92l6J50J87Oj08j35L64l07N8q3j01K47m3Q1l69L00l35K84o3j35
5696a39L34k07J17k91J50j12L78j81j92N8K4Q6j18J21o4L80j30J46m81K33q3k2
5718GK37j89j43j22j34L04RK9j43L4K39n3o8j5j04J45j4J70m2j28k60J59J00r0
5742g2J37k18K85k95K69j81j29rK45k18L68m09J09J59Q4k5m02M91k28l2O2J05
5764I6k03J27J18j03j12L43m38J55R9j89J34k12m8J38J36no9M7l9l1M8K4n4q8
$$ plain form
5788 -126 30 -235 -28 22 59 149 23 -163 280 118 124 -69 -35 167 39 -265 82 -107 -99 -105 2 89 -135 -153
5812 -153 -236 126 18 58 104 36 -168 101 -131 -176 -317 -66 -69 184 262 200 122 121 -9 -145 79 118 -29 -200
5836 -200 146 -54 97 34 117 45 68 31 -349 176 173 25 17 4 -120 76 45 46 -49 -339 40 -155 -144 -31 236
5861 236 -52 218 -191 -104 147 262 6 -191 147 -169 -10 168 -49 184 -96 -184 -190 -116 -142 373 -81 -151
5883 -151 1 57 -24 6 -182 -104 -32 -62 -95 -2 -254 44 172 212 177 -87 76 -126 114 -148 -2 6 47 -43 168
5908 168 -217 -141 -44 -171 -95 -52 -64 -231 -51 -77 160 16 -92 -96 -1 -163 144 -35 376 50 -98 353 47
5931 47 -13 57 171 63 -82 -11 194 -9 198 -141 -78 64 12 -101 90 -22 -21 -216 -167 134 7 64 -48
5954 -48 -91 17 221 -46 -12 -227 88 267 -134 -224 -67 61 150 -249 -58 -42 196 -89 161 -71 -124 124
$$ packed form
5788a26J56k65K07N0L7R0j26j86M43j62Oj93L4K02j28l04L47j89QoJ07Q7k24j8
5812a53q3L62j08M0M6o8k04K69k32m5j41K51lK53P8o2p8jj30j36K24L9j47j71
5836b00L46k00J51o3Q3p2K3l7l80N25lj48qj3j24J96l1Jr5k90L79j95J1J13K67
5861B36k88K70m09Q7K51J15k56j97L38l16J59J78k17K33k80q8oP4k6N15m54p0
5883a51J52N6q1L0j88P8P2l0l3R3k52K98J28M0l5k64J63k02K40k62J46QM1r0K11
5908A68l85P6R7j27P6M3j2j67J80k6K37j44j08mR5j62L07j79M11l26j48M51l06
5931D7o0P0J14j08j45P1K05k03K07l39O3J42n2j13J91j12Jj95M9L01j27N7j12
5954d8m3J08K04k67L4k15L15J79m01r0J57J28Q9l99J91J6K38k85K50k32n3K48
$$ plain form
5976 124 -210 154 121 -107 -325 -43 116 -248 -106 191 -92 105 -196 -83 146 -12 367 -153 -298 40
5996 40 165 36 -21 109 58 -75 269 119 346 128 -38 -353 55 34 -127 7 24 48 189 295 -36 133
6018 133 12 -267 -33 207 117 166 -172 88 -71 17 -248 -9 -228 120 91 35 52 91 0 14 198 189 -43 -175
6042 -175 -204 -290 -124 185 437 89 -58 -29 -55 186 -176 -187 201 -14 162 -32 -216 111 -85 46 228 89
6064 89 50 -37 -71 -271 22 179 -120 -235 -143 -20 -233 150 -55 115 -229 137 121 -105 -140 -2 1 93 -255
6087 -255 -346 -93 91 -215 -163 113 141 132 144 94 231 6 -97 210 19 -116 62 -68 -142 -11 -120 16 -35
6110 -35 -25 -202 59 104 -43 194 -212 -34 -4 -25 -225 -183 161 -129 -118 65 136 38 75 39 131 -173 -223 48
$$ packed form
5976A24l34L64l3k28k18K82J59l64J42K97k83J97l01J13K29j58L79n20j45L38
5996D0J25j29n7J30n1j33L44j50K27k18j66l15M08k1j61J34J7K4J41J06l31J69
6018A33j21k79K34K40r0M9l38K60j59Q8k65K39k19L48k9n6J7L9r1J4J84rk32j32
6042a75k9q6J66L09K52l48j47K9k6K41l62j1L88k15J76j94j84L27j96J31J82j39
6064H9l9q7l4k00K93J57k99j15R2J23k13L83k05J70l44L66j6k26l5J38LR2l48
6087b55r1K53J84l06N2K76K8rJ2n0J37k25j03L07j91j35J78j30p4J31j09J36n1
6110c5J0j77K61M5j47K37m06J78L0k1k00M2L44k90J1J83P1r8L7l6R2l04n0K71
$$ [...]
8191I5
##END NTUPLES=NMR FID
##END=
