##TITLE=1H_DE-106_oil
 200.13MHz, CDCl3,
 8 sc
 
 11.8.2025
##JCAMPDX= 6.0         $$ Bruker NMR JCAMP-DX V2.0
##DATA TYPE= NMR FID
##DATA CLASS= NTUPLES
##ORIGIN= UXNMR, Bruker Analytische Messtechnik GmbH
##OWNER= pz
$$ XWIN-NMR		Version 3.5
$$ Mon Aug 11 15:32:20 2025 Russian Standard Time (UT+4h)  she@DPX200
##.OBSERVE FREQUENCY= 200.1313
##.OBSERVE NUCLEUS= ^1H
##.DELAY= (6, 6)
##.ACQUISITION MODE= SIMULTANEOUS
##.ACQUISITION SCHEME= undefined
##.AVERAGES= 8
##.DIGITISER RES= 18
##SPECTROMETER/DATA SYSTEM= spect
##.PULSE SEQUENCE= zg30
##.SOLVENT NAME= CDCl3
##.SHIFT REFERENCE= (INTERNAL, CDCl3, 0, 14.3821)
##AUDIT TRAIL= $$ (NUMBER, WHEN, WHO, WHERE, WHAT)
$$ ##TITLE= Audit trail, XWIN-NMR		Version 3.5
$$ ##JCAMPDX= 5.01
$$ ##ORIGIN= Bruker BioSpin GmbH
$$ ##OWNER= she
$$ F:/spectra/data/she/nmr/H-C/1/audita.txt
$$ ##AUDIT TRAIL=  $$ (NUMBER, WHEN, WHO, WHERE, WHAT)
(   1,<2025-08-11 15:31:12.12 +0400>,<she>,<DPX200>,
      <created by zg, POWCHK disabled, PULCHK disabled
       configuration hash MD5:
       00 E9 B6 7A A2 85 ED C7 34 08 36 98 17 FE 4E 26
       data hash MD5: 16K
       1C 03 14 A2 D0 05 2D FD 4E 0D AF 7D 20 C2 69 DF>)
$$ ##END=
$$ 
$$ hash MD5
$$ 15 3F FC D2 9E 0A 84 0F 86 09 92 5E DD 6E 05 31
##$RELAX= 
##$RELAX= 
##$RELAX= 
##$RELAX= 
##$RELAX= 
##$RELAX= 
$$ Bruker specific parameters
$$ --------------------------
##$DU= <F:/spectra>
##$EXPNO= 1
##$NAME= <H-C>
##$PROCNO= 1
##$TYPE= <nmr>
##$USER= <she>
##$AMP= (0..31)
100 100 100 100 100 100 100 100 100 100 100 100 100 100 100 100 100 100 
100 100 100 100 100 100 100 100 100 100 100 100 100 100 
##$AQSEQ= 0
##$AQ_mod= 1
##$AUNM= <au_zg>
##$AUTOPOS= <>
##$BF1= 200.13
##$BF2= 200.13
##$BF3= 200.13
##$BF4= 200.13
##$BF5= 200.13
##$BF6= 200.13
##$BF7= 200.13
##$BF8= 200.13
##$BYTORDA= 1
##$CFDGTYP= 0
##$CFRGTYP= 5
##$CHEMSTR= <none>
##$CNST= (0..31)
1 1 145 1 1 1 1 1 1 1 1 1 1 1 1 1 1 1 1 1 1 1 1 1 1 1 1 1 1 1 1 1 
##$CPDPRG= <>
##$CPDPRG1= <>
##$CPDPRG2= <>
##$CPDPRG3= <>
##$CPDPRG4= <mlev>
##$CPDPRG5= <mlev>
##$CPDPRG6= <mlev>
##$CPDPRG7= <mlev>
##$CPDPRG8= <mlev>
##$CPDPRGB= <>
##$CPDPRGT= <>
##$D= (0..31)
0 0.7 0 0 0 0 0 0 0 0 0 0.03 0 0 0 0 0 0 0 0 0 0 0 0 0 0 0 0 0 0 0 0 
##$DATE= 1754911871
##$DBL= (0..7)
120 120 120 120 120 120 120 120 
##$DBP= (0..7)
150 150 150 150 150 150 150 150 
##$DBP07= 0
##$DBPNAM0= <>
##$DBPNAM1= <>
##$DBPNAM2= <>
##$DBPNAM3= <>
##$DBPNAM4= <>
##$DBPNAM5= <>
##$DBPNAM6= <>
##$DBPNAM7= <>
##$DBPOAL= (0..7)
0.5 0.5 0.5 0.5 0.5 0.5 0.5 0.5 
##$DBPOFFS= (0..7)
0 0 0 0 0 0 0 0 
##$DE= 6
##$DECBNUC= <off>
##$DECIM= 32
##$DECNUC= <off>
##$DECSTAT= 4
##$DIGMOD= 1
##$DIGTYP= 9
##$DL= (0..7)
0 120 120 120 120 120 120 120 
##$DP= (0..7)
150 150 150 150 150 150 150 150 
##$DP07= 0
##$DPNAME0= <>
##$DPNAME1= <>
##$DPNAME2= <>
##$DPNAME3= <>
##$DPNAME4= <>
##$DPNAME5= <>
##$DPNAME6= <>
##$DPNAME7= <>
##$DPOAL= (0..7)
0.5 0.5 0.5 0.5 0.5 0.5 0.5 0.5 
##$DPOFFS= (0..7)
0 0 0 0 0 0 0 0 
##$DQDMODE= 0
##$DR= 18
##$DS= 0
##$DSLIST= <SSSSSSSSSSSSSSS>
$$ [...]
##$SUBNAM0= <"">
##$SUBNAM1= <"">
##$SUBNAM2= <"">
##$SUBNAM3= <"">
##$SUBNAM4= <"">
##$SUBNAM5= <"">
##$SUBNAM6= <"">
##$SUBNAM7= <"">
##$SUBNAM8= <"">
##$SUBNAM9= <"">
##$SW= 18.0517328524113
##$SWIBOX= (0..15)
0 0 2 0 0 0 0 0 0 0 0 0 0 0 0 0 
##$SW_h= 3612.71676300578
##$TD= 16384
##$TD0= 1
##$TE= 0
##$TE2= 300
##$TE3= 300
##$TEG= 300
##$TL= (0..7)
0 120 120 120 120 120 120 120 
##$TP= (0..7)
150 150 150 150 150 150 150 150 
##$TP07= 0
##$TPNAME0= <>
##$TPNAME1= <>
##$TPNAME2= <>
##$TPNAME3= <>
##$TPNAME4= <>
##$TPNAME5= <>
##$TPNAME6= <>
##$TPNAME7= <>
##$TPOAL= (0..7)
0.5 0.5 0.5 0.5 0.5 0.5 0.5 0.5 
##$TPOFFS= (0..7)
0 0 0 0 0 0 0 0 
##$TUNHIN= 0
##$TUNHOUT= 0
##$TUNXOUT= 0
##$USERA1= <user>
##$USERA2= <user>
##$USERA3= <user>
##$USERA4= <user>
##$USERA5= <user>
##$V9= 5
##$VALIST= <valist>
##$VCLIST= <CCCCCCCCCCCCCCC>
##$VD= 0
##$VDLIST= <DDDDDDDDDDDDDDD>
##$VPLIST= <PPPPPPPPPPPPPPP>
##$VTLIST= <TTTTTTTTTTTTTTT>
##$WBST= 1024
##$WBSW= 4
##$XGAIN= (0..3)
0 0 0 0 
##$XL= 0
##$YL= 0
##$YMAX_a= 157052
##$YMIN_a= -216000
##$ZGOPTNS= <>
##$ZL1= 120
##$ZL2= 120
##$ZL3= 120
##$ZL4= 120
##$ABSF1= 10
##$ABSF2= 0
##$ABSG= 5
##$ABSL= 3
##$ALPHA= 0
##$AQORDER= 0
##$ASSFAC= 0
##$ASSFACI= 0
##$ASSFACX= 0
##$ASSWID= 0
##$AUNMP= <proc_1d>
##$AZFE= 0.1
##$AZFW= 0.1
##$BCFW= 1
##$BC_mod= 2
##$BYTORDP= 1
##$COROFFS= 0
##$CY= -3
##$DATMOD= 1
##$DC= 2
##$DFILT= <>
##$DTYPP= 0
##$F1P= 0
##$F2P= 0
##$FCOR= 0.5
##$FTSIZE= 0
##$FT_mod= 4
##$GAMMA= 1
##$GB= 0.15
##$INTBC= 1
##$INTSCL= 1
##$ISEN= 128
##$LB= 0.25
##$LEV0= 0
##$LPBIN= 0
##$MAXI= 10000
##$MC2= 0
##$MEAN= 0
##$ME_mod= 0
##$MI= 1.114404
##$NCOEF= 0
##$NC_proc= 0
##$NLEV= 6
##$NOISF1= 3.799351
##$NOISF2= 2.8
##$NSP= 1
##$NTH_PI= 0
##$NZP= 0
##$OFFSET= 14.38212
##$PC= 1
##$PHC0= -1560.303
##$PHC1= 13.39229
##$PH_mod= 1
##$PKNL= yes
##$PPARMOD= 0
##$PSCAL= 0
##$PSIGN= 0
##$REVERSE= no
##$SF= 200.129724274929
##$SI= 16384
##$SIGF1= 3
##$SIGF2= 2
##$SINO= 400
##$SIOLD= 16384
##$SREGLST= <1H.CDCl3>
##$SSB= 0
##$STSI= 0
##$STSR= 0
##$SW_p= 3205.1282051282
##$SYMM= 0
##$S_DEV= 0
##$TDeff= 0
##$TDoff= 0
##$TI= <>
##$TILT= no
##$TM1= 0
##$TM2= 0
##$TOPLEV= 0
##$USERP1= <user>
##$USERP2= <user>
##$USERP3= <user>
##$USERP4= <user>
##$USERP5= <user>
##$WDW= 1
##$XDIM= 8192
##$YMAX_p= 0
##$YMIN_p= 0
$$ End of Bruker specific parameters
$$ ---------------------------------
##NTUPLES= NMR FID
##VAR_NAME=  TIME,          FID/REAL,        FID/IMAG
##SYMBOL=    X,             R,               I
##VAR_TYPE=  INDEPENDENT,   DEPENDENT,       DEPENDENT
##VAR_FORM=  AFFN,          ASDF,            ASDF
##VAR_DIM=   8192,          8192,            8192
##UNITS=     SECONDS,       ARBITRARY UNITS, ARBITRARY UNITS
##FACTOR=    0.0002768,     1,               1
##FIRST=     0,             0,               0
##LAST=      2.2672688,     0,               0
##MIN=       0,             -216000,         0
##MAX=       2.2672688,     157052,          0
$$ Real data points
##PAGE= N=1
##DATA TABLE= (X++(R..R)), XYDATA
0@%%%%%%%%%%%%%%Qj6J6j6J6j7K5l2L9m7M9n7P2q1Q9j04J20j37J54j75J99k24
36a19K53k84L16l49L89m33M78n29N85o46P14p86Q64r51J049j158J274j404J555
55H18j723J914k137K394k700L071l525M103m871N931p487J0000j4705K6318j06872
70h9471j26529L00875J3415j75045J23036J10771j64880q297J21925o5011n7942
81a7153Q9161o0474j27287N1308K6786q3537N9117Q8650n8380j3355P6908k557
93B9187j2029M1234n232l0511J3687o492l1840O680N240l0500k018Q748j9218
106c3064Q928J6632l0622J828K9267k5869J0123P0544j4540m4365N3916L1245
118G4023n4740M779M3248m8703n2686K6972j2885m9081L3508K8272m4747Q241
$$ plain form
0 0 0 0 0 0 0 0 0 0 0 0 0 0 0 0 8 -8 8 -8 8 -9 16 -16 23 -24 25 -32 40 -41 48 -56 64 -73 81 -94 105 -119
36 -119 134 -150 166 -183 206 -227 251 -278 307 -339 375 -411 453 -498 551 -607 667 -737 818
55 818 -905 1009 -1128 1266 -1434 1637 -1888 2215 -2656 3275 -4212 5788 -8917 17401 -89471
70 -89471 -216000 84875 98290 -76755 46281 157052 -7828 -16125 105800 40789 -17153
81 -17153 72008 11534 -115753 -64445 -37659 -121196 -62079 26571 -31809 -45164 31744 29187
93 29187 17158 58392 53160 22649 36336 29844 -1996 4684 9924 -20576 -22594 -13846 -33064
106 -33064 -24136 -7504 -38126 -36298 -7031 -32900 -22777 47767 33227 -11138 42778 74023
118 74023 19283 24062 67310 18607 -34079 -7107 -19992 -69073 -35565 -7293 -52040 -43799
130d3799N0668q927n2M8669K636l5874O768J7348k4908j2770K0584j2150l3150
143b4957O726J3378j3555j213J4065l102j5099K134J7255M327Q00J6248M63j3281
157D189J6153J4749j5619n603O557j9456k3553L711L896j3115R52J3177r050O21
171b2391L1959P336j0363J6804O423j9302P44J0307j1588j2251m36n765j2151
184b0674N655J3334p236q767P922L348j861N465P653Q110l518r728R437J0654
198A9794o859Q56L135j4625j2140K495k506q976K795O840j0559m935K1312J0242
212F869l859J1564O083r700K117M990n834k798k717j2169q311L619K686m520K009
227i971L599r831O38J7791J487n130J0504L007r381J982J1117L878o728n765k330
$$ plain form
130 -43799 6869 -2058 -2110 46559 49195 13321 20089 37437 12529 -241 20343 8193 -24957
143 -24957 -18231 -4853 -18408 -19621 -5556 -8658 -23757 -21623 -4368 -41 759 17007 17470 4189
157 4189 20342 35091 19472 13869 20426 970 -22583 -18872 -14976 -28091 -27139 -13962 -23012 -22391
171 -22391 9568 16904 6541 23345 29768 10466 11210 21517 9929 -2322 -2758 -8523 -20674
184 -20674 -15019 -1685 -8921 -17688 -9766 -6418 -8279 -2814 4839 12949 9431 -297 9140 19794
198 19794 12935 13791 16926 2301 -9839 -7344 -9850 -18826 -16031 -9191 -19750 -24685 -3373 6869
212 6869 3010 14574 20657 10957 13074 18064 12230 9432 6715 -5454 -13765 -10146 -7460 -11980 -9971
227 -9971 -6372 -16203 -15565 2226 3713 -1417 9087 12094 2713 4695 15812 19690 12962 7197 4867
242D867r886n210N015k527o827L95m34j379L606J1837J2159l084n123Q347L211
257A4967n532J898K944o501r998l939R67p75n66J203n276m533O475L645L04O320
273A603J875l054J396L844M769K906j25l264p512l417K148l200k422K20o787n018
289a6038M808K846K698P080L877l286l078O376P674m586k337L949n637p405J899
304a160K104j275j640k274l143k085M736M625m490J55O720l080k592Q340M903
319I844k854k448N84o64l293J446J697p082l245K812l761j349O856J908k860k60
335b669K117K323J60K327J751m531r08K567k866L34L385l060k745mp11L46J758
352d26j9k438k018L763J710l959L699N576n447k901N632J143l002K1J480m001
$$ plain form
242 4867 -5019 -10229 -5214 -7741 -14568 -14173 -14607 -15986 -12380 -543 11616 8532 3409 11756 14967
257 14967 9435 11333 14277 7776 -2222 -6161 -5194 -5969 -6535 -5332 -10608 -15141 -8666 -5021 -4717 1603
273 1603 3478 424 1820 5664 10433 13339 13214 9950 2438 -979 1169 -2031 -4453 -4233 -11020 -16038
289 -16038 -11230 -8384 -5686 1394 5271 1985 -1093 5283 12957 8371 6034 9983 4346 -3059 -1160
304 -1160 944 -331 -1971 -4245 -7388 -9473 -4737 -112 -4602 -4447 2273 -807 -3399 4941 9844
319 9844 6990 4542 5126 4462 1169 2615 4312 -2770 -6015 -3203 -6964 -8313 -1457 451 -2409 -2669
335 -2669 -552 1771 1931 4258 6009 1478 570 3137 271 605 3990 930 -1815 -1819 -2530 -2184 -426
352 -426 -445 -2883 -4901 -1138 572 -3387 312 5888 441 -2460 3172 4315 1313 1334 2814 -1187
368a187l127M529J199n943K459N156o088k379O457K236l750j444K448M0k311K153
384D48K210k749l5J113k293N64K862j060j429j239J35J479m58Q79L72j776J30
401h47O19q96K663J019k375j197M33K53N97O44O83j736k607K792J492l145K779
418A171L296m497l285L282L097k117j635K456j548m378L385K561l059K019J670
433B418m887n69N087J124k718m79K340k452k516L850J412k441R01j426k742K101
449i97K183j496j84p07o56q92J113K325M38m03O39j384m46L327J38j197m72k039
467g10k30l1q70P85M39j589p58J25J036K720P11j267o68P07J730j156J80L239
485D393j295m684J507J510k552J199Q05l643k043K193J170k091J786M033k328
$$ plain form
368 -1187 -4314 215 1414 -4529 -2070 3086 -3002 -5381 1076 3312 -438 -1882 566 606 -1705 448
384 448 2658 -91 -126 987 -1306 -742 2120 1060 -369 -1608 -1473 6 -452 427 799 -977 -847
401 -847 -228 -1124 1539 2558 183 -1014 -581 -328 269 913 1596 -140 -2747 45 1537 -1608 1171
418 1171 4467 -30 -3315 -33 3064 947 -688 1768 220 -4158 -773 1788 -1271 748 2418
433 2418 -2469 -3038 2049 3173 455 -24 2316 -136 -2652 1198 2610 169 1070 -356 -3098 -997
449 -997 1186 -310 -494 -1201 -1857 -2749 -1636 689 1127 724 1363 -21 -467 2860 2998 1801 1329 -710
467 -710 -940 -971 -1841 -1056 -617 -2206 -2964 -2839 -1803 917 1628 361 -307 400 2130 974 1154 4393
485 4393 3098 -1586 -79 1431 -1121 78 883 -2760 -4803 -2610 -1440 -3531 -1745 2288 -40
500d0k274M392K144j185J730q89k655l74M13j292r07k38j92k234r52K246R98M77
518h32N07r57J074J812l37P95J533q32q15k25j86N14q13j365m06j965q99M07K08
537b782k1k64J426J679j135Q15M273m4k451J775O38k157p67N46j437j713N0l31
555a900j898P97K701j964j694L787J300j363M93J850M70j599N76J467o54j141
571A228M88j481j544M77k50j209p2m26L30N24M87J489J17J256J252j653O44K260
589C917j797j723O18m32j539o3m5j194K78O79O1o63K243J556k738N30J792r28
607E52l4J036n11qo10p03K32L8n6R2j237p13L33Q59J86l55R67J584j328m18K217
628B123m65r54P51j287j671J468J53j689r1J218k07j510K345J523j740R00Q35
$$ plain form
500 -40 -2314 2078 4222 3037 4767 3878 1223 849 1262 -30 -937 -1175 -1367 -3601 -4553 -2307 -1309 -832
518 -832 -325 -1282 -208 1604 1267 2062 3595 2763 1948 1723 1537 2051 1238 -127 -533 -2498 -3397 -2990 -2782
537 -2782 -2803 -3067 -1641 38 -1097 -282 3991 3947 1496 3271 3909 1752 985 1531 94 -1619 -1569 -1900
555 -1900 -3798 -3001 -300 -2264 -3958 -171 1129 -234 259 2109 2579 980 1556 3023 2369 1228
571 1228 1716 235 -1309 -832 -1082 -2291 -2363 -2789 -2459 -1935 -1448 41 158 1414 2666 1013 1657 3917
589 3917 2120 397 1015 583 -956 -1019 -1064 -2258 -1980 -1301 -1240 -1903 340 1896 -842 -312 1480 552
607 552 518 1554 1043 1035 425 -278 -46 -8 -64 28 -1209 -1922 -1589 -730 -544 -899 68 1652 324 -94 2123
628 2123 1658 704 1455 168 -1503 -35 118 -1571 -1662 -444 -651 -2161 184 1707 -33 867 1702
645A702k208Q68J599j856m24P08r27j237Q05J166n13l14J106j321q86K533N20
662A321j333Q95J079j867j72R31Q6K21r03p70m49n09K89L23o98J13O30L32K67
681b14O56J655M8j602P04J025j218n80P08j419j230L29k99k33L07R62n83j092
699b076J656R08m56Q87R53j333M96N32r44L97K53l49j512l92M61o05l66Q24p80
718a446r35J508L76l54J416R71j22p04O32Q10o95j189O68n66j300J40k94o81L80
737a385L79l17j43O25J132J69n87J271K03j043J045K00o71M00r27n14p9J88o27
756f81o60L5L32j4n34J038J06J54R64%K6L48J77k57o90J19L42p51n46L7k50r04
778a609Q30K32l44O37J73j02l73P32J010l52p54Q32j49j078P74L0l81j82j23k37
$$ plain form
645 1702 -506 362 1961 105 -319 389 -538 -1775 -970 196 -317 -631 475 -846 -1732 801 1321
662 1321 -12 883 1962 95 -77 854 940 1161 258 -512 -961 -1470 -1181 -858 -1556 -1443 -813 -481 -214
681 -214 442 2097 2145 543 1247 2272 1054 474 1182 -237 -1467 -1138 -1437 -1670 -1363 -401 -984 -2076
699 -2076 -420 488 32 919 1872 539 1035 1567 623 1020 1273 924 -588 -980 -519 -1124 -1490 -666 -1446
718 -1446 -2381 -873 -497 -851 565 1536 1414 710 1342 2152 1457 268 936 370 -930 -790 -1084 -1765 -1385
737 -1385 -1006 -1323 -1466 -841 291 460 -127 1144 1347 304 1349 1549 878 1278 351 -163 -242 -54 -681
756 -681 -1341 -1306 -974 -988 -1522 -484 -378 -224 740 740 766 1114 1291 1034 344 463 805 54 -492 -455 -705 -1609
778 -1609 -779 -547 -891 -254 -81 -183 -556 176 1186 834 80 912 763 -315 459 489 108 -74 -197 -434
798d34p3J39M51q14k06J188l59m12Q80O3k33K38j13j22L3P0J1q50k6M87k53J73
820a62M78J7n03k69J97L00K88J57m75n53J31M85n41L66O16o63m36L81m3L25L0
841A26m3l7n19K90P28n28j41P37o83p82N33J78m14N84J37n80k09L11R49l89K06
862D54K72l90m13P42j84J3o61j71l1j02o0M23N2j05l8m43L35N19L1j06P1j66L14
885C56J8m21O85j92j29j79p86K22M11n52J74m85N70NK86k3K71J51Q6J06n06K44
907C12M68k52p00K07j8K57r67N56J74n01k54N53k66M22L18m99k97P58P0J4k06
928A49M86N5q15J65K70n33L13k57o22L49J70o8m8O54n66L12J63K84j22j59K36
949D16l24j03L74j54j06M40l37k27n9o02L66J07k86J60r2K25J70q7k7L04J90J81
$$ plain form
798 -434 -507 -368 83 -731 -937 251 -108 -520 360 423 190 428 315 193 226 296 307 -543 -569 -82 -335 -162
820 -162 316 333 -170 -439 -242 58 346 503 28 -525 -394 91 -450 -84 532 -131 -567 -186 -229 96 126
841 126 83 46 -473 -183 545 17 -124 613 -70 -852 -319 -141 -555 29 166 -414 -623 -312 637 248 454
862 454 726 336 -77 665 481 494 -167 -338 -369 -471 -531 -108 -56 -161 -199 -642 -307 212 243 137 208 42 356
885 356 374 -47 638 446 317 138 -648 -426 -15 -567 -393 -878 -308 -303 -17 -40 231 382 468 574 68 312
907 312 780 528 -172 35 17 274 -693 -137 37 -464 -718 -165 -431 -9 309 -190 -487 271 341 355 149
928 149 635 690 -125 40 310 -223 90 -167 -789 -440 -270 -338 -386 268 -298 14 177 461 339 180 416
949 416 92 -11 363 209 103 543 206 -21 -80 -682 -316 -209 -495 -335 -427 -202 -32 -119 -146 158 348 529
971E29K8n57N38n1n62J02p0m16R9J11k29O0L72J55k01j35M33k09l58K54M00j66
993A27lK54m61K69K40k07j4m35J80m69l61O66q2k1J87j7k48N20L68k03L85j78
1015D97k74j06j61N50l87k04R4j92J14J01J20l25r7K24l16K22j45M30k46j60L03
1036D2P2J18M39l24j17O1k69m0K19n98M42k65k61J99M65k8k87N13j57J1m38N21
1058C18k72J21K55j81m92K75J05j65K12l33K42l13K08k03O7J28ko96J90P47K51
1079D62k82L09k48m83j3L91J5l12K38j4m56q5M32L64n24O61m33n9K29l23j2J20
1101b3k79L26k63M30L81m08l60J95J48j84N1M0P9J09m67j14L18j97o0K0K54J12
1123A08j4Nj46r3K56j53P0P5o0J58n4k13K6K18k86kJ00q3j93K14j68p6J18R3L27
$$ plain form
971 529 557 0 538 487 -75 27 -43 -459 -360 -249 -478 -418 -46 109 -92 -227 206 -3 -361 -107 293 127
993 127 124 378 -83 186 426 219 205 -230 -50 -519 -880 -214 -296 -317 -130 -147 -395 125 493 290 675 497
1015 497 223 117 -44 506 119 -85 9 -183 -69 32 152 -173 -270 -46 -362 -140 -285 145 -101 -261 42
1036 42 114 232 671 347 230 291 22 -18 201 -397 45 -220 -481 -282 183 155 -132 381 224 235 -203 318
1058 318 46 167 422 241 -251 24 129 -36 176 -157 85 -228 -20 -223 -156 -28 -30 -726 -536 211 462
1079 462 180 489 241 -242 -255 136 151 -161 77 63 -393 -478 -46 318 -206 455 22 -37 192 -131 -143 -23
1101 -23 -302 24 -239 191 572 164 -196 -1 147 -37 14 54 133 242 -225 -339 -21 -218 -278 -258 -4 108
1123 108 94 99 -47 -140 116 -37 33 108 48 206 152 -61 -35 183 -103 -105 -5 -88 -281 -67 -235 -311 -193 -100 227
1148B27o8nL75j94l51L39J1j89r9R1K2l36k19K17nj8kj0q0J56N2rJ4K08j22N7
1174F2J95k1oJ3r4m67J88J75m56K1J28p2M42m97L71J55Jj24L2OJ36NJ9N3L55m70
1200A50l03j73K23j9k3l1j18l0K12J97l66K09L10m5m8k91N74k73o1j79L89l37
1222c3M5J65k10N0m72J2Q1J31J25k00N8J83M94k03J59J0j84J22R8o85L07O1m6
1245F8l1o10M26J0n0M30Jl08L55l45j15L27Lq2J54l68J70J51l82M71k96k00K19
1268bL4O6j32j17l3K48l19L78L0p7J10L74m02l61L42j05r0J16j74k9K0j9J24k7
1292d5K29q1r0L5l34K22J47o5k42J0q4L36l83J47L63l41J49P4L19k17J15k98k75
1315c09J71L87k25k26N3Q0N9L6J84k96l41M00q1Q8j09J83J05O3Jk2J12n32K13
$$ plain form
1148 227 159 154 529 335 -16 323 334 145 46 137 159 -177 -396 -179 -184 -202 -204 -214 -294 -138 -86 -95 -81 127 5 62
1174 62 257 236 230 243 149 -318 -130 45 -411 -390 -262 -334 108 -389 -18 137 138 14 46 52 188 193 212 265 620 150
1200 150 -153 -326 -103 -122 -145 -176 -294 -324 -112 85 -281 -72 238 193 145 -146 428 155 94 -85 304 -33
1222 -33 12 177 -33 17 -455 -443 -362 -231 -106 -306 -248 -65 429 226 385 395 211 333 431 -254 53 114 68
1245 68 37 -573 -147 -137 -187 243 244 -64 291 -54 -169 158 161 79 233 -135 35 186 -196 275 -21 -221 -2
1268 -2 32 98 -34 -151 -184 64 -255 123 153 76 186 560 158 -203 139 34 -56 60 -114 -143 -123 -142 -18 -45
1292 -45 184 103 13 48 -286 -64 83 18 -224 -214 -298 38 -345 -198 165 -176 -27 47 366 149 264 -34 -309
1315 -309 -138 249 24 -202 -149 -69 -10 26 210 -86 -427 -27 -108 -20 -129 54 159 222 223 201 313 -219 -6
1338fJ2k41J13j82J54k29K69K16j98KL95l66nK46j6K61j82q1j69J89k05J2j41
1361a52p8J13j80k2J93L4p1J64K0r0K90j4L12r9l14J9l5K22k31j04k21M99n59
1384c04J9J28j75K75K9j13J11k3J51L6J83qM11m30k63K1J71j5j35r4m7p6J75k88
1408b61M7k11M30j04q2J85N8J84r7j55J12L2j14N8n4J85k58j03l25N89J6k21J88
1431I9j94K64k59M6K4n8O9K29n82N58q4O1k5j62J09l74K48K48j75o8L3l29l0K24
1455a28N1j7O9L9o3Q0J27k66R7m7Q1q9j17K52K71n25K90J51k96K34m52O20k33
1478A29l79J83j39R2P2L18k08Q2n7J62k67j27L27k14o3M7N4K16l03L1q7K60k70
1501a41J6R5L26k57p7Q5J30J74j52O6l4k89Q5j40J69L1k33j01K02M3j25K54l79
$$ plain form
1338 -6 6 -235 -122 -304 -150 -379 -110 106 -92 -90 305 -61 -66 180 164 425 243 162 -7 182 -23 -11 -152
1361 -152 -230 -117 -297 -319 -126 -92 -163 1 21 -69 221 207 519 420 106 125 90 312 81 -23 -244 255 -304
1384 -304 -285 -157 -332 -57 -28 -141 -30 -53 98 134 317 309 720 290 27 48 219 204 69 -25 -72 -148 27 -261
1408 -261 -214 -425 5 -99 -181 4 62 246 149 -6 106 138 24 82 28 213 -45 -148 -473 116 132 -89 99
1431 99 -95 169 -90 -44 -20 -78 -9 220 -362 196 112 173 148 -14 95 -279 -31 217 42 -26 7 -322 -352 -128
1455 -128 -77 -94 -25 14 -49 31 158 -108 -11 -58 23 -66 -183 69 340 -185 105 256 -40 194 -258 362 129
1478 129 -250 -67 -206 -114 -42 276 68 150 93 255 -12 -139 188 -26 -89 -42 12 228 -75 -44 -131 129 -141
1501 -141 -125 -30 296 39 -38 47 177 351 199 265 231 -58 27 -113 56 87 -146 -247 -45 -2 -127 127 -252
1524b52K53j17L5m2K08j03K55j11J28j40j74j45K19J39k68k9P9Op0j1J48l24K21
1547i5P7j7J90k55j62M51j63L6K15m36K43J0p1m3P0n4j14k34J65J57j04K6L17
1570B09p0k26J24J79j25pL7l0k00J7J42k65K83j63m0L45q2R7j74k26K27r6J0j6
1594e0L17p3o6J92k45j97J84j21r3J91r8j49L96k84Jj26kL01J33m24L24Q7J73
1617C71k84o2J39j61p3l7J08K00J01n77M32l43P7O7j23K08r0J04O0k89N2P9n7
1640i8j37K39k26P4L11j85j00J51R0j62J73m6J4k39j34rP5K12ok06J7K87j45J64
1664A14l38K16J30j84Q6m6K7l5r5L76m64L14j0j04m0j76L41k87M9J73k69J50J29
1687E7J04K67m50j98M69j53M9K9m6l26Q5J86l05j31M51o5p4K43k65K88l52K39
$$ plain form
1524 -252 1 -116 -81 -123 85 -18 237 126 254 114 -60 -205 14 153 -115 -144 -65 -59 -129 -140 8 -316 -95
1547 -95 -18 -35 155 -100 -262 189 26 62 277 -159 84 94 23 -20 50 -4 -118 -352 -187 -30 -134 -108 209
1570 209 139 -87 37 216 91 84 121 91 -109 -92 50 -215 68 -95 -135 210 128 225 51 -175 52 -44 -34 -50
1594 -50 267 194 128 320 75 -122 62 -59 -152 39 -59 -208 188 -96 -95 -221 -223 78 211 -213 111 198 371
1617 371 87 25 164 3 -70 -107 1 201 302 -275 157 -186 -109 -42 -165 43 -47 57 117 -172 -120 -41 -98
1640 -98 -235 4 -222 -148 163 -22 -122 29 119 -43 130 84 98 -141 -275 -284 -209 3 -3 -209 -192 95 -50 114
1664 114 -224 -8 122 -62 24 -22 5 -30 -125 251 -213 101 91 -13 -53 -229 112 -175 -126 47 -222 -72 57
1687 57 161 428 -22 -220 249 96 145 174 128 -198 -113 73 -232 -363 88 23 -51 192 -73 215 -137 102
1709A02K53m04K46j64J0k1Q9j85J38P4J16j48j60j4o7J22J26j52J18J5J03J5l04
1732i2l3J40M0r0q1Q0j17l1j34M71m11J90j01J9M7j7L04k72P2K39j68R3O1m7k0
1757A42o2l74L36j70P0j09q6JK23N5j35J54o7j16J92m8l0K55n1p1J9j38J32m46
1781c24M81l35M16k85P2j8Q9k96J09J55j96J65m0j26M3N3rJ48p5J9J43l22K07
1804G4k05N8J38j97j10K57k33J82O0P7k29K56j7k12J81p2K6j88J96j21K19R0j77
1827E3k12J34o7J55p4K0J0j18l7J79j9K6k12K23j12j03K46j15P1J97j96J78k17
1850A0O3o2l99N70k71J3j92K32P8j01J39R3P2k25J3N7K00j79kM7j71O3J12j64
1874do8J00n33L64OJ38M3q3J72j4l04N8K48k1lm35K48N2J57k72M29k17J53j44
$$ plain form
1709 102 355 -49 197 33 43 22 111 -74 64 138 254 106 -54 -68 -135 -13 113 -39 79 94 197 212 -92
1732 -92 -125 15 55 -35 -116 -36 -153 -184 -318 153 -258 -68 -169 -150 -103 -120 184 -88 -16 223 55 148 209 162 142
1757 142 80 -294 42 -128 -58 -167 -253 -252 -29 26 -109 45 -22 -138 54 6 -24 231 180 109 128 -10 122 -324
1781 -324 157 -178 238 -47 25 7 96 -200 -91 64 -132 33 -7 -133 -90 -37 -46 102 27 46 189 -133 74
1804 74 -131 -73 65 -132 -242 15 -218 -36 24 101 -128 128 111 -101 80 8 34 -154 42 -79 140 230 53
1827 53 -159 -25 -92 63 -11 9 19 -99 -136 43 24 50 -162 61 -51 -154 92 -23 48 245 49 227 10
1850 10 73 11 -388 182 -89 -76 -268 -36 42 -59 80 173 245 20 33 90 290 111 109 156 -15 48 160 -4
1874 -4 -72 28 -505 -141 -135 3 46 -37 135 121 -183 -125 123 102 99 -336 -88 -36 121 -151 278 61 214 70
1898G0q6k02K70j42L88m75J16J37j22K29j37k6j78L09j69R9J1K7k79J18J60j83
1920f5J69m05K22M2M7M7k3l22J26K46j05J16l18K19L12j62Nqm1n2jJ42Jj30k1
1945D1j46j98M72j26JJ16k41k2k3J71j5lj29J30k11L89k36J09N4j88j20l2K52
1968D5j63N7J20k04M05k17K4m1K3jk00j60J91J07k76K43Nm0oJ07k2J22m4N2j14
1993A3L1j24P2J62m5j9j6k72K05J73k89m7O8p7J4N7j73J35J0j0Q9j85K44j58K59
2018A17k74J86j10J48j00o5mJ68N8j24j75P7L52k68J53j33Q9l14J11K81l49K03
2040B7J6n2r8J09J49j72m0J53R3j51k33J17J12l38L61J27k38R5L9l8K10m40m8
2063b40J99j44K99Pm66N18l3j08R2N4k41J59j37M0m6nL40k06j43R8J5N4k60J88
$$ plain form
1898 70 -16 -218 52 -90 298 -177 -61 76 -46 183 46 20 -158 151 -18 81 92 119 -160 -42 118 -65
1920 -65 104 -301 -79 -37 10 57 34 -288 -162 84 -21 95 -223 -4 308 146 151 143 102 50 49 191 192 62 41
1945 41 -105 -303 169 43 44 160 -81 -103 -126 45 30 27 -102 28 -183 206 -30 79 133 -55 -175 -207 45
1968 45 -118 -61 59 -145 260 43 67 26 49 48 -152 -312 -121 -14 -290 -47 -42 -82 -88 19 -3 119 75 127 13
1993 13 44 -80 -8 154 109 90 74 -198 7 180 -109 -156 -88 -165 -151 -94 -267 -132 -122 -132 -43 -228 16 -142 117
2018 117 -157 29 -81 67 -33 -98 -102 66 124 0 -175 -98 254 -14 139 6 95 -219 -108 173 -176 27
2040 27 43 -9 -107 2 151 -21 -61 92 185 34 -199 -82 30 -308 53 180 -58 37 76 38 248 -192 -240
2063 -240 -41 -185 114 121 -345 173 140 32 124 178 -63 96 -41 -1 -47 -52 288 82 -61 37 52 106 -154 34
2087C4j30R8K59j57j64J38K11j91J04JLk90N7J17k12j79L00J8O3J2J07k31m9j28
2111b09K00r0K53j40j1P7j03k4J42q8P9k78L00O2k02K3k3k5J45k13J51K88j67
2134A47J24l15K81l18K3q9K28l04L79j03j97J94o1J53k09K46O4m28J08K01n9j04
2156c9j52K00J02j26N6j9P2j23J09k3j53J85q4O3MJ6R0k33n4K13o2k15K39j75
2180a09K87n7N4j31k1k99M47j37J45p3j56N6J39l37L05j24P3p3J79j38j02J79
2202A07j88k1n5KJ64R6k49J84j57J34Q9k63m8J6J72O8j04k02L43o1j48M9j04L44
2226A68l08L25jM3l38J02P4m6lk05J71j24J83P1j65K59k32K59m58R3K52j51M6
2249A5j92J45j9K0O2J88k23J83l3k40k69N63l36J07l2J66J1j20%J49J04j90J8
$$ plain form
2087 34 -96 2 261 104 -60 78 289 98 202 203 206 -84 -27 90 -122 -301 -1 17 80 92 199 -32 -81 -209
2111 -209 -9 -99 154 14 3 80 -23 -47 95 7 86 -192 108 170 -32 -9 -32 -57 88 -125 26 314 147
2134 147 271 -44 237 -81 -58 -147 81 -223 156 53 -144 50 -11 142 -67 179 243 -185 -77 124 65 -39
2156 -39 -191 9 111 -15 41 22 94 -29 80 57 -96 89 5 68 72 88 178 -55 -109 104 42 -173 66 -109
2180 -109 178 121 175 44 23 -276 171 34 179 106 -50 6 145 -192 113 -11 62 -11 168 30 -72 107
2202 107 -81 -102 -157 -155 9 105 -144 40 -117 17 106 -157 -205 -189 -17 51 -53 -255 88 27 -121 -72 -176 168
2226 168 -140 185 184 227 -111 -9 65 19 16 -189 -18 -142 41 112 -53 206 -26 233 -225 -132 120 -31 15
2249 15 -177 -32 -51 -31 31 219 -4 179 146 -94 -363 200 -136 -29 -61 105 116 -4 -4 145 249 59 77
2272G7k04L16j29K1j56J8K14k81K36N1j37j20L09m26K16k0k31K71j14J27l8j11
2294a11Q4J54j98L34l37M0K31k89K52k07J89j14m6J24k11J56J05j61K35k28rJ4
2316GK9L2k40M47l43J57o9K82q7j26j52J26J20k54L78l15J30k13j8l9L49m35J38
2339i6J8k1L7Mk42K12K0l8J96j88rJ16j50j26P6k7K30o9j0L17r1l50J84K69l73
2364a11l5K46J39O4q5j47k41L72j29mj5K1rm0K56l20l4q3J37j89jJ73m1n8J08
2389b6K91j80k54K15K6j97M19l27L0j34J18l6R2k2KJ19k80K06J9K14q9k22O3J08
2413A55rj29J29l13K4K04j57N8K4J57k71N8n7K57p8J4L7j31n3o9m4p5N70k77J13
2438A37r6j57n7M17l30J53J28j63L7k04N8Pk1J77J57k59Q2rK94j00k4k86K02l03
$$ plain form
2272 77 -127 189 60 81 -75 -57 157 -124 112 163 26 -94 215 -211 5 -15 -246 25 -89 38 0 -111
2294 -111 -27 127 -71 263 -74 -34 197 -92 160 -47 142 28 -18 106 -105 51 156 -5 230 2 -7 7
2316 7 36 68 -172 275 -68 89 20 302 215 89 -63 63 183 -71 307 -8 122 -91 -109 -148 201 -234 -96
2339 -96 -78 -99 -62 -58 -300 -88 -68 -106 90 -98 -107 9 -141 -267 -191 -218 12 -57 -67 250 159 -191 -7 262 -111
2364 -111 -146 100 239 303 218 71 -170 202 73 69 54 75 66 26 282 -38 -72 -155 -18 -207 -208 -35 -76 -134 -26
2389 -26 265 85 -169 46 72 -125 294 -33 -3 -137 -19 -55 37 15 17 136 -144 62 81 295 206 -16 47 155
2413 155 146 17 146 -167 -143 61 -96 -38 -14 143 -128 -70 -127 130 52 66 103 -28 -81 -150 -194 -269 301 24 137
2438 137 41 -116 -173 244 -86 67 195 32 69 -135 -77 -70 -91 86 243 -16 66 57 351 251 227 -59 143 -160
2462a60K34n4r4Q3L8j59K39k75j77M17j6P0l17R6PR2l92L88%J72j88J11J4Oj49
2487a4k7N0j43K71k7k09j06m0J72O3J55m14K33L4j31P5L1M2j91J50R8k26K01P7
2511A24j67OO4n9Q7k05q7L4M9Q4J92L0j52n3J84p7j87M4j31K56q6M1j39K61j27
2536a4k10K18qm6J15Q9j17K03l33N4M72n75J06%n7N7L1j44J49k7R1q6Q1l4M0j10
2562e5j07L77j88l7J59r7J35j9k69Q0K50m55L88j44q7M0pJ45n9l14J73J19k2o
2586@J36k57J20J22j47J1p0M07l83q6L52n4l28L7J57j26J74k40L96l4o1j80J54
2609A00J20J2l92J40n4QKN5K5k82J41K65j77j36j7J61L86j42k88K78r2l21J1J22
2633g5P3O1l0k09K51k24R9j05J72P5j19k05J96J31m4j58K95j08k3j36j41M06k01
$$ plain form
2462 -160 74 20 -74 9 47 -112 127 -148 -325 92 76 146 -171 -75 -68 24 -368 20 20 192 4 115 129 135 -14
2487 -14 -41 9 -134 137 110 -99 -205 -245 -73 -10 145 -269 -36 -2 -133 -58 -27 15 -176 -26 72 -154 47 124
2511 124 -43 -37 27 -32 55 -150 -237 -203 -154 -70 122 152 0 -53 131 54 -133 -89 -220 36 -50 -9 -148 113 -14
2536 -14 -224 -6 -14 -60 55 144 27 230 -103 -49 423 -152 -46 -46 -103 -46 -15 -159 -10 -37 54 -32 49 15 55 -55
2562 -55 -162 215 27 -10 149 52 187 168 -101 -21 229 -226 162 18 -69 -29 -36 109 50 -264 -91 28 6 0
2586 0 136 -121 -1 121 -26 -15 -85 322 -61 -147 205 151 -177 -140 17 -109 65 -175 221 187 126 -54 100
2609 100 220 232 -160 -20 -74 -66 -64 -9 16 -266 -125 140 -37 -173 -190 -29 357 215 -73 205 113 -208 -197 -75
2633 -75 -2 59 29 -180 71 -153 -54 -159 13 88 -31 -236 -40 91 47 -111 184 76 53 -83 -224 182 -19
2656a9J16j90M0J30R3j77m1k0j2M4J05k1o3k0j0J78j40j74L02j41o7p4K57k87
2680a91K27Q5j50J38k67J04K48l0k88J99k32J96j43J55nR0j45j10K1J68k44k2
2702a96R2j30K5J91K7p8J47j40J47L8L2j97j06K30J7j18M9k21K26m09L88K7O2
2725A03o5k03J00J11p5O6j03pJ43K2K31l24J38j30J71O2l21P3L11j15l15K48j83
2748f2P9j71j82N15r2k32K69j82J96k50J22j38K26k03J79j54p9J0P1K58j83m7
2770e0K17k66J71p7J0k58K61o6O3j69K76N3j75J81l48K68k51K05j44k8PK93j41
2793C2k33M46l85J30j07J08n8K31j85j01J64J00j96J89k87L42j88l1l5QL2J51
2815A27k9j60O3k0q5J66J12j50J61j65P6r9K40m58P3K14p8mj43L01k07L45k75
$$ plain form
2656 -19 97 -93 -53 77 170 -7 -48 -68 -80 -36 69 48 -15 -35 -45 133 -7 -181 121 -20 -87 -161 96 -191
2680 -191 36 121 -29 109 -158 -54 194 164 -124 75 -157 39 -104 51 46 136 -9 -119 -98 70 -174 -196
2702 -196 -104 -234 -209 -18 9 -69 78 -62 85 123 155 -42 -148 82 99 -19 30 -191 35 -374 14 41 103
2725 103 38 -165 -65 46 -29 37 -66 -73 70 92 323 -1 137 7 178 240 -81 -8 303 188 -127 121 -62
2748 -62 17 -154 -336 179 87 -145 124 -58 138 -112 10 -128 98 -105 74 -80 -159 -149 -78 180 -3 -50
2770 -50 167 -99 72 -5 5 -253 8 -58 5 -164 112 165 -10 171 -177 91 -160 45 -99 -127 -120 173 32
2793 32 -201 245 -140 -10 -117 -9 -67 164 -21 -122 42 142 -54 135 -152 190 2 -29 -64 -56 -24 127
2815 127 98 -62 1 -19 -104 62 174 24 185 20 96 -3 237 -221 -148 66 -12 -16 -159 142 -65 280 5
2838EK28j84k16J19J50nj61o9J09J78o3J5nj32J10N0J83k44J11o6j62J50j8Q0
2862A63o2M1m22N77l50K19j48M1M9L5L8l75M12J36j35k00p8J32k24L16m73L37
2884B9N2m13L78o3J59l29J77J37o2k71J21j4N3J82j71%N1l21K51K5k33J07K36
2907H1J3J02k69k3K95j54j66M4J20j43J12Pm6J02j35K21m3N2q7o8J30k12K78j68
2931D3L3M7m3j20p2J00m1K47l00l0J34K34l37K29j1R1n9k23L21j73N1j38Pk7J17
2956H0J1k28j36L01p0P8Q6r1k66M3j0K24j61L6r7K55R2k71K22J36l07kJ65q1o9
2981f0K03l42K13j32l7K90j46R0J6j77p2L28j42N4Q2k79k8L25j79j58K45j13l9
3004e8%J26k05j6J11J87q6O6k39j49M91k73O6j4j30P7j9J93j69O3P0N5n2q2j32
$$ plain form
2838 5 233 49 -167 -48 102 97 -64 -133 -24 154 91 106 101 -31 79 129 312 68 179 113 -49 101 83 163
2862 163 101 142 -280 297 -53 166 18 59 108 143 181 -194 218 354 219 19 -59 73 -151 165 -308 29
2884 29 81 -332 46 -17 142 -187 -10 127 65 -206 -85 -99 -46 136 -35 -35 16 -305 -54 -29 -262 -155 81
2907 81 94 196 -73 -96 199 45 -121 -77 43 -100 12 19 -27 75 -60 161 118 170 83 15 145 -67 211 43
2931 43 76 123 80 -40 -112 -12 -53 194 -106 -136 -2 232 -105 124 113 204 145 -78 243 70 121 -17 -10 -37 80
2956 80 91 -137 -273 28 -42 36 122 31 -235 -192 -202 22 -139 -103 -200 55 147 -124 98 234 -73 -75 90 9 -60
2981 -60 143 -199 14 -118 -155 135 -11 79 95 -82 -154 174 32 86 168 -111 -139 186 7 -151 94 -19 -58
3004 -58 -58 68 -137 -153 -42 145 59 125 -114 -263 228 -45 21 7 -123 -46 -65 128 -41 22 92 147 95 13 -119
3029a19J91J33o4p5q1K35k20L6j05K33l7j15l5j01J48J03L2l94K03L9P4n2k45
3052b16M39l36L6O1j1r8J53j72J27m5J29r5JL81k79Jo2q6j04P4m5J57L9p9J89
3077A59j89k22K31p4K60m5k0q6R4j0j06j56J75k4q4N9J89r8j47k15L38n9k70K82
3101a8M1j07R8K35m84M64m75K71N8J87l87L22k71M2j14Rm4P7R0m2n5R0J15k55
3125a53O0J67r9n3j06J26j52K98q7j46K10j21r1k31K05J22j99J79j13l6J90m05
3147d35M27j88J02K07o2K8r3J51Jj29k0Q3r3k29N48l54L3k3J86P7m9k53L04k60
3171d1q7M9l5J02m3J2n9J66k9J87K22m12J68j24k05J95mj6lJ88l36J45m4l0o1
3196i5K15k32K49J2q9P3j9p9p6o3K7pm4K86k96J07J28jm12K64R7lj30K18J45m80
$$ plain form
3029 -119 72 205 141 66 -15 220 0 36 -69 164 127 12 -23 -124 24 127 159 -235 -32 7 81 29 -216
3052 -216 223 -113 -77 -16 -27 -125 28 -144 -17 -62 67 -28 -27 354 75 76 14 -72 -176 -102 -147 10 49 -30 159
3077 159 -30 -252 -21 -95 165 120 100 14 108 98 -8 -164 11 -13 -97 -38 151 53 -94 -309 29 -30 -300 -18
3101 -18 23 -84 14 249 -235 229 -246 25 83 270 -117 205 -66 -24 -138 -129 -173 -96 -6 -48 -103 -13 102 -153
3125 -153 -93 74 -25 -78 -184 -58 -210 88 1 -145 65 -56 -147 -378 -173 -51 -250 -71 -184 -220 -30 -435
3147 -435 -8 -196 -94 113 51 79 -14 137 138 9 -11 72 -21 -250 298 -56 -23 -46 140 217 168 -85 219 -41
3171 -41 -128 -79 -114 -12 -55 -43 -102 64 35 222 444 32 200 76 -129 66 62 46 43 231 -105 40 -4 -34 -95
3196 -95 120 -112 137 149 60 133 114 35 -41 -104 -77 -84 -128 158 -138 -31 97 96 -316 -52 45 42 -88 130 275 -205
3222b05J91M3j00N4J10n0K9K6M1m25K43J38k06J93m5p6J55O6l08K38j73K92j91
3245D0j40K41n7p2n4J03Q5n2k32j63J38J34j42K40m9O0QN6l43J00J62r1K7p2J24
3270E1l02J60J14l00K59o8J06p2J21J03j25J59L5n8j34k84L76k52K85j38J4k97
3292b47J38K95l57J17R6k27L32k00l9K92l08J80l31P3L15J6k93N18l25L5K1qj08
3315a5l8j14J53J2k40J18K68p2l85L03j2q0J09N5J68k78J30k9k26R7J71j56K1
3338d0j14J10j02J89Rk91J45J34J12k32J87k3j13j75J94q7N3kj55j73L58J82l13
3361a47K2jJ65j41K69j25K4j48K45j32J18k72n1N5N1K4L36k01j8j38j8L25j0l02
3385g0K48l52l9J50O0l27J09L67J9k61p8OK78k26rM31n08J89o6N2p1n1J69k2k22
$$ plain form
3222 -205 -14 29 -71 -17 93 43 72 98 139 -286 -43 95 -111 82 37 -39 116 182 -126 112 -61 231 40
3245 40 -100 141 84 12 -42 61 146 94 -138 -301 -163 -29 -171 69 20 80 88 144 -199 -99 63 -28 -1 -73 51
3270 51 -251 -91 23 -277 -18 -86 20 -52 69 172 47 206 241 183 49 -235 141 -111 174 36 50 -247
3292 -247 -109 186 -171 -54 42 -185 147 -53 -92 200 -108 72 -259 -186 129 145 -148 370 45 80 101 93 -15
3315 -15 -53 -167 -14 -2 -242 -124 144 72 -313 -10 -22 -102 7 62 230 -48 82 53 -173 -76 95 -61 -40
3338 -40 -154 -44 -146 43 52 -239 -94 40 152 -80 107 84 -29 -204 -10 -97 -44 -46 -201 -374 -16 166 -147
3361 -147 -125 -126 39 -102 167 42 66 -82 163 31 149 -123 -174 -119 -68 -44 292 91 73 -65 -83 242 232 -70
3385 -70 178 -174 -213 -63 -3 -330 -221 146 165 -96 -174 -168 110 -116 -125 306 -202 -13 -79 -27 -98 -149 20 -2 -224
3410b24L58M7m12Q0K5pL37j2j43k15J90J67l22MN40m43N6L1r4K01j74jr1K43k72
3435a31K27n4r1j8q9j03K28L21l15K50j94k08Q4L3p5K22k75N12m19j8L5J18m6
3458fJ9j80M66m39N2N9m5J4K37m59J97K9J44P0m43N14k53k68K51J95l92ROL36
3482A13K4n5l46L35j59L4J16J84j82L6J06l59L16k41K02k68J72k24O0N0q4M39
3504B69l21q3O5J78p2p0J45j64M3L3j12j10Q8J23j84K26k67K16J40N2m12M05m13
3527b25l1J89J81j10j0q8m1K47l9%k35L45r8k20J54j35J20l51M64j65r8K47j76
3550g5J24o9K04m5j92O1j77P5J24N9j71R1P2k6k73j07L61J35k26op0N0J77nj19
3575b8J49r7n2j32j02K46j09K01Rj04K5K0m1p5R2j10K92P5k62k48K02J17l69K02
$$ plain form
3410 -224 134 181 -231 -151 -126 -133 204 192 49 -166 24 191 -131 -127 413 -30 26 57 -37 164 -10 -11 -102 141 -131
3435 -131 96 42 -49 -67 -156 -259 -31 290 -25 225 31 -177 -93 -60 -135 87 -188 324 -95 -113 -78 40 -6
3458 -6 13 -167 299 -140 -88 -29 -74 -60 177 -282 -85 -56 88 158 -285 229 -24 -292 -41 154 -238 -229 -223 113
3482 113 137 82 -264 71 -88 -54 62 246 64 100 206 -153 163 -78 124 -144 28 -196 -136 -86 -170 269
3504 269 -52 -135 -70 108 36 -34 111 -53 -10 23 -89 -199 -111 12 -172 54 -213 3 143 195 -217 188 -225
3527 -225 -256 -67 114 4 -6 -94 -135 112 73 73 -162 183 85 -135 19 -116 4 -347 117 -48 -146 101 -75
3550 -75 49 -20 184 139 -53 8 -169 -94 30 89 -82 9 81 55 -218 -325 36 171 -55 -61 -131 -81 96 91 -28
3575 -28 121 24 -28 -160 -262 -16 -125 76 85 -19 6 26 -15 -90 2 -108 184 259 -3 -251 -49 68 -301 -99
3599i9J83m39K13j04K27R7p2m7K9J30k80J45J9l7J11O5k73J32k03KK10M8R3K55
3623D05j91mk33J27j28L04o4k11L9R2j1l2n9j7k2K61m62L22k53L6J04l74N9L85
3647G3Q5l43J63O6L8k89N56m73PJ82Q9j70j2k04L04J87o72M48o3j98L70j31j59
3670a46K20M7Pk52J72J45m75K49j1k6q2L11j75J96j67j65J57M6j05K1L16k29N6
3693A10N5l67K91k9j95L0L31l55J68M10o86J51J57L5k31K3Q4J86l61J35K24k06
3715d0K32l97M33k58j12J60k06J56P8K6N2l1r4qj07K77l52J53k00K59J78r6l5
3738F8J11q5J9j67M0k2k35K45k1L3j7o9n8QjJ77l28M37j50J57q9l10K10j44J8
3763a73R8J6j9r6J01K14M8L3k96J9J32J66k71K35k40j41M16m40L35j99j6K71j74
$$ plain form
3599 -99 84 -355 -142 -246 -19 78 6 -41 -12 118 -162 -17 2 -35 76 141 -132 0 -203 -201 9 57 150 405
3623 405 214 210 -23 104 -24 280 216 5 44 136 125 93 34 17 -5 256 -206 116 -137 -101 3 -371 -312 73
3647 73 158 -185 -22 44 82 -207 349 -124 -117 65 154 -16 -28 -232 72 259 -413 35 -28 -226 144 13 -146
3670 -146 74 121 128 -124 48 193 -282 -33 -44 -70 -152 159 -16 180 13 -152 5 51 -54 -33 283 54 110
3693 110 165 -202 89 60 -135 -105 226 -129 39 449 -237 -86 71 106 -125 -102 -18 168 -193 -58 166 -40
3715 -40 192 -205 228 -30 -142 18 -188 -32 46 72 124 93 -1 -9 -116 161 -191 -38 -238 21 199 103 68
3738 68 179 94 113 -54 -14 -36 -271 -26 -47 -14 -31 -100 -158 -150 -151 26 -302 135 -15 142 53 -257 -47 -191 -173
3763 -173 -75 -59 -78 -174 -73 141 189 222 -74 -55 77 243 -28 207 -33 -174 242 -198 137 -62 -78 193 19
3786A9j29P2q9j5K87L9Q2o2k36P9J06j8k88J04J5o3m7Q2L18r3O8m51K01R5j09
3811c3J87k41K26J40l18r9M74j82j22J75k5J15k87l0J44q2J84J45m88J27p3n1
3833a14j46q2J08K48O9N4j53J29l81L29k03J4K43j00m3O3qk30J63k40N10o7m37
3856b74Q6K52L2O7l92J15L15m51J17K51j81j63K74r0K7J5K8k61J99qL8Rk44M59
3880B20l71J37j64M08j93J10k69J89L3L4J9j75P4k45J98J28k37L2Q3R9J42k00
3902E2n9J73j43n8l9k8R2J72j36n6Q6J18l67J49m7K54k5j76M8o6J53O5m50M64
3926A76k31L5k5P1P9J9kj43j86L25k51K85k60j04J89o5j69J06J63j01J09K57j78
3949I9m7k4j5k45J87k69L42k02Q6K54k63J68K9K4j21j63M72k87N8K30l87J25Q4
$$ plain form
3786 19 -110 -38 -127 -142 145 184 266 204 -32 47 153 135 -153 -49 -34 -97 -144 -62 256 163 231 -220 -19 76 -33
3811 -33 154 -87 139 279 -39 -138 336 154 32 207 182 297 10 -20 124 42 226 371 -117 10 -63 -114
3833 -114 -260 -342 -234 14 83 137 -16 113 -268 61 -142 -128 115 15 -28 35 27 -203 -40 -280 230 163 -274
3856 -274 -188 64 96 163 -229 -114 201 -250 -133 118 -63 -226 48 -42 -15 0 28 -233 -34 -42 -4 5 -239 220
3880 220 -151 -14 -178 230 37 147 -122 67 100 134 153 -22 52 -193 5 133 -104 -72 11 110 252 52
3902 52 -7 166 23 -35 -74 -102 -10 162 26 -30 56 174 -193 -44 -91 163 138 -38 10 -56 97 162 -288 176
3926 176 -55 -20 -45 26 105 124 122 -21 -207 118 -133 152 -108 -212 -23 -88 -257 -151 12 -89 20 277 99
3949 99 52 28 13 -232 -45 -314 28 -174 -88 166 -97 71 100 124 3 -160 312 25 83 313 -74 51 135
3972A35j50J40m2j58Lk85L95j63N9J27j18J06j03J46j6j39J17m5m9p3K40k56L7
3995i2M7k31J09J63k46J16P8k76J16K22J37j70J07k21K66l15J87On9K55k86J97
4017A10P1j95KJ7l4k5Q4n8J3J04k51o8L54l32J43j27J35JJ09j74R9K77k97K26
4041A84l56L89k32n1J57p8J5q5O1k02K87J4l5j27R2L2k38K81k2m58L17L43m23
4064a35Q7L0j5k0J76k27Q0R6o5Q1M0k59L58j18J24k39j45L7M6J19k5M4P9o2j39
4089e2q3J97P6k10J3n8L29j96J99M7l12J42k1j0k70K37Lj63M55m69J80j05m4J24
4113IJ88j31Q5j31J67l83K92l6j84L51l09J72J2k26K19k80J05P8J98k25J21j52
4135f0K44l37J89R7l89M09p6P8k96K60m2n0j15j82L62M7j90J07q7L10Qk40k29
$$ plain form
3972 135 -15 125 83 -75 -72 -357 38 -125 -66 61 -57 49 -54 92 76 -63 54 9 -40 -113 127 -129 -92
3995 -92 -45 -276 -167 -4 -250 -134 -56 -332 -216 6 143 -27 80 -141 125 -190 -3 3 -56 199 -87 110
4017 110 181 -14 -12 5 -29 -54 30 -28 -15 89 -162 -230 124 -208 -65 -192 -57 -56 53 -121 -22 255 -42 184
4041 184 -172 217 -15 -66 91 13 28 -57 4 -198 89 103 68 -59 33 65 -173 108 86 -372 -55 288 -135
4064 -135 -48 -18 -33 -53 123 -104 -24 72 7 88 128 -131 227 109 233 -6 -151 -114 -68 51 26 70 149 87 -52
4089 -52 -135 62 138 -72 -59 -117 212 16 215 262 -50 92 71 61 -209 28 31 -132 323 -146 34 -71 -115 9
4113 9 197 66 151 20 187 -196 96 60 -124 227 -82 90 102 -124 95 -185 -80 -2 196 -29 92 -60
4135 -60 184 -153 36 133 -256 153 77 155 -141 119 77 27 -88 -270 92 139 -51 56 -31 279 287 47 -182
4158a82k28K67J70j08K8qL2j32J18N6R6l6j09Q9l0lk14Q6J8J25Q8p4j45k2L59
4183B41l26o1J58j04P3j82L35k30J06L5N0j29K12J4j00j57M0k6p1J41n5K31q9
4206A06j16k4J92p0j28N8k80N39k38k8J0N1p0K07j15j33j2k61M63j71j29J11N1
4229A3Mj89K07j15l4j14J85J13j17J00k31K6q0L20o0m2L5K9o9J4P3j49J15L4j20
4254e2K31k17j00j9j31K41O1R5l93K39K55k51K3J93j67j44J56n3j85J53P5k30
4276b20K05K07J20l41O6q7k35L67p6nK58k77J63j34L2PM0p4K04m00K17j1j21l2
4300a27K29j25J3l2J93m45J57L09k36j3K1l5k85M38l8k1P3l61M11n0k7k31M9N6
4324g7j08K85j84J3o7l0M4K96k81K22l04J99L35l51J0r5o0j69L24M5J9k48L81
$$ plain form
4158 -182 -410 -143 27 -81 -53 -61 -29 -161 -43 13 109 73 -36 53 23 20 -194 -108 -90 35 123 49 -96 -118 241
4183 241 -85 -146 12 -92 -19 -201 134 -96 10 45 95 -34 178 192 92 -65 -25 -51 -122 19 -36 195 106
4206 106 -10 -34 158 88 -40 18 -262 277 39 11 21 72 2 209 94 -39 -51 -312 151 -20 -149 -38 13
4229 13 17 -172 35 -80 -114 -228 -43 70 -47 53 -178 -152 -232 88 28 -14 21 50 -19 -5 68 -81 34 68 -52
4254 -52 179 -38 -138 -157 -288 -47 14 109 -284 -45 210 -41 -18 175 8 -136 20 -33 -218 -65 10 -220
4276 -220 -15 192 312 -29 37 -50 -285 82 6 1 259 -18 145 11 43 50 90 16 220 -180 37 26 -95 -127
4300 -127 102 -23 -10 -42 151 -294 -137 172 -64 -77 -56 -91 -376 62 24 3 76 -285 126 76 49 -182 -133 -77
4324 -77 -185 100 -84 -71 -138 -168 -124 172 -109 113 -191 8 343 -8 2 -93 -153 -322 2 47 66 -182 199
4347A99j25k10R9j2k6l8J75j95Q3J92kk64K26j41k01M08K8j78n1P1j27K29k3l77
4371b60P3L29j98P8R8k61J53k20O1%N0N6k00L43j26j75J96j61K55j3j21K27n10
4394c26J16J59Q9rr3J75Q0r8k46k4K05l18K27n7K9LP5J24j56n9L2K42k09j14j10
4419b63K44J73k96K18j10K67k86k82J45J05j4m9J51J56K6k42M34k56k66K32J29
4440B16J21m08r5J62j21r0J32J7j91L79l06K27k08P4Pn4J51J23K8l54K62n7J84
4463A99j02k03J84j27L09n21L55j97J97l9N2M7m37K09L63o3j69j44j00K41j53
4484i9J07o1J80l4k4j61RJ93l80L77k47K43j14K71k74K53j21j85j9O9J36j11L15
4507C23m88K20L3lk1J39r5j44K31l22Q7L4m1m5K32j88K57j53j2K2j5j44M6R1k25
$$ plain form
4347 199 74 -136 -37 -49 -75 -113 62 -133 -50 142 140 -124 102 -39 -240 168 196 18 -33 38 -89 140 117 -260
4371 -260 -187 142 -56 22 120 -141 12 -208 -147 -147 -97 -41 -241 102 -24 -199 -3 -164 91 78 -43 184 -326
4394 -326 -210 -51 38 29 -64 111 191 93 -153 -177 28 -290 -63 -120 -91 -88 -13 111 -45 -104 -72 170 -39 -153 -263
4419 -263 -19 154 -142 76 -34 233 -53 -335 -190 -85 -99 -148 3 159 185 -57 377 121 -145 87 216
4440 216 337 -71 -166 -4 -125 -215 -83 -66 -257 122 -184 43 -165 -91 -84 -138 13 136 164 -190 72 15 199
4463 199 97 -106 78 -49 260 -261 94 -103 94 55 107 154 -283 -74 289 226 57 -87 -187 54 -99
4484 -99 8 -53 127 93 69 -92 -83 110 -270 107 -140 103 -11 260 -14 239 118 -67 -86 -17 119 8 323
4507 323 -165 55 88 85 64 203 108 -36 195 -127 -40 -6 -47 -92 140 -48 209 56 44 66 51 -93 -47 44 -181
4532a81J57k5j00K45o3rj14J70k87M9K24l04J38M9o6J78m2j04m2q0L0M05j88j62
4556a22J71q4j26K08r2PL26k69J79l15K53j76k0N6L90j22j49k29J67l5j5J06j28
4579a9l1j26K97j57p6P7R2J26k22J78j52J64l31l6J93K85j91q9j00j98N72m27
4601a71P1J03M8j11J34j8k02J2J67k8j77K12j13L75l67R9R1k93K68q3K0n0j16
4624a29J47j29L81j15j58j5j58M0J70j23J45N2Qj63k02K24J76l47K20k2QN8n3
4647A5lJ62j61L22l22j1nL6Q3r5l1J8J10n03J63J44K1J92o3k43K99j61J4M2J02
4672A25n5k71J86q6K08k91J62K16j31j40N6l6j72K53j80K10j66L05o5k64L31m94
4694b99N23q8k33N2O1Kk24J35j97L84j88K02K8l29M3O2q4J34M4j52M39m21M37
$$ plain form
4532 -181 -24 -49 -149 96 33 24 -90 80 -207 -158 66 -238 -100 -51 -117 61 19 -85 -127 -207 -177 228 40 -122
4556 -122 49 -35 -161 47 -45 -38 288 19 198 -117 136 -40 -60 -4 386 264 115 -114 53 18 3 109 -19
4579 -19 -50 -176 121 -36 -112 -35 57 183 -39 139 -13 151 -180 -216 -23 262 71 -18 -118 -316 256 -171
4601 -171 -100 3 51 -60 74 56 -146 -134 33 5 -172 40 -73 302 -65 34 125 -168 100 17 37 -13 -129
4624 -129 18 -111 270 155 -3 -18 -176 -136 34 -89 56 108 116 -47 -249 -25 151 -196 24 2 10 68 15
4647 15 12 174 13 335 13 2 -3 33 116 21 -10 8 118 -385 -222 -78 -57 135 72 -171 128 -33 -19 23 125
4672 125 70 -201 -15 -101 107 -184 -22 194 63 -77 -21 -57 -229 24 -156 54 -112 193 128 -136 195 -299
4694 -299 224 136 -97 -45 16 18 -206 -71 -268 116 -72 130 158 -171 -128 -66 -150 -16 28 -124 315 -106 331
4717C31m56N6R6Q4k4j64M7J49j19j43n4J02J44j33j4J47J3J39l02j12K08L33j90
4740A38Q1j19l8p2RJ1J04k32O6R1j0j86J72O3J28J01k61N2j57K70j27k17J80k37
4764a90O1J37j25K38l87K61k37o5O30j33k05J71l79L44j15L9j4J5k9K1j4L1k11
4787a56K99J4l45M3K73j09j77K13k01J77J85k97j27L83j9J1k11K78o04M15n8K18
4809B05k83J2k54M38k69K26P7l31L47k48K49j43K36k09M9k68r2J54J81J09j78
4830Hj1j5j09J16k20K59l00L29J80m17L62j38j78L21j04L2j40N8n5J40q5J11m9
4853I5J87m55m2K50r6J97K5j23k90L58l8N3rj97J69J47l51O4K70M1k01l17J80
4876h3K04j99q7J57j06N6J44l6n4l5J43k27K82k2k20k3k4j12J78L9OJ14j74J21
$$ plain form
4717 331 -125 -69 27 111 87 -77 -30 119 0 -143 -197 -95 49 -84 -98 49 62 201 -101 -213 -5 328 138
4740 138 219 100 62 -10 -1 10 114 -118 -52 39 29 -157 15 78 206 307 46 98 -59 211 84 -133 47 -190
4764 -190 -129 8 -117 121 -266 -5 -242 -307 323 190 -15 156 -223 121 6 45 31 46 17 38 24 55 -156
4787 -156 143 157 -188 -145 128 19 -158 55 -146 31 216 -81 -208 175 156 167 -44 234 -370 45 -13 205
4809 205 -78 -66 -320 118 -151 75 152 -179 168 -80 169 26 262 53 102 -166 -258 -104 77 186 8
4830 8 -3 -18 -127 -11 -231 28 -272 57 237 -180 182 44 -134 187 83 115 -25 33 -22 118 33 144 95
4853 95 282 -173 -215 35 -61 136 161 38 -252 106 68 121 112 -85 84 231 -120 -56 214 255 54 -263 -83
4876 -83 121 -78 -165 -8 -114 -58 86 50 -4 -39 104 -123 159 137 -83 -106 -130 -242 -64 -25 -19 95 -79 42
4900D2p7j60L54j75L43N9l40n9j70R4r0J34Q8o9j83K61J7j17K25j26K01k68J8
4923BJ2j93j8L70k50J10j03J3Q2J7J45k18r5O1K03r7k35N2R9J77n1j69Q8J52j62
4948hP4l3J5j40K47l27J88K8j31k1K60J38k55k4J98j17n1P1J30j19k67L44l88
4971a88K10J15n0j98L95l53l9K80l81M06q5k34P0j3P5J48J03l39J93J25j82l43
4993b85M91m5o7J58Nj23r8k04Q6j19L08j62J04k03L04L4l14J35m2N9j16K77j77
5016Fj93K46l8j57l1K96j17L42j88n6j22j61J1k3L09l9N2j56j68N22l99O7j71
5039a68K63j97m2N2J88N9j33k23J9J12J07J93k1k68K17l11J30k40L70P0k84K38
5061A31j96m2K03n6R9O5k28l9r7J83k70L66j12k35K05o3M05k21j09k6P2k20J52
$$ plain form
4900 42 -35 -195 159 -16 327 386 46 -13 -183 -89 -179 -45 43 -26 -209 52 69 -48 177 51 252 -16 2
4923 2 14 -179 -197 173 -77 33 -70 -57 25 42 187 -31 -126 -65 138 41 -194 -142 -43 134 83 -86 2 154 -8
4948 -8 66 33 48 -92 155 -172 16 44 -87 -108 152 290 35 11 209 92 41 112 242 123 -144 200 -188
4971 -188 22 137 87 -111 284 -69 -108 172 -209 197 112 -122 -52 -65 10 158 261 -78 115 240 58 -285
4993 -285 206 161 94 252 257 134 36 -168 -82 -201 107 -55 49 -154 150 184 -130 5 -37 22 -94 183 6
5016 6 -187 59 21 -136 -167 129 12 354 166 110 -12 -173 -162 -185 124 85 137 -19 -187 335 -64 3 -168
5039 -168 95 -102 -144 -92 96 155 22 -201 -182 -70 37 230 209 -59 158 -153 -23 -263 107 177 -107 131
5061 131 -65 -107 96 40 139 204 -24 -63 -160 23 -247 119 7 -228 -23 -86 319 98 -11 -37 35 -185 -33
5084c3q3J44J24k48J26j08J61R7k91K2K95k47J14p9M5j47p6J77L05n62J65J35
5106C6J7J98k75Q9j31j92K50j06K06J17l31q0K26k11K42j12M3j47L37p1j11JJ80
5129A75j79n3k6NJ6K01k5m0j23K5L58r5k95j87L36k26K32m1j12Q5R5l20L05K9
5153A40r3M4o7R8J8N1r7J32k98J22J53k90k17M92l20M0j15M76l53L14k45n9J26
5176E2M37k08n19L32r9j31P2J60n5J64M9m35J35J30Q6r8j50J9K53j28k61K51j03
5199d7O4J10j02j11J89j70K28k31J7j0o9P2J65O0k32J46j64J7K07l48L52m0m13
5222c10N07k75J77l4k15J93l36k1Q7L43k30m3L1L7K9r4J72j54J97n6K11j63l12
5245b59N0l9M07L6k8l71K96p9J5K1M2j63J18k20J28R7jL02l10r9j31J79J30k68
$$ plain form
5084 -33 -116 28 152 -96 30 -78 83 180 -111 -89 206 -41 73 -6 39 -108 -184 -7 298 -264 -99 36
5106 36 53 251 -24 65 -66 -258 -8 -114 92 209 -122 -202 24 -187 55 -57 -14 -161 176 105 -6 -5 175
5129 175 -4 -57 -83 -78 -62 139 114 74 -49 -24 334 239 -56 -243 93 -133 99 58 -54 31 126 -194 111 140
5153 140 47 91 24 122 140 191 94 226 -72 50 203 -87 -304 188 -132 -92 -207 269 -84 230 -15 -74 52
5176 52 489 281 -238 94 -5 -136 -64 96 41 205 254 -181 -46 84 170 72 -78 -59 194 66 -195 56 -47
5199 -47 17 127 25 -86 103 -67 161 -70 -53 -63 -132 -60 105 165 -67 79 -85 -68 139 -209 143 103 -310
5222 -310 197 -78 99 65 -150 43 -293 -314 -227 116 -114 -157 -126 -89 -60 -154 18 -136 61 5 216 53 -259
5245 -259 -209 -248 159 195 167 -204 92 13 28 49 91 -72 46 -174 -46 51 50 352 42 -57 -188 -9 121 -147
5269a47J80j82J15K6R1j04R8j27J96j00j25J07l88L58O5j62J57k3L6k61K72l1
5291E1m83N07k7L5l8j36J22j00j05l7J13L33l67n0l2J95k66K95J51k30J43jj74
5314a01R3j0P5m3L2P5o0n3j05J65l90J98J41k46K00R0k39Q0%o6N2k5M3k9M9L03
5340B29m45J13M2j46K66j68N3q8R7k0J37J14k70K19k71K57m2k55K3O2o1L27j68
5363Ej81J91j95L77m2O4l78Q4J51j32nr9J12K88j49l5J59l23q0K17k54Q1J16p3
5387a01L4k12L2L69p8J14k33J18L7O5r0j33L1k9J15k7J39l87jq8O15l65O2m0p7
5412a30P2k97L36k32K21j57K24o6N1L43k87O1k15J52r4K56m03p4J07M9L9j84L91
5435A63j86m6pL28l50o6J12L70k23P4k63K6K8OQM6J08q8j66K04Qp3j23N0L15j93
$$ plain form
5269 -147 33 -149 -34 -8 83 -21 77 -50 146 46 -79 28 -360 -2 63 -99 58 35 71 -190 82 51
5291 51 -432 75 48 83 45 -91 31 -69 -174 -211 -98 235 -132 -182 -214 -19 -285 10 161 -69 74 73 -101
5314 -101 -8 -18 57 14 46 121 61 8 -97 68 -322 -124 17 -229 -29 61 -178 -98 -98 -164 -112 -137 -94 -123 -74 229
5340 229 -216 -103 -61 -207 59 -109 -56 -144 -47 -67 70 184 -86 133 -138 119 77 -178 -155 -93 -154 173 5
5363 5 -176 15 -180 197 155 219 -159 -75 76 -56 -61 -160 -48 240 91 56 215 -108 -188 29 -225 -144 -28 -101
5387 -101 -67 -279 -247 122 44 158 -75 43 80 145 55 -78 -47 -76 39 12 151 -236 -237 -325 290 -75 -13 -53 -130
5412 -130 -58 -355 -19 -251 -30 -187 37 -29 22 365 78 139 -76 76 -18 238 -165 -239 -132 -83 -44 -228 163
5435 163 -23 -69 -76 252 -98 -164 -52 318 95 169 -94 -68 -40 -34 -26 20 128 40 -126 78 86 13 -110 -60 255 62
5461F2N3k73J93R3j64l11M19m6n0K41n1m24k2L46p0J05j3p4j9j12j84K52K4J83
5485A58k60K38k12Q8J33m08K30O5J15q4j8J56j05m9k31J46n4N8j86J56L8n7j57
5508b40J87j48N18k21k10lJ59P8J33k71k09K58j41J57o3J22J38m47J38K98k51
5529a8L29l27M1l16K73N9k54J37J34Kk5J11k42K6K0M2J37j15l65K82M6O6j04J94
5553A33l58J78J70k38M2MJ7J62l9J30r5L3k94K24j83j9K53J45k81j7J6L23k78
5576B8o4n2J28k25K82k27K44l19J71Q7N3k07j12J45K14j71n0J27K7j48k8j51P7
5599a71J60j51L53j66J24m59J11KJ95J32k0p3K6j47J87j90K49mj49O8k43L32M2
5622B08j59oq3q7L31q7k59L23m0k11R3K0L8%o9pK1J3J46j44o9J5qn7j4k36L6K5
$$ plain form
5461 62 115 -158 35 128 -36 -347 72 26 -24 217 166 -258 -280 66 -4 101 88 14 -5 -117 -301 -49 -25 158
5485 158 -102 136 -76 12 145 -263 -33 32 147 63 45 201 96 47 -184 -38 -92 -34 -220 -64 -26 -83 -240
5508 -240 -53 -201 317 96 -114 -117 42 120 253 -18 -227 31 -110 47 -16 106 244 -203 -65 233 -18
5529 -18 311 -16 25 -291 -18 41 -213 -76 58 60 35 146 -96 -70 -50 -8 129 14 -351 -69 -23 43 -61 133
5553 133 -225 -47 123 -115 -73 -69 -52 110 71 201 106 139 -155 69 -114 -133 120 265 -16 -33 -17 306 28
5576 28 -36 -88 40 -185 97 -130 114 -205 -34 53 106 -101 -213 -68 146 -25 -75 52 79 -69 -97 -248 -171
5599 -171 -11 -162 191 25 149 -310 -199 -197 -2 130 110 37 63 -84 103 -87 162 158 9 77 -166 166 208
5622 208 49 43 -40 -127 204 117 -142 181 141 -70 23 43 81 81 12 5 26 39 185 41 -28 -13 -21 -78 -92 -328 -292 -267
5650b67K73Q8j59J65j35j02M8j37K86J19o0j89m8R6o6J60O6n5l04R3lK51j8l24
5674b22L01j3k15K66l1n1K13j30l08L77l00N1o4q5N79k91p1j3o0rJR7j38M09l63
5699g0n5N0j12K49l23K15j34J82j1k1K31k86J2J40R3N1P5l19J01j13L26j88PK1
5723A21J3l67J57P6J41K36l71n6J22o7J28j72l39K62o9J62J54j9j59q1R9j64K63
5746G0j88J69j59j3O2j9L10k24JJ40n91M91N6k90J56K21l16m4J16J38p2l6J29
5769A07p8M5k53K08Pj29K14n06M49j21J29j00N4r1J61m3Q1J8k39L0J40j32P5p7
5793e1R2J8j0J40j78R9l22L52n1J23k7l8r7q0q2M09j96k44n5K26J68j39k68K33
5817B2q6J5l3n7M4J53k5J10l10K32k05J60Nk7q0j0K26o4k24LL35k95pP9k8j07
$$ plain form
5650 -267 6 94 -65 100 -35 -137 -89 -226 60 179 119 -70 -118 -22 -88 72 138 83 -221 -128 -131 120 102 -222
5674 -222 79 66 -149 117 86 35 248 118 -190 187 -113 -62 -126 -211 368 77 6 -7 -67 -76 -75 22 -116 293 -70
5699 -70 -125 -75 -187 62 -261 -46 -180 2 -9 -30 201 -85 -73 67 160 211 286 -33 68 -45 281 93 100 121
5723 121 134 -233 -76 0 141 377 6 -50 72 5 133 -39 -378 -116 -185 -23 131 112 -47 -128 -29 -193 70
5746 70 -118 51 -108 -121 -59 -78 232 8 9 149 -442 49 105 -185 -29 192 -124 -168 -52 86 14 -22 107
5769 107 29 74 -179 29 36 -93 121 -385 64 -57 72 -28 26 -65 96 53 134 152 -87 -57 83 -49 26 -51
5793 -51 41 59 49 189 11 110 -212 140 89 212 185 147 50 -30 -112 297 101 -143 -198 28 196 57 -211 22
5817 22 -64 -49 -82 -139 -95 58 33 143 -167 65 -140 20 25 -2 -82 -92 134 70 -154 -151 184 -111 -118 -39 -67 -174
5843a74K41j67k5M9K63r2j66r6M18j79m1K4L7j19N4j05M4r0k0Q5J83l66J40J58
5867E6j0k20L30O2p9p7K6j87K69k1k44M60p22M29j24o4p4P6J81j53K30k56L37
5890B25n5j63k32L14M6p0k10K27k50K6P6K4N8J11j62K09l3j58J30l03K92k25m3
5913a66oL85k3l11K72k9Kj93l45L63k3J52J14k91L40k25m2J2Q0j24l0n2K2K4l12
5938d06J83K92J64k71J17k61L43k54J16lj98L68q3k57J47j22j18J47m2J20j0j59
5960a87K92pj13J26p1j82K33j19J33j74j3J26j67r9K72RRO1j61q4j17K35J51p0
5984H3K8j30p0J72q4k01J71J8N7K91m21j66K60J70l33J38m0K24j09R6k06m8K60
6007A60l13J69J35J04q1j97R8m7M6p2J38k48M03j10j83o2L3J63k17K03m2j36j21
$$ plain form
5843 -174 67 -100 -125 -76 187 95 -71 -167 251 72 31 55 92 -27 27 -78 -34 -124 -144 -59 124 -242 -102 56
5867 56 46 -174 156 218 139 62 88 -99 170 149 -95 365 -357 72 -52 -116 -190 -114 67 -86 144 -112 225
5890 225 170 7 -225 89 135 65 -145 82 -168 -142 -66 -42 16 127 -35 174 141 -17 113 -190 102 -123 -166
5913 -166 -172 213 190 -121 151 122 124 -69 -414 -51 -74 78 192 -99 241 16 -26 -14 66 -58 -88 -140 -118 -94 -406
5938 -406 -223 69 233 -38 79 -182 161 -93 23 20 -178 190 107 -150 -3 -125 -243 -96 -138 -18 -28 -187
5960 -187 105 98 -15 111 40 -142 91 -28 105 -69 -82 44 -123 -222 50 59 68 129 -32 -116 -233 2 153 83
5984 83 111 -19 -89 83 -1 -202 -31 -13 44 335 -86 -252 8 178 -155 -17 -57 167 58 154 -52 -100 160
6007 160 -153 16 151 255 174 -23 75 28 74 2 140 -108 295 185 2 -60 -27 136 -81 122 80 -56 -177
6030a77M04k73n1P4j50Q3K6%j2K29k32J5J18j00J33k4j23m0J07j61J40R9j30J40
6054I5J07j70l9Q5J63L3k31j37L85l51Q5j59N6J16j73K50j7k33K21QR9k87N5J58
6078A19J58j64j10R4k12j42K07Q0J91n14J30L15l26O5L54r2p5j6j27N2p4K98l84
6101a73J58P6j85K16j28J32J14l82J29l6Q1O7k27J71K91k28j43j35L96k69Q6J9
6123C0j53J72k07J19K15j20k99J09J60p6j18K77J50k9l46K4J72J00j84k08L32
6144A20l23K70n0k3J39r8KK47l82K20k28K24j45J65m07J52p8K94k68J49j52J02
6166g0L7p6L3m8J82l56M52l32K07r6O1m7J08Q7j92l5J64J13j8j04p2j12p9J57
6190c6N4p5j50j02M10j13K8J10j97J87O2k99L15k41J51J53j01j08JJ31k51K10
$$ plain form
6030 -177 227 -46 -97 -23 -173 -90 -64 -64 -76 153 -79 -64 54 -46 87 63 -60 -100 7 -154 -14 85 -45 95
6054 95 202 32 -7 78 241 274 43 -94 291 -60 25 -134 -78 38 -135 115 98 -135 86 94 193 -94 -39 119
6078 119 277 113 3 97 -115 -257 -50 30 221 -293 -163 152 -174 -109 245 153 78 62 -65 -13 -87 211 -173
6101 -173 -15 61 -124 92 -36 96 210 -172 -43 -79 2 69 -158 13 304 76 -67 -202 194 -75 11 30
6123 30 -123 49 -158 -39 176 56 -243 -134 26 -50 -168 109 259 230 -116 -92 80 180 -4 -212 120
6144 120 -203 67 17 -6 133 35 37 284 -98 122 -106 118 -27 138 -269 -117 -195 99 -169 -20 -172 -70
6166 -70 -33 -109 -76 -124 58 -298 154 -178 29 -67 -6 -53 55 142 -50 -85 79 192 174 70 -2 -114 -193 -36
6190 -36 18 -57 -207 -309 101 -12 16 126 -71 116 178 -121 194 -47 104 257 156 48 49 180 -71 139
6212A39k56J4l6J11j57J34J74k1o8K26j83k6K76m38N8K8j02K8L41k61r8K8J75
6235H6J7m9k34j0P56l94j89P5J27k58J02K08k58J69j01p1p0K76k99J32K37J7j
6258B68m66K87j08J73k27J08K11o0k05J29n8n7J29K4q5J22j24j92M0Q9k03J86
6280a9R0l30L59k42Q2m4j20J44L2M6p3J27j34j59L56k11j11J97k5j03K16n0r0
6303f2L7J35J0j97K6K5k08L13m2k8J50m8k81J51J07n9l2m43L21J16R5mj49R9K0
6328E2r2j96L01J78k50j34L1QK22R7l53J59l9J12O2R8k52K23o1m07M19k37K35
6351A76j69J68m00M04k43J48o2J27l6o6j82P6Mj50N1J19o6J8K77p9k46m0L64j31
6375F2M1o4j13j03M63k35L5k01L02k93Q7L0o4K81j84j73K76k4j84K00k22J67j46
$$ plain form
6212 139 -117 -103 -139 -28 -185 -51 123 102 34 260 77 51 327 -111 -53 -25 -127 -99 242 -19 -117 -89 86
6235 86 103 54 -180 -190 566 172 -17 58 185 -73 29 237 -21 148 47 -24 -94 182 -117 15 252 269 268
6258 268 -198 89 -19 154 -73 35 246 186 -19 110 52 -5 124 148 63 185 61 -131 -91 -2 -205 -19
6280 -19 71 -259 100 -142 -60 -104 -224 -80 -48 -2 -75 52 -82 -241 115 -96 -207 -10 -35 -138 78 28 -62
6303 -62 -25 110 120 -77 -51 -26 -234 79 37 9 159 111 -170 -19 88 29 -3 -446 -125 -9 86 82 -67 32 52
6328 52 -40 -236 65 243 -7 -141 -110 -102 120 217 -136 23 -16 96 158 256 4 227 166 -241 178 -59 176
6351 176 7 175 -225 179 -64 84 22 149 113 47 -135 -59 -55 -205 -154 -35 -101 -83 194 115 -131 -171 193 62
6375 62 103 39 -74 -177 286 51 86 -115 187 -106 -19 11 -53 228 44 -129 147 123 -61 139 -83 84 -62
6398f2r9J6L49l06J84j53L05n01L04L8j01J28j49P9K4k27K58O5n2k61K8J87Pj57
6422i6r8M0k36K56O5J53J9j27J07l7j20q7J60o9K6J8J14O6p6N5M8j1p1p9l7m0
6448e7j58K02R9n5R8o1j08J33l7m20L39R1nr8N1j93oJ18O8L3ON9q7L3q2j82K25
6475FJ2j13J91j14L0p7L24n5k90rJ5M2J28n0k4K3j64Q6J89k95P6L6J92j87p6J45
6501D1k80J02R4P4M7l30J23K07j00O6r1j5J99j98K66j65j0Nj53q5J95L0R0j44
6525c2J8K54k82K64j53N8k22J61j04K21j51J52k19l2L00k2j79P1k11nj8K34j18
6548a5n5Q9J34k07N8k09K60O2j69Q0p4L38n86L23K02j21p0J32l26L51k07k72K46
6571c6J90k19K53k25r3j0K39J70l91L3J80k64J38j9J31j28L32l78j74K51j68j18
$$ plain form
6398 -62 -161 -145 204 -102 82 -71 234 -267 37 75 -26 102 -47 32 56 -171 87 152 100 -161 -133 54 61 -96
6422 -96 -194 -154 -390 -134 -69 84 103 -24 83 46 -74 -161 -1 -70 -44 -26 88 154 78 133 181 170 99 20 -17 -57
6448 -57 -215 -13 86 31 129 68 -40 93 56 -364 -25 66 61 -37 14 -179 -185 -67 1 34 40 99 12 45 -37 -219 6
6475 6 18 -95 96 -18 12 -65 259 204 -86 -95 -80 -38 90 40 16 39 -125 -39 150 -145 -69 -33 159 -28 -104 41
6501 41 -239 -137 -43 31 78 -252 -129 78 -22 44 -47 -62 137 -61 205 40 30 35 -118 -203 -8 22 112 -32
6525 -32 -14 240 -42 222 69 127 -95 66 -38 183 32 184 -35 -67 233 211 32 103 -108 -113 -131 103 -15
6548 -15 -70 19 153 -54 4 -205 55 117 -52 28 -46 292 -294 29 231 110 40 172 -154 197 -10 -282 -36
6571 -36 154 -65 188 -37 -130 -140 99 269 -122 -89 91 -173 -35 -54 77 -51 281 -97 -271 -20 -188 -306
6593c06L52J45l86K41q8j6K40o50N43N4k83J64P8j96q1J57K0K7m8P9M5l49L15
6616E7J71k18O8j62J40j12j43L31L7k75L23j52J5j64J12j94P4K55k60J11O6j59
6638g9L25k51p2J61j36k42K17p2J46M3M0k79N2J61l5O4j07K8L7k0Rm2M1N1m4J38
6664A34j91J27q7j07R6P8j52j18L46Jj4k27o2K8K49j30J70j83J00J8L4O8k55n3
6688a30J43J02J22k71R5k7R2j73O9L2J3j00j20J8j56J54P0r9M6L8j6K09l3J16
6712A94l63K19l06J46R0Jk86N90m33j7M42j54j38j05L56j98k92k3L34P9J99m56
6734a21J07J47j46j1J07r7n2P0j89J85k7J53r2r6o5Ll9J53J14q0j11k5J72k24
6758a64K62k83K02KM4K2kj06k52J22K84j21l0J52r1J5qr8J02j22L13j58k00J7
$$ plain form
6593 -306 46 191 -195 46 -42 -58 182 -468 75 129 -154 10 88 -108 -189 -32 -12 15 -33 46 91 -258 57
6616 57 228 10 78 -84 56 -56 -199 132 169 -106 217 65 80 -84 28 -166 -92 163 -97 14 80 -79
6638 -79 246 -5 -77 84 -52 -294 -77 -149 -3 40 80 -199 -147 14 -21 43 -64 -36 1 -19 -10 -52 -11 40 -4 134
6664 134 -57 70 -17 -124 -28 50 -102 -220 126 127 113 -114 -176 -148 101 -29 141 -42 58 76 110 178 -77 -130
6688 -130 13 115 237 -34 61 34 126 -47 22 54 67 -33 -153 -135 -291 -137 -67 -166 -120 -82 -98 111 78 194
6712 194 -169 50 -256 -110 -20 -19 -305 285 -148 -165 277 123 -15 -120 236 38 -254 -277 57 136 335 -121
6734 -121 -14 133 -13 -24 83 -14 -66 4 -185 0 -27 126 34 -62 -127 -124 -163 -10 104 24 -87 -112 60 -164
6758 -164 98 -185 17 19 63 85 83 -23 -275 -153 131 10 -20 132 41 56 48 -50 52 -70 243 85 -115 -98
6782i8j27J13L90j87r0O6R1j75O5k23K37J36l12L52k67J62R4j85k89L39j5J61
6804B38j87Mj15O8R8l04L05j12L65l23j57l8J3L69k78j25P1kJ44q6L6q8J02K31
6828B29k24j6L1J22j82j2K55l24J16j0Ro8J56k36K8M07j90j1j20L8j14K35L0j16
6852C3l40K24J7m9K9q6K63j13N4j49p9K56j00O7n5k29L51m2N5qj51J20p4J22r9
6877A7NK61l62O0J32j90K8n3j71R1Q1L66j27k5L1L8k29K21j00O6j22o2J51J41
6901B48j86q6j15%O2j59N5L99l00j60J29Q7j3j8K12J55k1l37J02o8R1O7j53j26
6925a35j0Q7k6J71k1j64N4Q1j69J50J2j98K42j4m68J66L55Nj77r5M28j31l33Q7
6949a03m7J01j04J3J07%j01L00k63J82M3J10m27K02J59n3l64K70L1j36L68k93
$$ plain form
6782 -98 -225 -112 278 91 1 67 158 -17 48 -175 62 198 -114 238 -29 133 227 42 -247 92 77 238
6804 238 51 55 -60 8 106 -198 107 -5 360 37 -120 -158 -145 224 -54 -179 -108 -110 34 -52 -16 -104 -2 229
6828 229 5 -11 20 142 -40 -52 203 -121 -5 -15 -6 -74 82 -154 -126 281 91 80 -40 -2 -116 119 149 33
6852 33 -307 -83 -66 -115 -86 -172 91 -22 32 -117 -196 60 -40 27 -28 -257 94 52 107 99 -52 68 -6 116 17
6877 17 22 283 -79 -19 113 -77 -49 -102 -273 -182 -101 265 138 113 144 182 -47 174 74 140 18 -44 107 248
6901 248 62 -24 -139 -139 -77 -236 -181 218 -82 -242 -113 -26 -39 -57 155 310 289 -48 54 -14 77 144 -9 -135
6925 -135 -145 -58 -84 87 66 -98 -44 37 -132 18 30 -168 74 60 -408 -242 113 118 -59 -154 274 143 -190 -103
6949 -103 -150 -49 -153 -140 -33 -33 -134 166 -97 85 128 238 -189 13 172 119 -245 25 56 -80 288 -5
6971eJ06m0j19J39n7O8m12K78K14l02K25j03j01R2J67l11L63o5k7k54J32K05k72
6994g9P8o7j64L65m1L8J03l5j83N0k01J64MK36l51M57m10K68k43j27J37M6m2j82
7018a79q8K76J19k54M31l29q6J58K01k96k19M81j58k78K18j66K59k45J9L29n9
7039A34j28l84K58L37m57L4M30q1k01p4N8K37l00n0J67L05n11N7L26n34Q6J82
7061a09P2q0R9J48j21J36j80L8K22J25k56l30K00J56l4k67R2r5L45m48L48k35
7083a74K78j87R3J70k01k40M24k07J42j7K21l41K22J16l75J96K20l23J5J05l50
7104b13J61J95l25J05L37j97ok73K03J12k11N6OJ33m4r3R8k88K64K2m6k26M73
7127B43m60K08j70L09j3J4k18J37k2n6l8J72j29R0l5n4J73m35L49j88L7L5Q4L6
$$ plain form
6971 -5 101 61 -58 81 24 92 -320 -42 172 -130 95 -8 -109 -17 150 -161 202 137 110 -144 -12 193 -79
6994 -79 -1 -68 -232 133 92 130 233 198 15 65 -136 28 32 268 -83 374 -36 232 -11 -138 -1 45 3 -179
7018 -179 -267 9 128 -126 305 -24 -110 48 249 -47 -266 215 57 -221 -3 -169 90 -155 -136 193 134
7039 134 6 -378 -120 217 -240 -206 224 143 -58 -132 -74 163 -137 -187 -20 285 -226 -169 157 -377 -291 -109
7061 -109 -37 -117 -18 130 9 145 -35 3 225 350 94 -236 -36 120 86 -181 -89 -184 161 -287 61 -174
7083 -174 104 -83 10 180 -21 -261 163 -44 98 81 302 -39 183 299 -76 120 340 17 32 137 -213
7104 -213 -52 143 -182 -77 260 63 57 -216 -13 99 -112 -56 -50 83 39 -54 44 -244 20 42 -4 -230 243
7127 243 -217 -9 -179 130 117 131 -87 50 28 -28 -66 106 -23 67 32 -22 151 -284 65 -123 -86 -51 33 69
7151F9K09k75K44l18m5L12k21j03J40J34k17K17l65M17k83J25j13K20j65M8jn4
7173b5K4K61l31j02L13l30R0M81k25k41J59j1q8j6J15n7M2N7j89J71k85Q8R1J15
7197A07k10N1l8j28N5L61k34n9j45N1J33J19P0J2o8P8M8l30J2k7M0J02K10k42
7221c2L8Pk73L53j0p7j99K14j71J42L0n2r0J96k04J44k3q4K1L5K98l90L17j87
7245Co2o6J31J76n34N56k9k91K1K28j06l0l8Qp6j3l3J07m6K86lj26j05P8L8j30
7271e6k9k38N90n64K27O4m0n1J70m7L0k18J03j4J21O2j26N3r3K97j18J44l37J12
7295D2j57K55l42J22o1J45J09K6j46jR9p5L0K0pl2N6j34l5M77n44J98k87J9L98
7320A75r8l9kR8O3j61O4k75K47P0k17R8J0N2j88J25r2L10l45Q8j67K72j01J28
$$ plain form
7151 69 278 3 247 -71 -116 196 -25 -128 12 146 -71 146 -219 198 -85 40 -73 147 -18 30 29 -25
7173 -25 -1 260 -71 -173 140 -190 -100 381 156 -85 74 63 -25 -41 74 17 59 116 -73 98 -187 -99 -8 107
7197 107 -103 -52 -90 -218 -163 198 -36 -95 -240 -189 -56 63 133 145 77 155 203 -127 -115 -142 -102 0 210 -32
7221 -32 6 13 -260 93 83 6 -193 21 -150 -8 22 -30 -120 76 -128 16 -7 -91 -70 -35 263 -127 190 3
7245 3 -59 -125 6 182 -352 204 175 -116 -95 133 27 -3 -41 -33 -109 -122 -155 -48 -94 192 189 63 -42 36 74 -56
7271 -56 -85 -323 267 -297 -70 -6 -46 -97 73 26 56 -162 -59 -73 48 110 -16 37 -56 241 123 267 -70 42
7295 42 -115 140 -202 -80 -141 4 113 139 -7 -8 91 16 46 66 59 27 83 -51 -86 391 -153 45 -242 -223 175
7320 175 77 38 36 134 197 36 100 -175 72 142 -75 23 33 85 -103 22 -70 240 -105 -17 -184 88 -13 115
7344A15L5k11j19J13J88k12j16K12n2K41k12k0n5L1K29N3l24J66l9J01O1j17O
7367G4J96k05k49J45Nnk8Mm9k5n8o7K34o9J14K96k92O6j76K28j16j22O3%R3p1
7393a4p3o3J80l8o1N9J76k73K72j94J38k52%J4K84k24Ml7K19q4m9L03j81k55L62
7418B13k21J38j49O8l0l46L89J08q3j59K9j62J2L60j93J37j08O0J56j74L0j52
7440g7J29J85l57K15j79o0R8p9K11p5j7P6P8m34L03k7Jj65L59j88J23j51q0L8
7464g3q5M10k76M5M0M9j41RK06l93L6O4n0L17j6o0O7j04m5K43k63K24j53j87K27
7489I1o7j27m9K25k97M4J70j56J27K99k24N8K9j29p8J35K6J93l59R8j31J29M4
7512E1J34n42L14L8j27j31K93N4L0K0l18K00j29K41K7n8o1J46l12K01j57P1p1
$$ plain form
7344 115 150 -61 -180 -67 121 -91 -207 5 -47 194 -18 -38 -93 -62 167 220 -104 62 23 124 185 68 74
7367 74 270 65 -184 -39 -34 -39 -67 -63 -112 -137 -195 -262 -28 -97 17 313 21 87 -89 139 23 -99 -36 -36 57 -14
7393 -14 -87 -150 30 -8 -69 -10 166 -107 165 -29 109 -143 -143 -129 155 -69 -65 -102 117 33 -16 287 106 -149 213
7418 213 -8 130 -19 49 19 -327 62 170 87 -72 -43 -205 -193 167 -26 111 3 63 219 45 75 -77
7440 -77 52 237 -120 95 -84 -144 -46 -125 86 11 -6 70 148 -286 17 -10 -9 -174 185 -3 120 -31 -111 -73
7464 -73 -158 252 -24 21 61 110 -31 -22 184 -209 -173 -109 -159 158 142 82 149 45 0 243 -20 204 51 -136 91
7489 91 24 -103 -152 73 -224 -180 -10 -166 -39 260 36 94 123 -6 -84 51 77 270 -89 9 -122 7 51
7512 51 185 -357 -43 -5 -132 -263 30 84 114 134 -184 16 -113 128 155 97 36 182 -130 71 -86 -15 -86
7535h6J84N6n2o5p6k18K70O7J7l16N81k15k90J48j81K99j70l2J47j46R4J87m59
7558b56K24j56rK51k4p2L93m18p5J85l09L20k41J61l1J33l2QJ27k27R2q3l3J21
7582D9m6r7J66p6J46l23M15j86n7k80L01j16J82J75j00m1k55K07k5n5N3j50r7
7605b10Q8j47M73k67n6K24j83k31L07r8K47k22K38J75k63j65j46K35Q4oj37N4
7627fr0k05K66J34j88J59K90k23j84M1K5j19j26K84j40N6J47K05l65M4K3k17p1
7650b60K90kJ82j80J30j30j39M2O6j3J20r2M9J2j00p7J44l4j04Q9m8J75j86K22
7674A56o9K5m4p6m5K34j87J52r1J2k67K24K04K0j58j18p2j16L26j15j42K45oM
7698I6j58J56j54P8K15k73n2oq3j5J80k60K23O3K30j15l41K23J73l15NK06j21
$$ plain form
7535 -86 98 154 102 37 -39 -257 13 80 97 -219 362 147 -143 5 -176 123 -47 -79 68 -78 16 203 -256
7558 -256 -32 -188 -197 54 30 -42 351 -67 -142 43 -266 54 -187 -26 -57 76 44 52 179 -48 44 -39 -72 49
7582 49 3 -94 72 -4 142 -181 234 48 -9 -289 12 -104 78 253 153 112 -143 64 39 -16 37 -113 -210
7605 -210 -122 -269 204 -63 -119 105 -78 -309 -2 -100 147 -75 163 338 75 -90 -236 -1 83 77 -60 -6
7627 -6 -96 -301 -35 99 -89 70 360 137 -47 -6 19 -100 -226 58 -82 -26 121 326 -39 5 28 -189 -260
7650 -260 30 28 210 30 160 30 -109 -67 -1 -14 106 14 63 75 -25 -102 42 8 -96 -7 -55 120 -66 156
7674 156 87 112 68 -8 -53 181 -6 146 55 67 -200 24 228 248 90 -28 -100 -216 110 -5 -147 98 92 96
7698 96 -62 94 -60 18 233 -40 -92 -98 -181 -196 -16 -276 -53 10 240 125 -216 7 180 -135 -130 76 -45
7721d5lp1J59j26l0J97l3N2j86R7L46l28K7k1K80m46n0L11j12k00n0K58j42J22
7745FO2j50M6o1J9K95J0m56M2n7M13k30r6J74M5j11K8J40Rj75j18Q0K90j73k5
7770Gk2j40J38l6O7J83m2j48j13K8j53J59j9K84l75O25l57j33Q0k34J4Q7L62k06
7794E6qm7k69J45J94k0r6L8R0L1m7k34J26j72J42M8L8k5K15Kl01J02J45j46o2
7819e5J95k16Q6q7J25O2l65K87J35k07J18j13p5J35q6L18m89K58j09J03R2k35
7841a23L4K59n8r5k2kJ5J78k91j10J46J78j51oJ41k52J60K79j86l5o5J08p7j63
7865a38K17m3q2k72N07R5n04L30j20o2N8j37J92J32o1L1j26P1J16k19J30j62j46
7888a93J70J9K22k47J03L3o1K17l11l51L18K00Q5k07l6k86N28q6l57K5M97k46
$$ plain form
7721 -45 -48 -119 40 -86 -116 81 48 100 -86 11 357 29 56 35 315 -131 -181 130 18 -182 -232 26 -116 6
7745 6 68 -82 -36 -97 -78 217 227 -229 -187 -244 169 -61 -157 17 62 -49 -21 119 128 -47 -165 -85 205 32 7
7770 7 -15 -155 -17 -53 14 197 155 7 -106 -78 -231 -72 -91 193 -182 443 86 -47 33 -201 -187 -100 262 56
7794 56 48 1 -268 -123 71 51 -45 -7 83 114 67 -167 -41 -213 -71 -23 15 -10 205 207 -94 8 153 7 -55
7819 -55 140 -76 10 -77 48 110 -255 32 167 -40 78 -35 -110 25 -61 257 -232 26 -83 20 112 -123
7841 -123 -89 170 112 17 -5 -7 8 186 -105 -215 -69 109 -42 -48 93 -159 1 280 94 59 -6 102 25 -138
7865 -138 79 36 -46 -318 189 284 -220 110 -10 -72 -14 -151 41 173 112 143 17 88 204 -15 115 -47 -193
7888 -193 -23 -4 218 -29 74 107 46 263 -48 -399 -81 119 204 -3 -39 -325 203 117 -240 -215 282 36
7910C6j9O9K65m78J53j76M5PJ35J56k73q9J58Kj13J52j94L28M5m32J27K28j79
7933d7J99m8j9k0m8k19K6l0J90J84qk74k21K94P9j05M48n24K38o0J21j60R4Pj28
7958c1J54k15P0L3L02m69K88k99J23n0K38q9k48K38j24k01K57R9j58m1J04k63
7980b82M65l37QJ90k1j41R0L54l82J77j16k15K35J24j28o2p1n5K25L6j59K2K75
8003B32j82k4J16k43J84j1j40p2J18P3j79J30qJ98mk70j26K86j14j35j67J92j59
8026c05L63j59L20p0l33J23N52o50J57J99l48J35M5J23m0j68K7j58Q0J00P8o4
8048Gk8J5j58J33m2J04j91K01j51j41P77m67lqm5J50j47p6J13m9R7j90m9mL18
8073A66k65K29j55J1P9L1r9k8j1o4K69p3k06L77m65RM35j78M6j48N4o0o1nK55
$$ plain form
7910 36 17 86 351 -127 26 -150 -105 -98 37 193 -80 -169 -11 -9 -122 30 -164 164 209 -223 -96 132 -47
7933 -47 152 104 85 65 17 -202 -176 -206 -16 168 160 -114 -335 -41 38 -67 381 -143 95 35 156 -4 90 97 -31
7958 -31 123 -92 -22 11 313 -156 132 -167 -44 -94 144 55 -193 45 -79 -280 -23 76 -82 -123 -19 -282
7980 -282 183 -154 -146 44 23 -118 -28 326 -56 121 5 -210 25 149 21 -41 -112 -167 58 94 -65 -43 232
8003 232 50 26 142 -101 83 72 -68 -140 -22 51 -128 2 -6 192 188 -82 -208 78 -36 -171 -338 -146 -305
8026 -305 58 -101 219 149 -184 -61 491 -159 -2 197 -151 -16 29 152 112 -56 -29 -187 -107 -7 71 7
8048 7 -21 -6 -164 -31 -73 31 -160 41 -110 -251 526 59 56 48 3 153 6 -70 43 -6 91 -99 -148 -152 166
8073 166 -99 130 -25 -14 65 96 -3 -31 -42 -106 163 90 -116 261 -204 -195 240 62 108 -40 14 -46 -107 -112 143
8098A43k29K66l40p3L89j5K11j24j78jK27j46k16o9M77m88J87q5J03j43J16OP6
8121I4L9k52Q7L3j62J95O0l35L85n8l44J37R6N9N9k61O3k22K51M31l74O6q1P6
8145D2m6j80L25j88qk10K37L8j2Q0j90K53m20K15L20k5k1m37K31j96K66M7l81
8168b60L91k64M3p5L37k18P7k54J96J92j86K0k18J05j29J20m6J19k6J09J81l16
8190a02L46
$$ plain form
8098 143 -86 180 -160 -233 156 141 352 228 50 49 276 130 -86 -155 322 -166 21 -64 39 -104 12 18 94
8121 94 133 -119 -32 1 -161 34 94 -241 144 86 -258 -121 -25 34 93 -168 -105 -327 -76 355 -19 47 -34 42
8145 42 -4 -184 141 -47 -55 -265 -28 10 -2 78 -112 141 -279 -64 256 231 210 -227 4 -192 74 121 -260
8168 -260 131 -133 -90 -165 172 -46 31 -223 -27 165 -21 -1 -219 -114 -243 -123 -169 -50 -76 33 214 -102
8190 -102 244
8191B44
$$ Imaginary data points
##PAGE= N=2
##DATA TABLE= (X++(I..I)), XYDATA
0@%%%%%%%%%%%qJ6j6J6k4L2l2M0n4O2p2Q8j04J20j44J71j95K24k59K99l42L89
33B07m42N00n64O33p09P94q87R89j099J220j354J499j657J831k020K225k452K704
51A418k979L280l615L993m417M896n444O073o810P690q755J0071j1756J4005j7167
66i517K1976l0266M8512j64790P6704J43255k42614J15127J52150j23742n8795
77g2000J71004l0442p4865Q3229N113j25341N3208N9808q7678n789P6744p9810
89b6819n7455O7196M866m5971L0788P987k4276K7871L4610m040K6527K9831j6360
102E4755r122J0442k5389j8130J580l9397k6450K1583k1402j2380N5822k919m7723
115e8730N1944N6355m0630j775N7123k6156n1231L6339J6221m6709J5689K9555
$$ plain form
0 0 0 0 0 0 0 0 0 0 0 0 0 -8 8 -8 8 -16 16 -16 24 -30 32 -40 48 -56 64 -80 91 -104 120 -139 160 -182 207
33 207 -235 265 -299 334 -375 419 -468 521 -578 642 -712 787 -870 961 -1059 1166 -1286 1418
51 1418 -1561 1719 -1896 2097 -2320 2576 -2868 3205 -3605 4085 -4670 5401 -6355 7650 -9517
66 -9517 12459 -17807 30705 -134085 -57381 85874 -156740 -41613 110537 -13205 -72000
77 -72000 99004 68562 -6303 76926 82039 -43302 9906 69714 -17964 -23753 52991 -26819
89 -26819 -84274 -17078 -12212 -58183 -27395 -19408 -43684 -15813 18797 14757 41284 71115 54755
102 54755 45633 56075 30686 12556 14136 -25261 -51711 -30128 -51530 -63910 -8088 -11007 -58730
115 -58730 -6786 49569 8939 7164 64287 38131 -13100 23239 39460 -7249 8440 37995
127C7995n4074k0939M2103j5962k9534K9822K308l8993J0657L7595m213k855L4049
140B7959Q383k3255J0875K1673j7582j7170J879j5144k6509n999J1208P54o736
153b9664J0436P361o893J8953K5561q939m840J4086p653j6820Q821R292j5119
166D582r438O559j1030j1580J7770K124k3307O858J2604j3962M623K2588L90m875
180C906J0373O006n467M112Q858j3801j9960n04j595j1152j105L810J629j883
194a6773l762J3598J9295o31K50R353p353q182P909J756j0060l345J134j2141
208h952j0975J3519O406j4500J245O783q304L807J3462R32J608O180j858n04Q213
223A7062M226q014o115k090j2692p910R661k331j3420N030O066o346O229J7038
$$ plain form
127 37995 -16079 -37018 5085 -10877 -40411 -10589 -8281 -47274 -36617 978 -3235 -6090 27959
140 27959 36342 13087 23962 45635 28053 10883 12762 -2382 -28891 -34890 -23682 -22928 -29664
153 -29664 -19228 -11867 -18760 193 25754 16815 11975 26061 18408 1588 10409 19701 4582
166 4582 -4856 1703 -9327 -20907 -3137 -1013 -24320 -17462 -4858 -18820 -14197 8391 8781 3906
180 3906 14279 20285 14818 18930 27788 13987 -5973 -6477 -8072 -19224 -20329 -16519 -14890 -16773
194 -16773 -20535 -6937 12358 11727 11977 21330 13977 5795 13704 15460 5400 2055 3189 -8952
208 -8952 -19927 -6408 -2 -14502 -13257 -6474 -14778 -10971 2491 3423 5031 11211 9353 8849 17062
223 17062 21288 13274 7159 5069 -7623 -15533 -5872 -8203 -21623 -16593 -10527 -16873 -10644 6394
237F394P324m260j500L906j028j385N868k047j1080l764k023n338l12M054K317
252b874q003q631Q280P936k842M616Q716r39k855L593P339K036l200k408o942
267C822q441J771J43o979m74n44n388J810P402O269L783J231k25q13J722O830
283A1919P05m074l48o108o198L706J110l330j9j644o552l279O004Q070k690k123
299d851P223Q65l774O990N976j107k637l490l018k444J165J101p326m436M849
314d914j819m250Q013N926m040k092L579K673o7K063K879m990l389M579j414l443
330g06M186n00o677j929J520R11l42K50J191k400L22N282L64K25M115j282l269
347A261R76K23l02k66j165l166k109K338K141m061J136N547m377l742O385K531
$$ plain form
237 6394 13718 9458 7958 11864 10836 9451 15319 13272 2192 -1572 -3595 -8933 -9245 -5191 -2874
252 -2874 -10877 -19508 -11228 -3292 -6134 -1518 7198 6259 3404 6997 14336 16372 13172 10764 3822
267 3822 -4619 -2848 -2705 -9684 -10158 -10702 -16090 -14280 -6878 -609 3174 4405 4180 3367 5089 11919
283 11919 12624 8550 8202 2094 -4104 -398 712 -2618 -2637 -4281 -10833 -14112 -8108 -38 -2728 -4851
299 -4851 2372 3237 -537 6453 12429 11322 8685 5195 2177 -267 898 1999 -5327 -9763 -4914
314 -4914 -6733 -10983 -2970 2956 -1084 -3176 403 3076 3009 5072 7951 2961 -428 4151 2737 -706
330 -706 3480 2980 -3697 -5626 -4106 -3195 -3537 -3287 -2096 -4496 -4174 1108 1472 1697 5812 4530 1261
347 1261 2237 2460 2158 1892 727 -2439 -4548 -2210 -69 -4130 -2994 2553 -1824 -5566 819 3350
363C350l348j64K113j450k417M187K604n874k28N531n026l833N914J918n389k198
379d310L187J296k411J499L102k780q08K952j361m8K759j019k172n23q3K119r39
396D60o06N25j481J10J292n14J582Q98k994j030J570N39O72j5m15j016k028K307
414a44K749l302O29L119l999l260M312L527k751k608K158N73l502K521L600l383
430B39q62K262m043j474N376Q73m045j115K574r12k080L893L099l243n90R96j840
447h92J945K585k439j716n00j002j08O02J283o1j651K65m54L29L101J021k114
464A94l14K18N3K279m91J70L25k248j435R31J07L81m29k561r28N82K050J48l88
483a356L126N22l574K450L976k194k38J155l613k114J858R54k432q30K170k157
$$ plain form
363 3350 2 -162 1951 501 -1916 2271 4875 -999 -1227 4304 -722 -4555 1359 3277 -2112 -4310
379 -4310 -1123 173 -2238 -739 2363 -417 -1225 1727 366 318 3077 2058 -114 -637 -720 1399 460
396 460 -146 379 -1102 -992 300 -214 1368 2266 -728 -1758 -188 351 1023 1008 593 -423 -2451 -144
414 -144 2605 -697 -68 3051 -948 -4208 104 3631 880 -1728 430 1003 -2499 22 3622 239
430 239 -623 1639 -2404 -3878 1498 2371 -1674 -2789 -215 -1127 -3207 686 3785 542 -48 948 -892
447 -892 1053 3638 1199 -517 -1017 -2019 -2127 -1525 -242 -303 -1954 -1689 -2143 -1814 1287 2308 194
464 194 -120 98 151 2430 1939 2109 2434 186 -1249 -318 -211 170 -259 -2820 -3748 -3166 -1116 -968 -1356
483 -1356 1770 2292 -1282 1168 5144 2950 2712 3867 254 -1860 -2 952 -1480 -2310 -140 -2297
499b297k800L360K672k353P13J593j954J024K830J70k98J12J10j373j381J479
515A607j59k264j237j772j16J187j44j0K191J9n87J500J908J180N58j240j07r14
533A600j012Q25n25j369j265n41M66j280o27K957R6k854J988K684j125Q05J419
550B242J75l16M96J056k094n81J681k777l592K151P18k825o02K181J08j74P57
567a396K737M56p1J219k34j151J223q5j939k92o02j175ko0pn21N2J197r49j54
587a754K654l96j351J810J043o64L65O99j003n63K01p12j866J106O57k876r87
604c637K703k51l70J684L74l08N52L32L38O97n25o16q85j224O54J91j66q19j6
623a292J102o32q74K388M23j360P92o3p56P75J138j883r5J072o57j369J188J048
$$ plain form
499 -2297 -5097 -1737 935 -1418 -705 888 -1066 -42 2788 2958 2660 2772 2882 1509 128 1607
515 1607 1448 -816 -2053 -3825 -3941 -2754 -2898 -2908 -717 -698 -1285 215 2123 3303 3861 2621 2514 1600
533 1600 588 1413 888 -481 -1746 -2287 -1821 -3101 -3728 -771 -675 -3529 -1541 1143 18 823 2242
550 2242 2417 2101 2597 3653 1559 978 2659 -118 -3710 -1559 -841 -3666 -4268 -2087 -1979 -2153 -1396
567 -1396 1341 1797 1726 2945 2711 1560 2783 2698 759 467 -135 -1310 -1312 -1372 -1379 -1900 -1848 -651 -1600 -1754
587 -1754 900 504 -847 963 2006 1342 1707 2406 1403 840 1041 329 -1537 -431 226 -2650 -3637
604 -3637 -934 -1185 -1555 129 503 195 747 1079 1417 2114 1589 973 88 -1136 -482 -291 -457 -1276 -1292
623 -1292 -190 -822 -1696 692 1115 -245 547 484 -272 503 1641 -242 -337 735 78 -1291 -103 945
641I45j758p59J456j456K55K650q23j215J825j11j114J351O74o87j723M68j140
658a162j108J503J223k445O10J431m82k64J969L85j28m69k80J48m77N2J34j130
676d90o30M99n49k24R0R09M74j749M92K227r45R1J641n87j027J047L97n08j98
695I60j26j160j384L91N51p51N1N90j192O04J597O9J067N81j08p18K36N89o95
714A152n96p9n89j319K25L97j250M84R88n63n37R33J175J34p63J063Q22r28J76
733I25Q30p34j98J66j236p21rN34q83r07J106M42q09P23J482m76O42L15k76N34
753A450J10k93n01n55j58m82n71J81o0k30N75j06m53P05K37k00L18N21Q00j52
773A136r51N77J12m56L98j64p91k83k51k11m04L49Q16l96n87J209N39q01N57O75
$$ plain form
641 945 -813 -1572 -116 -1572 -1317 1333 510 -705 1120 1009 -105 1246 1920 1233 -490 -22 -1162
658 -1162 -2270 -767 456 -1989 -1379 52 -430 -694 1275 1660 1532 1063 783 931 454 506 640 -490
676 -490 -1120 -621 -1170 -1394 -1304 -395 79 -1670 -1178 1049 104 195 1836 1249 222 1269 1666 1158 960
695 960 834 -326 -1710 -1319 -768 -1519 -1468 -878 -2070 -1466 131 200 1267 1848 1740 1022 1258 1847 1152
714 1152 556 477 -112 -1431 -1206 -809 -2059 -1575 -587 -1150 -1687 -754 421 555 -208 855 1677 749 925
733 925 1755 1021 823 989 -247 -968 -977 -443 -1326 -2233 -1127 -685 -1494 -771 711 235 877 1192 916 1450
753 1450 1560 1267 766 211 53 -429 -1000 -819 -879 -1109 -534 -640 -1093 -388 -151 -351 -33 488 1288 1136
773 1136 185 762 874 418 816 652 -139 -422 -673 -884 -1288 -939 -123 -519 -1106 103 642 -159 398 1073
793A073m03M0Q8m18j81j9K24q98l96P03J74p30O09K89o12J82K90M0K27j3O3m30
815i8j98P01K11o34K24K11o48M2j59M01J01M0k26m81J56M31n9m5M52k19p69N04
837f2k2j06L48k44l91J23J51N16k76l19P85p0q47M34M09m18l99om4r4M35L68o80
860d09j22M66j30l82O66O88l63l72K87J23j40J27Q2l05k74o3m82j12N93m8p43
881i13M12J7L61N09p9K39j83J15j24l49N23J5m00k60j65K51j57n1k85K48p7o3
903d16M93m55L28N12l1p01M07P18k04k10j7J9m80k84M28k86k00K56m59n05Q06
924b81L50p9m40O34p0KK7K90j59j3L17n47l81O58l48k73K13J00l48j15K12K70
946A9l19J78K11k17N06qo6k9L71k59r2r1k00j00k10m9m0J32L23j51p3j27K20j40
$$ plain form
793 1073 670 710 798 380 199 180 404 -494 -890 -187 -13 -743 -134 155 -457 -275 15 55 282 269 332 -98
815 -98 -296 405 616 -18 206 417 -231 -189 -348 53 154 194 -32 -513 -357 74 15 -30 422 203 -566 -62
837 -62 -84 -190 158 -86 -477 -354 -203 313 37 -282 503 433 -414 20 429 11 -388 -394 -438 -532 -97 271 -409
860 -409 -531 -65 -195 -577 89 777 414 42 329 452 312 439 521 216 -58 -121 -603 -715 -122 -170 -913
881 -913 -501 -484 -123 386 307 546 363 478 354 5 528 543 143 -117 -282 -31 -188 -239 -524 -276 -353 -416
903 -416 77 -378 -50 462 431 -270 137 855 651 441 424 443 -37 -321 107 -179 -379 -123 -582 -1087 -281
924 -281 69 -10 -450 184 114 116 143 433 274 261 578 31 -350 308 -40 -313 -100 0 -348 -463 -251 19
946 19 -300 -122 89 -128 378 370 304 275 646 387 295 204 4 -96 -306 -355 -395 -263 60 -91 -164 -291 -71 -211
970b11K11l20L66J58m03P6O24n2j11J36K6l92m2K05n76j65K31J88q39K72M52o6
992b32L9q2k2N75K30k89O7j81K2k4m14K31L78o07K44j3l24O56k00k78o2K82k01
1015b05j06j9N59l3j22M05m32M20o0j96j25k42K48l08j82o9L81P7l03P4J43K24
1037A29L2R4l60q5J18L29J15J39o1l08l66L92M06k55k09j15k27j2k26J4L09L8
1059a09p1K16j98K84M26k49J74m31K01m88L37l9q4PN0j01n72Q76J12m55M13k60
1081C9m17J57K87N3j09J03J07k16Q8M36k25m92K82K1n25O44m05L1K58k48m16N06
1103d1K18j72l0p6K36j10Q8k0l74K74J15j73J11L22m04L83o7m05j85K96l82LM27
1126C4k18j36L0N08l24L68j67K63n83M94n3j64O5K29n36O9K91m3j45j16j57J02
$$ plain form
970 -211 0 -320 46 204 -199 -123 501 449 338 474 500 108 66 271 -305 -470 -239 -51 -890 -618 -166 -232
992 -232 -193 -275 -297 278 508 219 286 105 127 103 -311 -80 298 -309 -65 -78 -402 254 54 -224 -286 -4 -205
1015 -205 -311 -330 229 196 74 479 47 467 407 211 86 -156 92 -216 -398 -467 -86 -9 -312 -238 -95 129
1037 129 161 255 -105 -190 -72 257 372 511 450 142 -224 168 574 319 110 -5 -232 -244 -470 -456 -147 -109
1059 -109 -180 36 -162 122 548 299 473 42 243 -245 92 53 -31 -24 26 -75 -647 229 341 -114 299 39
1081 39 -378 -221 66 119 10 113 220 4 92 528 303 -189 93 114 -411 233 -172 -141 117 -131 -547 -41
1103 -41 177 5 -25 -101 135 25 113 93 -281 -7 108 -65 46 368 -36 347 280 -125 -310 -14 -396 -393 34
1126 34 -184 -320 -290 218 -106 262 95 358 -225 269 216 52 117 346 -190 -121 170 127 -18 -134 -291 -189
1148a89J98o7j81l8O15k87p0P8J20J24l38L69rl69M3Q0k19K51k89p3j83J98K82
1171D6J2k50oL56N2j41J64J40k66o5R5K5N0l45J8OL9r2k63K50J23l54L28L07m54
1196b25J35N61k82J52j24J66j6j80P3l29m1k7j68J24Q3j35P8o0k87N84Oj93m5
1219a50N58l42L8K99l57K06J18m02k8j74J00L12m22j52M13j2j25K36k63R4L79
1240C26k42m6L36J9O6n19N2p0J93j24Mn0k52K04j28n3K67qL6lK73o9k82J1L45
1265B86l35K7p5j86K14J89k79k36L82K9r5m6Q9K78l53Q6P4l00K81J63k66j53L31
1288A05J89j14q6j06o0q9K56J2j17J0Q5m1j22N6j37K12J1k54J5j27o5N11l12K
1312a66j08L81o4j89R9P4J51j31o6j5RJ15l56l6N4J84k19L46k19l8R0K49P0j22
$$ plain form
1148 -189 9 -58 -239 -277 338 51 -19 59 179 303 -35 334 325 -44 -1 79 -140 111 -178 -251 -434 -236 46
1171 46 58 -192 -198 158 210 69 233 373 107 42 137 162 212 -133 -115 -109 -70 -162 -425 -175 -52 -406 -78 229 -225
1196 -225 -90 471 189 341 217 383 367 187 260 -69 -110 -137 -305 -181 -98 -233 -155 -215 -502 82 88 -105 -150
1219 -150 408 66 104 403 46 252 370 -32 -60 -234 -134 178 -244 -396 17 5 -120 116 -147 -53 326
1240 326 84 38 374 393 459 -60 -8 -78 115 -9 -5 -55 -307 -103 -231 -284 -17 -25 11 8 281 212 -70 -59 286
1265 286 -49 -22 -97 -283 -69 120 -159 -395 -13 16 -79 -125 -36 242 -111 -25 49 -251 30 193 -73 -226 105
1288 105 294 180 94 -12 -72 -161 95 107 -10 0 85 44 -78 -22 -159 53 64 -190 -175 -302 -367 144 -168 -166
1312 -166 -274 107 43 -146 -47 27 178 47 -19 -34 -25 90 -266 -302 -248 -64 -283 63 -156 -194 -104 145 215 93
1336I3J71j65o4J61ok16J0J23l42J15Jl6j24O2J62r1p7J65K50k21K04K28j76K45
1360D72m12L29j61j55nk77j97K58J5ll33J87Q1L04J27n50N20j95L88m02r9L74
1382B66o9j26M0k5q1Pk4m03K13Q4K38n15Q7M03j01l9J02L84k92n3K09j2j06k37
1406e0J93k49jJ32l46N3J74k3L13l94j2J22L40j54JK9j43J77j07J22j88J56N1
1429A96q5k76k21J69K05p3L8o9L45J43p17N73j08j31J2J12n5k68L94j90k8R2n6
1452Bq4J28K68m75J57j08K22j48Q3r6J34j87n4K85k74K58k27J93m6p7L0l9J17
1475F2p5J92j36q7K65m38L08J5j93K02J7l00L23l5J01O8j59j55J43j60K4K09j29
1498F2l15L49l2j20J68j1l06q1M86k75m3K22l47J44K66K19k89Nn7J10j5K9K9J
$$ plain form
1336 93 264 99 35 196 190 -26 -16 107 -235 -120 -119 -155 -279 -217 -55 -146 -223 -58 192 -29 175 403 227 472
1360 472 60 389 228 73 68 -209 -406 -148 -133 -136 -469 -282 -201 103 230 -320 200 5 393 -9 -108 266
1382 266 197 71 111 86 5 12 -12 -415 -202 -118 120 -395 -308 95 -6 -45 57 441 149 96 305 293 187 -50
1406 -50 143 -106 -107 25 -321 -268 -94 -117 196 -198 -210 -88 252 98 99 128 -15 162 55 177 -11 145 196
1429 196 111 -165 -386 -217 -12 -85 -47 -116 229 372 -345 228 120 -11 1 113 58 -210 184 -6 -34 58 2
1452 2 -82 46 314 -161 -4 -112 110 -38 45 -51 83 -104 -158 127 -147 111 -116 77 31 -46 -16 -55 62
1475 62 -13 179 43 -44 221 -217 91 106 -87 115 132 -168 155 120 221 289 130 -25 118 -42 -18 191 62
1498 62 -253 96 64 -56 112 101 -205 -286 200 -75 -118 104 -243 -99 167 386 97 102 45 155 140 169 198 199
1522A99j21j13n4q0P3j11l0J76K33j07K4O9m08N24l58R0K10k73L55j47j67J26
1544A10j41J49k08r1L3J46j65P5l6K12k24L28j06rk08M87j34k14K8l88N15J0o
1567A63l11k51L79l7kQ9q8M3N1r5J28J50k7j40j58L28j91Q3j90J47k09L38r4k18
1591a12M7q2K61l13m0K62J32l74K76nK68l65l5J9J94n4l5J9M1l8o5R2r7K7l4o5
1617g6K18l53L12r5L4k0J13Mk83J33J01O9j65O3k14K09l90M81m15K76j20J20j67
1640a65l3L02K8k44J76j29n4K28l0L35n44L12j21O8j87k4j82L11o2M8l23K50q3
1663a23K2K9k3J6J11q4J70k27J74k09K69j9J46m56j30P06m97K93l87L96j90j32
1685a45K07j61r1K31j77O7J51J6o2R8k78L23M8l78j50L40J32j76l1j96K9n8J04
$$ plain form
1522 199 78 -35 -89 -169 -96 -207 -237 -61 172 65 89 158 -250 274 -84 6 216 -57 298 151 -16 110
1544 110 -31 118 -90 -181 -148 -2 -167 -92 -128 84 -140 188 82 73 -135 352 218 4 32 -356 159 169 163
1567 163 -148 -399 -20 -57 -59 30 -58 -15 36 -59 69 219 192 52 -106 222 31 114 -76 71 -138 200 106 -112
1591 -112 -65 -147 114 -199 -239 23 155 -219 57 52 320 -45 -80 -61 133 79 44 63 104 66 1 93 -4 23 -11 -76
1617 -76 142 -211 101 6 40 20 133 137 -146 -13 88 157 -8 55 -159 50 -340 141 -274 2 -118 2 -165
1640 -165 -198 104 132 -112 64 -65 -119 109 79 414 -130 182 61 129 -58 -82 -264 47 -15 33 -290 -40 -123
1663 -123 -101 -72 -95 -79 32 -52 118 -109 65 -144 125 106 252 -204 -334 372 -125 168 -219 177 -13 -145
1685 -145 62 -99 -190 41 -136 -69 82 98 36 134 -144 179 227 -151 -301 39 171 -5 -36 -232 -203 -261 -157
1708a57K45k99N8J81m4l0M18m53j75K16J92m6l99N40k55l24N16m10L20Ok76P3
1730a03Q7J61k82L08o4n6j58K63l08L13L7l12K65j22m37N57l99L48k36K20k12
1751a30k22K38J75q8J36j00Q6l67J81Qn0J07Jk83K51J9J93p8j99J44qJ97l70r4
1775b53K88J86m50J73l1K97j88k2M9RQol6j6j87M52k34Q0j03JJl39L59m3J90j82
1801CK10j97M4j48N6N59n98L23P3l44k5O7k48L83k55ON0K26l76M57k09j01K01
1824A57p7o4q3J49m0j85q3J33j4j33J57RK23Q9m14K86j36j61M6P0l6J01ml2J5
1849b7Qj6j35L13k4j93J77k42K55k92L13r9n1j05P6k18J50J41j38Pnj34N03l35
1873g1J20K4j58M3j47J16J76j6l3l25J27K36k02M31l38r2J88pj3k39K67L1j26
$$ plain form
1708 -157 88 -211 -153 28 -16 -46 372 -81 -256 -40 152 106 -293 247 -8 -332 184 -226 94 100 -176 -103
1730 -103 -16 145 -137 171 107 51 -107 156 -152 161 198 -114 151 29 -408 149 -250 98 -138 82 -130
1751 -130 -352 -114 61 -27 109 9 95 -272 -91 -83 -133 -26 -25 -308 -57 -38 155 77 -122 22 14 211 -159 -253
1775 -253 35 221 -229 -56 -87 210 22 0 49 58 66 60 24 8 -179 273 39 119 16 17 18 -321 38 -5 185 3
1801 3 213 16 60 -88 -32 527 -71 252 325 -19 -44 23 -225 158 -97 -91 -41 185 -191 266 57 -44 157
1824 157 80 16 -67 82 42 -143 -226 -93 -107 -240 -83 -74 149 238 -176 110 -26 -187 -141 -71 -107 -6 -10 -42 -27
1849 -27 -19 -35 -170 143 119 -74 103 -139 116 -176 137 38 -13 -118 -42 -260 -110 31 -107 -100 -105 -239 264 -71
1873 -71 49 73 -85 -42 -189 -73 103 87 54 -271 -144 92 -110 321 -17 -109 79 72 59 -180 87 118 -8
1896hLJ86k4J50j90J55k55k5j55k3K40J26M6m19M6J70o7J95k54K20k1j50q3J87
1920E0J27K2j38l04K27M6o9k5J5j50K98k25M10k35j52J06m7j13O9J23j82L22O6
1943B41l03k9K12k89L03l77J58j16J6J34Q2k75J52J32q4km8J89n8j95J40J70l73
1966b20J38R1j32k9K93l9m8k5k4k29K92m9m9L6r1j83L74k06K63J76j60l01Q9l66
1990c99M34k36K60m2p7L84k86j37k8nK32l9k38J28j50L0K60j35J1mN7K17m51L52
2014A38k36M31k85p5o4J74j69N8Q9J40j48r8J51J5q9MlJ8J19j6k16K8l68K79o5
2039a88K36k50J65LK49Q9j51l47QK35l40L78jr5kq4K38N6k35NOJ07k30l2J18P3
2065A1m1K24l48K26J50l15R9j17J12j38J84j10n2K50j02j08K52k18n2J75Qj97
$$ plain form
1896 -8 -5 181 157 307 117 272 17 -8 -163 -186 54 180 226 -193 -147 23 -44 151 -103 117 96 -54 -137 50
1920 50 177 199 61 -243 -16 30 -39 -64 -49 -199 99 -126 284 49 -103 3 -44 -157 -88 35 -147 175 241
1943 241 -62 -91 121 -168 135 -242 -84 -200 -184 -50 32 -243 -91 41 -43 -45 -93 96 38 -157 -17 153 -220
1966 -220 -82 9 -123 -152 141 102 54 29 5 -224 68 19 -30 6 -85 -268 106 -100 163 339 179 -122 -33 -399
1990 -399 35 -201 59 17 -60 324 38 -99 -127 -132 100 61 -177 -49 -199 -169 91 -44 -33 -37 20 237 -214 138
2014 138 -98 333 48 -27 -91 83 -86 -28 61 201 53 -45 106 121 32 36 33 51 170 154 -62 -34 -402 -123 -188
2039 -188 48 -202 -37 -34 215 304 153 -194 -186 49 -291 87 86 -9 -11 -95 143 199 -36 -31 -25 82 -148 -180 -62 11
2065 11 -30 194 -154 72 222 -93 6 -111 1 -137 47 -63 -115 135 33 -75 177 -41 -93 82 90 -107
2087a07K7J11j7l9q8J61K1j64P2J3j00L35k8j05m09M03k29K94j43k13L16P7k38
2110e0k79M00J11k21P5O4J13q0j15j17J99l10K82l2L1p7J64k23K7j14P5m2J66
2133D7K13n07K89j82L3R7J4m4M9K14k37L32l19L57n02M9J33j06M24m62K88l41
2155a61M7k2K03j14K44o02L47l10K76J54J4J7J03j41q2J8J09q3n8P3m50K64Q8
2178f6K33j59r5j04M7L24j69m0OKJ13Q6k74K33l15K87j80j4R9o7M7J24K83l47
2202E4j51J16k31J34q3Q2n9K09l07J93M9j9J20k1J2j31r4M3K46j45jj22j17J97
2226b6j57J53m6J4L6K04j97j6L2j7N3o4N8J71j01j51J43k14P2n4J12j08K15p4
2250C8r6k9OO4J87j55r7J29k31L61r1k7p7K85m17KO2n1J11j18J32P4J35j52o0
$$ plain form
2087 -107 -80 31 14 -25 -113 48 69 -95 -23 -10 -110 225 197 92 -317 86 -143 151 8 -205 111 188 -50
2110 -50 -329 71 182 -39 36 100 213 133 18 -99 100 -210 72 40 71 -6 158 -65 -38 -152 -77 -119 47
2133 47 260 -247 42 -140 -107 -10 4 -40 9 223 -14 318 -1 356 -146 -97 36 -70 354 -108 180 -161
2155 -161 -114 -136 67 -47 197 -405 -58 -368 -92 62 76 93 196 55 -27 -9 100 17 -41 32 -418 -154 -66
2178 -66 167 8 -87 -191 -144 180 11 -29 -23 -21 92 178 -96 137 -178 109 -71 -85 14 -53 -6 118 401 54
2202 54 -97 19 -212 -78 -161 -79 -138 71 -236 -43 6 -13 107 86 98 -33 -127 -84 162 17 16 -106 -223 -26
2226 -26 -183 -30 -76 -62 -26 178 -19 -35 -3 -20 33 -31 27 198 97 -54 89 -125 -53 -107 5 -103 112 38
2250 38 -58 -87 -81 -17 170 15 -82 47 -184 177 86 59 -18 267 -150 -148 -86 -137 -26 -144 -12 62 197 45 -15
2275a5r8K63k04K25J2l90J30P5j31k56K69J44j0o8J22L0j50P3k09lK78K5J53m32
2299a67J80j17m0J25K0J08k2m1j40L5j81N9l2K97o9j16j1j53N61m83K09N3m8m29
2323d02O05l94m6J24j19N17m14J45R8j23K4O1Pr5O4K6k0n0J8k7o0K56m60K5M34
2348A94l69J04j22J05K93k75L8L7J48k22J79N2k66J66r7pR5j36K31Lq9k5O7K33
2372C37l91j25j20M49q0j73K06j68M1J63l06K62n7J34j67L57m03j79P5J55j47
2393a37R4P5k71J54Q1j09K75l13J19K15k66N0K35j07k11J31j96J72k07K17j51
2414a50J99P6k05p2K15n2j32l2J5K05O7k45J74j66n7R4r1J19J00j04l3L22n74
2437c27N18k44j01K30kj19l5k09L9Q0P0Q5K39l49K22q4j14J95j59l4l6J71j00
$$ plain form
2275 -15 -113 150 -54 171 183 -207 -77 -2 -133 -389 -120 24 14 -54 68 98 -52 21 -188 -191 87 112 265 -167
2299 -167 13 -104 -144 -19 1 109 87 46 -94 -59 -240 -181 -213 84 15 -101 -112 -265 296 -187 22 75 27 -402
2323 -402 203 -191 -237 -113 -232 285 -129 16 114 -9 15 76 83 -12 52 78 58 8 26 -1 -61 195 -265 -240 194
2348 194 -175 -71 -193 -88 205 -70 -32 5 153 -69 110 162 -104 62 -35 -42 53 -83 148 151 62 37 104 337
2372 337 -54 -179 -299 150 70 -103 103 -65 -24 139 -167 95 38 172 5 362 -41 -220 -145 10 -137
2393 -137 -43 32 -239 -85 -4 -113 162 -151 -32 183 -83 -33 202 95 -116 15 -181 -9 -216 1 -150
2414 -150 49 125 -80 -152 63 11 -121 -153 -138 67 134 -111 63 -103 -160 -66 -157 -38 62 -42 -75 247 -327
2437 -327 191 -53 -154 76 74 -45 -80 -289 -250 -170 -100 -15 224 -125 97 13 -101 94 -65 -99 -135 36 -64
2460f4J03j17J49j77J51N1l6l4m1J2j84L06q0J84j24q9K90k02l84N27k58L64l53
2483fJ12n5P4k88L08k09P0qq6J61k15j63L10J00j19M0K8j13j60L12j81K21k18
2506h5M8J00r6oQ9M5J68m66J26J60j25n1K04N1j56j53L41n9r6o0J14l9r7K14k58
2531h7j8J63J6ok52j18J36K8K00N2j73M63k56rj83L0K7j07J06r8J90o5j41K42
2555A40M4k12J04n1J7Q9j88O1J40j0k85qL76l04M6L91k42j61K2R7l08L6j75M51
2579G0J8J63m78K52j42K65P4j94M1K23l19R0k35n1K53KJ75k91P7J37k24P2O7l39
2603b94O2q4K86J10j97O5R4j55J93J00j10J05j55J36m08J47J20L6k8K35k23m7
2625a2R2m0J66l11M4P4j56J91p9M8R1n1j64J5J13j14M5K89k94K63j37p4J44Qj41
$$ plain form
2460 -64 39 -78 71 -106 45 96 60 26 -15 -3 -187 119 39 223 99 10 300 98 -286 241 -17 347 -6
2483 -6 106 51 125 -163 145 -64 6 -2 -88 73 -142 -305 5 105 -14 26 54 -59 -219 93 -88 133 -85
2506 -85 -37 63 -33 -39 50 95 263 -203 -77 83 -42 -93 111 162 6 -147 194 135 39 -21 93 54 -43 171 -87
2531 -87 -105 58 74 68 -184 -302 -166 -138 62 114 -59 404 148 139 -44 -14 13 -94 12 -86 104 39 -102 140
2555 140 184 -28 76 25 42 131 -57 4 144 134 -151 -159 217 -87 -41 350 108 -53 -31 66 -242 -206 -381 70
2579 70 88 251 -227 25 -117 148 222 28 69 292 -27 63 -172 -223 30 32 207 -84 -7 130 -94 -22 45 -294
2603 -294 -232 -316 -30 80 -117 -52 42 -113 80 180 70 175 20 156 -252 -105 15 51 23 258 35 -12
2625 -12 80 40 206 -105 -61 13 -143 48 -31 17 108 57 -107 -92 21 -93 -48 241 -53 210 73 -1 143 151 10
2650A0N4j26j33K32k15K5K03j47l2L71k32P5m40J23M28n73M41l14L46j63K54k29
2672d2O6J10k85J41j83K13R8j83J5J37K81m1l33J38l36J32K55M1m62n1M79l14
2694a24RK84l94J74J18p7j18J2J17j49J91l9M5k46J35q8K23k92K08J25j32p8J17
2717B1J34k41N1R2M8j58n0M49k87j51Q4J1k9n3p6L11q7J7N9j59m2L0mJ1P8k01
2743a42Q2P1L5k06o3J11K61m12J36J59l03K90R3k35J11J0J6N5r6p3J08j0K7Jo6
2768d0R7J20k07m7J97j82K37j58r2J02O0j07p4k8k7M20j83n4k16N5L09k14J60
2791A28j18l8J78o8O8j2j86J08k12K45r1N2k6J6kk46k0J33K06M5k87K36k78N6
2815a13J15r2M30M6l35q2k3J72j16J38l36K87j98r0O6L57m8l04m1L1m3J35J28
$$ plain form
2650 10 64 -62 -195 37 -178 -153 50 -97 -129 242 10 85 -355 -232 196 -377 64 -250 96 -67 187 -42
2672 -42 24 134 -151 -10 -193 20 118 -65 -50 87 368 327 -6 132 -204 -72 183 224 -238 -289 190 -124
2694 -124 -115 169 -225 -51 67 -10 -128 -116 1 -148 43 4 49 -197 -62 -150 73 -219 -11 114 -18 -96 21
2717 21 155 -86 -35 57 105 -53 -103 346 59 -92 -8 3 -26 -79 -155 156 69 86 145 -14 -56 -26 -30 -19 59 -142
2743 -142 -60 11 46 -160 -223 -112 149 -263 -127 32 -271 19 112 -123 -12 -2 14 69 -27 -100 8 -2 25 26 -40
2768 -40 57 177 -30 -77 120 -62 175 17 -75 27 87 -20 -94 -122 -149 271 88 34 -182 -127 182 -32 128
2791 128 10 -28 150 82 150 138 -48 60 -152 93 2 54 28 44 42 -204 -224 -91 115 160 -127 109 -169 -113
2815 -113 2 -90 340 386 51 -31 -54 118 2 140 -196 91 -107 -197 -131 226 178 -126 -167 -136 -179 -44 84
2838H4m50J92j7K46K2j59J41K34o7k25l7l46K72J10o0J45JK05k56r3K06j7k60
2861a29K57k22J42r6O4J10j88n9K81j29L6O8k14L36k50k7p1J39M2q1l63K20J70
2884C6k58K68l13J68kL99k48j54J06k46M21n5j67J59l15L15r7n3j43K18j69L25
2906A95k09J50l25J24k16N1L48Oj48o6J96j98R5j95L92j59n8j47K8J00j4K67l20
2929a03m9m0J50J35j78J39j89J83l9j70N9J12j46r2L63k16p2K7O6J2J18k0p8J14
2953H6RM0l11N7P3J60l3k11K81l05J74R2oK41l14q4R0O2k12N0K87j03l10k4J43
2978f8K0O4j35k0K11j07o8K89m0L4k74K69l13j70M01j25r6n0K16J02k32J64q8
3001a6j07J63j18Q8M4j81J82j07K8j41M11n37N65k72n6L9j24K81L7r9R8k58RK72
$$ plain form
2838 84 -366 -174 -191 55 77 -82 59 293 226 1 -36 -382 -110 0 -60 85 86 291 35 -58 148 131 -129
2861 -129 128 -94 48 -48 16 126 -62 -121 160 31 67 135 -79 257 7 -20 -91 48 90 9 -354 -134 36
2884 36 -222 46 -267 -99 -101 298 50 -104 2 -244 177 122 -45 114 -201 114 17 -36 -179 39 -130 195
2906 195 -14 136 -189 -65 -281 -230 118 124 -24 -90 106 -92 3 -192 200 41 -17 -164 -136 -36 -50 217 -103
2929 -103 -152 -192 -42 93 -85 54 -135 48 9 -161 -102 10 -136 -228 135 -81 -153 -126 -60 -48 70 50 -28 86
2953 86 95 135 -176 -119 -46 114 81 -130 151 -154 20 112 106 347 33 -51 39 101 -111 -61 226 123 -187 -211 -68
2978 -68 -48 16 -119 -139 72 -35 -103 186 146 180 -94 175 -138 -308 93 -32 -128 -178 38 140 -92 72 -16
3001 -16 -123 40 -78 10 54 -127 55 -52 -24 -165 246 -291 274 2 -54 -15 -139 142 179 80 178 -80 -71 201
3025B01rl45J90O6j04j9K12k42P3j45K95l56J25K10j94P9j31o1QK41J6k28n5K88
3049A15j53J41j86j0J79j00m6J4j29J39l8Q9O2N0n2j43K57k43j13J97k2j7Mj91
3073a96M27l48K00j32J48j19j02p6J38j10L83l13j92L03j23J75k3j32J34j26J6
3094f8O7L4K15k92n4J58j61J66n7K18j75j76J53K6j05k5J73k10L5J49Qp3Jj03
3118i6Q5O3j68J26J49j74j07J10o8K56j58r0J39r3J93o6l17O9j12M12j84k8L6
3141b3K7j44K35j00m9r2K28r7J84j97l1J8Mo2J87k49Q8J04j8R0l32K21M3K4L7
3166I6K8k5j59L3O3k0r6J52L8n4k00J10j88J71J05l5o5J19k29K24J97k58n2R3
3190D8K9o6O2R0m08K54j20K66k29K49j69k92K68q9L38l52Q1k00K57j45P1j35K86
$$ plain form
3025 201 192 -153 37 103 -1 -20 192 -50 23 -122 173 -183 -58 152 -42 37 -94 -155 -147 94 110 -118 -173 115
3049 115 -38 103 -83 -93 86 -14 -60 -46 -175 -36 -74 15 77 127 75 -68 189 -54 -167 30 8 -9 -5 -196
3073 -196 231 -117 83 -49 99 -20 -122 -198 -60 -170 213 -100 -292 11 -112 63 40 -92 42 -84 -68
3094 -68 -1 33 248 -44 -98 60 -101 65 8 226 51 -125 28 54 -51 -76 97 -113 -78 71 79 6 7 -96
3118 -96 -11 52 -116 10 159 -15 -122 -12 -80 176 18 -72 67 -26 167 101 -216 -147 -259 153 -31 -59 -23
3141 -23 4 -140 95 -5 -54 -146 82 -15 169 -28 -59 -41 -37 -99 88 -161 -73 31 13 103 -229 -8 35 59 96
3166 96 124 99 -60 -27 36 16 -80 72 110 56 -144 -34 -222 -51 54 19 -46 73 -156 68 265 7 -45 48
3190 48 77 11 73 163 -245 9 -111 155 -74 175 6 -286 -18 -107 231 -121 -40 -240 17 -128 -57 -192 94
3213I4n5P3j77k8K24j00J8M8p5l70L69k2P7q1m0m4O3P6N6J4J2J01k78q2M2pj1
3240a03K47j20l45N72m98L45N2r1qo6l2J69k64O5P6j21K12J27l09K10l41K36K27
3263B40k06k31K37J2J94k0q5l57J71N4J5j08K07j63R8j29K71q6J11j80m8l9J3
3286b9l00J78L07n45M20j9N0j56J6K15j72J05O5J98l06J6J75j30M4k44lL8L86
3309C09k75Q7m1P6n4k29J94p9M6L0j65P9J51k5ln6j59J99R8J1l50J62Q6j68L66
3334B90k79L6K04j73M0k27K17l9L68l28j02r9L8O8n4J75j02nR6k1Q3m81K11K63
3358A79j07m4J55k89o9K19J65j06J38k60L90m74J9J92j42oM0J56l65J55Q4J47
3380A77l98J89J26Ml5j85J83m1J4m0l5J0j01K1J20J05J27k05j96J90J48j79r7
$$ plain form
3213 94 39 112 -65 -93 131 31 49 97 22 -348 21 -1 76 -5 -45 -89 -26 50 106 120 132 233 -45 -127 -85 -92 -103
3240 -103 144 24 -321 251 -247 98 150 59 51 -15 -47 122 -142 -77 -1 -122 90 217 -92 118 -223 13 240
3263 240 34 -197 40 52 246 226 141 -216 -45 9 24 -84 123 -40 58 -71 200 114 225 45 -3 -42 -29
3286 -29 -329 -151 156 -389 31 12 62 -94 -78 137 -35 70 135 333 27 43 218 88 132 -112 -115 -77 309
3309 309 34 121 80 156 102 -127 67 -12 34 64 -101 -22 129 104 101 45 -114 85 183 194 -156 6 92 -76 290
3334 290 11 47 251 78 118 -109 108 69 437 109 7 -92 -54 14 -40 135 33 28 124 103 186 -295 -84 179
3358 179 72 28 183 -106 -175 44 209 103 241 -19 371 -103 -84 108 -34 -40 0 156 -209 -54 30 177
3380 177 -221 -32 94 98 63 -122 61 20 34 -6 -41 -31 -132 -111 9 114 241 36 -160 30 178 -1 -98
3403i8K64k54l8J94O3j19k99L40l17L97r9j05j10J00k6r3N8J00k7L06j33o5L7
3426G6j13K66m60P3J80k37J68j85L08p9J15r6J39j33j84J37k4K28l14K69n25L66
3448b5j79N38k04k15K26j09o8J22m4J00k61J3L1J78J88k27nk93J57k2J01K00p7
3471A25K02N0n52M8J64j11J42k8j71K01J42j55k09J27k41J62J15j07O8O7j38K61
3493A62k7L4p8k58L55j85p7K2O0n6l3N1p9R2J94k41J49j99j45K08M9q4J58J05
3517A77l44L05l01Q8J48J53k80K98n7k52Q2l6j12J17k09K65j65l0Q0K42j95j54
3539a80NM04j79j17o3o3K30Lp3j87L85o3l8O3o1N6j60k88O37j06j21j26j23j53
3563c18M34j51m1j80K38k10L36l31M5J62P2j19L31k00k50k67M55J21m0o7k14l9
$$ plain form
3403 -98 166 -88 -126 68 131 12 -287 53 -264 133 34 -71 -181 -81 -107 -200 -142 -42 -69 237 104 39 76
3426 76 -37 229 -231 -158 22 -215 -47 -232 76 -3 112 16 155 22 -162 -25 -49 179 -135 134 -391 -25
3448 -25 -204 334 130 -85 141 32 -36 86 42 142 -119 -106 -75 103 291 64 59 -234 -77 -99 2 202 125
3471 125 327 377 -175 -127 37 -74 68 40 -131 70 212 57 -152 -25 -266 -104 11 -96 -28 39 -99 162
3493 162 135 169 91 -167 188 3 -74 -52 8 -48 -81 -30 -109 -17 177 -64 85 -114 -259 -51 -2 -86 72 177
3517 177 -167 138 -163 -75 73 226 -54 244 187 -65 17 -19 -131 -14 -223 42 -123 -153 -73 169 -26 -180
3539 -180 -175 229 50 -67 -130 -193 37 40 -33 -220 165 102 64 127 66 122 -38 -326 311 205 84 -42 -165 -318
3563 -318 116 -35 -76 -256 -18 -228 108 -223 -178 -16 56 -63 268 68 -182 -449 6 127 87 20 -194 -233
3585b33j33M72j51J54R9k63K04l47PL63n9j18r5J0N0J41m02J77J74oJ79m16K56
3608F3P0r3n6n8l9o4J76J0k58M28k19Lj6k76M47Q2k79j09K77k07J38J95k71j31
3632a87K12k71K84J03j3o4M3J7J4k18J36jk0jK8j8k54L32p1j6j11r1L2J97j72
3657a10K17K5m4j66N3R7n8J28p9r8N7Kl9K43k13R5N8j64J37k90R1j57J51J37l5
3682C8j94K83k24K03j52J56L3l61p0K66o4J12M7P3n2j12K9l4J68j74l1J86Nk20
3706h9J75j46J26O7k51K71k16K18j52J5j02K29j47J3j53K13p4L9k00J7P8J08j36
3729i7JJ58l8K72j65j71J64m1R1p9k56M7R5R2j84o1K79j22O2j8J01l21K07N7j64
3754i1J37K6J39k9l24L3K50k17J52J18k94K35r8J11l62K68k18K40qj25J37k85
$$ plain form
3585 -233 -366 106 -45 109 208 -55 149 -198 -191 172 113 -5 -100 -90 -40 101 -301 -124 50 44 223 -193 63
3608 63 133 40 -16 -74 -113 -177 -1 9 -249 179 -40 -37 -53 -329 118 200 -79 -188 89 -118 20 215 -56 -187
3632 -187 25 -246 38 141 128 64 107 124 138 -80 56 55 35 34 62 44 -210 122 51 35 -76 -167 -135 62 -110
3657 -110 107 132 88 -78 -25 72 14 142 63 -35 22 24 -15 228 15 110 168 4 141 -149 -58 -215 -64 73 38
3682 38 -156 127 -97 106 -46 110 143 -218 -288 -22 -86 26 73 146 94 -18 11 -23 145 -29 -60 126 131 -89
3706 -89 86 -60 66 133 -118 153 -63 155 3 18 -84 145 -2 11 -142 71 -3 36 -164 -147 -69 39 -97
3729 -97 -96 62 24 296 131 -40 124 83 174 95 -161 -114 -19 73 -111 -172 107 -15 47 29 130 -191 16 73 -91
3754 -91 46 72 211 182 -142 -109 141 -76 76 194 -100 135 37 148 -214 54 -164 76 68 -57 80 -205
3776b05K79j7N1j36K61k15j04O5j74R3K1K31l63K05mj76l6M89m62K78K17o84L49
3799c7l3J14j56J46q4L28j55j89J05l8K19m48J73P0j77M27j30K7k46n6K81j00
3821D1n0J1o6J28J10p7k47O4Q9K9K59k00J03m29L48j52M3K1q7J16L34m54j33L38
3845A39q1J56j97N9j94J44K88j04j81j6J80k44R2n4kj00L1lK40K0j17N3l05L9
3869a57R8J63q7l1l9O2j37K59j88J7L96l21k40R2j36M10n9K3r6l6o2K14k20J62
3893H7l50M69j83j41M29nn95M02k31J71l6j60O3J2J61rk5J07l15R5M3j25L20R
3917A93p4J56k73LQk42M40n2M7k3Q0j57J68l08N6P0q9q5jN38m00j5j59q2K63j03
3943d1j0p8K35k40J01k18J49L4J95r9Pm3N5J29j34J34l56k6J83N0m3J2P6j10K17
$$ plain form
3776 -205 74 57 108 -28 233 18 -86 -21 -195 -102 -81 150 -213 -8 -12 -188 -224 265 -197 81 298 -386 -37
3799 -37 -70 44 -112 34 -50 278 123 -66 39 1 220 -228 -55 15 -162 265 135 162 -84 -140 141 41
3821 41 -9 2 -64 64 174 97 -150 -86 3 32 291 91 194 -235 113 -39 4 25 -62 54 388 -66 -199 139
3845 139 58 214 17 76 -118 26 314 210 29 13 193 -51 41 -13 -15 -115 -84 -87 153 173 56 109 -196 -157
3869 -157 -59 104 17 -14 -53 9 -128 131 -57 -40 356 35 -205 -113 -249 161 102 125 29 -7 -69 145 -75 87
3893 87 -263 206 23 -118 311 306 -289 113 -118 53 17 -143 -80 -68 93 84 59 166 -149 -54 -11 -136 184 193
3917 193 119 275 2 5 13 -229 211 159 206 183 263 106 274 -34 22 92 3 -82 -83 455 55 40 -119 -201 62 -41
3943 -41 -51 -129 106 -134 -33 -251 -102 -68 127 28 35 -8 47 176 42 176 -180 -206 -23 27 -16 -4 72 -38 179
3968A79k07J69k73j0K72m1P7j0j90J35k3l12K22J21l3J95k99L1k6j20K55o1o2
3991a1L4rO6l48L17k61N06j87o5Nj00j59M12j83l03L18q3m9j14M81j16J19k71
4014aj2n5K62m81M55J8k66J26k00J20P7k00M8J68k53K29K87k01N7j98J14l8J25
4037A81K09m06L06l56Mm6L14k56J87m0j77J3N3p4k9j80N53j94Q9J70m52K11P7
4060A57p2r6K36k33L32n50K90N7r3J48k61Q6M0K50m76J80J10k40N8J3R5k0p2q1
4084a42j5M4m1K56j14J61M3r0o8J8j36j14L80m4J00j45l6L7j52m0N7m5oMJ67q6
4110gJ55j49j52K72j1J5q4j51J3M33m97N37l32l8n3n2J92J8J26l12J49l0J39j41
4134D0l8k04J88j20K20l84K80M0k4O0r9K02k03O0j44K8K47P8l93K67j31J52N5
$$ plain form
3968 179 -28 141 -132 -142 130 89 166 156 -34 101 78 -234 -12 109 76 271 -28 3 -23 -143 112 51 -11
3991 -11 23 14 80 -268 49 -212 294 107 42 47 -53 -212 200 17 -286 32 -51 -100 -214 267 151 270 -1
4014 -1 -13 -68 194 -287 168 186 -80 46 -154 -34 43 -157 -109 59 -194 35 322 121 178 -20 94 56 181
4037 181 390 -16 290 -66 -62 -108 206 -50 137 97 -80 -67 -14 -88 -117 -297 256 62 151 321 -131 80 157
4060 157 85 -11 225 -8 324 -226 64 121 28 176 -85 1 41 291 -185 -5 105 -135 -77 -64 31 11 -61 -142
4084 -142 -157 -113 -154 102 -12 149 192 102 34 52 -84 -198 182 138 238 93 57 94 -58 -98 -41 -86 -92 -88 79 -7
4110 -7 148 -1 -153 119 108 123 39 -112 -99 334 -163 374 42 4 -49 -101 91 109 235 -77 72 42 181 40
4134 40 2 -202 -14 -134 86 -298 -18 22 -2 58 -41 161 -42 18 -126 -98 149 227 -166 101 -30 122 177
4157A77l94L72j6m3o4j70M1r0rL10j39J74l65J79j91J24J47L8p3k5P9j66J07m8
4181d5J57j82j50M43l02M59l03o6j21J14J47J38Ok88j3j10Q0p6L2P4k6J02q4m9
$$ plain form
4157 177 -217 155 139 96 32 -138 -97 -187 -196 114 -25 149 -216 -37 -228 -104 43 81 8 -17 62 -104 3 -45
4181 -45 112 -70 -220 223 -79 380 77 11 -110 4 151 289 295 7 -6 -116 -36 -112 -80 -6 -32 70 -14 -63
$$ [...]
8191A51
##END NTUPLES=NMR FID
##END=
