##TITLE=1H_DE-106_ch_9_TFA
 200.13MHz, CDCl3,
 8 sc
 
 20.8.2025
##JCAMPDX= 6.0         $$ Bruker NMR JCAMP-DX V2.0
##DATA TYPE= NMR FID
##DATA CLASS= NTUPLES
##ORIGIN= UXNMR, Bruker Analytische Messtechnik GmbH
##OWNER= pz
$$ XWIN-NMR		Version 3.5
$$ Wed Aug 20 13:54:47 2025 Russian Standard Time (UT+4h)  she@DPX200
##.OBSERVE FREQUENCY= 200.1308
##.OBSERVE NUCLEUS= ^1H
##.DELAY= (6, 6)
##.ACQUISITION MODE= SIMULTANEOUS
##.ACQUISITION SCHEME= undefined
##.AVERAGES= 8
##.DIGITISER RES= 18
##SPECTROMETER/DATA SYSTEM= spect
##.PULSE SEQUENCE= zg30
##.SOLVENT NAME= CDCl3
##.SHIFT REFERENCE= (INTERNAL, CDCl3, 0, 14.3821)
##AUDIT TRAIL= $$ (NUMBER, WHEN, WHO, WHERE, WHAT)
$$ ##TITLE= Audit trail, XWIN-NMR		Version 3.5
$$ ##JCAMPDX= 5.01
$$ ##ORIGIN= Bruker BioSpin GmbH
$$ ##OWNER= she
$$ F:/spectra/data/she/nmr/H-C/1/audita.txt
$$ ##AUDIT TRAIL=  $$ (NUMBER, WHEN, WHO, WHERE, WHAT)
(   1,<2025-08-20 13:52:34.17 +0400>,<she>,<DPX200>,
      <created by zg, POWCHK disabled, PULCHK disabled
       configuration hash MD5:
       00 E9 B6 7A A2 85 ED C7 34 08 36 98 17 FE 4E 26
       data hash MD5: 16K
       22 D8 BC FB 1E A8 28 0C 29 CD 78 69 9E CE A1 37>)
$$ ##END=
$$ 
$$ hash MD5
$$ 8F 8C 2C 6C 85 C1 6C 41 46 41 7F 54 92 BE C0 A9
##$RELAX= 
##$RELAX= 
##$RELAX= 
##$RELAX= 
##$RELAX= 
##$RELAX= 
$$ Bruker specific parameters
$$ --------------------------
##$DU= <F:/spectra>
##$EXPNO= 1
##$NAME= <H-C>
##$PROCNO= 1
##$TYPE= <nmr>
##$USER= <she>
##$AMP= (0..31)
100 100 100 100 100 100 100 100 100 100 100 100 100 100 100 100 100 100 
100 100 100 100 100 100 100 100 100 100 100 100 100 100 
##$AQSEQ= 0
##$AQ_mod= 1
##$AUNM= <au_zg>
##$AUTOPOS= <>
##$BF1= 200.13
##$BF2= 200.13
##$BF3= 200.13
##$BF4= 200.13
##$BF5= 200.13
##$BF6= 200.13
##$BF7= 200.13
##$BF8= 200.13
##$BYTORDA= 1
##$CFDGTYP= 0
##$CFRGTYP= 5
##$CHEMSTR= <none>
##$CNST= (0..31)
1 1 145 1 1 1 1 1 1 1 1 1 1 1 1 1 1 1 1 1 1 1 1 1 1 1 1 1 1 1 1 1 
##$CPDPRG= <>
##$CPDPRG1= <>
##$CPDPRG2= <>
##$CPDPRG3= <>
##$CPDPRG4= <mlev>
##$CPDPRG5= <mlev>
##$CPDPRG6= <mlev>
##$CPDPRG7= <mlev>
##$CPDPRG8= <mlev>
##$CPDPRGB= <>
##$CPDPRGT= <>
##$D= (0..31)
0 0.7 0 0 0 0 0 0 0 0 0 0.03 0 0 0 0 0 0 0 0 0 0 0 0 0 0 0 0 0 0 0 0 
##$DATE= 1755683553
##$DBL= (0..7)
120 120 120 120 120 120 120 120 
##$DBP= (0..7)
150 150 150 150 150 150 150 150 
##$DBP07= 0
##$DBPNAM0= <>
##$DBPNAM1= <>
##$DBPNAM2= <>
##$DBPNAM3= <>
##$DBPNAM4= <>
##$DBPNAM5= <>
##$DBPNAM6= <>
##$DBPNAM7= <>
##$DBPOAL= (0..7)
0.5 0.5 0.5 0.5 0.5 0.5 0.5 0.5 
##$DBPOFFS= (0..7)
0 0 0 0 0 0 0 0 
##$DE= 6
##$DECBNUC= <off>
##$DECIM= 32
##$DECNUC= <off>
##$DECSTAT= 4
##$DIGMOD= 1
##$DIGTYP= 9
##$DL= (0..7)
0 120 120 120 120 120 120 120 
##$DP= (0..7)
150 150 150 150 150 150 150 150 
##$DP07= 0
##$DPNAME0= <>
##$DPNAME1= <>
##$DPNAME2= <>
##$DPNAME3= <>
##$DPNAME4= <>
##$DPNAME5= <>
##$DPNAME6= <>
##$DPNAME7= <>
##$DPOAL= (0..7)
0.5 0.5 0.5 0.5 0.5 0.5 0.5 0.5 
##$DPOFFS= (0..7)
0 0 0 0 0 0 0 0 
##$DQDMODE= 0
##$DR= 18
##$DS= 0
##$DSLIST= <SSSSSSSSSSSSSSS>
$$ [...]
##$SUBNAM0= <"">
##$SUBNAM1= <"">
##$SUBNAM2= <"">
##$SUBNAM3= <"">
##$SUBNAM4= <"">
##$SUBNAM5= <"">
##$SUBNAM6= <"">
##$SUBNAM7= <"">
##$SUBNAM8= <"">
##$SUBNAM9= <"">
##$SW= 18.0517779522481
##$SWIBOX= (0..15)
0 0 2 0 0 0 0 0 0 0 0 0 0 0 0 0 
##$SW_h= 3612.71676300578
##$TD= 16384
##$TD0= 1
##$TE= 0
##$TE2= 300
##$TE3= 300
##$TEG= 300
##$TL= (0..7)
0 120 120 120 120 120 120 120 
##$TP= (0..7)
150 150 150 150 150 150 150 150 
##$TP07= 0
##$TPNAME0= <>
##$TPNAME1= <>
##$TPNAME2= <>
##$TPNAME3= <>
##$TPNAME4= <>
##$TPNAME5= <>
##$TPNAME6= <>
##$TPNAME7= <>
##$TPOAL= (0..7)
0.5 0.5 0.5 0.5 0.5 0.5 0.5 0.5 
##$TPOFFS= (0..7)
0 0 0 0 0 0 0 0 
##$TUNHIN= 0
##$TUNHOUT= 0
##$TUNXOUT= 0
##$USERA1= <user>
##$USERA2= <user>
##$USERA3= <user>
##$USERA4= <user>
##$USERA5= <user>
##$V9= 5
##$VALIST= <valist>
##$VCLIST= <CCCCCCCCCCCCCCC>
##$VD= 0
##$VDLIST= <DDDDDDDDDDDDDDD>
##$VPLIST= <PPPPPPPPPPPPPPP>
##$VTLIST= <TTTTTTTTTTTTTTT>
##$WBST= 1024
##$WBSW= 4
##$XGAIN= (0..3)
0 0 0 0 
##$XL= 0
##$YL= 0
##$YMAX_a= 250939
##$YMIN_a= -307977
##$ZGOPTNS= <>
##$ZL1= 120
##$ZL2= 120
##$ZL3= 120
##$ZL4= 120
##$ABSF1= 10
##$ABSF2= 0
##$ABSG= 5
##$ABSL= 3
##$ALPHA= 0
##$AQORDER= 0
##$ASSFAC= 0
##$ASSFACI= 0
##$ASSFACX= 0
##$ASSWID= 0
##$AUNMP= <proc_1d>
##$AZFE= 0.1
##$AZFW= 0.1
##$BCFW= 1
##$BC_mod= 2
##$BYTORDP= 1
##$COROFFS= 0
##$CY= -3
##$DATMOD= 1
##$DC= 2
##$DFILT= <>
##$DTYPP= 0
##$F1P= 0
##$F2P= 0
##$FCOR= 0.5
##$FTSIZE= 0
##$FT_mod= 4
##$GAMMA= 1
##$GB= 0.15
##$INTBC= 1
##$INTSCL= 1
##$ISEN= 128
##$LB= 0.25
##$LEV0= 0
##$LPBIN= 0
##$MAXI= 10000
##$MC2= 0
##$MEAN= 0
##$ME_mod= 0
##$MI= 1.114404
##$NCOEF= 0
##$NC_proc= 0
##$NLEV= 6
##$NOISF1= 3.799351
##$NOISF2= 2.8
##$NSP= 1
##$NTH_PI= 0
##$NZP= 0
##$OFFSET= 14.38212
##$PC= 1
##$PHC0= -1545.319
##$PHC1= -10.20772
##$PH_mod= 1
##$PKNL= yes
##$PPARMOD= 0
##$PSCAL= 0
##$PSIGN= 0
##$REVERSE= no
##$SF= 200.129724274929
##$SI= 16384
##$SIGF1= 3
##$SIGF2= 2
##$SINO= 400
##$SIOLD= 16384
##$SREGLST= <1H.CDCl3>
##$SSB= 0
##$STSI= 0
##$STSR= 0
##$SW_p= 3205.1282051282
##$SYMM= 0
##$S_DEV= 0
##$TDeff= 0
##$TDoff= 0
##$TI= <>
##$TILT= no
##$TM1= 0
##$TM2= 0
##$TOPLEV= 0
##$USERP1= <user>
##$USERP2= <user>
##$USERP3= <user>
##$USERP4= <user>
##$USERP5= <user>
##$WDW= 1
##$XDIM= 8192
##$YMAX_p= 0
##$YMIN_p= 0
$$ End of Bruker specific parameters
$$ ---------------------------------
##NTUPLES= NMR FID
##VAR_NAME=  TIME,          FID/REAL,        FID/IMAG
##SYMBOL=    X,             R,               I
##VAR_TYPE=  INDEPENDENT,   DEPENDENT,       DEPENDENT
##VAR_FORM=  AFFN,          ASDF,            ASDF
##VAR_DIM=   8192,          8192,            8192
##UNITS=     SECONDS,       ARBITRARY UNITS, ARBITRARY UNITS
##FACTOR=    0.0002768,     1,               1
##FIRST=     0,             0,               0
##LAST=      2.2672688,     0,               0
##MIN=       0,             -307977,         0
##MAX=       2.2672688,     250939,          0
$$ Real data points
##PAGE= N=1
##DATA TABLE= (X++(R..R)), XYDATA
$$ [...]
1794b02K95K30l16o2Mj71M16j81J89k8l48J70J57k28J4P3j19R7j25J31k61p7L90
$$ -202 93 323 7 -55 -51 -222 194 13 202 174 -174 -4 153 -75 -61 12 -107 -10 -135 -4 -265 -342 48
1817D8j88J83k36J75l94L18J79O1j10q4JO8k32n0J29K51l3l35L16k91K69J36j1
$$ 48 -140 43 -193 -18 -412 -94 85 146 36 -48 -47 21 -211 -261 -132 119 86 -249 67 -224 45 181 170
1840A70j08o6J22o6N0r8L6Nj8j40j93L56n2m9N1k72N52m45L6LJ30L60m74K62m1
$$ 170 62 -4 118 52 102 4 40 45 27 -113 -306 50 -2 -51 0 -272 280 -165 -129 -126 4 364 -110 152 111
1865A11q4j18J40P2r5j37l8o7L50l52J34j65K40j7n2J02j72K27m7J47l97K21n1
$$ 111 27 -91 49 121 26 -111 -149 -216 134 -218 -84 -249 -9 -26 -78 24 -148 79 32 179 -218 3 -48
1888d8k18M9L1J36jP2k23Q5K06j65K26j11k3J07p2m6l3M1O0k0l49M44M6k67J80
$$ -48 -266 -217 -186 -50 -51 21 -202 -117 89 -76 150 39 16 123 51 5 -28 13 73 53 -296 148 194 -73 107
1913A07O7q6k33P8k9q7J34K95k86J9n7o9L94j80q4J5N6j58j02L14k01K10j13K06
$$ 107 174 88 -145 -67 -96 -183 -49 246 -40 -21 -78 -147 247 67 -17 -2 54 -104 -206 108 -93 117 4 210
1937B10k00J14K1j50k9j7J60p2j08K20k45K63j19J56j26k42L47l6j02n3L56l29
$$ 210 10 124 145 -5 -34 -51 109 37 -71 149 -96 167 48 204 78 -164 183 147 45 -8 348 19
1959A9K07k28p4N6j78J97j94k05M65O3R7l52J45l4J76L0Ok94K92k39K83L4l32
$$ 19 226 -2 -76 -20 -198 -1 -195 -400 65 128 225 -127 18 -16 160 190 196 -98 194 -45 238 272 -60
1982f0J2k5j23R8j70L42l8N0j39J13n2P9o9j46J98o2o4r4L02l68K90j04j91K47
$$ -60 -48 -73 -196 -98 -268 74 36 86 -53 60 8 87 18 -128 70 8 -56 -150 152 -216 74 -30 -221 26
2006B6r7J27m8K25l12K80R2m90O4K80k05J1r6J07P7K1n3J1j78Lj10Q6Q2j2P6N3
$$ 26 -71 56 8 233 -79 201 293 -197 -133 147 -58 -47 -143 -36 41 62 9 20 -158 -155 -265 -179 -97 -109 -33 20
2032B0J58l98L41j3N2j44Q6j81K42j84k07L22k88o4K46N1O4%j02O3J9k66J73R4
$$ 20 178 -220 121 108 160 16 102 -79 163 -21 -228 94 -194 -258 -12 39 103 103 1 64 83 -183 -10 84
2056H4L0n6M38l46l53k3M72j22j06Lj69J10J47k07M18j09j81J53k71k9p3J81p6
$$ 84 114 58 496 150 -203 -226 246 124 18 21 -148 -38 109 -98 320 211 30 183 -88 -117 -190 -9 -85
2079h5L27k09N7j38k4k6J98J3o8Q5L46k72P7j97k0k17M5L0J21p0j14J89r7Q7k14
$$ -85 242 33 90 -48 -72 -98 100 113 45 130 476 204 281 84 64 -153 -108 -78 43 -27 -141 48 -49 38 -176
2104a76L23n6R5m31J19J4P2J33k63K54k0J97j42J41l01K3r3Q0O3R4j67j22K51
$$ -176 147 91 186 -245 -126 -112 -40 93 -170 84 64 261 119 260 -41 -18 -111 -31 32 126 -41 -163 88
2127H8j27J93k2k97k24K9J48k7J66J36l6k72L68j09P6J87k96j05K08k33j54K36
$$ 88 -39 154 132 -165 -389 -360 -212 -239 -73 63 27 -245 123 14 90 277 -19 -124 84 -149 -303 -67
2149f7q5J92j21P8O1j35k8J41J1N1j41m4M1J19J6j48L67m23O7j66K93Qj04M8k12
$$ -67 -152 40 -81 -3 58 -77 -105 36 47 98 -43 -87 -46 73 89 -59 308 -115 -48 -214 79 87 -17 31 -181
2174a81K83j75k31J33J5R5J82j50J55j34L39m30K37o9j35J61j1l39J58J36k16
$$ -181 102 -73 -304 -171 -156 -61 121 -29 126 -8 331 -99 138 69 -66 95 84 -255 -97 39 -177
2195a77j03J02K67o2K51k14N2j74K39j69q4J09l00L68j17r6J0M0k62L98l19J89
$$ -177 -280 -178 89 27 278 64 116 -58 181 12 -72 37 -263 105 -12 -108 -98 -58 -320 78 -241 -52
2217e2J96j77j52K71J01k81L42k95J86o7j11L21k54L24l65j75K37J64k48RLK9
$$ -52 144 -33 -185 86 187 -94 248 -47 139 72 -39 282 28 352 -13 -188 49 213 -35 -26 -23 6
2239FK82q9l14n8j6K27j44Q1j40L09m35L24K4J32j85J26p5Nq3O8K04j95P8k51
$$ 6 288 199 -115 -173 -189 38 -106 -25 -165 144 -291 33 57 189 4 130 55 60 -23 45 249 54 132 -119
2263a19J33j67K8N2R5j24K79j88J23P9r5j81k5J63J22m18L93k49K46o2R4j55n1
$$ -119 14 -153 -125 -73 22 -102 177 -11 112 191 96 -85 -110 53 175 -243 150 -99 147 85 179 24 -27
2286b7O6k62K84k83J08K64m14N21l77M6J88L6k37J49J33k63j2j19n9K10j23K58
$$ -27 39 -223 61 -222 -114 150 -264 257 -120 -74 114 150 -87 62 195 -68 -80 -199 -258 -48 -171 87
2308H7j45J66j5P1j44j20r0J65M29o10K84J6m28M95k6m0k35R9p9J28r4N6L03j94
$$ 87 -58 108 93 164 20 -100 -190 -25 404 -206 78 94 -334 161 135 95 -140 -41 -120 8 -86 -30 273 79
2332G9k73K81J61k27J2J38k72j46L35k43L66k34O3j9J04m8k98M44j69J02j39n8
$$ 79 -194 87 248 21 33 171 -101 -247 88 -155 211 -23 40 21 125 77 -221 223 54 156 17 -41
2354d1k00O58k93j86m8rK29k0M9k59L9J54P5r4q7M6r7L40k19m10J28J15L01r1
$$ -41 -241 417 124 -62 -110 -119 110 90 139 -120 -81 73 148 54 -33 13 -84 256 37 -373 -245 -130 171 80
2378H0L0j48M8J9L03j54k14J37p1L6q0L3k93K01m9N7j07L27k76J85m19K76K78
$$ 80 110 -38 10 29 332 178 -36 101 30 66 -14 19 -274 -73 -122 -65 -172 155 -121 64 -355 -79 199
2401A99k30%K34l10l8J19N5k31L3l5rM79l28K11k19k24O51k99j73l8L23k71J43
$$ 199 -31 -31 203 -107 -145 -26 29 -202 -169 -204 -213 266 -62 149 -70 -294 357 58 -115 -153 170 -101 42
2424D2j73J18m03M34R3K35p5J17n18M1K60k61L01q2l5k43M00l52j2J59o0Nj25
$$ 42 -131 -13 -416 18 111 346 271 388 -130 -89 171 -90 211 129 94 -149 251 -101 -113 46 -14 -9 -134
2447a34O4J53J15j72p5J48q5Mj65J91k24J94J92l13J62j17k67L91q4j74J13K09
$$ -134 -70 83 198 26 -49 99 14 18 -147 44 -180 14 206 -107 55 -62 -329 62 -22 -196 -83 126
2469A26o8K73k46K28l94J41m2R2l55K01K73o52L59L4l16L17J92l38L03q7M1j97
$$ 126 58 331 85 313 -81 60 18 110 -245 -44 229 -423 -64 -30 -346 -29 163 -175 128 41 82 -115
2491a15K61l88J92j9l6M5J57n2K0k32R3Q6kR6n1j83RK14j5J36q7qJ61j69j4J4
$$ -115 146 -242 -50 -69 -105 -60 97 45 65 -167 -74 12 10 106 55 -128 -119 95 80 216 129 121 282 113 99 113
2517A13j08k3J62k65J70l29L38K09j88k63K75K7M8N2j40mj12J56k28Q4r7J24N1
$$ 113 5 -18 144 -121 49 -280 58 267 79 -184 91 118 166 218 78 74 -38 118 -110 -26 -123 1 52
2540E2j30J37j57J18J53k95j64M71j62Q7L54m26P0j95L25k25O1j39N5m7P3M7k04
$$ 52 -78 59 -98 20 173 -122 -286 185 23 110 464 38 108 -87 238 13 74 -65 -10 -57 16 63 -141
2563a41J00J18j4N0LJ67k28J24j31n7J1qJ02J5k79L5J84J03j95N9R7N5j40J06
$$ -141 -41 77 63 113 116 283 55 179 48 -9 2 -6 96 111 -168 -133 51 154 -41 18 115 170 30 136
2587A36k31L4J2Q6L7k4L0j97K3L8Q0k9p9L0R1o8n7o4J88n2KL9N5j48K24J46j92
$$ 136 -95 -61 -49 37 74 50 80 -117 -94 -56 24 -5 -84 -54 37 -31 -88 -152 36 -16 -14 25 80 -68 156 302 110
2614A10m28M99j86j18K41j19r2o4M2O6N1J61k51M5J76j60j11J93J2k40m5M16j54
$$ 110 -318 181 -5 -123 118 -1 -93 -157 -115 -49 2 163 -88 -43 133 -27 -138 55 67 -173 -218 198 44
2637D4j19J21k59K81j30J23k14M77j76oj19j81LJ82M8j72L9K87m25J69j34q6J93
$$ 44 -75 46 -213 68 -62 61 -153 324 148 142 23 -158 -155 27 75 -97 -58 229 -196 -27 -161 -247 -54
2660e4j00K89q4k02L73pj37q9MK9j92PK92l51J07n7N73m11j04l8P6n5J39j50L27
$$ -54 -154 135 51 -151 222 215 78 -11 -7 22 -170 -163 129 -222 -115 -172 401 -10 -114 -152 -76 -131 8 -142 185
2685A85k98J84j78N07k97j51L37k89M9k08K47kll4ro6J95k57m7L62q3k89n5J53
$$ 185 -113 71 -107 400 103 -48 289 0 49 -159 88 86 83 49 40 -26 169 -88 -135 227 144 -145 -200 -47
2709d7k2R0p4j01M76n67L33k83M47K2k94K0J32j62K34k79o3K82j6j66J96n99N09
$$ -47 -69 21 -53 -154 322 -245 88 -195 252 274 -20 0 132 -30 204 -75 -138 144 128 -38 158 -441 68
2732F8m1j01q1L68o1k8k90Q7O1K35l89l6J12K73k05O6K4k08K80j29l2L48l81J56
$$ 68 27 -74 -155 213 152 124 -166 -79 -18 217 -172 -208 -96 177 -28 38 62 -146 134 5 -27 321 -60 96
2756I6J27m87K18J85q3J10n3J44j78j79L93m76J8R8l1j5J35k59L92M5j77J17J09
$$ 96 223 -264 -46 139 56 166 113 257 79 -100 293 -183 -165 -67 -98 -113 22 -237 155 200 23 140 249
2779B49k95N9r3L0k47J57j19M59k36K72k66N2j2p7J95p2k93J66J12M9J25p3l99
$$ 249 -46 13 -80 -50 -297 -140 -259 200 -36 236 -30 22 10 -67 128 56 -237 -71 41 90 215 142 -257
2802b57N77k76J28k13K19j16J22j07j36NJ07R0j56L7J00l04L86k92J4O0J43q2
$$ -257 320 44 172 -41 178 62 184 77 -59 -54 53 143 -13 24 124 -180 206 -86 -72 -12 131 49
2824D9K04k5Lj20N7p8j69r3K93l6Q5m24M51o5J5n0j11o2j71L17L4m03J40M62l62
$$ 49 253 228 231 111 168 90 -79 -172 121 85 170 -254 197 132 147 97 -14 -76 -247 70 104 -299 -159 303 -59
2849e9j19n4K35R8K9j17j61J72q4P2k1R7m45K31K59m7j97K35k9j49N8Q4j65k2
$$ -59 -178 -232 3 101 130 13 -148 24 -60 12 -9 88 -357 -126 133 86 -111 124 95 -54 4 88 -77 -99
2873i9J16R4k10J11q4l89L78K78n0n4k24j00J14Q2J28j02mj61L28k04J40n1m8
$$ -99 17 111 -99 12 -72 -461 -83 195 145 91 -133 -233 -119 -37 91 -11 -15 -176 152 -52 88 37 -11
2896a1J13q0K7o1m0r4J72k06K70k33J00j59K32j1j78L81j95q4M76l54n8Q2j72
$$ -11 102 22 49 -12 -52 -146 26 -180 90 -143 -43 -202 30 19 -159 222 27 -57 419 65 7 89 -83
2919h3J09l08L00J42J28j86N3k07n2Q4J89o1O9j18k48Nj45J60K27j80P0K47k74
$$ -83 26 -282 18 160 288 102 155 -52 -104 -20 169 108 177 59 -189 -184 -329 -169 58 -122 -52 195 -79
2942g9k8K02j49P9q2J28N9j28J29j18J2q6L60m65J10K9Q2P4N9o8j09%m7K69j92
$$ -79 -107 95 -54 25 -57 71 130 2 131 13 25 -61 299 -166 -56 -27 55 129 188 120 11 11 -36 233 41
2967D1m5J15PJ89m38K24k4k91J57O2p7J3pp7J35N6r6N7mN0K3Q4j10Q7k00q0K81
$$ 41 -4 111 118 307 -131 93 69 -222 -65 -3 -80 -67 -74 -151 -16 40 -56 1 -3 47 70 154 44 131 -69 -149 132
2994A32j52j36J58R6j46J6RqJ01l95K14N7K83j44l51O6K02KM8j23j80l1L14l8
$$ 132 -20 -156 2 98 -48 -32 -23 -31 70 -325 -111 -54 229 85 -266 -200 2 4 52 -71 -251 -282 32 -6
3018fr9J1M7j66jK13j62NR0oJ82k40R9m9N8J26k31k6J8J34J27J6j22k11J70K30
$$ -6 -105 -94 -47 -213 -214 -1 -163 -158 -68 -74 108 -132 -33 -82 -24 102 -129 -155 -137 -3 124 140 18 -193 -23 207
3044B07j85J0Q0o8O0j43J62l12K87l18J66o3K12J70j32m6k68O9L83q3N9k59K42
$$ 207 22 32 112 44 104 -39 123 -189 98 -220 -54 -117 95 265 133 87 -181 -112 271 188 247 -12 230
3067B30j98j37l3J39k5j7l0M40l83PJ23k92J16j02K1K2K45o6o4k3k38J84M10j81
$$ 230 32 -105 -138 1 -24 -41 -71 369 -14 -7 116 -176 -60 -162 -141 -119 126 60 -4 -27 -265 -81 329 148
3091A48m56L08j84PK83m6L4J29j14j21J03j00J96k26r9P5rJ3R0j5k39M7J26k2
$$ 148 -308 0 -184 -177 106 60 94 223 109 -12 91 -9 187 -39 -138 -63 -72 -59 31 16 -223 -176 -50 -72
3115g2r8O02l95j09J88j87J8J95m17J88J53k0l3l69N45k26m3K06m1k60NL19j99
$$ -72 -170 432 37 -72 116 -71 -53 142 -275 -87 66 46 13 -356 189 -37 -80 126 85 -175 -170 149 -50
3138e0oK35k74NK47l50l0L12J05j5j41MM2l9J7m4R3o5P5j20J8o2J52r5Q3j67j98
$$ -50 -56 179 -95 -90 157 -193 -223 89 194 179 38 42 84 45 62 18 111 46 121 1 19 -43 109 14 97 -70 -268
3165b68K50j49K32l9J4J07m10J70P9j8O7K04r7j75J50L0j81J23j08J6j10Q7J0
$$ -268 -18 -167 65 26 40 147 -263 -93 -14 -32 35 239 142 -33 117 147 -34 89 -19 -3 -113 -26 -16
3188a6K70q4m28J97j61L50j03r2J51j79O7J9j17K88k87L86k97j02N7Q6m8r0M2
$$ -16 254 170 -258 -61 -222 128 25 -67 84 -95 -28 -9 -126 162 -125 261 -36 -138 -81 5 -43 -133 -91
3211i1J32q0J58j10Q2k1q6N9K73m56M05k45l15m1J80J97K21l53k02P37m64j81
$$ -91 41 -39 119 9 91 70 -16 43 316 -140 265 20 -295 -336 -156 41 262 -91 -293 444 -20 -201
3233b01K78q1J3j2L7j50j86K63J88p9n3m6k59K94j55J93j00M3rK46r3o1K2m3J54
$$ -201 77 -4 9 -3 34 -116 -302 -39 149 70 17 -29 -288 6 -149 44 -56 -13 -22 224 131 70 92 49 203
3258B03j81q9o1n2K41L7m4j49J60j05j22L1J75J3oN3j29J78j90m6K69j15Pl34
$$ 203 22 -67 -128 -180 61 98 54 -95 65 -40 -162 -131 44 57 51 104 -25 153 -37 -83 186 71 78 -256
3282b56N3K19k80J99K25N9q5j70P6RJ1l1J28k20R8qK53k42n5N89o32j8J47K1r1
$$ -256 -203 16 -264 -65 160 219 134 -36 40 49 60 29 157 -63 35 27 280 38 -17 572 -60 -78 69 90 -1
3307al13M14oN5j9k60J38M1J67m41q3J70J60q1J49N4j97m6k38M42k7O0j91J4k2
$$ -1 -314 100 94 149 130 -130 8 49 216 -225 -308 -138 22 -59 90 144 -53 -99 -337 105 78 138 -53 -39 -61
3332f1K20L1l52J76K34j99j1O0j34o0J47J36l20k19K52J36k0k9o5R6J99l46K07
$$ -61 159 190 -162 14 248 49 38 98 -36 -96 51 187 -133 -352 -100 36 16 -13 -78 18 217 -129 78
3355G8p2n5J07l0j11Q6l29M61j49j47L58k97L12m8j39L5j16J35k4m6j8j96K07
$$ 78 6 -49 58 28 -83 3 -326 135 -14 -161 197 -100 212 164 25 60 -56 79 55 9 -9 -205 2
3378BJ6o2J77q7l25J43L12l15J68q8j6J18Op5kJ25n0l05K33M1J28j53j7nk70L12
$$ 2 18 -44 133 46 -279 -136 176 -139 29 -59 -75 43 49 -26 -28 97 47 -258 -25 16 144 -9 -26 -31 -301 11
3404A1J07j78J62kP2k10j15N2MJ73k74K91L2o7l77L82o1k21K13L0p8L29Km30K62
$$ 11 118 -60 102 100 172 -38 -153 -101 -97 76 -198 93 125 58 -319 63 2 -219 -6 24 -54 275 277 -153 109
3429A09J8j61J91n7j34J8n8k99K53K8J52k73K91n8Q6p3n3j03p2N9K04j94J30J18
$$ 109 127 -34 157 100 -34 -16 -74 -373 -120 -92 60 -213 78 20 106 33 -20 -123 -195 -136 68 -126 4 122
3453A22Ll45J54M49m34P0J11j55J15r5J56j98Q6J84j52m7k99L08j11J96k64M4
$$ 122 125 -220 -66 383 -51 19 130 -25 90 -5 151 -47 39 223 71 24 -275 33 -78 118 -146 -102
3475a02J12qK33j18j50o6K61j48N4l28JJ43J22j04J17k74O7R3K89k3j72P7j97
$$ -102 10 2 235 117 -33 -99 162 14 68 -260 -259 -116 6 -98 19 -255 -188 -95 194 171 -1 76 -121
3498a21J38k24l2K22n5k1J81k14J12J99j67j5K3K32k77k7J47J53j71m2j90K32
$$ -121 17 -207 -239 -17 -72 -93 88 -126 -14 185 18 3 26 258 -19 -46 101 254 83 41 -149 83
3520H3nM5q4mk22J34N5P0j33J15q5r0M5N9M3J04n2l7j61J84j9j35M61m51J80j35
$$ 83 78 123 39 35 -187 -53 2 72 -61 54 -31 -121 -76 -17 26 130 78 41 -120 64 45 -90 371 -80 100 -35
3546c5N6j98K97or4J12k84O6P9J27p4J03j70J54m42K12l02L80L0l18Q3K48O7j56
$$ -35 21 -177 120 114 20 132 -152 -86 -7 120 46 149 -21 133 -309 -97 -399 -19 11 -307 -224 24 91 -65
3570f5J02J36o6q2j58M7J03L5J93j73p6k24J95K88r1N2l47PP7M6n0Q0j31O2M4
$$ -65 37 173 107 25 -133 -86 17 52 245 72 -4 -228 -33 255 164 216 -131 -124 -47 -1 -51 29 -102 -40 4
3595Dk58K40j93K29j36pJ94q0j68L47k33j03l04N60O2k88L66m60J71j71L53j92
$$ 4 -254 -14 -207 22 -114 -121 73 -7 -175 172 -61 -164 -468 92 154 -134 232 -228 -57 -228 125 -67
3617f7o5K79k48l5J24P4N1m5k3k03K36k19K68m4m9J56q5j49L8Q8l3J18j78J81
$$ -67 -132 147 -101 -136 -12 62 113 68 45 -158 78 -141 127 83 34 190 105 -44 -6 82 49 167 -11 170
3641A70lK32l88r2J27l67K04q0N7j06J15j73K37Qp6J23%R0n6M4J22j43j77K69
$$ 170 167 399 11 -81 46 -321 -117 -197 -140 -246 -131 -304 -67 -59 -135 -12 -12 78 22 66 188 45 -132 137
3665A37J99l13oj74K36J12m8n6R6k42J00j40n2l0J00J64o4K7l87M60j10r9N2J64
$$ 137 336 23 17 -157 79 191 143 87 183 -59 41 -99 -151 -181 -81 83 19 46 -341 119 9 -90 -38 126
3689A26j64O1k62J68K58k14P2j24R2pr2L6K30j49j78K61j55o4K37k44K39M5k16
$$ 126 -38 23 -239 -71 187 -27 45 -79 13 6 -86 -50 180 31 -147 114 -41 -105 132 -112 127 172 -44
3712d4q9O2K10p2l55L03L4J8R2M9l38J75j56L4J34j06k36K91K57j16k40O0r5k7
$$ -44 -133 -71 139 67 -288 15 49 67 159 208 -130 45 -111 -77 57 -49 -285 6 263 147 -93 -33 -128 -155
3736a55N36n50N24m65J66o3l19O85m63K08j05J33r8j81L7K36j66k5p3J04j5jK67
$$ -155 381 -169 355 -110 56 -7 -326 359 -104 104 -1 132 34 -147 -110 126 -40 -65 -138 -34 -49 -50 217
3759B17j07j40P7j81o3K65jj04NK48j41o4k09J70n1N1K45P0l02k98M9J06L13Q0
$$ 217 110 -30 47 -134 -197 68 67 -37 -32 216 75 11 -198 -28 -79 -28 217 287 -15 -313 -264 -158 155 235
3783B35q9M7k22N2J4j58K24l35K99p1Q2r7K01o8n4J11j04j79j06qM57l27L03k51
$$ 235 146 193 -29 23 37 -121 103 -232 67 -4 78 -19 182 114 60 171 67 -112 -218 -226 231 -96 207 -44
3807d4Q0N9O0j73lK5j88K9K56j10j79J39K47j7j9o6j02J5J78o4j07K06L4m23K0
$$ -44 36 95 155 -18 -21 4 -184 -155 101 -9 -188 -49 198 181 162 96 -6 9 187 123 16 222 256 -167 -147
3832a47J72N1j19k8K07k71J65k14K46o3J14j56J9J90m45J25Q3J30l51N01l62L64
$$ -147 25 76 -43 -71 136 -135 30 -184 62 -1 113 -43 -24 166 -279 -154 -71 59 -292 209 -153 211
3854B11l14k18K54K35j30J54k19J71J16k36K11o5j24o3LN1p0L6J33k4m13M26j71
$$ 211 -103 -321 -67 168 38 192 -27 144 260 24 235 170 46 -17 -14 37 -33 3 136 112 -301 125 -46
3877d6J80j50O9L3k1j17J07J26p7k1kk40J32K9j4J47r6k23K77l10M34k34k6r0
$$ -46 134 -16 53 86 65 -52 55 181 104 83 81 -159 -27 2 -12 135 39 -184 93 -217 217 -17 -43 -133
3901a33L37k17k03M44k75N8J52j83M8k00m7L46l08J04J13j09O7j27L78l00M41
$$ -133 204 -13 -216 228 -47 11 163 -20 28 -172 -219 127 -181 -77 36 -73 -6 -133 245 -55 386
3922C86m03J42K7l70M18R9l57J00m6k10L29j10K27j61M1k40K04q2J17q7m2J37
$$ 386 -17 125 152 -218 200 299 -58 42 -4 -214 115 5 232 71 112 -128 76 -6 111 24 -18 119
3944A19l16J53Mj55J41K65k19j62J68P9j90n7O9O7j67K69L9j41O0K53m06J53j04
$$ 119 -197 -44 -40 -195 -54 211 -8 -170 -2 77 -113 -170 -101 -34 -201 68 107 -34 26 279 -127 26 -78
3967g8r6K55o6R7r8k0o9J12J81j93Q3Q3j80J06l30K22j43J32j75J76r9p2J56N4
$$ -78 -174 81 15 112 14 -6 -75 37 218 25 108 191 11 117 -213 9 -134 -2 -177 -1 -100 -172 -16 38
3991C8L8q6m46O16k81J59P8j68P1n9J65k9j01L1p5J4nQ8p5K5j56J68P3M4K27n90
$$ 38 76 -10 -456 160 -121 38 116 -52 19 -40 125 96 -5 26 -49 -35 -40 48 -27 -2 -158 10 83 127 354 -236
4017b36L24j09R7j53K03k08j27L5N0j83L52jj08k57J87q1L05n4r6R7L2k53K92
$$ -236 88 -21 76 -77 126 -82 -209 -174 -124 -307 45 44 -64 -321 -134 -215 90 36 -60 37 69 -184 108
4040A08l8n8pJ82j92K33j57J5rJ02n3k92K62p4R3r8J83l78p6J94j62M92l48j7
$$ 108 70 12 5 187 -5 228 71 86 77 179 126 -166 96 22 115 17 200 -178 -254 -60 -222 270 -78 -95
4064i5l7K15n2n3K61k93jK17k19J21J96l32m7J10O0k27M89m29J0j25K31J24J81
$$ -95 -132 83 31 -22 239 -54 -55 162 -57 64 260 -72 -119 -9 51 -176 313 -116 -106 -231 0 124 305
4087C05k02J1L9j11J68j04j76j73J10j5J4j96J16L7J00o1J67k9k51L97j67O0j97
$$ 305 103 114 153 42 210 106 -70 -243 -133 -148 -134 -330 -214 -177 -77 -138 29 0 -251 146 -21 39 -158
4110a58p8K76k88Q7J78P3J19j39k90J78J1p5J49k91l1K76Rj48K72j32m2NL39j15
$$ -158 -236 40 -248 -161 17 90 209 70 -220 -42 -31 -106 43 -248 -279 -3 6 -142 130 -2 -44 -39 300 185
4134A85k88K03j25J35l5j87J12R8m18P1J86r1J3M3m3J92L4l9oNk36L90l39J70
$$ 185 -103 100 -25 110 75 -112 0 98 -320 -249 -63 -154 -141 -98 -141 51 85 46 40 45 -191 199 -140 30
4158C0k56J04J31K3Lj29J44J42j17q5%J18q9j82j02L41J29j15k26J28J01L8K28
$$ 30 -226 -122 9 32 35 -94 50 192 75 -10 -10 108 19 -163 -265 76 205 90 -136 -8 93 131 359
4181C59k37j83K6q1R9J38P9l13ML90k79l2j08J41K08k97J45j28K35J76n35j9J96
$$ 359 122 -61 -35 -116 -17 121 200 -113 -109 281 2 -30 -138 3 211 -86 59 -69 166 342 -193 -212 -16
4204a6J47m70J13M83k80K5K0Rj27m0L36j64k21J83J28j79M9j17K18j36L0o6R8
$$ -16 131 -339 -226 257 -23 2 22 31 -96 -136 200 36 -185 -2 126 -53 -4 -121 97 -39 -9 -75 23
4227B3j8j13K12J68m70Q3J71J88k96j21J73L1j29J31k73K84K2JR3M0j90j09Q8
$$ 23 5 -108 104 272 -198 -115 56 244 -52 -173 0 31 -98 33 -240 44 66 67 160 200 10 -99 -11
4250a1m8J32l8j7M0K4j3mj31M6K70n03K46P6k91J96Q3j27K10j32k10K40k47K72
$$ -11 -59 73 35 18 58 82 69 65 -66 -20 250 -253 -7 69 -222 -26 57 -70 140 8 -202 38 -209 63
4274F3j4J62J6k01n3O1N3j14P3j74K45l5j00l6m9Q2J01J62n49K04k0K05K08k75
$$ 63 49 211 227 26 -27 34 87 -27 46 -128 117 82 -18 -54 -103 -21 80 242 -307 -103 -123 82 290 15
4298A5J27P8k66J10q1L65k86J20j75k23O7RK19q5K67j68l33J9j3L75j58j4j4p5
$$ 15 142 220 -46 64 -17 348 62 182 7 -216 -149 -140 79 -6 261 93 -240 -221 -234 141 -17 -31 -45 -120
4322a20O2q1M62l37l6j48K04j98L27j61q3j03K1L67k18k93K43J66J09k33J44k38
$$ -120 -58 -139 323 -14 -50 -198 6 -192 135 -26 -109 -212 -191 176 -42 -335 -92 74 183 -50 94 -144
4344a44j14N9J65l9K81k4j10j44L41k70J25J62j18l26L08j08q5j8J98j23M6j22
$$ -144 -258 -199 -34 -73 208 184 74 -70 271 1 126 288 170 -156 152 44 -41 -59 139 16 62 -60
4366f0J74j7k82j6K92j4J44k04R5R5k99J22K1k09L41k31J41j21j63L02l8n6K41
$$ -60 114 97 -185 -201 91 77 221 17 112 207 -92 30 51 -158 183 -48 93 -28 -191 111 73 17 258
4389B58J37k74l05K55j11J41k04K01k61J87p1j15K85l01J12O8k3R3j66P4k04J08
$$ 258 395 121 -184 71 -40 101 -103 98 -163 24 -47 -162 123 -178 -66 2 -21 72 -94 -20 -224 -116
4411a16m7Q8M1L7R7K0K7k38L4n0N7J90j63K56l81R8K42j44r5k61M73k25P5K22
$$ -116 -163 -75 -34 3 100 120 147 -91 -57 -107 -50 140 -23 233 -148 -50 192 48 -47 -308 165 -60 15 237
4435B37j96q2O5k8n4j2LK22r5k54L88j83o2Q3j45L6o1qK43j93J36l4k28J55J74
$$ 237 41 -41 24 -4 -58 -70 -67 155 60 -194 194 11 -51 32 -113 -77 -138 -146 97 -96 40 6 -222 -67 107
4460A07j38j66J05K05j34n7K8O0M2j86o4L19j26J19rk51k58J55K16J08M5k41J0
$$ 107 -31 -197 -92 113 -21 -78 -50 10 52 -134 -198 121 -5 114 105 -146 -404 -249 -33 75 120 -121 -111
4483a11j09J55J02j74J49O1k70K18k92L22J59l53N39m40J43j91J43k63jJ28J47
$$ -111 -220 -65 37 -137 12 73 -197 21 -271 51 210 -143 396 -44 99 -92 51 -212 -213 -85 62
4504F2k1q8J43j67l3M68l04O5j10R2j74K42j71j3j26L32k80j2q1K24j13K08k31
$$ 62 41 -47 96 -71 -104 364 60 125 15 107 -67 175 4 -9 -135 197 -83 -95 -176 48 -65 143 -88
4527h8J05j14j8L34m25L08j71J89N2k01n8r7J91k8p6J47q8r8K04r4q2K85n4J14
$$ -88 17 -97 -115 219 -206 102 -69 120 172 -29 -87 -184 7 -21 -97 50 -38 -136 68 -26 -108 177 123 237
4551B37m62M10k81L42j32o1o4j89K92J60k52j40J49n5RJ78j06j09j50K81Q5K6
$$ 237 -225 185 -96 246 114 53 -11 -200 92 252 0 -140 9 -46 -37 141 35 -74 -224 57 142 168
4573A68M9k1k32J07j85K12J26j82J43l15K51j82J38M1l79L69ol46L22o9r0k13
$$ 168 217 196 -36 71 -114 98 224 42 185 -130 121 -61 77 118 -261 108 102 -244 78 9 -81 -294
4595b94R6L58j05r6j03k74J84M00j06k39j32Q4L6K19M8r3Qj06L03k76M0N9k48
$$ -294 -198 160 55 -41 -144 -418 -234 166 60 -179 -311 -227 -191 28 76 -17 -9 -115 188 -88 -48 11 -237
4618b37L38J19k36J40k4J06k50O9o2J90o8qp4j08R8j80K18K95n47L28j81L01k88
$$ -237 101 220 -16 124 100 206 -44 25 -37 153 85 77 3 -105 -7 -187 31 326 -221 107 -74 227 -61
4641f1mJ20k0K95m36J2J37P1k55m0J88J03j01N1o8rK7p2K09j23j10j47L73j14
$$ -61 -65 55 35 330 -106 -94 43 114 -141 -181 7 110 9 60 -8 -17 10 -62 147 24 -86 -233 140 26
4665B6k17K26j22K52j43l24K38J17q3J20J6j25J42j0P6j25P2j4q4j05J96r9p9
$$ 26 -191 35 -87 165 22 -302 -64 53 -30 90 106 -19 123 113 189 64 136 122 38 -67 129 30 -49
4688d9k15J72K49j41J67K07n34K28K6oj3l9j82J70J26K2J23k89J72m9k1j70K78
$$ -49 -264 -92 157 16 183 390 -144 84 110 104 91 52 -130 40 166 188 311 22 194 145 124 -46 232
4711B32k41K29j69j90P0J24k07k15L32M5J37j98J34J51k68n7MK13k22K13q9J30
$$ 232 -9 220 51 -139 -69 55 -152 -367 -35 10 147 -51 83 234 -34 -91 -87 126 -96 117 28 158
4733A58L6j27k5P5k73J07j33J65j37L80k17j51L16k26K20k94J41J73j75j89J23
$$ 158 194 67 42 117 -156 -49 -182 -17 -154 226 9 -142 174 -52 168 -126 15 188 13 -176 -53
4754e3J51J14m68l9J67L43k92J07l58L53J22m3O2L9k00k33K47p5J37L41m34j5
$$ -53 98 212 -256 -295 -128 215 -77 30 -328 25 147 104 166 205 5 -228 19 -56 81 422 -12 -27
4776b7o3l1J39J76l44L33p3j63qQ8j68K30q5R7N0j04K23j93P3p0j33j80m0J73
$$ -27 -90 -121 18 194 -150 183 110 -53 -61 27 -141 89 4 101 151 47 270 77 150 80 -53 -233 -273 -100
4800a00M60k54p7K05k83p5L0pK39l44J70m4P2J42l9j05n2k0N1J98j68L0k1k16
$$ -100 360 106 29 234 -49 -124 -94 -101 138 -206 -36 -80 -8 134 95 -10 -62 -82 -31 167 -1 29 8 -208
4824b08J46l4p6R7K32j94j31K83p8K2J01k34k0J26m75L47p7K06r1Nk7K0J72j00
$$ -208 -62 -96 -172 -75 157 -37 -168 115 37 59 160 -74 -94 32 -443 -96 -173 33 -58 -53 -80 -60 112 12
4848A2k87L94l8j68J9k94M90K4k96J19K02n0M7k99J59J52l67K14o3M4J11j51J06
$$ 12 -275 119 81 -87 -68 -362 128 152 -144 -25 177 127 174 -125 34 186 -181 33 -30 14 125 -26 80
4871H0j83J67j79K6j40K03j31K59l9j95J84l02M88l51L85q9R6l16j37L18r1K6
$$ 80 -103 64 -115 -89 -229 -26 -157 102 63 -132 52 -250 238 -113 272 183 279 -37 -174 144 53 79
4893G9j52J87l47M4Q4J47J00k86J29j8J58po1o7l7R3j97J65N6k19J47N1J15j96
$$ 79 -73 114 -233 -189 -105 42 142 -144 -15 -33 125 118 57 -10 -47 46 -151 14 70 -149 -2 49 164 -32
4917c2J14j13Q5k79M11m0N0m60K33m6K03k18P4J05n5J02J90q0o7k18j23K68j00
$$ -32 82 -31 54 -225 186 146 196 -264 -31 -77 126 -92 -18 87 32 134 324 244 177 -41 -164 104 4
4940DM9K8m45L53P7R1j69k08L93j98j30J86O9k7J7j12R9J9j80l0J62p1j38J12
$$ 4 53 81 -364 -11 66 157 -12 -220 173 -25 -155 31 100 73 90 -22 77 96 -84 -114 48 -23 -161 -49
4964d9j46K61q0K88n65M41qR1n1l29O0K15j42M2QJ50k58J43m5j41M9L27m55K18
$$ -49 -195 66 -14 274 -291 150 142 233 182 -147 -87 128 -14 28 36 186 -72 71 26 -115 -66 261 -194 24
4988B4j87K46k36K61q6q7K9J93q1qn5j13JJ26q0J19qj3k53J35J12K3O4J7j93n0
$$ 24 -163 83 -153 108 22 -65 -36 157 76 68 13 -100 -99 27 -53 66 58 45 -208 -73 39 62 126 143 -50 -100
5014a00K0R3O2L1l32K07R7k15lM4K0k15K35O5K22j67j22j1Q0J35L4j00j84j13
$$ -100 -80 13 75 106 -226 -19 78 -137 -140 -96 -76 -291 -56 9 231 64 -58 -69 11 146 180 80 -104 -217
5038b17M10k53J27O7o1R2M8k84L6J61l5j18j36L10j04j45J82j60L8q4J42j42J57
$$ -217 193 -60 67 134 73 165 213 -71 -35 126 91 -27 -163 147 43 -102 80 -80 -42 -126 16 -126 31
5061C1j53q1L77k07j1j4k7J72m4j02J79p1r5L28m89M7K80j40L7J46j37N1k02J1
$$ 31 -122 -203 174 -33 -44 -58 -85 87 43 -59 120 49 -46 282 -207 -160 120 -20 17 163 26 77 -125 -114
5085a14L76m70M7M16j09k80K41m1QK26q9m01J96k25k9M21L2l08J97j45Q5m2j36
$$ -114 262 -208 -161 255 146 -134 107 66 74 300 211 -190 6 -219 -248 173 205 -103 94 -51 34 -8 -144
5108a44K37j4m7j99K14k1P9o0j39J29j76K86k01K6j21L47L8k31j02K00o9k8j03
$$ -144 93 79 32 -167 47 26 105 45 -94 35 -141 145 -56 -30 -151 196 234 3 -99 101 32 4 -99
5131i9K48j64J4m3p4K11m3q0K14nk37k28J68O5P4q3J9O6mn7M6k8j06R1k72M65
$$ -99 149 -15 -1 -44 -118 93 50 -30 184 179 -58 -286 -118 -53 21 -62 -43 23 19 -38 8 -20 -126 -35 -307 158
5157A58j28k34J75K11j1Q5j65p6Rk1P5l4j76J9K31l38L78l03L7L9J54l14J69l1
$$ 158 30 -204 -29 182 171 256 91 15 24 3 78 44 -132 -113 118 -220 158 -145 -108 -69 85 -229 -60 -91
5181i1L5J19k70J96Q5j56o1L77k50K9j93J57K36l64P1l7J34l0k1J69j25q0j24
$$ -91 -56 63 -207 -11 74 -82 -143 234 -16 13 -180 -23 213 -151 -80 -117 17 -13 -34 135 10 -70 -194
5204a94J21j04R1K32l11J58NJ29q5j50L89l23j23Q6M7J9m2k1M9o4j1L86m87J60
$$ -194 -73 -177 -86 146 -165 -7 -2 127 42 -108 281 -42 -165 -79 -32 -13 -55 -76 -27 -91 -102 284 -203 -43
5228d3k15L64o5J75j44j91K35R%l23L77j96Q9n4MM9K0j7L3j61j17J96j18K84j62
$$ -43 -258 106 41 216 72 -119 116 125 125 -198 179 -17 72 18 22 71 91 74 107 -54 -171 25 -93 191 29
5253B9J02n2pj13n8N4q3J42O5j88J69K7n9k61L28Nl5K6j19j21RQ3K23j63M7n2
$$ 29 131 79 72 -41 -99 -45 -128 14 79 -109 60 87 28 -233 95 100 65 91 -28 -149 -140 -57 166 3 50 -2
5279bJ63l13L43k78R3J44m33L40l00N25n61J97J01j90N55m66J25M7k34k1j6J08
$$ -2 161 -152 191 -87 6 150 -283 57 -243 282 -279 -82 19 -171 384 -82 43 90 -144 -165 -181 -73
5301g3K13q8R8j57O5J64l81R1r2L30m5j60Q3k99R2K79o9p2o6M5J13j34J68J2k50
$$ -73 140 52 150 -7 58 222 -159 -68 -160 170 125 -35 48 -251 -159 120 51 -21 -87 -42 71 -63 105 117 -133
5326a33J90J60j93j18k6j31K1O34j55j54k08J75j55J83K6l26L02j83J96N5j89
$$ -133 57 217 24 -94 -120 -251 -230 404 249 95 -113 62 -93 90 116 -210 92 -91 105 160 -29
5347b9J58j32O2N8j75J6p0J18j0J07M9l04Q7Jk7j4M11m78k4K21k72O03l07J36
$$ -29 129 -3 59 117 -58 -42 -112 6 -4 103 152 -152 -65 -64 -91 -105 306 -172 -196 25 -247 356 49 185
5371A85l66J44n5K4L9p2l7J18J56j82J04l17M54o3P1j56J19j94J68k8j86J61r6
$$ 185 -181 -37 -92 -68 -29 -101 -138 -20 136 -46 58 -259 195 132 203 47 166 -28 140 112 -74 87 -9
5394ij9J28j48m6M4k2M9lJ43oo3qj03R7Qj9r2j07J1M11n6N0l03M2m3J20Ln0l5
$$ -9 -28 100 -48 -94 -50 -72 -23 -26 117 111 48 40 -63 34 42 23 -69 -176 -165 246 190 240 -63 -21 -64 56 59 9 -26
5423b6Q6J52m41L37j61N2j43K38p4j12j1j37J89K15l2m0j79L1R1q9J64j64j07
$$ -26 60 212 -229 108 -53 -1 -144 94 20 -92 -103 -240 -51 164 132 92 -87 -56 35 -54 110 -54 -161
5446a61NK46n0J84m05J03L06j44p1J88k35k5q4l6L5L4M6L47m39K27j29K46j30
$$ -161 -156 90 40 224 -181 -78 228 84 13 201 -34 -59 -143 -179 -144 -110 -64 283 -156 71 -58 188 58
5469E8j59J88l35L20o3J48k45P3J53N9k59K08m83K21L37k88K07k25l9J71m2J59
$$ 58 -101 87 -248 72 9 157 -88 -15 138 197 -62 146 -337 -116 221 -67 140 -85 -124 47 5 164
5491A64j76R2k56J72MP7j10j93M26l02K33K5k92k19P8J95K62k76j60L6J87rK58
$$ 164 -12 80 -176 -4 0 77 -33 -226 200 -102 131 156 -136 -355 -277 -82 180 -96 -256 -220 -33 -42 216
5514B16m3k4m33N02k41j63M5M11m25K34J93l85Q4k02PK92J02l19J92l5J5j22J
$$ 216 173 149 -284 218 -23 -186 -141 270 -155 79 272 -113 -29 -231 -224 68 170 -149 43 8 23 -99 -98
5537i8K42n6l9r0j58N8J99P1j47K96k41J50r3j48J20R4qk34L08l52k39J94N3q
$$ -98 144 88 49 -41 -199 -141 58 129 -18 278 37 187 94 -54 66 160 152 -82 226 -126 -365 -171 -118 -126
5561a26K1j0J9l1K00Lk53K06j61j66J21J78j62R5j9o0L59j1j69O3r3K80j32j72
$$ -126 -105 -115 -96 -127 73 76 -177 29 -132 -298 -177 1 -161 -66 -85 -145 214 203 34 97 4 284 152 -20
5585b0L5k21J19L9j6L36m80J44j73J76L28k02J8P7j19k72J72O0O5K5j9k36J04
$$ -20 15 -206 -87 -48 -64 272 -208 -64 -237 -61 267 65 83 160 41 -231 -59 1 66 91 72 -164 -60
5608f0M9j10R7J20m6N6mJ09k90n2O5l8K37n5J48k00K4j06J46j11K50k55J6j73
$$ -60 -11 -121 -24 96 50 106 102 211 -79 -131 -66 -104 133 78 226 26 50 -56 90 -21 229 -26 -10 -183
5632a83M02k75K66qj87o6MJ17j73m2M4P9P0J03m20M43k34K01q1N7p1N7l76m9M30
$$ -183 219 -56 210 202 15 -51 -47 70 -103 -145 -101 -22 48 151 -269 174 -60 141 60 117 46 103 -273 -322 108
5657A08m0J06k78K6nK06Q1j73j7n5m2J58k13r9M51m44L53j89l4K24j90J45j03
$$ 108 68 174 -104 -78 -83 123 204 31 14 -41 -83 75 -138 -237 214 -230 123 -66 -100 124 -66 79 -24
5680b4M2p9KJ8K29l9j57J33j35k9m6P3r1L26l92J09K3j9j33K23k67K07Q7nN7N9
$$ -24 18 -61 -59 -41 188 149 -8 125 -10 -39 -85 -12 -103 223 -169 -60 -37 -56 -189 34 -233 -26 61 56 113 172
5706A72j85J29l7j24J00j08L34J00l13N4j70j50L6O1P2n9K71q5L0j13L8j31k8
$$ 172 -13 116 79 -45 55 -53 281 381 68 122 -48 -198 -162 -101 -29 -88 183 98 128 15 53 -78 -106
5729a06L7m6N3J90j51n1r3P3l9K88j69Q5j98J8J83K2j91j49K78O7k70L36k04J19
$$ -106 -69 -115 -62 128 -23 -74 -167 -94 -133 155 -14 71 -127 -109 74 96 -95 -244 34 101 -169 167 -37 82
5753H2k00o3L00J06l5k2k09J48J33k33j18p3L47j91M6M9l56J59J38j45J69J0m3
$$ 82 -118 -181 119 225 190 168 -41 107 240 7 -111 -184 163 -28 18 67 -289 -130 8 -137 32 42 -1
5776aM7K78l37L2j83J96Q5K7P7j34N0j12r8K23l34K22p1J2j13K42J04l1j50p5
$$ -1 46 324 -13 19 -164 32 117 144 221 87 137 25 -73 150 -184 38 -33 -21 -134 108 212 181 31 -44
5800d4J05Q1k36J06K6l4j27L03L2J6j81k66n6J88J55O0j79O2n6K98k95k4J83k75
$$ -44 61 142 -94 12 38 4 -123 180 212 228 47 -219 -275 -87 68 128 -51 11 -45 253 -42 -66 117 -158
5824a58K1L7l8R3J37k80J81L4L9L0m2k10K40P3O3l81K68l10K79J75n63K73L4j94
$$ -158 -137 -100 -138 -45 92 -188 -7 27 66 96 54 -156 84 157 220 -161 107 -203 76 251 -312 -39 -5 -199
5848a99K07O0N0k3N5K1l4j34O4Q7p1j66L28k33j06n6k62M95j22Q1R2n2j59J49
$$ -199 8 68 118 95 150 171 137 3 67 154 83 -83 245 12 -94 -150 -412 83 -39 42 134 82 -77 72
5872G2k2q3L89l17j26J80k18j1K49l23M88j55r5k5k10L43j91N3k4J56j71k4J82
$$ 72 50 -33 356 39 -87 93 -125 -136 113 -210 278 123 28 3 -207 136 -55 -2 -26 130 -41 -65 117
5895A17m19L08j22K40k50lJ23J8n3L80k93J5o3J61j51l20L46j97J99Q9M3l06n1
$$ 117 -302 6 -116 124 -126 -129 -6 12 -41 339 46 61 -2 159 8 -312 34 -163 36 125 168 -138 -189
5918a89K76l7m8J93P3j66on3j82n7J71J36j82J0J46k9j01O9lj69J41L9J13k45
$$ -189 87 50 2 195 268 102 96 43 -139 -196 -25 111 -71 -61 85 56 -45 24 21 -148 -7 32 145 -100
5942a00o6N8J60o7j35R4J4L3j05J11k67L35K8j41OK45k97J60J04j62O4l1o9j8
$$ -100 -166 -108 52 -15 -150 -56 -42 -9 -114 -3 -270 65 93 -48 -42 203 -94 66 170 8 72 41 -28 -46
5966d6J91l54K87j59K67m7p1J49k96J12j7k09K98km1j4j87K27%j05J08q3J81o9
$$ -46 145 -209 78 -81 186 139 68 217 -79 33 16 -193 105 103 62 48 -139 88 88 -17 91 8 189 120
5990A20k0j8k24J0P3Pj49L07Q4m11O2J36J3P9k21L10j10r8J37j92Q3M9j31M0M10
$$ 120 100 82 -142 -132 -59 -52 -201 106 190 -221 -159 -23 -10 69 -152 158 48 -50 87 -105 -22 27 -104 -64 346
6015C46m14p2P3L12k86q6n4M14m31L31k7r0l31J54k7J71k7J03L8Nl9M1l05J6P1
$$ 346 -68 -140 -67 245 -41 -127 -181 233 -198 133 106 16 -315 -161 -188 -17 -44 59 97 102 63 104 -201 -185 -114
6040a14K33j33j7R8l41N20l55N5K64l26k9K56M7j72lJ18j16kj38L17m41L46L99
$$ -114 119 -14 -31 67 -274 246 -109 -54 210 -116 -145 111 158 -14 -17 101 -15 -17 -155 162 -279 67 466
6063D66n33J39p4K40j56m3J00n5n0k78j2J10K69j31J11Mk80L32k21J14j03J50
$$ 466 -67 72 -2 238 82 39 139 84 34 -244 -256 -146 123 -8 103 107 -173 159 -62 52 -51 99
6085I9q3J20Lk22J6l2n6K38j13k12K97p5k1J60j06L27l20m5Q6Rl7j63K64o6K3
$$ 99 16 136 139 -83 -67 -99 -155 83 -30 -242 55 -20 -41 119 13 340 20 -25 61 70 33 -130 134 68 91
6110I1l37K22k25K16L5J32Nj54k1J43L2m48K11J99o2j14P0j2o2K49l00J05K95
$$ 91 -246 -24 -249 -33 2 134 139 -15 -36 107 139 -309 -98 101 39 -75 -5 -17 -79 170 -130 -25 270
6133B70l40J90M0J04j6Lj98j9k8O0j28j0P0R0Jj16K85j43j36k08J14J29K55l92
$$ 270 -70 120 160 264 248 251 53 34 6 66 -62 -72 -2 88 89 -27 258 115 -21 -229 -115 14 269 -123
6157a23J30K11j84J23r9r5o8m1K29K0J1j65m7J38K4j13r2L92j99l8J25k14r3J51
$$ -123 7 218 34 157 58 -37 -105 -146 83 103 114 -51 -98 40 64 -49 -141 251 52 14 139 -75 -168 -17
6181a7j86O9J62o4j29O1k4J6J22k95K63j70j20R8K59R2k36L21j71K65k56k66M05
$$ -17 -203 -134 28 -36 -165 -104 -128 -112 10 -285 -22 -192 -312 -214 45 137 -99 222 51 316 60 -206 199
6204A99m7l75K50j58J26j6O0k07J10J41mj00O1j85K35j88L32k42k15L63M4k88
$$ 199 152 -223 27 -131 -5 -21 39 -168 -58 83 79 -21 40 -145 90 -98 234 -8 -223 140 184 -104
6226a04K58nn5O0j39N0p0K2k0P1r8R5Q2k3j40n1P0P6N4p5q9K12j85j91K03L64
$$ -104 154 149 94 154 15 65 -5 17 -3 68 -30 65 147 124 -16 -67 3 79 133 58 -31 181 -4 -195 8 372
6252C72o99K95j02M86l28j65J19K06j75j09J39k04p7K09K57m91J43J29k01J39
$$ 372 -327 -32 -134 352 24 -141 -22 184 9 -100 39 -165 -242 -33 224 -267 -124 5 -196 -57
6272e7L4r8J5J3J10k26K15J57k67K25l06J14K49k64L1n7R7J66j90J91j46K55k08
$$ -57 -23 -121 -106 -93 17 -209 6 163 -104 121 -185 -71 178 -86 -55 -112 -15 151 -39 152 6 261 53
6295E3J1l9L04m54j29M0K95j95r3O0J62Q9j22O5j73K70k09J63j66j0o1R4J67m3
$$ 53 64 25 329 -125 -254 -214 81 -114 -207 -147 15 104 -18 47 -126 144 -65 98 -68 -78 -139 -45 122 79
6319G9Q9j98R6J29k76K06nj07K79l01n0J19j37j08L06k1J6k93O2N0J95k73L21
$$ 79 168 -30 66 195 -81 125 120 13 292 -9 -59 60 -77 -185 121 100 116 -177 -115 -65 130 -143 178
6342A78k08j37L6O2k7J72P5j59j26K17j45K00j95J20KK2p2R6R8k44R5k32L54k80
$$ 178 -30 -167 -131 -69 -96 76 151 -8 -134 83 -62 138 -57 63 65 87 15 111 209 -35 60 -172 182 -98
6366i8J92j20P6O7L2q4n5K67l51M5K00l63J90K2K69j15Ln8k0j34j3J48o4O9K5
$$ -98 94 -26 50 117 149 65 10 277 -74 -29 171 -192 -2 20 289 174 177 119 99 -35 -48 100 36 105 130
6391A30k63PL08l4k01K02k86j10Q7O4L23o3k45R3j3J33k34j85N81p7k79O1Kj13
$$ 130 -133 -126 182 148 -53 149 -137 -247 -160 -96 227 164 -81 12 -1 132 -102 -287 294 217 -62 -1 1 -112
6415a12M3J23j25MO9j2o7PJ05J28j41r2J48j7O8j19n9L31l79r1R8J92j31k85K31
$$ -112 -69 54 -71 -67 2 -10 -77 -70 35 163 22 -70 78 61 129 10 -49 282 -97 -188 -90 102 -29 -314 -83
6440h3k18K98j23J60k42n5P5K54m1m7k1n2K80j42J14M0n49L38J15J30j40K28m84
$$ -83 -301 -3 -126 34 -208 -263 -188 66 25 -22 -43 -95 185 43 157 197 -352 -14 101 231 91 319 -165
6463a65L07q8J16O1j23r5j28K56K04l28o0k72K63RO5j59L38m85K88N8K15k52J54
$$ -165 142 54 170 231 108 13 -115 141 345 17 -43 -315 -52 -43 22 -137 201 -284 4 62 277 25 179
6486A79k60J29M4K5j92j48J20j79M54j56J22k30j22L15j31J7K62l68J67J21m99
$$ 179 -81 48 92 117 -75 -223 -103 -282 172 16 138 -92 -214 101 -30 -13 249 -119 48 169 -330
6507c30J46L67k42OQ3q0q7k3J91M3q9J11K38m70K18j54o0K58j76J35l5K3k18J69
$$ -330 -184 183 -59 -53 30 -50 -137 -160 31 74 -15 96 334 -136 82 -72 -132 126 -50 85 50 73 -145 24
6531B4K33l71J41m2Mj96L20k94K50R3m31L82k64J12j47J66p2p9J23N0l40K08P7
$$ 24 257 -114 27 -15 -11 -207 113 -181 69 162 -269 113 -151 -39 -186 -20 -92 -171 -48 2 -338 -130 -53
6554e3K61j27J3j51L34l32j35K57N9m1k1K39m54J63J80p2p1j07K36l57K60p0O2
$$ -53 208 81 94 -57 277 -55 -190 67 126 85 64 303 -151 12 192 120 49 -58 178 -179 81 11 73
6577G3J44k58K87j83m3l6L0j80J14k6J17L5Pj74K08j28O9l06L73k12J26j50p3
$$ 73 217 -41 246 63 20 -16 14 -166 -52 -78 39 74 81 -93 115 -13 56 -250 123 -89 37 -113 -186
6600a86j01N53r3n1J1j68oj47K13p3J01p4L28l46M8J0L7J01n49N60l7k09K48j15
$$ -186 -287 266 173 122 133 -35 -41 -188 25 -48 53 -21 307 -39 9 19 56 157 -392 168 131 -78 170 55
6624E5j85J78l2Q0J70l21L8m7O3l0r7K27r1r3j34K69K7j93l0J63J44k31o5N6R3
$$ 55 -130 48 16 96 266 -55 -17 -64 -1 -31 -128 99 8 -85 -219 50 77 -116 -146 17 161 -70 -135 -79 14
6649A4k8j1J50j12j98N5J45j14k7K57J3j21o3Ok6L3Q2M6qj15Q7j70J21m0j26K33
$$ 14 -14 -25 125 13 -185 -130 15 -99 -126 131 144 23 -40 -34 -60 -27 55 101 93 -22 65 -105 16 -24 -150 83
6675H3Q3k21Q5Mj84J33J62l20J51J12k0j82N60m32Q2K4k6k41KL14j19L87l35l64
$$ 83 166 -55 30 34 -150 -17 145 -175 -24 88 68 -114 446 14 96 120 94 -147 -145 169 50 437 102 -262
6699b62j0J05J07q9L46k85j67K85j21P2j59O8J5L25J31k46k93K52J50k90j54J24
$$ -262 -272 -167 -60 -149 197 -88 -255 30 -91 -19 -178 -110 -95 230 361 115 -178 74 224 -66 -220 -96
6721i6j20J83L31o17N27J4l30J52K03m5n3j66n6Q0m7Q6Lj29l4L23j15m6J2j17
$$ -96 -216 -33 298 -319 208 222 -108 44 247 202 149 -17 -73 7 -40 46 49 -80 -114 209 94 48 60 -57
6745e7K44j35k86K81j35nJ6J44l97K92mJ5jo2R3L44l24K2lk1j04J37j53J5R6j95
$$ -57 187 52 -234 47 -88 -93 -77 67 -330 -38 -42 -27 -28 -90 3 347 23 45 42 21 -83 54 -99 -84 12 -183
6771a83L60l46J13K4L3o7N9j19M03J16l39j66K50k84K84j22j64J15q0j35K74k3
$$ -183 177 -169 -56 -32 1 -66 -7 -126 277 393 54 -112 138 -146 138 16 -148 -33 -113 -248 26 3
6793Ck4j08Q0l9Q7P1k91K43r5K39k33J3j26O2J71K62l37l0l0J22j51J5J01J08
$$ 3 -21 -129 -49 -88 -1 70 -221 22 -73 166 -67 -54 -180 -118 53 315 -22 -52 -82 40 -111 -96 5 113
6817A13l37N6j2J05rQ5k31J45J26K7J2K8MJ6l91L85j66J16j73j1n8J92r5K22J09
$$ 113 -224 -168 -180 -75 -84 1 -230 -85 41 68 80 108 112 128 -263 122 -44 72 -101 -112 -170 22 -73 149 258
6842B58l11K29j36J62n2j02l39N53j92N7k59mR0j9L6P8Mk49J22K57k87R1j07J79
$$ 258 -53 176 40 202 150 48 -291 262 70 127 -132 -136 -46 -65 -29 49 53 -196 -74 183 -104 -13 -120 59
6866E9J8j02j54J7K08K52n74L86r4J72l72K51k50L87j83k11Q3K33j07k1M4n4k18
$$ 59 77 -25 -179 -162 46 298 -276 110 16 188 -184 67 -183 204 21 -190 -107 126 19 -2 42 -12 -230
6889b30N3j52N56n27K36K78l99P9o6L19J08l45N1Q8j42L5J64R8m47M3K18J36k47
$$ -230 -177 -329 227 -300 -64 214 -185 -106 -172 147 255 -90 -39 49 -93 -58 106 204 -243 -200 18 154 -93
6912i3J42O0k72j27M81j60j0l73K87l0K07l28K96pl9R1qm07J44p7L02l00J07J56
$$ -93 49 109 -163 -290 191 31 21 -352 -65 -95 112 -216 80 73 34 125 117 -290 -146 -223 79 -221 -114 42
6936D2p2J59j87l8K84j40k5j89K19j24L8J35L3k47J55k36R6J10K0Qj03q3J48Q8
$$ 42 -30 129 -58 -96 188 48 23 -166 53 -71 -33 102 135 -112 43 -193 -97 13 33 41 -62 -145 3 91
6960I1j49K72n0m3j43K70j12j49j62P4M1J07P1m7kk16m0lK68Q2j88K35j34k62
$$ 91 -58 214 164 121 -22 248 136 -13 -175 -101 -60 47 118 71 69 -147 -187 -190 78 160 -28 207 73 -189
6984a89L24j35k37K63j05J25k49L90p2k78N6J75J3k36L03kl35L75k25P5j07PR0
$$ -189 135 0 -237 26 -79 46 -203 187 115 -163 -107 68 81 -155 148 146 -189 186 -39 36 -71 -64 26
7007B6J76J38k70k0k74N74m32k29M45l55J97L6j68Q9J00k51J35j16R7R5K30k24
$$ 26 202 340 70 50 -224 350 -82 -311 134 -221 -24 12 -156 -67 33 -218 -83 -199 -102 -7 223 -1
7029aj98M19l17J94J30k46Q6k74K82n8K17j19K47l39k48K61r7Jp8K74k43J12j91
$$ -1 -199 220 -97 97 227 -19 67 -207 75 17 234 115 362 23 -225 36 -61 -60 -138 136 -107 5 -186
7052a86K23j0l1k33K27j05J86KL38k63l46p7L42k15K24qj49mq2p0L50k41j17J14
$$ -186 37 27 -4 -237 -10 -115 71 73 411 148 -198 -275 67 -148 76 68 -81 -85 -167 -237 113 -128 -245 -131
7076a31K1L09j25J73k78nM6l57K47l1P2K29LNk41j02J36J89j49m7N8J32K0k77
$$ -131 -110 199 74 247 -31 -36 10 -347 -100 -131 -59 170 173 178 -63 -165 -29 160 11 -36 22 154 174 -103
7100a03r0J30n1J35J3K22l96J77M3m9J09M9l76K7J81j5M5J8j3j2R0k30N9q5o4
$$ -103 -193 -63 -114 21 34 256 -140 37 80 31 140 189 -187 -160 21 6 51 69 56 44 134 -96 -37 -122 -186
7125a86J37J71j06m7J04n89M86J48L4n6j30m8P1j68j24L00K9j5J72q2j58P2L0
$$ -186 -49 122 16 -31 73 -516 -30 118 152 96 -34 -82 -11 -179 -303 -3 26 11 183 101 -57 15 45
7148D5j8k9j56J11Q5l07N13j94M1J25l68K88m04J23J05J19N1k21J13qp5j21J94
$$ 45 27 -2 -158 -47 38 -269 244 50 91 216 -152 136 -268 -145 -40 79 130 -91 22 14 -61 -182 12
7171A2j6j86J73K01l55J19K08k59J39p1K4q7j13J6K43L9J00k85K23j51J50j17
$$ 12 -4 -190 -17 184 -171 -52 156 -103 36 -35 -11 -98 -211 -195 48 87 187 -98 125 -26 124 7
7193Gj66J81K63m0r3j8k28M5O1L2m8L37k14l27K94j54Q8P4m5R6k62J54K02j28
$$ 7 -159 22 285 245 152 134 -94 -49 12 44 -4 333 119 -208 86 -68 20 94 49 145 -117 37 239 111
7217A11k46K76j63J27K4k1k27Q8J33k14M6j54M09n66K35q2J65L78k83O1l9j56
$$ 111 -135 141 -22 105 129 108 -119 -31 102 -112 -66 -220 189 -377 -142 -224 -59 319 36 97 58 -98
7239i8K28J0m09K22Op4P9L86j80j92l8m3J11J09r5r4J00J74l77K55K2L7k39n9
$$ -98 130 140 -269 -47 -41 -115 -36 350 170 -22 -60 -103 8 117 22 -72 28 202 -175 80 102 139 -100 -159
7263a59K35P4j31j03N0m2r7K57l04M70l10K92j53j47k2J04k50K90J84n0j41m11
$$ -159 76 150 19 -84 -34 -76 -173 84 -220 250 -60 232 79 -68 -90 14 -236 54 238 188 47 -364
7285c64L83Q6j89K51j6q1J81k42m3m0k2J34J91j36j01Ok34L35j92R3m2K96m41
$$ -364 19 105 -84 167 151 70 251 9 -34 -74 -96 38 229 93 -8 -2 -236 99 -93 0 -42 254 -187
7308a87O7J97k40K06j66L7K11j77J48q9K40j85l5n1J8q8J73l52L13L53l19J61
$$ -187 -120 77 -163 43 -123 -86 125 -52 96 7 247 62 27 -24 -6 -94 79 -273 40 393 74 235
7330B35l36L5L03r7m06K00Kk47J41J62NL1k00K16Nm3p8K12j76K39N1l26J43ol
$$ 235 -101 -66 237 140 -266 -66 -64 -311 -170 -8 -3 28 -172 44 49 6 -72 140 -36 203 254 -72 71 65 62
7355F2L5j57P6r0Kj62J29O5K6k7k4j18J67K38m76M47K7l43K08k03K62N6j34Q3
$$ 62 97 -60 16 -74 -72 -234 -105 -40 -14 -41 -65 -183 -16 222 -254 193 220 -123 85 -118 144 200 66 149
7379A49Q6l85J18Q0k99K98l46K50RrJ64j4m6p8R3Jl53L79L2k04p2J06j00J18j08
$$ 149 235 -150 -32 48 -251 47 -299 -49 -40 -49 115 101 55 -23 70 71 -282 97 129 -75 -147 -41 -141 -23 -131
7404a31m0K53J06rl91M83j66p4k00Q8Q7k8J5K50l12L45l39O4p7J84k48P5j12j58
$$ -131 -171 82 188 179 -212 271 105 31 -169 -81 6 -22 -7 243 -69 276 -63 1 -76 108 -140 -65 -177 -335
7428c35K48J31J45j15j21K7J1J96j49p8j91J09j09k3L87j12j38K15R6j27r6J47
$$ -335 -87 44 189 74 -47 -20 -9 187 38 -40 -231 -122 -231 -254 133 21 -117 98 194 67 -29 118
7450A18j82K39l30L84r0k62K35j0L9Jj10k59J30K17j54R1p3p5K09j06J6J42k47
$$ 118 -64 175 -155 229 139 -123 112 102 141 142 32 -227 -97 120 -34 57 -16 -91 118 12 28 170 -77
7473g7K1L16o03L56j04J17J5j42J62kn9j52Q4P8k93J30L12j1k92K57m0l39L55
$$ -77 -56 260 -343 13 -91 26 41 -101 61 59 0 -152 -68 10 -283 -153 159 148 -144 113 73 -266 89
7496H9l56K67j35K14k7K41k57k01M6n8K49L14m11RJ40m6j50J88l47RL96k93J05
$$ 89 -267 0 -135 79 52 293 36 -165 -119 -177 72 386 -25 -16 124 78 -72 116 -231 -222 174 -119 -14
7519a4qq2O7R7K10m17J49K78j70J10k03J10J70k70J73L3k60K27o7j08Mj24J8n7
$$ -14 -22 -104 -37 60 270 -147 2 280 110 220 17 127 297 27 200 233 -27 200 133 25 29 -95 -77 -134
7543a34J63k4J34l06K82j37r2J92K9k83J56j17P8J01O3O2l29K32J3j46Q0j44J82
$$ -134 29 5 139 -167 115 -22 -114 78 107 -176 -20 -137 -59 42 105 167 -162 70 83 -63 17 -127 55
7566E5M6k36J89k72J19K94k20J31J54l65J9J74J42m01m4N54j60j5o2O9k7O1r2
$$ 55 101 -135 54 -218 -99 195 -25 106 260 -105 -86 88 230 -171 -215 339 179 164 102 171 144 205 113
7589A13P0l10O3j01K35j42Q3j52r6K34L04k38n5k57K38J49K17l09k73M7R8q1K04
$$ 113 183 -127 -64 -165 70 -72 11 -141 -237 -3 301 63 8 -249 -11 138 355 46 -227 -180 -82 -163 41
7612D1p4o1R6j42K8J04k2k63L77j08m5j2mK08J4l14O0K53J13j92P8j32R4p8Kj36
$$ 41 -33 -94 2 -140 -112 -8 -30 -293 84 -24 -69 -81 -85 123 137 -177 -117 136 249 57 135 3 97 19 21 -115
7638a15J28J07L2o7j0j80K20r6K00O1j17j65k43L00j13Q2J09k82L35m1j55J14
$$ -115 13 120 152 85 75 -105 115 19 219 280 163 -2 -245 55 -58 24 133 -149 186 145 -10 104
7660A04J61n8j54M6k17J05k44K88K4n9L47k95lq5N2j59K30k39K22m5J43j47M3
$$ 104 265 207 53 99 -118 -13 -257 31 55 -4 343 48 45 -40 12 -147 83 -156 66 21 164 17 60
7683F0k42J38R1k88L52j24j3n9K34m08Q4L11J46k70k5j81q4N59m56L52R6k57j01
$$ 60 -182 -44 47 -241 111 -13 -26 -85 149 -259 -175 136 282 12 -13 -194 -278 281 -175 177 273 16 -85
7706h5J72J03k47N4J33l65J87K31l63K71o5j18J48p4N4j77J07M0R8Nk6j18K6L6
$$ -85 87 190 -57 -3 130 -235 -48 183 -180 91 26 -92 56 -18 36 -141 -34 6 104 109 83 -35 -9 27
7730B7J9mj40J05J24p9j72m3J71n4m0j2J11l06K20L94k23k50J85K5j0k5j63L06
$$ 27 46 42 -98 7 131 52 -120 -163 8 -46 -86 -98 13 -293 -73 321 98 -152 33 58 48 23 -140 166
7754A66l30K77K98m35QL10m17J05N4Mj62o2L37l02O6K18j05M5j86j20J96J6N9
$$ 166 -164 113 411 -24 -16 294 -123 -18 36 40 -122 -184 153 -149 -83 135 30 75 -111 -231 -35 -19 40
7777D0j60J24N8k58K88p1n9M90k21l14o9J12J77KLk30K02J04l50J68k19K6K2J58
$$ 40 -120 4 62 -196 92 21 -38 452 231 -83 -152 -40 137 139 142 -88 114 218 -132 36 -183 -157 -135 23
7801B3p3R2l78M17j80J07k45Q6K05k57J76j26o5J55J01j28l9L67m18J71j24P6
$$ 23 -50 42 -336 81 -99 8 -237 -151 54 -203 -27 -153 -218 -63 38 -90 -129 238 -180 -9 -133 -57
7823e7J19k39K48j2k28L54M6k24J39Ol2J6J8j45k20L10R1k2j6j39j8j33J85R0
$$ -57 62 -177 71 59 -169 185 231 7 146 152 120 136 154 9 -211 99 190 168 152 13 -5 -138 47 137
7847A37J74k90k33J12K34k60O4r6N9J65k39J10NK28j44J82k42n0R6jO7j63j57
$$ 137 311 21 -212 -100 134 -126 -62 -158 -99 66 -173 -63 -58 170 26 208 -34 -84 12 11 78 -85 -242
7870b42L13oj55N34n46K70k26K2O2Q0O3m6j59K63k13j57J30K00k70M6ol15J43
$$ -242 71 65 -90 444 -102 168 -58 -36 26 106 169 123 -36 227 14 -143 -13 187 -83 -37 -43 -358 -215
7893b15R0Q7p5J04J74q6K9K08j73m65M6K23R1K48l31J62j06j6m2J06j9K04j43
$$ -215 -125 -38 -113 -9 165 79 108 316 143 -322 -276 -53 38 286 -45 117 11 -5 -47 59 40 244 101
7916A01j08J44J25l8j92J20j54L49l08K5j80J93q3j22l9L7J09k51L23J16j26l12
$$ 101 -7 137 262 224 32 152 -2 347 39 64 -116 77 -6 -128 -167 -130 -21 -272 51 167 41 -271
7938b71J62K02o1J71l1m42K07J15k75J89N2L8m8JJ40j42k06O0M49k28J97k98Q4
$$ -271 -109 93 32 203 172 -270 -63 52 -223 -34 18 56 8 9 149 7 -199 -139 310 82 279 -19 65
7961F5L2KJ32l83K43k34M9K25k01O1L56m24J2R6K41k31K3O0l7k3j12m6J28n5J62
$$ 65 97 99 231 -152 91 -143 -94 131 -70 -9 347 -77 -65 31 272 41 64 124 87 64 -48 -94 34 -21 141
7986A41j72K43l68M9J63R6j24lj34M38l76J52j85j79J87PL9p9J32R2k36J99r4
$$ 141 -31 212 -156 -107 56 152 28 25 -109 329 -47 105 -80 -259 -72 -65 -26 -105 27 119 -117 82 -12
8009a2k5L07m73J79p3J87J34j40j53K11r4K35n32J65K71j75k2k40L75K0j90k8
$$ -12 -37 270 -203 -24 -97 90 224 84 -69 142 48 283 -249 -84 187 12 -10 -250 125 145 -45 -73
8031g3J58j83K21K2rP7K3j80k6K78pl17QK35m16J84J27k25j54L27O2k80OK63l
$$ -73 85 -98 123 145 136 213 236 56 30 308 301 -16 -8 227 -189 -5 122 -103 -257 70 132 -148 -142 121 118
8056A18j66j03j8L66l34M9R9k21M75k91L6J79k03j70P5j47M38k82K14K08l55L07
$$ 118 -48 -151 -169 197 -137 -88 11 -210 265 -26 10 189 -14 -184 -109 -256 182 -100 114 322 -33 274
8078B74k98R6j65K49l20j6O9l2K00R2j89J89j70O6nj15k0L39k27m0P7m6j09J85
$$ 274 -24 72 -93 156 -164 -180 -111 -143 57 149 -40 149 -21 45 40 -75 -95 244 17 -23 54 8 -101 84
8102H4r8q9j07J69J97j99L2o5K50k47M8R2j21J17j02l3M48j58L8k20k26L13J22
$$ 84 -14 -103 -210 -41 156 -43 -11 -76 174 -73 -25 67 -54 63 -39 -72 376 218 256 36 -190 123 245
8125B45n11M25o4n8J03j94K41j93j04Pj1j17M20l05o1J3L82k86J80n8k5nK77k11
$$ 245 -266 159 95 37 140 -54 187 -6 -110 -103 -114 -231 189 -116 -177 -164 218 -68 112 54 29 24 301 90
8149I0l27J60j33KK12P9o4m1j87K53j69k5L00L8j38J37n0j85j84N03l15m6N4K37
$$ 90 -237 -77 -210 -208 4 83 19 -22 -209 44 -125 -150 150 188 50 187 137 -48 -232 271 -44 -90 -36 201
8173B01k15j51M45k90j07j80L28N4R8l31R1m3K0J08q1n1J49J09
$$ 201 -14 -165 280 -10 -117 -297 31 85 183 -148 -57 -100 -80 28 -53 -104 45 154
8191A54
$$ Imaginary data points
##PAGE= N=2
##DATA TABLE= (X++(I..I)), XYDATA
0@%%%%%%%%%%Qj6J6k4L2l2M0n6O6p4R3j17J36j60J92k24K58k98L44l97M56n21
$$ 0 0 0 0 0 0 0 0 0 0 0 8 -8 8 -16 16 -16 24 -32 34 -40 53 -64 72 -88 104 -120 138 -160 184 -213 243 -278
32b78N94o73P61q58R64j083J213j353J509j679J864k067K286k525K788l078L393
$$ -278 316 -357 404 -454 510 -573 640 -713 796 -883 981 -1086 1200 -1325 1463 -1615 1778
49A778l736M116m536N000n514O088o733P464q297R258j0385J1723j3345J5364
$$ 1778 -1958 2158 -2378 2622 -2892 3196 -3537 3927 -4370 4888 -5497 6226 -7119 8245
63H245j7946K1387k6238L3635m6427P4695k51189J06754K98864l42348O2659K14989
$$ 8245 -9701 11686 -14552 19083 -27344 47351 -203838 -97084 201780 -140568 -77909 137080
75A37080j13495j36960K22445K9444j18244Q0514N6868k24334l9706J37811p0499
$$ 137080 23585 -113375 109070 138514 20270 100784 157652 -66682 -106388 31423 -39076
86c9076j11496J54195N6650j49783j9041J26738J5281r237L5374r896l7019J3787
$$ -39076 -150572 3623 60273 -89510 -108551 18187 33468 24231 59605 49709 12690 26477
98B6477p232k4415J7919J0101m1166j7431o934j8670L5618M8980l0268m711M9503
$$ 26477 19245 -5170 12749 22850 -18316 -35747 -42681 -61351 -25733 23247 -7021 -11732 37771
111C7771l8217n1336Q5523N8925p3282k3141M8839m1947n7140N1918K5834o0570
$$ 37771 -446 -51782 33741 92666 19384 -3757 45082 3135 -54005 -2087 23747 -36823
123c6823N426M2365n2595l1706P7794L0248m1095K1764L6555l9216k3354M0266
$$ -36823 -31397 10968 -41627 -73333 4461 34709 -6386 15378 51933 12717 -10637 29629
135B9629J5937k8761j2627n834l1647j6837K4222J3762r713Q867J6955q204q495
$$ 29629 45566 16805 4178 -1656 -33303 -50140 -25918 -12156 -21869 -13002 3953 -4251 -12746
148a2746K7433L7013m793k6621L550l763m0717q729K9822q752k7743R993K915
$$ -12746 14687 51700 46907 20286 23836 20073 -20644 -29373 449 -8303 -36046 -26053 -23138
161b3138j9005K1787M8344J058j4195K4392O56m1485J985L3267j8409l0909L270
$$ -23138 -42143 -20356 27988 29046 14851 39243 39899 -1586 399 33666 15257 -15652 -12382
174a2382j4166k5149J6381K3590P23J3836J9883j3258j2676K4627J8318j3648
$$ -12382 -26548 -51697 -35316 -11726 -11003 2833 22716 9458 -3218 21409 39727 26079
186B6079n389R79k5217k2415N33j35N711J4319o661j1743J4915J3815P21J3727
$$ 26079 20690 21669 -3548 -25963 -25430 -25565 -19854 -5535 -12196 -23939 -9024 4791 5512 19239
200A9239J8292o583j7727p242o881p518Q476J016k1175m677J0803j0043k099L1138
$$ 19239 37531 30948 13221 5979 -902 -8420 56 1072 -20103 -24780 -13977 -24020 -26119 5019
214E019J6589j1779n98O712n933j771R550k187j2531k906p849k0048K865K2106
$$ 5019 21608 9829 9231 15943 10010 8239 17789 15602 3071 165 -7684 -27732 -24867 -2761
228b761k389r569J1335N748r062O284J5916M608j142j978j0130j0627K245L836
$$ -2761 -5150 -14719 -3384 2364 -6698 -414 15502 20110 18968 16990 6860 -3767 -1522 2314
242B314q143m073M910p935j1230P072J3383O254M308J672L87J358LQ48K283M83
$$ 2314 -5829 -9902 -4992 -12927 -24157 -17085 -3702 2552 6860 8532 8919 10277 10280 11128 13411 13894
258A3894n894j2728j0552J68K266l34J389L664K596J225J103Q856J3141J555m177
$$ 13894 8000 -4728 -15280 -15112 -12846 -13180 -11791 -8127 -5531 -4306 -3203 5653 18794 20349 16172
273A6172j917n718o438l420l291k586k627m492m941k57R105J1234K665L471P527
$$ 16172 14255 8537 2099 -1321 -4612 -7198 -9825 -14317 -19258 -19515 -10410 824 3489 6960 14487
288A4487N69n244J467K066k673n587r112p547l632k77J309K568M985O091j4m28
$$ 14487 15056 9812 11279 13345 10672 5085 -4027 -11574 -15206 -15483 -14174 -11606 -6621 -530 -544 -972
304i72Q460P321Q90j738k695m844o137o587j655J548j466k499q49L10N320N932
$$ -972 7488 14809 15699 13961 11266 6422 285 -6302 -7957 -6409 -7875 -10374 -11223 -10913 -5593 339
320C39M041L837K931p06l404l363P41J845m889n853j367k005k507J119M019M297
$$ 339 4380 8217 11148 10442 7038 3675 4416 6261 1372 -4481 -5848 -7853 -10360 -9241 -5222 -925
336i25K297r38O00K155K456K093j131j720k99m112n765N28K652nj954j336J178
$$ -925 1372 434 1034 3189 5645 7738 6607 4887 4588 476 -5289 -4761 -2109 -2114 -4068 -5404 -4226
353d226J577k08L177M107J321q31j673j771Q00J439j915k240j460p29k070l061
$$ -4226 -2649 -2857 320 4427 5748 4917 3244 1473 2273 3712 1797 -443 -1903 -2632 -4702 -7763
369g763K816N540q67j513K444K196m38J002J755R91k126l040k326k385J49J786
$$ -7763 -4947 593 -274 -1787 657 2853 2415 3417 5172 6163 4037 997 -1329 -3714 -3565 -1779
385a779k327j590L243O57j594K950M531J722j138n26o8j373j683m24j695j964
$$ -1779 -4106 -5696 -2453 -1796 -3390 -440 4091 5813 4675 4149 4081 2708 1025 601 -1094 -3058
401c058n73j975j977K842M323P30O77J917J771m1j393R20J288l066l437j851j553
$$ -3058 -3631 -5606 -7583 -4741 -418 312 989 2906 4677 4636 3243 4163 5451 2385 -1052 -2903 -4456
418d456m38j3M36J631J350M00J831J285J922K848r68k451l26j046l479j594J89
$$ -4456 -4894 -4907 -4471 -2840 -1490 -1090 741 2026 3948 6796 5828 3377 3051 2005 -1474 -3068 -2879
435b879j13j659r80J636J491J051L428J231K06J580j41k596J38J104k064l196
$$ -2879 -2992 -4651 -5631 -3995 -2504 -1453 1975 3206 3412 4992 4851 2255 2393 3497 1433 -1763
451a763j790N17q76j307J717K343J87O99J543O09J208J327o72p09p79q09j763
$$ -1763 -3553 -3036 -3912 -5219 -3502 -1159 -972 -273 1270 1879 3087 4414 3742 3033 2254 1445 -318
468c18k298L5J517j882j611J795R70M22J394J685J155m0j88J01p64NO37k646k027
$$ -318 -2616 -2581 -1064 -2946 -4557 -2762 -1792 -1370 24 1709 2864 2824 2636 2737 1973 1978 2615 -31 -2058
487b058R98j335k379J322K410l69j8J325J317N47O48R24j00p43K32j873k192M35
$$ -2058 -1060 -2395 -4774 -3452 -1042 -1411 -1429 -104 1213 1760 2408 3332 3232 2489 2721 848 -1344 -909
505i09J54k098k87M96J34K99J329J350J525M09k00L29l2J77r88j595l90n40j996
$$ -909 -755 -2853 -3140 -2644 -2510 -2211 -882 468 1993 2402 2202 2531 2499 2676 1688 93 -297 -837 -2833
524b833j69K3M51J735l4j90J683J361m47L90J145j57j799j091k9j176q64J93j92
$$ -2833 -3002 -2979 -2528 -793 -827 -1017 666 2027 1580 1970 3115 2958 1159 68 39 -1137 -2001 -1808 -2000
543b000q68J411O23n50J679J904k83p52N61L26p71j232J89m28j559L15k09m25
$$ -2000 -2868 -1457 -834 -1384 295 2199 1916 1164 1725 2051 1280 48 237 -191 -1750 -1435 -1644 -2069
561b069J085J163p72O53J265L8n14L12P39o66j150n52J98o37k21K25k22M68L3
$$ -2069 -984 179 -593 60 1325 1363 849 1161 1900 1234 84 -468 -270 -907 -1128 -903 -1125 -657 -624
580f24J57N35N12J59P20n76n69L37p4j273L22L89n73r17L57P06Q7k94J017K43
$$ -624 -467 68 580 739 1459 883 314 651 577 -696 -374 15 -558 -1475 -1118 -412 -325 -619 398 641
600F41m93Q05j68q89Q37N11j597k99M23j19p83M37O16j78l46O04K40J00Q11J7
$$ 641 148 953 785 -104 733 1244 -353 -652 -229 -348 -1131 -694 -78 -256 -602 2 242 342 1153 1170
620A170q74M03L84j270k85N50n92l59p7K3K39L61J22M84K93O53k27m11M48Q2j250
$$ 1170 296 699 1083 -187 -472 78 -514 -873 -950 -927 -688 -327 -205 279 572 1225 998 587 1035 1117 -133
641a33J16j37j028o7N32p53L76J115K1l23P68J153r50L9N56k61j111K98m60q50
$$ -133 -17 -154 -1182 -1249 -717 -1470 -1094 21 42 -281 487 1640 690 729 1285 1024 -87 211 -249 -1099
661a099J10N26q16k14J381k43MQ07Q60j27q52N55L63q56j27k20q99j70k33l63
$$ -1099 -989 -463 -1279 -1493 -112 -355 -351 456 1316 1189 337 892 1255 399 272 52 -847 -1017 -1250 -1613
681a613J32J065J01K10M12L4O17O4j59J8J04o24k87p05r5K35n06J19L95m01K78
$$ -1613 -1481 -416 -315 -105 307 341 958 1022 863 881 985 361 74 -631 -726 -491 -997 -878 -483 -884 -606
702f06O85J71M83K66j91j24lk76j26n99J59m9p07l60N01L00j6M76n2K69M67m36
$$ -606 79 250 733 999 808 684 681 405 279 -320 -161 -210 -917 -1277 -776 -476 -492 -16 -68 201 668 232
724B32M28O2J3j6n63l34M4k97n33P05n2k59J5P7P02R4J00K1K09k01J35j17n59
$$ 232 660 722 735 719 156 -178 -134 -431 -964 -259 -311 -570 -555 -478 224 318 418 439 648 447 582 465 -94
747i4K00K5n90j65P6L53j43J83K36J50rj50N45n45N67op04K31j42m78j00nL98
$$ -94 106 131 -459 -624 -548 -195 -338 -155 81 231 222 72 617 72 639 633 -71 160 18 -460 -560 -565 -167
770a67j16l19n8R61k00K62J82j00k33K52n51K45j70l15M4j93L9J57L32j20K36
$$ -167 -283 -602 -660 301 101 363 545 445 212 464 -87 158 -12 -327 -283 -476 -437 -280 52 -68 168
791A68M5k00j34L36J71j76m55K98j18k76J66j09L13J25j67R3J5J15J02k40k87
$$ 168 213 13 -121 215 386 210 -245 53 -65 -341 -175 -284 29 154 -13 80 95 210 312 72 -215
812b15L61J06p71r3M60j18J68o5j91L87J46m6J04L17m63J55k4j67j69j02n2K02
$$ -215 146 252 -519 -612 -152 -270 -102 -167 -358 29 175 129 233 550 87 242 218 51 -118 -220 -272 -70
834g0k81K19j28J29l5J53j12L84o5M4J30k93K90j48k08j59KJ75l89k02N15n2l44
$$ -70 -351 -132 -260 -131 -166 -13 -125 259 194 238 368 75 365 217 9 -150 -148 27 -362 -564 -49 -101 -445
857d45L53P9M9Q7J59q5j05N5k23J15k58P4n0p7k69K98O63m98k24L10J34J52j00
$$ -445 -92 -13 36 123 282 197 92 147 -76 39 -219 -145 -195 -272 -541 -243 420 -78 -302 8 142 294 194
880A94m8M59l02m60J57k40k83M18o57L41J58K13l76N29K85j45Q2M6K5J02l20q9
$$ 194 146 605 303 -157 0 -240 -523 -105 -762 -421 -263 -50 -426 103 388 243 325 371 396 498 178 89
902H9Nk11k21J05k27J80J21m4J02N0N19m23R7J60L22m58j3K35n54R9j53k27K17
$$ 89 94 -117 -338 -233 -460 -280 -159 -203 -101 -51 468 45 142 302 624 166 153 388 -166 -67 -220 -447 -230
925b30n9j14L33j10K92K14r6j49R7J98j61M5m59K07p2j33k39L97k49J60J5l6N51
$$ -230 -289 -403 -70 -180 112 326 230 81 178 376 215 260 -199 8 -64 -197 -436 -39 -288 -128 -113 -149 402
948D02k88k69J54K27k70K26p4j56q8J94L11l44k2R3J1l06J23M86n16L07N3j93
$$ 402 114 -155 -1 226 -44 182 108 -48 -136 58 369 25 3 96 107 -199 -76 410 -106 201 254 61
970F1q0r8o4K87J6r8n7p3N4J53o4k07P1J85m2O0J7rj21l0J57m4k76O9J08r3J54
$$ 61 -19 -117 -181 106 122 24 -33 -106 -52 101 37 -170 -99 86 44 104 121 112 -9 -39 118 74 -202 -133 -25 -118 36
997C6q3RN1L11k28K0j97k2J73M4n1J01m11O4m5K09L4l10K24L98j20j56J33l45
$$ 36 -47 -38 13 324 96 116 -81 -103 70 114 63 164 -247 -183 -228 -19 15 -295 -71 327 207 51 184 -161
1021a61oM88p00L77l94K66k21K16J14j59K60r2J68k27m8J02k5R5O3l21j55M61
$$ -161 -167 321 -379 -2 -396 -130 -351 -135 -21 -180 80 -12 156 -71 -119 -17 -42 53 116 -205 -360 101
1043A01n40J98K71p2J33j14o1K68K5j1Q9k10j9J04m45K5J10l42L80j01o2M20k44
$$ 101 -439 -241 30 -42 91 -23 -84 184 209 198 287 77 58 162 -283 -258 -148 -490 -110 -211 -273 147 -97
1066i7K56L5J67j12p1O9j92j11l2k89M24k11J90k66M6L6K81J0O3Kj07J32k55K73
$$ -97 159 194 361 249 178 247 55 -56 -88 -377 47 -164 26 -240 -194 -158 123 133 196 198 91 223 -32 241
1090B41j85N2k33p5k82M20k12l04M56N0J03j93P3K72j41Q3P8j46p4L29m01P9m59
$$ 241 56 108 -125 -200 -482 -62 -274 -578 -122 -72 31 -162 -89 183 42 125 203 57 -17 312 -89 -10 -469
1113d69K40j01j22O81m95J92j8K38j21J42N8p6l9j49R1j53l1L24m39k7P9k50L37
$$ -469 -229 -330 -452 229 -266 -74 -92 146 25 167 225 149 110 -39 52 -101 -132 192 -247 -274 -195 -445 -108
1136a08M8K33j72L98k84o2K59k29L6N4k52K51l60r8K52j06k47M24N5K06j30l2
$$ -108 -60 173 1 399 115 53 312 83 119 173 -79 172 -188 -286 -34 -140 -387 37 92 298 168 136
1158A36j81p7L25k04R2o3j42L9j82J51m6K02rJ52k19n7J9J84om79L00L30k47J24
$$ 136 -45 -122 203 -1 91 28 -114 -75 -257 -106 -152 50 41 193 -26 -83 -64 120 114 -365 -65 265 18 142
1182A42j45j16k02J97r2K97j0j65O0K92k70L1j0Q8j75j1K1l8K3R4K23m69K19M23
$$ 142 -3 -119 -321 -124 -216 81 71 -94 -34 258 -12 19 9 97 -78 -89 -68 -106 -83 11 234 -235 -16 407
1206D07o38L05J48j47O7l81N73l57o6R0Q4k21k60L90J50j56J10J52l38K48l27
$$ 407 -231 74 222 75 142 -239 334 -23 -89 1 85 -136 -396 -6 144 -12 98 250 -88 160 -167
1227a67P7K33p5R0m44Q5l8J4p3L18k6n6K50j38L1M3k1j63L1j9Q7N2k43K06k92
$$ -167 -90 143 68 158 -286 -201 -239 -225 -298 20 -6 -62 188 50 81 124 103 -60 -29 -48 39 91 -152 54 -238
1252b38k3R6J3j0K56K4J35l34P5K14k10J16J12l9p2l07P9K48k40j79J58J27K06
$$ -238 -261 -165 -152 -162 94 118 253 -81 -6 208 -2 114 226 187 115 -192 -113 135 -105 -284 -126 1 207
1275B07l17J43J26J15o5j50j73J34J44j18k67K06k25k77L58p2J57p7J44K63k01
$$ 207 -110 33 159 274 209 59 -114 20 164 46 -221 -15 -240 -517 -159 -231 -74 -151 -7 256 55
1296E5K29j28K11m43J10k02K74l88J36L08l27J30o9K82j82j25L04L7j27K14l78
$$ 55 284 156 367 -76 34 -168 106 -282 -146 162 -165 -35 -104 178 -4 -129 175 212 85 299 -79
1317g9J28r9N0k49J99p1k22P0L79k28J07j5J91n7k7n5J91j10o9j52K03N4j67l4
$$ -79 49 -50 0 -249 -50 -121 -343 -273 106 -122 -15 -30 161 104 77 22 213 103 34 -118 85 139 -28 -62
1341f2R6N2l27M70J11j89l13J67k20L89J17k03k2J16l20j01N4r2K63l74L78J09
$$ -62 34 86 -241 229 340 151 -162 5 -215 174 291 88 66 182 -138 -239 -185 -277 -14 -388 -10 99
1363I9j24K86l51L7J10m7k04K10l86K53J7k35K88nn3L19j87j41R8N0K0j0J77k21
$$ 99 -25 261 -90 -53 57 10 -194 16 -370 -117 -100 -335 -47 -52 -105 214 27 -114 -16 34 54 44 221 0
1387@Q6k32K07N9j81J37k74K06M6o0n8M8n5J67j06J28k71L41R5n71M08l03J02
$$ 0 86 -146 61 120 -61 76 -198 8 54 -6 -64 -16 -71 96 -10 118 -153 188 283 -288 120 -183 -81
1410h1J82j22J73m6j47l4J03q6K88p6Q6l27J77k63P1P1j56K75m2k01J65L0K47
$$ -81 101 -21 152 106 -41 -75 28 -58 230 154 240 -87 90 -173 -102 -31 -187 88 46 -155 10 40 287
1433B87k08K73j73n5j26J07j43m6l3j29J98j84L21k17J42l3j72K45O3k65J13j24
$$ 287 79 352 179 124 -2 105 -38 -84 -117 -246 -48 -232 89 -128 14 -19 -191 54 117 -148 -35 -159
1455a59j2K25l6nj1L6J05j91l0k35L46L2j34J07r3L27k53j24P4j27J18q5L43l24
$$ -159 -171 54 18 13 2 38 143 -48 -78 -313 33 65 -69 38 -55 272 19 -105 -31 -158 -40 -125 218 -106
1479a06K48k08j93K38j15K66l22K01L6P4l03K79K5j04Nm60L61J71R2j77J56J77
$$ -106 142 -66 -259 -21 -136 130 -192 9 45 119 -184 95 120 16 21 -439 -78 93 185 8 164 341
1501C41n31K16j8n9j3K01j20j23O1lR4J83J06k52m05N5K36RL50ok83K70l22j86
$$ 341 -190 26 8 -51 -64 137 17 -106 -45 -48 46 229 335 83 -322 -267 -31 -22 328 322 39 309 -13 -199
1525a99j78M10j50o1K85k75j0K89j27j74J04J91j12L4L2k90M84k46j02J21p9k01
$$ -199 -377 33 -117 -178 107 -168 -178 111 -16 -190 -86 105 -7 27 59 -231 253 7 -95 26 -53 -254
1547b54K25K35j27j98P5j44J5o1J74p9K21j06N0k87J80N56n04J31k93L5L93j78
$$ -254 -29 206 79 -119 -44 -188 -173 -234 -60 -139 82 -24 26 -261 -81 475 -29 102 -191 -156 237 59
1569E9j58O9j09q1J48O8K10r1M7pk11N0M0k20K68L6p3J69l46J31J62j66nq0k16
$$ 59 -99 -30 -139 -220 -72 -4 206 115 162 155 -56 -6 34 -186 82 118 45 214 -132 -1 161 -5 -10 -90 -306
1594c06K49K13k00J8J28q1L5j3l3N3j88M1j64L06l0k8MJ09M9j43J9l42M77m1j09
$$ -306 -57 156 -44 -26 102 21 56 43 10 63 -125 -84 -248 58 28 0 4 113 162 19 38 -304 173 132 23
1619B3k16j22L81m0K59l98L39j44p8J18k6j5p3J92m7K5k19k2J00l5K08o2l49L09
$$ 23 -193 -315 66 26 285 -113 226 82 4 122 96 81 8 200 153 178 -41 -63 37 2 210 148 -201 108
1643A08j73j37L20j05Q0j00j56J85j66J56K7j23K51j6p3l17J63M21l55j29Q7J46
$$ 108 -65 -202 118 13 93 -7 -163 22 -144 12 39 -84 167 151 78 -239 -76 345 -10 -139 -52 94
1665I4k8k68J23J31j5m7j62J85k25K06J44j85L5m8P5M03o13K05M3k34K58J73j86
$$ 94 66 -202 -79 52 37 -10 -172 13 -212 -6 138 -47 -12 -60 15 418 -195 10 53 -181 77 250 64
1688F4j81J99k6kj22J30Q7n3j60k03J89K50j93Q2n2M2j79j05K05Q7l1l41M23n5
$$ 64 -117 82 56 54 -68 62 149 96 -64 -267 -78 172 -21 61 9 51 -128 -233 -28 59 28 -313 110 55
1712E5q7L3Om4J1Q3k05m8L10k07N2J7j43nk4K48r5j01K38j57R6j26K86j39k8K40
$$ 55 -32 1 7 -37 -26 57 -148 -196 114 -93 -41 -24 -167 -172 -196 52 -43 -144 94 -63 33 -93 193 54 26 266
1738B66Q4j20l67p4J20j43J40N0j16j94K53J28l7J01Pr7o8J75j44K26k06j31M07
$$ 266 350 230 -137 -211 -91 -234 -94 -44 -160 -354 -101 27 -10 91 98 1 -67 108 -36 190 -16 -147 260
1761B60r3j56j16K18j80p2M08l98O0J78K21k51M5j80k05J03M39k33k61J63o0n
$$ 260 167 11 -105 113 -67 -139 269 -129 -69 109 330 79 124 -56 -261 -158 281 48 -213 -50 -110 -115
1783a15J17o9N9N5J10j44L10l6n77L34J23o0l06J36K99l27K37j29Pj19J12P6j29
$$ -115 2 -67 -8 47 157 13 323 287 -290 44 167 107 -199 -63 236 -91 146 17 24 -95 17 93 -36
1806c6K18j93pJ90j32O7N2k56K0L1R8J31p9L4j60j73J90J63j14j44Q3j09j25K28
$$ -36 182 -11 -18 172 40 107 159 -97 -77 -46 52 183 104 138 -22 -195 -5 158 44 -100 -17 -126 -251 -23
1830b3K74k14j53K32k75J65r7J61k38K69R7p4k5m3n3j6J2m7J59j09Q2p5k11l2
$$ -23 251 37 -116 116 -159 6 -91 70 -168 101 198 124 99 56 3 -13 -1 -48 111 2 84 9 -202 -234
1854b34K21l5M7J00k96J7M17j62l81L25R2k81K03J35k33j12K00m2K27l81J05R7
$$ -234 -13 -48 -1 99 -197 -180 237 75 -306 19 111 -170 33 168 -65 -177 23 -19 208 -173 -68 29
1876B9J84p5j66K19k54K55j92K8J15r9Ro3L3k6Jj4k6J47k07j01J19N9j75L89j46
$$ 29 213 138 -28 191 -63 192 0 28 143 44 53 -10 23 -3 -2 -16 -42 105 -102 -203 -84 -25 -200 189 43
1901D3j9j18J27R5m5M7k06K41N4m13L55j24P3j19j80j8L29jk60L89q3l4K35m32
$$ 43 24 -94 33 128 83 130 -76 165 219 -194 161 37 110 -9 -189 -207 122 121 -139 250 167 133 368 -64
1925f4O4j03J0J58k58J79p2O2J19K63l65j6O5q5m0j49N35l29J59k96L22n48K93
$$ -64 0 -103 -93 65 -193 -14 -86 -24 95 358 -7 -23 42 -43 -83 -232 303 -26 133 -163 159 -389 -96
1948i6j2o4K8K35K39k01l60J26J67k43K33l79L16O5J80k48j39j2k1K52q5m6kO5
$$ -96 -108 -172 -144 91 330 129 -231 -105 62 -181 52 -327 -11 54 234 -14 -153 -165 -186 66 -19 -65 -67 -2
1972bJ89k20J22n9P1l83M72j91J71j89L7j3R1j51k0n6J89K15l26O1L9K32j72J5
$$ -2 187 -33 89 30 101 -282 190 -1 170 -19 18 5 96 -55 -75 -131 58 273 -53 8 47 279 107 122
1996A22j4mQ0l40K7J05J04Q9J5j77r4K3Rm5nJ16M2l65L44J83k60o3Q6L16m98J82
$$ 122 108 104 184 -156 -129 -24 80 169 184 7 -87 -64 -55 -100 -105 11 53 -312 32 215 -45 -108 -22 294 -204 -22
2022b2J87qk27o0J46M3M7J09j49l8qj62J81K26p2l09J31k43Q6n8L63k74R8oj29
$$ -22 165 157 -70 -130 16 59 106 215 66 28 20 -142 39 265 193 -116 15 -228 -142 -200 163 -111 -13 -19 -148
2047a48O8l8J42j6j68j2K99L6o4j26J31j35K36n3l09M29k98M3j30k17J61L08k81
$$ -148 -80 -118 24 8 -160 -172 127 163 99 -27 104 -31 205 152 -157 272 -26 17 -113 -330 -169 139 -142
2070a42K34j16o0M0K6R1N5L6N1Nr0l10J39j66L98q7j35L8J74m19L92j76K44j41
$$ -142 92 -24 -84 -44 -18 73 128 164 215 220 130 -180 -41 -207 191 104 -31 7 181 -238 154 -22 222 81
2094H1j33L1K20k92J96J21l68J64q4k36K78j8j28R5r7L14k42MJ9L27j00l3J3p9
$$ 81 -52 -21 199 -93 103 224 -144 20 -64 -300 -22 -40 -168 -73 -170 144 -98 -94 -75 252 152 119 132 53
2118E3j14j91L21K33k02m0j14K8l6K39k03K18k87k04k9K58J48J55J6k28K26k27
$$ 53 -61 -252 69 302 100 60 -54 -26 -62 177 -26 192 -95 -299 -328 -70 78 233 249 21 247 20
2140B0nJ84J43l68J55Ok81J73j05M63m56K6J43n0M2j0L2j00J32K6k90n6J87O8
$$ 20 15 199 342 -26 129 135 -146 27 -78 385 -71 -45 98 48 90 80 112 12 144 170 -120 -176 11 79
2164G9k39j5K33n1m9o4j68N29o00N48j03M4p6K6n2j95l4J9K35k66QK15k0p3O2
$$ 79 -160 -175 58 7 -42 -106 -274 255 -345 203 100 144 68 94 42 -153 -187 -168 67 -199 -191 24 4 -69 -7
2189gK1m06N32m08M3L41J38k57n3K42k10k38J1J56J79k44M5M3K06j93K34k08j
$$ -7 14 -392 140 -268 -225 116 254 -3 -56 186 -24 -262 -251 -95 84 -160 -115 -72 134 -59 175 -33 -34
2212c4k32J47O1J88n5k48J43j93r3L57J14k83O9j5L8QM7l5K24j32k04J40J04k95
$$ -34 -266 -119 -58 130 75 -173 -30 -223 -316 41 155 -128 -59 -74 -36 -28 19 -16 208 76 -128 12 116 -179
2236a79L79P0k70J40j50o1j1j53J49K2J16j78K42k51P5j01K8l0K5K62o3j58m5
$$ -179 200 270 0 140 -10 -71 -82 -235 -86 -64 52 -126 116 -135 -60 -161 -133 -163 -138 124 61 -97 -142
2259a42M33m72k3J49N1k08K88k87K07R7j19J69o2J1k55K01J10QQ7j48k2M5j90
$$ -142 291 -181 -204 -55 -4 -212 76 -211 -4 93 -26 143 81 92 -163 38 148 156 243 95 73 118 -72
2282g2pJ1K61k56L12m08Q4J69r7o9k11J15K49M1j43R0k53J90j29J96l71K64M8
$$ -72 -79 -68 193 -63 249 -159 -75 94 -3 -72 -283 -168 81 122 -21 69 -184 6 -123 73 -298 -34 14
2305A4PP8j43R3k92K88J18l69O4K56l20o6N75n25K41p8P8k32M05N7l19R1Q1k49
$$ 14 21 99 -44 49 -243 45 163 -206 -142 114 -206 -272 303 -222 19 -59 19 -213 192 249 -70 21 102 -147
2329a47L2j89Q5K25k5l8p6J13j88K9j98N80k78J19L8pl32K88l53M71l1j28O9l5
$$ -147 -115 -304 -219 6 -19 -57 -133 -20 -208 -179 -377 203 -75 44 82 75 -257 31 -322 149 118 -10 59 24
2353B4J5j59L30l54J00j32O5K23r8l5k9J86l6p9N5k11L45m07M79k20k44n7K58
$$ 24 39 -120 210 -144 -44 -176 -111 112 14 -21 -50 136 100 21 76 -135 210 -197 282 62 -182 -239 19
2376A9P2j56J11J41r4Q9Q1j83O5J59m42L19j31j15j94J55Q0J45J2m42L70J90l53
$$ 19 91 -65 46 187 93 182 263 80 145 304 -138 181 50 -65 -259 -104 -24 121 133 -309 61 251 -102
2399a02J27Q7j72p9M14m88J7J47KP1n6j21M41l28j54L31oj2l10M26j9r8L0r1o1
$$ -102 25 112 -60 -139 275 -213 -196 -49 -47 24 -32 -153 288 -40 -194 137 131 119 -191 235 216 118 148 57 -4
2424dJ65k97L92j72l14J78k4p2j6K03j61J55q4m1K01r3p6j91J8J86k6l2j07L42
$$ -4 161 -136 256 84 -230 -52 -76 -148 -164 39 -122 33 -51 -92 109 16 -60 -251 -233 -47 -73 -105 -212 130
2448A30l09L47m8n8k16Q6j01L0J73J17p1j46L60l56k4J70P0l21j99K18J88j1j23
$$ 130 -179 168 120 62 -154 -68 -169 -139 34 151 80 -66 294 -62 -86 84 154 -167 -366 -148 40 29 -94
2471i4L81j27j89j42j9O2J66k58J98q8K0K57k76N6K71p1j66N4j65J28K51j81j25
$$ -94 287 160 -29 -171 -190 -128 38 -220 -22 -110 -90 167 -109 -53 218 147 -19 35 -130 -2 249 68 -57
2494e7O1K11m25J88J59j86p4J13j5j50M29n47L12j46M55l59p8J71J80j49oK47
$$ -57 4 215 -210 -22 137 -49 -123 -10 -25 -175 254 -293 19 -127 328 -31 -109 62 242 93 87 334
2516C34o03K26P3k27L25r6k76N07n02M77k55o2J82K52l61m4L26n5k41l5O3K43
$$ 334 -269 -43 30 -197 128 32 -244 263 -239 238 -17 -79 103 355 -6 -50 276 221 -20 -55 8 251
2538B51k57mk5j32M6M59m55Q9q9J11j72J81J13j49k74L58J35j29l48L70J3l39
$$ 251 -6 -10 -35 -167 -121 338 -117 -28 -117 -6 -178 3 116 -33 -307 51 186 57 -291 79 92 -247
2560b47J59O6oq1o8J87R5n4J76m49J0R0P6m7K04j14o1L1n5P8R6j45Q5K59o8l44
$$ -247 -88 -22 -28 -109 -177 10 105 51 227 -222 -212 -122 -46 -93 111 -3 -64 -33 -88 -10 86 -59 26 285 217 -127
2586a27Q4j99K73l5J31n5K9j98K44n4j68O9M2j30J92j56k9m9K87k35L25n50J64
$$ -127 -43 -242 31 -4 127 72 101 -97 147 93 -75 -6 36 -94 98 -58 -87 -136 151 -84 241 -309 -145
2609a45L79j03j72j30N30l35J64n4L3M6o31L97J95l19L80j87J07j49j81K01J66
$$ -145 234 131 -41 -171 359 24 188 134 167 213 -418 -21 174 -145 235 48 155 6 -175 26 192
2630A92l33J53r6L4M0k1p2J05N0r6O8k23J15J13j80j12K92l38M61K4q6L30n33
$$ 192 -141 12 -84 -50 -10 -31 -103 2 52 -44 24 -199 -84 29 -151 -263 29 -309 152 176 90 420 -113
2653a13K64l2l30L18R7j69l8k62L82j68L7j03K44j30J11J13j54l6J33j07J87k67
$$ -113 151 119 -211 107 204 35 -3 -265 117 -51 -14 -117 127 -3 108 221 67 31 164 57 244 -23
2675b3K4Q2j97r9J54rJ4r5j3o7K97K2j00O6k22jJ29J26K6q3k0K7J45k63J5j58
$$ -23 1 83 -114 -213 -59 -68 -54 -149 -162 -229 68 90 -10 56 -166 -167 -38 88 114 31 11 38 183 -80 -65 -223
2701b23L97l67jJ57K71k36N1J11J7k09r3K53q4j53k74N16q7p0p7MJ02j01R2rl2
$$ -223 174 -193 -194 -37 234 -2 49 160 177 -32 -125 128 44 -109 -383 133 46 -24 -101 -97 5 -96 -4 -13 -45
2726d5j59K74l5r4K28ql37N25n39O0J4P4J2N3n0LJ91j37k31J73N3K8k17j05K23
$$ -45 -204 70 35 -59 169 161 -176 349 -190 -130 -116 -42 -30 23 -27 -24 167 30 -201 -28 25 53 -164 -269 -46
2751d6R8J95k41n3l21M64l12L51l3j54K9l6m3J25R8j56K68j19k98M8J75j68OJ98
$$ -46 52 247 6 -47 -368 96 -216 135 102 -52 -23 -59 -102 23 121 -35 233 114 -184 -136 39 -129 -123 75
2775G5k04L9n5n5K69J48l39J68l0L7q8K8O0J06k51J26m4j83J29j29k8K03R3m1
$$ 75 -129 -90 -145 -200 69 217 -122 46 16 53 -35 -7 53 159 -92 34 -10 -193 -64 -193 -221 -18 75 34
2799C4rr1J44k26L43m98K85O8K72r7n78L26j50L25l9J9P2l56Q1J10J47k60j18
$$ 34 25 -66 78 -148 195 -303 -18 50 322 225 -353 -27 -177 148 109 128 200 -156 -75 35 182 -78 -196
2822a96J02J97l37M49k57Q5k83J90J47m6o9m9J79o6k31J87L9J82l61o8L89k65
$$ -196 -94 103 -234 215 -42 43 -240 -50 97 51 -18 -67 112 46 -185 2 41 223 -138 -206 183 -82
2844h2l7j27K64k75N55k07o7J28j95Mj06K79l28J86K35k92J35p1J71j99l6K23
$$ -82 -119 -246 18 -257 298 91 24 152 -43 -39 -145 134 -194 -8 227 -65 70 -1 170 -29 -65 158
2866A58k96M41k62j16K45k62R6j53J04j36j1p6N38k11K2l26K43j02j48j03L55
$$ 158 -138 303 41 -75 170 -92 4 -149 -45 -181 -192 -268 270 59 81 -245 -2 -104 -252 -355 0
2887@j50l6R9p9L58l27K73l8P3l03M51m97L03pN3l54K44l55K92j77J94rmo4k08
$$ 0 -150 -186 -87 -166 192 -135 138 100 173 -130 321 -176 127 120 173 -181 63 -292 0 -177 17 8 4 -60 -268
2912b68M70j50R7k7q1J55P4l23J99j8j75kn2J35l31J28j32K40k47M49j62K75o2
$$ -268 202 52 149 122 41 196 270 -53 146 128 -47 -49 -101 34 -297 -169 -301 -61 -308 141 -21 254 192
2935A92k34J29j17Q7l01K51NK60k82m0J89P0l92L38j66l8K96k44r5J65%n3P1P4
$$ 192 -42 87 -30 57 -244 7 12 272 -10 -50 139 209 -183 155 -11 -49 247 3 -92 73 73 20 91 165
2959A65l5N7q5k61K45k34K93J17n06J65q1j39M86l45K0K66l01J64J25k13J41k95
$$ 165 130 187 102 -159 86 -148 145 262 -244 -79 -160 -299 187 -158 -138 128 -173 -9 116 -97 44 -251
2981b51J29J54j48J09P0l6J01j84J56m95L82K83m76J55K28k84L07O4k35J6J48
$$ -251 -122 32 -116 -7 63 27 128 -56 100 -395 -13 270 -206 -51 177 -107 200 264 29 45 193
3002A93l04P6R6k06L43k07j79J30K33J07l61J37NR1k31N7j09K05k83K6J42N7j40
$$ 193 -111 -35 61 -145 198 -9 -188 -58 175 282 -79 58 63 154 -77 -20 -129 76 -207 -181 -39 18 -122
3025a22j02K18k4R2k36K4J30qJ41l0j24k3oLL07k85o1P8L6j24p2L15r3K62m25
$$ -122 -224 -6 -30 62 -174 -150 -20 -28 113 83 -41 -64 -70 -67 240 -45 -106 -28 8 -116 -188 127 34 296 -129
3050a29J47N4k03N6J9n6O6j85K37M8l73K63K80l37J88l76j5N34l04L71o8k54K7
$$ -129 18 72 -131 -75 -56 -112 -46 -231 6 54 -319 -56 224 -113 75 -301 -316 218 -86 285 217 -37 -10
3073a0K21j84j59L15k70J89j59m6P9Q3k2k0o0J29k26J48J81k20o6K07l9j76j1
$$ -10 211 27 -132 183 -87 102 -57 -103 -24 59 37 17 -43 86 -140 8 189 -31 -97 110 71 -105 -116
3096a16K6j17M6K14p6l2K01k96N0p3L9L78j71N3j31k91M08j9j83K92j96k35J36
$$ -116 -90 -207 -161 53 -23 -55 146 -150 -100 -173 -134 244 73 126 -5 -296 112 93 -90 202 6 -229 -93
3119i3p1L25q9R5n8J27k87J17n4p7K10k56J60qJ46j15m0p7n4p5M15j78M7m00L34
$$ -93 -164 161 72 167 109 236 -51 66 12 -65 145 -111 49 41 187 72 32 -45 -99 -174 241 63 110 -290 44
3144D4n8k20K20J05K3j1k64J45K10j50K47l39P8j37K08k20k97K68J36N0r8r9J25
$$ 44 -14 -234 -14 91 114 103 -161 -16 194 44 291 -48 30 -107 101 -119 -416 -148 -12 38 -60 -159 -34
3167c4K78m90M12j97J08p1j38K9L6kPJ10j04k3N9jm8M55m11K6K41k89K14J46k00
$$ -34 244 -246 166 -31 77 6 -132 -103 -67 -69 -62 48 -56 -79 -20 -21 -69 386 -25 1 242 -47 167 313 113
3192A13j4p2Pj42Q0J00K07l3k6l5J9k85L39j87j42k6K7O4Lj83J38K17j13l29K03
$$ 113 99 27 34 -108 -28 72 279 246 220 185 204 -81 258 71 -71 -97 -70 -6 -3 -186 -48 169 56 -273 -70
3217g0K09M7k06J01K55l06j46J38j38J0J76j38L5M7j77M11o95M66J37r3R5l22
$$ -70 139 186 -20 81 336 30 -116 22 -116 -106 70 -68 -33 14 -163 248 -447 19 156 63 158 -164
3239a64NnJ35k20J97j02j62L26l04K95j7k6J7O6k9l37N10O6l69P4J90p2j18J03
$$ -164 -159 -164 -29 -249 -52 -154 -316 10 -294 1 -16 -42 -25 41 12 -325 185 251 -118 -44 146 74 -44 59
3263E9m5p3J38l38K52j48J05J36K07m49K93k81J22K87k75Q0k72R6l7j41K06O4
$$ 59 14 -59 79 -259 -7 -155 -50 86 293 -156 137 -144 -22 265 -10 70 -202 -106 -143 -284 -78 -14
3285a4L74l11J63k84L10j18l22K80J00jk64J91k84K50k42J37P4p1K3M8L82k28
$$ -14 360 49 212 -72 238 120 -202 78 178 177 -87 104 -180 70 -172 -35 39 -32 -9 39 421 193
3307A93j95Kl2K10j07j61K16l06q1J79J72J5Q0k98R0r2K72j81O4j17K17j12Q9
$$ 193 -2 0 -32 178 71 -90 126 -180 -261 -82 90 105 185 -113 -23 -115 157 -24 40 -77 140 28 117
3330A17p0k54O7P8J21P7l15M25k90J32k04P2M1K55p3j47J22j6k94J28K82k86P3
$$ 117 47 -207 -140 -62 59 136 -179 246 -44 88 -116 -44 -3 252 179 32 154 138 -156 -28 254 -32 41
3353D1j30on6J84j14J22Q6j0o5j17J21j61l5L08j63n2RK57K16o04N83l76K6M6
$$ 41 -89 -95 -151 33 -81 41 127 117 52 -65 56 -105 -140 168 5 -47 -38 219 435 -169 414 38 64 110
3377A10k7r1J17K50k83j18J49K30j83j5k17J37J03l55M0L39k80J87j98J24L62
$$ 110 83 -8 109 359 76 -42 107 337 154 139 -78 59 162 -193 -153 186 -94 93 -105 19 381
3398C81p22L79j38N7P4k0pJ35k02J47rj63q5j6J89M3J7k18M02j99qk67R7jL72
$$ 381 -341 38 -100 -43 31 11 4 139 -63 84 75 -88 -173 -189 0 43 60 -158 244 45 37 -230 -133 -134 238
3423B38j65%j92J98K52j82k3j88j8oQ4m9J37k91j84N47l27J26K06j84j55o6J06
$$ 238 73 73 -119 79 331 149 126 -62 -80 -86 -2 -51 86 -205 -389 158 -169 -43 163 -21 -176 -242 -136
3446a36J4M25l9m38K70j31j79L95j32pl98L24J81k45J46L7K07o16N65m48L13p1
$$ -136 -122 303 264 -174 96 -35 -214 181 49 42 -356 -32 149 -96 50 87 294 -322 243 -205 108 37
3468C7Jl3j10O7l7K20j51J8P0j09R3j27K12l7K4Rk01j59j4O07k01l30J72J03J45
$$ 37 38 5 -105 -38 -75 145 -6 12 82 -27 66 -61 151 114 138 147 -54 -213 -227 380 179 -151 21 124 269
3493B69m70K55Kk55M55k71j22J26R7l20K36M0k7K8j60K77p4p0j47K26j11J5N2
$$ 269 -201 54 56 -199 256 -15 -137 -11 86 -234 2 42 15 43 -117 160 86 16 -131 95 -16 -1 51
3516E1L2k50K99m9o4k39J22J90j20L6J10j50N2m4K84m21K13p3J29Nk08J85k81
$$ 51 83 -167 132 83 19 -220 -98 92 -28 8 118 -32 20 -24 260 -161 52 -21 108 113 -95 90 -191
3539a91K5J23r8j21L62j26%q6Km2N21m16P6J06K6m0P6K8l72J6K30l68J50L20j75
$$ -191 -166 -43 -141 -262 100 -26 -26 -112 -110 -152 369 -47 29 135 161 121 197 225 -147 -131 99 -269 -119 201 26
3564B6J51j96L3R4j45J38N6l94J92o3K62j40R7k77Q3J37j68M2J54J77m05kK00
$$ 26 177 -19 14 108 -37 101 157 -237 -45 -108 154 14 111 -166 -83 54 -114 -72 82 259 -146 -148 52
3587E2J03k70K7n1K08j99J93p1j12M70r2k30r5n6K20j18j73j38K49J31J40k89
$$ 52 155 -115 -88 -139 69 -130 63 -8 -120 350 258 28 -67 -123 97 -21 -194 -332 -83 48 188 -101
3609a01J60n1m6J94Ll62J28J68k28J12R4k46J08l7M8K50k42j85M0Q0K37r2j12
$$ -101 59 8 -38 156 159 -203 -75 93 -135 -23 71 -175 -67 -104 -56 194 -48 -233 -193 -113 124 32 -80
3632h0J00k0j92K66j26J38j46Q1j09J07O1j23o5Q7j29J38j36J74J96k82m2K47
$$ -80 20 0 -192 74 -52 86 -60 21 -88 19 80 -43 -108 -21 -150 -12 -148 26 222 -60 -102 145
3654A45o9Q3J12j22j08J33j16j29L05m23L1M3O2j5M9P6j1q5J80k18J01j57J17
$$ 145 76 159 271 149 41 174 58 -71 234 -189 -158 -115 -53 -68 -19 57 46 -39 141 -77 24 -133 -16
3677a6J32J37j85N7j09R5k53M1j3o7N12n44L25p4J67j37l4j0p4M5J58r3L2j48
$$ -16 116 253 68 125 16 111 -142 -101 -114 -181 331 -213 112 38 205 68 34 24 -50 -5 153 60 92 -56
3701e6n3K22q1J03J07q2j6j48J01j71K89l30K8J34O2k45J19J55J02k19L28k38
$$ -56 -109 113 32 135 242 160 144 -4 97 -74 215 -115 -87 47 109 -136 -17 138 240 21 349 111
3723A11k66K51j75rR6L8o4J49k52K4K53n7j5m06J58M0j2k7M44n53L80l9k62K80
$$ 111 -155 96 -79 -88 8 46 -18 131 -121 -97 156 99 84 -322 -164 -124 -136 -163 281 -272 108 69 -193 87
3747H7j13M5L3j77k9K68qN0j77K13p2R8j87p1J32k17J38k45j10K66K52j26%RJ64
$$ 87 -26 19 52 -125 -154 114 106 156 -21 192 120 218 31 -40 92 -125 13 -232 -342 -76 176 50 50 59 223
3772B23q9J68k73K48j88q3k59J73q7J43J30j86J74j99J1L58l40j8OL36m27L48
$$ 223 134 302 29 277 89 6 -253 -80 -167 -24 106 -80 94 -105 -94 264 -76 -94 -88 248 -179 169
3794A69j82J72k27J4k1J52k8k05K78k44L42l23j87K72N1N5k13l9J01K96l17j8
$$ 169 -13 159 -68 -54 -75 77 49 -156 122 -122 220 -103 -290 -18 33 88 -125 -164 -63 233 -84 -102
3816a02n9J80k17J08r0N0lJ13K4Q4m7l13L1j9R3L64j10n6j35k7M0J7p2J71j21
$$ -102 -161 19 -198 -90 -180 -130 -133 -20 4 88 41 -272 -241 -260 -167 197 87 31 -104 -131 -91 -74 -146 25 -96
3841i6m6P8K3r8l19M97j41J41j75R1K91l88M6Qlj21J27j03K13kJ19O4l69K7J58
$$ -96 -142 -64 -41 -139 -458 39 -102 39 -136 -45 246 -142 -96 -88 -91 -212 -85 -188 25 23 142 206 -163 -136 22
3866B2J07j3j5N2l43J42Q4j5L16n36J02o0K59j61n3P9pk7N3l8mJ65n7l08J94J8
$$ 22 129 116 101 153 -190 -48 36 21 337 -199 -97 -157 102 -59 -112 -33 -40 -67 -14 -52 -56 109 52 -256 -62 -44
3892d4p4L1L2r0K24j93j1K6K88r8k92J98K55n35J60Q6J68j18k87M87j21L7l22
$$ -44 -118 -87 -55 -145 79 -114 -125 -99 189 91 -201 -3 252 -283 -123 -37 131 13 -274 213 92 129 -193
3915a93L13J30k82J47k07P1j11J08N0j48K91k61K49jj65Qm3M4j23K84j19J25n03
$$ -193 120 250 -32 115 -92 -21 -132 -24 26 -122 169 -92 157 156 -9 -1 -44 0 -123 161 42 167 -336
3938c36N06l33K61l44L91m8k80K24k00L11l68J46J43j98N7N0K14m50L02l07K16
$$ -336 170 -163 98 -246 145 97 -183 41 -159 152 -216 -70 73 -125 -68 -18 196 -254 48 -259 -43
3959d3l22K59j38L47j67l4J26k24l4L73J4k36K55j32R0r6L7k2o3j81j42L23j26
$$ -43 -365 -106 -244 103 -64 -98 28 -196 -230 143 157 -79 176 44 134 38 75 53 -10 -191 -333 -10 -136
3982a36R1J54l74J0J48m3K00o3q5J20R0l9K50m55P6Mk2Q4J66j87Jj45N68l36j4
$$ -136 -45 109 -265 -255 -107 -150 50 -13 -98 22 112 73 323 -132 -56 -52 -74 10 176 -11 -10 -155 413 77 63
4007F3O7M0j46L8J08k7K3M4l73n0K56O5k63J39K72m67K82l2j26J53k24L18r9J05
$$ 63 130 170 24 62 170 143 166 210 -163 -213 43 108 -155 -16 256 -211 71 39 -87 66 -158 160 61 166
4031A66Kj01k2N0kl23J49O3J43j27j48k9K69j13J58j56o7J43l4l88J76j58K15
$$ 166 168 67 45 95 93 -230 -81 -18 125 -2 -150 -179 90 -23 135 -21 -88 55 21 -367 -191 -349 -134
4054a34N27o21M7K34o7N1J73j2K6l01K83k14j85M16k45J73p6r9J39o7j34K20j26
$$ -134 393 -228 -181 53 -14 37 210 198 224 -77 206 -8 -193 223 -22 151 75 -24 115 48 -86 134 8
4077Hj63j0N6J54k3M8k42N3KQ2L5J3p9j6M1k59J60M32k21j12j35L12kj89k61M80
$$ 8 -155 -165 -109 45 22 70 -172 -119 -117 -35 0 13 -66 -82 -41 -300 -140 292 71 -41 -176 136 134 -55 -316 164
4103A64m8k14J12l2K5m7p5J37Ml6P0j68k2J50k33j2K79K61k28Jj52L04j99O5L5
$$ 164 116 -98 14 -18 7 -40 -115 22 26 -10 60 -108 -130 20 -213 -225 54 315 87 88 -64 240 41 106 141
4128A41k59J30J57k52K19l36J61l91P26l05j89K82m7K64k29K36l43k21R6O0j52
$$ 141 -118 12 169 -83 136 -200 -39 -430 296 -9 -198 84 37 301 72 308 -35 -256 -160 -100 -252
4149b52J44L27k09m4J55k11R2N7q3j83r7R1O4N09j14m47K62Nj30j73K52K2r0R
$$ -252 -108 219 10 -34 121 -90 2 59 -24 -207 -304 -213 -149 360 246 -201 61 66 -64 -237 15 37 -53 -44
4173d4R4O2j49j11K28L5j94N3P0j04k16K63r8P4o8K05q5J59j76J63J07k11k57
$$ -44 50 112 -37 -148 80 115 -79 -26 44 -60 -276 -13 -111 -37 -105 100 15 174 -2 161 268 57 -200
4196b00K17o2L1R0j07l9j60J02K41j80N4q8P0n3O6K38l11N1m9M44l46P4j04J01
$$ -200 17 -45 -14 76 -31 -70 -230 -128 113 -67 -13 -101 -31 -84 -18 220 -91 -40 -89 355 9 83 -21 80
4220H0o0p2P0l7J0p5j2J82j07M1Ko6J27j5l16J91J98k31Kj67K91n9k6J33J73k55
$$ 80 20 -52 18 -19 -9 -84 -96 86 -21 20 22 -44 83 68 -248 -57 141 -90 -88 -255 36 -23 -49 84 257 2
4246Bj27J61l17N5K07L01k18l82L21q0R6n5nN3M3k24j90M30j57K45n2o7M5o1K24
$$ 2 -125 36 -281 -226 -19 282 64 -318 3 -77 19 -36 -41 12 55 -169 -359 71 -86 159 107 40 85 24 248
4271B48l21J92R9k31J59k32J59L17l26K2r2J20J46l14J34k26J99J09j9k4l12L07
$$ 248 -73 119 218 -13 146 -86 73 390 64 86 -6 114 260 -54 80 -146 53 162 143 119 -193 114
4293A14l81N22l89N7r3OJ24K8m4J48mm9L5j44L26l14K48r6M1l00j6J43q5M5K33
$$ 114 -267 255 -134 -77 -170 -164 -40 -12 -56 92 88 39 74 -70 256 -58 190 94 135 -165 -181 -38 -123 -78 155
4318A55n6J52k60J8O3j78J50kj5L34l88o8J46k22M0K93p7j19J07j34K84j95l8
$$ 155 99 251 -9 9 72 -106 44 42 27 361 -27 -95 51 -171 -131 162 85 -34 73 -61 223 28 -10
4341a0n7P9Lj09K23q1r7J58k36K08l31K94j19J03k79J62m9Q2K19l40l9M55l48
$$ -10 -67 12 15 -94 129 48 -49 109 -127 81 -250 44 -75 28 -251 -89 -138 -56 163 -177 -216 239 -109
4364a09J86j34%J27r6J94j39J44n8k49J46P5k01N42l99Jk66K38J35j06l04L58
$$ -109 77 -57 -57 70 -26 168 29 173 115 -134 12 87 -114 428 29 30 -236 2 137 31 -273 85
4386H5P3j33q2j18K5K61r0J44k71J19J17j04L6n7Q6j73P7j9j44K68j91K2l3J31
$$ 85 158 25 -57 -175 -150 111 21 165 -106 13 130 26 62 5 91 -82 -5 -24 -168 100 -91 -69 -102 29
4410B9L6m8J5Np2J29k47OL51j59k16K42j24O3j7j05L17l31l0J84J56k51R2k60
$$ 29 65 17 32 37 -35 94 -153 -147 204 45 -171 71 -53 10 -7 -112 205 -126 -156 28 184 -67 25 -235
4434b35K23k34K99j60L4K12P6k69P8j53P4M9o4K10l0k12R4j86J47j15K34p5K7
$$ -235 -12 -246 53 -107 -73 139 215 -54 24 -129 -55 -6 -70 140 110 -102 -8 -194 -47 -162 72 -3 24
4457B4q%O9l7j3j17L07l15L41K5k21Q0j2j65J71j78p8K76l4k72J23J35J67j43
$$ 24 16 16 85 48 35 -82 225 -90 251 276 55 135 123 -42 129 -49 -127 149 115 -157 -34 101 268 125
4481A25k81J56J5j8j89J97N7p8j24K6J75n8JJ09n9j01q7RJ93p6o6k8J57K15k8
$$ 125 -156 0 15 -3 -192 5 62 -16 -140 -114 61 3 4 113 54 -47 -134 -125 68 -8 -74 -102 55 270 242
4506B42l05L47j43Mk00K20R6j20k30K55K8m92L29k12L24j03j45M39m46j0j4q5
$$ 242 -63 284 141 145 -55 165 261 141 -89 166 194 -298 31 -181 143 40 -105 334 -112 -122 -136 -221
4528b21j4K28p2j62N2J48j07L07q8k2k33n9L32K6j92N7J3n3j84M39k00j34MJ64
$$ -221 -235 -7 -79 -241 -189 -41 -148 159 71 49 -184 -243 89 115 -77 -20 -7 -60 -244 195 -5 -139 -135 29
4552B9Rk40N32l51K28p8l85J70K87j62J43q0L9l06J94J49k49p0K61n5j78K89q6
$$ 29 38 -202 330 -21 207 129 -256 -86 201 39 182 102 141 -165 29 178 -71 -141 120 65 -113 176 90
4575I0l53N76k35j17p1m3K83l52jL65Q1j70n1K39m91K18k40M00J02k99J93r6M8
$$ 90 -263 313 78 -39 -110 -153 130 -222 -223 142 223 53 2 241 -250 -32 -272 128 230 -69 124 28 76
4598G6l96J26J72k5J25J9J1j24k19K17k8R0j75J48rr6K92k68J70r8L33k44k5j19
$$ 76 -320 -194 -22 -47 78 97 108 -16 -235 -18 -46 44 -131 17 8 -88 204 -64 106 8 341 97 72 -47
4622d7n0k2mJ54j16poM07j71k68j97L23J04j93K65j53K4J64l73J11J30J35q5k01
$$ -47 -97 -119 -123 31 -85 -92 -98 309 138 -130 -327 -4 100 -93 172 19 43 207 -166 -55 75 210 125 -76
4646g6J26l6j59K82R3k78L34k16k1j37N6q1n7K51Q3J0J6k30o9O0p3J87j02j68
$$ -76 50 14 -145 137 230 -48 286 70 49 -88 -32 -113 -170 81 164 174 190 -40 -109 -49 -122 65 -37 -205
4670b05k6L62q7k31J29j57K28k66N3L17j35K7J16r3j07K8K93l99J62P7p5O8p7
$$ -205 -231 131 44 -187 -58 -215 13 -253 -200 117 -18 9 125 32 -75 -47 246 -153 9 86 11 79 2
4693BJ03Rp5q8j7j60J41K32j14L96m73LJ50j72kl2j77J08K24J22k33n3K31j85
$$ 2 105 114 39 -49 -66 -226 -85 147 33 429 -44 -41 109 -63 -65 -97 -274 -166 58 180 -53 -106 125 -60
4717f0m6N7Pl1n8J33l04K63j4L0R3j36Q0Q5m90L22j72L05J8M6j43K9k13NM0J0
$$ -60 -106 -49 -42 -73 -131 2 -302 -39 -53 -23 70 -66 14 99 -391 -69 -241 64 82 128 -15 14 -199 -194 -154 -144
4743a44R4k77K05J90j04K73J9l78J82j13M9O6M8j60L77l22J46l70J51k43M26j36
$$ -144 -50 -327 -122 68 -36 237 256 -122 60 -53 -4 62 110 -50 327 5 151 -219 -68 -311 115 -21
4765b1J0M5m9o0J06j05O2K32n29M48j46j83J96q0P0L0l29L24P5p1N2m4n0J26j22
$$ -21 -11 34 -15 -75 31 -74 -12 220 -309 139 -7 -190 6 -74 -4 26 -303 21 96 25 77 33 -17 109 -13
4790a3N3j97M22j39l48L62o0P4n3j88J05p0K44r0J88k51j36j56L31j18K68N1k18
$$ -13 40 -157 265 126 -222 140 80 154 101 -87 18 -52 192 102 290 39 -97 -253 78 -40 228 279 61
4813F1k66j6J63j26K97M4j53l8L57j35l53R4J45j0k1j14J68m0O3q6k09J62j49
$$ 61 -205 -221 -58 -184 113 157 4 -34 323 188 -165 -71 74 64 43 -71 97 57 120 34 -175 -13 -162
4836a62o2j1O39l39j65P0K1J74k94K64k14L18l23J3J72N8j38L68k51j76k07M76
$$ -162 -224 -235 404 65 -100 -30 -9 165 -129 135 -79 239 -84 -71 101 159 21 389 138 -38 -245 231
4858B31j38j27J91J55m9j78ML3J53j56j47l5R5o0rK62l81J92n1K03r4k14J30K39
$$ 231 93 -34 157 312 263 85 89 122 275 119 -28 -63 32 -28 -37 225 -156 36 -15 188 94 -120 10 249
4882B49k57k2j41O9K93l37J23Q0k69L40p5j9J24j21K49k61J01j50J24j10q9K13
$$ 249 -8 -30 -171 -102 191 -146 -23 57 -212 128 53 34 158 37 286 25 126 -24 100 -10 -99 114
4904A14l42J48R8j90K25l4J84m16J12o7K64k26J31k2J3L1o7J33J27l6k73N8K70
$$ 114 -228 -80 18 -172 53 19 203 -213 -101 -168 96 -130 1 -21 -8 23 -44 89 216 180 -93 -35 235
4927B35Kj63%j65j3J27M1J23l16J89j39J70j27O6r6j28J22j0J18q7j37K25K65
$$ 235 237 74 74 -91 -104 23 64 187 -129 60 -79 91 -36 30 -66 -194 -72 -82 36 -51 -188 37 302
4950C02l11j81L9J52Q2j20j22L14m51K93K47k32o9J17j77L3P6K73m51L32o4l3
$$ 302 -9 -190 -151 1 83 -37 -159 155 -296 -3 244 12 -57 60 -117 -84 -8 265 -186 146 82 49
4972D9j11m8p6J80J7K0J4k19J46J61o5K1m32J64K56r3o9J81L1j60k6K3K42M2k48
$$ 49 -62 -110 -186 -6 11 31 45 -174 -28 133 68 89 -343 -179 77 -16 -85 96 127 -33 -59 -36 206 248 0
4997@K7J2J37k63K15l14K81k6qj82J01K10k96J62o2J05j01N4pr8J06k19J2K05
$$ 0 27 39 176 -87 128 -186 95 69 61 -121 -20 190 -106 56 -6 99 -2 52 45 -53 53 -166 -154 51
5021E1j13K54j30j39K6J63j76K46l18Q9l8J58j04K47j36j29RqJ2j12L96l32K26
$$ 51 -62 192 62 -77 -51 112 -64 182 -136 -47 -85 73 -31 216 80 -49 -40 -48 -36 -148 248 -84 142
5044A42l18K36J98m12M10j65k49K92J83l31k4n0J70j05o1J83M6J28j23l71J62
$$ 142 -176 60 258 -154 256 91 -158 134 317 -14 -38 -88 82 -23 -84 99 145 273 150 -221 -59
5065e9j18K66j07K2k3R4k22J78O3j14J13M9M9p5j23J80j25k15K17j32N2k29K58
$$ -59 -177 89 -18 4 -19 75 -147 31 94 -20 93 142 191 116 -7 173 48 -167 50 -82 -30 -259 -1
5088al5L4J68n1j05m9L6M2JK2l36K48j6K36l46K84m83N44k14k17K62J12Rl10K83
$$ -1 -36 -2 166 115 10 -39 -3 39 40 62 -274 -26 -42 194 -152 132 -351 193 -21 -238 24 136 145 -165 118
5113A18r1m1L2p2J45j45j08K62K6J04n45K64O7K9j34J79K1j54L04k58j75K39k58
$$ 118 27 -14 18 -54 91 -54 -162 100 126 230 -315 -51 16 45 -89 90 111 -43 261 3 -172 67 -191
5136a91J77j46L29j81j37L17j99J78j46j3L68l46k36K86J4q3K33k27j27O5J94
$$ -191 -14 -160 169 -12 -149 168 -31 147 1 -12 356 10 -226 60 74 -9 224 -3 -130 -65 129
5157A29j14m5J59j01Nj63J39J45j65n8k11J91J57R7l97L08K2k67J26R3j25L2J08
$$ 129 15 -30 129 28 33 -130 9 154 -11 -69 -280 -89 68 165 -232 76 98 -169 -43 50 -75 -43 65
5180F5k68L1J82Nk40L74k54J1o4qR8K23l21K65kj13K63m70K68k03L16m95M81k06
$$ 65 -203 -172 10 15 -225 149 -105 -94 -158 -166 -68 155 -166 99 97 -16 247 -223 45 -158 158 -337 144 -62
5204f2j20J63R4m82N45j93k02J62J44J05r7j79j63K78J31l28K81L9k65K29pok6
$$ -62 -182 -19 75 -407 138 -55 -257 -95 49 154 57 -122 -285 -7 124 -204 77 116 -149 80 73 67 41
5227D1q2J48m20K80P9q0Qj36J84K9p5Q4l57L23r4L43j99j32J12j54M7j55K37j07
$$ 41 -41 107 -313 -33 46 -34 -26 -162 22 51 -24 60 -297 26 -68 275 76 -56 56 -98 -51 -206 31 -76
5251g6M8k3J57P5J39k16q2j20J43k97L17j04J8o9Kj19J74%J28m9j40k39L46J58
$$ -76 -28 -51 106 181 320 104 22 -98 45 -252 65 -39 -21 -90 -88 -207 -33 -33 95 46 -94 -333 13 171
5275A71J71k53o5K49k52k04K18J5O4l26n7L30l75L01j4K57k82j15n4J67R5K1J55
$$ 171 342 89 24 273 21 -183 35 50 114 -212 -269 61 -314 -13 -27 230 -52 -167 -221 -54 41 62 217
5298B17j66P6%j57K57l60K46L4k1Q5j36k08J77J06j34n6J49o1m6j10r9L31n7k4
$$ 217 51 127 127 -30 227 -133 113 147 126 211 75 -133 44 150 16 -40 109 48 2 -108 -207 124 67 43
5322D3l36K07J84r3n6N5K1l15J51J94j29j05J84p2l2k95N02j74O4j77R1r2K90
$$ 43 -293 -86 98 5 -51 4 25 -290 -139 55 -74 -179 5 -67 -99 -394 108 -66 -2 -179 -88 -180 110
5345A10j32OJ24j85K49m28K00j78L36j43L7j48k8M16j76j68K85j95M6q2j11L91
$$ 110 -22 -16 108 -77 172 -256 -56 -234 102 -41 -4 -152 -180 236 60 -108 177 -18 28 -54 -165 226
5367B26k51j82M20k09j5QM7N5Kj72K34l15M76n09K95m7J44l18Q5K8k40K49n6O1
$$ 226 -25 -207 213 4 -11 -3 44 99 101 -71 163 -152 324 -185 110 63 207 -111 -26 2 -238 11 -45 16
5391A6k21L52j56qj88K80r7Kp2J66j17K3n4J29r9n1K78j99k12K6L03%j49O1q9
$$ 16 -205 147 -9 -17 -205 75 -22 -20 -92 74 -43 -20 -74 55 -44 -95 183 -16 -228 -202 101 101 -48 13 -76
5416g6L31l42Ln8p7J59j40J86rK19Nj50M0p0j56K09O7k30K75l63N03l71K22k6
$$ -76 255 -87 -84 -142 -219 -60 -200 -14 -23 196 201 51 91 21 -135 74 141 -89 186 -177 326 -45 177 151
5440A51r0k%O0o8n8J74k18j69k1K69K34n3k95Q6K9n4J12k00l8J87N6k45j4J68
$$ 151 61 59 59 119 51 -7 167 -51 -220 -241 28 262 209 -86 0 29 -25 87 -113 -151 36 92 -153 -167 1
5465AK02m61J7N67m83K08l9M7K84m74M2j47J94j45L96l18n6pP1o1j10K69k24M29
$$ 1 203 -258 -241 326 -157 51 12 59 343 -131 -89 -236 -42 -187 209 -109 -165 -172 -101 -162 -272 -3 -227 202
5489B02k04m6j60L67j64M3k5n6o6K14J15k10n3q7M34l91R3Q5J08j66j7nJ59l85
$$ 202 -2 -48 -208 159 -5 38 13 -43 -109 105 220 10 -43 -130 304 -87 6 91 199 33 16 11 170 -215
5513b15K55O1j66J11k82M25l0j51j45K70k58L07j09j45n3j10K45o0m3J99K7p1
$$ -215 40 101 -65 46 -236 189 159 8 -137 133 -125 182 73 -72 -125 -235 10 -50 -93 106 133 62
5535F2k09j5J94L3r8l8q0O2q8N6L50m29K03K36o4q5Q4k27P5L01k62R4k30j32J44
$$ 62 -147 -162 32 65 -33 -71 -151 -89 -177 -121 229 -200 3 239 175 90 174 -53 22 323 61 155 -75 -207 -63
5560f3J71k13K4P1pO4k0J81j33N2j24j61K12lK40m13J27M7N7j67o9NL0Q3J2L09
$$ -63 108 -105 -81 -10 -17 47 27 208 75 127 3 -158 54 51 291 -122 5 52 109 -58 -127 -122 -92 -9 3 312
5586C12k66P8k53LK9j9P7P6oj44J53lP9j55J16j97K66k1P4j79q8Q4J6Qj21L6N1
$$ 312 46 124 -129 -126 -97 -116 -39 37 31 -113 40 37 116 -39 77 -120 146 125 199 20 -68 16 32 40 -81 -45 6
5613FK68n69L83j59n2K66m49K30P5j25K65l38L34j45j50Q4K41j60j25K55l8l25
$$ 6 274 -295 88 -71 -123 143 -306 -76 -1 -126 139 -199 135 -10 -160 -76 165 5 -120 135 97 -228
5635b28L96Pl78l3J25J74K06j78j37J68r2k3K60l11P3J07k40R2k04J46K7L34k70
$$ -228 168 175 -203 -236 -111 63 269 91 -46 122 30 7 267 -44 29 136 -104 -12 -216 -70 -43 291 21
5658B1j43k8K83n5K83l57m0J42r2R4q5K29r7J64m03J84j60q8p8J94J49N6j59l7
$$ 21 -122 -150 133 78 361 4 -36 106 14 108 23 252 155 319 -84 100 -60 -148 -226 -32 117 173 14 -23
5682b3R2O1n3k59K58J54J4rj91K34k05K5j71K01N5j17J65j13j63J00R3q8P6j4
$$ -23 69 130 77 -182 76 230 244 235 44 278 73 98 -73 128 183 66 231 118 -45 55 148 60 136 122
5706A22p3j61J0J54R2j93J6l52O36l88K01l8l14J29K84P3j55k01j18K19j04J35
$$ 122 49 -112 -102 52 144 -49 -33 -385 251 -137 64 26 -288 -159 125 198 43 -158 -276 -57 -161 -26
5728b6K63k48J13k08J87p2R9J48k09J32l73M6K50o0j25J75K1n1J18p9k81j14J66
$$ -26 237 -11 102 -106 81 9 108 256 47 179 -194 -148 102 42 -83 92 113 62 180 101 -180 -294 -128
5751a28m6P5J30J8P0j86NM4j7Q8Q7J17m45K65q2r6R1J8J09k0r5P3n0j76J57R3
$$ -128 -174 -99 31 49 119 -67 -62 -18 -35 53 140 257 -188 77 -5 -101 -10 8 117 97 2 75 25 -151 6 99
5777I9r3j6P7J17P0m42J20M9n7n4K38p2p4M73l13JK4J14k33K62l15n0L9M4J63
$$ 99 6 -10 67 184 254 -188 -68 -19 -76 -130 108 36 -38 435 122 123 147 261 28 290 -25 -75 -36 8 171
5802A71j48L57m15j25K96l2q7j68J86m3M8J20j59J08k1k80J76j5j24K83L3j55
$$ 171 23 380 -35 -160 136 104 17 -151 35 -8 40 160 1 109 88 -192 -16 -31 -155 128 161 6
5824Fk58M58l98L62q9Ro2l47K28Q3L4m1p7K57k32n3K23Q6l08r4k4L08j13q1K18
$$ 6 -252 206 -192 170 81 90 28 -319 -91 -8 26 -15 -92 165 -67 -120 103 189 -119 -213 -237 71 -42 -123 95
5849I5K30l25l48M86j26J09j95J81k03J66j6M3m1n2j63L1R4m9J35N6l5j99J73
$$ 95 325 0 -348 138 12 121 -74 107 -96 70 54 97 56 4 -159 -128 -34 -83 52 108 73 -126 47
5872D7J93j80j82K1J13m4K59kl34jL81l8m23J9K82j44j10L25j4p5O8j63L7K6k
$$ 47 240 60 -122 -101 12 -32 227 225 -109 -110 271 233 -190 -171 111 -33 -143 182 168 93 161 -2 35 61 59
5897E9k67J06O5pm1J12k54J04J21m5R1J19k02K34j61q7J93k30L87m56J26M8j4
$$ 59 -208 -102 -37 -44 -85 27 -227 -123 -2 -47 44 163 -39 195 34 -53 140 -90 297 -159 -33 15 1
5920AM3q1L95n30L21l1k31M0K00k14j28K97K04l91J11K13k07N9o0J00k20K71j33
$$ 1 44 -37 358 -172 149 118 -113 -73 127 -87 -215 82 286 -105 6 219 12 71 11 111 -109 162 29
5943B9k96J52L61k59J8k31K45L9k16R5L02l38J20mK64j99j10Q3j73oK9oJ68r6
$$ 29 -267 -115 246 -13 5 -226 19 58 -158 -63 239 -99 21 17 281 82 -28 55 -118 -124 -95 -101 67 -29
5967b9J1J38j57K95l02Q3q0Q9m06M71op2K5J30j01MQ5K0j97J20j06J73j65j8J10
$$ -29 -18 120 -37 258 -44 39 -41 48 -358 113 107 35 60 190 89 93 178 198 1 121 15 188 23 5 115
5992A15N8j77M5N0k03k11L88m3j73L04l10Q7N1M9L2P8l00J46n4pj06K33k52K01
$$ 115 173 -4 41 91 -112 -323 65 22 -151 153 -157 -70 -19 30 62 140 -160 -14 -68 -75 -181 52 -200 1
6016AO4k7j69O6O2N7J56j90j94L62o2j31j30j52N27R2k46n0o4K4J23k86L87l05
$$ 1 65 38 -131 -65 -3 54 210 20 -174 188 126 -5 -135 -287 240 332 86 36 -28 -4 119 -167 220 -85
6040h5j71n8O74j50q1Rk20j4K78l11L57l17J84M6m27J59P3r1J24K80l07J0K9J27
$$ -85 -256 -314 360 210 129 138 -82 -96 182 -129 228 -89 95 141 -286 -127 -54 -145 -21 259 -48 -38 -9 118
6064A18k21K2K42k37J69j09K03k2j40J06j08n7j14J74j8j82K69J77k59J18L2P0
$$ 118 -103 -81 161 -76 93 -16 187 165 25 131 23 -34 -148 26 8 -174 95 272 13 131 163 233
6086B33l12J05l27N07j82R0j37o7%n9J18O4q8O7k85L83j12J10j18j9J15j29J72
$$ 233 -79 26 -301 206 24 114 -23 -90 -90 -149 -31 33 -55 12 -273 110 -2 108 -10 -29 86 -43 129
6109A29j53P9k5j90J80j40j92M34J06k40L30o45M22k06K66Q3k29o4J08q6J9J45
$$ 129 -24 55 30 -160 20 -120 -312 122 228 -12 318 -327 95 -111 155 238 9 -55 53 -33 -14 131
6131A31j62K29j24J20L7m07J90l1J93N0k39j61K4j30M84M5k88j34M50n35K55M9
$$ 131 -31 198 74 194 231 -176 14 -17 176 226 -13 -174 -150 -280 204 249 -39 -173 277 -258 -3 46
6153D6R7j04Q5k88K77q7mJ2k23J08K99o0n0r6K4J75n5N0P0n00J41n3R9N4N1OK2
$$ 46 143 39 124 -164 113 26 22 34 -189 -81 218 158 108 12 36 211 156 206 276 -224 -83 -136 -37 17 68 74 96
6180I6j20j7r9K30k3k74M61k12O3j34p5q9q6K41r7R9K0K0r6r4J12M5j03M10j64
$$ 96 -24 -41 -140 90 67 -207 254 42 105 -29 -104 -193 -279 -38 -135 -36 -16 4 -92 -186 -74 -29 -132 278 114
6205A14l00O3J97r2m3J28j03K2J13o2L89l76O5j45j53J67m0M0j65j1M42n0r9j37
$$ 114 -186 -123 74 -18 -61 67 -36 -14 99 37 426 50 115 -30 -183 -16 -56 -16 -181 -192 250 200 101 -36
6229c6JK29j19k57L69l13r8K78j43J65mM3j26K58jj03k69L84l72L28l52K84j52
$$ -36 -35 194 75 -182 187 -126 -224 54 -89 76 72 115 -11 247 246 143 -126 258 -114 214 -138 146 -6
6252fj97m4K55o3L04j06m91J77J67k2K13o1P3k27J30P5k69j6k6J77J16j95R5n6
$$ -6 -203 -247 8 -55 249 143 -348 -171 -4 -26 187 126 199 -28 102 177 -92 -108 -134 43 159 -36 59 3
6276Ck86M85l56J88jk60K40M4M5k15O6J14o1j18L50j33r9MnJ15j47J06j5l7QK1
$$ 3 -283 202 -154 34 33 -227 13 57 102 -113 -47 67 6 -112 238 105 6 10 5 120 -27 79 64 27 35 56
6302E6J26j72r5j65K56j16l8K99J04j82j35J05l2O0Rl0J59k37M4N1j23nj5O2R3
$$ 56 182 10 -85 -250 6 -110 -148 151 255 73 -62 43 11 71 80 50 209 -28 16 67 -56 -61 -76 -14 79
6327G9k57K51M3j69Q6j20Q3m5o5K98m9l09L23P2l52j52j7N9K64J54j55r3J05o
$$ 79 -178 73 116 -53 33 -87 -4 -49 -114 184 135 -174 149 221 -131 -283 -300 -241 23 177 22 -71 34 28
6351B8M9nj60n9K93j36J30q2K7k85o2L14j37J85j21L5O6j31L45j35o4q4k39j7
$$ 28 77 72 -88 -147 146 10 140 58 85 -200 -262 52 -85 100 -21 14 80 -51 294 159 95 11 -228 -245
$$ [...]
8191A
##END NTUPLES=NMR FID
##END=
