##TITLE=1H_DE-106_ch_8
 200.13MHz, CDCl3,
 8 sc
 
 19.8.2025
##JCAMPDX= 6.0         $$ Bruker NMR JCAMP-DX V2.0
##DATA TYPE= NMR FID
##DATA CLASS= NTUPLES
##ORIGIN= UXNMR, Bruker Analytische Messtechnik GmbH
##OWNER= pz
$$ XWIN-NMR		Version 3.5
$$ Tue Aug 19 15:29:39 2025 Russian Standard Time (UT+4h)  she@DPX200
##.OBSERVE FREQUENCY= 200.1308
##.OBSERVE NUCLEUS= ^1H
##.DELAY= (6, 6)
##.ACQUISITION MODE= SIMULTANEOUS
##.ACQUISITION SCHEME= undefined
##.AVERAGES= 8
##.DIGITISER RES= 18
##SPECTROMETER/DATA SYSTEM= spect
##.PULSE SEQUENCE= zg30
##.SOLVENT NAME= CDCl3
##.SHIFT REFERENCE= (INTERNAL, CDCl3, 0, 14.3821)
##AUDIT TRAIL= $$ (NUMBER, WHEN, WHO, WHERE, WHAT)
$$ ##TITLE= Audit trail, XWIN-NMR		Version 3.5
$$ ##JCAMPDX= 5.01
$$ ##ORIGIN= Bruker BioSpin GmbH
$$ ##OWNER= she
$$ F:/spectra/data/she/nmr/H-C/1/audita.txt
$$ ##AUDIT TRAIL=  $$ (NUMBER, WHEN, WHO, WHERE, WHAT)
(   1,<2025-08-19 15:28:29.45 +0400>,<she>,<DPX200>,
      <created by zg, POWCHK disabled, PULCHK disabled
       configuration hash MD5:
       00 E9 B6 7A A2 85 ED C7 34 08 36 98 17 FE 4E 26
       data hash MD5: 16K
       96 69 1D DA 92 23 12 98 00 11 9E E2 2C 71 AF 9E>)
$$ ##END=
$$ 
$$ hash MD5
$$ 7C E7 8D 15 E3 41 A6 D0 71 DA A8 AD 4A 23 F8 A3
##$RELAX= 
##$RELAX= 
##$RELAX= 
##$RELAX= 
##$RELAX= 
##$RELAX= 
$$ Bruker specific parameters
$$ --------------------------
##$DU= <F:/spectra>
##$EXPNO= 1
##$NAME= <H-C>
##$PROCNO= 1
##$TYPE= <nmr>
##$USER= <she>
##$AMP= (0..31)
100 100 100 100 100 100 100 100 100 100 100 100 100 100 100 100 100 100 
100 100 100 100 100 100 100 100 100 100 100 100 100 100 
##$AQSEQ= 0
##$AQ_mod= 1
##$AUNM= <au_zg>
##$AUTOPOS= <>
##$BF1= 200.13
##$BF2= 200.13
##$BF3= 200.13
##$BF4= 200.13
##$BF5= 200.13
##$BF6= 200.13
##$BF7= 200.13
##$BF8= 200.13
##$BYTORDA= 1
##$CFDGTYP= 0
##$CFRGTYP= 5
##$CHEMSTR= <none>
##$CNST= (0..31)
1 1 145 1 1 1 1 1 1 1 1 1 1 1 1 1 1 1 1 1 1 1 1 1 1 1 1 1 1 1 1 1 
##$CPDPRG= <>
##$CPDPRG1= <>
##$CPDPRG2= <>
##$CPDPRG3= <>
##$CPDPRG4= <mlev>
##$CPDPRG5= <mlev>
##$CPDPRG6= <mlev>
##$CPDPRG7= <mlev>
##$CPDPRG8= <mlev>
##$CPDPRGB= <>
##$CPDPRGT= <>
##$D= (0..31)
0 0.7 0 0 0 0 0 0 0 0 0 0.03 0 0 0 0 0 0 0 0 0 0 0 0 0 0 0 0 0 0 0 0 
##$DATE= 1755602908
##$DBL= (0..7)
120 120 120 120 120 120 120 120 
##$DBP= (0..7)
150 150 150 150 150 150 150 150 
##$DBP07= 0
##$DBPNAM0= <>
##$DBPNAM1= <>
##$DBPNAM2= <>
##$DBPNAM3= <>
##$DBPNAM4= <>
##$DBPNAM5= <>
##$DBPNAM6= <>
##$DBPNAM7= <>
##$DBPOAL= (0..7)
0.5 0.5 0.5 0.5 0.5 0.5 0.5 0.5 
##$DBPOFFS= (0..7)
0 0 0 0 0 0 0 0 
##$DE= 6
##$DECBNUC= <off>
##$DECIM= 32
##$DECNUC= <off>
##$DECSTAT= 4
##$DIGMOD= 1
##$DIGTYP= 9
##$DL= (0..7)
0 120 120 120 120 120 120 120 
##$DP= (0..7)
150 150 150 150 150 150 150 150 
##$DP07= 0
##$DPNAME0= <>
##$DPNAME1= <>
##$DPNAME2= <>
##$DPNAME3= <>
##$DPNAME4= <>
##$DPNAME5= <>
##$DPNAME6= <>
##$DPNAME7= <>
##$DPOAL= (0..7)
0.5 0.5 0.5 0.5 0.5 0.5 0.5 0.5 
##$DPOFFS= (0..7)
0 0 0 0 0 0 0 0 
##$DQDMODE= 0
##$DR= 18
##$DS= 0
##$DSLIST= <SSSSSSSSSSSSSSS>
$$ [...]
##$SUBNAM0= <"">
##$SUBNAM1= <"">
##$SUBNAM2= <"">
##$SUBNAM3= <"">
##$SUBNAM4= <"">
##$SUBNAM5= <"">
##$SUBNAM6= <"">
##$SUBNAM7= <"">
##$SUBNAM8= <"">
##$SUBNAM9= <"">
##$SW= 18.0517779522481
##$SWIBOX= (0..15)
0 0 2 0 0 0 0 0 0 0 0 0 0 0 0 0 
##$SW_h= 3612.71676300578
##$TD= 16384
##$TD0= 1
##$TE= 0
##$TE2= 300
##$TE3= 300
##$TEG= 300
##$TL= (0..7)
0 120 120 120 120 120 120 120 
##$TP= (0..7)
150 150 150 150 150 150 150 150 
##$TP07= 0
##$TPNAME0= <>
##$TPNAME1= <>
##$TPNAME2= <>
##$TPNAME3= <>
##$TPNAME4= <>
##$TPNAME5= <>
##$TPNAME6= <>
##$TPNAME7= <>
##$TPOAL= (0..7)
0.5 0.5 0.5 0.5 0.5 0.5 0.5 0.5 
##$TPOFFS= (0..7)
0 0 0 0 0 0 0 0 
##$TUNHIN= 0
##$TUNHOUT= 0
##$TUNXOUT= 0
##$USERA1= <user>
##$USERA2= <user>
##$USERA3= <user>
##$USERA4= <user>
##$USERA5= <user>
##$V9= 5
##$VALIST= <valist>
##$VCLIST= <CCCCCCCCCCCCCCC>
##$VD= 0
##$VDLIST= <DDDDDDDDDDDDDDD>
##$VPLIST= <PPPPPPPPPPPPPPP>
##$VTLIST= <TTTTTTTTTTTTTTT>
##$WBST= 1024
##$WBSW= 4
##$XGAIN= (0..3)
0 0 0 0 
##$XL= 0
##$YL= 0
##$YMAX_a= 93687
##$YMIN_a= -161226
##$ZGOPTNS= <>
##$ZL1= 120
##$ZL2= 120
##$ZL3= 120
##$ZL4= 120
##$ABSF1= 10
##$ABSF2= 0
##$ABSG= 5
##$ABSL= 3
##$ALPHA= 0
##$AQORDER= 0
##$ASSFAC= 0
##$ASSFACI= 0
##$ASSFACX= 0
##$ASSWID= 0
##$AUNMP= <proc_1d>
##$AZFE= 0.1
##$AZFW= 0.1
##$BCFW= 1
##$BC_mod= 2
##$BYTORDP= 1
##$COROFFS= 0
##$CY= -3
##$DATMOD= 1
##$DC= 2
##$DFILT= <>
##$DTYPP= 0
##$F1P= 0
##$F2P= 0
##$FCOR= 0.5
##$FTSIZE= 0
##$FT_mod= 4
##$GAMMA= 1
##$GB= 0.15
##$INTBC= 1
##$INTSCL= 1
##$ISEN= 128
##$LB= 0.25
##$LEV0= 0
##$LPBIN= 0
##$MAXI= 10000
##$MC2= 0
##$MEAN= 0
##$ME_mod= 0
##$MI= 1.114404
##$NCOEF= 0
##$NC_proc= 0
##$NLEV= 6
##$NOISF1= 3.799351
##$NOISF2= 2.8
##$NSP= 1
##$NTH_PI= 0
##$NZP= 0
##$OFFSET= 14.38212
##$PC= 1
##$PHC0= -1562.563
##$PHC1= 10.19228
##$PH_mod= 1
##$PKNL= yes
##$PPARMOD= 0
##$PSCAL= 0
##$PSIGN= 0
##$REVERSE= no
##$SF= 200.129724274929
##$SI= 16384
##$SIGF1= 3
##$SIGF2= 2
##$SINO= 400
##$SIOLD= 16384
##$SREGLST= <1H.CDCl3>
##$SSB= 0
##$STSI= 0
##$STSR= 0
##$SW_p= 3205.1282051282
##$SYMM= 0
##$S_DEV= 0
##$TDeff= 0
##$TDoff= 0
##$TI= <>
##$TILT= no
##$TM1= 0
##$TM2= 0
##$TOPLEV= 0
##$USERP1= <user>
##$USERP2= <user>
##$USERP3= <user>
##$USERP4= <user>
##$USERP5= <user>
##$WDW= 1
##$XDIM= 8192
##$YMAX_p= 0
##$YMIN_p= 0
$$ End of Bruker specific parameters
$$ ---------------------------------
##NTUPLES= NMR FID
##VAR_NAME=  TIME,          FID/REAL,        FID/IMAG
##SYMBOL=    X,             R,               I
##VAR_TYPE=  INDEPENDENT,   DEPENDENT,       DEPENDENT
##VAR_FORM=  AFFN,          ASDF,            ASDF
##VAR_DIM=   8192,          8192,            8192
##UNITS=     SECONDS,       ARBITRARY UNITS, ARBITRARY UNITS
##FACTOR=    0.0002768,     1,               1
##FIRST=     0,             0,               0
##LAST=      2.2672688,     0,               0
##MIN=       0,             -161226,         0
##MAX=       2.2672688,     93687,           0
$$ Real data points
##PAGE= N=1
##DATA TABLE= (X++(R..R)), XYDATA
$$ plain form
0 0 0 0 0 0 0 0 0 0 0 0 0 0 0 0 0 -3 8 -8 8 -8 8 -12 16 -16 17 -24 24 -32 33 -40 46 -52 57 -65 73 -84 93 -104
38 -104 116 -130 143 -160 178 -196 218 -238 264 -289 320 -352 387 -426 471 -519 574 -638 710 -794
58 -794 893 -1011 1152 -1330 1559 -1866 2298 -2953 4056 -6238 12175 -63719 -161226 22967
72 22967 42589 -45604 32752 93687 -11698 -23575 46693 16811 -10382 48366 13872 -70751
84 -70751 -42505 -17415 -66523 -33008 29078 -9548 -37368 8697 23218 15576 34346 37419 15671
97 15671 13348 16708 1694 -5166 4243 -1881 -13526 -16419 -17583 -7990 -248 -18190 -20136 -353
111 -353 -8252 -10981 20619 21487 -4676 5199 24193 13787 10893 23438 10347 -14451 -10892 -10390
125 -10390 -24371 -11254 3388 -15915 -21573 -2765 -1975 251 21274 23987 5699 2367 9274
$$ packed form
0@%%%%%%%%%%%%%%%lJ1j6J6j6J6k0K8l2L3m1M8n6O5p3Q6r8J09j22J38j57J77j97
38a04K20k46K73l03L38l74M14m56N02n53O09o72P39q13Q97r90J093j212J348j504
58g94J687j904K163k482K889l425M164n251P009j0294J8413p5894r7507J84193
72B2967J9622q8193P8356O0935j05385j1877P0268k9882k7193N8748l4494q4623
84g0751K8246K5090m9108L3515O2086l8626k7820M6065J4521p642J8770L073k1748
97A5671k323L360j5014o860R409o124j1645k893j164R593P742j7942j946J9783
111c53p899k729L1600Q68k6163R875J8994j0406k894J2545j3091k4798L559N02
125a0390j3981J3117J4642j9303n658J8808P90K226K1023K713j8288l332O907
$$ plain form
138 9274 3783 -687 8683 5993 -11655 -12960 -6129 -9047 -5588 4381 1614 -7392 -7002 243 3019
153 3019 3048 8171 7489 -1742 -323 6898 4412 3495 6410 -345 -9349 -7005 -2409 -4864 -5551 -1193
169 -1193 -3958 -8616 57 7866 4721 6804 8697 1382 -785 4428 3147 -780 -503 -2845 -8498
184 -8498 -7667 -1026 325 -1416 922 -98 -2821 1085 4429 3680 3953 2234 -1463 -1162 1214 1795
200 1795 1741 301 -1640 -3873 -3877 -1942 -529 -228 -824 -2931 -1848 1008 1911 3742 5123 2656 287
217 287 814 1010 1232 893 -938 -3558 -4367 -3088 -2170 -1314 878 586 -1511 127 2481 2203 2836 3203
235 3203 988 -189 -237 128 467 519 -406 -2177 -2717 -1537 -950 -965 136 -295 -1702 -718 461 1377 2357
254 2357 2211 1339 769 493 1086 998 190 -198 -1602 -2920 -1819 -1323 -776 -301 -509 -314 320 751 1831
$$ packed form
138I274n491m470R370k690j7648j305O831k918L459R969k767r006L90P245K776
153C019K9N123o82r231J419P221k486r17K915o755r004K344M596k455o87M358
169a193k765m658Q673P809l145K083J893p315k167N213j281l927K77k342n653
184h498Q31O641J351j741K338j020k723L906L344p49K73j719l697L01K376N81
200A795n4j440j941k233mJ935J413L01n96k107J083K856R03J831J381k467k369
217B87N27J96K22l39j831k620q09J279R18Q56K192k92k097J638K354k78O33L67
235C203k215j177m8L65L39N2r25j771n40J180N87j5J101m31j407R84J179R16R80
254B357j46q72n70k76N93q8q08l88j404j318J101M96N47M75k08J95O34M31J080
$$ plain form
273 1831 2250 1466 762 178 215 443 376 -94 -214 -694 -1250 -1282 -532 -262 -450 -747 -491 -413 214 1028 960 986
295 986 796 591 443 633 710 294 20 -1013 -787 -1027 -578 -384 -319 -339 -512 -311 403 837 598 539 401
316 401 40 -69 501 380 140 -428 -327 -221 -143 -343 -121 -253 -378 -581 -301 126 272 489 243 301 187
337 187 505 392 429 297 -65 -18 -528 -432 -157 -408 -442 -397 -407 -47 24 365 427 234 -2 -77 182 230 152 207
361 207 -60 -234 -56 -129 43 -258 -135 -221 -214 42 23 -91 85 -22 150 139 275 297 76 135 85 -106 -418
384 -418 110 -5 -130 -7 -132 -50 45 97 231 132 346 130 52 -77 130 41 -5 -216 -69 -83 -196 348 140
407 140 158 -130 53 -86 180 79 255 -120 396 48 308 -62 129 115 153 29 -109 -69 -41 2 307 -174
429 -174 -7 339 -9 -150 249 -129 -324 -112 107 148 -99 42 12 -240 -118 -87 116 -233 -331 52 64 -71
$$ packed form
273A831M19p84p04n84L7K28o7m70j20m80n56l2P50K70j88k97K56P8O27Q14o8K6
295I86j90k05j48J90P7m16k74j033K26k40M49J94O5k0j73K01P14M34k39n9j38
316D01l61j09N70j21k40n68J01J06P8k00K22j32j25k03K80M27J46K17k46N8j14
337A87L18j13L7j32l62M7n10R6K75k51l4M5j0L60P1L41O2j93k36p5K59M8p8N5
361B07k67j74J78p3J72l01J23q6PK56j9j14J76j07J72j1J36K2k21N9n0j91l12
384d18N28j15j25J23j25Q2R5N2J34r9K14k16p8j29K07q9m6k11J47j4j13N44k08
407A40J8k88J83j39K66j01J76l75N16l48K60l70J91j4L8j24j38M0K8M3L05m81
429a74J67L46l48j41L99l78j95K12K19M1k47J41l0k52J22L1K03l49r8L83J2j35
$$ plain form
451 -71 -321 263 134 -45 -82 269 223 -103 -28 -175 -2 -125 94 52 -58 174 -62 173 4 39 124 -8 74
474 74 131 -1 -81 35 197 7 46 -51 -61 -84 -53 34 213 137 20 13 92 -37 299 201 -178 182 -39 101 -133
499 -133 121 123 -214 214 -9 -319 -278 -45 -29 183 34 41 -26 -39 118 -39 125 155 201 -41 19 -252 -245 -50 46
524 46 -46 -41 141 -78 -355 -123 145 199 -75 78 103 -128 102 -107 107 -100 64 31 18 86 -207 -59 298
547 298 -8 -41 31 258 -57 -50 -14 -271 53 -2 296 315 -74 -45 -261 -150 -179 81 40 -159 163 99 55 145 -82
572 -82 -16 -106 55 -33 -77 103 -5 20 93 51 74 102 -105 192 -21 -148 -29 -176 -22 107 22 5 129 108 220
597 220 22 -322 78 -86 -299 -358 -154 -63 -98 -236 -92 133 -109 77 217 86 -84 39 37 -64 123 91
619 91 46 110 34 295 -38 131 218 -138 3 0 -88 -204 -35 208 135 -143 55 154 223 37 -38 -64 -208 -201 131
$$ packed form
451g1k50N84j29j79l7L51m6l26P5j47J73j23K19m2j10K32k36K35j69L5Q5j32Q2
474G4N7j32q0J16J62j90L9r7j0k3L1Q7J79p6j17pP9j29L36r8l79L60k21J40k34
499a33K54Kl37M28k23l10M1K33J6K12j49Po7j3J57j57J64L0M6k42O0k71PJ95R6
524D6r2NJ82k19k77K32K68N4k74J53K5k31K30k09K14k07J64l3j3O8k93J48L57
547B98l06l3P2K27l15PL6k57L24n5K98J9l89K9k16J11k9K60m1j99L22o4m4R0k27
572h2O6r0J61q8m4J80j08K5P3m2K3K8k07K97k13j27J19j47J54J29q5j7J24k1J12
597B20j98l44M00j64k13n9K04R1l5j38J44K25k42J86J40j31j70J23kj01J87l2
619I1m5O4p6K61l33J69Q7l56J41lq8j16J69K43p3k78J98R9O9j86p5k6j44PL32
$$ plain form
644 131 215 140 -129 26 -267 -46 -11 28 75 168 -188 -64 -113 166 -162 63 -50 40 85 35 129 -18 -15 -164 -85
669 -85 109 27 341 273 70 220 -75 -57 117 20 44 48 -49 77 -60 101 -119 101 143 111 111 -34 -38 -219 162
694 162 313 -162 -390 -173 75 111 297 53 154 36 35 -58 -103 36 -44 198 -167 2 31 7 -67 -10 -15 132
718 132 -139 -300 -192 -149 -14 -98 271 -264 -42 29 -150 10 18 46 -205 -196 -51 118 76 -161 174 -48 -155
741 -155 -107 22 133 -13 -18 -2 -34 -75 -111 -132 -240 -69 34 -76 -58 -39 -172 -295 89 -118 -173 23 252 13
765 13 -127 5 -287 -95 -119 137 37 -166 128 15 -74 327 -142 234 183 -18 83 99 123 -90 -249 -64
787 -64 204 -177 -16 31 30 122 273 -75 -77 -44 -91 335 -261 -15 -239 91 -111 -74 -58 -331 -83 47 -103 -193
811 -193 -293 -195 -14 99 199 -101 137 -39 60 24 -31 -14 117 74 143 126 -223 125 -160 54 -113 54 -176
$$ packed form
644A31Q4p5k69J55k93K21L5L9M7R3l56J24m9K79l28K25j13R0M5n0R4j47Lj49P9
669h5J94q2L14o8k03J50k95J8J74r7K4Mr7J26j37J61k20K20M2l2%j45mj81L81
694A62J51m75k28K17K48L6J86k44J01j18jr3m5J39q0K42l65J69K9k4p4N7nJ47
718A32k71j61J08M3J35q4L69n35K22P1j79J60QK8k51RJ45J69m2k37L35k22j07
741a55M8J29J11j46nJ6l2m1l6k1j08J71J03j10J8J9j33j23L84k07n5J96K29k39
765A3j40J32k92J92k4K56j00k03K94j13q9M01m69L76n1k01J01J6K4k13j59J85
787f4K68l81J61M7jR2J51l48kL3m7M26n96K46k24L30k02L7J6k73K48J30j50r0
811a93j00R8J81J13J00l00K38j76R9l6n5J7J31m3O9j7l49L48k85K14j67J67k30
$$ plain form
834 -176 147 300 -99 111 223 -61 -76 169 -77 219 -21 -7 -87 -213 -110 77 95 -60 245 -30 -276 -75
856 -75 82 5 -2 2 55 -55 100 7 165 -190 31 -4 115 91 -53 -139 -83 78 -286 67 -10 225 164 55 14
881 14 114 47 131 290 -72 190 60 -253 81 -69 192 -55 147 -70 -114 -116 21 69 -17 -335 21 16 -52 95
905 95 52 272 -114 33 29 324 -39 12 -113 9 335 -7 -254 -26 40 108 -74 -40 -366 187 -105 -119 -35 -127
929 -127 117 -344 53 -72 -232 -44 54 -115 232 -134 -124 -14 53 -88 59 32 117 81 -191 82 -301 -152
951 -152 -110 241 130 -367 231 21 42 33 -41 -70 67 158 276 -32 199 -35 -4 162 27 -80 -34 -250 74
974 74 -24 -37 101 171 -166 114 -25 85 186 91 67 -65 -68 -1 206 -120 1 -228 -86 94 47 -226 64 240
998 240 -5 39 112 110 -164 -235 58 -316 -13 294 160 22 48 -90 -357 -45 93 48 57 -31 -65 -131 -10 115
$$ packed form
834a76L23J53l99K10J12k84j5K45k46K96k40J4q0j26J03J87J8j55L05k75k46K01
856g5J57p7pMN3j10J55r3J58l55K21l5J19k4j44q6N6J61l64L53p7K35o1j09m1
881A4J00o7Q4J59l62K62j30l13L34j50K61k47K02k17m4kJ37M8q6l18L56no8J47
905I5m3K20l86J47mK95l63N1j25J22L26l42k47K28O6O8j82L4l26N53k92j4Q4r2
929a27K44m61L97j25j60J88R8j69L47l66J0J10O7j41J47k7Q5l6k72K73l83J49
951a52M2L51j11m97N98k10K1rp4k9J37R1J18l08K31k34L1J66j35j07M6k16L24
974G4r8j3J38P0l37K80j39J10J01r5k4j32lO7K07l26J21k29J42J80m7k73K90J76
998B40k45M4P3kk74p1K93l74L03L07j34j38K6j38k67L12J38m5Rq8l4o6J21J25
$$ plain form
1022 115 -99 179 -1 20 -24 -344 -127 -102 -86 144 -11 170 136 -70 25 57 62 163 -41 17 -99 319 -142
1045 -142 -67 240 -121 164 -42 -10 -5 174 -62 80 90 94 167 -13 63 219 -403 156 -212 -37 161 -180 -23
1068 -23 171 13 11 -205 188 203 -138 187 103 6 37 98 52 -198 118 -261 -183 -179 -92 -51 168 -94 -87 100 153 -103
1094 -103 15 -82 280 103 45 -114 6 104 48 -66 186 -255 -13 115 -78 46 71 168 181 156 249 -284 -233
1117 -233 -126 168 177 45 60 8 15 -97 -43 203 -246 -11 -91 285 -219 -309 -237 291 -295 216 -28 -5 -32 -312
1141 -312 -70 -55 195 100 99 -334 5 -83 163 320 -17 61 173 311 -81 87 -116 42 5 -90 -99 -29 -196 -189
1165 -189 -52 412 -51 -151 29 -156 260 230 28 -66 250 -85 103 -185 -2 160 135 28 257 -48 -362
1186 -362 -8 17 -180 46 270 -219 222 -165 -10 -203 66 -129 68 233 78 4 -127 -31 -156 345 190
$$ packed form
1022A15k14K78j80K1m4l20K17K5J6K30j55J81l4k06R5L2NJ01k04N8j16M18m61
1045a42P5L07l61K85k06L2NJ79k36J42J0MP3j80P6J56o22N59l68J75J98l41J57
1068b3J94j58kk16L93J5l41L25q4r7L1O1m6k50L16l79P8MQ7M1K19k62PJ87N3k56
1094a03J18r7L62j77n8j59J20R8n6j14K52m41K42J28j93J24K5R7J3k5R3n33N1
1117b33J07K94Rj32J5n2Pj12N4K46m49K35q0L76n04r0P2N28n86N11k44K3k7k80
1141c12K42J5K50r5jm33L39q8K46J57l37P8J12J38l92J68k03J58l7r5rP0j67P
1165a89J37M64m63j00J80j85M16l0k02r4L16l35J88k88J83J62k5j07K29l05l14
1186c62L54K5j97K26K24m89M41l87J55j93K69j95J97J65j55p4j31R6j25N01j55
$$ plain form
1207 190 147 96 -92 -110 131 175 -267 -31 62 -28 -114 -219 -46 -99 91 -112 -28 77 86 -180 134 98 -81 70
1231 70 146 -203 66 -45 60 -222 -118 119 -64 355 -80 -64 120 49 85 35 89 106 -70 -73 -199 167 146 208
1255 208 -147 -123 -6 203 -85 99 1 -166 -158 -134 185 -120 208 -98 -92 120 114 -52 128 -190 -97 20 75 -15
1279 -15 217 56 226 266 57 -310 140 -16 92 56 -29 -50 80 -253 -231 -47 128 93 -97 -29 -162 43 -91
1302 -91 -112 207 37 -236 -128 -2 220 121 -86 10 -27 228 176 179 128 123 138 -35 104 -210 330 -2 -317 -57
1326 -57 -117 34 -106 -99 -46 106 -240 -117 32 22 47 28 255 -117 -6 121 210 150 227 -123 -52 -85 -23 50 -197
1351 -197 -87 447 28 -18 148 -188 54 -48 -192 24 -102 165 42 109 129 -98 209 -112 20 -61 -21 -30
1373 -30 152 105 -246 -123 -140 109 -199 43 135 -389 -48 111 195 64 -39 -180 -310 -65 -259 98 -118 128
$$ packed form
1207A90m3n1j88j8K41M4m42K36R3r0q6j05J73n3J90k03Q4J05Rk66L14l6j79J51
1231G0P6l49K69j11J05k82J04K37j83M19m35J6J84p1L6n0N4J7j76lj26L66k1O2
1255B08l55K4J17K09k88J84r8j67QK4L19l05L28l06OK12oj66J80l18R3J17N5r0
1279a5K32j61J70M0k09l67M50j56J08l6q5k1J30l33K2J84J75l5j90O8j33K05j34
1302i1k1L19j70k73J08J26K22r9k07R6l7K55n2Ln1nJ5j73J39l14N40l32l15K60
1326e7o0J51j40PN3J52l46J23J49j0K5j9K27l72J11J27Q9o0P7l50P1l3O2P3k47
1351a97J10N34m19m6J66l36K42j02j44K16j26K67j23O7K0k27L07l21J32q1M0r
1373c0J82m7l51J23j7K49l08K42R2n24L41J59Q4j31j03j41j30K45j94L57k16K46
$$ plain form
1395 128 54 -181 -24 -178 143 -84 -223 -4 -137 146 -8 20 89 29 -27 -116 -138 79 20 -24 66 -99 -7 -180
1419 -180 35 -32 261 46 -81 25 54 72 307 172 55 165 -70 85 -27 -4 167 77 19 -3 25 5 51
1442 51 -16 30 -32 -262 266 -183 99 93 232 58 25 -91 0 -44 -159 158 -229 269 48 62 -223 -60 90
1465 90 -207 76 13 -103 172 95 -200 -134 -22 100 104 16 30 -73 87 -30 267 -210 40 -110 -91 38 78
1488 78 -113 -195 67 123 -59 169 -82 50 -256 270 137 -167 -152 -50 63 -112 180 134 -67 103 144 34
1510 34 -121 -126 -184 -171 -225 111 115 101 175 75 81 43 -133 -114 53 -50 -78 -72 -236 -148 229 13 -193 -34 -185 -5
1536 -5 -39 -95 -227 184 -16 -17 -248 18 -132 -146 262 -57 89 -4 164 -1 -34 -180 120 -72 -11 111 -422
1559 -422 -37 -246 -231 216 66 -84 -38 24 188 -81 -87 159 -105 -251 -122 -33 -13 -65 -38 17 -248 10 -9 -3
$$ packed form
1395A28p4k35J57j54L21k27j39K19j33K83j54K8O9o0n6q9k2K17n9m4R0j65R2j73
1419a80K15o7K93k15j27J06K9J8K35j35j17J10k35J55j12K3J71r0n8k2K8k0M6
1442E1o7M6o2k30N28m49K82oJ39j74l3j16R1m4j15L17l87M98k21J4k85J63J50
1465I0k97K83o3j16K75p7k95O6J12J22Mq8J4j03J60j17K97m77K50j50J9J29M0
1488G8j91q2K62N6j82K28k51J32l06N26j33l04J5J02J13j75K92m6k01J70M1j10
1510C4j55nn8J3n4L36Mj4P4j00Ol8j76J9J67j03k8Oj64Q8L77k16k06J59j51J80
1536el4n6j32M11k00jk31K66j50j4M08l19J46r3J68j65l3j46L00j92O1J22n33
1559d22L85k09J5M47j50j50M6O2J64k69oK46k64j46J29Q9K0n2K7N5k65K58j9O
$$ plain form
1583 -3 -23 91 -45 14 142 32 72 -61 178 -33 129 163 -69 -154 -79 -75 -49 -63 85 133 -167 62 -93 147
1607 147 -219 145 -323 -53 -90 31 103 169 -57 -32 57 110 310 -345 -125 21 33 46 -146 -81 51 186 72
1630 72 -164 -242 67 -74 -56 -215 -157 277 95 -257 103 2 -262 169 -31 -65 -136 63 73 -136 -225 106 108
1653 108 -248 90 22 227 -129 -65 -90 -167 12 -132 -17 -109 36 -130 -19 -234 -157 -301 -93 53 -124 -81
1675 -81 93 -282 -44 -236 -173 -202 39 -136 -28 11 -32 283 -135 -204 -144 -69 -8 12 -129 0 -210 -165 23 204
1699 204 -118 -15 -88 -74 49 227 36 207 -96 -171 48 -176 -62 85 -108 -115 10 61 -89 -294 -168 -16
1721 -16 -40 151 17 79 -122 -40 30 -73 56 -91 -82 403 -151 58 -156 55 285 -142 -86 126 -404 -113 31
1744 31 -393 -10 41 113 165 445 135 133 -51 -17 254 123 123 15 46 83 -18 -123 101 86 -7 -43 -201 -225 186
$$ packed form
1583ck0J14j36N9J28j10M0j33K39k11J62L4k32q5P5MK6j4J48M8l00K29j55K40
1607A47l66L64m68K70l7J21P2O6k26K5Q9N3K00o55K20J46J2J3j92O5J32J35j14
1630G2k36p8L09j41J8j59N8M34j82l52L60j01k64M31k00l4p1J99J0k09q9L31K
1653A08l56L38o8K05l56O4k5p7J79j44J15r2J45j66J11k15P7j44K08J46j77M3
1675h1J74l75K38j92O3k9K41j75J08L9m3L15m18o9O0P5O1K0j41J29k10M5J88J81
1699B04l22J03p3J4J23J78j91J71l03p5K19k24J14J47j93pJ25N1j50k05J26J52
1721a6k4J91j34O2k01Q2P0j03J29j47RM85n54K09k14K11K30m27N6K12n30K91J44
1744C1m24L83N1P2N2K80l10kj84L4K71j31%j08L1L7j01j05K24j5r3l6j58k4M11
$$ plain form
1769 186 -137 10 47 -50 144 218 -247 -184 95 -169 -103 -144 165 33 -46 36 48 9 65 -51 8 -164 71 9
1793 9 108 -24 -7 164 102 -219 -31 119 -36 60 141 165 -27 68 -60 247 140 191 188 -71 43 -79 -58 -260
1817 -260 240 70 203 157 -178 -68 -45 -96 -136 -158 145 -107 58 75 -36 137 -86 -150 61 211 70 -87
1839 -87 51 -269 -49 -182 157 182 74 -233 -133 -230 176 158 -100 92 -45 -71 293 16 -12 43 -158 -106 -69
1862 -69 9 -39 39 -68 30 88 1 108 -56 -55 -275 -6 190 -12 -199 -184 198 78 59 -85 65 -104 -111 -5
1886 -5 -111 376 64 43 -108 -210 233 191 -88 -126 119 162 -21 -287 -21 84 -93 77 31 -127 -2 -15 -192
1909 -192 87 73 145 -127 -164 65 19 39 148 -141 119 -72 362 34 -138 -30 273 26 -34 214 28 154
1931 154 -113 113 -331 -328 -22 -162 192 85 69 38 97 29 -71 37 -84 -110 -27 223 172 84 -95 65 62 -231
$$ packed form
1769A86l23J47L7r7J94P4m65O3K79k64O6m1L09j32p9Q2J2l9N6j16N9j72K35o2
1793IR9j32J7J71o2l21J88J50j55R6Q1K4j92R5j28L07j07N1lk59J14j22K1k02
1817b60N00j70J33m6l35J10K3n1m0k2L03k52J65J7j11J73k23o4K11J50j41j57
1839h7J38l20K20j33L39K5j08l07J00r7M06j8k58J92j37k6L64k77k8N5k01N2L7
1862f9P8m8P8j07R8N8q7J07j64Jk20K69J96k02j87J5L82j20j9j44J50j69pJ06
1886ej06M87l12k1j51j02M43m2k79l8K45M3j83k66K66J05j77J70m6j58J25j3j77
1909a92K79j4P2k72l7K29m6K0J09k89K60j91M34l28j72J08L03k47o0K48j86J26
1931A54k67K26m44LL06j40L54j07j6l1N9o8j00J08j21k6Q3K50n1q8j79J60lk93
$$ plain form
1955 -231 -43 54 -130 40 134 39 188 29 -126 -32 -166 -77 59 -152 -210 146 12 -57 -329 -224 122 -21
1977 -21 -88 -68 -36 -114 -101 -67 -122 -149 -65 35 81 -120 -463 -46 5 -134 -48 118 88 -36 132 102 -150 -79 -70 330
2003 330 151 -7 -19 -73 187 187 -89 -27 55 -249 -112 68 -259 89 291 53 7 -14 -146 -41 -172 151 -256
2026 -256 3 274 123 -128 -69 14 -94 -78 125 155 -197 24 108 88 201 151 112 123 24 -5 -79 -241 78 -19
2050 -19 -102 -101 -76 -20 199 308 189 341 -59 -129 -189 21 -108 -32 -144 259 -40 -94 -99 99 -133 -17 62 -53
2074 -53 275 -167 -161 57 -40 -4 143 -12 44 73 -191 25 223 -78 -222 117 -132 -200 152 158 -110 -39 -145 -76
2098 -76 48 -32 -164 -87 -119 -21 29 -65 -195 33 -115 167 -63 0 89 73 -64 -11 -296 -214 82 262 27 187
2122 187 120 140 120 -101 65 87 -119 -199 -84 -220 -47 41 131 32 162 -220 -75 29 107 -226 138 -17 -88
$$ packed form
1955b31J88R7j84J70R4r5J49j59j55R4j34Q9J36k11n8L56j34o9k72J05L46j43
1977b1o7K0L2p8J3L4n5k7Q4J00M6k01l43M17N1j39Q6J66l0j24J68l0k52P1RM00
2003C30j79j58j2n4K60%k76O2Q2l04J37J80l27L48K02k38m6k1j32J05j31L23m07
2026b56K59K71j51k51N9Q3j08J6K03L0l52K21Q4k0J13n0l9J1r9k9p4j62L19r7
2050a9q3JK5N6K19J09j19J52m00p0o0K10j29P6j12M03k99n4nJ98k32J16P9j15
2074e3L28m42OK18r7L6J47j55N6K9k64K16J98l01j44L39k49o8L52Ok68P1j06O9
2098g6J24q0j32P7l2R8N0r4j30K28j48K82k30O3Q9j6j37N3k85Q2K96J80k35J60
2122A87o7K0k0k21J66K2k06q0J15j36J73Q8R0r9J30l82J45J04P8l33L64j55p1
$$ plain form
2145 -88 85 151 -93 -4 -23 -121 -180 113 -53 274 -66 -179 -116 -68 108 -234 -5 -91 -32 -40 88 -75 108 -47
2169 -47 120 125 96 -342 30 166 -115 2 -65 -28 168 5 99 -88 -173 -86 73 82 -63 167 -199 191 -190 -69
2193 -69 63 94 -36 -15 113 85 -169 40 -136 -230 50 19 22 215 -68 -74 -145 231 107 45 94 -112 -140 -221 56
2218 56 87 3 -44 0 -121 -7 -93 54 20 179 -135 -271 153 -138 -164 -61 211 -194 -315 -3 -104 0 -107
2241 -107 -140 258 -57 163 208 17 -150 -1 -40 -99 16 121 255 52 -48 42 -61 74 106 218 -10 -72
2263 -72 -152 -86 75 -97 170 149 207 -281 -240 143 330 81 99 105 -95 -132 -84 2 -40 -118 -22 -44 -56 110 -95 -173
2289 -173 20 7 -54 153 191 -165 181 -54 236 143 -263 135 39 -48 174 66 58 -224 -123 -45 -119 -1 -189
2312 -189 -140 68 -251 286 -121 -12 6 19 271 -47 43 365 -149 120 -345 -23 -254 3 280 116 -226
$$ packed form
2145h8J73O6k44Q9j9r8n9K93j66L27l40j13O3M8J76l42K29q6N9qJ28j63J83j55
2169d7J67Nk9m38L72J36k81J17o7L7J96j63R4j87q5Q7J59Rj45K30l66L90l81J21
2193f9J32L1j30K1J28k8k54K09j76r4K80l1LJ93k83op1L76j24o2M9k06k8q1K77
2218E6L1q4m7M4j21J14q6J47l4J59l14j36M24k91k6J03K72m05j21L12j01J04j07
2241a07l3L98l15K20M5j91j67J49l9n9J15J05J34k03j00R0j03J35L2J12k28o2
2263g2q0O6J61j72K67k1N8m88M1L83J87k49J8Ok00l7M8Q6m2p8R6k2j2J66k05p8
2289a73J93j3o1K07L8l56L46k35K90r3m06L98r6q7K22j08qk82J01P8p4J18j88
2312a89M9K08l19N37m07J09J8J3K52l18R0L22n14K69m65L22k31K57K77j64l42
$$ plain form
2333 -226 111 -206 159 -56 47 -23 -119 -108 -166 154 72 -5 -5 100 158 -271 -162 202 -63 155 15 66 113 -90
2357 -90 164 -223 -32 32 -43 -329 -6 -109 126 -10 -119 -215 112 -4 107 14 -272 -2 66 8 -13 101 -349
2380 -349 -196 80 83 -34 -51 -89 54 53 -115 -105 36 26 77 153 -16 -100 -343 -216 298 58 -130 -37 -56 183
2404 183 -179 -146 100 -87 -35 69 117 207 158 -82 -142 144 -415 -187 -197 -213 66 -55 -93 109 -105 120 101
2427 101 52 -153 -189 110 19 100 -63 -122 -118 -103 -138 0 -57 178 -41 -83 93 -10 -148 67 -40 -34 76 263
2451 263 79 20 199 72 -42 66 74 -27 69 4 13 199 -133 -246 -174 43 42 -154 -15 23 135 -174 48 -98
2475 -98 -193 -29 -153 -100 132 139 -76 46 -9 77 60 81 102 89 -200 74 188 65 -347 -170 -108 -49 -100 -172 18
2500 18 1 83 29 12 -135 241 130 -151 87 -200 78 54 188 79 -43 60 -97 -108 1 5 -145 262 -37
$$ packed form
2333b26L37l17L65k15J03p0r6J1n8L20q2p7%J05N8m29J09L64k65K18j40N1M7k03
2357i0K54l87J91O4p5k86L23j03K35j36j09r6L27j16J11r3k86K70O8n8k1J14m50
2380c49J53K76Lj17j7l8J43jj68J0J41j0N1P6j69q4k43J27N14k40j88R3j9K39
2404A83l62L3K46j87N2J04M8R0m9k40o0K86n59K28j0j6K79j21l8K02k14K25j9
2427A01m9k05l6K99r1Q1j63n9MJ5l5J38n7K35k19m2J76j03j38K15j07OJ10J87
2451B63j84n9J79j27j14J08Qj01R6o5RJ86l32j13P2K17jj96J39L8J12l09K22j46
2475i8r5J64j24N3K32Pk15J22n5Q6j7K1K1j3k89K74J14j23m12J77O2N9n1p2J90
2500A8j7Q2n4j7j47L76j11k81K38k87K78k4J34j09j22J03j57j1J09Mj50M07k99
$$ plain form
2523 -37 -27 -144 -27 -36 45 2 -8 150 -181 32 -230 -200 38 -10 56 122 35 -164 98 -24 104 -60 188 -23
2547 -23 -199 -77 91 89 -8 -31 241 -97 177 -57 140 -125 173 -12 19 185 63 307 -167 73 314 20
2569 20 18 -81 -80 84 -88 62 -73 -135 21 -274 -31 9 34 26 129 -19 -354 -204 28 -38 -14 -230 188 233 52
2594 52 151 -179 220 76 26 59 -127 31 7 378 -73 -217 123 -40 153 -210 -233 252 -68 38 14 -114
2616 -114 26 43 119 231 75 -189 -132 11 -55 175 -59 -263 17 -54 201 -169 -185 324 121 -271 72 8
2638 8 58 -216 -94 44 188 176 105 14 138 -14 28 -233 42 -263 -30 61 198 -90 -186 307 -84 -40 -100 316
2662 316 -115 321 246 -68 119 6 158 177 -82 -47 -127 248 19 -22 -88 -29 203 48 137 3 228 213 -101
2685 -101 139 201 4 -272 -61 -215 98 -35 -27 218 31 -10 -22 242 56 67 11 -2 -262 39 -2 92 -176
$$ packed form
2523c7J0j17J17rQ1m3j0J58l31K13k62L0K38m8O6O6q7j99K62j22J28j64K48k11
2547b3j76J22J68kr7k3K72l38K74k34J97k65K98j85L1J66j22K44m74K40K41k94
2569B0kr9JJ64j72J50j35o2J56k95K43M0K5qJ03j48l35J50K32o6K4k16M18M5j81
2594E2R9l30L99j44n0L3j86J58k4L71m51j44L40j63J93l63k3M85l20J06k4j28
2616a14J40J7P6J12j56k64N7J43o6K30k34k04K80p1K55l70j6N09k03l92L43o4
2638HN0k74J22J38J44j2p1r1J24j52M2k61K75l05K33R1J37k88r6M93l91M4o0M16
2662C16m31M36p5l14J87j13J52J9k59L5q0L75k29m1o6N9K32j55Q9j34K25j5l14
2685a01K40O2j97k76K11j54L13j33QK45j87m1j2K64j86J1n6j3k60L01m1R4k68
$$ plain form
2708 -176 -279 103 234 1 -105 138 -58 349 66 -65 -43 160 68 14 0 -46 -22 258 -209 -127 -50 344 23
2731 23 -187 -352 -263 115 40 -269 -124 26 -27 26 -211 -57 -267 -37 -110 -353 -73 -121 -178 163 -73 92 -8
2754 -8 -241 32 99 -66 -439 -69 81 -103 262 76 -72 -132 181 190 -40 -328 -195 -38 168 -53 -4 63 33
2777 33 198 -144 -12 -46 -169 -66 12 -49 15 87 -88 134 -198 63 131 -140 131 -185 5 -55 -39 -19 124
2800 124 -150 133 118 211 -198 -129 -65 -83 70 -30 165 159 35 -83 -101 -40 -119 44 43 118 -128 -76 -167 -156 119
2825 119 35 118 39 -193 -182 60 -16 141 133 -202 -174 -161 29 64 171 148 -119 -169 -21 -69 -67 -407 -15 210 -54
2850 -54 1 -89 -179 -38 371 25 117 22 -2 -100 32 -381 -20 -70 61 208 82 -262 -6 107 219 -172 -137
2873 -137 -34 -33 -145 204 239 -219 77 1 46 129 104 -8 39 6 17 -171 -152 10 -98 102 -73 274 -149 -72
$$ packed form
2708a76j03L82J31k33j06K43j96M07k83j31K2K03r2n4j4m6K4K80m67Q2P7L94l21
2731B3k10j65Q9L78p5l09J45J50n3N3k37J54k10K30p3k43K80m8n7L41k36J65j00
2754hk33K73O7j65l73L70J50j84L65j86j48o0L13Rk30k88J33J57K06k21M9O7l0
2777C3J65l42J32l4j23J03P8o1O4P2j75K22l32K61O8k71K71l16J90o0J6K0J43
2800A24k74K83j5R3m09O9O4j8J53j00J95oj24j18j8O1p9J63jP5k46N2r1J1K75
2825A19q4Q3p9k32J1K42p6J57ql35K8J3J90L5J07k3k67n0J48m8Kl40L92K25k64
2850e4N5r0r0J41M09l46R2r5k4r8J32m13L61n0J31J47j26l44K56J13J12l91L5
2873a37J03Jj12L49L5m58K96p6M5Q3k5j12M7l3J1j88J9J62j08K00j75L47m23P7
$$ plain form
2897 -72 59 -9 34 -160 156 47 -229 -108 -251 72 -139 223 99 90 -102 -101 -88 143 31 142 73 -71 -42
2920 -42 182 130 -103 198 104 8 -68 -51 -6 -127 -25 230 21 -78 435 93 -4 39 -89 80 142 92 -173 1
2944 1 97 -312 -87 83 48 25 58 -13 -103 -13 -289 -41 -83 35 86 -152 89 -104 -68 -285 -61 208 214 -57 58
2969 58 287 39 225 218 -103 -15 191 73 209 73 -25 302 -204 -36 -16 -1 -94 42 -126 56 -83 134 12
2992 12 4 195 81 -58 -46 245 55 -33 -77 -135 119 -2 50 -53 46 -122 -58 -199 -130 34 -82 -111 131 23
3016 23 -42 -84 -12 50 -61 171 2 -14 -71 3 -240 362 17 -320 234 -94 112 -93 195 78 113 -68 46
3039 46 -8 176 10 -153 153 124 354 -89 16 300 292 -122 -180 -56 -15 -214 -87 -225 9 -109 -134 13 9
3062 9 21 94 6 -85 -252 -183 -111 162 -23 -23 15 22 -61 -139 168 -235 -43 -17 -52 173 81 56 -34 70 -56 131 83
$$ packed form
2897g2J31o8M3j94L16j09k76J21j43L23k11L62j24rj92JJ3K31j12J11o9j44K9
2920d2K24n2k33L01r4r6p6J7M5j21J02K55k09r9N13l42r7M3j28J69O2n0k65J74
2944AR6m09K25J70l5k3L3p1r0R0k76K48m2J18N1k38K41j93L6k17K24K69Ok71J15
2969E8K29k48J86pl21Q8K06j18J36j36r8L27n06J68K0J5r3J36j68J82j39K17j22
2992A2qJ91j14j39J2K91j90q8m4n8K54j21N2j03R9j68O4j41O9J64j16k9K42j08
3016B3o5m2P2O2j11K32j69j6n7P4k43O02l45l37N54l28K06k05K88j17L5j81J14
3039D6n4J84j66j63L06k9K30m43J05K84qm14n8J24M1j99J27j38K34j18k5J47m
3062IJ2P3q8r1j67O9P2K73j85%L8Pq3p8L07m03J92K6l5K25r2k5r0J04j26J87m8
$$ plain form
3089 83 -68 -20 1 -23 136 -15 -99 -117 -212 -48 136 46 -80 97 -55 142 125 -11 -123 -41 137 20 287
3112 287 -9 22 -36 23 -220 83 -105 -57 -20 -51 142 60 171 -114 121 -165 115 -195 441 130 54 -8 -59
3135 -59 -91 128 39 -31 -5 195 201 -144 -143 -6 174 14 348 -13 140 -40 73 214 -334 -136 -7 -225 133
3158 133 53 -136 -166 87 -122 292 263 90 -102 -148 -135 -76 19 -39 26 341 -125 97 -90 -77 107 -58 -93 6
3182 6 58 282 56 -293 13 51 -23 -443 -10 106 109 -233 -46 46 -82 -7 -65 -31 -32 -111 362 125 141 268 -94
3207 -94 -9 -8 -31 21 -103 -330 -126 -49 -38 82 -88 -104 -123 23 53 119 156 -51 -155 8 223 -154 -87 -97 222
3232 222 110 -35 -155 63 -263 -12 -3 37 -37 95 -186 -197 -14 69 -170 40 27 95 -207 43 38 -26 54 170
3256 170 82 -344 143 101 -83 60 156 -133 47 37 189 -18 286 32 -15 84 -20 219 67 -18 -5 -111 -186
$$ packed form
3089H3j51M8K1k4J59j51q4j8r5J64J84r0j26J77j52J97j7j36j12Q2J78j17K67
3112B87k96L1n8N9k43L03j88M8L7l1J93q2J11k85K35k86K80l10O36l11p6o2n1
3135e9l2K19q9p0K6K00Ol45JJ37J80j60L34l61J53j80J13J41n48J98J29k18L58
3158A33q0j89l0K53k09M14k9j73j92m6J3N9R5n8O5L15m66K22j87J3J84j65l5R9
3182FN2K24k26l49L06L8p4m20M33J16Ll42J87R2j28P5n8L4jp9M73k37J6J27l62
3207i4Q5Jk3N2j24k27K04P7J1J20j70j6j9J46L0O6L7k07j04J63K15l77O7j0L19
3232B22j12j45j20K18l26K51RM0p4J32k81j1J83Q3k39K10j3O8l02K50no4Q0J16
3256A70q8m26M87m2j84J43R6k89J80j0J52k07L04k54m7R9j04K39j52q5J3j06p5
$$ plain form
3279 -186 -227 -57 65 -282 -20 -66 114 -30 -112 144 12 238 -66 173 7 -294 -42 -23 -111 47 -129 18
3301 18 181 134 245 80 -23 34 60 51 14 -50 117 166 -5 -32 -224 -94 149 -189 180 -120 -4 -76 337 181
3325 181 123 77 55 -241 -19 37 18 84 178 39 -163 35 -90 252 15 17 -158 -6 -129 118 -10 -66 18 110
3349 110 -169 30 -38 19 -59 138 -97 168 -136 296 65 -24 111 58 45 16 89 -39 6 153 -21 -117 -216 -136
3373 -136 126 -59 -250 178 12 219 -13 81 105 63 -211 51 20 336 -74 -65 23 -55 203 18 123 -317 10
3396 10 -200 38 -178 -207 -71 -10 144 207 101 -218 -195 -127 -63 197 171 -26 -89 -146 -275 -105 398 262 -241
3419 -241 -76 -148 -77 -19 95 227 -101 182 -265 131 150 -242 189 209 -68 82 22 92 120 -31 125 -143 -241
3442 -241 47 -181 181 106 -134 69 119 243 -56 151 53 138 228 -204 129 146 -115 -288 27 70 29 -51 154
$$ packed form
3279a86m1J70J22l47K62m6J80j44q2K56j32K26l04K39j66l01K52J9q8J58j76J47
3301A8J63m7J11j65j03N7K6rl7o4J67M9j71k7j92J30K43l38L69l00J16p2M13j56
3325A81n8m6k2k96K22N6j9O6R4j39k02J98j25L42k37Kj75J52j23K47j28n6Q4R2
3349A10k79J99o8N7p8J97k35K65l04M32k31q9J35n3j3k9P3j28M5J47j74r6r9Q0
3373a36K62j85j91M28j66K07k32R4K4m2k74K62l1L16m10RQ8p8K58j85J05m40L27
3396A0k10K38k16k9J36O1J54O3j06l19K3O8O4K60k6j97o3n7j29J70N03j36n03
3419b41J65p2P1N8J14J32l28K83m47L96J9l92M31K0k77J50o0P0K8j51J56k68r8
3442b41K88k28L62p5k40K03N0J24k99K07r8Q5R0m32L33J7k61j73L15M3m1q0K05
$$ plain form
3465 154 -130 37 -269 27 2 15 135 5 -75 -3 19 -166 -25 41 66 97 -44 99 147 -42 -2 -132 54
3488 54 87 -125 -91 19 -218 -11 44 1 167 -106 224 156 204 265 -78 150 -369 84 6 89 -59 -253 56
3511 56 -160 -348 -295 186 -103 -76 -96 130 115 65 0 69 -61 -266 76 -36 39 -156 53 -6 153 89 -21 8
3535 8 315 174 -149 -164 -71 88 266 179 8 207 -112 9 -270 -88 144 -15 13 -182 -88 195 -94 -70 -38
3558 -38 201 -155 -57 62 -141 38 177 41 -51 -164 -1 -32 -103 -14 90 -86 95 102 286 -62 -112 193 -27
3581 -27 -22 32 567 88 213 -15 -68 156 -1 -18 139 414 -12 -37 -22 102 119 111 -66 -92 -101 91 -83 -105 56
3606 56 -5 170 45 123 97 12 127 70 298 177 236 247 5 -73 214 17 -24 247 -163 -107 -107 86 55 124 -65
3631 -65 19 -33 -111 267 122 -19 -100 209 -110 -138 -80 -22 -57 65 -114 172 83 177 29 138 -96 16 -14 -114
$$ packed form
3465A54k84J67l06K96k5J3J20j30q0P2K2j85J41O6K5L1j41J43M8j89M0j30J86
3488E4L3k12L4J10k37K07N5m3J66k73L30o8M8O1l43K28n19M53p8Q3j48j94L09
3511E6k16j88N3M81k89K7k0K26j5n0o5O9j30k05L42j12P5j95K09n9J59o4j10K9
3535HL07j41l23j5R3J59J78q7j71J99l19J21k79J82K32j59K8j95R4K83k89K4L2
3558c8K39l56R8J19k03J79J39j36r2j13J63l1p1Q9J04j76J81PJ84l48n0L05k20
3581b7NN4N35m79J25k28n3K24j57j7J57K75m26k5J5J24J7qj77k6rJ92j74k2J61
3606E6o1J75j25P8k6q5J15n7K28j21N9J1k42p8K87j97m1K71m10N6%J93l1O9j89
3631f5Q4n2p8L78j45j41q1L09l19k8N8N8l5J22j79K86q9R4j48J09k34J12l0j00
$$ plain form
3655 -114 99 -101 203 -35 107 -70 288 -59 58 -82 37 -10 258 30 283 -208 -46 87 -182 40
3675 40 39 -73 -207 -82 213 -30 -44 26 -31 -245 88 46 -9 -146 -104 28 157 227 105 -153 -63 -107 46 -24
3699 -24 66 -89 -51 -45 161 31 112 -9 -310 133 150 106 67 35 19 -37 -121 96 -106 -37 -120 -168 85 -49 60
3724 60 44 -113 -61 -105 -3 -137 133 71 -32 -153 39 92 45 -257 140 -97 94 -206 -201 174 -281 -34 -6
3747 -6 -143 117 36 -23 -87 202 -101 -54 -12 68 -109 301 187 212 139 22 -99 168 -49 191 46 -74 176
3770 176 32 39 25 -15 -175 -100 -173 308 108 -147 169 64 -188 -57 83 -119 -12 -58 226 -66 -62 52 102
3793 102 -144 -14 -241 -71 -152 23 -88 39 -81 -40 110 -209 -163 -67 2 167 9 243 60 102 -101 -101 182
3816 182 258 150 16 220 -190 -134 -177 222 211 -8 86 67 -15 -120 -80 -132 126 8 -41 -46 -205 218 -45 309
$$ packed form
3655a14K13k00L04k38J42j77L58l47J17j40J19m7K68k28K53m91J62J33k69K22
3675D0jj12j34J25K95k43j4P0n7k14L33m2n5j37M2J32J29P0j22k58R0m4J53p0
3699b4R0j55L8OK06j30Q1j21l01M43J7m4l9l2j6n6q4K17k02O9q3m8K53j34J09
3724F0j6j57N2m4J02j34K70o2j03j21J92N3m7l02L97k37J91l00NL75m55K47K8
3747fj37K60q1n9o4K89l03M7M2Q0j77M10j14K5p3j17j21K67k17K40j45j20K50
3770A76j44Pj4m0j60P5p3M81k00k55L16j05k52J31J40k02J07m6K84k92MJ14N0
3793A02k46J30k27J70q1J75j11J27j20M1J50l19M6R6O9J65j58K34j83M2k03%K83
3816A82P6j08j34K04m10N6m3L99j1k19R4j9q2j05M0n2K58j18m9nj59M23k63L54
$$ plain form
3840 309 -183 197 91 232 70 14 -132 -29 68 -150 -19 -123 -209 -96 155 -174 27 71 -196 53 132 -10
3862 -10 45 -93 -25 -386 348 -42 164 -192 47 -63 -3 50 222 5 68 -166 -72 142 -6 186 -201 116
3884 116 165 -50 179 74 65 36 61 -199 80 215 17 16 278 47 -23 -103 88 -81 13 274 -184 47 114 -76
3908 -76 13 -231 -67 -121 8 99 -152 -131 122 173 -161 145 64 101 -15 66 -34 335 324 48 21 187 -17 -99
3932 -99 185 63 -44 45 139 30 -97 164 -269 95 -200 56 -35 -161 89 163 -92 66 42 -20 126 -2
3954 -2 -35 -63 -105 -53 143 -87 11 -69 51 -135 -104 -73 200 -68 -78 8 272 232 58 -283 -76 -228 -192 24 -15
3979 -15 -54 69 130 72 -186 48 -102 -189 196 -82 -326 -80 -97 -90 182 -77 33 -38 -182 272 -39 87 -142
4002 -142 117 245 -174 -204 115 237 -65 70 281 31 3 66 52 -110 92 -258 -271 -132 -57 126 223 64
$$ packed form
3840C09m92L80j06J41j62n6j46J03R7k18J31j04q6J13K51l29K01M4k67K49P9j42
3862a0N5j38O8l61P34l90K06l56K39j10O0N3J72k17O3k34R4K14j48J92l87L17
3884A16M9k15K29j05rk9K5k60K79J35j98jK62k31p0q0J91j69R4K61m58K31O7j90
3908g6Q9k44J64n4J29R1k51K1K53N1l34L06q1L7j16Q1j00L69j1k76k7J66k04q2
3932i9K84j22j07Q9R4j09j27K61m33L64k95K56r1j26K50P4k55J58k4o2J46j28
3954bl3k8m2N2J96k30R8q0J20j86L1L1K73k68j0Q6K64m0j74l41K07j52L6K16l9
3979a5l9J23O1n8k58K34j50q7L85k78k44K46j7PK72k59J10p1j44M54l11J26k29
4002a42K59J28m19l0L19J22l02J35K11k50k8O3j4j62K02l50j3J39P5J83R7j59
$$ plain form
4024 64 -177 -40 -86 100 113 9 44 29 47 -44 113 226 76 26 -17 343 -199 321 -87 -92 -215 -193 -120 197
4048 197 80 -35 32 -199 170 178 163 -47 -8 -268 -118 174 -145 -322 -6 22 8 145 -42 139 28 -53 -123
4071 -123 -76 -23 -124 73 -57 30 78 -57 86 -83 155 143 219 -145 228 -91 92 112 -26 15 -220 30 184
4094 184 59 -76 34 -180 119 125 201 -162 -190 -170 87 70 -86 288 131 -140 156 -109 19 -21 -43 13 -218
4117 -218 261 117 62 9 -185 -178 131 -386 -92 19 -112 -137 -34 -83 11 -88 -73 161 5 11 93 -201 90 -192
4141 -192 103 3 145 -265 -182 44 400 -70 30 -161 -10 202 -174 316 -88 71 198 -71 151 266
4161 266 48 9 -80 7 -29 -70 143 -81 -65 128 68 -214 -217 7 -81 -261 191 -81 -77 343 125 109 258 -96
4185 -96 -146 244 -117 -163 -63 -122 6 -106 -8 -19 -88 88 45 -149 -54 375 -12 -181 -130 -125 37 -80 223 -209
$$ packed form
4024F4k41J37m6J86J3j04L5j5J8r1J57J13j50n0m3L60n42N20m08nj23K2P3L17
4048A97j17j15O7k31L69Qj5k10L9k60J50K92l19j77L16K8j4J37j87J81j11q1p0
4071a23M7N3j01J97j30Q7M8j35J43j69K38j2P6l64L73l19J83K0j38M1k35K50J54
4094A84j25j35J10k14K99OP6l63k8K0K57j7j56L74j57k71K96k65J28m0k2N6k31
4117b18M79j44n5n3j94PL09n17K94J11j31k5J03m9R4r9J5K34j56OQ2k94K91k82
4141a92K95j00J42m10Q3K26L56m70J00j91J51K12l76M90m04J59J27k69K22J15
4161B66k18l9q9Q7l6m1K13k24J6J93o0k82lK24q8j80M52k72MM20k18j6J49l54
4185i6n0L90l61m6J00n9J28j12R8j1o9J76m3j94R5M29l87j69N1NJ62j17L03m32
$$ plain form
4209 -209 63 -90 -127 195 -12 121 -11 -116 -223 -150 105 92 -141 244 114 56 47 -90 67 347 -97 -260
4231 -260 105 19 143 -214 28 86 28 -68 -72 -96 -144 4 179 -15 11 -65 177 79 -135 -32 -32 -3 -147 -63 220
4256 220 -212 249 38 -14 20 50 83 -162 -86 21 -105 129 12 156 -246 118 138 76 84 -149 159 -34 -90
4279 -90 116 19 180 388 225 -142 167 116 101 -161 -49 -116 120 -62 41 126 -140 362 131 115 -56 15 -220
4302 -220 -29 -189 -38 60 52 -46 16 65 -149 70 -172 -219 132 30 155 -170 143 -68 41 -80 -183 -182 14
4325 14 3 188 1 -39 -84 119 -25 151 -54 -4 52 195 -12 -88 20 137 -57 5 228 112 89 -111 -251
4348 -251 -112 -242 -76 37 151 -22 47 53 -29 -139 -66 30 130 -50 80 -241 246 145 -82 13 89 58 -111
4371 -111 104 -10 138 17 123 -303 -102 -16 -60 -117 40 -247 259 31 -42 289 -46 22 -50 -97 122 -149
$$ packed form
4209b09K72j53l7L22k07J33j32j05j07P3K55j3k33L85j30n8rj37J57K80m44j63
4231b60L65q6J24l57K42N8n8r6mk4m8J48J75j94K6p6K42r8k14J03%K9j44Q4K83
4256B20m32M61k11n2L4L0L3k45P6J07j26K34j17J44m02L64K0o2Qk33L08j93n6
4279i0K06r7J61K08j63l67L09n1j5k62J12o7K36j82J03Q5k66N02k31j6j71P1k35
4302b20J91j60J51R8qr8O2M9k14K19k42m7L51j02J25l25L13k11J09j21j03JJ96
4325A4j1J85j87m0m5K03j44J76k05N0N6J43k07p6J08J17j94O2K23j16k3k00j40
4348b51J39j30J66J13J14j73O9Oq2j10P3R6J00j80J30l21M87j01k27R5P6l1j69
4371a11K15j14J48j21J06m26K01Q6m4n7J57k87N06k28p3L31l35O8p2m7K19k71
$$ plain form
4393 -149 -393 62 51 -154 -22 187 -5 -217 38 47 106 264 206 -58 -99 197 -44 -10 0 -62 36 -92 -205
4416 -205 77 41 215 -87 -122 77 6 367 109 13 104 -285 169 368 -105 -49 -53 -183 -163 95 -244 -69 -58
4439 -58 -2 -136 127 -138 269 -150 -47 -119 43 72 -58 38 -86 -67 -25 -175 -93 84 89 51 13 135 188 -90
4463 -90 -238 -116 100 122 140 -8 -7 -258 -169 38 -78 80 95 188 123 305 179 248 -55 -118 181 10 -15 -107
4487 -107 -104 112 -159 -26 13 23 -17 -300 85 -81 -244 65 2 11 -12 -148 -127 -134 -434 -249 -139 93 -36 18
4511 18 -169 161 54 -170 -63 -54 97 -56 269 66 -136 301 80 -183 257 -95 139 148 -81 80 129 60
4533 60 118 10 -171 219 38 30 212 -269 18 -57 -106 -239 76 -119 116 112 200 -164 -205 49 36 -117 27 195
4557 195 102 -22 50 93 -16 -108 11 -122 -4 -92 155 5 0 -299 214 -123 -87 142 100 69 -83 68 -118
$$ packed form
4393a49k44M55j1k05J32K09j92k12K55RN9J58n8k64m1K96k41L4J0o2R8j28j13
4416b05K82l6J74l02l5J99p1L61k58r6R1l89M54J99m73N6mj30K0K58l39J75J1
4439e8N6j34K63k65M07m19J03p2J62K9j30R6j24J9M2j50Q2J77Nl8l8J22N3k78
4463i0j48J22K16K2J8j48Jk51Q9K07j16J58J5R3o5J82j26O9l03o3K99j71k5r2
4487a07LK16k71J33L9J0m0k83L85j66j63L09o3Rk3j36K1pl00J85J10K32j29N4
4511A8j87L30j07k24J07RJ51j53L25k03k02M37k21k63M40l52K34Rk29J61M9o9
4533F0N8j08j81L90j81qJ82m81K87p5m9j33L15j95K35mQ8l64m1K54j3j53J44J68
4557A95r3j24P2M3j09r2J19j33J18q8K47j50nk99N13l37L6K29m2l1j52J51j86
$$ plain form
4580 -118 363 -190 100 -13 47 -176 -137 34 -333 -193 -114 -34 -69 220 -161 -256 204 -186 3 -106 -37 -45 -112
4603 -112 178 164 -147 -12 76 -155 115 -170 -26 83 62 -244 -11 93 150 -231 -104 192 -56 98 228
4624 228 2 -222 -72 121 8 -82 21 181 -41 -102 -63 27 74 -291 -1 -6 236 -253 146 250 91 -96
4646 -96 14 -157 158 409 -42 -178 -121 9 -58 59 -73 0 -30 328 189 -42 -55 -50 216 83 260 134 216
4669 216 228 -55 180 -146 53 20 -127 -158 -298 140 129 -119 67 138 -5 -126 -195 -165 -87 -44 -347 185 -176
4692 -176 -109 -292 -38 112 170 -7 55 105 -152 51 -55 -182 12 427 58 76 11 -47 85 218 -231 -67
4714 -67 -79 128 119 101 -205 -195 67 -85 13 75 33 57 200 27 320 -106 71 76 -161 -157 224 -39 42 -84 130
4739 130 -271 12 -39 -87 -298 8 -197 -136 -41 81 78 40 -11 21 -66 -65 -43 -310 262 -91 103 -192 55 141 -168
$$ packed form
4580a18M81n53K90j13O0k23L9J71l67J40P9Q0l5K89l81r5M60l90J89j09O9qo7
4603a12K90j4l11J35Q8k31K70k85J44J09k1l06K33J04N7l81J27K96k48J54J30
4624B28k26k24J50J93j13r0J03J60k22o1L9R0M7l65K90nK42m89L99J04j59j87
4646i6J10j71L15K51m51j36N7J30o7J17j32P3l0L58j39k31j3NK66j33J77j26Q2
4669B16J2k83K35l26J99l3j47l1j40M38j1k48J86P1j43j21o9L0P8M3l03N32l61
4692a76O7j83K54J50N8j77O2N0k57K03j06j27J94M15l69J8o5n8J32J33m49J64
4714f7j2K07rj8l06J0K62j52R8O2m2K4J43j73K93m26J77Nk37ML81k63Q1j26K14
4739A30m01K83n1m8k11L06k05O1R5J22ll8n1L2q7JK2k67N72l53J94k95K47Q6l09
$$ plain form
4764 -168 39 197 144 -109 24 81 106 99 1 -226 20 -16 -204 -290 -124 132 -55 159 -53 35 -181 143 -183
4787 -183 -63 121 15 108 -189 73 162 -43 55 -71 21 -6 -255 185 43 95 175 -40 183 259 -153 100 -37
4810 -37 -48 -191 178 227 116 -104 347 -123 -1 45 -172 122 -85 -165 131 -36 -58 117 -168 -39 67 92
4832 92 -64 148 -12 170 27 164 -37 -244 86 125 -69 27 255 199 62 244 -269 -32 -12 -209 -73 55
4854 55 178 56 -10 12 -133 -79 -268 230 244 201 82 -250 -68 94 -5 30 -83 215 118 0 82 135 226 208
4878 208 27 -57 149 146 361 29 78 121 -104 -69 73 -179 7 -96 2 146 -108 -6 -223 204 232 151 40
4901 40 357 -93 -81 48 187 124 -20 -51 39 95 -13 23 214 -9 -16 12 -30 -117 -25 -262 29 -68 209 375 292
4926 292 8 207 -78 -179 -212 -179 -190 -116 180 179 46 -19 -202 -144 -69 -110 -197 -250 263 -164 -160 58 63 204 142 -84
$$ packed form
4764a68K07J58n3k53J33N7K5pr8k27K46l6j88q6J66K56j87K14k12Q8k16L24l26
4787a83J20J84j06R3k97K62Q9k05R8j26R2k7k49M40j42N2Q0k15K23P6m12K53j37
4810c7j1j43L69M9j11k20M51m70J22M6k17K94k07q0K96j67k2J75k85J29J06K5
4832I2j56K12j60J82j43J37k01k07L30L9j94R6K28n6j37J82n13K37K0j97J36J28
4854E5J23j22o6K2j45N4j89M98J4m3j19l32J82J62r9L5j13K98r7j18Q2N3R1j8
4878B08j81q4K06lK15l32M9M3k25L5J42k52J86j03R8J44k54J02k17M27K8q1j11
4901D0L17m50J2J29J39o3j44l1R0N6j08L6J91k23pK8m2q7R2k37K91r7K77J66q3
4926B92k84J99k85j01l3L3j1P4K96jj33o5j83N8P5m1q7n3N13m27MK18NJ41o2k26
$$ plain form
4952 -84 -5 -80 0 41 2 -306 -80 -177 92 -8 -82 -35 -142 -68 137 -124 -80 -76 61 76 -17 57 50 9 -65 -114 7
4979 7 111 -258 -56 -89 -233 -91 35 37 45 105 -211 -215 25 109 85 255 -212 -249 295 -71 -38 33 446 69 -91
5004 -91 41 76 -96 62 80 207 15 92 -285 43 -27 250 -50 68 -20 -133 -56 31 112 2 -38 -152 -5
5027 -5 49 -3 -36 -65 -9 -108 42 120 -114 148 26 81 -171 74 158 73 11 -196 -21 -47 72 -55 82 -326 -236
5052 -236 31 53 143 83 85 117 -8 130 -27 330 217 36 -154 2 -53 -117 38 -127 178 282 145 -53 -116
5075 -116 61 248 16 -114 257 52 -187 -1 -122 81 -101 179 211 -151 -151 124 102 68 146 -8 -164 107
5097 107 -89 39 -81 -78 -220 156 -45 130 -77 118 52 -79 -112 -121 6 26 -20 -118 68 -253 42 49 34 -284
5121 -284 134 -149 44 -37 -97 -35 -105 -25 -18 -366 229 -199 -136 -103 47 -145 -48 187 -140 101 -87 13 -169
$$ packed form
4952h4P9p5Q0M1l9l08K26r7K69j00p4M7j07P4K05k61M4MJ37J5r3P4pm1p4m9J21
4979GJ04l69K02l3j44J42J26KQO0l16mK40Q4k4J70m67l7N44l66L3P1M13l77j60
5004i1J32L5j72J58J8J27j92P7l77L28p0K77l00J18q8j13P7Q7Q1j10m0j14J47
5027eN4n2l3k9N6r9J50P8k34K62j22N5k52K45Q4q5o2k07J75k6J19j27J37m08R0
5052b36K67K2R0o0KL2j25J38j57L57j13j81j90J56n5o4J55j65L05J04j37j98o3
5075a16J77J87k32j30L71k05k39J86j21K03j82K80L2l62%K75k2l4P8j54j56K71
5097A07j96J28j20Lj42L76k01J75k07J95o6j31l3rJ27K0m6r8J86l21K95Pj5l18
5121b84M18k83J93q1o0O2p0Q0Pl48N95m28O3L3J50j92R7K35l27K41j88J00j82
$$ plain form
5144 -169 48 -110 -81 -48 116 -75 -4 82 43 -304 100 100 -112 9 -24 216 3 0 102 -72 -240 250 -136
5167 -136 -83 -319 -38 187 0 -106 -367 134 -67 -85 -52 44 -28 -95 275 105 29 -142 -185 227 -227 356 -11
5190 -11 -25 140 -29 34 -106 -78 256 -343 259 90 -87 -277 -200 -198 -141 152 172 133 34 198 93 60 196 142
5214 142 -39 161 194 137 180 -75 -254 87 -1 -131 238 -238 66 -79 -118 67 11 -152 -34 -202 47 -32
5236 -32 -119 -4 19 -128 135 26 204 -55 -64 45 -61 156 28 -129 88 18 36 -41 -160 -188 -131 -153 237 263
5260 263 372 24 32 -141 55 -61 -88 -344 61 -201 -54 -36 -79 204 44 -44 193 159 88 25 161 -71 -85
5283 -85 -124 -349 -70 -48 152 154 -110 -87 69 74 101 11 95 219 166 70 241 -110 126 -185 -146 -10 118 63 -57
5308 -57 129 -153 -56 211 107 30 34 110 -247 -293 62 161 119 30 107 -289 46 1 113 -48 -25 70 258 -188 328
$$ packed form
5144a69K17j58K9L3J64j91P1Q6l9l47M04%k12J21l3K40k13lJ02j74j68M90l86
5167a36N3k36K81K25j87j06k61N01k01j8L3R6p2o7L70j70p6j71m3M12m54N83l67
5190a1j4J65j69O3j40K8L34n99O02j69j77j90P7KN7K93K0l9r9J64j05l3J36n4
5214A42j81K00L3n7M3k55j79L41q8j30L69m76L04j45l9J85n6j63J18j68K49p9
5236c2q7J15K3j47K63j09J78k59rJ09j06K17j28j57K17p0J8p7j19k8N7k2L90K6
5260B63J09l48Qj73J96j16k7k56M05k62J47J8m3K83j60q8K37l4p1o3J36k32j4
5283h5l9k25K79K2K00Kk64K3J56NK7r0Q4J24n3r6J71l51K36l11L9J36J28n5j20
5308e7J86k82R7K67j04p7MP6l57m6L55R9m2q9P7l96L35m5J12j61K3R5J88m46N16
$$ plain form
5333 328 -193 -166 190 17 162 -103 -251 -122 -2 66 90 185 -92 -149 -146 90 173 54 504 254 192 -21 -126
5356 -126 -80 -166 195 -250 20 -19 -40 26 247 240 -224 20 -179 35 59 -113 -137 280 -273 192 3 31 33 -266
5380 -266 -30 -189 3 -55 -42 113 71 -210 -88 -128 61 -99 165 144 41 -196 -320 -134 78 64 -71 -209
5402 -209 71 131 19 -136 -1 146 -354 -172 -173 -89 83 -12 200 -4 281 184 340 -237 -75 -36 73 -333
5424 -333 -11 101 -25 -92 -9 -181 -105 44 -23 30 70 135 -94 -28 100 101 77 -28 -106 -217 -198 -164 -96 -9 -204
5449 -204 -238 82 -101 -13 17 76 63 -18 36 -68 124 -71 -78 313 123 283 -69 136 167 19 228 -209 -118 92
5473 92 -116 -87 49 1 -94 -70 101 -143 -92 -159 28 -78 107 -267 -79 -5 268 -255 -172 -79 10 471 262 98
5497 98 -232 228 -262 -35 237 41 -76 -36 -292 178 -54 95 141 -88 -85 -187 12 -73 -42 216 -384 -176
$$ packed form
5333C28n21K7L56j73J45k65j48J29J20O8K4R5k77n7LK36Q3j19M50k50o2k13j05
5356a26M6q6L61m45K70l9k1O6K21pm64K44j99K14K4j72k4M17n53M65j89K8Kk99
5380b66K36j59J92n8J3J55m2k81J22m0J89j60K64k1j03k37j24J86K12j4j35j38
5402b09K80O0j12j55J35J47n00J82jQ4J72r5K12k04K85r7J56n77J62L9J09m06
5424c33L22J12j26o7Q3j72P6J49o7N3M0O5k29O6J28Jk4j05p8j11J9L4O8Q7j95
5449b04l4L20j83Q8L0N9j3q1N4j04J92j95pL91j90J60l52K05L1j48K09m37R1K10
5473I2k08K9J36m8r5K4J71k44N1o7J87j06J85l74J88P4K73n23Q3R3Q9M61k09j64
5497I8l30M60m90K27K72j96j17M0k56M70k32J49M6k29Lj02J99q5L1K58o00K08
$$ plain form
5519 -176 -28 199 -45 -53 -169 348 -36 128 -111 11 23 113 -153 78 72 56 -87 16 -26 -158 154 -263 221
5542 221 100 -299 36 47 164 -65 10 135 -26 105 145 -157 -162 81 63 47 122 -11 45 -24 -270 26 219
5565 219 -55 84 96 13 131 -114 -236 156 -121 61 -2 180 -194 307 -76 -54 -278 -104 -199 -82 -71 -35
5587 -35 78 28 119 55 68 -94 -167 -125 350 -28 167 126 -159 -108 -204 92 83 -237 -61 -180 -10 -219 -71 70
5611 70 139 -34 150 -25 -233 5 -91 292 50 -243 172 -57 131 14 -150 101 133 -308 269 134 -160
5632 -160 97 126 -18 -23 82 157 -117 12 -184 -208 127 -63 174 -87 -37 -186 148 189 99 -30 55 -128 -34
5655 -34 36 67 -187 273 99 -313 -54 129 71 -99 268 -13 -4 -88 -74 -278 -206 -34 31 -273 181 -37 -152
5678 -152 137 -112 27 -17 -175 32 52 66 236 -124 -146 306 95 -229 213 1 75 -62 -112 344 -74 -72 -101
$$ packed form
5519a76J48K27k44qj16N17l84J64k39J22J2R0k66K31oj6j43J03m2j32L12m17M84
5542B21j21l99L35J1J17k29P5J25j61J31M0l02nK43j8j6P5j33N6o9k46K96J93
5565B19k74J39J2q3J18k45j22L92k77J82o3J82l74N01l83K2k24J74r5J17J1L6
5587c5J13n0R1o4J3j62p3M2M75l78J95m1k85N1r6K96rl20J76j19J70k09J48J41
5611G0O9j73J84j75k08K38r6L83k42k93M15k29J88j17j64K51L2m41N77j35k94
5632a60K57K9j44nJ05P5k74J29j96k4L35j90K37k61N0j49L34M1r0j29Q5j83R4
5655c4P0L1k54M60j74m12K59J83n8j70L67k81Rq4J4k04P2J72O5l04M54k18j15
5678a52K89k49J39m4j58K07K0J4J70l60k2M52k11l24M42k12P4j37n0M56m18Kk9
$$ plain form
5701 -101 -136 39 -235 80 -195 -26 92 -215 -172 -121 335 -13 -4 87 80 -117 123 -20 90 -182 -113 -5 -189
5724 -189 -72 330 -165 67 -6 188 -75 95 104 -55 5 -36 -70 -32 142 -81 -161 -23 224 -25 223 -225 -152
5747 -152 154 -120 10 -154 -316 116 -15 120 117 -157 -85 -52 135 30 6 85 78 120 140 358 173 -6 152
5770 152 -226 92 -16 35 105 189 -114 -56 -56 -132 119 -90 316 -57 198 -112 32 -113 115 -183 -39 89
5792 89 -56 -169 99 52 -127 -64 -80 88 105 -15 -88 121 47 -208 92 91 169 -73 -24 199 209 -175 3 -42
5816 -42 39 56 -166 -283 44 218 -111 206 22 132 -43 -109 -68 -119 -136 158 169 -40 206 -44 96 -249 216
5839 216 114 30 48 339 42 220 47 132 379 18 -141 144 52 47 -20 323 79 43 15 -64 36 3 -39 252
5863 252 -71 94 119 151 32 -148 158 13 157 67 -23 48 -55 262 91 35 305 44 -117 53 -44 121
$$ packed form
5701a01l5J75k74L15k75J69J18l07M3N1M56l48RR1pj97K40j43J10k72O9J08j84
5724a89J17M02m95K32p3J94k63J70Rj59O0m1l4L8J74k23q0J38K47k49K48m48P3
5747a52L06k74J30j64j62M32j31J35lk74P2L3J87j05k4P9pM2K0K18j85j79J58
5770A52l78L18j08N1P0Q4l03N8%p6K51k09M06l73K55l10J44j45K28k98J44J28
5792H9j45j13K68m7j79O3j6J68J7j20p3K09p4k55L00jP8k42M9K23J0l84J78m5
5816d2Q1J7k22j17L27J74l29L17j84J10j75o6M1n1j7K94J1k09K46k50J40l45M65
5839B16j02q4J8K91k97J78j73Q5K47l61j59K85r2no7L43k44l6k8p9J00l3m2K91
5863B52l23J65K5L2j19j80L06j45J44r0r0P1j03L17j71n6K70k61j61J70r7J65
$$ plain form
5885 121 -31 -178 114 -82 -59 -28 -256 -65 47 -127 16 -115 -54 -185 68 129 126 34 114 91 153 -34 28 -475
5909 -475 -96 133 76 -87 238 -159 -210 -107 36 152 -118 161 -238 -148 257 45 4 205 90 -54 -41 -35
5931 -35 88 72 11 21 24 22 -152 -64 -214 -39 -122 50 -62 27 -206 -163 24 213 -68 -80 124 -18 -63 58 -103
5956 -103 207 -70 -53 51 196 -51 -27 181 -31 -67 147 109 -194 -134 -134 104 -1 16 -60 206 188 -302 -74
5979 -74 75 -177 -110 -126 198 -267 102 -88 35 143 -36 -74 23 38 6 -126 65 327 -128 -130 -149 -360 -241
6002 -241 -56 -54 -70 214 122 344 18 168 125 -41 191 41 238 -221 -5 235 -57 -29 115 129 -72 190
6024 190 -26 -43 -86 -46 -61 -173 122 -132 -64 -56 164 -79 61 35 170 -134 -88 -130 -46 -16 114 -106 13 -153
6048 -153 14 147 32 -173 49 -81 167 -32 -206 1 153 15 -201 105 31 -63 -170 -267 -104 98 -85
$$ packed form
5885A21j52j47K92j96K3L1k28J91J12j74J43j31O1j31K53O1lr2Q0k3O2j87O2n03
5909d75L79K29n7j63L25l97n1J03J43J16k70K79l99R0M05k12m1K01j15j44J3O
5931c5J23j6o1J0Lkj74Q8j50J75q3J72j12Q9k33M3J87J89k81j2K04j42m5J21j61
5956a03L10k77J7J04J45k47K4K08k12l6K14l8l03O0%K38j05J7p6K66j8m90K28
5979g4J49k52O7j6L24m65L69j90J23J08j79l8R7J5l2j32J91K62m55kj9k11J19
6002b41J85Kj6K84r2K22l26J50m3j66K32j50J97m59K16K40k92K8J44J4k01K62
6024A90k16j7m3M0j5j12K95k54O8QK20k43J40k6J35l04M6m2Q4L0J30k20J19j66
6048a53J67J33j15k05K22j30K48j99j74K07J52j38k16L06p4r4j07r7J63K02j83
$$ plain form
6069 -85 187 82 -122 92 -2 -172 -23 29 60 -161 -172 -17 -183 96 112 -319 -66 156 35 -94 129 156
6091 156 -245 99 -141 5 -159 -80 307 14 -126 157 -59 -83 -130 -188 -12 45 34 -19 40 102 3 88 -30 57
6115 57 -335 26 150 53 -39 286 -14 -255 -77 133 -134 -31 15 212 39 -19 113 -128 85 24 240 -228
6137 -228 167 166 157 218 82 -29 -211 54 87 0 19 -189 -34 60 -179 -94 210 65 100 -226 -62 -194 -107 17
6161 17 165 -72 96 85 -56 45 36 -133 41 98 107 -123 -33 12 93 214 138 -70 -29 28 80 -42 -40 -57 -27 145
6187 145 -73 -12 -27 88 61 -72 -246 163 -128 -291 307 -5 -183 73 29 -378 -135 39 -77 -174 -380 57
6209 57 -35 30 -243 257 95 -51 -209 -163 -70 45 134 56 -280 216 -35 -106 -294 -25 247 246 99 68 -183 -126
6233 -126 -81 295 297 -257 196 131 172 -104 142 -23 -10 -4 26 -19 -40 218 66 61 45 -3 -185 195 -157 -11 -37
$$ packed form
6069h5K72j05k04K14r4j70J49N2L1k21j1J55j66K79J6m31K53K22j21j29K23K7
6091A56m01L44k40J46j64P9L87k93j40K83k16k4m7n8J76N7j1n3N9O2r9Q5j18Q7
6115E7l92L61J24r7r2L25l00k41J78K10k67J03M6J97j73n8J32k41K13o1K16m68
6137b28L95jrO1j36j11j82K65L3q7J9k08J55R4k39Q5L04j45L5l26J64j32Q7J24
6161A7J48k37J68j1j41J01rj69J74N7Rk30R0M5Q1J21p6k08M1N7N2j22Kj7L0J72
6187A45k18O1j5J15k7j33j74M09k91j63N98l12j78K56m4m07K43J74j16r7k06M37
6209E7r2O5k73N00j62j46j58M6R3J15Q9p8l36M96k51p1j88K69K72jj47l1k51N7
6233a26M5L76Kn54M53o5M1k76K46j65J3OL0m5k1K58j52nj6m8j82L80l52J46k6
$$ plain form
6258 -37 -178 -49 84 29 -209 268 184 -225 -99 -216 24 16 -29 172 58 85 81 143 -76 16 -84 -42 229 226 -19
6283 -19 347 69 164 30 -94 219 94 -37 193 -71 111 22 -27 224 32 -20 71 10 -78 -131 14 55 78 -1
6307 -1 -13 287 6 -136 -152 62 88 -234 -189 114 272 -89 -225 -90 31 40 -55 270 70 305 1 70 -67
6330 -67 161 18 -58 -103 78 53 111 14 39 41 10 0 17 -5 -232 -38 129 98 0 -160 114 -134 61 -31 -84 -169
6356 -169 13 -34 -53 -77 -126 125 132 -169 21 -303 -311 51 -20 -51 -129 106 134 81 63 -118 -50 -5 48 6 26 -103
6382 -103 61 122 12 7 27 -97 -68 -163 -214 -285 158 65 -54 -45 9 114 33 -67 -33 25 -265 -279 0 -88 -184 36
6408 36 -100 -55 50 1 -63 6 35 33 -251 175 21 70 5 40 -34 174 -101 267 -124 -72 -117 39 23 -107 -9
6433 -9 -89 168 -48 -1 -170 31 -94 160 -115 -171 -20 149 -277 40 19 -65 -232 121 -1 -289 160 172 -64
$$ packed form
6258c7j41J29J33n5k38M77q4m09J26j17K40qm5K01j14K7mO2k19R2j00M2K71lk45
6283a9L66k78R5j34j24L13j25j31K30k64J82q9m9K51j92n2R1o1q8n3J45M1K3p9
6307aj2L00k81j42j6K14K6l22M5L03J58l61j36J35J21Rr5L25k00K35l04O9j37
6330f7K28j43p6m5J81k5N8r7K5Kl1j0J7k2k27J94J67l1r8j60K74k48J95r2n3q5
6356a69J82m7j9k4m9K51Pl01J90l24qL62p1l1p8K35K8n3j8j81O8M5N3m2K0j29
6382a03J64O1j10nK0j24K9r5n1p1M43r3j19RN4J05q1j00L4N8k90j4K79q8r6K20
6408C6j36M5J05m9o4O9K9kk84M26j54M9o5L5p4K08k75L68l91N2m5J56j6j30R8
6433iq0K57k16M7j69K01j25K54k75n6J51J69m26L17k1q4j67L53j22k88M49J2k36
$$ plain form
6456 -64 -205 -77 -167 -211 -77 -143 124 192 -85 -72 -39 13 -11 20 -136 -34 201 30 31 -101 48 104 175 51 -21
6481 -21 183 -98 57 -25 197 51 -167 -106 -75 -146 -131 -247 81 196 15 304 -199 -19 -31 162 70 -358 183
6504 183 128 68 -74 -25 15 -144 -108 -155 145 11 -33 71 75 -52 0 -35 -213 -165 360 28 114 -16 -36 89 -39
6529 -39 226 -119 -159 129 -112 -155 -70 247 65 -137 20 -41 -46 159 86 -111 69 -185 -2 -26 137 -24 -44
6552 -44 23 -212 2 63 -178 -2 -139 65 -128 82 -220 50 -114 40 21 -102 171 45 -103 -287 77
6573 77 139 62 -149 8 -384 -93 208 63 -161 110 55 37 -62 180 -24 -168 102 -114 148 38 -239 204
6595 204 75 -73 -9 -119 84 56 -44 27 -187 -116 24 64 88 31 -127 -73 203 84 113 68 -146 -231 88 -67
6619 -67 155 9 35 8 3 127 41 -120 402 89 129 -17 -95 19 12 -140 -25 -105 169 45 152 231 6 156
$$ packed form
6456f4j41J28r0m4J34o6K67O8k77J3L3N2k4L1j56J02K35j71Jj32J49N6P1j24p2
6481b1K04k81J55q2K22j46k18O1L1p1J5j16L28J15j81K89n03J80j2J93r2m28N41
6504A83n5o0j42M9M0j59L6m7L00j34m4J04Mj27N2l5j78M8N25l32Q6j30k0J25j28
6529c9K65l45m0K88k41m3Q5L17j82k02J57o1nK05p3j97J80k54J83k4J63j61k0
6552d4O7k35K14O1k41J76j37K04j93K10l02K70j64J54j9j23K73j26j48j84L64
6573G7O2p7k11J57l92K91L01j45k24K71n5j8r9K42k04j44K70k16K62j10k77M43
6595B04j29j48O4j10K03k8j00P1k14P1J40M0K4n7j58N4K76j19K9m5k14q5L19j55
6619f7K22j46K6k7nJ24q6j61N22l13M0j46p8J14pj52J15q0K74j24J07P9k25J50
$$ plain form
6643 156 -21 133 173 111 112 48 119 116 -62 154 50 -47 -78 102 -105 76 119 -73 -225 53 -36 -79 -17 155 -173
6668 -173 -112 -171 44 -194 -91 220 144 21 -119 -45 208 -51 -45 156 -45 -195 -18 -142 62 -200 201 98
6690 98 -86 72 4 -293 -58 30 82 -38 -33 8 72 147 73 101 -11 -118 166 -49 -57 225 69 26 -221 176 121
6715 121 18 -84 91 128 101 183 -263 -195 -251 14 -26 61 47 91 102 119 -95 33 -104 102 -22 -142 237 -199
6739 -199 50 -89 85 -70 -12 -92 -52 64 147 -2 126 -89 92 -178 214 -17 -144 -64 -175 213 -177 34
6761 34 91 118 108 -84 -14 5 99 120 -22 -19 91 -167 -89 117 42 -146 -200 -142 198 53 213 -72 136 -221 0
6786 0 1 -195 17 -37 -138 -183 -116 83 -185 74 -130 -85 160 61 134 125 31 -107 -96 -17 18 104 30 -129 -14 -50
6812 -50 -510 100 -183 212 67 7 -220 405 0 -72 -100 -124 -336 99 -45 86 -189 -41 -162 52 575 69
$$ packed form
6643A56j77J54M0o2Jo4P1lj78K16j04r7l1J80k07J81M3j92j52K78q9m3O2J72l28
6668a73O1n9K15k38J03L11p6j23j40P4K53k59OK01k01j50J77j24K04k62M01j03
6690I8j84J58o8k97K35Q8N2j20NM1O4P5p4K8j12j07K84k15qK82j56m3k47L97n5
6715A21j03j02J75L7k7Q2m46O8n6K65m0Q7j4M4J1J7k14J28j37K06j24j20L79m36
6739a99K49j39J74j55N8q0M0J16Q3j49J28k15J81k70L92k31j27Q0j11L88l90K11
6761C4N7K7j0j92P0J9R4K1j42LJ10k58P8K06p5j88n4N8L40j45J60k85K08l57K21
6786@Jj96K12n4j01m5O7J99k68K59k04M5K45r9P3rr4j38J1P9L5Q6p4j59J15l6
6812e0m60O10k83L95j45o0k27O25m05p2k8k4k12M35j44J31k75J48j21K14N23n06
$$ plain form
6834 69 29 78 -246 -81 -13 -2 -131 -193 163 -76 -111 -25 56 193 334 -22 -35 -60 -12 152 -124 77 57 114 165
6859 165 -241 64 -20 152 200 -104 -83 -404 171 5 -161 -64 -309 -124 -80 71 -36 108 33 142 -1 -13
6881 -13 217 -140 -80 23 112 46 -90 72 49 79 -258 92 119 87 119 26 46 -93 -99 -22 124 -17 -99 -70 -22 -273
6907 -273 63 194 -59 138 272 65 -237 -79 369 37 447 13 121 -258 -96 -82 -208 -121 -184 31 5
6928 5 -131 209 203 52 -59 131 53 35 200 133 20 -275 -20 -1 -192 -107 100 15 5 86 -223 331 -23 -41
6952 -41 75 224 -117 33 76 168 252 143 -74 83 18 2 29 -298 162 142 119 -171 -59 -31 -89 -37 -113 -58 45
6977 45 -153 -51 256 -56 142 140 75 -62 -340 81 81 -128 -13 234 24 30 2 87 -181 48 178 -57 277
7000 277 102 -116 128 219 102 173 -210 -78 -107 -212 167 -5 -134 42 -73 -359 17 -218 13 148 -267
$$ packed form
6834F9m0M9l24J65O8J1j29o2L56k39l5Q6Q1J37J41l56j3k5M8J64k76K01k0N7N1
6859A65m06L05q4J72M8l04K1l21N75j66j66R7k45J85M4J51j07J44p5J09j43j2
6881a3K30l57O0J03Q9o6j36J62k3L0l37L50K7l2L2r3K0j39oP7J46j41q2K9M8k51
6907b73L36J31k53J97J34k07l02J58M48l32M10m34J08l79J62J4j26Q7o3K15k6
6928Ej36L40oj51j11J90p8j8J65o7j13k95K55J9j91Q5K07q5j0Q1l09N54l54j8
6952d1J16J49l41J50M3R2Q4j09k17J57o5j6K7l27M60k0k3k90J12K8n8N2p6N5J03
6977D5j98J02L07l12J98ko5j37k78M21%k09J15K47k10Ok8Q5k68K29J30k35L34
7000B77j75k18K44R1j17P1l83J32k9j05L79j72j29J76j15k86L76k35K31J35m15
$$ plain form
7021 -267 34 67 -90 219 -120 -78 123 96 35 38 33 9 -86 -147 -92 178 31 73 -3 -301 191 -132 -55 -44 275
7046 275 81 -9 -78 110 -117 231 -45 -43 -265 155 79 48 38 -40 60 119 -222 132 210 -272 -214 61 -264 -177
7070 -177 -4 -463 160 -3 -343 187 111 83 173 -314 -150 -186 45 300 57 -280 -92 64 -61 -59 -6 36 -128
7093 -128 120 -187 75 276 38 -9 -72 -184 -50 109 40 -173 -189 -220 -196 -57 -52 114 102 37 -12 -232 -331 -97
7117 -97 151 126 -43 26 -157 180 122 32 -92 44 86 -225 -187 -149 -164 -162 -12 -72 96 -77 33 -34 171 177 227
7142 227 -111 -14 210 -31 -65 120 100 301 -243 -107 90 -158 -46 -108 -50 -181 -202 75 -232 37 75 -7 -9
7165 -9 326 -64 -128 -150 -67 195 -203 -142 -21 38 21 -10 -165 2 66 152 -112 42 -75 141 7 -42 116 137
7189 137 -34 6 113 -237 175 -40 56 62 -12 -107 102 27 68 -469 -216 -14 86 -20 146 -106 185 146 -82
$$ packed form
7021b67L01L3j57L09l39M2K01k7o1Lnk4r5o1N5K70j47M2p6k98M92l23P7J1L19
7046B75j94r0o9J88k27L48k76Kk22M20p6l1j0p8J00N9l41L54P8m82N8K75l25Q7
7070a77J73m59O23j63l40N30p6k8R0m87J64l6K31K55k43l37J88J56j25KN3M2j64
7093a28K48l07K62K01k38m7o3j12J34J59o9k13j6l1K4J39NJ66j2o5m9k20r9K34
7117i7K48k5j69O9j83L37n8r0j24J36M2l11L8L8j5KJ50o0J68j73J10o7K05ON0
7142B27l38R7K24k41l4J85k0K01n44J36J97k48J12o2N8j31k1K77l07K69L8q2k
7165iL35l90o4k2Q3K62l98O1J21N9j7l1j55J67O4Q6k64J54j17K16j34m9J58K1
7189A37j71M0J07l50M12k15R6Op4r5K09p5M1n37K53K02J00j06J66k52K91l9k28
$$ plain form
7212 -82 168 -122 115 49 212 106 -17 -84 80 -86 14 211 -151 -40 -173 175 219 -32 -16 -101 21 -153
7234 -153 -36 -110 -116 51 115 207 185 -15 -147 -39 -138 -41 112 -188 113 180 -246 105 219 59 -86 123 173
7257 173 -233 78 -79 -84 130 136 123 103 -153 155 95 165 -119 61 -210 104 76 41 -142 -60 -138 -162 -46 12 37
7282 37 -164 -25 -241 48 89 -163 -27 -23 88 158 -294 64 -25 2 -123 -228 156 15 -44 197 36 -151 -262
7305 -262 60 -176 -231 -247 -32 277 -37 4 28 233 4 -207 282 51 167 -203 97 65 18 -25 -146 -182 -24
7328 -24 7 -10 149 70 -150 -63 153 133 146 -24 46 -317 71 -28 121 -70 -132 79 -354 16 -157 156 0
7351 0 162 199 114 125 -74 165 54 -38 65 -97 -52 56 -158 -58 53 104 80 1 28 12 103 40 33 15 -25 53
7377 53 130 -281 -99 -136 25 64 -9 413 194 209 -55 -223 195 -110 -45 134 60 198 -269 141 27 -117 -64
$$ packed form
7212h2K50k90K37o6J63j06j23o7J64j66J00J97l62J11j33L48M4k51J6q5J22j74
7234a53J17p4oJ67O4R2k2k00j32J08r9R7J53l00L01O7m26L51J14j60j45K09N0
7257A73m06L11j57nK14Oj3k0k56L08o0P0k84J80k71L14k8l5j83Q2p8k4J16N8K5
7282C7k01J39k16K89M1k52J36MJ11P0m52L58q9K7j25j05L84j41n9K41j61j87j11
7305b62L22k36n5j6K15L09l14M1K4K05k29k11M89k31J16l70L00l2m7m3j21l6J58
7328b4L1j7J59p9k20Q7K16k0J3j70P0l63L88r9J49j91o2K11m33L70j73L13j56
7351@J62L7q5J1j99K39j11r2J03j62M5J08k14J00J11N1k4p9K7j6R1o3pj8m0P8
7377E3P7m11J82l7J61L9p3M22k19J5k64j68M18l05O5J79p4J38m67M10j14j44N3
$$ plain form
7400 -64 -147 113 -119 -172 71 108 43 -81 207 -39 58 37 -36 -217 -73 64 -214 22 58 80 119 -42 20 73
7424 73 77 39 203 -95 118 15 69 -80 -41 -43 -271 -192 92 -49 -28 169 147 -8 5 54 -114 41 -94 253
7448 253 -256 -86 90 -136 139 266 162 -31 -89 11 -57 19 71 -28 140 -10 35 93 -15 -23 -118 109 10 12
7472 12 -336 -352 132 227 -66 105 -256 -122 -77 -264 203 168 151 -5 130 41 332 -250 23 18 16 171 51 -105
7496 -105 93 100 -213 -193 102 39 -206 -32 -48 136 128 -136 -35 94 178 72 -229 26 -36 73 213 -15 119
7519 119 -74 -92 -44 86 112 92 -100 143 37 -13 112 -69 69 -38 268 112 -65 88 85 82 55 -4 77 -22
7543 -22 -118 -11 -104 116 131 90 3 -210 -266 169 80 -118 38 99 -65 -41 -110 74 177 83 -145 -91 -288 81
7567 81 114 -325 118 -156 -115 27 -64 -10 128 95 -189 -205 374 62 157 285 -13 -8 181 30 -175 -19 -153
$$ packed form
7400f4q3K60k32n3K43L7o5j24K88k46R7k1p3j81J44J37k78K36L6K2L9j61O2N3
7424G3Ml8J64k98K13j03N4j49L9kk28P9K84j41K1J97k2j55J3M9j68J55j35L47
7448B53n09J70J76k26K75J27j04j93n8J00o8P6N2r9J68j50M5N8j08qr5K27r9K
7472A2l48j6M84R5k93J71l61J34M5j87M67l5j7j56J35q9K91n82K73nkJ55j20j56
7496a05J98Pl13K0K95o3k45J74j6J84qk64J01J29Q4j06l01K55o2J09J40k28J34
7519A19j93j8M8J30K6k0j92K43j06n0J25j81J38j07L06j56j77J53llk7n9Q1r9
7543b2r6J07r3K20J5m1q7k13n6M35q9j98J56O1j64K4o9J84J03r4k28N4j97L69
7567H1L3m39M43k74M1J42r1N4J38l3k84j6N79l12R5J28k98NJ89j51k05J56j34
$$ plain form
7590 -153 124 -32 145 -167 60 -157 -151 86 13 20 16 -62 -224 51 -181 -50 -7 -94 251 -233 -79 73 -243
7613 -243 -26 84 -87 321 -24 138 103 97 130 -41 -37 286 94 -83 113 91 -30 -75 63 -148 7 -1 278
7636 278 8 -1 18 139 66 35 190 -17 -93 219 115 -112 70 286 -134 -78 154 92 121 -126 158 93 -210
7659 -210 -222 79 -25 11 -50 121 418 237 -86 -117 108 -214 -115 92 -152 127 -52 -148 220 -24 -125 -183
7681 -183 -60 -36 405 -43 86 -87 110 17 43 6 -75 67 -20 -213 -85 119 20 285 -51 60 -103 180
7703 180 279 47 -72 52 62 107 -35 -20 52 28 -167 165 0 0 -38 134 280 4 -100 -100 149 -4 -219 -43
7727 -43 61 -185 -109 -245 -110 -97 -179 19 133 -18 -42 242 -223 -308 -57 50 94 -260 332 -44 -185 -57
7749 -57 134 145 54 111 -77 125 -204 -75 45 121 -284 -24 -22 -137 -139 10 -167 -81 263 173 -136 58 48 -28
$$ packed form
7590a53K77j56J77l12K27k17OK37p3Pmp8j62K75k32J31M3q7L45m84J54J52l16
7613b43K17J10j71M08l45J62l5oL3j71ML23j92j77J96k2j21m5J38k11J55qK79
7636B78k70rJ9J21p3l1J55k07p6L12j04k27J82K16m20N6K32o2K9k47K84o5l03
7659b10j2L01j04L6o1J71K97j81l23l1K25l22R9K07k44K79j79r6L68k44j01n8
7681a83J23K4M41m48J29j73J97r3K6l7q1J42q7j93J28K04r9K65l36J11j63K83
7703A80R9k32j19J24J0M5j42J5P2k4j95L32j65%l8J72J46k76j04%K49j53k15J76
7727d3J04k46P6j36J35J3q2J98J14j51k4K84m65q5K51J07M4l54N92l76j41J28
7749e7J91J1r1N7j88K02l29J29J20P6m05K60Kj15kJ49j77Q6L44r0l09J94j0p6
$$ plain form
7773 -28 111 -208 -142 -244 -74 -51 19 22 -36 180 -12 92 -244 223 -54 -224 -123 -22 -50 -167 84 153 -248
7796 -248 -27 0 46 7 49 299 163 -36 -25 133 45 203 201 -57 15 132 -223 -380 65 -69 80 176 -83
7819 -83 -204 140 -111 -16 186 26 -15 60 201 422 -66 -21 -73 -27 -73 278 -211 341 133 -149 5 136 111
7842 111 206 251 49 218 -3 289 -96 -296 -123 -39 -8 80 134 -78 -166 -49 118 -353 144 -56 -100 -34 -152
7865 -152 114 27 -92 240 24 -125 55 9 24 16 -33 204 21 48 -100 100 257 6 30 -247 126 28 -195
7888 -195 3 11 10 -46 -32 169 239 -44 -6 107 13 -40 207 -89 -137 141 -25 -86 246 -59 186 -138 -187 96
7912 96 21 -239 -145 101 96 -221 -32 87 39 -88 108 -50 62 51 -227 -59 -53 6 -8 82 -112 -147 -302 -121
7936 -121 -6 -101 2 -224 -100 87 -79 348 -169 89 -44 -66 30 -151 -82 228 -1 -31 95 -101 15 -203
$$ packed form
7773b8J39l19O6j02J70K3P0Ln8K16j92J04l36M67k77j70J01J01k8j17K51O9m01
7796b48K21K7M6l9M2K50j36j99J1J58q8J58kk58P2J17l55j57M45j34J49R6k59
7819h3j21L44k51R5K02j60m1P5J41K21m88M5n2M6m6L51m89N52k08k82J54J31k5
7842A11R5M5k02J69k21K92l85k00J73Q4L1Q8N4k12q8J17J67m71M97k00m4O6j18
7865a52K66q7j19L32k16j49J80m6J5qm9K37j83K7j48K00J57k51K4k77L73r8k23
7888a95J98Qjn6J4K01P0k83L8J13r4n3K47k96m8K78j66o1L32l05K45l24m9K83
7912I6p5k60R4K46nl17J89J19m8j27J96j58J12j1k78J68ON9j4R0j94l5j55J81
7936a21J15r5J03k26J24J87j66M27n17K58j33k2R6j81O9L10k29l0J26j96J16k18
$$ plain form
7958 -203 -128 -382 357 230 108 25 48 -74 38 62 -7 86 243 157 -46 32 -188 14 -81 -249 144 -321 -267
7981 -267 -124 -153 -222 -485 126 131 68 168 -114 -157 74 16 -45 -67 174 -11 -15 -11 -45 -26 -122 -40 -124 164 53 -159
8007 -159 -67 -6 -230 81 22 -68 31 148 -179 -286 -276 -8 -108 136 71 48 114 -65 80 -106 -96 350 271 18
8031 18 28 127 -125 -96 -15 -24 116 -171 85 -128 -85 -176 317 11 130 -134 146 188 -45 -117 -221 -57 -31 -76
8055 -76 -215 -219 43 -209 -21 -289 73 13 234 216 57 118 51 -342 12 43 9 45 -222 -266 77 -131 162 26
8079 26 -94 17 160 -123 -108 50 98 84 23 11 -44 62 -106 242 -131 5 130 68 -59 185 -82 227 163
8102 163 175 -272 -171 -19 84 0 232 10 82 190 106 -200 -42 183 -151 -27 67 35 68 56 14 150 114
8125 114 138 101 -50 -41 42 2 18 88 -28 139 -152 156 -13 -18 70 73 -138 -281 172 277 -13 -225 22 32 -123
$$ packed form
7958b03P5k54P39j27j22q3K3j22J12K4o9R3J57q6k03P8k20K02r5j68L93m65N4
7981b67J43k9o9k63O11No3J00k82m3K31n8o1k2K41j85mMl4J9r6Q2q4K88j11k12
8007a59R2O1k24L11n9r0R9J17l27j07J0K68j00K44o5k3O6j79J45j86J0M46p9k53
8031A8J0R9k52K9Q1rJ40k87K56k13M3r1M93l06J19k64K80M2k33p2j04J64K6m5
8055g6j39mK62k52J88k68L62o0K21j8j59O1o7l93L54L1l4L6k67m4L43k08K93j36
8079B6j20J11J43k83J5J58M8j4o1j2n5J06j68L48l73J36J25o2j27K44k67L09o4
8102A63J2m47J01J52J03q4K32k22P2J08q4l06J58K25l34J24R4l2L3j2m2J36l6
8125A14K4l7j51RQ3m0J6P0j16J67k91L08j69nQ8Lk11j43M53J05k90k12K47J0j55
$$ plain form
8150 -123 67 -38 -302 76 -308 68 195 -105 120 162 17 -206 -43 -73 -58 -166 28 161 -77 -133 16
8171 16 109 119 20 -45 74 -31 -125 3 287 -176 -243 32 99 -102 93 -138 -197 13 13 235
$$ packed form
8150a23J90j05k64L78l84L76J27l00K25M2j45k23J63l0J5j08J94J33k38n6J49
8171A6R3J0r9o5J19j05r4J28K84m63o7K75O7k01J95k31n9K10%K22
8191B35
$$ Imaginary data points
##PAGE= N=2
##DATA TABLE= (X++(I..I)), XYDATA
$$ plain form
0 0 0 0 0 0 0 0 0 0 0 0 0 0 8 -8 8 -8 8 -16 16 -17 24 -32 32 -40 48 -56 64 -72 88 -96 112 -128 144 -162
34 -162 184 -208 234 -264 294 -328 364 -405 450 -498 552 -608 672 -742 816 -898 991 -1090
52 -1090 1202 -1327 1466 -1624 1801 -2006 2243 -2522 2854 -3265 3777 -4444 5351 -6659 8723
67 8723 -12489 21621 -95893 -50570 55144 -90970 -27449 48975 -25127 -53131 61215 57678
79 57678 18893 62114 55899 -32593 -4842 42458 -2775 -9673 40955 -10502 -62022 -22533 -389
92 -389 -26207 -15815 -6220 -19331 -13321 9917 11737 14802 31378 32944 18613 16256 13796 10699
106 10699 6545 -16753 -30850 -14972 -19598 -30271 -6382 -26 -23997 -11869 19456 15658 9219
119 9219 23220 17328 -4255 2430 13023 379 2752 13464 -8906 -23340 -4884 -2005 -9574
$$ packed form
0@%%%%%%%%%%%%Qj6J6j6J6k4L2l3M1n6O4p2Q8j04J20j36J60j84K08k40K72l06
34a62L46l92M42m98N58o22O92p69Q55r48J050j160J280j414J558j714J889k081
52a090K292k529K793l090L425l807M249m765N376o119P042q221R795j2010J5382
67H723k1212L4110j17514M5323J05714j46114O3521P6424p4102k8004J14346l537
79E7678l8785M3221o215q8492K7751M7300m5233o898N0628n1457n1520L9489K2144
92c89k5818J0392R595j3111O010K3238J820L065J6576J566j4331k357k460l097
106A0699m154k3298j4097J5878m626j0673K3889O356k3971J2128L1325l798o439
119I219J4001n892k1583O685J0593j2644K373J0712k2370j4434J8456K879p569
$$ plain form
132 -9574 2101 2728 -16405 -16523 -107 3915 2152 12537 14526 530 270 12144 9275 4921
146 4921 7961 -66 -13859 -14461 -7027 -4816 -7004 -4236 -1953 -6878 -2428 9457 9748 6579 9217
161 9217 4626 -2611 194 5501 1251 -3698 -1951 -4352 -9593 -2904 4445 -1153 -3316 342 -3442
176 -3442 -3923 4455 5589 1681 2361 2743 -780 495 5982 4996 -1503 -2619 -3285 -6653 -4034 -126
192 -126 -2109 -2513 -1845 -2666 79 4467 5876 5217 3251 1353 -30 -69 1188 663 -1753 -3255 -5078
209 -5078 -4499 -961 -62 137 1271 -314 -1445 1148 2327 3011 2916 1682 -525 -514 978 1353 413 313
227 313 -1204 -3787 -2989 -547 -1328 -927 -343 -1089 -1174 923 2603 2730 3085 2346 716 54 1068 957
245 957 -689 -1032 -1723 -3350 -2860 -1002 -460 113 -224 -506 27 956 1740 1968 1437 895 275 -613 392
$$ packed form
132i574J1675O27j9133j18J6416M022j763J0385J989j3996k60J1874k869m354
146D921L040q027j3793o02P434K211k188K768K283m925M450J1885K91l169K638
161I217m591p237K805N307m250m949J747k401n241O689P349n598k163L658l784
176c442m81Q378J134l908O80L82l523J275N487r86o499j116o66l368K619L908
192a26j983m04O68q21K745M388J409o59j966j898j383l9J257n25k416j502j823
209e078N79L538Q99J99J134j585j131K593J179O84r5j234k207J1J492L75r40j00
227C13j517k583P98K442p81M01N84p46q5K097J680J27L55p39j630o62J014j11
245I57j646l43o91j627M90J858N42N73l37k82N33R29P84K28n31n42o20q88J005
$$ plain form
264 392 939 183 -474 -914 -1759 -1297 -933 -529 -337 -974 -952 -351 257 1057 1858 897 1055 842 124 738 599
285 599 292 -379 -1575 -1406 -1262 -1094 -342 -495 -277 -316 -217 334 880 944 644 644 176 102 561 165 143 -84
307 -84 -422 -534 -583 -418 -136 -261 -608 -473 -376 -368 361 844 508 408 296 612 433 676 180 -130 -320 -629
329 -629 -492 -237 -127 -178 -504 -222 -379 188 232 343 536 -62 255 401 230 325 363 -68 -30 -158 -487 76
351 76 -224 -231 -33 -198 47 467 166 100 218 160 -230 126 264 264 55 -79 -348 -183 50 87 -110 -141 -312
374 -312 -85 -128 193 -64 -60 -85 35 -92 31 -151 114 -235 -367 -60 -85 -326 223 -36 -93 -28 69 -54 -91
397 -91 85 -95 136 78 137 143 64 56 77 -77 24 -133 390 -196 77 162 22 -484 119 187 124 257 190 -25 -18
422 -18 169 210 125 -7 -11 -139 -187 -179 -64 46 -16 99 -184 2 -106 -55 94 22 31 64 -164 -1 -218 -352 -58
$$ packed form
264C92N47p56o57m40q45M62L64M04J92o37K2O01O08Q00Q01r61J58k13p18O14j39
285E99l07o71j196J69J44J68P52j53K18l9R9N51N46O4l00%m68p4M59l96k2k27
307h4l38j12m9J65K82j25l47J35R7QP29M83l36j00j12L16j79K43m96l10j90l09
329f29J37K55J10n1l26K82j57N67M4J11J93n98L17J46j71R5L8m31L8j28l29N63
351G6l00pJ98j65K45M20l01o6J18n8l90L56J38%k09j34k69J65K33L7j97l1j71
374c12K27m3L21k57Mk5J20j27J23j82K65l49j32L07k5k41N49k59n7O5R7j23l7
397i1J76j80K31n8N9Op9qK1j54J01j57N23n86K73Q5j40n06O03O8o3J33o7k15P
422a8J87M1q5j32mj28m8QJ15J10o2J15k83J86j08N1J49p2RL3k28J63k17j34K94
$$ plain form
447 -58 -190 -157 77 -149 -27 68 -120 -198 -111 322 225 167 59 -20 -109 16 -45 -257 196 -258 -185 -129 80 47 27
472 27 41 51 -88 -178 240 246 193 64 46 188 -178 -140 -14 72 -213 -96 -231 455 -5 181 66 43 -19 124
496 124 77 149 308 283 -48 -162 162 -263 -79 272 -324 -229 -153 -19 -17 -27 22 -4 24 -274 167 1 45 150
520 150 163 -330 76 199 -480 -112 -145 246 -44 -32 67 114 89 -194 -216 245 13 177 249 65 164 189 -42 -276
544 -276 127 -200 -454 105 53 -254 20 -12 -245 -276 147 64 61 203 252 -126 -15 -227 -3 -2 -135 -34 -295
567 -295 -198 52 163 -197 140 -16 -128 -65 -22 60 -185 272 45 -41 50 192 6 82 -67 7 -291 190 -226
590 -226 126 -82 88 -136 -162 145 151 -29 -71 -414 -231 -53 179 -34 -112 50 -89 -37 83 -35 -251 -83
612 -83 123 -56 -8 112 81 191 62 23 11 118 287 18 -159 291 66 -156 171 -151 59 344 60 190
$$ packed form
447e8j32L3K34k26J22R5j88p8Q7M33r7n8j08p9q9J25o1k12M53m54P3N6K09l3k0
472B7J4J0j39r0M18On3j29j8J42l66L8J26Q6k85J17j35O86m60J86j15k3o2J43
496A24m7P2J59k5l31j14L24m25J84L51n96R5P6J34Kj0M9k6K8k98M41j66M4J05
520A50J3m93M06J23o79L68l3L91k90J2R9M7k5k83k2M61k32J64P2j84R9K5k31k34
544b76M03l27k54N59n2l07K74l2k33l1M23q3lJ42M9l78J11k12K24Jj33J01k61
567b95R7K50J11l60L37j56j12O3M3Q2k45M57k27q6R1J42j86P6j49P4k98M81m16
590b26L52k08J70k24k6L07Oj80m2l43J83J78K32k13p8J62j39N2J20j18k16J68
612h3K06j79M8J20l1J10j29l9j2J07J69k69j77M50k25k22L27l22K10K85k84J30
$$ plain form
634 190 73 55 -47 -170 101 64 232 133 -81 -16 -13 120 68 107 -15 30 -9 241 -163 -23 321 -144 -269 -24
658 -24 -101 -93 57 33 -156 64 209 203 64 345 236 138 233 -185 -78 -41 149 31 215 -33 11 -57 217 -96
682 -96 -157 235 217 5 -269 174 83 -23 -194 5 226 -19 240 -13 -159 0 84 -293 50 -29 109 159 73
705 73 -89 223 -86 -67 186 165 104 3 185 36 -183 -182 16 -204 277 -103 -8 -80 231 -3 48 30 87 21
729 21 -244 71 60 -216 12 142 239 190 41 77 178 291 -11 68 -15 -226 -302 205 -22 -43 -19 42 233 -81
753 -81 -22 -72 86 4 -132 15 -24 133 87 7 -138 171 42 -75 142 82 269 12 98 -239 -27 -114 292 -22
777 -22 280 -150 -97 44 -26 -35 39 -68 212 49 28 171 -28 110 -272 -54 -157 54 -123 -58 -218 -68 -219
800 -219 140 -39 226 169 24 20 189 121 -274 228 -87 -207 163 321 -140 -166 270 26 39 6 -60 65 20
$$ packed form
634A90j17j8j02j23K71l7J68r9k14O5LJ33n2L9j22M5l9K50m04J40L44m65j25K45
658b4p7QJ50k4j89K20J45oj39K81j09r8R5m18J07L7J90j18J84k48M4o8K74l13
682i6o1L92j8k12k74M43r1j06j71J99K21k45K59k53j46J59Q4l77L43p9J38N0q6
705G3j62L12l09J9K53k1o1j01J82j49k19JJ98k20M81l80R5p2L11k34N1j8N7o6
729B1k65L15j1k76K28J30R7m9j49L6J01J13l02P9q3k11p6N07k27k1K4O1J91l14
753h1N9n0J58q2j36J47l9J57m6q0j45L09j29j17K17o0J87k57Q6l37K12q7M06l14
777b2L02m30N3J41p0rP4j07K80j63k1J43j99J38l82K18j03K11j77O5j60J50j51
800b19L59j79K65n7j45mJ69o8l95N02l15j20L70J58m61k6M36k44J3l3o6J25m5
$$ plain form
823 20 233 -209 -121 33 67 2 55 180 12 -51 -161 -50 -126 128 -76 366 26 139 -115 166 -16 -99 127
846 127 232 -286 112 157 -111 112 -78 334 -97 47 92 -126 204 16 54 69 163 -98 -314 -176 22 159
868 159 34 56 -19 -73 95 93 -200 -13 185 51 -103 3 137 88 -151 -83 -112 -138 -134 66 288 -69 378 102
892 102 -136 -10 -89 106 226 31 -102 -5 61 272 -41 229 -148 225 29 191 -11 80 3 69 -41 -248
914 -248 181 -14 -119 -83 -35 -118 4 95 -175 70 -13 89 -198 -83 54 -41 -82 133 -29 44 12 101 -247 -103
938 -103 79 98 183 30 115 -266 -31 -166 11 5 -184 65 -16 -316 -15 9 161 128 243 -167 -212 50 252
961 252 63 -276 147 127 -101 -145 55 -13 -12 -129 -236 226 50 -32 -80 -21 -8 -95 -108 -5 46 -18 100 91 -134
986 -134 125 -168 17 121 4 76 -161 -122 119 96 60 40 -88 15 -80 -78 204 1 -23 -103 -100 22 -153 -59 32
$$ packed form
823B0K13m42Q8J54L4o5N3J25j68o3j10J11p6K54k04M42l40J13k54K81j82q3K26
846A27J05n18L98M5k68K23j90M12m31J44M5k18L30j88L8J5R4k61k16J38J98J37
868A59j25K2p5n4J68kk93J87J98j34j54J06J34m9k39O8k9k6MK00K22l57M47k76
892A02k38J26p9J95J20j95j33R7O6K11l13K70l77L73j96J62k02R1p7O6j10k07
914b48M29j95j05L6M8q3J22R1k70K45q3J02k87J15J37r5m1K15j62P3l2Q9l48J44
938a03J82J9Q5j53Q5l81K35j35J77oj89K49q1l00L01K4J52l3J15m10m5K62K02
961B52j89l39M23k0k28m4K00o8Jj17j07M62j76q2m8N9J3q7j3J03N1o4J18rk25
986a34K59k93J85J04j17P2k37L9K41k3l6k0j28J03r5KK82k03k4q0LJ22j75R4R1
$$ plain form
1011 32 395 -14 17 -8 -296 -30 -25 -105 -89 -75 131 229 -111 179 111 -91 -65 -93 73 -218 168 99 -134 -120 -155
1036 -155 121 10 30 9 88 -123 -83 3 153 -252 121 162 140 -10 -19 -81 -297 -92 70 -210 -80 -204 -153 0
1060 0 141 -5 85 -74 -230 141 150 -365 24 -228 72 161 51 120 -74 14 14 162 -106 -147 -35 -119 -89 -118 -44
1085 -44 -19 105 76 141 30 -6 130 83 -16 -126 -316 101 63 -12 -36 62 77 -24 205 -169 -25 175 18 147
1109 147 60 176 -116 49 -138 167 -61 -103 116 105 -189 172 -198 -5 -35 70 10 214 -120 -52 220 -97
1131 -97 -24 24 157 -225 7 178 -214 -165 -82 -113 64 129 17 -88 147 66 -7 -111 122 -308 53 44 -54 -104
1155 -104 -117 -95 97 -32 -204 -92 134 32 225 -74 -17 -173 -120 32 139 -87 -99 14 -48 83 -266 60
1177 60 15 141 -4 -195 -79 66 -162 -29 39 -26 -53 -173 -71 25 140 23 -183 108 61 127 216 241 -32
$$ packed form
1011C2L63m09L1k5k88K66Nq0J6J4K06R8l40K90o8k02K6k8J66k91L86o9k33J4l5
1036a55K76j11K0k1P9k11M0Q6J50m05L73M1k2j50ro2k16K05J62k80J30j24N1J53
1060@J41j46R0j59j56L71Rn15L89k52L00Q9j10O9j94Q8%J48k68m1J12q4L0k9P4
1085d4K5J24k9O5j11l6J36m7r9j10j90M17l8p5k4R8J5j01K29l74J44K00j57J29
1109A47q7J16k92J65j87L05k28m2K19j1k94L61l70J93l0J05o0K04l34O8K72l17
1131i7P3M8J33l82K32J71l92M9Q3l1J77O5j12j05K35q1p3j04K33m30L61rr8n0
1155a04j3K2J92j29j72J12K26j02J93k99N7j56N3J52J07k26j2J13o2J31l49L26
1177F0m5J26j45j91J16J45k28J33O8o5k7j20J02R6J15j17k06K91m7O6Q9K5k73
$$ plain form
1200 -32 194 -35 72 247 40 -62 -64 -27 -93 4 37 173 -30 127 -46 -95 299 180 -93 43 43 -74 -104 -118
1224 -118 37 196 -19 10 82 -168 -69 68 148 75 225 -47 135 -22 47 54 -73 92 -70 139 -33 -142 -63
1247 -63 -110 -257 5 136 -88 37 72 -47 -217 144 -11 284 48 -25 -64 -191 108 66 289 -27 -228 197
1269 197 59 -97 123 -195 -263 -24 41 120 137 -139 -184 132 -138 -333 9 -228 18 -121 46 -68 -78 160
1291 160 -65 -96 27 61 210 177 43 -82 12 -124 -176 -107 -47 285 -46 -56 85 253 115 101 -128 -117 128
1314 128 -104 46 10 232 170 -29 273 3 -70 -36 -60 105 -90 -159 -103 -139 155 -188 59 126 60 168 7
1337 7 145 231 107 -104 83 90 -63 83 16 -46 0 0 -97 377 23 -107 24 91 41 -14 -171 -135 -325 282 -9
1362 -9 -329 320 -45 -58 -125 -360 -138 -194 24 -14 -261 61 102 89 34 -141 47 -24 -257 172 16 203 255 156
$$ packed form
1200c2K26k29J07J75k07j02kL7o6R7L3J36k03J57j73m9L94j19k73J36%j17l0j4
1224a18J55J59k15K9P2k50R9J37Q0p3J50k72J82j57O9Pj27J65j62K09j72j09P9
1247f3m7j47K62J31k24J25L5j19j70L61j55K95k36p3l9j27K99m2K23l16k01M25
1269A97j38j56K20l18o8K39O5P9J7k76m5L16k70j95L42k37K46j39J67j14j0K38
1291A60k25l1J23L4J49l3j34j25R4j36n2O9O0L32l31j0J41J68j38j4k29J1K45
1314A28k32J50l6K22o2j99L02k70p3L4k4J65j95o9N6l6K94l43K47O7o6J08j61
1337GJ38Q6j24k11J87Pj53J46o7o2M6%r7M74l54j30J31O7n0n5j57L6j90O07k91
1362il20O49l65j3o7k35K22n6K18l8k47L22M1j3n5j75J88p1k33M29j56J87N2r9
$$ plain form
1386 156 63 101 -183 152 78 -310 146 18 -346 -45 42 2 -43 76 -270 170 194 -168 138 57 71 -110 -164
1409 -164 1 -82 73 -57 133 -66 -50 -23 26 -13 -82 -92 -262 -97 -90 370 -234 88 -13 137 72 124 264 150
1433 150 -244 126 -95 82 50 -112 -14 -187 211 -17 44 132 1 17 -54 148 45 -37 -121 -4 -251 -154 82
1456 82 -9 -105 -87 28 -275 4 -13 264 72 -243 -102 -191 -67 -277 181 123 45 256 -37 -90 66 -270 74
1479 74 -29 -204 -145 0 37 19 77 -47 340 63 -172 112 -209 133 65 115 -6 -141 34 -12 -175 161 -171
1502 -171 -4 -205 72 -69 -38 29 -16 128 -169 -34 -166 33 118 72 -23 -9 -16 -10 13 -65 -12 -22 -3 179 46
1527 46 125 -63 279 -185 -56 131 -10 63 -5 -75 -158 -271 -71 -210 76 -18 -57 -63 39 141 225 148 269 -112
1551 -112 52 234 152 -6 -69 141 30 -248 -45 23 117 55 -215 37 -84 20 87 244 -44 -67 -275 100
$$ packed form
1386A56r3L8k84L35p4l88M56j28l64L01Q7m0m5J19l46M40K4l62L06q1J4j81n4
1409a64J65q3J55j30J90j99J6K7M9l9o9j0j70J65PM60o04L22j01J50o5N2J40j14
1433A50l94L70k21J77l2j62R8j73L98k28O1Q8j31J6p1K02j03q2q4J17k47R7K36
1456H2r1r6J8J15l03K79j7K77j92l15J41q9J24k10M58n8p8K11k93n3J56l36L44
1479G4j03j75N9J45L7j8N8j24L87k77k35K84l21L42o8N0j21j35J75m6j63L36l32
1502a71J67k01K77j41L1O7m5J44k97J35j32J99Q5m6r5J4pOK3p8N3j0J9J82j33
1527D6P9j88L42m64J29J87j41P3o8p0q3j13K00j39K86r4l9oJ02J02Q4p7J21l81
1551a12J64J82q2j58o3K10j11k78K03O8R4o2k70K52j21J04O7J57k88k3k08L75
$$ plain form
1573 100 -62 -143 -106 100 -50 189 0 198 176 133 -74 184 -79 -26 -176 122 -72 8 273 156 180 92 14
1596 14 57 211 -103 56 144 -71 107 31 251 21 11 -36 -166 38 -190 66 -114 -186 -45 -178 -153 -59 318
1619 318 -19 -205 -8 -13 -152 -49 -240 3 -146 -195 -130 -35 -44 8 8 -10 70 -66 18 168 213 69 96 55 -11 80
1645 80 -1 54 243 137 -146 34 289 46 -54 -106 -36 -99 -91 -9 -25 -311 -91 88 -85 -180 38 -228 13 146
1669 146 -4 167 -123 59 66 -98 292 58 152 46 -174 88 232 -58 -107 176 19 145 56 -111 -9 -110
1691 -110 8 13 -176 229 72 32 88 -282 7 464 -50 26 -156 148 -163 217 190 -62 263 16 85 -181
1713 -181 60 206 -44 9 -92 -154 81 72 111 2 -77 31 -117 17 -17 5 -142 4 206 67 51 1 -61 -113
1737 -113 30 114 -193 44 -22 -143 234 39 -289 132 102 64 47 57 -324 -49 215 -284 26 238 -108 -50
$$ packed form
1573A00j62q1L7K06j50K39j89J98k2m3k07K58k63N3j50K98j94Q0K65j17K4q8p8
1596A4M3J54l14J59Q8k15J78p6K20k30j0m7j30K04k28K56j80p2J41j33K5R4L77
1619C18l37j86J97nj39J03j91K43j49m9O5R5rN2%j8Q0j36Q4J50M5j44K7m1o6R1
1645H0q1N5J89j06k83J80K55k43j00n2P0o3QQ2j6k86K20J79j73r5K18k66K41J33
1669A46j50J71k90J82Pj64L90k34R4j06k20K62J44k90m9K83j57J26q9j67J02j01
1691a10J18Nj89M05j57m0N6l70K89M57n14P6j82L04l11L80k7k52L25k47O9k66
1713a81K41J46k50N3j01o2K35rL9j09p9J08j48J34l4K2j47J46K02j39j6n0o2n2
1737a13J43Q4l07K37o6j21L77j95l28M21l0l8j7J0l81K75K64m99L10K12l46N8
$$ plain form
1759 -50 25 -239 -168 52 118 -236 -102 168 170 -21 -87 144 126 36 35 237 176 33 27 98 32 107 -77 67 232 206
1785 206 -231 -135 36 92 -92 44 191 -119 -187 38 161 52 -188 -42 -23 26 -125 -67 -46 -5 75 -92 -40
1808 -40 29 26 -118 -215 206 44 199 231 0 186 15 148 32 168 -101 -205 -158 219 20 -261 -47 157
1830 157 -68 8 -87 132 -70 -167 -99 -122 80 18 -296 -74 -73 77 -142 -24 65 -58 -170 272 -67 120 44
1853 44 -32 113 -450 77 71 -77 39 -227 -88 35 67 112 83 -160 2 -131 32 -69 39 -60 -44 39 -116
1876 -116 -156 90 13 -86 -76 -264 -51 29 -166 202 -48 -48 278 82 -115 158 -76 -119 363 214 230 -8 -69
1899 -69 76 195 33 4 23 30 -53 -33 124 -7 175 11 132 -49 -139 -162 225 -73 19 51 -334 -40 351 -37
1923 -37 186 -169 -93 49 -96 -15 -47 -17 123 173 14 133 -19 -113 -45 -72 6 -3 -36 1 130 461 78 41 -153
$$ packed form
1759e0P5k64P1K20O6l54J34K70Kj91o6K31j8r0jK02o1j43oP1o6P5j84J44J65k6
1785B06m37R6J71N6j84J36J47l10o8K25J23j09k40J46J9M9j51N8K1M1Q0j67N2
1808d0O9lj44r7M21j62J55L2k31J86j71J33j16J36k69j04M7L77j99k81K14K04
1830A57k25P6r5K19k02r7O8k3K02o2l14K22JJ50k19J18Q9j23j12M42l39J87p6
1853D4p6J45n63N27oj48J16k66J39J23L2M5k9k43J62j33J63j01J08r9J6Q3j55
1876a16m0K46p7r9J0j88K13Q0j95L68k50%L26j96j97K73k34m3M82j49J6k38o1
1899f9J45J19j62k9J9Pq3K0J57j31J82j64J21j81r0k3L87k98R2L2l85K94L91l88
1923c7K23l55P6J42j45Q1l2L0J40N0j59J19j52r4O8k7P8rl3L7J29L31l83l7j94
$$ plain form
1948 -153 -100 21 93 129 -37 5 -19 10 315 -55 265 14 90 -155 233 116 66 67 221 -365 395 263 -183
1971 -183 36 -102 -219 -182 -42 -201 -121 41 -26 29 151 110 -114 17 55 169 136 193 -23 101 -12 -136 -396
1994 -396 22 154 -148 -146 -75 102 181 -84 27 -106 -19 82 -98 -220 29 195 36 177 29 178 119 -292
2016 -292 -75 -7 -73 -159 -38 31 -187 207 100 -106 -129 50 -1 13 -251 -226 -91 33 -33 97 -50 362 -74
2039 -74 -46 -79 30 30 78 144 -89 -94 -11 -193 -27 301 156 62 -134 -189 391 -57 -140 139 99 30 -67 83 -267
2064 -267 206 61 133 -232 25 47 179 230 -156 224 -218 296 61 79 -8 28 129 154 -76 -79 -88 28 232 -13
2088 -13 -37 -146 289 -66 94 84 -136 102 94 -73 31 174 98 7 -92 35 -16 76 40 38 32 45 34 -206 81 70
2114 70 -148 -65 -276 -28 -50 -77 -112 -204 106 -43 -91 -2 67 175 -166 1 137 31 5 4 201 12 -96 0
$$ packed form
1948a53N3J21P2L6j66M2k4K9L05l70L20k51P6k45L88j17n0JJ54n86P60j32m46
1971a83K19j38j17L7J40j59Q0J62o7N5J22m1k24J31L8J14l3N7k16J24j13j24k60
1994c96M18J32l02KP1J77P9k65J11j33Q7J01j80j22K49J66j59J41j48J49n9m11
2016b92K17O8o6q6J21O9k18L94j07k06k3J79n1J4k64K5J35J24o6J30j47M12m36
2039g4K8l3J09%M8O6k33nQ3j82J66L28j45r4j96n5N80m48q3K79m0o9r7J50l50
2064b67M73j45P2l65K57K2J32N1l86L80m42N14k35J8q7L6J01K5k30lrJ16K04k45
2088a3k4j09M35l55J60j0k20K38qj67J04J43p6r1r9J27n1R2l6koJ3j1k40K87j1
2114G0k18Q3k11K48k2k7l5r2L10j49m8Q9O9J08l41J67J36j06k6jJ97j89j08R6
$$ plain form
2138 0 -16 -231 -82 -140 115 115 9 -126 -29 26 124 13 -151 103 187 285 -9 112 4 264 -224 -18 70 -49
2162 -49 -36 419 -4 -78 -115 29 56 -15 -15 158 49 -190 -71 -307 -155 103 152 152 29 245 -67 -25 -67 25 -37
2187 -37 309 145 77 29 49 -117 376 -300 -217 81 45 30 93 -216 -27 16 -287 154 130 -46 82 73 6 85 211
2212 211 103 -160 16 -139 -239 25 -146 -68 -356 213 -85 -75 234 65 -200 -108 153 -235 185 -35 -23
2233 -23 70 147 -159 -75 -30 -228 -115 -96 -45 -48 23 157 -67 -127 108 -122 -146 49 17 139 -83 -196 17 188
2257 188 -12 153 79 38 -41 -41 -141 101 196 65 -24 -226 161 25 53 -97 64 75 -28 135 38 -78 147
2280 147 73 12 -191 -104 92 89 24 -103 -14 -16 35 34 23 -10 -44 120 219 122 -28 279 152 87 156 106 -17 -195 -35
2307 -35 -268 -160 -89 -266 73 279 156 -124 -63 147 82 -138 -3 177 65 130 -1 -187 -223 324 -225 76
$$ packed form
2138@j6k15J49n8K55%j06j35R7N5R8j11j64K54Q4R8k94J21j08K60m88K06Q8j19
2162d9J3M55m23p4l7J44K7p1%J73j09k39J19k36J52K58M9%j23K16l12M2m2R2o2
2187c7L46j64o8m8K0j66M93o76Q3K98l6j5O3l09J89M3l03M41k4j76J28ro7P9J26
2212B11j08k63J76j55j00K64j71P8k88N69k98J0L09j69k65R2K61l88M20k20J2
2233b3R3P7l06Q4M5j98J13J9N1lP1J34k24o0K35k30k4J95l2J22k22j13K13J71
2257A88k00J65p4m1p9%j00K42R5j31q9k02L87j36K8j50J61J1j03J63r7j16K25
2280A47p4o1k03Q7J96lo5j27Q9kN1jj1l3l4J64R9r7j50L07j27o5O9n0j23j78J60
2307c5k33J08P1j77L39K06j23k80O1K10o5k20J35J80j12O5j31j86l6N47n49L01
$$ plain form
2329 76 38 -114 75 51 -88 -192 98 -186 -32 124 217 242 97 -107 217 114 306 -80 5 -190 -115 37
2351 37 127 328 -7 33 255 -23 -292 -70 -275 115 -4 177 -46 -224 -95 -326 -176 194 92 -148 -262
2372 -262 8 149 4 75 208 -128 -218 80 272 267 63 -47 207 132 97 -28 -223 -57 47 -14 -86 -61 17
2395 17 -30 159 11 -166 119 -34 30 -77 -175 -147 84 -46 215 22 -154 -28 -77 116 252 25 -88 157
2417 157 -42 111 43 -193 -41 -326 -179 27 53 19 -185 28 -65 -102 69 -33 6 88 -206 207 14 -42 0
2440 0 -70 -121 -40 -166 87 99 92 55 -368 -254 -47 100 124 62 -15 78 -96 -40 -291 213 96 58 -60 -22 61 93
2466 93 -23 -25 -143 -157 206 -41 166 207 -41 -81 -107 30 -202 -38 379 46 -149 -116 -50 -188 19 -34 -8 -42
2490 -42 -10 105 220 -5 -19 -8 51 196 62 42 -32 -167 229 151 330 -156 6 218 85 -308 11 9 -90 -39
$$ packed form
2329G6l8j52J89k4j39j04K90k84J54J56R3K5j45k04L24j03J92l86Q5j95P5J52
2351C7R0K01l35M0K22k78k69K22k05L90j19J81k23j78J29k31J50L70j02k40j14
2372b62K70J41j45P1J33l36r0K98J92nk04j10K54p5l5j25j95J66J04o1p2K5P8
2395A7m7J89j48j77K85j53O4j07r8K8K31j30K61j93j76J26m9J93J36k27j13K45
2417A57j99J53o8k36J52k85J47K06K6l4k04K13r3l7J71j02L9Q2k94M13j93n6M2
2440@p0n1Q1j26K53J2pl7m23J14K07J47K4o2p7R3j74N6k51N04j17l8j18L8Q3L2
2466I3j16kj18j4L63k47K07M1k48m0k6J37k32J64M17l33j95L3O6j38K07n3K6l4
2490d2L2J15J15k25j4J1N9J45j34k0p4j35L96p8J79m86J62K12j33l93L19kr9N1
$$ plain form
2514 -39 189 21 40 -127 101 211 -59 58 23 -11 -154 -2 -15 -237 79 2 -110 107 224 98 -230 -162
2536 -162 -153 45 51 64 37 268 8 -184 -43 -19 -311 96 -133 -143 -225 -218 -57 -118 143 -39 26 -84 -272 200
2560 200 -58 -197 -65 -41 8 -532 -140 -17 140 10 -171 7 70 2 -39 -172 -215 33 79 37 214 29 6
2583 6 123 220 -28 -78 110 50 -7 -5 28 87 -16 -61 -148 112 -6 78 -38 186 -34 129 -1 76 -128 -205 112
2608 112 38 85 106 -111 -64 -88 -232 -54 -26 51 -192 -63 52 79 79 -28 122 -10 -70 -143 143 122 132 145 -61
2633 -61 -150 109 42 47 109 -129 -27 92 68 -143 257 32 80 143 119 -325 24 11 -191 -75 -18 46 -135 41
2657 41 115 185 74 194 -47 138 113 -197 -230 -47 -32 -136 31 -256 351 -168 -141 -145 -102 -58 -19 198 -110 -228
2681 -228 195 -156 -68 -134 23 -129 164 94 -127 58 -164 411 159 13 200 185 3 214 83 -25 -32 -19
$$ packed form
2514c9K28j68J9j67K28J10k70J17l5l4j43J52j3k22L16p7j12K17J17j26l28O8
2536a62RJ98OJ3k7K31k60j92J41K4k92M07k29j0q2PJ61o1K61j82O5j10j88M72
2560B00k58j39J32K4M9n40L92J23J57j30j81J78O3o8m1j33m3K48M6m2J77j85k3
2583FJ17R7k48n0J88o0n7KL3N9j03m5q7K60j18Q4j16K24k20J63j30P7k04p7L17
2608A12p4M7K1k17M7k4j44J78K8P7k43J29J15K7%j07J50j32o0p3K86k1J0J3k06
2633f1q9K59o7NO2k38J02J19k4k11M00k25M8O3k4m44L49j3k02J16N7O4j81J76
2657D1P4P0j11J20k41J85k5l10l3J83J5j04J67k87O07n19K7mM3M4L9K17l08j18
2681b28M23l51Q8o6J57j52K93p0k21J85k22N75k52j46J87j5j82K11j31j08pJ3
$$ plain form
2703 -19 -145 113 -89 -81 -10 -68 -166 -90 -195 -157 202 174 -96 -87 -160 -153 28 -172 112 -95 -131 -117 -136 -150 -138 50
2729 50 -93 -3 -44 58 1 -46 145 184 -45 36 45 -5 167 -164 14 181 10 -160 -100 187 -192 156 123 -83
2753 -83 85 155 145 -46 157 151 96 235 82 -61 -7 4 -159 18 -66 121 143 -280 97 -130 -5 42 -45 62
2777 62 54 -26 -97 -203 0 75 76 -208 351 39 246 -121 39 -119 240 -193 54 -167 69 -43 -90 51 -89
2800 -89 31 -131 -23 48 -263 132 36 20 222 218 -128 -113 29 17 -211 -162 -76 -14 148 -207 100 -152 201 -127
2824 -127 -126 270 -11 -190 57 -92 112 -90 -100 129 407 40 -231 44 4 -125 -11 65 -181 -236 61 -15
2846 -15 24 -142 129 81 -64 236 -129 114 105 345 -109 329 56 105 -162 186 -18 24 120 -137 98 7 -81
2869 -81 -96 137 -72 -35 68 145 6 -75 -7 -15 214 -251 -186 -185 -37 97 99 94 121 28 -236 288 -319 262 -101 17
$$ packed form
2703a9j26K58k02QP1n8r8P6j05L8L59k8k70Rp3PJ81k00K84k07l6J4j9j4J2J88
2729E0j43R0m1J02n7m7J91L9k29Q1Rn0J72l31J78J67j71j70O0K87l79L48l3k06
2753h3J68P0j0j91K03on5J39j53j43N4J1j63J77q4J87K2m23L77k27J25M7q7J07
2777F2qq0p1j06K03P5Jk84N59l12K07l67J60j58L59m33K47k21K36j12m7J41j40
2800h9J20j62J08P1l11L95r6j6K02ml46J5J42j2k28M9Q6O2J62l55L07k52L53l28
2824a27JL96k81j79K47j49K04k02j0K29K78l67k71K75m0j29J14P6k46n5K97p6
2846a5L9j66K71m8j45L00l65K43rK40m54M38k73M9k67L48k04M2R6k57K35r1q8
2869h1j5K33k09L7J03P7j39q1O8qK29m65O5JJ48J34KnK7r3k64N24o07N81l63J18
$$ plain form
2895 17 300 259 50 48 -77 21 74 -493 -278 -299 94 -26 -53 -89 -126 -6 -49 141 -293 -20 -161 -101 -38 179
2919 179 -76 -52 227 -455 -171 -4 175 9 -104 51 134 -157 8 -19 74 -65 -93 -40 -32 0 -179 59 26
2942 26 -130 45 156 33 -25 21 -105 -114 38 -5 264 26 36 -64 -61 37 -292 109 -209 -185 -47 38 93 -16
2966 -16 17 -43 186 67 -21 -19 -116 -136 -126 18 -83 -92 406 244 6 -305 169 21 -99 136 -135 -73 -118 -16
2990 -16 -81 73 -61 183 203 -245 204 203 -18 196 -66 -91 -94 -4 -120 -184 158 -110 -58 22 52 -332 100 194 94
3015 94 -218 -218 -80 254 8 -139 118 21 -38 41 100 -91 -44 -88 -162 58 67 -29 201 135 -120 -141 -31 -103 -43 213
3041 213 54 -26 -158 -23 142 -213 -110 -129 -139 -204 116 221 37 35 76 -56 81 74 62 240 255 -150 87 83
3065 83 26 -32 -12 29 -54 147 175 -112 51 207 -24 48 -42 -60 -144 -82 -278 43 13 -253 179 -141 44 21 -13
$$ packed form
2895A7K83m1k09kj25R8N3n67K15k1L93j20k7l6l7J20m3J90m34K73j41O0O3K17
2919A79k55K4K79o82K84J67J79j66j13J55Q3k91J65k7R3j39k8N3QL2j79K38l3
2942B6j56J75J11j23n8M6j26rJ52m3K69k38J0j00LR8l29M01l18K4J38Q5N5j09
2966a6L3o0K29j19q8Kr7k0J0J44j01rM98j62k38l11M74j48j20K35k71O2m5J02
2990a6o5J54j34K44K0m48M49jk21K14k62k5lR0j16o4L42k68N2Q0L0l84M32R4j00
3015I4l12%J38L34k46j47K57r7n9P9N9j91M7m4p4K20Rr6K30o6k55k1J10p2O0K56
3041B13j59q0j32J35J65l55J03j9j0o5L20J05j84kM1j32J37pj2J78J5m05K37m
3065H3n7n8K0M1q3K01K8k87J63J56k31P2r0j8q4O2j96L21l0k66M32l20J85k3l4
$$ plain form
3090 -13 53 -252 64 93 -247 -193 12 -15 74 129 -130 -2 -58 84 -9 -42 -36 52 -21 190 -68 125 60 -130 -86
3115 -86 197 -60 299 217 -12 -239 -165 -45 114 97 -92 52 70 82 -285 33 -73 24 256 -99 83 -289
3137 -289 -72 135 -16 -272 -62 -116 -80 18 242 -84 -115 -203 214 99 87 135 113 155 143 -75 -123 -121 206 57
3161 57 19 -136 87 87 82 40 3 -57 83 318 203 55 -27 93 -6 243 -76 -38 -95 18 53 57 17 -75 163 109
3187 109 169 -38 -208 183 -186 101 50 10 -148 97 131 -120 91 -67 -120 42 257 -106 88 68 78 -113
3209 -113 -79 -131 74 -76 97 108 -83 -60 9 -75 63 -83 65 35 166 -8 148 42 317 137 118 55 -190
3232 -190 -109 329 -71 325 -71 -64 143 30 -72 -65 -168 11 186 -63 180 -133 19 22 -56 -220 126 -107 189
3255 189 238 -19 52 44 244 -11 -123 106 -60 264 -392 61 270 -96 -46 149 12 289 80 156 -15 0
$$ packed form
3090a3O6l05L16K9l40N4K05k7Q9N5k59J28n6J42r3l3OQ8p3K11k58J93o5j90M4
3115h6K83k57L59q2k29k27P4J20J59j7j89J44J8J2l67L18j06R7K32l55J82l72
3137b89K17K07j51k56K10n4L6R8K24l26l1q8M17j15j2M8k2M2j2k18m8KL27j49
3161E7l8j55K23%nm2l7o0J40K35j15j48q2J20r9K49l19L8n7J13L5Mm0r2K38n4
3187A09O0k07j70L91l69K87n1m0j58K45L4k51K11j58n3J62K15l63J94k0J0j91
3209a13L4n2K05j50J73J1j91K3O9q4J38j46J48l0J31j74J56j06K75j80j9o3k45
3232a90Q1M38m00L96l96PK07j13j02Pj03J79J75k49K43l13J52Lp8j64L46k33K96
3255A89M9k57P1qK00k55j12K29j66L24o56M53K09l66N0J95j37K77k09P6j71J5
$$ plain form
3277 0 210 -258 13 -79 93 -121 -254 -53 28 92 182 -87 110 1 110 -12 -59 -104 -53 -5 -252 -119 -228
3300 -228 113 36 -201 202 -184 45 175 -176 -11 5 -29 -55 -302 -53 -183 -147 -153 35 149 -14 -304 164
3322 164 19 72 -13 -187 -83 -279 184 -111 -10 -18 19 72 -103 102 91 56 -276 -131 -108 -53 129 38 -142 63
3346 63 52 65 203 25 9 153 -125 -44 74 248 241 -153 60 -182 18 35 -179 -153 34 71 49 196 -20 -89
3370 -89 2 -155 -85 286 117 265 108 122 50 57 -126 -127 -104 88 82 96 -185 -136 10 -23 -232 32 29 -52 -15 63 -49
3397 -49 -51 -372 -57 -80 29 -80 -155 62 23 -1 -107 12 -40 -68 76 -272 -160 -86 156 -337 134 -132 -65 25
3421 25 10 -100 50 210 103 35 -111 53 48 -175 -2 -35 -81 7 -79 -57 -63 207 -128 -91 -13 -93 153 -197 47
3446 47 153 -166 251 -39 -255 18 212 14 92 225 -153 30 93 87 133 -13 414 -291 171 13 -74 -164 74
$$ packed form
3277@K10m68K71r2J72k14j33K01Q1O4R0k69J97j09J09j22m7m5N1M8k47J33j09
3300b28L41p7k37M03l86K29J30l51J65J6l4k6k47K49j30L6oJ88J14j63k90M68
3322A64j45N3q5j74J04j96M63k95J01qL7N3j75K05j1l5l32J45K3N5J82r1j80K05
3346F3j1J3J38j78j6J44k78Q1J18J74pl94K13k42K00J7k14K6J87L7k2J47k16o9
3370h9R1j57P0L71j69J48j57J4p2Pj83jK3J92oJ4k81M9J46l3k09K64lq1L7P8j12
3397d9kl21L15k3J09j09p5K17l9k4j06J19n2k8J44l48J12P4K42m93M71k66O7R0
3421B5j5j10J50J60j07o8j46J64nk23J73l3m6Q8q6K2oK70l35L7P8q0K46l50K44
3446D7J06l19M17k90k16K73J94j98P8J33l78J83O3oM6j46M27p05M62j58q7r0K38
$$ plain form
3469 74 64 -104 -260 138 -237 -166 61 22 -36 -8 27 59 91 -25 -26 0 -222 -193 107 -147 70 -8 -122 172 -94
3494 -94 -74 -168 -315 154 23 152 -1 131 148 -249 49 -65 42 301 -69 121 74 -143 -209 16 -59 12 -33
3517 -33 -21 66 -9 220 -129 -84 -37 60 100 19 -173 99 153 -48 -26 93 119 -9 -64 -87 300 -92 -200 71 85
3542 85 119 -224 132 48 -64 -30 38 -322 -119 -44 -25 43 -40 208 -113 38 -177 56 133 314 31 173 300
3565 300 -103 74 25 -31 -170 -206 56 124 88 -90 206 220 -41 63 92 -46 1 181 94 84 -56 -52 20 9 -15
3590 -15 -185 83 -44 -20 -142 160 31 43 -262 -23 -190 153 -109 -97 41 25 -34 6 136 32 -3 153 57
3613 57 -204 94 -159 313 41 -9 62 -1 -137 -131 -60 -9 -25 19 11 258 -27 -388 -246 63 370 -145 160 118
3637 118 95 120 79 -212 -104 19 36 3 0 222 -111 100 -31 299 -62 377 -49 214 -372 -7 284 83
$$ packed form
3469G4j0j68j56L98l75P1K27l9n8K8L5L2L2j16jK6k22K9L00k54K17p8j14K94k66
3494i4K0r4j47M69j31J29j53J32J7l97K98j14J07K59l70J90m7k17o6K25p5P1m5
3517c3J2Q7p5K29l49M5M7R7M0q1j92K72N4k01K2J19K6j28n5k3L87l92j08K71J4
3542H5L4l43L56q4j12L4O8l60K03P5J9O8q3K48l21J51k15K33P7J81k83J42J27
3565C00m03J77m9n6j39l6K62O8l6j78K96J4k61J04K9j38M7J80q7j0j40MP2j1k4
3590a5j70K68j27K4j22L02j29J2l05K39j67L43k62J2J38j6n9M0J30j04l5J56r6
3613E7k61K98k53M72k72n0P1o3j36OP1N1j6M4qK47k85l61J42L09L07n15L05m2
3637A18k3K5m1k91J08J23J7l3lK22l33K11j31L30l61M39m26K63n86L65K91k01
$$ plain form
3659 83 -13 49 -19 -55 116 37 -94 -225 -111 -157 126 15 -311 -354 135 92 -149 222 76 -30 115 159 -94
3682 -94 58 -43 160 39 82 14 -25 165 111 166 434 -32 -105 36 170 343 -180 350 36 -87 -220 90
3704 90 205 23 -305 71 -138 255 116 26 163 -84 100 51 -294 77 255 -67 -104 292 -102 -78 86 233
3726 233 -254 -112 53 10 -21 -185 -146 4 150 -103 -291 148 -104 123 11 -82 -161 -192 -48 201 234 55
3748 55 -125 -66 -21 54 246 -42 -256 132 14 179 -86 215 210 -21 63 -161 236 -14 34 217 140 -70 -134
3771 -134 81 -12 36 -28 184 -300 86 -91 37 -175 -81 48 -121 143 -306 6 -176 72 14 23 -48 93 -302
3794 -302 161 57 158 -158 96 -123 61 16 193 82 216 234 -299 -112 -28 155 13 121 -175 274 56
3815 56 152 155 10 -152 -146 -194 -79 145 111 74 50 -192 216 -41 6 37 -56 -346 -6 137 -97 47 19 17 -83
$$ packed form
3659H3r6O2o8l6J71p9j31j31J14m6K83j11l26m3M89m3k41L71j46j06J45M4k53
3682i4J52j01K03j21M3o8l9J90n4N5K68m66p3J41J34J73n23N30l14j23j33L10
3704I0J15j82l28L76k09L93j39r0J37k47J84m9l45L71J78l22l7L96l94K4J64J47
3726B33m87J42J65m3l1j64L9J50J46k53j88M39k52K27j12r3p9l1J44K49L3j79
3748E5j80N9M5P5J92k88k14L88j18J65k65L01nk31Q4k24L97k50M8J83p7k10o4
3771a34K15r3M8o4K12m84L86j77J28k12R4J29j69K64m49L12j82K48n8Rp1J41l95
3794c02M63j04J01l16K54k19J84m5J77j11J34J8n33J87Q4J83j42J08k96M49k18
3815E6R6Lj45j62Om8J15K24l4l7k4k42M08k57M7L1r3k90L40J43k34J44k8kj00
$$ plain form
3840 -83 224 35 285 -39 -269 -170 -35 -44 -98 143 139 24 57 -338 96 84 233 -34 -192 -48 47 -313 -28
3863 -28 -58 -8 -52 80 180 -23 32 -91 -173 123 -214 -213 57 8 210 -67 -128 71 -248 75 15 -177 -92 -129
3887 -129 28 -154 -59 -84 133 119 47 42 -110 50 322 -213 -205 106 172 -93 135 13 -30 251 138 253 49
3910 49 79 -136 106 -47 109 -46 -83 62 -97 11 230 180 129 -34 29 -69 61 0 -97 124 -62 -318 144
3933 144 101 -74 -151 184 88 253 -133 99 -260 -147 32 140 -171 -8 -119 -211 31 205 222 41 111 46
3955 46 217 -53 113 -23 -152 -87 131 19 -63 -126 -64 345 -174 364 -11 299 132 -132 -120 -176 10 56 -110
3978 -110 114 -105 92 -101 -165 185 -17 377 -59 96 -81 136 -330 148 98 -32 -38 90 33 -267 -69 -92
4000 -92 -83 -13 -111 41 144 269 -22 -117 17 -110 10 42 -228 25 -14 68 45 130 -208 -35 -41 -317 -231 33 109
$$ packed form
3840h3L07j89K50l24k30R9J35rn4K41mj15L3l95M34j2J49k67j58J44R5l60K85
3863b8l0N0m4J32J00k03N5j23q2K96l37JK70m9K02k77o1J99l19L23o0j92Q5l7
3887a29J57j82R5k5K17j4p2nj52J60K72n35QL11O6k65K28j22m3K81j13J15k04
3910D9L0k15K42j53J56j55l7J45j59J08K19n0n1j63O3r8J30o1r7K21j86k56M62
3933A44m3j75p7L35r6J65l86K32l59J13J79J08l11J63j11r2K42J74J7j81P0o5
3955D6J71k70J66j36j29O5K18j12q2o3O2M09n19N38l75L10j67k64J2n6J86M6j66
3978a10K24k19J97j93o4L50k02L94m36J55j77K17m66M78n0j30oJ28n7l00J98k3
4000i2RP0r8J52J03J25k91r5J34j27J20L2k70K53l9Q2k3Q5l38J73ok76Q6K64P6
$$ plain form
4025 109 213 151 125 -21 -7 132 -136 180 107 -81 56 90 126 -154 -40 -345 -212 -99 -158 89 109 -51 -76
4048 -76 -250 -145 276 65 138 152 32 -147 116 97 -47 72 -117 -28 -65 214 -93 93 190 -104 205 -40
4070 -40 -61 -36 -22 -35 53 -22 -49 39 -15 -47 -24 164 -212 52 -38 -221 168 134 167 -77 163 -157 -119 21 61 -130
4096 -130 -81 124 57 15 71 -87 114 8 -122 16 17 35 19 11 112 -20 225 223 108 68 65 93 -180 59 97 -71
4122 -71 3 -29 39 -340 212 132 -55 -46 -139 -39 85 -4 -7 -99 205 -68 -271 160 -253 68 315 274 -199 0
4146 0 7 66 252 353 118 -212 -87 6 148 1 -43 19 -41 137 165 224 23 -65 106 -24 -142 156 -149 -75
4170 -75 59 163 151 109 13 -320 37 157 -387 -170 -36 130 16 -105 46 -121 -91 -36 58 106 -139 -175 -305
4193 -305 57 -8 -88 -61 -34 -91 -97 54 238 24 15 13 -172 -278 -101 -38 -22 -99 166 150 -209 225 -116 102 153
$$ packed form
4025A09J04o2k6j46J4J39k68L16p3j88J37L4L6k80J14l05J33J13n9K47K0j60k5
4048g6j74J05M21k11P3J4j20j79K63j9j44J19j89Q9l7K79l07J86R7k94L09k45
4070d0k1K5J4j3Q8p5k7Q8n4l2K3J88l76K64r0j83L89l4L3k44K40l20L8J40M0j91
4096a30M9K05o7m2N6j58K01j06j30J38JJ8j6qJ01j32K45kj15m0lK8k73K39L8j68
4122g1P4l2O8l79N52q0j87Rr3J00J24q9lr2L04k73k03M31m13L21K47m1m73J99
4146@PN9J86J01k35l30J25R3J42j47m4O2o0J78K8N9k01q8J71j30j18K98l05P4
4170g5J34J04j2m2r6l33L57J20n44K17J34J66j14j21J51j67L0N5R4M8k45l6j30
4193c05L62o5q0K7K7n7oJ51J84k14rkj85j06J77O3J6p7K65j6l59M34l41K18N1
$$ plain form
4218 153 -3 -174 -90 110 -92 -116 -106 -60 -51 197 -60 -57 108 80 -233 -164 -154 16 -186 -136 -85 -174 -13 -249 -32
4243 -32 -182 160 -105 -180 103 -58 198 185 -152 -63 161 -140 -114 171 83 82 -211 -69 169 -39 -185 32 -11
4266 -11 -145 -69 120 118 43 49 -23 -306 -77 -101 -84 -48 79 130 -185 -111 -107 26 0 206 167 30 -90 217 142 316
4292 316 256 -91 52 -38 -45 -101 -51 -43 325 -52 411 -156 -166 -4 -45 -27 -24 -213 158 395 30 -243 -329 -5 159
4317 159 102 -106 323 -1 51 -120 -50 156 208 31 -100 17 -9 32 -41 -37 -6 -11 97 -195 -122 -87 87 -49 57
4342 57 149 -223 109 -131 -75 200 -44 75 -19 -104 -152 179 54 -94 -45 -3 363 -301 139 -318 77 -121 55
4365 55 282 -68 148 289 -7 -15 136 -136 -95 -27 170 105 -349 -14 -34 -84 210 19 -153 -157 -68 5 128 79
4389 79 68 151 -5 234 -47 -79 173 116 -5 52 -33 79 70 -60 -101 -50 -245 -89 10 -14 253 94 144 -195 167
$$ packed form
4218A53j56j71Q4K00k02k4J0M6RK48k57LJ65k8l13O9J0J70k02N0N1q9J61k36K17
4243c2j50L42k65p5K83j61K56j3l37Q9K24l01K6K85q8jk93J42K38k08j46K17m3
4266a1j34P6J89kp5Op2k83K29k4J7L6J27N1l15P4MJ33k6K06l9j37j20L07p5J74
4292C16o0l47J43r0pn6N0QL68l77M63n67j0J62m1J8Lj89L71K37l65k73q6L24J64
4317A59n7k08M29l24N2j71P0K06N2j77j31J17k6M1p3ML1nJ08k92P3L5J74j36J06
4342E7R2l72L32k40N6K75k44J19r4q5m8L31j25j48M9M2L66o64M40m57L95j98J76
4365E5K27l50K16J41k96qJ51k72M1O8J97o5m54L35k0n0K94j91j72mQ9P3J23m9
4389G9j1Q3j56K39k81l2K52n7j21N7q5J12rj30m1N1j95J56R9k4K67j59N0l39L62
$$ plain form
4414 167 74 303 -37 33 -499 -243 -205 -35 264 -157 -103 34 175 -171 -77 -35 42 32 61 -42 -17 -89 250 55
4438 55 219 -126 173 28 -234 -22 235 -96 21 110 80 -53 4 130 190 104 -9 295 128 -23 -33 -67 -138
4461 -138 4 -123 105 56 182 -99 61 91 -201 -58 44 -30 -112 -190 235 -239 -35 -126 -38 -239 91 147 -155
4484 -155 -337 380 72 -15 129 -61 -65 30 -216 119 38 -123 1 103 -15 16 -84 -407 -55 36 92 164 36
4507 36 59 76 221 -237 22 -95 -14 -252 196 -153 78 65 196 28 -135 -88 -60 -5 -72 321 -31 -248 -98
4530 -98 -18 -130 -128 239 -266 219 -176 -39 -82 141 63 12 112 -57 -190 -131 97 -429 -186 73 -123 -162 -273
4553 -273 -299 10 -255 -21 -8 297 110 -112 51 -28 340 -80 -57 112 -204 0 73 -8 337 -169 -255 152
4575 152 -78 -190 -129 -72 63 -104 -108 -128 -39 95 -115 133 -17 24 -68 18 18 41 -93 46 62 -52 58 -10 -60
$$ packed form
4414A67r3K29l40P0n32K56L8J70K99m21N4J37J41l46R4M2P7j0K9j03K5p2L39j95
4438E5J64l45K99j45k62K12K57l31J17Q9l0j33N7J26O0q6j13L04j67j51j0l4p1
4461a38J42j27K28m9J26k81J60L0k92J43J02p4q2p8M25m74K04r1Q8k01L30N6l02
4484a55j82P17l08q7J44j90mR5k46L35q1j61J24J02j18L1j00l23L52R1N6P2j28
4507C6K3J7J45m58K59j17Q1k38M48l49K31j3J31j68j63M7K8N5o7L93l52k17J50
4530i8Q0j12KL67n05M85l95J37m3K23p8n1J00j69j33N9K28n26K43K59j96l9j11
4553b73k6L09k65K34J3L05j87k22J63p9L68m20K3J69l16K04P3q1L45n06q6M07
4575A52k30j12O1N7J35j67mk0Q9J34k10K48j50M1r2Q6%K3j34J39J6j14J10o8n0
$$ plain form
4600 -60 122 99 -35 -101 1 37 126 -89 -190 78 -93 116 233 31 -165 -92 59 -47 242 -155 -49 11
4622 11 -26 116 64 -177 63 137 100 62 188 -30 91 238 -195 62 19 -127 -206 239 164 49 4 167 -146
4645 -146 24 -51 -70 -27 216 -19 160 101 -173 507 -12 201 -5 18 -91 -149 156 37 5 -365 72 152 241
4668 241 -215 -36 -97 -125 -113 41 -86 -206 -77 -228 -97 -76 -56 -209 298 57 -131 -126 136 -26 -45 -41 -205
$$ packed form
4600f0J82k3j34o6J02L6Q9k15j01K68j71K09J17k02j96P3J51j06K89l97J06O0
4622A1l7J42n2k41K40P4l7l8J26k18J21J47m33K57m3j46p9M45p5j15m5J63l13
4645a46J70p5j9M3K43k35J79n9k74O80n19K13k06K3j09n8L05j19l2l70M37Q0Q9
4668B41m56J79o1k8J2J54j27j20J29j51J31K1K0j53N07k41j88NK62j62j9Mj64
$$ [...]
8191b07
##END NTUPLES=NMR FID
##END=
