##TITLE=1H_DE-106_ch_7_TFA
 200.13MHz, CDCl3,
 8 sc
 
 20.8.2025
##JCAMPDX= 6.0         $$ Bruker NMR JCAMP-DX V2.0
##DATA TYPE= NMR FID
##DATA CLASS= NTUPLES
##ORIGIN= UXNMR, Bruker Analytische Messtechnik GmbH
##OWNER= pz
$$ XWIN-NMR		Version 3.5
$$ Wed Aug 20 13:43:57 2025 Russian Standard Time (UT+4h)  she@DPX200
##.OBSERVE FREQUENCY= 200.1308
##.OBSERVE NUCLEUS= ^1H
##.DELAY= (6, 6)
##.ACQUISITION MODE= SIMULTANEOUS
##.ACQUISITION SCHEME= undefined
##.AVERAGES= 8
##.DIGITISER RES= 18
##SPECTROMETER/DATA SYSTEM= spect
##.PULSE SEQUENCE= zg30
##.SOLVENT NAME= CDCl3
##.SHIFT REFERENCE= (INTERNAL, CDCl3, 0, 14.3821)
##AUDIT TRAIL= $$ (NUMBER, WHEN, WHO, WHERE, WHAT)
$$ ##TITLE= Audit trail, XWIN-NMR		Version 3.5
$$ ##JCAMPDX= 5.01
$$ ##ORIGIN= Bruker BioSpin GmbH
$$ ##OWNER= she
$$ F:/spectra/data/she/nmr/H-C/1/audita.txt
$$ ##AUDIT TRAIL=  $$ (NUMBER, WHEN, WHO, WHERE, WHAT)
(   1,<2025-08-20 13:42:41.76 +0400>,<she>,<DPX200>,
      <created by zg, POWCHK disabled, PULCHK disabled
       configuration hash MD5:
       00 E9 B6 7A A2 85 ED C7 34 08 36 98 17 FE 4E 26
       data hash MD5: 16K
       12 AF DB 5C 8B D4 F6 3E 26 BD 4D 15 3B B5 00 AE>)
$$ ##END=
$$ 
$$ hash MD5
$$ D9 9B 18 47 BA 02 7D 80 FE 65 0D B4 4A 8C B7 08
##$RELAX= 
##$RELAX= 
##$RELAX= 
##$RELAX= 
##$RELAX= 
##$RELAX= 
$$ Bruker specific parameters
$$ --------------------------
##$DU= <F:/spectra>
##$EXPNO= 1
##$NAME= <H-C>
##$PROCNO= 1
##$TYPE= <nmr>
##$USER= <she>
##$AMP= (0..31)
100 100 100 100 100 100 100 100 100 100 100 100 100 100 100 100 100 100 
100 100 100 100 100 100 100 100 100 100 100 100 100 100 
##$AQSEQ= 0
##$AQ_mod= 1
##$AUNM= <au_zg>
##$AUTOPOS= <>
##$BF1= 200.13
##$BF2= 200.13
##$BF3= 200.13
##$BF4= 200.13
##$BF5= 200.13
##$BF6= 200.13
##$BF7= 200.13
##$BF8= 200.13
##$BYTORDA= 1
##$CFDGTYP= 0
##$CFRGTYP= 5
##$CHEMSTR= <none>
##$CNST= (0..31)
1 1 145 1 1 1 1 1 1 1 1 1 1 1 1 1 1 1 1 1 1 1 1 1 1 1 1 1 1 1 1 1 
##$CPDPRG= <>
##$CPDPRG1= <>
##$CPDPRG2= <>
##$CPDPRG3= <>
##$CPDPRG4= <mlev>
##$CPDPRG5= <mlev>
##$CPDPRG6= <mlev>
##$CPDPRG7= <mlev>
##$CPDPRG8= <mlev>
##$CPDPRGB= <>
##$CPDPRGT= <>
##$D= (0..31)
0 0.7 0 0 0 0 0 0 0 0 0 0.03 0 0 0 0 0 0 0 0 0 0 0 0 0 0 0 0 0 0 0 0 
##$DATE= 1755682961
##$DBL= (0..7)
120 120 120 120 120 120 120 120 
##$DBP= (0..7)
150 150 150 150 150 150 150 150 
##$DBP07= 0
##$DBPNAM0= <>
##$DBPNAM1= <>
##$DBPNAM2= <>
##$DBPNAM3= <>
##$DBPNAM4= <>
##$DBPNAM5= <>
##$DBPNAM6= <>
##$DBPNAM7= <>
##$DBPOAL= (0..7)
0.5 0.5 0.5 0.5 0.5 0.5 0.5 0.5 
##$DBPOFFS= (0..7)
0 0 0 0 0 0 0 0 
##$DE= 6
##$DECBNUC= <off>
##$DECIM= 32
##$DECNUC= <off>
##$DECSTAT= 4
##$DIGMOD= 1
##$DIGTYP= 9
##$DL= (0..7)
0 120 120 120 120 120 120 120 
##$DP= (0..7)
150 150 150 150 150 150 150 150 
##$DP07= 0
##$DPNAME0= <>
##$DPNAME1= <>
##$DPNAME2= <>
##$DPNAME3= <>
##$DPNAME4= <>
##$DPNAME5= <>
##$DPNAME6= <>
##$DPNAME7= <>
##$DPOAL= (0..7)
0.5 0.5 0.5 0.5 0.5 0.5 0.5 0.5 
##$DPOFFS= (0..7)
0 0 0 0 0 0 0 0 
##$DQDMODE= 0
##$DR= 18
##$DS= 0
##$DSLIST= <SSSSSSSSSSSSSSS>
$$ [...]
##$SUBNAM0= <"">
##$SUBNAM1= <"">
##$SUBNAM2= <"">
##$SUBNAM3= <"">
##$SUBNAM4= <"">
##$SUBNAM5= <"">
##$SUBNAM6= <"">
##$SUBNAM7= <"">
##$SUBNAM8= <"">
##$SUBNAM9= <"">
##$SW= 18.0517779522481
##$SWIBOX= (0..15)
0 0 2 0 0 0 0 0 0 0 0 0 0 0 0 0 
##$SW_h= 3612.71676300578
##$TD= 16384
##$TD0= 1
##$TE= 0
##$TE2= 300
##$TE3= 300
##$TEG= 300
##$TL= (0..7)
0 120 120 120 120 120 120 120 
##$TP= (0..7)
150 150 150 150 150 150 150 150 
##$TP07= 0
##$TPNAME0= <>
##$TPNAME1= <>
##$TPNAME2= <>
##$TPNAME3= <>
##$TPNAME4= <>
##$TPNAME5= <>
##$TPNAME6= <>
##$TPNAME7= <>
##$TPOAL= (0..7)
0.5 0.5 0.5 0.5 0.5 0.5 0.5 0.5 
##$TPOFFS= (0..7)
0 0 0 0 0 0 0 0 
##$TUNHIN= 0
##$TUNHOUT= 0
##$TUNXOUT= 0
##$USERA1= <user>
##$USERA2= <user>
##$USERA3= <user>
##$USERA4= <user>
##$USERA5= <user>
##$V9= 5
##$VALIST= <valist>
##$VCLIST= <CCCCCCCCCCCCCCC>
##$VD= 0
##$VDLIST= <DDDDDDDDDDDDDDD>
##$VPLIST= <PPPPPPPPPPPPPPP>
##$VTLIST= <TTTTTTTTTTTTTTT>
##$WBST= 1024
##$WBSW= 4
##$XGAIN= (0..3)
0 0 0 0 
##$XL= 0
##$YL= 0
##$YMAX_a= 209571
##$YMIN_a= -149109
##$ZGOPTNS= <>
##$ZL1= 120
##$ZL2= 120
##$ZL3= 120
##$ZL4= 120
##$ABSF1= 10
##$ABSF2= 0
##$ABSG= 5
##$ABSL= 3
##$ALPHA= 0
##$AQORDER= 0
##$ASSFAC= 0
##$ASSFACI= 0
##$ASSFACX= 0
##$ASSWID= 0
##$AUNMP= <proc_1d>
##$AZFE= 0.1
##$AZFW= 0.1
##$BCFW= 1
##$BC_mod= 2
##$BYTORDP= 1
##$COROFFS= 0
##$CY= -3
##$DATMOD= 1
##$DC= 2
##$DFILT= <>
##$DTYPP= 0
##$F1P= 0
##$F2P= 0
##$FCOR= 0.5
##$FTSIZE= 0
##$FT_mod= 4
##$GAMMA= 1
##$GB= 0.15
##$INTBC= 1
##$INTSCL= 1
##$ISEN= 128
##$LB= 0.25
##$LEV0= 0
##$LPBIN= 0
##$MAXI= 10000
##$MC2= 0
##$MEAN= 0
##$ME_mod= 0
##$MI= 1.114404
##$NCOEF= 0
##$NC_proc= 0
##$NLEV= 6
##$NOISF1= 3.799351
##$NOISF2= 2.8
##$NSP= 1
##$NTH_PI= 0
##$NZP= 0
##$OFFSET= 14.38212
##$PC= 1
##$PHC0= -1562.508
##$PHC1= 13.59228
##$PH_mod= 1
##$PKNL= yes
##$PPARMOD= 0
##$PSCAL= 0
##$PSIGN= 0
##$REVERSE= no
##$SF= 200.129724274929
##$SI= 16384
##$SIGF1= 3
##$SIGF2= 2
##$SINO= 400
##$SIOLD= 16384
##$SREGLST= <1H.CDCl3>
##$SSB= 0
##$STSI= 0
##$STSR= 0
##$SW_p= 3205.1282051282
##$SYMM= 0
##$S_DEV= 0
##$TDeff= 0
##$TDoff= 0
##$TI= <>
##$TILT= no
##$TM1= 0
##$TM2= 0
##$TOPLEV= 0
##$USERP1= <user>
##$USERP2= <user>
##$USERP3= <user>
##$USERP4= <user>
##$USERP5= <user>
##$WDW= 1
##$XDIM= 8192
##$YMAX_p= 0
##$YMIN_p= 0
$$ End of Bruker specific parameters
$$ ---------------------------------
##NTUPLES= NMR FID
##VAR_NAME=  TIME,          FID/REAL,        FID/IMAG
##SYMBOL=    X,             R,               I
##VAR_TYPE=  INDEPENDENT,   DEPENDENT,       DEPENDENT
##VAR_FORM=  AFFN,          ASDF,            ASDF
##VAR_DIM=   8192,          8192,            8192
##UNITS=     SECONDS,       ARBITRARY UNITS, ARBITRARY UNITS
##FACTOR=    0.0002768,     1,               1
##FIRST=     0,             0,               0
##LAST=      2.2672688,     0,               0
##MIN=       0,             -149109,         0
##MAX=       2.2672688,     209571,          0
$$ Real data points
##PAGE= N=1
##DATA TABLE= (X++(R..R)), XYDATA
0@%%%%%%%%%%%%%%Qj6J6j6J6j9K7l2L7m5N2o0P1q3R3j05J20j39J59j79K03k30
36a22K59k91L25l60M00m46M96n48O05o69P39q15Q96r88J089j201J326j460J613
55H48j788J984k207K468k778L147l599M166m903N907p354R631j3752K3474q8978
70g3734l6244K11620o4162j47196J42447J76840j53095j56567O4960O6429k9686
81A612P552k7319n9783O2765P8303j04985o9401J32828R4391p8274o5984J9811
93h484L7370K3828j0473m9729j5550L0997m279n1153j1841L8091L1635M883k1038
106e743k5561K3683M2722p441j6354J8268M75k4900j0695j1983j3908K0471K2152
119A1186k8152k9198K8280L3237j1151n750K1456N195r812n008j1396o350J4657
$$ y = [0, 0, 0, 0, 0, 0, 0, 0, 0, 0, 0, 0, 0, 0, 0, 8, -8, 8, -8, 8, -11, 16, -16, 21, -24, 28, -32, 39, -44, 49, -56, 64, -75, 84, -95, 108, -122, 137, -154, 171, -189, 211, -235, 261, -287, 318, -351, 388, -427, 469, -519, 570, -631, 695, -765, 848, -940, 1044, -1163, 1305, -1473, 1674, -1925, 2241, -2662, 3245, -4109, 5522, -8230, 15244, -73734, -109978, 101642, 37480, -109716, 32731, 209571, 56476, -100091, -35131, 31298, 1612, 9164, -18155, -77938, -15173, 63130, -41855, -111256, 21572, 115963, 37689, -28295, -8484, 28886, 52714, 42241, -7488, -23038, 7959, 3680, -47473, -59314, -21223, 10412, 15295, -5743, -31304, -7621, 35101, 27660, 11306, 29574, 30049, 5149, -5546, -17529, -31437, -10966, 11186, -16966, -46164, -17884, 15353, 4202, -1548, 19908, 25103, 15291, 10283, -1113, -7463, 7194]
132G194N470j9749j6759L554Q532K746L915P941L602N20J024l018l027N839O510
147A4294m281j2863q142L671K137k388L432K514k161K538J959k860N781J1135
161A4766j694j0739l246K282k541k146K949j729m388J717q60l475O623R604j010
176F113k641P59k211p70K725Q13k988j990q85m997l086M602L444o6K227P3l522
193b400K595L692q22O08J862l009m246o17K65p95J555J861k395k582K783J977
209C32j494L286K976k257k251N64j242j424J535J330k403q84N52n3j111K129K182
226A767n05n04Q06n43j191k77P14o02k12n3K15n62M8J234P86r3J42N81q08j235
246b92n84Q3l96J3M89l55l83N15K14J095J240J026M34j129j175p32p71j84K3m10
$$ y = [7194, 12664, -7085, -23844, -20290, -11758, -9012, -5097, 2844, 6446, 6966, 7990, 4972, 1945, 7784, 14294, 10013, -2850, -10992, -7321, -5184, -7572, -4140, -1626, -3787, -1249, 710, -2150, 3631, 14766, 13072, 2333, -913, 1369, -1172, -3318, -369, -2098, -6486, -4769, -5629, -9104, -2481, 7123, 6113, 3472, 4231, 2020, 1250, 3975, 4788, 1800, -190, -1075, -6072, -9158, -4556, -1112, -1178, 1049, 1122, -2400, 195, 3887, 3065, 3673, 5535, 2526, -1720, -2337, -2072, -2867, -1312, 549, -1846, -4428, -1645, 332, -1162, 2124, 5100, 2843, 592, 1156, -86, -1510, 25, 1355, -1048, -1932, -1380, -1433, -2544, -415, 1767, 1262, 758, 1564, 1021, -170, -447, 267, -335, -547, -600, -385, -947, -899, 335, 1121, 1028, 1170, 1751, 943, -292, -876, -793, -1189, -1176, -687, -1042, -1425, -910, -696, 399, 1639, 2665, 3099, 1970, 795, 63, -708, -892, -869, -1279]
266a279n66p45j89N94J355J668J829P9j232J45m27o5j0J6n38k177j471k90M82
285b821M88K706P79q47k2O16L62O67J090J13j604k059j174o27j4J341Q35p79n8
304a008P6k13J504J560J218n05j442j084m48n63P99N99r61j244k38q24R43J932
322A01J424N51q10p50j15k44N25R48k61j254j339j312K2J002J216Q56L40j178
340b78m0j17Q11J916L26q14j416j313p54N08N05N75K20j395n54j50O75K090J430
359B225K22o15j015j283N53L45L75J55j461j416q00j90J287J850O29K99l75l65
377D20j58P18Q13O28n51j931q69j402k32J102N26J97J3n42P2Q73J464J707L69
396C217p78r56j219q97K23K56m13l3j585m59R5J013J440J943n2l63j97o64P57
$$ y = [-1279, -1845, -2590, -2779, -2185, -830, 838, 2667, 2746, 1514, 1659, 1232, 1167, 1157, 1173, 635, -1542, -3013, -3303, -2821, -2333, 373, 1152, 305, 283, 899, 1261, 1928, 3018, 3131, 1527, -532, -1706, -2333, -2347, -1006, -171, -950, -1008, -932, -1145, 359, 1919, 3137, 2632, 1190, 106, -342, -905, -106, 493, -468, -1712, -1950, -2774, -1831, 101, 1525, 2076, 1266, 516, 401, 157, 682, 1630, 1369, 115, -1224, -2536, -2514, -1512, -296, 560, 900, -278, -318, -435, 376, 2292, 2618, 1804, 388, -925, -1679, -1171, -666, -91, 129, -1266, -1820, -1970, -1295, 795, 2225, 2447, 1832, 817, -466, 87, 432, 807, 962, -499, -1915, -2715, -2905, -1618, 232, 861, 1160, 785, 420, 262, 980, 1793, 2421, 1870, -61, -930, -2332, -2564, -1462, -936, -739, -726, -1268, -1196, -323, 1141, 2848, 3217, 2439, 1483, 264, -633, -410, -154, -567, -600, -2185, -2644, -2549, -1536, -96, 1847, 1795, 1432, 1235, 571, 1328]
415A328M17Q7p42j178j237j155l17R95J065M70P2J84l96M45J069Q03L48l19j369
434E70j163m02k67K83N07j38o21k99J97J071Q02Q71P68j185k05k14o88J59O85
453G31m28r36o34k94j73J003J031J95Lmk87l56N04Q36k57m75j65p31p39M00Q22
474D6k88L01j76j11m23N66O38N9m8K52j181j8K42Q8n1L45n4m28l55L84L42J23
496B53P0J09k4q58K10J64K17L41m94j36k56L20l08O40P0m2l82q4J25RO0J70k32
519e8n0k7k82oP41k93K18m6j38n11M59lJ89j53K7J3NQ7r5J34P9j91m40J26K95
544H0j97j10K20n16L17K72L4L1J62J86l55J6n3k56q9L22q1j95M4l44J27L66J26
567A07j81J18j10J73K25j62L83o36L67k04l22J09L88j18l55K91l91J46P4l3o4
$$ y = [1328, 1745, 1832, 1090, -88, -1325, -2480, -2797, -1802, -737, -267, -195, -11, -407, 38, 1107, 1910, 2258, 1939, 570, -593, -995, -1262, -979, -472, -610, -1231, -1530, -1333, -262, 540, 1411, 2179, 994, 789, 575, -113, 46, 731, 303, -633, -1267, -1561, -1734, -731, 300, 495, 498, 494, 207, -149, 355, 1191, 934, 459, 294, -437, -1176, -776, 46, -242, 59, -117, -228, -651, -85, 553, 612, 564, 816, -365, -383, -141, -53, -104, 241, 187, -241, -596, -212, 130, 253, 323, 432, 408, -450, -240, -76, 141, 482, -12, -148, -404, -84, -392, 248, 318, 276, -106, -190, -65, -56, 4, 174, -58, -108, -135, -417, -423, 318, 25, 243, 197, 59, -452, 7, 4, 193, 40, 67, 80, 85, 172, 77, 211, 290, 99, -341, -215, 80, -117, -227, -7, -523, -206, 66, 100, 131, 293, 479, 124, 140, 87, -169, -258, 64, -17, -212, -168, -512, -385, -19, 107, -74, 44, -66, 107, 332, 170, 553, -83, 284, 80, -242, -133, 255, 137, -218, 73, -318, -172, -98, -131, -195]
588a95N18k99j19nN3M01j69j4p6r2k23j4j0K53P6m77k18J06J63J79M47K3K31j34
612D05l67J31P0m7K03k51m29l5m80L97M34l15K45K58q00M65M26J22j82L12l03
633B59l26l14j08M66j7j71J49k61j31M24J48J73L28l09m16P5L49j16j80J88k07
654Cl40k5j44L47N10J43l29j72P0j45k27O51j00j82O3o11Q9M48MK93M8m78K09
677A25l54p3N86l31J67k58m06K22j13L11J87K97l21l44J44O5K04L13k72k80P7
698e4l04M46j04J58O0k25j19j75k01N52J7M3%k68L0k1Q2K86l8O5j16l61L3L7J87
723A0kl8o0l51K38K07L28J68l56M6m37R6J62L32k72Q7l31j77K98k85J28M70k24
746C7m13M88k13K19K29O1J05k31m57p5n2K82K11P2n51k85J49j06O30p1p1R2J30
$$ y = [-195, 323, 24, -95, -100, -47, 354, 185, 171, 95, 3, -220, -234, -244, 9, 85, -392, -610, -504, -341, -162, 285, 308, 539, 405, 38, 169, 239, 192, 395, 144, -285, -320, -800, -403, 31, -284, -39, 219, -581, -116, 310, 432, 250, 562, 259, -67, -381, -489, -23, -40, -211, -62, -323, -454, -30, 118, 291, 619, 310, -106, -31, 318, 202, 22, 210, 3, -337, -362, -506, -159, 351, 494, 165, -7, 63, -82, -309, 342, 242, 60, 123, -488, -399, 49, 53, 346, 394, -84, 125, -229, -302, 284, -47, 120, -138, -544, -322, -435, -124, 63, 360, 39, -305, -161, -96, 108, 421, 149, -131, -54, -358, 88, -16, 142, 202, -23, -142, -317, -518, 34, 51, 94, 94, -174, -144, -165, -83, 203, 165, 230, 114, -247, -214, -177, 10, 8, -30, -90, -441, -203, 4, 332, 500, 144, 190, -247, -151, 11, 343, 71, 158, -173, -350, -52, -337, -209, 261, 37, -376, 112, -101, 118, 347, 408, 513, 282, -175, -250, -302, -20, 191, 263, -288, -573, -424, -530, 100, 29, -42, 50, 180]
769A80l5j37J19J10J92m95J41k80j43M16J50k19K16l51R9k18J91K95O9j53J6j1
791A52p4q0M5M30j91k21k29r5j36k02P40M9n38J70K64j84q0K57L37l3l12j18j0
814e9k11K53K12l20n9k34kN8K74K9L35m44L55j86M10k84K86j78l60K28j91J25
836C7M1m03K78l13R4J3k81L74N39l20L9j69N5j40J67K88k13j53K76k76k96K44
858a19P7q0NjN5k27K94k8J97J50m23l0J37J88k77K13J20l27j40K09j86K14J88
881B09j48Ml19K72O9K76j74q7j09j85J53l7J08K2K37m53O6l0J8K28j68K13j19
904D6j42O5J17J35j10M0j82K33l32J4K61P4l66K14j5l50L64k08K64n3l7m59K12
927b15l3J43J35K09k33j41m5J02J16K73j58j69J36l77K95l95M46o7%J16m09J10
$$ y = [180, 145, 8, 127, 237, 429, -66, 75, -205, -348, 68, 218, -1, 215, -136, -37, -255, -64, 231, 300, 147, 163, 152, 78, -2, 43, 473, 282, 61, -168, -263, -399, -601, 139, 188, -350, -180, 84, -100, -180, 77, 414, 381, 69, -49, -59, -270, -17, 195, -125, -184, -418, -420, -362, -88, -59, 276, -168, 187, 1, 411, 127, 413, 235, -125, 103, -88, 37, 78, -325, -47, -360, -266, -253, -534, -160, 379, 59, 98, -71, -16, -156, 11, 299, 86, -67, 209, -67, -363, -119, -42, -122, -117, -118, -63, -290, 4, -24, 173, 323, -100, -130, 7, 195, -82, 131, 251, -76, -216, -7, -193, 21, 209, 61, 65, -254, 18, 87, 363, 189, 102, -7, -192, -39, -76, 32, 54, 291, -162, -96, -126, -108, 120, -48, 165, 46, -96, -31, 86, 221, 111, 151, -31, 202, -130, -116, 145, 219, -147, 67, 52, -298, 66, -142, 122, 69, 32, -427, -215, -248, -105, 30, 239, 6, -135, -180, -78, 38, 311, 153, -16, 120, -257, 38, -357, 89, 22, 22, 138, -271, -161]
949a61N13OP4n6m36L8j40r0O01K3k47M5n62j85M07Q5lJ49K2j5j96J16J39K09l2
974C04J72n53j04J26%r3O7k5j54K56n21K39M39P0j1L7k57L9p5l4L34k61n3m9k91
999c98Q0J58L6l9K79j18j03J83K62j49K70l90J9k70J90l2l2N2k7l73mK98J57J03
1023A52K09j78k91K67k6K83m99P7P0j30l46J90j56K68K95j13n32M37n0L1J46J47
1045B51J18l43p7j1j59qK99k40J62mj54j35M73k3Rj40j3j9L7L7J31M4j05k54R
1070a15J75Kj89K02j68J75o5j29L03n16M14R9K0j80l24M21n22K43J03P3k12J32
1092e8L24n8J49k05nj52j74l1J10jj92L89r4j75JK41J77j77j18k9J40n7Q2k92
1116b05K52j33K74l22K11k21L08J24j45k06L5P4N8K67l59q7K28l15M9J77m68M65
$$ y = [-161, 352, 358, 432, 376, -60, -22, -162, -252, 349, 372, 125, 170, -392, -577, -170, -85, -88, 61, 83, 68, -128, -12, 127, 336, 304, 476, -77, -181, -55, -55, -148, -81, -106, -260, -4, -525, -286, 153, 223, 212, 249, -8, 31, -44, -78, 256, -5, -58, -107, -398, -318, -160, -124, -163, 116, -2, -105, 78, 340, 191, 461, 71, 90, -180, 10, -22, -54, -2, -29, -402, -406, -108, 49, 152, 361, 183, -108, 159, 133, 416, -83, -6, 64, -66, -412, -222, -378, -110, 185, 72, -460, -23, -73, -42, 104, 251, 369, 26, -51, -62, -221, -229, 70, -170, -8, -12, -166, -301, 172, 149, 158, 18, 5, -14, 23, 60, 191, 235, 130, -124, -115, 60, 62, -127, 75, -93, 82, 17, -112, 191, -325, 89, 188, 208, 28, -296, 125, -397, -154, -51, 22, -190, -58, 266, 208, 357, 152, 147, -5, -179, -210, -100, -101, -293, 96, 2, -173, -172, 69, 246, 69, -49, -78, 62, 5, 87, -205, 47, -86, 188, -134, 77, -144, 164, 288, 143, -63, -28, 46, 104, 371, 12, -75, 153, -162, -113, 64, -404, 61]
1138F1k23J48j59R9L41m9l90L61p4j6N8O1k28Nr8J23jL35m13P0R8m7k89q7N40
1163B26k56R4j89K11j20l23L96k8k9M4J81k54k5j01J44J2M8k17K22R0J2m13Q2
1186a93K2q2J28pL75l60J84O4k57J78m9j75K60j67n8J5j65L19Q9r6O8Nj4L4L5
1211A53J28l07L6j0oJ68p0l39JL07%j27R2p4J17J22j02j74k04K65K21r5o7k42
1235b07K29k09R1k30L82j93L87j20k34K38k18K17j66m4p2L86k90j20K01k87L11
1256E2k08K85R1N0m05N5J35j1P0p3j50J61j58J15L5K6J21l85J24J45R5l02K07
1279G5k30J7j27J54J35j92N42j65J05l20q0jJ78n8K02j77j56p9j7J57r4L60l07
1302g8J88j32j3J23j01j04L44j17j93M2L69j12k26o5L71l35j64N8J43K19l47K64
$$ y = [61, -162, -14, -173, -74, 267, 218, -172, 189, 115, 99, 157, 218, -10, -5, -103, 20, 19, 354, -59, 11, 109, 62, -227, -314, 226, -30, 64, -125, 86, -34, -357, 39, 11, -18, 26, 207, -47, -72, -173, -29, -17, 31, -186, 36, 126, 138, -275, -193, -171, -253, -125, -132, 243, -117, 67, 131, -126, 52, 3, -172, 88, -79, -137, -122, -287, 32, 121, 25, 93, 98, 84, 118, 153, 281, -26, 10, 0, -6, 162, 92, -247, -246, 61, 61, -66, 26, -48, 69, 191, 89, -85, -289, -24, 197, 102, 35, -207, 22, -187, -96, -326, 56, -137, 250, 130, -104, 134, -84, 133, -33, -77, -149, 237, -53, -173, 28, -259, 52, -156, 129, 220, 270, -135, -80, 55, 44, 114, 41, -109, 52, -106, 9, 44, 70, 191, -194, -70, 75, 170, -132, 75, -155, -138, -265, -111, 24, -168, 374, 209, 314, -6, -86, -87, 91, 33, 235, 58, -98, -177, -194, -37, -131, 229, -78, 110, -22, -35, 88, -13, -117, 227, 110, -83, -41, 328, 216, -10, -75, 296, -39, -203, -145, -2, 217, -130, 134]
1324A34j85m9K56n8J90M7j73n0k99M33l52r8K23l2j49m6J08P4L9j24M52j09l9
1347A93p6l75Q8m9J29l6L5j1K09k85J30n9M81k69J06q9JJ09P6n0j27k10j31K40
1371C0q2P5M6PJ6k11k5K29J11r1k20J70N0j28j66M18k59Q4l25M8k2O48m40k4K0
1396d1J28N0o3K30l99L47k88J14j23k55M00J86k63o6L1M1K66k47N4P5m04K13p3
1419h7q2m4O2M63k65kj3j48K90M5n1j59N3j13o7j70M57j24K1K5q0K25n19J91N07
1444D15j45k51J43J19l53J11j5n9O9n5N0o5K6J09j13n8j72J59J9K73k77J28OJ03
1468A67J42n24K54j36J08K8j19P7ll01K44J72q8j8J25l0j10L6j53J48j46J70J71
1491B14r3k61J49K50O5m49J20p6JJ2K81j77J24k74J50K9k76J01N0L01l76m2K70
$$ y = [134, -51, -100, 156, 98, 288, 335, 162, 112, -187, 246, -106, -204, 19, -13, -162, -208, -100, -26, 13, -111, 341, 232, 193, 117, -258, -170, -219, -90, -126, -91, -102, 107, -178, -48, -107, 374, 105, 211, 122, 123, 232, 308, 258, 131, -79, -210, 30, -52, 23, 69, 76, 92, -119, -144, 85, 196, 105, -115, 55, 105, -23, -189, 229, -30, 54, -271, -223, -245, 403, -37, -61, -41, 87, 137, 74, 304, -95, 252, -36, 78, -45, -300, 100, 286, 23, -43, -12, 29, 295, 48, 102, 177, -227, -14, -87, -169, -213, -151, 312, 47, 45, 32, -116, 174, 219, 168, 9, 62, -51, -118, -288, 169, 45, 66, 91, 11, 236, -283, -92, 415, 270, 19, 162, 281, -72, 39, 24, -35, 34, -21, 29, -36, -10, 99, -14, -72, -244, -85, -66, 207, -70, 58, 64, 167, 309, -215, 39, -97, 11, 39, -80, -3, -6, -307, -63, 109, 21, 3, 128, 98, -12, 24, -129, 19, -127, 43, 214, 121, -140, 9, 259, 324, -125, -5, -81, -80, -68, 213, 36, 160, -114, 36, 65, -211, -110, -60, 241, -135, -177, 93]
1514I3n1m8J43O6m7q2j31K52j54j25J92j79j0o8j6M42k77j57L5K10M1j43j14K88
1538A60j60k57M91l86P5Q4k09J76m8L45l02J09pq8j31J5m7M1O1L2Q1N8Pn59O46
1563A87K7k38L1n6o5o4J91m8L4N6J31j59j90J74l8j19J29o0K53j79K3LK06l90
1587a61L49o1n9j22J10R3J5k9j72R6P9l32j07L22J9k71J79nj57L02P0j43M7Q3
1611A45k37P6m9j9Q2n6mp9j27J89K8k7K45J86m04J30j28J88j7j72Q2L0n3j25J47
1636C1k84J27L63m33L44L0l47M25k10p1M9J35L6q4k28k2l0k4J11N8k39J70K85
1659A92n9k92J15O4k20N3K61p2l12M13j22R0J92l48O9J38j97j19J53k16K63j41
1681i5L56j12k79oK83k30JJ00j25K33J2k73J7L0K72m07L23j38J21N9j8o6R7k28
$$ y = [93, 42, -6, 137, 203, 156, 74, -57, 195, 41, -84, 108, -71, -81, -149, -165, 277, 0, -157, -122, 88, 129, -14, -128, 160, 0, -257, 234, -152, -77, 7, -202, -26, -74, 271, -31, 78, 71, -17, -148, -133, -180, -139, -78, -46, 35, 93, 100, -459, 187, 214, -24, 7, -49, -114, -178, 13, -35, -1, 55, 186, 27, -163, 11, -27, -146, -17, -77, 176, -3, 20, 23, 229, -161, 188, 127, 68, -54, 56, 149, 164, 135, -37, 59, 138, -194, -301, 21, 40, -231, -52, -57, -214, 88, 158, 15, 62, 145, -92, -16, -65, -84, -2, -58, -62, -141, -268, -79, -51, -78, 167, 353, -51, 79, -49, 139, 122, -50, 32, 62, 9, -116, 31, -253, -126, 237, -196, 148, 178, -169, 256, 46, -25, 24, 159, 195, 111, -117, -139, -169, -193, -82, -24, -263, -93, 192, 133, -159, -44, 20, -200, -147, 114, 42, -270, 143, 21, 111, 303, -45, 24, 162, -35, -154, -1, -217, 46, -95, 261, 149, -130, -136, 147, -83, -82, 18, -107, 126, 138, -135, -118, -88, 184, -223, 100, -38, 83, 142, 124, 58, 155, -73]
1705g3Q8J39j29j11p5K14l43M92j8j04j58l8K33j63K19j73k8M1r4J60j58K69j87
1728CJ92j59j13m8K20l46M22k63n0L70p3l46J68JL7j69K28j4j99K60rj68j3K6
1752d3mK09l32L29j71k09J10K17n8m30N66l8l06K88p7l56L55J34j00k05N1M31
1774C61m37J45pj98r8K31O2P7k52K98j70j65K14k49J35J57M1j2J08l84J58j38
1796a23Q9L6J47p3l20K48o9N1rj52K71J36m33M40l17N5J56j51K2J46j94J35r0
1819Ar0l9L61k77j88M28mJ20m94J73j12K63m80J90J48R0j41j53L02Mj10K6J28
1842A46p9K18l37J4m7J33m04N68l13J66j10J41j70K35L1j81o3m5j58M27Q2l17
1864f3J20j44J29j01J57l07L5O2J0M01m74K35O1k50J13K54P0k23m8m5k4K51q3
$$ y = [-73, 15, 154, 25, -86, -161, 53, -290, 202, 184, 80, -78, -116, 117, -46, 173, 0, -28, 13, -81, 79, -79, 190, 3, 195, 36, -77, -125, 95, -251, 171, -92, -142, 228, 155, -191, -23, -22, 15, -154, 74, 60, -139, 121, 112, -56, -69, -43, -47, 162, -170, 159, -12, -221, -111, 106, 48, -382, 184, 146, -160, 128, 51, -305, 50, 184, 84, -121, -70, 361, -76, 69, 62, -136, -234, -3, 59, 136, -116, 182, 12, -153, 61, -188, -53, 104, 145, 133, 241, -143, 15, -123, -34, 2, 149, 76, -244, 4, -65, -14, -23, -175, 96, 232, -201, 239, -78, -23, 133, -18, 4, 150, -44, 91, 1, -89, -128, 233, -44, -232, 196, 192, 312, -182, -9, -121, 142, -338, -148, 0, 90, -51, -204, 98, 102, -8, 18, 146, 67, 285, -52, -38, -85, 48, -356, 212, -101, 65, -45, 96, -74, 161, 192, 11, -52, -97, -255, 172, 254, -63, 57, -87, 42, -59, 98, -209, -174, -112, -102, 299, -175, 60, 121, -129, -16, 238, 308, 85, 37, -8, -32, 219, 136]
1887A36k8q1j79J10j86O02l51j98J59j42L6K32l42L8J36L35j55J65k56j02l67
1908d38L88m9J76p9O4q9J5j55K60k81J52J35l23J33J42J0k36K11j63PJ97n4Q2
1931A05j34J6k0J94j29Q2j46l6L25q6j09k18R8n1J21k14K64l3pk51K73M8k06L21
1955B07L7j22j96OO3p5o9K18o6p3M5j5L01m98J7K16K9n0j70J97N1m6J02j46j70
1980b07J40P9J73k15ml5J99n9J55l71J03q7K50j66R4p5L30m74R0J46p2o4O2L2
2004B4J21j43R6l30K98J70k48J91k29L39k66j43p7K53m2j45Q9K05M8k78j7J24
2026D0m1l84L22O1K18l83K87l16K49j53J67j18N1P2p9J41J9L6j47j09l0K94j04
2049I3J47m69J57L18k88K83j88p0JO5j61M28j74j9qk66K81k51L80k17Jo5o0k49
$$ y = [136, 108, 27, -152, -42, -228, 374, 23, -175, -16, -158, -122, 110, -232, -194, -58, 277, 122, 287, 31, -71, -438, -50, -99, 77, -2, 62, -27, -12, -167, 93, -188, -36, 99, -224, -91, 51, 61, -175, 36, -127, -120, 77, 23, 105, -29, -13, -33, 161, 32, 114, -32, -68, 257, 171, 62, -156, -58, -109, 12, -202, 62, 29, 22, -229, 44, 92, -114, 207, 244, 122, -74, -68, -5, -80, -149, 69, 3, -70, -25, -40, 261, -237, -220, -4, 25, -25, -195, 2, 53, 7, 109, -37, -207, -67, 12, 185, -30, -34, -69, 130, 71, 226, -145, -42, -129, 121, -45, 49, -26, 304, -170, -80, 66, -6, -70, -8, 24, 145, 2, 98, -232, 66, 236, -12, 179, -50, 289, 23, -120, -197, 56, 14, -131, -42, 163, 211, -67, -84, 40, -1, -385, -63, -2, 216, -167, 120, -196, 53, -100, 67, -51, 0, 72, -7, 134, 153, 189, 42, -67, -97, 197, 93, 240, -229, -72, 246, -42, 241, 53, -17, -16, 49, -112, 316, 142, 123, 115, -151, 130, -121, 259, 42, 43, -22, -82, -331]
2073c31L46k1q1N0k37j5M82n0j23R0j90j02O0j2K43j55J18J57j15j31RJ45j20
2096A7l33M18k24l6K88Q1j39k56j3kJ23q5O7J39j17J53j84J44k44J62K1J40j70
2119e0J73j46Q7j08J23K22j15J5l29l3L94k72n2J27J62k83j25m8L83q8j04J90
2141A23j21j05q6J51J86j1l06K08j51J3O58m68j60L7P3j36j29j71N17%q8J03l3
2164A04J14m63L35J4M7r8J37l37J33R2J45j07n9J52j94j39K10p6N3k2j43J32j59
2187a29J3J32N6k10o9P8J90L3j62J70k9l29L31L9j85PJ23P4l59K39J37j65J5J1
2211A1P6p6j46J86j78J77j0k61M28l30K92q6k60K95l12m2L92r1P9k03j47P6p8
2234b08K95KL5j79J5L9j03K24j76K9q7P2O2j16M71m36L7k19M71k1o1n3k83J60
$$ y = [-331, 15, -6, -87, -37, -274, -289, 193, 143, 20, 110, -80, -182, -122, -134, 109, -46, 72, 229, 114, -17, -8, 137, 17, -316, 102, -122, -158, 130, 211, 72, -184, -197, -199, -76, -161, -94, 45, -72, 81, -103, 41, -203, -41, -20, 120, -50, 123, -23, 64, -44, 79, 301, 186, 201, -128, -161, 233, -39, -91, 36, 198, -85, -210, -258, 125, 37, -67, 123, 2, -103, -189, -38, 148, 137, -169, 39, -112, -99, 559, 91, -69, -32, 41, -95, -224, -395, 122, 122, 34, 137, 104, 218, -245, 90, 104, 151, 53, 190, -147, -14, 78, 223, 116, 57, 209, 15, -124, 86, 10, 63, 41, -102, 30, -129, -116, 16, 72, -138, -207, -129, 61, 94, -68, 102, 73, -256, 75, 114, -71, -64, 59, 133, -226, 13, 150, -15, 0, 11, 87, 11, -135, 51, -127, 50, 40, -221, 207, -123, 169, 83, -177, 118, -194, -236, 156, 65, 144, -59, -206, -130, -208, 87, 89, 124, -55, -40, -1, -104, 120, -56, -27, -114, -42, 20, -96, 375, -61, -24, -243, 228, 207, 146, 93, -190, -30]
2258c0K05J25m38K39l34K72k35L83r9j52J87j14MK22k10j56L16j71k15K47J16
2279A62j46j03K8K34k57R3j0O8j00m0m0J12O1K36j41j59K63l08M8K72j40j8K00
2302C15k58m35L06Q5l13L84j75K49k69K77j14j73K50k07K51j21J09P4l46K7J75
2323I1P4j52j06N4k7k10P4M13l27K52j49l6L9J22j26j45J43q3j9P0k3j50M3P8
2347a00J29l2k6J76Nk18J87P0k23M4j22J79l44M16j96K50r2k87K00j04J00r0M67
2370C89l03k48K96m5k03K68j33p2J40j34LP9K3j21j15N1Jj9N4N6J05n3k29J55
2394e5R3kk17k14K81k3J16j7j60l7L75j8j42jn0o6O2L9J34p3l4o3R6j52P8j66
2420b16M24k0j37M9M7J12m11J43Q4Q4k67R9K57l16j62j0J80j5P3P8r4Q5j10kl4
$$ y = [-30, 175, 300, -138, 101, -233, 39, -196, 187, 88, -64, 123, 9, 13, 235, 25, -131, 185, 14, -201, 46, 162, 16, -87, -59, 175, -82, 11, 1, 69, -31, -71, -111, 1, 62, 298, 157, -2, 261, -47, 1, 273, 133, 115, 315, 57, -378, -72, 13, -300, 84, -91, 158, -111, 166, 52, -121, 129, -78, 173, 52, 161, 235, -111, -84, 91, 165, 13, -93, -39, -66, -276, -202, 211, -116, 136, -13, -49, -10, 112, -14, -159, -16, -99, -118, -48, -71, -221, -178, -100, 29, -3, -29, 147, 152, -66, 121, 191, -32, 12, -110, 69, -275, 141, -55, 195, 103, -184, 16, -88, 12, -78, 389, 86, -162, 134, 89, -114, 154, 21, -51, 89, -45, -42, 37, 60, -61, -176, -125, -124, -143, -89, -33, 72, 19, -210, -55, 38, 36, -181, -395, -114, -137, -21, -38, -198, -235, 140, 122, -20, -21, -71, -137, -75, -36, 98, 25, -9, -72, 24, -128, -50, -216, 208, 188, 51, 100, 147, 259, -152, -9, 75, 159, -108, -9, 248, -68, -230, -240, -60, -75, -2, 76, -18, 67, -43, -45, -79]
2445g9J13K0m8m4j17M05k96Q7K09q7m30L72l44K67K78o00J73L78p9k10J8o3M2
2468c5J26q0q0M0n1L33l74K71j09L08k72L5k5j96O9j33J48j12K82j75k61M09j54
2491c6j45K00K03j36l7k00p9K77l3o2pj4k93J17M62l91k21K72J9j05K49j78L9
2514i9K06k04j1Q4J63l82L06J22k60j24K39Q3k51J36N2l7K0j42n8J51k92J43J40
2537a5j48P0j88J78J35k20J61K31j39rj0J9q6m4Q2p4N9M6j42J18k2Q2J67j60l16
2562b25M53j80J43k30j6K68k38M2j24K77K4j06j26J22k06L19p3k31J94j23L5q4
2584h5N9L2j34K37K9j71L9J0K05l85m9M9K12J03j96K1M4PQ1j46N0j54J15L5R0
2609I8m2k83L42J68m96K00LJ62j72O2M2P1l50j2L14o7k66K40l3nK99l13K68l41
$$ y = [-79, 34, 54, 6, -38, -155, 250, -46, 41, 250, 163, -267, 105, -239, 28, 306, -294, -121, 257, 178, -32, -14, -77, -35, 91, 11, -69, -29, -80, 253, -121, 150, 41, 349, 77, 112, 87, -109, -40, -173, -25, -137, 145, -30, -291, 118, -36, -181, 19, 222, 86, 49, -151, -230, 47, 14, -48, -55, -69, -362, -245, 217, -174, -395, -123, -104, -209, 40, -138, -99, 107, -97, -108, -24, 139, -243, 63, 185, -75, -199, 40, 123, -128, 8, 60, 23, 43, -99, -157, -6, -298, -155, -15, -163, -93, -281, -103, 32, -188, -27, 204, 65, 56, 46, 65, -21, -65, 17, -57, 2, 48, -94, 24, 2, 84, 251, 91, -225, 228, 48, 191, -39, -55, 213, -25, 17, -107, 170, 194, 88, -38, 84, -122, 197, 124, -107, 87, -36, -1, -85, -26, 6, -128, 109, 138, -33, 6, 16, 221, -164, -213, -164, 48, 151, -45, -24, 20, 27, 108, -38, 12, -142, -27, 8, 98, 56, -227, 115, 283, -213, -13, -10, 152, -20, 42, 84, 155, -195, -207, 107, 40, -226, 14, -19, -24, 275, -38, 230, -111]
2633a11q4M5K99m5L9j36q0J7P1K2J69k02p9R9L6j84J75j0j48J87k37K63k97R0
2657a01K26k94Q1rJ46K30j58O1M2k58J5k48L50k1K17l85m8K48k13J26k05J86J89
2680A77k56PQ4K6J91l37O2j96K02J3Rp4J24j30J64k67J82K16m40N02Rm34L57k46
2704e5k6K94m08K19l30M30k8k03K22j00m02P35k74k59J25k22K48k7J96O8k47P5
2726C1k0J32k04k38K32J92j18J08k93J15L9k32J71p6j92M08J54o6k51J60j14P2
2748A0k3m6L17k20j08j8R3q9N8K01k41N3J92n17J12J36nL4K76k27j16K42J2r2
2772C4K02l44k1K83j96J21n3J70k91m5Q1K3j49m0J18J39kJ30j70k9q6J62l55L40
2796B2j30PJ43NR1k89K15N4j18k28K25l0J72k11q4K42j35M7k22L27j85j00L34
$$ y = [-111, -195, -150, 149, 104, 143, 7, -73, -56, 15, 37, 206, 4, -75, 24, 60, -124, 51, 41, -107, 80, -157, 106, -191, -101, 125, -169, -88, -97, 49, 279, 121, 182, 224, -34, -19, -267, 83, 62, 279, -106, -154, 94, -119, 7, -198, -12, 177, -79, -72, 12, 38, 229, -108, -46, -242, -40, -27, -18, -92, 32, -98, 66, -201, -19, 197, -243, 259, 268, -166, 191, -55, -81, 213, -195, 24, -306, 124, 96, -107, 115, 15, -387, 348, 74, -185, -60, -282, -34, -61, 135, 203, -44, 31, 11, 143, -61, -299, -67, 125, 7, 115, -178, -63, -24, -256, -85, -161, -353, 55, 209, 143, -108, 52, -62, 10, -13, -59, 258, 38, -70, -88, 5, -84, -26, 175, -66, -13, 179, -338, -226, -90, -95, -61, 215, -12, -128, 114, 126, 34, 236, -108, -129, 154, -42, 79, 26, 196, -95, -140, -59, -36, -185, -225, -107, 32, 30, 160, -10, -39, -125, 37, -318, 22, -108, -101, 42, 47, 138, -151, 64, 118, 0, -228, -3, -33, 139, -72, -156, 86, -49, -2, -224, 103, -82, -182, 152]
2819A52k26j32j48M13k82J57Q2j7q3J67l25J79n2J03r5m0L25r6j13j61P2K72j21
2842C1R7r7lK0j96K56Kk01K41o5q7j52K77l05M36n09P9J75N5O3k92L12l81J66
2866g8M8J58q0k04j30L85j83J42K33l51K36j98q8K73k78j46K61j61J32K85l73
2887a17J30q0L04mj68j51J26K2m2M5Q1l18K88L19m03L65m04j31J89j6q1K5J14
2910I3k97K1K34o2M4J97L2j82J9k40P4r1Q7J49p2p1j67L33%l43K0J73J78k05J51
2935G5L7l81j4L75j27n3o0Q7n3Q2J39N7n9l70q7J50P6K84n9J7m55M07k33j09M35
2960A61m78L30K24k61J10m54L08K39L1k51q0J52jj35OM9J37l31L30k09PO5M3k25
2984b33L28k46J70J51k04M5j06kmQ4J63m8k5l33M46p6o3o4M7OR4m7k00j2p4L53
$$ y = [152, -74, -206, -354, 59, -223, -66, 16, -1, -84, 83, -242, -63, -115, -12, -107, -147, 178, 82, -31, -192, -120, 152, 31, 128, 31, 28, 48, -148, 108, 110, -91, 150, 85, -2, -154, 123, -182, 254, -255, -176, -1, 54, 117, -175, 137, -244, -78, -30, 128, 48, -156, -286, 99, -84, 58, 291, -60, 176, -22, -110, 163, -115, -261, 0, -161, -29, 256, -117, 13, -67, 237, 233, 65, -86, 40, 62, 20, 65, 146, -172, 116, 435, 32, 397, -7, -138, 51, 35, -46, -21, 93, -204, -183, 51, -11, 33, 230, 262, 80, 99, -141, -67, -158, -71, 78, 6, -65, -232, 101, 101, -242, -222, -49, 129, -76, 75, 112, -269, -283, 92, -35, -88, -148, -61, -114, -32, 107, 164, 105, -265, -352, -202, -126, 158, 99, 116, -339, 68, -165, -274, 161, -317, 13, 237, -24, 86, -368, -60, 179, 210, -41, -121, 31, 30, -105, -99, -50, 87, -244, 86, -123, -116, -51, -8, -233, 95, -151, 19, 170, -34, 11, -95, -97, -101, -17, 146, 98, 73, -260, 186, 110, 47, -17, 30, 36, 130, 83, -117, -129, -203, 150]
3010A50j09o5Q9j75J43j38J01m8J34m8j8p0K17j10L7j92J88J09k71J28j96K27
3032H3K5k68Q8J74Rm90K61J17O3j58K8j0m4J05Q9l75K73J6mP9q6L4k32nK83JJ75
3059B31j27p9Rl9p7L31nm03J40o8J3J13q8j22Q2q2O4k8J79j17l4O8K15M8k91L72
3085C05k20j61j16j82M68k41J23R0K8j30J55j65%J13l02K25J77pj21k17K18O9
3107A09j39q9J31O3K1j47J4J07k22L39m31Q4O85n80N8J56%k22N0J08j4k05K16
3130I2j03p5J7O3l14L66N2j50K5j72J80Q8k06J96j33J61j86K70j12m8R9j73K3
3153d0r8J95j15J90K08o00M07j47M8K20l46q8K56o6p7J34l56L64m42L91m3l4j21
3176a60J88j13o7K64K52k35q1l05L90j89N6RP6j31K70j92J82j36j16k0O9J56k76
$$ y = [150, 41, -24, 65, -110, 33, -105, -4, -52, 82, 34, 16, -54, 163, 53, 90, -102, 86, 195, -76, 52, -144, 83, 108, -160, -72, 102, 111, -379, -118, -1, 62, -96, -68, -78, -122, -17, 72, -303, -30, -14, -18, 61, -25, 9, -223, -228, 55, 56, 231, 104, 25, 34, -5, -82, 249, 244, -159, -19, -87, -74, 39, -49, -171, -89, -171, -107, -135, 44, -73, -107, -39, 176, 224, -67, 305, 85, -76, -192, -374, 94, -147, -24, 66, 94, -36, 119, -46, -46, 67, -235, -10, 167, 160, 39, -178, 40, 109, -30, -119, 12, 75, 96, -51, -37, 70, -152, 187, -244, -160, 525, -55, 3, 159, 159, -63, -13, 95, 81, -124, 92, -11, -86, -69, -6, -320, 46, 98, -52, -27, -199, -19, 69, -137, 59, -74, 87, -99, 171, 59, 11, 110, -63, -40, -138, 57, -58, 132, 340, -260, 147, 0, 48, 268, -78, -166, 90, 24, -53, 81, -275, 89, -353, 38, -5, -39, -160, 28, -85, -152, 112, 364, 129, 48, -257, 133, -56, 0, 9, 85, -46, 224, 32, 214, 78, -38, -58, 11, 167, -109]
3199a09J57j58L60l84J69p8J41j16K45l27K14l1k8J36k89k6K4L1k17L98j51J63
3221A24l98J94K04k96K63P9k68M5M44l84o2J50j82J30j31j88K90j02j51L58j7
3242A02j36Q6N3j24L2j83J66j79M00nk2j54l1M4j95J77l37M45k21q3m4P7Q1j50
3266b01M58j16k0j17K54l09j02K7L81j84k03J24%J94l14p0J96j35J84k2J20N9
3288B04j34P5k06q4O1Q8k38N16k29Q3j11j99o5K39J9q2PJ28J00O6j50k21K29k58
3312a62J42L28n20L22k82J34j94J77j15J41J14j98J95k2K10l73J05k26K85j53
3332i2O5P4k11Q1R5K99l16J17j31j53q1P8M74j28l01O4J38j63K21j07K37q3l55
3355a78K15j30J10j0PL4j86N9K06nj87L49l74P9J12J03j97j86lK39j80J77j91
$$ y = [-109, 48, -110, 250, -134, 35, -43, 98, -18, 227, -100, 114, 83, 55, 191, -98, -124, -100, -69, -286, 112, -39, 124, -274, -80, 124, -172, 91, 170, -98, -53, 391, 7, -55, 95, -87, 43, -88, -276, 14, -88, -239, 119, 102, -34, 52, 105, -19, 13, -170, -4, -183, 217, 212, 190, 36, 5, 49, -146, 31, -306, 139, -82, -165, -209, -132, -51, -201, 257, 141, 121, 4, 258, -51, -153, -126, 255, 71, -132, -8, -8, 186, -128, -198, -2, -137, 47, 25, 145, 204, 70, 145, -61, -145, -84, 4, -234, 282, 53, 136, 25, -174, -239, 0, 19, -63, -56, 72, 172, 238, 88, -133, 96, -162, -20, 308, -212, 110, -172, -38, -232, -55, -170, -29, 85, -113, 82, 60, 270, -103, 2, -224, 61, -92, -27, 47, -164, -83, 12, 311, -5, 112, -19, -172, -253, -175, 299, 171, -130, -66, 72, -91, 130, 23, 260, 177, -178, 37, -93, 17, 7, 14, 48, -138, -79, 127, 122, -65, 284, -90, -11, 101, 204, 7, -179, -182, 57, -123, 54, -137]
3378a37N3L96m03J89j24j79K93j44r6K56r0Q3j28l7K34k36j26O5L08k01k33L16
3400E9j15Q3j20n4q8J72J42j85R3kj95J63J3O3j56J98K2k72J55j78J90J26n6j
3424E7k21l4K94k9j31L85m22L41l69L09qj97k08J75K28r1j32L9o1L4p6J90k55
3447a82K53r3P3m5O5j29MK72l00M1R7k13J28M9m0o9R5l5j91L08l47K5k9J70J79
3472H6n4l5o1J95l77J49L45m42L40j72o3n3K73n5j77m5R7O1l9K07k32l7K36nj21
3497B1k1p1J84l20J88K33m24K04k20L22m7q8n2J74LJ43l33n0M47l76K2K07l47
3520b01J73q8NJ58l6P1k87K37o8L04k77Mk7q7Q4j04J81l6j3M3J9k9j93K87j94
3545g4n7J37m1J56j08K01l25lj19K79l89M60L2n37L60J1J9M7k23K34l6j80k1L59
$$ y = [-137, -84, 312, -91, 98, -26, -205, 88, -56, -152, 104, 14, 97, -31, -68, 166, -70, -196, -131, 177, -24, -257, 59, -56, 27, -93, -147, -235, -63, 79, -106, -13, -15, -210, -47, -34, 29, -127, 71, 93, -179, -24, -202, -12, 114, 58, 57, -164, -198, 96, 67, -64, 321, -101, 240, -129, 180, 172, -25, -233, -58, 170, 79, -53, -14, -75, -41, -117, 73, -182, 71, -22, 51, 6, 71, -58, -54, 218, -82, -41, 56, -157, -29, 20, -20, -89, 6, -29, -220, 88, -259, -234, -263, -93, 86, 32, -3, -64, 131, -246, -97, 248, -194, 146, -26, -89, -142, 131, 76, -101, -146, -49, 12, -27, 180, -52, -89, 147, 142, 21, 0, -71, 113, -207, -19, 214, -210, -6, -226, 96, 49, -39, -91, 83, 86, 229, -104, -154, 293, -83, -61, 146, -201, -28, -116, -111, 47, 11, 82, -205, 32, -36, 268, -9, -5, -32, -119, -35, -139, 42, 6, -7, 36, 55, 26, -167, 120, -74, -131, 6, -35, 121, 13, 214, -111, -114, -233, 46, -343, 117, 149, -388, -28, -17, 2, 49, -174, 60, 24, -156, -177, 182]
3569A82l12k3J91k40R7J90K9k1k5J57R9k41k45K65p9k11L37j00j77K19n4j97K60
3592A01k90K91j82N8K36j09j96J57j64j92L97p6j04K2N9M8k7P3k69m7L52k42K96
3615A92k51K24r9m1J9J67l9k43J84k02n5j60L13J61M0j98j63j14K10K36r2l77
3637b88K16J78l4j00K4k29K58j7j9J36j45Qj28O2L05N6j97k19J58P4K5j21j03
3660a00Q6J24k4nj91k3M39k58j74J45O8j14J58ok19J23L6j85R2J32l7m06L61R
3684C1P1l1P0K1l37J74J50j21p0k9N2J75j44m4J50q2P3j77J66k35K37r7J05k9
3708G9M7k36J81K47j96l97K42J72l34K00j1o8KQ6j01j19J40n3R1Pk40L15R3k85
3732a38r7M12l3k55J22K21j36l39L30j7k72K10N2p5J40k55J34n1l4r8K67k76q8
$$ y = [182, -130, -153, 38, -202, -105, 85, 114, 93, 68, 225, 324, 83, -162, 103, 24, -187, 150, 50, -127, 92, 38, -159, 101, -189, 102, -80, -22, 214, 105, -91, 66, -98, -290, 107, 31, -73, -51, 8, 56, 29, 102, -167, -214, 138, -104, 192, -59, 165, 66, 25, 44, 211, 172, -71, 113, -89, -144, -304, 9, 170, 210, 12, -151, -265, -55, 181, 89, -288, -72, 106, 72, -28, -4, -233, 25, 8, -11, 125, -20, -12, -140, -78, 227, 283, 86, -133, 25, 99, 124, 3, -100, -14, 110, 86, 81, -110, -133, 306, 48, -126, 19, 87, -27, 131, 125, -94, 29, 65, -120, -28, 104, 67, -339, 22, 31, 102, 71, 141, 162, -175, -1, 149, 28, -42, -71, -19, 156, 12, -32, 118, 36, 109, -68, 98, -137, 100, 3, 108, 79, 126, -110, 71, 318, 122, -275, -33, 139, -195, 5, -6, -74, -72, 14, -87, -206, -66, -119, -28, -21, -261, 54, 147, -138, -235, 177, 144, -111, 11, 232, 96, -243, 87, 70, -202, 8, 60, -15, 125, -130, 4, -47, -81, -179, 88, -188, -276]
3755b76M03J30m26J11q4K53K01l86j24L06o5k89L50L2j97o8M25k41Ok0j2K36n55
3778b90L20j7K73l66n4jO0P2K84l92J01j92L18j8K1p7K62k24j04J27k64K53J89
3801B81m02J57n9K5q7j13M11j88m06M61l10M37k46k07K16om7l3n8L71k68K05j29
3824EK8K8p7n7K39k16r5O3K23k40N5K15k42j6K8K25k33oN3K9p2J90o7O9m1k33
3850a45L94l76L34j36l97M8J15N5K0K13k36M4K33N0l21K96l4k83J46Q5k72j60
3872c27K53J09rq4p4L51k00K4k24M5j24M87j63r4Q5L7k00n0M52l06K2L2j54O8
3896d4K14o6k67Q3L9J71K05k70j5j37K87k21k9o0K75k96K13J54p2k62L40l49J4
3919i3K81k22J9Q5o2j2O7R6j5k77J83l25M49p3j1k06K75l52L25j78k39L51P7k84
$$ y = [-276, 127, 257, -169, -58, -142, 111, 312, -74, -198, 108, 43, -246, 104, 136, -61, -129, 296, 55, 61, 41, 29, 265, -290, 30, 13, 286, -80, -134, -135, -75, -3, 281, -111, -10, -202, 116, 98, 119, 42, 304, 80, -24, 103, -161, 92, 281, -121, 36, -23, 2, -85, -198, 213, 25, -381, 80, -230, 207, -39, -246, -30, -36, -83, -116, -174, 197, -71, 134, 5, 33, 61, -16, -73, 166, -50, -145, -82, 141, -99, -44, 171, -71, -87, -59, 166, -67, -73, -20, 9, -63, 127, 60, 129, 88, -145, 249, -127, 207, 71, -326, -278, -163, -108, -88, 125, -111, -67, 166, 216, -105, 191, 157, -126, 20, 105, -167, -327, -74, 35, 26, -58, -132, 219, 19, 43, -181, -136, -260, 227, 64, -30, 55, 92, -108, -158, 294, -12, 10, 42, -112, -44, 170, 104, -163, -80, -41, 130, 335, 65, 50, -87, 200, -21, -50, -110, 165, -131, 82, 236, 164, -98, 242, -107, -93, 188, -34, -15, 70, 8, -4, 63, 159, 144, -133, 50, -275, 174, 101, 90, -116, 159, -193, 132, -46, -285, 66, 143, -141]
3943a41J08r9L14n5j67J3J4J77j77j24R2k2q2L07N0j45q8k4J75l60L60j31J7J03
3967A15J71m83MJ37O2J87j48K6j02J43m4j87J61R1k80J20Q9j61N3J93q7j02n9
3990a01K61J5J48m95K63j60j25J35o3J52Ol46M92k17p3o4J23J19O6l4k20K01k13
4013a30O9K06j99L0K60k18N4j06K5O7L10k44q3k31K96k02J79J58k02j18j2M1J70
4036A20J12j43j78J96j8o7J53k80J61J34k71k09K76m6J7j52j4M58l67K87j38k03
4058a72K15K58n41L20J0k13P5J4j24K12j03K49pk79mO6J02J5K3k28J51k79M25
4081A85j94K2L5j77k57L57j56j60R9L30P0J14l41K39k21O7om4j45L9J30p1K40
4104A55o7Rk14K19q6j79k34L81J9j02J29k7j36J44j07O5j28J16m3J68%r7o0L0
$$ y = [-141, -33, -132, 182, 127, -40, -27, -13, 164, -13, -137, -45, -67, -149, 158, 208, 63, -25, -49, 126, -234, 126, -5, 12, 115, 286, -197, -193, -56, 6, 193, 45, 71, -31, 112, 68, -119, 42, 133, -147, -27, 62, -99, -46, 147, 60, -42, -101, 160, 175, 323, -172, 91, -69, -194, -59, -122, 30, 36, -310, 182, -35, -108, -172, -49, 70, 136, 102, -118, 83, -130, -61, 145, -54, -24, 236, 18, 72, -34, -9, 58, 368, 124, 41, -190, 106, -96, 83, 241, 39, -79, -91, -50, 120, 232, 89, -89, 107, 89, 22, 175, -105, 56, 190, -81, -290, -14, -60, -43, -195, -209, 249, -118, 169, 31, -172, 43, 301, -240, 80, 90, -123, -48, -34, -158, 54, -49, 200, 193, -86, -90, -24, 78, 93, 116, -112, 39, -240, 185, -9, 13, 48, -129, -386, -29, -185, -345, -246, 84, 154, 268, -73, 166, -55, 12, 6, -38, -183, -144, -14, -85, 155, 88, 97, -117, 102, 16, -163, -397, -16, 3, -99, 30, 3, -133, 11, -96, -31, -159, -43, -86, 82, 82, -15, -75, -45]
4128d5L2L2l7j28L04m46Q8J55q8J18J79j95n0j04J05L12k81kJ81j53r1M3K54l49
4152a66R2J70k9j60n1QK00r2PJ74k27J21m6jj33K29M6j24j23K64N9j3j34K49l38
4177a8K7q2L90l01k45J68M6n6NL07j05k36L6o6J61k46J63M4R8j63R7J16l04L07
4201A43p7Q4j41J25O8l47RN9P3j02k6K72k67J74j00L2OO9j77k63M38j79K40j57
4225d4O1m7j13o9K01rl6j2j71J23NJ22K6O5K07n27J63R9l15J14J71J62k32K5J36
4250A05n3K53k10M5O5Jk52J69k29K6J43k33M51k57J31j87k03K68n0k87K57J81
4272A34r8o6K93j69q7K0J95l55j20L53j8l8J42j41j91J26P7l26K26M0Nk48J0K21
4296a5J31j33J27k90L04l46M4J79j23j9K26l9R4J20k90P9Q9k12J9Po1J44J78k60
$$ y = [-45, -13, 19, -18, -146, 158, -288, -200, -45, -133, -15, 164, -31, -81, -185, -80, 232, -49, -51, 130, -23, -114, -71, 183, -166, -74, 96, 67, -93, -144, -136, 64, -28, -21, 153, -74, 47, 1, 0, -133, 96, 142, 18, -105, 159, 218, 205, 71, 320, -18, 9, -73, 317, 16, -229, -61, -15, -71, -66, 241, 136, -100, -64, -130, 31, -215, -52, -8, 90, -73, 24, 140, -164, 143, 66, 150, 9, 134, 202, -145, -136, -77, -4, -106, -132, 140, -127, 47, -53, -21, -15, 54, -123, -386, 52, -127, 113, -44, 17, -30, -143, -212, -11, -20, -56, -68, -239, -116, -111, 11, 37, 102, 309, -218, -55, 44, -271, -157, 14, 176, -56, -31, 105, 52, 305, 95, 140, 205, 206, -46, 123, -106, -80, 63, -170, 281, 24, 155, -32, -235, 33, -17, -304, -47, 134, 36, -30, 263, 94, 7, 27, 222, -133, -253, 100, 82, 44, 186, 45, -146, -20, 57, -269, -43, -3, 2, -246, -236, -15, 116, -17, 110, -180, 124, -222, -178, 1, -122, -141, 85, 46, 140, 260, -30, 49, 138, -74, -55, -48, -109, 35, 213, -47]
4320d7k0J40q8K20k45L05j48nj4j7j4j29k1K14j50Q7L2J36m54R7K43K0j72j35
4344a65K01j91L13Jj19R7J3J00j79n2N3M0k06P2lj15M3l2j2j46L01j40K16q1P7
4369H6k65J18L4J9M7j06L86k62l22R6L04j92l8R4k34L91p8q6JL28m35M5rK72j74
4394B0k10L9Q0k4K87q0k51K51l01N3J46qK82j05m28K36J12J93l39k39L52k55n
4417a94J14J04Nk4Q6K3m5q8k9j28K36J14k06L6j98M46l71L15l25J59N0k24J84
4440D0r9k46O0L01O0J20j65m6j19j80nK18J2j86R4L33q2J98l98P6oJ02P4l13J84
4465B7k31L40j01l31J90J54NJ46j74K45k85j61J91j44K72k80J72k5j18J43J41
4486A76j19r8j10J13j4L5J01q0n2J47k3J35j70O6K01j91J0J21j05%j5P4k29p2
$$ y = [-47, -67, 73, -15, 205, -40, 265, 117, 112, 98, 81, 67, -62, -83, 131, -19, 68, 100, 236, -218, -121, 122, 142, -30, -165, 36, -155, 158, 159, 40, 137, 150, 250, 71, 19, 72, 112, -94, -22, -25, -140, -97, -129, -141, -287, 14, -126, 90, 9, 86, -179, -61, -27, -8, 39, -67, 319, 57, -265, -169, 135, -57, -95, -1, -235, 156, 78, -8, -7, 321, -114, -69, -78, 194, 20, -190, -151, -71, -95, 192, 112, -139, 112, -189, -136, 10, 2, 284, 179, -249, -13, 99, 292, -47, -286, 66, -189, -194, -80, 24, 29, 5, 91, 114, 69, -19, -48, -176, 60, 174, -32, 4, -194, 252, -119, 196, -129, 30, 80, -144, 40, -59, -305, -245, 56, 116, 236, 71, 25, -94, -274, -279, -61, -49, -235, -141, 192, 110, 308, -90, -14, -20, 82, 156, -157, 27, -204, 136, 35, -296, -106, 48, 53, 199, 25, 270, -15, -176, 15, -129, 143, -137, 35, 10, -108, 35, 176, 57, -41, -151, -38, -52, -17, 84, 4, -48, 99, 76, 211, 41, 107, 308, 117, 127, 248, 143, 143, 128, 202, -27, -99]
4510i9J40l47L01L19k90j80K27J98k82m7l6j71J47K51O5J3j72j67m6J38O2M8j9
4533E3J62m37L67k68m1K43QM0m60M28q8N6k6j09n0j69J50k15Q7L98j09J1o8k03
4557b40L31p5L8J67j42q4p8L09m24O2L02nj22j6k04L2M69p3m72J84M4P3l1M9K4
4582A18k41j59M88j33l5Q0OO5j93N2J36j60k37L17j81K99k57M7L26j86l96p0M1
4605b73L58j66K84l47J86JJ18J29j62L09m68P7j53L0N9J98k53M2o1L53l40q6L3
4628a32K23j24j37K42j32J68j64J14J08k56k02K89R9j50j35K48k5n0N5j52J17
4649Dl3O5J81m1n0j09M7k73K08r8K4K50l58J84J14j10J14j23k5m52O50k69R6o0
4673f4n2L25k82k4Q8j58J01M0rJ04l11M71j19N0k66M6N9K15r4l07M19k46K6OK0
$$ y = [-99, 41, -306, -5, 314, 24, -156, 71, 269, -13, -60, -96, -267, -120, 131, 196, 209, 37, -130, -176, -38, 24, 72, 53, 215, -222, 145, -123, -164, 79, 87, 127, -333, 95, 7, 63, 37, -72, -122, -291, -141, -356, -269, 129, 20, 31, -37, -240, 91, 16, 54, 221, 79, -5, -83, 226, -198, -136, 166, 161, 39, 23, -181, -149, 320, 247, -225, -41, 3, 76, 45, 94, 118, -123, -282, 206, 73, 38, 118, 124, 189, -4, 48, 184, 24, -213, 104, -77, 222, -35, 12, 338, 152, -244, -314, -273, 85, -81, 203, -144, 42, 43, 161, 290, 128, 437, -31, 46, -107, -77, -18, 180, -73, -31, -92, 261, -79, -165, -132, 91, -33, -170, 72, -60, 108, -56, 58, 166, -90, -292, -3, 96, -54, -189, 59, 34, -16, 39, -113, 4, -29, 36, 217, 176, 126, 17, 64, -209, -1, -99, -75, 175, -183, 1, 115, 5, 119, -4, -29, -481, 169, -100, -4, -64, -116, 209, -73, -97, -9, -167, -66, -26, -35, 69, -242, 229, 110, 160, -106, -60, -1, 214, 120, -187, 232, -14, 12, 18, 38]
4698C8K35k25q1K96o3l95J83O8l7L7N1j41J77j02k9LM0j58J6j58J49J15kJ4J03
4723A34k14K69j57r5L43r6j39L45m53K92j55oj32r3K14J15k47O1k9J50j11Pl6
4746c3K1j5K18n6j75J50R2q3j48J0j23%J60P7j52j53M40k79l0k3N8J04k56L8O5
4771i3K51n2r0J6J92k19k3J41K1j56j45O9p0j6P6Q7J16j07m1J6j31J20k22K32
4795b8J88m26K06N3l2J1K5k52J32K36J11k29j41KJ7L47l05N5K7J9J29l41M52l18
4819f2J1O9MQP2j0k32K69k27K70p3k27K92l99M51k37j9P9R1Q9l42J52r3K31j62
4844Ej87K39j09J88j86L61l87%J73m6M9m17M80j02k3J2P9o5nj16J96J13l13K7
4868c4j03L02k22k4q9J66J05m7k37K73j58p2J42nQ4l06R9l9Q5L8Kj65K26N2k0
$$ y = [38, 273, 48, -33, 263, 200, -195, -12, 56, 19, 56, 107, -34, 143, 41, 12, 15, 55, -103, -87, -245, -96, 19, 17, 31, 134, -80, 189, 32, -63, 280, 184, 45, 390, -63, 229, 74, 68, -64, -157, 57, 172, -75, -14, -43, 107, -4, 3, -33, -12, -27, 191, 135, -40, 110, 202, 119, -29, -19, -142, -142, 18, 95, -57, -210, 230, -49, -79, -102, -44, 60, -196, -158, -93, 158, 106, 16, 32, 224, 5, -18, 123, 144, -12, -157, -88, -158, -174, -98, -11, 105, -2, -43, -27, -158, -38, -260, -28, 160, -266, -60, -7, -39, -28, -3, -255, -123, 113, 224, -5, -146, -144, -127, 220, -85, -30, -3, 16, 145, -196, 256, -62, -51, 18, 22, 30, 102, 92, -140, 129, -98, 172, 99, -128, 164, -235, 216, -21, -40, 39, 130, 219, -123, 29, -64, 167, 5, -182, 57, -52, 136, -50, 311, -76, -76, 97, 51, 100, -317, 163, 61, 38, 50, 129, 64, 59, -57, 139, 252, -61, -34, -137, 165, -57, -81, -170, -4, 101, 54, -183, 90, -68, -140, 2, -3, 81, -225, -126, -165, -80, -42, -40, -205, 21, 73, 53]
4893E3J68k05p6K48q1l68N3K37n9k61J35K75j12j22n2k2Q1m9L32m51M21j56l70
4916c81J74L80j64j06K95l75P2J01J68k5k69o1P1K63j00p7j04K25k15L2k3J08
4938a1J39j50R2l73M86p0j57J64l11Q3M21n29L88j52j37J68l3n1J90m10L73L1
4960A51k26J07K50j32k38P9J94k17kj66J44J9J33k87K58j91J97J24j38J16J4l60
4982a71J15P9N7r6J14J95k93o1L4J02n8j38O4K09j34K64l77J73j26n4J92k50J31
5005b9q8O6R1l5m3mQ7k63J55j96K78j0J87l78PJ78J11k76K57m8kJ13l33J51r4
5030a18L06l5j36M1l35K12J09l18L14J11j21mj08J1k4m0K61p1q8j0N0j18R6J43
5054A28J45n99L19J66j12P9k55L08l81L68k91J80j60O3J10M3o0j34J88l38K34
$$ y = [53, 221, 16, -60, 188, 107, -261, -208, 29, -30, -291, -156, 119, 7, -115, -167, -189, -108, -157, 175, -276, 145, -11, -381, -207, 173, 9, -97, 198, -177, -105, -4, 164, 139, -130, -191, -120, 143, 43, -34, -138, 87, -128, -96, -119, -11, 128, -22, 70, -303, 183, 113, -44, 120, -191, -108, 313, -216, 172, 20, -117, 51, 18, -33, 157, -253, 120, 151, -75, 32, 282, 150, -88, -9, 185, -32, -34, -200, -56, -37, 96, -191, 67, -124, 73, 197, 59, 175, 189, -171, -56, 23, 80, -16, 98, 293, 0, -61, -27, 75, 17, -121, -57, 152, 18, 282, -95, 78, -48, -102, 90, -160, -29, -117, -51, 40, 5, -38, -42, 45, -218, -63, -259, 19, 9, 196, -182, -175, 3, 114, -162, 95, 47, 45, 158, -175, -24, -118, 188, 153, 17, 58, -277, -65, 44, -274, 40, 151, 30, 26, -82, -71, -95, -135, 126, 55, -33, -43, 7, -111, -15, 128, 273, -326, -7, 159, 47, 126, -129, 179, -202, 166, -125, 55, -105, -42, 68, 111, 51, -83, 105, -233, 1]
5075APj86N1J28o9K6k41M49j71k13M37j45j44J02Q2j18k5n6r6K08k69J15p4L17
5099A16k18L19k13J07N0k51j21L76l06m9Q5J48j12J90l48K28J53k07j71J30ML15
5121B25n9k31L7k53K43p0K93q0J8k85J66j79kK26K5j20J24M4q6P4m8j79j18N60
5145C25k41K7l10J55L5p9j70R0L1L9P8%R6K0k87M3L0j0j85K34K4j57L42Q9j98
5170B1J21k05o2K50j43j47L23k30pM8L9k56K88o0j00L47k34M1q4L91l56L4K29
5193B48m02%K02O1p2k41J52K86l3j19R6m9j24j15J16J65j78j12K14P7k64L79l07
5216b0j22J34J86j60j81N9K6j86OL09j40M0K0j28J18j6j95K81l5q7k3J19j2N4
5240D7Lr6%j03j32K51q9J63N4Q8j59q8P7j24j07N19m75K35m9j47J35rm1K50J61
$$ y = [1, 8, -178, -127, 1, -68, -42, -283, 166, -5, -218, 219, 74, -70, 32, 114, -4, -29, -85, -181, 27, -242, -127, -201, 116, -102, 217, 4, 111, 161, -90, -211, 165, -141, -190, -105, 43, -69, 121, -227, 1, 154, -53, -224, -94, -90, 225, 166, -65, -28, -281, -38, -108, 185, 105, 123, -162, 4, -175, -177, 49, 74, -46, 78, 122, 36, 110, 62, -117, -235, 325, 84, 111, -199, -44, -9, -88, -258, -168, -137, -98, -20, -20, 76, 96, -191, -148, -118, -128, -313, -79, -55, -212, 130, 219, 21, 142, -63, -125, 125, -18, -165, 158, -72, -79, -31, 8, -248, 40, -20, -120, 227, -7, 34, -50, 341, -15, 19, 248, -154, -154, 48, 109, 37, -204, -52, 234, 201, 82, 178, 129, 5, -110, 6, 171, -7, -119, 95, 172, -92, 287, -20, -142, -8, 178, 18, -163, -104, -78, -264, -258, 51, -89, -49, -29, -157, -39, -55, -250, 31, -4, -91, -114, 5, -7, 47, 50, -46, -46, -149, -281, -30, -119, 44, 98, 186, 27, -61, 16, -108, -215, 304, -171, 64, 15, -132, 3, -6, -47, 203, 364]
5265C64l64K78m42K55j27j10m2P6R5k06L76j58J1k79K49k8L16j12j99rj66L47
5287A25m3j04J49j27J08l32J41K09j66J42k71J54j47J09N0J14k05J66l02J76J12
5308E8k68M21l50J53Q6K2k32K23k27M1j7L4J93N6k18l6N6j06j5P0K57j40j41k1
5332a01K00j76K89j43l2k6j8m5j8%N7J7j60K91JJ17j12n5n2p5M5l97K24L30k64
5357a03K9J63j26j1P0L4pm4O6k5r9K28j75J97k53q5k40K29l5L73n6k00j70J75
5381f5l5L85m52j53K12Q7j63M52m44r2L57j65J66Q4j31j15J09P9J23m00K54k3
5403G0k61O7K79k81N4J32j60O6K93m54M5Q2q3K47q9n2P5j34O5l3k6K58k57N0J72
5428A25k26j05J86Ll56K88J08J7R6q2k2J58l30L07N5j29p4M5Pl26J99L2p6pJ70
$$ y = [364, 0, 278, -164, 91, -36, -146, -188, -112, -17, -223, 153, -5, 6, -273, -24, -52, 264, 152, -47, -56, -222, 125, 82, -22, 127, 0, 108, -224, -83, 126, -40, 102, -169, -15, -162, -53, -3, 111, -94, 72, -230, -54, 58, -210, 211, -139, 14, 100, 122, -110, 113, -114, -73, -90, -56, 137, 193, -25, -61, -5, -111, -126, -56, 201, 61, -80, -101, 99, -77, 212, 69, 37, 11, -7, -52, -70, -70, -13, 4, -156, 135, 136, 253, 141, 86, 34, -41, 4, -393, -169, 161, -103, -74, 89, -37, -48, 22, 56, 49, 5, 71, 46, -53, 175, 0, 197, -56, -141, -381, -152, -187, 186, 130, -70, -240, -65, -100, 285, -167, -320, -108, -21, -184, 268, -176, -268, 89, -76, 90, 174, 43, -72, 37, 116, 239, -161, 93, 70, -191, -124, 155, -126, -72, 60, -100, -34, 259, -195, -150, -68, -151, 96, 7, -45, 30, -104, -39, -72, -98, 160, -97, -47, 125, -101, -206, -20, -17, -373, -85, 23, 40, 136, 54, 32, 190, -140, 167, 222, 93, 19, 64, 71, -255, -56, -24, -100, -107, 63]
5453F3M1J33l41M01m15J24k68L05M3j61k38M31k52j46J88Qj32J93J33r7l0j40
5475a57K47k27K37O6m5k30r8J52J14r9O1n9n7Q5K06O5l53P4m1K22l31K33j79O1
5499e3p6L34m27M19j50j8k8j3j1j36O0j83K92K9k33J57q0K99k01l1K55k60q6K77
5523A36k54P9Q2k14L17n6k32R8j79J02L10l37L75l48K80j28q2K25j88J28J60m
5545B70m88K58j31R1m3j6Q2J47l89L5K16k08J67k02K30j29J52O6p1j34J29k44
5567b12M8L00m07K48K21k20k15K28J4o6j34j16n9M25L2k26N0J9R2q0J91j51j07
5590a25qN2n6q3K03n4k4m1P6R7q6O2J74k40j05K06k23K40k19R3N1L9K09k78R1
5615E1P1m9k72K55M5j47q0J93k82J73L6l2k3J61j11J3Q0o0m4J04j77RO6R8jk41
$$ y = [63, 104, 237, -104, 297, -118, 6, -262, 43, 86, -75, -313, 118, -134, -280, -92, -84, -216, -23, 110, 13, -17, -157, 90, -137, 100, 166, 121, -109, -207, -55, 59, -40, 21, -38, -95, -10, 196, 261, -92, -18, -59, 163, -168, 65, -114, -53, -129, 205, -222, 197, 47, 29, 1, -12, -23, -159, -99, -282, 10, 39, -194, -37, -117, 182, -19, -50, 205, -55, -141, 136, -118, -39, 43, -171, 146, 90, -142, -44, -223, -121, 189, -148, 227, -121, 159, 31, -51, 174, -14, 114, 274, 270, -218, 40, -91, 0, -43, -59, 23, 170, -219, -184, 32, -176, -9, -211, 19, -110, 42, 108, 37, -97, 32, -212, -164, 136, -271, -23, 198, -22, -237, -9, 5, -61, -195, -311, -370, 55, 87, -139, -89, -70, 22, -58, 133, -18, -125, -133, -81, -137, -220, -17, -71, -95, -136, -60, 37, -49, 13, 187, -53, -158, 48, -175, 65, -154, -61, -10, 29, 238, -40, 51, 122, 73, -199, 56, 101, -46, -126, 67, -215, -42, -6, -38, -61, 100, -11, 2, 82, 22, -22, 82, -95, -86, -20, 78, 77, -164]
5641a64L18k97Q7Q6j63k6J80Ql0pK29l32K01Q4j65k15P9K69L06m39k54Q9J52K9
5665B5J4j2k61K67J72k16N0J37q7J55j10%l26L03k97K4K51J8j0j81j37J64l8j01
5689a96K06j21J52j24J67N2l35K31J66k17J52l1l05J77j11J21j18kK31j45k24
5710b74K05n7R8K7J54k84j15L62j47J62j71K26j38q3J9J75j32q8q9N6K43p3k51
5733a75J34ll3K50k89J66p6J69k22P0Q4n2j26n2j33K69O5nj95K07J47r5p0o8o6
5758i9k57K66j14L75k12j00l0L1J48m19L33K50k14p2k41J12L57j15q0o1K80r4
5780D4%P1k91M55j95j23J88j86K16p8j45J2N7RJ50j43J03l9p1K0l55L19j4O9k35
5805a62J66p2J44K13l99K15k58J09K97k96L3j23K27J6j25Rk28M50j74Q8n9j19
$$ y = [-164, 154, -143, -56, 30, -133, -159, 21, 29, -1, -8, 221, -111, 90, 174, 9, -206, -127, 142, 448, 9, -245, -156, -4, 25, 39, 27, -234, 33, 205, -11, 39, 176, 89, 244, 134, 134, -192, 111, -186, -162, 89, 107, 97, -84, -221, -57, -95, -196, 10, -111, 41, -83, 84, 136, -199, 32, 198, -19, 133, 102, -203, -26, -137, -16, -134, -136, 95, -50, -274, -69, -126, -28, -1, 153, -131, -246, 116, -31, 131, -40, 186, 48, -35, -16, 159, 27, -61, -150, -94, 149, 76, -175, -41, -44, -77, 173, -116, 50, -26, 143, -79, -9, 75, 23, -103, -155, -288, -19, 46, 41, -154, 53, 200, 105, 35, -33, -99, -356, -90, -204, 171, -41, -141, -171, -140, 8, -411, -78, 172, -42, -114, -355, -243, 114, -1, -81, -142, 138, 44, 44, 115, -176, 279, 84, -39, 149, -37, 179, 101, -44, -32, 25, 34, 184, 41, 144, 105, 34, 54, -301, 18, 4, 73, -162, 4, -68, 76, 289, -110, 105, -153, -44, 253, -43, -10, -133, 94, 110, -15, -6, -234, 216, 42, 130, 71, -48]
5827d8j50O6J69k41M10l82K27O9J14k60K26j80j32L63l05k39K4K24r6L5p0K4K86
5850A34M9m8k13K56j87k34P8J79mo6m0O2QJ78o5k10K82j83P9kq4k1K70l22j5M85
5876C66n64K2L40m71M76j42K3K90q4k60j64J63k10L03j7j07L27j46k65R8j25M42
5898B95k40k61L43k02nl7J73l36L00R1M2j46q2p6J64k07j17K69J25J29j63L0k14
5921a25O3R8l3j22K96j82N3L3k73J23K54j17m8o8j88J11Q8M1k3k57K86J71j88
5944gj9J92j71J46r3K15l44p8M20p8l18P7K57n40N33l53J85q1J18j96O8K9K4K8
5968A4o4mL2R9L7k84L68K6n6j64j1J9j59K72l85J15R4q4K67l5k77K85%j16P8k05
5994a38K46j19N8J56k15K3j36O7R9r5J92l12J84%j99J20n1O2L53m47K04j32jn9
$$ y = [-48, -198, -132, 37, -204, 206, -176, 51, 120, 234, -26, 200, 20, -112, 251, -54, -293, -269, -45, -141, -106, -176, -152, 134, 183, 135, -78, 178, -9, -243, -165, 14, 10, -56, -96, -34, -26, 152, 87, -123, 159, -24, 55, 53, -31, -52, 218, -104, -119, 366, -198, -176, 164, -307, 169, 27, 50, 340, 256, -4, -168, -5, -215, 88, 71, -36, 291, 145, -120, -22, -147, 295, 55, -206, 137, -65, -70, -107, 66, -270, 30, 121, 163, 17, -65, -141, 23, -184, -301, -32, 93, 222, 59, 89, -125, -62, 36, 3, -119, 177, -5, 48, 81, -192, -69, 185, 68, 20, -48, -236, -125, -37, 4, -19, -276, 10, 181, -7, -26, 166, -5, 141, 48, 263, -81, -159, 261, 183, -135, -58, 199, -341, 192, -161, 24, -57, 61, -135, -67, -38, -14, 14, -50, -54, -22, 77, 114, -170, 198, 224, 168, 4, -7, 12, -147, 125, -260, -145, -51, -135, 132, 97, -180, 105, 105, -11, 67, -138, 108, -11, 47, 203, -12, 11, -125, -58, 41, -54, 138, -174, 10, 10, -189, -69, -120, -58, 295, -152, 52, -80, -81, -140]
6018a40K31j1l13N03j91k27K50p1m19L88n3m6J22P5J57l5l45J76J1J01l01K22
6040H4o2k8K39l81L90j57j71j87L74l63M10j79kJ72J15l07k0J25L8J10l96J74
6062b2K0J66k12m2J76J63k99L9KM7J12k84N5m9n6J98K62k49J15k89L07k51p6L22
6086A55k49j4M3j32K60P4k67J85J14j16r2P0O6m85L81K05l43N5M0r3M2J21j75
6109a55L47Pj29j01K07q7j4j80J63J24j52J34l13ljK24R7j55n2o7K32j84P1j17
6133a04MJ07j90j9K3K63j79j16J05R5o2J24k25k17K75P9l9M0K73j93K3l13P7L16
6157A47j90J22k01N9K02L6k03k25M63l16J5N6K03k94J54N8J34k23k9j0K56K1k73
6180c8J42m80K94M05l21O2j12M0K50j62k20O8K73n1j6J40q8k63K55k7l47j99M16
$$ y = [-140, 91, 80, -233, 270, 79, -148, 102, 31, -388, 0, -53, -99, 23, 98, 255, 220, -125, 51, 62, 163, -138, 84, 22, -6, 233, -148, 242, 85, -86, -273, 101, -262, 148, -31, -33, 139, 254, -53, -73, 52, 90, 200, -196, -22, -2, 164, -48, -90, 86, 249, -50, -11, -9, 38, 150, -134, -79, -128, -184, 14, 276, 27, 142, -147, 160, -91, -167, 155, -94, -108, -65, -197, 63, 137, -130, 55, 169, 53, -39, 31, 97, -388, -7, 198, -145, -90, -50, -143, -101, 20, -155, 192, 199, 70, -31, 176, 89, 75, -105, 58, 182, 30, 164, -149, -152, -153, 71, 168, 13, -39, -106, 126, -58, 13, -104, -100, 7, -183, -202, -179, 84, -95, -211, -106, -11, -73, 51, -174, -391, -116, -37, -76, -36, 237, 44, 67, -246, -169, 147, -43, 79, -122, -63, 139, 175, -28, -253, 210, -106, -91, -35, 168, -126, 28, 86, 220, -3, -32, -42, 214, 235, -38, 104, -376, -82, 323, 2, 64, -48, -8, 242, 80, -140, -72, 201, 150, 134, 274, 186, -77, 178, 151, -196, -395, 21]
6203B1K89j60N6l84L80pN4j70q3J35k74K79k47k67M90n2M2Kj72J1J12k7k49J30
6227i1N5R9j54j5j29K85P7k8k27k9J26K67m08L42k18K9Q2j7P5j42J53R4j95Q7
6251A18k90Q2j12J87P4j61K01j13j6J2L51m92K06k40K86q9M5J51k14l04M00j97
6273a15J47k29J25J18k58K15k62L23N3m0n3j80Q4K91k41R6Q0j95o3k9J17k96L98
6296H6k35M05m44K52J5k57J82k3P5P6k95J78p3Ll8L68j90J06p5k01P1j18K74l15
6320a73j55L96j51j37J39Pj20K3K04l26K82j79P3J1k9L37k12J34j73P1j41Q6l1
6343f4n8N3n6K16j19K07l24M45m50L8K01j07j39J93O3j16QJ2K55l07N8oJ7j3j45
6368a38q6J89j0Q4qk3Q4j7k76L80j32R6j15J11o0L6j21l4Q6Qk26O6M8j08kK80
$$ y = [21, 310, 150, 206, -178, 202, 195, 249, 79, -4, 131, -143, 136, -111, -378, 112, 60, 102, 104, -68, -57, 55, 28, -221, -91, -36, 63, -91, -106, -235, 50, 127, 99, -128, -157, -31, 236, -172, 170, -48, -19, 63, 46, 121, -21, 132, 226, 31, 118, -172, -90, -202, -15, 59, -102, 99, -14, -30, -18, 333, -159, 47, -193, 93, 4, 49, 200, -14, -318, 82, -115, 32, -197, -72, 46, -212, 3, -259, 64, 117, 77, 24, -156, -72, 219, -22, 74, 154, -41, -104, -133, -16, -312, 86, -149, 256, -188, 64, 79, -178, 4, -19, 56, 132, -163, 15, -58, -55, -93, 275, 85, 191, 116, -85, -14, -132, 142, -173, -328, 68, -83, -220, -81, -74, -194, -171, 33, -293, -11, -190, -117, -106, -135, 202, -10, 124, -49, 22, -119, -33, -64, -122, -69, -125, 91, -28, 179, -145, 300, -150, -112, 89, -18, -157, 36, 99, -17, -9, 3, 258, -49, 9, 3, 20, 7, -138, -224, -35, -45, 39, 31, 8, 92, 75, -201, 179, 47, 143, 28, 139, 79, 115, -6, -40, 46, 54, -172, -106, -58, -166, -168, 112]
6394A12j58J58n7j06j94L20J46k13k4r4K93j91K38m69M2N3J31K42k72K82m8k33
6416d2j80J88J17l5o9K06k26J39j72Oj2J89j67L13r1l91K34l28R2K94J7j41J20
6439F1j63K85l26M9k77l6M84j00j57lJ39j30P8j19L24j73OP4pr2m6K83l92J00
6463a38Nj67M3M48j09Lj71k5Qq8J52Q3j77K93N0m37J37J04J13o4K7j32p4n5M09
6488B38o2l37J66LpK47m04K42p9j2l5J88j64M07l56o4Q3m9K03k3r9k65K54j30
6512e5p5K68j25j12J64k0j64O6K56k15j9k7K3J89k10L5j86K70l48L45m52K33L32
6535A73j07k12K41k8L2K8j57M8l1Mj52L71j16M8n2m78M91j01J98K8k98K0K12j02
6559F0j7K7k96J62k1M9J54k40k39K44J73j94J25Q8k61K22r7O4k33L33r8J71j5
$$ y = [112, -46, 112, 55, -51, -245, 75, 221, 8, -16, -110, 183, -8, 230, -239, -197, -144, -13, 229, -43, 239, 191, -42, -222, -34, 83, 48, -21, 185, -41, 98, -74, -68, -80, 109, -58, 255, 164, -227, 7, -321, -229, 65, 82, -59, 61, -102, 183, -143, -94, -371, -407, 77, -23, -180, -183, -44, -174, -96, -215, 109, -64, -58, 16, 9, -83, -129, 154, -238, -138, -133, -300, -257, 191, 82, 85, -86, -111, -103, -191, -39, 44, -133, 160, 210, -227, -90, 14, 127, 63, 90, -42, -116, -171, 238, 176, -161, 5, 8, 1, 248, -156, 86, 7, -5, -40, 148, -16, 391, 35, -29, 54, 5, 208, 185, 86, -179, 75, -55, -130, 138, 13, -99, 65, 45, -119, -53, 203, -12, -31, -58, -35, 154, -56, -21, -207, 63, -285, 60, -392, -159, 173, 66, -146, 95, 67, 99, 127, -30, 18, -13, -9, -161, 210, 94, 142, 90, -388, 103, 2, 200, 228, -70, -50, 162, 60, 43, 70, -226, -64, -85, -36, 118, -122, -361, -117, 56, -138, -13, 75, -186, 36, -61, 3, -230, 103, 5, 176, 161]
6582A61l07Q8O3K78m24J72j58J33j36K29m33M59k32L27l49j12K56m4L05l03K5
6603bl4L20k88J72j91kK54m63K49N2j20r6K2J63j88Q1P8J60j15o8K09l74J25m3
6627i9k2L04k84K35%Om3r2k74K64P5j33K13k39K2q3k1K13P5K1k07Q8o7J47k06
6652a07P7J10m7o7k8N33n32j8O5j31K04p9j26J28J02J33n6j99P2k80K4K87k99
6675b34J09L14n4l82K48n6j39K57K0k64l0L97j45l6J8P1j88J1J06Q8l42J12L11
6698A92q4l33J71M16l06j3m9N9m9J52j67M9K2p5Q1j80O0p7K38k50L58ql70o0Q3
6723a40Q1l7j17K20k10J79m2M50n72L2J73j05j89M97q8p8q7j12K67q9j19l5L04
6746A83k52M7J48J1Oj91J24j4l4k08L23k56K49k42J40q7L5o8K68p9q7jJ18l88
$$ y = [161, -146, -58, 5, 283, -141, 31, -127, 6, -130, 99, -334, 125, -107, 220, -129, -241, 15, -29, 276, -27, -2, -36, 284, -4, 168, -23, -25, 229, -234, 15, 67, -53, -149, -127, 36, -152, -71, 7, 167, 52, -16, 193, -181, -56, -99, -121, 183, -101, 134, 134, 140, 97, 5, -269, -5, 70, -63, 150, -89, -67, -150, -171, 42, 117, 138, -69, 19, -48, 99, -107, -30, 80, 33, -34, -62, 471, -61, -79, -14, -145, 59, -20, -146, -18, 84, 217, 161, -38, 34, -246, -222, 65, -234, -125, 189, 135, -247, 1, -55, -194, 63, 83, -181, -211, 186, 41, 5, 23, 94, -94, -83, 23, 111, -231, -119, 192, 108, -225, -54, 362, 56, 43, -6, 53, 4, 156, -11, 38, 60, -15, 66, -114, -54, -131, 107, -143, 215, 207, -163, -223, -140, -59, -96, -213, 7, -203, -24, -66, 384, -188, -156, 17, -88, -277, 220, 132, 54, -33, -145, 122, 33, -86, -121, 183, -69, -22, 126, 137, 143, -48, 76, 62, 28, -180, 143, -113, 136, -106, 34, -53, -18, -86, 182, 103, 16, 15, 133, -255]
6770b55M75j78l8j52J38r0J98n2j52J72K6Jj31J0Pr4K19r2o2J67j77J72Q1j89
6794Dm5N9l2J24n7N8j90j01K49n3O1j74K43J82m01J12j37L07j94k2%J25L7l7j35
6819a7K06l21K23j18p4j69K93j31L62l59O9K52m03L7K38J38k67m0K87o3j18M2
6841F7j20J01k0K51l64K26l8jj41P6J62j81L7j69K09p3j05J44Lk10J1n8j2O3J12
6866c0P2K5j80j9K04l64J23K00J4N1J9k83k5K8J06J72j11L7j20k16M4L77j01k5
6890bJ33j90J56l47K86j02K21k94J07j0L7j09J16K37k65o1L70n85J47K53r8L1
6912C1q3P6j87L24m64L54j53J54j14J16L6j6j09o3MJ66j72n2K24j70K19k80k7
6935a86R4m3L5J11L4j02%j33K45l7j56J93K4l6r2j5j68K44j13J37k54L48Om1n3
$$ y = [-255, 220, 42, 4, -148, -10, -100, 98, 46, -106, 66, 92, 93, -38, -28, -21, -115, 104, 12, -50, 117, -60, 112, 193, 4, -41, 18, -14, 110, 53, 111, -79, -180, 69, 16, 77, -97, 146, 328, -73, 39, -98, 209, 15, -7, -7, 118, 155, 118, -17, 189, -132, 91, -27, -101, -270, 23, -108, 254, -105, -36, 216, -187, -150, 88, 226, -41, -81, 206, 143, 25, 67, -53, 48, 28, 279, -85, 141, 103, 102, -39, 37, 199, 18, 55, -114, 95, 22, -83, 61, 64, -146, -135, -193, -205, -142, -30, 42, 67, -113, -132, 72, -292, -169, 31, 45, 96, 115, -168, -193, -165, -59, 113, 2, 39, -81, -297, -253, 124, 23, -2, 131, -59, 97, -250, 36, -66, 155, -139, -32, -42, -5, -114, 2, 239, -26, -87, 283, -302, -155, 98, 0, 31, -52, 24, -163, 161, -303, 51, -102, 52, -62, 54, 90, 74, -35, -98, -94, 72, -100, -152, 72, -98, 121, -159, -186, -92, -135, -100, 11, 45, -57, -57, -190, 55, 18, -138, 55, 79, 43, -49, -64, -232, 12, -101, 36, -218, 130, 136, 95, 42]
6960D2k42K22J01j3m3K9l66K69J60n73L55J39k55k9J89j78K91j49J20J16j84n3
6982e2J95l61L24J16k42M3K8r4M3o5j09J78K2L3J45l55p6J53N9K16k60N5J62j58
7006@l30L04j53K15j42j37J71M3K09j53N3k18K35j31K61j11k48J03J6J5m0P4l15
7029b79J93L7K61k33n2J74R3k41m7J66k76J64PL56l80J57q8K2l1L3M1M5k70R0
7053e8l9K92l50N0J43j78Q0l6Q2J51j31k95J22N8j06KJ13J71L1j17J5L22j78j30
7077A4k9j3K22M4l27R1r3J12J94k17N86n44j12nR3k37L22j34o6L03k80R9K8P6
7101A27J11q5j79J05o7J84J6m5Jj59r8M7J86k36K58k81P3m6K98k4o4j46N5m8K59
7126B42k9j82L8j20o5K59l17J51r5L58krk40l3K86k09j01J26J67p5k85J56J9O0
$$ y = [42, -200, 22, 123, 110, 67, 96, -270, -1, 159, -414, -59, 80, -175, -204, -15, -193, 98, -51, 69, 185, 1, -52, 143, -218, 106, 222, -20, 23, 51, -43, 0, -65, -174, 4, 26, 59, 204, -151, -227, -74, -15, 201, -59, -4, 158, 0, -330, -26, -179, 36, -106, -243, -72, -29, 180, 27, 80, -138, 97, -34, 227, 116, -132, -29, -13, 2, -38, 36, -279, -86, -49, 212, -21, -73, 101, 194, -47, -94, 72, -204, -40, -33, 323, -57, 100, 12, 34, 3, 36, 77, 122, -148, -58, -97, 195, -155, -105, 38, -140, -60, -96, -14, 137, 6, -289, -167, -109, -215, -213, -100, 71, 102, -15, 0, 322, 144, 14, -15, -28, 194, 238, -89, 2, -91, 21, 215, -2, 584, 40, -72, -77, 16, -221, 101, -33, -99, 204, -76, 23, 51, 127, 238, 153, -26, 79, 12, 196, 212, 167, 168, 9, -89, -42, 144, -92, 166, -115, -42, -88, 210, 186, 122, -24, 31, -17, 242, 213, 31, 69, -51, -116, 143, -174, -23, -118, 240, 238, 229, -11, -44, 242, 33, -68, 58, 225, 150, -135, 21, 40, 100]
7150A00L9k32J35K10p2k61J09j15J79k55L84k47n8L1O7L2J24k21K85N8k04k07
7172a19l8L14k72K3K01j33l6J32j7j09j99M10j57k3J32j2k44M8J54K64l39j18
7194a38K2J15Q8q7l2J87j72J26P8rk1j1j95K76j90K3m29L70k6J23j20m0rJ52L79
7219D60l46m0j4p7j75J46j2n6j64M13k84j1L76k80J75n8j27J60o9j01J01RK45
7242B71j47k28J99j61L0j40Q5R8j14J35j57j17J33J19j18M34n05p2M50k08j60
7263a73L72j20j86J22L5L70k94k88K1n0O3J56j05J36L9k27J7J44p4k74L03R8k95
7286b10q1K08K10j65k06J85K96j63r6q8K46q4L4k5j90J8J45l15M03mq3k27K45
7309E3j56R0O2l3j71K36Pk46K55l16J48J00k63M85k07J37k03k8K81k27O9k1M4
$$ y = [100, 139, -93, 42, 252, 180, -81, 28, -87, 92, -163, 221, -26, -84, -53, 14, 46, 170, -51, 234, 292, 88, -119, -157, 157, -115, -92, 109, -24, -60, 72, 55, -54, -253, 157, 0, -23, 109, 97, -147, -99, 55, 319, -20, -138, -116, -1, 87, 0, -32, 155, -17, 109, 187, 178, 157, 146, -49, 227, 37, 60, -369, 1, -25, 98, -22, -62, -71, 81, 460, 114, 74, 60, -17, -192, -46, -58, -114, -278, 135, -149, -160, 216, -64, 111, 53, -74, 86, 17, -84, 17, 26, 271, 124, -104, 95, -66, -36, -176, -91, 7, -107, 28, -129, -246, -113, 6, -112, 322, -183, -255, 195, -13, -173, 199, 79, -107, 15, 50, 420, 126, -162, -141, -191, -128, 28, -77, 59, 98, -129, -112, 32, -42, -316, -13, 85, -210, -291, -83, 127, -38, -244, -59, 237, 74, -22, -110, 136, 52, 86, 61, -129, -111, 34, -281, 122, 118, 35, -192, 53, -103, -13, 49, 16, -155, 81, 88, -158, 97, -219, -71, 29, -234, 251, 44, 181, -22, -50, 231, 4, 73, 52, 96]
7332I6J5j77K50j49K06l89K3K00j04j55L79j01j40R0J49j44n1J33j29j32K84k52
7354i8RM9K27k96o2J15k57M86P0l87K95l27Q6R8r1O2J22j97n6J68J99n27M4K54
7378a4n1l8R9L1j06M22m87K41j21J34n9p1m9l8J87q3J84l55J04K6J68r9j64pK38
7403I2r9J32l40K61n7J4R9j87J59j3R5k06j93L0K67P3k28K4N0j50R4o7L42j38
7427E4J98l25k11M63k06p1K40k38Q4j89lL65k71j19J90J6M3k10K36j57Q1KM0o3
7451e1K22k14p8J6K19Mj44J0J44j07J61m3JK6Q4j60J25k25OR4m1K50l39k15K22
7476c3L9j11J05R2j54l36L50K06l76K46j52J31kM5j23J47j51K9K23j38k70Q0j2
7499a65R9j35R8K17j80rj60L73l7J7j25Nk2l09J76J49K28j37j74J89J0n4P4n6
$$ y = [96, 111, -66, 184, 35, 241, -148, -125, 75, -29, -184, 195, 94, -46, 44, 193, 49, -2, 131, 2, -130, 154, -98, -89, -40, 187, -109, -171, -56, -313, 173, 243, -144, 151, -176, -90, 8, -83, -21, 101, -96, -152, 16, 215, -312, -268, -14, -65, -103, -4, 27, -79, 343, -144, 97, -24, 110, 51, -20, -69, -107, 80, -3, 181, -174, -70, -44, 124, 25, -139, -146, 92, -7, 125, -215, 46, -11, 3, 102, -85, 74, 61, 156, -50, -243, -213, 54, 127, -101, -77, -27, -177, -83, -150, 192, 54, 252, -73, -284, 179, -27, -98, 142, -96, -12, -201, -204, 161, -110, -229, -39, -23, 20, -190, 46, -111, -30, -28, 12, -51, 171, -43, -121, -105, 114, 118, -26, -16, 128, 21, 182, 139, 140, 166, 250, 90, 215, -10, -4, 90, 49, 299, -40, -255, -33, 6, -105, 0, 92, -62, -398, -48, 158, -218, 28, -124, 7, 5, 50, -73, 74, -77, -48, 175, 37, -233, -153, -165, -66, -201, -103, 114, -66, -75, -235, 138, 101, 118, -7, -2, -24, -333, -157, -8, 220, 83, -91, 98, 108, 54, 128, 72]
7523G2J21k34K39j62j6N1l6j86J04l3K9K7j57K47j3n9j4L6j78L22k70K81k36j67
7547b32J28L10j33j36oJ3k54N02m55L13L9j30k91N18k97mrK9M5K27O4k20NJ5R4
7572A35k28k3m9L83k84K1O2M8l59N13k85J69k27K11j34J17l18L81J00j32l61L02
7594D2k5O2j84J62m4m01P36l76j61J03J0J87j54k46J92K8lJ61m0m0J49m33K07
7617f8k4K55l61K20K06l97K46l5j87K1P4n0K90m02P3m8K87L7l0j13j04R6n4J39
7641G1n0k1l67M23j43L71m05P2q6J95J43m85K62m8K3l5J49p5K03r4l16J25L9K67
7665B18j25j20K17l31O3NJ59n7j6K28l58o7J84j11J74j20r4K1K3J15j3l24O85
7688C56m94m6J51NK44O4j39k17R8pj71j43L97n8j10r9K59j60K79k21m0m2J71m7
$$ y = [72, 193, -41, 198, 36, 20, 71, 35, -151, -47, -80, -51, -24, -181, 66, 53, -6, -20, 16, -162, 160, -110, 171, -65, -232, -104, 206, 73, -63, -69, -56, -310, 192, -263, 50, 89, -41, -332, 186, -111, -115, -124, -95, -50, 177, 241, 21, 26, 41, 135, -93, -116, -165, 218, -66, -45, 17, 65, -294, 219, -66, 103, -124, 87, -47, 70, -248, 133, 233, 101, -260, 42, 17, 79, -105, 57, 13, -388, 348, -28, -189, -86, -76, 111, -43, -289, -97, -69, -72, 89, 49, 9, 158, -275, -68, -92, 163, -198, 22, 228, -169, 77, 42, -145, -124, -50, -100, 190, -212, -139, -187, 100, 137, 107, -6, -110, -14, -68, 71, 21, 0, -367, 56, -87, 284, -121, -49, -135, 60, 203, -282, -20, -68, -45, -80, 69, -6, 197, 103, -213, -88, -49, 218, 93, -27, 190, -141, -78, -73, 86, 29, 13, 241, -117, -184, 0, -111, 63, -57, -151, -130, -107, 8, -5, -329, 356, -138, -184, -33, -28, 216, 280, 141, -76, 22, 15, -156, -299, 98, 40, -70, -169, 90, -70, 209, -12, -52, -94, 77, 30]
7712C0m7K30j98j90L82l51M9j5J46J49O4k25p5L41l28j88R1K14J0p5j33j76K88
7735gM0j27P3J14j22j56K65m4J05j67k8r3J88o9K48Mj67l31M06k59J52R3k39N6
7759f5R1j33J37j80q3K88l48J12J35m0J30O2j77K03o9j00Q7k43L34k09L6l3L35
7782B70k92k3L81m57J65j23k9L33j69j1O2q8K1k63L76l21K5K56J07R5k99L0k7
7805A9q2Pk20K91j34k33L90j9J11k98mM37M2Qk75j58J22o5O6R1J12j58L86m02
7829C4J6J95k27k30K32J59m65M19o5j50J72P5j44J1J56k45L18l96J55L9j28K73
7851B04l87L10j4k5k21K33P1j52j45M5k1L08Kj76J0OJ50l32P1%j51o9K91k74J71
7876i5K11m2r7m1J82j36J25j05l3r9J64j84Q5N0R2K0K8r9k72K14L7K8k51M24j22
$$ y = [30, -17, 213, 15, -175, 207, -144, -95, -110, 36, 185, 249, 24, -51, 290, -38, -226, -135, 79, 89, 14, -119, -295, -7, 33, -94, -21, 93, -29, -185, 80, 36, 141, -26, -54, -147, 41, -28, 220, 224, 57, -274, 132, -127, 25, 118, -121, -65, 26, -107, 30, -150, -233, 55, -293, -181, -46, -86, 44, 106, -71, 132, 63, -37, 50, -193, 141, -68, -32, -65, 270, -22, -45, 336, -121, 44, -79, -108, 225, 56, 45, 107, 19, 40, -223, 153, -168, -143, 113, 220, 315, 16, 46, 19, -63, -56, -276, 15, -119, -352, 38, 19, 130, -168, -172, 265, 307, 315, 40, -118, 4, -61, 5, 96, 208, 50, 436, 34, 50, 245, 18, -212, 20, 179, -286, 133, 68, -82, 90, 165, 21, 32, 188, -57, 261, -135, 20, 59, -69, 204, -183, 127, 113, 88, -133, 100, 171, 19, -126, -81, -102, 206, 208, 32, 42, 48, 198, -134, -63, -63, -214, -283, 8, -266, -95, 116, 74, -23, -64, 118, -18, 107, 2, -31, -130, 34, -150, -65, -15, 77, 97, 125, 26, -246, -32, 5, 33, -218, 206, 84]
7901H4j92j5J97j04j44K42ln9k14L4K45j64J17J88l41J45k91M1L59n45L29n2M7
7924i6J73j83J62j0j96J78L9k51j52J87L11j8k11m2K81k36P7j35K52m6n4m5q4
7947i9j58J60J69N6j06j15o7pN7K66q3m06N15k98M23l52M1j91J73k13K67K9j21
7970f0l0K68L4P3j80J42k06j0K9j23Q9j13L09k47mq6j23L39p0k99J43M6P8j23
7994a24J06J06j29k7J14J03k71M04j12q5m08K94j01lR1j06j24L58j05J8Q7k61
8016a75K81j86J24J87j75j33J92l75L46N4m2k94L35k03L32k44j13J86j37M7N2
8037E9r5J90j0J44j50l36J08J11M1J8p4l2N8j55K71j14n0J27k04m9K38m06J78
8060a32j18L34J31j15k75K47p9k43M28r3L53n87J09j12M75k22j37N7L0l0J05l6
$$ y = [84, -108, -123, 74, -30, -174, 68, 65, 6, -208, -174, 71, -93, 24, 212, -129, 16, -275, -234, 125, -420, -91, -143, -96, 77, -106, 56, 46, -150, 28, 67, -184, -336, -149, 162, 144, -67, -109, 172, -64, 13, -122, 130, 84, 30, -15, -99, -257, -97, 72, 128, 22, -93, -160, -167, -110, 156, 73, -333, 182, -116, 307, -45, -4, -195, -22, -235, 32, 61, -60, -90, 178, 212, 285, 105, 247, 41, 31, 60, -63, 26, -87, 222, -25, -29, -115, -238, 101, 31, -268, -125, -79, -1, -124, -18, 88, -41, -68, 46, 149, -122, 282, 170, 85, -323, -29, -130, -133, -42, -148, -272, 86, -19, -1, 86, -175, 106, -80, 44, 231, 56, -77, 115, -260, 86, 140, 98, -196, 139, -64, 268, 24, -89, 97, -40, 7, 59, -36, 154, 144, 288, 138, -198, -90, 21, 62, 80, 6, -26, 32, -123, 148, 34, -16, 111, -93, -142, 96, -310, -132, -250, 84, 215, 100, -175, 72, -7, -250, 178, 85, 438, -149, -40, -152, 323, 101, -36, 21, 51, 21, 126, 90]
8082I0q6M0k0r4M8J44J46k22or4j05J9L17j01K3Q0k9j39N7M9n8j58J29j24J77
8107H3j59J27L3o2qK3K3n4J10k17n7K44o6K84l91N9N1K0k9K67j22k90J14l8l5
8132i0K03l47L34R2l05N2L7J97j45L6J19l82M08j27R0r7j9k48%J72O5q4J33j00
8156fl0n1J79j90k2L92o9k24k3R4j93K71o6j57K1J51L0k09K69j37j69L95m01K08
8180F3k7q8P0M5L5n9l60L30m6L20l2
$$ y = [90, 4, 44, 24, -70, -22, 122, 268, 46, 40, -54, -159, -140, 177, 76, 99, 179, 150, 11, 68, 117, 59, -99, 30, -94, 83, -76, 51, 84, 22, 14, 37, 60, 6, 116, -101, -158, 86, 20, 304, -87, -28, 23, 43, 14, 281, 159, -131, -17, -55, -90, 113, -234, 100, 192, -113, -61, -24, 173, 28, 64, 183, -199, 209, 82, 172, 75, 56, -192, -192, -20, 45, -39, 94, -6, -36, -87, 92, -98, -120, 272, 203, -21, -44, 50, -143, 128, 62, -95, -74, 77, 107, -102, 167, 30, -139, 256, -145, 63, 36, -52, 18, 63, 98, 39, -321, 9, -37, 283, 251]
8191B51
$$ Imaginary data points
##PAGE= N=2
##DATA TABLE= (X++(I..I)), XYDATA
0@%%%%%%%%%%%qJ6j6J6k4L2l8M6n6O4p2Q8j04J26j50J74k02K32k67L07l52M00
33B12m50N08n73O44p24Q10r05J008j121J246j381J526j688J866k055K265k497
50a309K751l032L341l684M069m501M989n545O190o949P851q944J0306j2054J4394
65G873j7709K2799l1699N1737j82110K6597K58836j45674l9352M6909N357P648
77A1212R5524o6027q3012J02490R2384j57813j11394P1946M6437m0992J8486m38
89b1197l2303M0096N6749m1486j8862O5027L5524n2704n0705k863K8568K0362
101B6206j9058m4411K976L3408j1374k9812J7267L4580K5014O586l4000k8510
113b1128L4844L0937l0311k4449J5943j42k4769k990R353m203R862K0592j3888
$$ y = [0, 0, 0, 0, 0, 0, 0, 0, 0, 0, 0, 0, -8, 8, -8, 8, -16, 16, -22, 24, -32, 32, -40, 48, -56, 70, -80, 94, -108, 124, -143, 164, -188, 212, -238, 270, -303, 341, -383, 427, -478, 530, -591, 655, -726, 800, -888, 978, -1077, 1188, -1309, 1442, -1590, 1751, -1933, 2136, -2365, 2624, -2921, 3269, -3680, 4171, -4773, 5533, -6521, 7873, -9836, 12963, -18736, 33001, -149109, -122512, 136324, -9350, -48702, -1793, 3564, 11212, 106736, 40709, -42303, 60187, 152571, -5242, -116636, -44690, 1747, -39245, -20759, -21197, -53500, -13404, 43345, 1859, -17003, 48024, 83548, 30844, -19861, -22724, 5844, 26206, 7148, -37263, -34287, -879, -12253, -42065, -24798, 9782, 34796, 41382, 7382, -21128, 13716, 44653, 14342, -10107, 5836, 5694, -19075, -22065, -12712, -16915, -7053, 13539, -349]
126c49k1310J7944K1843m168m044J758n296n962k601n252n15R676N331j1758j3876
141a8579N368J2535K368j177K194L162o83l549l31K171K736L712m602j3267k546
156a0488P270j27k472L238k68l525K943M542Q25K765Q714j517j1048k566L151
171A437k074j90R87n370l050K543l87NP203P239j135l210k17p15l96K037p24n428
189a445j074j516m841j5O097J994N28K698r78j039L454K440j635q53L23l807n024
206d693N93J497r60J137K086j815j230L372J809k48J851J921k641k371l26l59
222c77j670N71J056q16j001J298O38j04R11J601m22p92j21k27j363l3J39J47L28
241b37k6P17l63m04J045M71R5N1n01j104j217o52P82N11K39P61K27p66R1O51N94
$$ y = [-349, -21659, -3715, 18128, 13960, 9916, 11674, 6378, 416, -2185, -7437, -7952, 1724, 7055, -4703, -18579, -13211, -676, 1692, 515, 2709, 5871, 5188, 1639, 1308, 3479, 6215, 9927, 5325, -7942, -10488, -3218, -3345, -5817, -2579, -2847, -6372, -3429, 1113, 1938, 4703, 13417, 11900, 852, -1714, 1437, -637, -827, 160, -5210, -8260, -5717, -6104, -6099, 1104, 8343, 7208, 3998, 3781, 3066, 2670, 4707, 3983, -1445, -2519, -4035, -8876, -8891, -2794, -800, -272, 2426, 1448, 409, 3863, 6303, 4668, 3815, 4138, 331, -4693, -4100, -2603, -3563, -2426, -340, -2155, -3385, -13, 1796, 1548, 3399, 5320, 2679, 308, -18, -377, -2047, -1476, -420, -1236, -2237, -939, -301, -405, 506, 2107, 1685, 893, 772, 545, -818, -851, -712, -565, -237, -263, 454, 91, -313, 732, 1203, 1298, 1349, 848, -256, -1473, -2125, -1343, -832, -593, 168, 395, -371, -280, 371, 965]
262I65J110M14o86j524j043q78N52J89J29L25k99j194L91J319J034J253J17l11
280A863j187j307Q71K94k58L38o17k203q20R02N60J310J291J89o06r73O43J064
298A354J01Q79k79j896j579k50k44P04J260j42p10r10R0J608J110R93P40q50j481
317D98n50m31K03Q83k98j021j420n59N28J056J415J560K79j328k10j26k79J527
335A727k45j310j381j347k87P35R68J647Q46j034l7J45L99J266P25m75j184k323
353a165j210q1M24R57P78l87n45K3P42J859J357O68l02j453j898l95m57L05Q25
372D5m84j885p29M54P58K040J778Q48l96j213J27n17J12M89m42j676j121r04n56
391c272J201J493J009L35m12q8P0P50R01Q74r17j183j655q63L45J39P82J32o25
$$ y = [965, 2075, 2489, 1803, 279, -764, -1642, -1090, -901, -772, -447, -746, -1940, -1549, -230, 804, 2057, 2174, 1863, 676, -631, 240, 534, 276, 614, -3, -2206, -3026, -2124, -1564, -254, 1037, 1226, 620, -353, 290, 1354, 1455, 2334, 2055, 159, -1420, -1670, -1914, -1210, 50, -92, -802, -1712, -1622, -14, 1096, 2089, 2829, 1979, 498, -52, -483, -280, 603, 305, -716, -2136, -2695, -2167, -1111, 304, 1864, 2143, 815, 605, 479, 200, 1727, 1482, 172, -1209, -2556, -2843, -2108, -1140, 507, 1353, 319, 282, 427, 826, 2092, 2817, 2342, 1158, -1165, -2375, -2456, -2032, -1075, -297, -684, -1229, -1206, -464, 1395, 2752, 3420, 3118, 1665, -233, -628, -1085, -780, 45, -439, -2324, -3053, -2599, -1841, 199, 1977, 2825, 2429, 1216, 1343, 826, 938, 1427, 985, -691, -1812, -2716, -3272, -2071, -578, 431, 766, 354, 266, 336, 1086, 1987, 2861, 1944, 761, -894, -1757, -1412, -1273, -491, -359, -984]
410i84q14P51J011N72J607J24m38q39r69k95K93M38K21q45j192k01l11M60J358
429e3Q12l5k27m61PN69O08L49n02n41r14n59P2K02L87j49k8l93m11P47P07M45
451F32Q83m30r44R0l15l44R22P0j45j035m88M5Q2O34J175j64q27L00K46m82R21
472H26J10k04o03K3o60o46J042M13k30j57j22k82J30P05M61j83N8l94o63J7J17
493b42M35j79j56j88k48o5M33L57J75%j06l62L27p4N7k24L57m48k66j15M50J10
515B8P9J86k20r1lJ01K65J31n50K14r4k77k56K84O8j31J65J69l68K08J51J05r4
538G0j78K20l05o8L05N7k11J30k73k05M23J9R9J4l73J0j12O67p5o0M18j02m22
561D8ro4M9K01k4l73l73M10l3J74k00J96q1k41M51M4j74L79J80m62k15K61n82
$$ y = [-984, -1798, -1047, -36, 536, 2143, 2267, 1829, 990, 21, -274, 19, 457, 678, -167, -1359, -1560, -1871, -1411, -53, 759, 724, 497, 36, 43, 612, 1220, 1569, 1067, 526, -388, -947, -875, -673, -286, -435, -463, -856, -1267, -520, 187, 632, 1515, 1085, 141, 231, -84, -428, 494, 564, 419, -616, -1104, -1059, -977, -343, 832, 668, -159, 141, 387, -95, 826, 936, 732, 129, 152, -508, -1154, -112, 301, 71, -86, -208, -490, -360, 345, 806, 623, 681, 287, -376, -359, -242, 193, 14, -142, -330, -578, -643, -210, 147, 322, 322, 216, -146, 181, 107, 164, -60, 297, -151, -417, -532, -82, 28, 107, 293, 73, -18, -21, 80, 345, 476, -74, 140, 46, -231, -487, -203, -135, -266, -101, 68, -300, -92, 59, 164, 70, -108, 112, -193, -261, 44, 101, -110, 20, -253, -458, -35, -16, 83, 97, -276, -266, -378, 289, 214, 154, 572, 470, 48, 39, -25, 24, 225, 201, -172, -545, -135, -168, 6, -194, 2, -79, -320, 131, 175, 1, 380, 560, 98, -117, 144, -438]
584d38L10J96j38j93J19l32K20J35L23J48Lj31j91J40J31j28n6l0k53j99M4K91
606b9k20M57l97m6k3K48j1K27K69J12p73K54j73P9J6L73j2m64J93m60j59O34K02
629B97l66N7k24l6R1L48M76k13l50j6j46l4L50R8l81J7k68nr4K61m1K08L38j23
653B44o50N57j10L96r9p1l16l19J77l46L31L21j25j94J50l13J40M86J44j54Nm87
675b33J87q8K61Qj00J52n88M5L32K52m7j24N8m30j55L16M11j0j62l17L01l52J12
698a71K84K38R4k82k64k36J78J77Mk4q2k11r8P8J7M35J22P4k79l12J44L4L57M2
722C19j38j31r2m36K00N21j62k4oj28J3M0L42J71Q3j99n41n6J82R3j20K54o5l36
746b16P7k21K09K71j84J05k26k21K02K75K04L17m21k66K6K7K78j92n0K94k84o28
$$ y = [-438, -128, 68, -70, -263, -144, -476, -256, -121, 202, 350, 353, 222, 31, 171, 302, 174, 118, 88, -165, -364, -320, -29, -249, 208, -189, -235, -258, -10, -21, 206, 475, 587, -186, 68, -105, -26, -10, 363, 351, -113, 80, -380, -539, 95, 297, -69, -12, -236, -272, -181, 167, 643, 430, 80, 64, -82, -116, 234, 332, -49, -32, -300, -305, -399, -138, -179, 29, 367, 244, -406, 151, 41, 437, 338, 267, -49, -368, -191, -537, -206, 115, -10, -204, -54, -367, -227, 259, 403, 249, 254, -233, -46, -134, 127, 135, 35, 187, -401, -356, -24, 228, 181, 57, 115, -315, -470, -154, 257, 247, 85, -232, 69, -283, -171, 113, 351, 445, 163, -101, -337, -159, 18, 22, -2, -84, -295, -393, -315, -298, 137, 259, 333, 54, -258, -114, -80, 277, 319, 181, 50, -42, -478, -278, 243, 81, 57, 51, -77, -64, -24, 318, 489, 572, 373, -168, -224, -42, 51, -69, 185, 120, -216, -139, -360, -151, 120, -64, 41, -185, -406, -204, 71, 275, 592, 171, -95, -69, -42, 236, 44, -6, 288, 4, -624]
768f24N6L69J61L07K0k70k52J16K13L42K33m86j31k92j67O6P0L21r5j07Kj21L96
791A27j5n9N6M45m49o4K21o1Q5n2l92j11O2j69K3M61J0K15l50Q9k43K25l4K62
815B82M9n05o0N9J41J38J39l21L19l67J1O3j00L9L70k75j13J22k3K11j31J68k2
838A94k37j99L41l42J58L7L2o3j81L11j96J76J08M7L7m19K52L86m03L9K71l38
860A1k15j51L69j75K38J91n79J56J07k12M32J74K6l78P8j18rr0K53j39L8k7j00
883a20l0Q7L30l14m40N33q0L39p8j12k18J54j1n49L76J28K42J20l25Rq6l25L44
906b6J62k30J92k33Q0j8P2M01k08q8j16k07m6L06L82k68K1j52o3j71N9L44k1m1
930A31j76K09k72K57K5j10j0P8k75K65Q9k06M7J70k95J35j22k82P9NK9j2n0J62
$$ y = [-624, -568, -199, -38, 269, 289, 19, -233, -117, 96, 438, 671, 185, 54, -238, -405, -339, -269, 52, -43, -150, -148, -269, 127, 112, 53, 109, 554, 105, 41, 262, 201, 286, 234, -158, -269, -207, -376, -353, 108, 118, 333, -17, 72, -171, 54, 20, 282, 331, -174, -234, -175, -34, 104, 243, -78, 241, -126, -115, -52, -152, -113, 257, -18, -131, -9, -32, 179, 48, 216, 194, -43, -242, 99, -243, -85, -48, -16, -79, -260, 51, -145, 31, 139, 186, 223, -196, 56, 442, 39, 78, 349, 11, -204, -355, 14, -161, 77, 268, -311, -155, -48, -260, 172, 346, 372, -6, 72, -46, -55, -145, 108, -31, 7, -20, -120, -150, -63, 267, -47, -487, 46, -34, 305, 227, 115, -103, 51, 40, -509, -133, -5, 237, 357, 32, 41, -45, -370, -26, 136, -94, 98, -135, -55, -73, -1, 400, 192, 104, -12, -219, -265, 41, 423, 155, 176, 24, -39, -210, -151, 193, 172, 131, -45, 164, -108, 149, 174, 64, 54, 132, -143, 122, 211, 5, 52, 222, -73, 62, -60, -342, -263, -258, -229, -241, -291, -129]
954a29J14R0L72j88Ql67K59q7j45K56k57j35K6jj57K11N54m28J15L4J01k14J31
977A63L10k45n3J0o40L58l00N60l29J70k05j00L16j50M41j36N0J90l70k06K24
998E8O3Q1k53o3J37l16j7j43P38l14M9J8l6M9P9L33j24j25r1k8o09M84k5j30J9
1023a66L4j19j69O09j97J21j42p4j45J96mN2J87j48k51j80J38j13M53j94K2L46
1045B56m1j99J61j56J0Q9k16K09q6m8L7j78L2M3J68l9%L09k37j87J57j03j88J88
1069a9k26K86o4o2p6O9j08K3J62l10K12K63%J43m80L55n3J06J06j68l92Q7K23
1092G7j02P3j2n9k33M07J56k53K89m77J27j07J90k44O2J24pR5J2j66J72K1j48
1115cp9n5J44l9mK5j42lK40N3l39K80j33K45j02j21J1j71K73q9M9k89J51K8j76
$$ y = [-129, -15, 75, 447, 259, 267, -100, 159, 72, -73, 183, -74, -209, -183, -184, -341, -130, 424, -4, 111, 145, 246, 32, 163, 473, 228, 175, 185, -455, -97, -397, 163, -166, 4, -201, -301, 15, -135, 306, 170, 220, 410, 40, -166, 58, 121, 202, -51, -114, 23, -293, -310, -453, 285, -29, 20, 38, 2, 51, 130, 463, 339, 214, 123, 95, -514, -30, -55, -185, -166, -132, -251, -420, 189, -8, 113, -29, -103, -248, -52, -56, -4, 183, 35, -216, -396, -258, -371, 82, -112, -90, 256, 215, 16, 177, 21, 31, 120, -96, 113, 27, -21, 16, -162, -130, -87, 81, 42, 42, 351, 114, -73, 84, -19, -207, -19, -245, 41, -23, -85, -161, -92, -200, -177, -15, -325, -113, 150, 150, 293, -187, 168, 115, 221, 327, 159, -233, -146, 77, -25, 48, 36, -23, -256, 151, 307, 54, 343, -134, -7, -114, 76, -168, -106, 18, 11, 106, 118, -48, 124, 145, -3, -82, -137, 7, -32, -36, -11, -153, -156, 84, 137, -202, 78, -55, 190, 88, -33, -22, -193, 80, -9, 40, -249, -98, -70, -246]
1140b46J85J23k61J19L7K10j74n6J43j17O7K32k59k5J59n6K8K19r0k42j42P8K34
1163A66j31k19J56J10n9Q2m4p9J62k68K16k68J67%K43k83O8K1J13k13J20J88p4
1186A74m15M95m14LJ26J28j52l07L76P2J23j39Q6m06K08J19j0m15K79L02k95J08
1208D6j77O5R5j20J31j82L51p7o1j09N6J76l99J35j09%J66q8K13j59k6L24l92
1231a41j7O4O0J43r6j93r5K99k12Q6q0L37j25LK1MJ4j16J50m0k72K22J07R8q0
1256A41o0L6k59k2K55k2QJ1j21K38j38j95L7J61j17m9P9k10L49q8k80N20k67k87
1280b80K36J31k28N02j52k66M7k77L02n1L07k91O4j84J01K0J13p8J56J48l40j57
1302a77k03K62KQ9k33J85N9Q8K2M9K4J85k54J13k17j16L9k07P8K77J0o9L2k24
$$ y = [-246, -61, 62, -199, -80, -43, 167, -7, -63, 80, -37, 30, 262, 3, -22, 137, 81, 109, 328, 238, -4, -146, -68, 166, 35, -184, -28, 82, 23, 105, 61, -18, 144, -124, 92, -176, -9, -9, 234, -49, 19, 40, 153, -60, 60, 248, 174, -241, 254, -160, -157, -31, 97, -55, -362, 14, 86, 209, 70, 156, -250, -42, 77, 67, -348, -69, 233, -62, 46, -131, -66, 29, -91, 40, -142, 209, 132, 71, -38, 18, 194, -205, -70, -179, -179, -13, -101, 112, -47, -73, 251, -141, -158, -94, -34, 109, 13, -180, -275, 24, -188, -102, -182, 155, 30, 33, 54, 58, 72, -44, 106, 66, -206, 16, 123, 221, 141, 81, 117, -142, -164, 91, 69, 77, 88, -33, 205, 67, -128, -91, 70, -47, -96, -17, -227, 122, 34, -246, 274, 7, -280, -44, 87, -141, 361, 209, -57, -10, -287, 15, -36, 271, -20, 44, -140, -39, -19, 94, 16, 172, 320, -20, -177, -380, -118, -116, -27, -260, -75, -16, 72, 94, 143, 167, 352, 98, 211, -6, -122, -83, -290, -212, 65, 75, 6, 38, -186]
1326a86Q4J70p9L42k59L1Pp0N5Rr8K1j06n1J39k30j64N09j71JJ44r9k6J50k13
1351i0K20Mk14n6J22K7J5k77J64jq0O6J21j44K80j78L04k75K69l05K14Q4n80J98
1375a12n5Jj7J58JL6j71J83OJ69J40L9l81j94K27m6N5j44L33j23o6j06K46j95
1399a6J49J40N3j77p7k45J19Q6m9L6Q3k36K35K8%m32R3J09J54O2l50L79j51k6
1423c3J6N9R1j18K2J0J4M6k55J7j57K82N3R1ok71K68P6k26l02L12j65O15j82k34
1448B3K02l48J36o3r6L6J2J00J74j27q0l25L01J57lk90L34p0j69J53J58n3l98
1471b36L56R0l47K75k43J17Q9J30k45P0l3o9jJ06J78J73o45K92M1j77K00N6N8
1494B35k93L47k95q1J7M0p5l1LJ78l5JK2k97M75j75J41l3k20R9k73N8J1K9K75
$$ y = [-186, -102, 68, -11, 331, 72, 103, 110, 40, 95, 104, 6, 27, -79, -130, 9, -221, -385, 124, -47, -46, 98, -1, -27, 123, -90, 130, 134, -80, -136, -14, 13, 28, -249, -85, -86, -166, -100, 21, -123, 157, -21, 283, 8, 277, -28, 186, 270, -310, -112, -167, -166, -183, -25, -24, 12, -159, 24, 30, 199, 339, 378, -3, -197, 30, -16, 39, -105, 228, 105, 39, -67, 179, -16, 133, 273, 326, 149, 72, -173, -54, 32, -17, 19, 102, -134, 101, 129, 129, -303, -210, -101, 53, 115, -235, 144, -7, -33, -17, 42, 133, 15, 37, 47, 61, 107, -148, -131, -288, -6, 47, 138, 132, -139, 129, 205, -21, -323, -11, -176, 439, 257, 23, 225, -123, 13, -50, -146, -110, -98, 2, 176, 49, -31, -356, -55, 102, 99, -191, 143, 73, -96, 57, 215, 162, -236, 120, 210, -137, 138, -105, 12, 101, 231, -14, 56, 23, -46, -47, 59, 237, 410, -235, 57, 98, -79, 121, 177, 235, -58, 289, -6, -87, -70, -30, -105, -136, -133, 45, 10, 11, 33, -264, 211, 36, 177, 144, -76, 23, -250, -192, -181, -152, 123]
1519A23k1q7j71K48K89m86Q2p3Q9M1K2n4J13j64m2J41j47j19M07m01M92l14N3
1542B1l2j60p9J78j01J12J32l84K50L75l49M9J6K8j23K9o3J78l8k4J32l65L02
1565H4k17L87l95J80K6k52J57J24j19j43L79l33l2pP2Q0r8M4L14j40k9j32RLK0
1590a8j3o1j88J21M9J42K45l06j54M1J90Q4k68K90j22o0L26n36M59j25k7j48L4
1613d5J27J19j73k41J42k02L69j8N2k59r0N3K36j81NJ55J16j06J94m47K38l5j7
1636hP5K00k17r8J95k02oN2m0KJ3r4K7K14kk34J09m7J49k4Ok68j01J38K64j14
1662a1J09k55K36m9j28K31j64j3M1p2J3K41k19K72M2l07J32qj77L13j4l30n6M3
1686a30J75j45J2L17k70K37k46o6N1Q4Pj31l27M22j4l2j3P4l9J28j74J31j47K23
$$ y = [123, 102, 15, -156, 92, 381, -105, -23, -96, -7, 34, 56, 2, 115, -49, -91, 50, -97, -216, 191, -210, 282, -32, 21, -11, -171, -250, -72, -173, -61, 71, -313, -63, 312, -37, 12, 28, 56, -67, -38, -101, 77, 39, 15, 147, -218, 84, -133, 254, -141, 39, 65, -187, -30, 94, -25, -168, 211, -122, -154, -161, -89, -9, -107, -63, 251, 111, 82, -50, -41, -38, -18, -31, -92, -280, -159, -110, 32, 277, -29, -183, -142, 48, 132, -136, 154, 32, -28, 298, -238, 221, 96, 69, -79, -45, 82, 201, 28, -213, -71, -273, 96, 78, 130, -129, -219, -166, 70, -111, -106, 49, 165, 59, 253, -194, 44, 9, -8, 67, 267, 50, -48, 147, -55, -61, -9, -49, -47, -34, -128, -101, 113, 111, -123, -14, -61, 88, 64, 70, -198, -299, -161, 103, -11, 98, -157, 79, 30, -98, 133, -31, -44, -3, -75, -62, 179, -40, 232, 274, -33, 99, 91, -86, 227, 213, -117, -173, -130, 45, -100, -88, 229, -41, 196, -50, -116, -65, 19, 26, -105, -432, -10, -24, -56, -69, 5, -34, 94, -80, 51, -96, 127]
1710A27k32J32J46k91l1K97P3l96P3l8L5k5l3J13L40jj55j96J30o4J08K0o1K1
1734I2k3J70m4j71Q1p3J32l77M16k57J24l6j6K26m41L66k04M7j23KLJ43n6J15
1758I6j5L1K00l50P4j40kK4l0N7L17k71J93J15j25k21j20O2K00k52L74l07J32
1781D2j13j58N9J92R2o1k14K55L9j81J19mMo0M6Np2K44k83m1L28j72j64J36P8
1806A16J87m05K5JJ47r7M12o55L87j6k50K97k65K05Jj65n1rM4L58m58K80O3J39
1830B91l33%J03j32N4j60J7K93j68k0K6J36j9k85K85J4j15J74O0k66K9m0J25q8
1854a9lj84K49Q8k60K67j15k38L86k02R1o7M6j1j88L71k33J52j14n38M82k70N1
1877b59K93L6o9j04J66O0k68k6J71o9J9K2J15j3k05L52j63M5rKk49L05k63j99
$$ y = [127, -105, 27, 173, -118, -149, 148, 221, -175, -102, -140, -105, -130, -163, -50, 290, 289, 134, -62, 68, 4, 112, 132, 71, 92, 69, 239, 195, 24, 105, 32, 164, -213, 203, -54, 70, 34, 18, 244, -197, 169, -35, 12, -111, -109, -106, 37, -19, 96, 81, 112, 312, -38, 36, -104, -106, -82, -112, -55, 262, -9, 184, 299, 174, -47, -167, -105, 95, -157, 217, -90, 42, -71, -229, -170, 22, 114, 53, -161, 94, 133, -48, 71, 67, 71, 11, 57, 62, -10, 234, -49, -90, 238, 66, -98, 38, 116, 303, -102, -77, -76, 71, -26, 386, -269, 118, 102, -148, 149, -116, 89, 90, -75, -126, -135, -91, 267, -191, 89, 152, 291, -42, -42, 61, -71, -17, -177, -160, 133, -35, -55, -29, 107, 88, -197, 88, 102, -13, 161, 221, -45, -16, -56, 69, -19, -22, -206, 43, 131, -129, 138, 23, -215, 171, -31, 60, -7, 39, 28, -160, 211, -22, 130, 16, -522, -40, -310, -259, 34, 70, 1, -103, 63, 123, -145, -171, 0, -69, -50, -28, 87, 74, -131, 221, 58, 103, 94, 96, -153, 152, -111, -310]
1901c10K03N2Q2k57M15j71M7J28j39J95k31L5r2j15K73j49K62r9j43m4R7q2J43
1924A00j07k41K79P6l2j17R5k42J24J59j16J6J98K5j80K9j91J97l31N45n19L63
1946A30kQ5j03K0k75m3L44k89P6K54p3l3k13J7K93j21L2l84L62J2N9l21J87r2
1970g8j15K59k05J64Q0K22l47k6k3J49n2j41K38n4O3o7J85k69J40Nj35L6j23L2
1994f2J37j14l8j3oK44j54j54J18Qr3q0J85P2P3n6j49J95L3j30J80J18l41K27
2018B00l39n5L17r5l13K82k24K36J5j73n1K41Qr7J2l2k13L97l13J13k5Q1R8l8
2042C2m1m7O2J81o8j04j64R1K68m27M29j44J73m33K8K69p2k56K74K4j59j9L08
2065B05r7k49K86m28L24j05K11j59j17Q1N6l07J10L19Q0j59QP8m6J18l38K54j74
$$ y = [-310, -107, -55, 27, -230, 185, 14, 61, 189, 50, 245, 14, 49, -43, -158, 115, -34, 228, 129, -14, -58, 39, -43, 100, -7, -248, 31, 107, 75, -42, 53, -189, -65, 94, -22, -6, 192, 217, 37, 66, -125, 72, -259, 286, -233, 130, 128, 213, 110, 130, -145, -188, 156, -133, -57, 197, 124, 91, -122, -105, 188, 67, 99, -285, 77, 89, 148, -173, 14, -78, -193, 66, -139, 25, 105, 327, -20, -46, -69, 80, 28, -113, 125, 71, 134, 67, 252, -17, 123, 128, -7, 29, -94, -62, 75, -39, -77, -90, -96, 148, -6, -160, -42, -34, -127, -207, -22, 50, 123, 67, -82, 113, 146, 16, 196, 314, -27, 200, -139, -194, 123, 28, -285, -3, -227, 9, 24, -149, -200, 41, 49, -48, -36, -68, -281, 116, -197, -84, -109, -28, 70, 32, -9, -56, 6, 187, 119, 15, -149, -58, 210, -217, 212, 68, 241, -192, -164, 105, 33, -223, 51, 75, -84, -103, 205, 108, -141, 145, -283, 41, -64, 147, -12, -129, -48, 8, -299, -189, 130, 210, 51, 59, 137, 91, 209, -129, 125, -49]
2088d9J53k5J4rl04L38q1j12k7K81k84J97j48J58r5R6k09q3L45k12pj46M24k63
2112d8k2K86m04J8J24K54l28j40K75n3m8p6J56J4q0J19r6J66l6J13J43o17L55
2135G5k02J61J10J58k07j16J00o4k18O7O5L6J51j26J09r6K73l94J18J67k49L53
2157B71q8k10lk2j01K12k25P9jL2Q3K4j1j60j0l9K9J60q0pK74j76J44j50L6J4
2183G5k3j47J59l39O3L91k83J83J03k45L5j75L61m87M59j80kN4r9J02j17L37k67
2206d2o6M8OR2J0j54K98l15j3K89k54l0R3LO0p8K10O4k18j39m6J67J37k00j4J13
2232B1J43j69J62k69K15q0n8J3n3o6J92m7K07l84K84Q4j39P5mk30L03Q6j90J02
2256A98k61j78J14K89j50L1k35J22L83j76j80n8j06K05J94k40k4kO9k12o7K48
$$ y = [-49, 104, 79, 93, 84, -220, 118, 37, -75, -102, 179, -105, 92, -56, 102, 7, 103, -106, -189, 156, -56, -63, -209, 215, -48, -70, 216, -188, -170, -46, 208, -120, -260, 15, -38, -86, -162, -6, 8, -72, 47, -49, 117, 81, 194, 337, -280, 75, -127, 34, 144, 302, 95, -21, 79, 15, -203, -136, -71, -35, 116, -10, 99, 3, 276, -118, 0, 167, -82, 271, 183, -27, -30, -52, -153, 59, -166, -87, -88, -56, 27, 51, 40, -120, -130, -169, -140, 20, -60, -67, 207, 31, 175, 25, 61, 75, 52, -95, 64, -275, -212, 179, -104, 79, 182, -63, -28, -203, 158, -329, 130, -50, -52, 2, -97, 5, -112, 225, -42, -108, -60, -54, 38, 48, -106, 192, -123, -136, 153, -101, -131, -38, -35, 25, -53, 157, 221, 3, -136, -182, -15, 122, -78, -92, 21, 164, -5, 157, -112, 103, 23, -35, -22, -75, -141, 51, 4, 211, -173, 111, 195, 56, 131, 127, -103, 200, 286, 96, 198, -63, -241, -127, 162, 12, 43, -192, -70, 313, 137, -43, -101, -207, -2, 192, -48, -72, -74, -5, -217, -284, -36]
2278c6J17J8o1P1rJ17l14L24j90j50L20j74mR3p2N0k18j3r8O14o64J62K07k54
2302a64N4J82J07k35J87J48r4j53J47j80J54j74m6Q4k5J09q6r0n5r6Q6J29M5k11
2326a77J97j35O1J76J80l20J06n4J11k72L01l09kL29k94J67j16j31K7J80k06M9
2348a32K93j30n5J91j63M1j41K02Q6k06J22j22p7k7m4J94l15K32P2j1j06k1j31
2371b48P27m66k51K2J55J71J63n18J25K29j54K21k16r1L25r0l48K32Lq4O9r0n5
2394a69J33k3k0K46k03P8nk56q9K96M9p9M4j9R6j77K2J87k47K0J07j46L1J33k96
2419b87J64K42j0k04P4Q4k11p3J09L78k46J80l19J48j22K4J23M9o7L9n5J73j73
2442B0k0m5j8J51k26K12n1q5J18o2Q8k44P2J52J34k14R0l02N38j75k80L14j46
$$ y = [-36, 81, 99, 38, 109, 100, 217, -97, 227, 37, -113, 207, 33, 29, 122, 50, 100, -118, -131, -229, 385, -279, -117, 90, -164, -110, 72, 179, -56, 131, 279, 185, 32, 179, -1, 153, -21, -67, 17, -8, 101, 15, -75, -130, -226, -140, -11, 34, -177, 20, -115, -54, 122, 302, -18, 88, 34, 145, -127, 174, -135, -137, 192, -102, 65, -51, -182, -155, 25, -181, -132, 161, 31, -24, 167, 4, 45, -96, 106, 192, -14, 108, -14, -91, -118, -162, 32, -283, -51, 21, 10, -96, -117, -248, 479, 13, -238, -216, -61, 110, 273, -245, -120, 109, -45, 176, -40, -131, 194, 104, -244, -12, -9, -93, -24, -114, -169, -36, -59, -79, 167, -36, 42, 37, -219, -308, -12, 37, -42, 2, -17, 79, -98, -76, 111, -136, -116, -9, -155, -124, 9, -287, -123, 119, 109, -95, -21, 63, -148, -221, -112, 266, 20, 200, -119, 29, -93, -69, 54, 103, 36, 75, 20, 193, 20, 0, -45, -63, 88, -138, 74, 23, -62, 56, -6, 82, -162, -90, 62, 196, -18, 72, -230, 308, 133, -147, 167, 21]
2465B1j6j71jPL31k11O5m6j0k11J65QK11q8k07J05J27j24Q2j39M56n6k68L9j38
2490f9R6p6R4RP3o4K1j61J66j68M3o2J34p9J61j35l1R1J52k39o1R1qR0k51R7M5
2517d1L2r8J22J56j08j68K54l87K39q2J53kj20Q6J22j84j16p1N0L1K22k14o9L18
2541A25R0k77J27K08k31k09k9O9M3j2J64K15n02M5J54K37l0q7j33J68j93J55K36
2564C33k80k37J60J43J74l54J53L6j86J28j5j35o2K28J70l81Q3L6J8J84l60K84
2586A20K3j3j04l86L66j50J22O1j70J7K71m5j76Q9L8J26j58PJ40n9k06J14J9J82
2610B28k77J60r4p9K50j69J02k31qo0o4K50q3Q7M5R8j27j13l9J35K29j89J85k3
2634B13O4j96k6J14qj07J50m12L12p5j23j42L79j83j47j21M82j7m05l7L42j9J1
$$ y = [21, 5, -166, -167, -160, 171, -40, 25, -21, -31, -242, -77, -69, 142, 54, -153, -48, 79, -45, 37, -102, 354, 298, 30, 69, -69, 27, -49, 45, 54, 127, 63, 84, -77, 89, -79, -36, -98, 36, -43, 118, -17, -48, 43, 195, -44, -105, -14, -22, 68, -183, -86, -41, -9, -107, 15, 171, 63, -105, 149, -238, 1, -81, 72, 70, -50, 36, 158, -26, -142, -213, -163, -132, 90, -124, -193, 125, 215, -62, 65, 273, 42, -167, -196, -127, -84, -96, 68, 283, -219, -174, -20, 217, 187, 100, -33, 135, -58, 97, 333, 53, -184, -24, 119, 293, -61, 92, 128, -58, 70, 55, -80, -142, 86, 256, -125, -42, -6, 12, 196, -164, 120, 143, 130, 26, -360, 6, -144, -22, 39, -131, -114, 157, 112, -64, 25, 63, 189, 31, 38, 178, 119, -87, 27, 46, 228, -49, 111, 17, -62, 188, 19, 121, -110, -118, -178, -242, 8, -75, 12, 57, 155, 28, -85, -124, 11, 240, 51, 236, 213, 277, 81, 55, 169, 161, 54, 204, -208, 104, 29, -94, -236, 143, -40, -187, -308, 174, 157, -248, -285, 57, 38, 49]
2657D9N1j2L3k4k05j53N7q1L44nJ22j37k76J37l8qJ44J37j80j19J52P6j12m8m2
2682a38J37k03K87m4j08K80k3P2k73J01k60J47j02M25j48r9j39R0k0j7q6P9J96
2705A54p6k10L9K99l36K40k05r9L38M9m8j5M6j40l1Q6J0m1p9J07j14k17K08l3
2729f8J82q0P3m9N3j48j07J76r0J12k7nJ40J07l27O1P0j64N9p8j06J65Q7k17K20
2754C9l6q2o7L31l83J55K20J1L5j55k40L55p7j67M15l92Q8j87K32K10n8k94l1
2777g8n0M3J31j38J04j30J45O6j61j17n0J91k8K4Q6O0p2K5l41K68m9j60L70l36
2801a97L61l44R8J02j10L0k3Q3j74K03O8J41k42K87l14k86M21o2o4j5K2J1p6r4
2825a74K28J80j11n2j10K3O2M3p4K5n4j14O3l23L12K60n3j56JJ0q0J38K04M7n09
$$ y = [49, 100, 88, 121, 97, -108, -261, -204, -285, 59, 54, 176, 39, -237, -100, -138, -146, -2, 135, -45, -164, -12, 64, -48, -96, -138, -1, -204, 83, 39, -69, 211, 188, 260, -13, 88, -172, -25, -127, 298, 150, 51, -88, 2, -18, -35, -121, -42, 154, 78, -132, -93, 206, -130, 110, -95, -194, 144, 193, 145, 130, 176, 36, 5, 91, 101, 60, -19, 88, -26, -243, -35, -68, 114, 34, 107, 58, 111, -37, -144, 32, -58, 54, 27, 22, 162, 269, -58, 3, 73, -91, -32, -110, -216, -51, 36, -181, 39, 3, -79, -146, 185, -198, -43, 177, 188, 223, 68, -172, 183, 106, -61, 354, -38, 50, -137, 95, 305, 247, -47, -78, -128, -85, 46, -92, 12, -118, 27, 93, -68, -185, -235, -44, -72, -48, 38, 98, 26, 51, -290, -22, -71, -231, 139, -197, 164, -180, -82, 20, -90, -60, -83, 0, -174, 29, 97, 238, -4, 283, -31, -317, 104, 42, -22, -37, -15, -4, -80, -174, 54, 234, 123, 71, -39, -16, 46, 89, 15, 40, -14, -128, -65, -388, -76, 184, 131, -25, -24, -14, -94, 44, 248, 295, -214]
2850b14m7L19Q1j17M5Q0k24N0o0J54J14k27J33k67J10K15j00j22J66j58J44jk91
2873b17j04N55l38L1J87j30K3J93k47J06j5j96J31j69K85k69K08k30L36K5k26
2894f1K58l8k70J00no6J91k78K6M22l10o7JJ29j90J39r9j39N88j66k79N12k53
2917A45j87J26j09O5jN3j3l11Q7M59j4o23L92k16K27N6j84M14k61j66n2J78O5
2940A30l52J25m7K11j91O5J4J58m52L24O1j75o8L22j55J2n6Q2P0j32LK83n34J84
2964a18l6J36j16L40j15n3j23K20Ml4J55j93J20K11k54r8M7r1qN7qj20J67N2j00
2989D2l1L3J31j25L24n73K72K05l01J18q9J63k47%J22J54J31m11m0K11l70M34
3011A53j61j0P1L5p4j03K69k16j71J94J76k59j82K36O8J59J8j97J45L7l49K24
$$ y = [-214, -261, 58, 139, 22, 67, 147, -77, -27, -87, 67, 181, -46, 87, -180, -70, 145, 45, -77, 89, -69, 75, 74, -217, -321, 234, -104, -73, 114, -16, 7, 200, -47, 59, 44, -152, -21, -190, 95, -174, 34, -196, 140, 165, -61, 197, 159, -111, -11, -16, -82, 109, -169, -143, 279, -31, -98, -97, 32, -158, -19, -118, -257, 331, 165, -114, 398, 145, -42, 84, -25, 40, 39, 92, 79, -232, -145, 314, 300, -323, 69, -147, 80, 136, -48, 366, 105, -61, -113, 65, 130, -222, -97, -144, 67, -124, -59, -45, 113, -339, -15, 46, -129, -197, 125, -30, -18, -74, 8, 78, -54, -51, 232, -302, -118, -154, -18, -134, 206, 91, 38, -85, 135, 139, 105, 260, 67, 187, 398, 144, 46, 93, 2, -6, 51, 43, -77, 90, 142, 42, 11, 44, 175, 50, 374, -199, 73, 278, -23, 95, 6, 169, -78, -78, 44, 198, 329, -82, -122, 89, -281, 153, -8, -18, 53, 88, 14, -89, 180, -36, -207, -13, 163, -96, -278, -42, 26, 185, 203, 6, 151, 188, -161, 63]
3033F3pkn9M7n6J58L2j04j73m4J04n0N9q4M2P1M8J55k3m07R6N0R6K44j44K01l58
3060d5j14J86j86J69j65J45K06m26K8J84Q9Q2q0j00o3K3J7N9k11J14L7Q7M4l4
3084D6L5J63k08j68O5Q6l5J01r2o7q9R3J91M1k75M21l54J18J36j07R1k49J09j48
3108i6J82l2J02j19j20K01k29K91m0MK6k34J5q8M24l43lK59l92K86j10j52K76
3131A08r0jj71J35j45J80j7n3L31k42%R9l37L00O9p7k08J00j18m6K79J7j25J69
3155A57O2j58K13l61K60j44R4k31K03k18K94k44QJ43J9k16K62j70J34k05J57J07
3177A66k40P3j1p9K09k25j56K16L35j77l02J28M1p0J54k95K98j6Mk53J95J8k3
3200a0K8m4j42K48k24R0K68j94K9opr8J46k36p1K28J47k40p7L67q8j46J31j9j01
$$ y = [63, 56, 54, -5, 42, -14, 144, 176, 72, -101, -145, -41, -91, -32, -116, -74, -3, 45, 200, 177, -230, -134, -84, 12, 256, 112, 313, -45, -159, 27, -159, 10, -155, -10, 196, -230, -202, -18, 71, 153, 73, -27, -90, -67, -50, 9, -202, -88, -51, 36, 80, 46, 81, 244, 36, -132, -67, 19, -16, 85, -7, -74, -163, -70, 121, 162, -113, 308, -46, 72, 208, 101, 192, -57, 52, -96, 86, 54, 156, 37, -83, 118, -111, 180, 140, 144, 170, -64, -49, -137, 287, -56, -59, 200, -192, 94, -16, -168, 108, 18, 17, -154, -19, -164, 16, -1, -54, 277, 35, 35, 134, -203, 97, 166, 89, -119, -19, -137, -183, 96, 113, -12, 157, 219, 61, 274, -87, 173, 29, 123, -108, 95, -123, 171, -73, -65, 78, 97, -119, 143, -27, 107, -98, 59, 166, -74, -1, -12, -91, 118, -107, -263, -47, 288, 111, -191, -63, -22, -92, 62, -233, 65, 49, 53, -200, -5, 13, -10, 18, -26, -168, 80, -144, -54, 214, 20, 49, 43, 36, -62, 84, -152, -223, 5, 152, -88, -165, 202, 114, -32, 99, 80, -21]
3225b1J53j08M2J67j65O3k5Q4j41J73r7M5k07J09k1l0k41J59j76K63O0j93J56
3248D9n0J24J04j95ol26o4N13L4j79j29K20k76J6J44j5j10k7K5K15J14m20L66
3271A27J21k71R7n6K68j58l97J73N4r7J87k38J2K63m9j59P4j89K83J90k80Q6m47
3294d06N33M1j83j31L7K44j86p5K15O0k78r8K60pk72J26L49k47jO3Q9K6l40L72
3318A91k88J4J19j08N8M07o65K20R4J06k75R1j52Q1J58n6m1Q2LL3J03k93J88p1
3342ao0j44K33J1R5J96k29l4Q6j23j40M45k0O7k53j73J7L0K61j49PQk40J08J4
3367A2PqK20R8l03j75J16L58n26P7O0o3MJ66m7rK14p6l02O8L80l52M8J24J41l01
3393f9J26k98J83J72rj70m3M42l02p0j05J17l5M7K34k85K22n56O76m93K88o5Q
$$ y = [-21, 132, 24, 66, 233, 68, 131, 106, 190, 49, 222, 125, 170, -37, 72, 51, 21, -220, -61, -237, 26, 86, -107, 49, -1, 123, 227, 32, 26, -300, -364, 149, 183, 4, -125, 95, -181, -165, -21, -36, -146, -173, -148, 67, 181, -239, 127, 248, -23, 74, 18, 286, 128, -269, -96, -42, -139, 48, -190, -178, 85, 36, -123, -49, -238, 45, 235, -45, 41, -406, 127, 168, -15, -146, -109, 135, -51, -126, 89, 149, -129, -227, 33, 26, -246, -120, 229, -18, -19, 44, 133, 159, -181, 191, -97, -83, 36, -72, -14, 393, -272, -52, 42, 148, -127, -36, -188, -107, 51, -5, -46, 36, 39, 72, 175, -118, 70, -1, -61, -205, 28, 39, 134, 330, 101, 67, 153, 30, -110, 335, 315, 382, 129, -44, -27, 3, 264, 115, 122, 130, -110, -2, 12, 19, 11, 231, 329, 26, -149, -33, 325, -201, -124, -64, -127, -123, 43, -4, -13, 201, 125, -177, -109, 271, -81, -33, 91, 232, -69, 57, -241, -58, 114, 105, -65, -108, 334, 32, -38, -143, -26, -61, -14, 220, -65, 157, -399, 277, -216, 72, 7, 15]
3416A5K01k82J38o6L1k99K90m3j48K47m7m05N10j13n1p5J47K9o7n1o8J16nj64
3440a60P3M8K18k40J97k8k00r3K27K2K3j43O6k7M1P2l01O34n25lR1P2J20j31P5
3465A28j0j47j58J63n2K85q7j07m7K76k30J38K8M7l19J84L7j13M6J9q8K9J96l24
3489a06J34l7j56K45j50N4R2k26P7j60J48l02M88o30K54J67q7K61J17j47l16N49
3511B69j9m22J84M0%o0Q6l11M25p0j87J29J62l31J14J22l4j06J01nn5J22k29J46
3535G1J77l55P9K2k49L92k90L15k32p2k6K04L5l1k6k10l1K06K0r9l5J19L4m8Q7
3560E7m6O6l71L57J99l74J95J54n62K24J87R1j93M2j69j08K09m4K0OJ4J40j09
3583a5J28k52k22M72j28J02n1l7l6K14k37m0J34J26j07M1l33K13j6J02J34j24
$$ y = [15, 216, -66, 72, 6, 37, -262, 28, -15, -163, 84, 37, -368, 142, 29, -22, -97, 50, 79, 12, -39, -107, 9, 4, -160, -87, -39, 179, -61, 136, 108, -92, -185, 42, 64, 87, -56, 10, -17, 24, 96, -205, 429, -96, -99, -8, 64, 184, 53, 128, 118, -29, -187, -24, -76, 209, 122, 15, -32, 244, 14, 152, 180, 227, -92, 92, 129, 16, 62, 81, -7, 22, 218, -106, 28, -9, -165, 80, -70, -16, 76, -150, -73, -233, -85, -387, 101, -529, -275, -108, -195, 66, 183, 36, -280, 269, 250, -172, 12, 52, 52, -8, 78, -233, 192, 122, -65, 64, 226, -105, 9, 131, 97, -9, 92, 87, 32, 154, -75, 71, 248, -107, -28, -6, -255, 137, -153, 162, -70, -142, -168, 36, 71, 40, 14, -196, -227, -21, -1, -100, -135, -16, 18, -30, 57, 11, 77, -294, 63, 262, -112, 83, 237, -325, -101, 86, 177, -16, 26, -143, -251, -42, -86, -66, -60, -46, 94, -15, 113, -139, -361, 111, -17, 85, 34, -3, -39, 175, -62, -102, 32, 158, 51, 92, -241, -28, -44, 58, 192, 68]
3605F8J54k55Kj46Q5j25L17j70P2J84l00N6K05j58l00J63J96J7l39L73j88k45
3627c34M25k51j1l45N63K69m10P3j33j9K17qj97J73j3j50K29Q7O7j86m4K8j57
3650a27K15r8m8J11K05l59J28J82K6k62o2J27J01K04l57k36J90P0k00K3L28j74
3672a3q7o5L08k71K80k22q2O9K02m5m4N2J15k15P5J54l50J35j06J68JL8k01L58
3696B54l07N2j3j1J5K04J3l28K9K64k52k6K7j9j80N30j59l3N0l71J34j22K96J13
3720A60l05k0P5j58L94j44k49K16OQ0k13K83m5J42k18M2k73J35J99j36J96J48
3742C15n47Q2K21j47k39L78q2M0K47l91J53K09k25L0m6M2j95j06J67P3j5j32K74
3765A06j46o0k48M37l1r0L9j7o0J80Q8j14M8m4O4j02n1k30L73J80m68J90j53R6
$$ y = [68, 222, -33, -31, -177, -92, -217, 100, -70, 2, 186, -114, -58, 147, -11, -311, -148, 48, 65, -274, 99, -89, -334, 91, -160, -171, -516, 47, 316, -94, -21, -154, -173, 44, 36, -161, 12, -1, -151, 78, 165, 232, 46, 2, 30, -127, 88, -10, -58, 53, 258, -101, 27, 209, 235, -27, -89, 38, 139, 343, -14, -250, -60, 10, -190, -167, 161, -13, -100, -165, 143, -128, 152, -70, -152, -83, 119, 74, 30, 82, 197, -18, 57, 211, -139, -4, -110, 58, 59, 97, -104, 254, -53, -1, -14, -25, -10, 194, 207, -121, -92, 172, -80, -106, -79, -98, -278, 252, 93, 60, 110, -261, -127, -249, 47, 160, -145, -165, -90, -248, 146, 2, -247, -31, -25, 55, -158, 125, 80, 222, 4, 46, -227, -92, 107, -29, 167, 315, -232, -150, 71, -76, -315, 63, -19, 21, 268, -123, 30, 239, 14, 44, -2, 40, -155, -261, -94, -21, -36, -168, 106, -40, -100, -348, 89, 58, -32, 7, -10, -70, 110, 198, 84, 132, 88, 152, 50, -1, -231, 142, 322, -146, 44, -109, -13]
3789a3J00m0MJ27n12L94j45M14k92J0j28QK96j89J81j04j33K11j57n9N9j96J28
3812c6L47n09J6J50K46k09J3Pj78K91q3J10k19j15L85l08R8j04J85j64J69k89
3834a97K34j50j94J00j15J20M8L80k47l8N1J27Mj14L1j3J92j4K3q7m8k3k70K22
3858B2J26k49L20j59j55L24j62l05J34L25m40J9N7p2k8K32K22m11L04o2j46L66
3880B62n33L06J67k70Q7o2Qk6L44l04j86M38k16J24j99k6J18k21L00j75O9k91
3902b86M53O0m35R6N8J33L9j10k40K83o2l29L29j97K00p7J02j22J88q6j21n2K18
3925D2J04k91R3p0K42k39j1N7K66k02j03J61j46K86l80PJ35OL63k60K6k96M21
3948B11j37J07k54n7j20K32k3j22K76J02j3j85P0J01j82q2q8L22p6n0p4j32R9
$$ y = [-13, 87, 47, 51, 178, -334, 60, -85, 329, 37, 47, -81, -73, 223, 34, 215, 111, -22, 189, 32, -27, 32, -164, -36, 311, -198, -182, -32, 214, 5, 18, 25, -153, 138, 55, 165, -54, -169, 216, -92, 6, -98, 87, -77, 92, -197, 37, -113, -307, -207, -322, -202, -154, 226, -21, -59, -8, 119, 123, 9, 40, 27, 219, 205, 228, 141, 93, 70, -200, 22, 148, -101, 219, 60, -95, 229, 67, -238, -104, 221, -219, -200, -143, -215, -243, -11, 211, -200, 104, 42, -104, 262, -271, 35, 202, -68, 19, -43, -35, -61, 283, -21, -207, 231, 15, 139, -60, -86, 32, -189, 111, -64, 5, -286, 167, 227, -208, -112, -54, 79, 118, 8, -232, 51, -11, -340, -11, -208, -8, -85, 17, -105, 83, -3, -124, -176, 42, 146, -145, -52, -122, 120, -119, -130, -73, 193, -9, -112, 49, -97, 189, -191, -184, -49, -43, 320, 60, 86, -210, 211, 74, 181, -73, -130, -250, -18, -41, -163, 113, 215, 202, 17, 87, 188, 6, -76, -164, 158, 82, 32, -42, -174, -75]
3971g5n7J46K0k40K08K57k77J6K13k34j7j9p4J59k0k7k14R7j12J55l6lJ69m1K67
3996B61k44J31j76JN4j07K57k15J79j51J11l7j38K75r1j05K16l06qJ46J9lr6J62
4020A35j0l00R6K41o6k04J4O4Okj69K32J08k3j15P0j71K3J80k56K84k46J23l20
4044c06J57n0K78j10j78J12J84m8J37k67K37N5j34L8k31K95j47p1p4K13j56K31
4066A65j79N9l19M23j33j40J95j99P3J1K92l32j06J75K2p0L05j90N6J10l89o8
4088b39K45J71k84P4L8J80k02q4L6J5j39N0J38r1L73k76L7k6j03J83jl15K75q4
4112b9j38R3Q4J21q0K93k88l07J41J6L29l00k8Q5k1J29j3L4n9r3j03J55J6K0R
4137F6J57r4J2j23N4m5p0l4J42j12K21j41r6J91k2j85J40k23J59%Oq6j13P7K27
$$ y = [-75, -132, 14, 34, -206, 2, 259, -18, -2, 211, -23, -40, -59, -133, 26, 6, -21, -235, -138, -250, -95, -131, -134, 35, -6, 261, 17, 148, -28, -27, 27, -80, 177, -38, 141, -10, 101, 64, -74, 201, 110, 5, 221, -85, -93, 53, 72, 69, -27, 135, 125, -175, -79, 162, 96, -108, -94, -30, -24, -26, -195, 37, 145, 122, 7, 77, -94, -71, 109, -147, 137, -109, 14, -306, -149, -199, 79, -31, -209, -97, 87, 39, 176, -91, 146, 201, 67, 105, -126, 169, 22, -49, -123, 90, -66, 165, -14, 45, -274, 149, 16, -124, 71, -128, -55, -44, 248, -84, -190, -15, 7, -63, 242, 52, 108, 218, -171, -239, 6, 177, -107, -33, 5, 185, -17, -101, -65, -50, -189, -139, -1, -92, 281, 5, 42, 16, -87, 96, 95, -220, 55, -29, -167, -74, 10, 131, 51, 344, 56, -251, -110, -94, 235, -65, -93, -8, -29, 100, 87, 121, 62, -31, -134, 21, 37, 57, 66, 223, 129, 141, 18, 72, 27, -43, -77, 65, -47, 174, 33, -63, 128, 106, -79, 61, -162, -3, -3, 3, -83, -196, -119, 108]
4162A08J05k52J02J47q4r2m9N9Q0k64j19J73l9K73j45l42K37o5M42m35K42J01
4184A83j89R1J11L0j59k16K81k00J24L1j08K64j46l43N61k41j55J27k3k6Q0j16
4206c9J45p8j2r0N6J71k84m2O9j66L84j69J31k54K04J62j93J59j31N2j07L3r4
4229i3m3K76m1m45N06k70L81j84J5J97l78K48R8j60j33j26o1K65k4l7j44K35j05
4252b3K5J42j54j77N57k36m77J68R5P7k5k86K75J07J5K11O3k87k37J58O0m4j55
4275a48K89j69k8K12p7Q3r2k48Q2k7J65j94m9LM41m55J44Q3J50k4k18J65k0k65
4299a97L29k36J31m1q1K5Q0J10J66j62J12k43K12j08o3q7k42K19L74k97j36R3
4321d2Q1j2M5p2l4j01q9L11o9j42J34j10K08j46j12Q4K74j5k66L5J63k72R5j99
$$ y = [108, 213, -39, 63, 210, 126, 34, -15, 44, 124, -140, -259, -86, -125, 148, 3, -339, -102, -167, 275, -160, 82, 183, -6, 85, 196, 226, 67, -149, 132, -68, 56, 87, -21, 243, 97, -246, 315, 74, -81, 46, 23, -3, 77, -39, 106, 28, 16, -74, -18, 153, -131, -173, -104, -270, 114, -55, 76, -178, 26, 188, -5, 154, 23, 75, -32, 1, -93, -136, 140, 99, -346, 160, -110, 271, 87, 102, 299, -79, 169, 267, 107, -26, -152, -213, 52, 28, -9, -153, 82, -23, 2, 144, -10, -187, 370, 134, -343, -175, -80, -3, -28, -314, -39, 68, 83, 294, 357, 70, -167, -9, 51, 7, -148, 141, -28, -56, 156, 79, 162, 70, -178, -96, -123, 42, -152, -201, -198, 243, -212, -68, 15, 165, 141, -77, 88, 68, -197, 132, -104, 27, -14, -95, -70, 10, 120, 286, 124, 236, -7, 205, 97, 34, -53, -295, -76, 298, 1, -135, -42, 39, 27, 72, 0, -34, -135, -224, 87, 18, -124, 10, -100, 108, -38, -150, -66, 208, 193, -73, -38, 125, -147, -52, -251]
4345b51L70k05o3J8K12P2k01O9k78M37j64l0J8O1r0J57Q2m38K51J8p5J02o1j95
4369a84L66P1l41R1p8K22k48J37J38l12p5J23J40l2j72k16L81J93m88M12j40K89
4391B77k36n7L91o25L10Q4NKK5j99J70j08J70k07k00K21J12j01K26k46p7J42q2
4414cJ77l98R7j9Q2l9j4k2r7M58q4k91J20q1J33K95l92o0M5J08K75m29K77j89
4438e1l4J65l0q5M7j80J91OJ84m28P0K85j40q7k56L58K0l0k28l7M93l47j4R8J12
4463H2k96j07L56M4o5p5J29J19M6l39J34M69l06k73L8k9Q0k7N7r5l2J71r7J10
4487I4l75K96l7R3N3n4p1K02lp0l47K05k01L13l8m09M86k2r3l28K08K00k53L35
4511A84j98K4J76j88j71K81K3l92K72Q9j11J83k71K65m5J57l70J91l09k2K91J05
$$ y = [-251, 119, -86, -149, -131, 81, 153, -48, 21, -257, 180, 16, -14, 4, 65, -25, 132, 214, -224, 27, 45, -30, 72, 11, -184, 182, 253, -88, 3, -75, 147, -101, 36, 174, -138, -213, -90, 50, 18, -154, -370, 11, 204, -284, 128, -12, 277, 41, -16, 375, -250, 60, 144, 149, 151, 176, -23, 147, 39, 209, 2, -198, 23, 135, 34, 260, 14, -63, 79, -3, 174, -224, -127, -146, -64, -103, -117, -139, -236, 222, 138, -153, -33, -114, 19, 314, -78, -138, -93, 15, 290, -139, 138, -51, -85, 80, 50, -35, 12, -168, 23, 29, 213, -215, -145, 140, 0, -87, -343, 15, 35, 5, -223, -260, 233, -114, -128, -30, 82, -214, -321, 35, 79, 14, -61, 68, 187, 233, -106, 28, 497, 191, -82, -44, -73, 7, -20, 37, -58, -90, 81, -16, 94, -281, 15, -22, 71, 124, 70, -1, 201, 198, 128, -219, -14, -215, 98, 60, -349, 137, 115, 22, -306, -98, 102, -151, 184, -14, 10, 186, -2, -173, 108, 131, -261, 11, 100, -11, 172, -99, 166, 121, 278, -92, 99, -210, -232, 59, 164]
$$ [...]
8191g7
##END NTUPLES=NMR FID
##END=
