##TITLE=1H_DE-106_ch_6
 200.13MHz, CDCl3,
 8 sc
 
 19.8.2025
##JCAMPDX= 6.0         $$ Bruker NMR JCAMP-DX V2.0
##DATA TYPE= NMR FID
##DATA CLASS= NTUPLES
##ORIGIN= UXNMR, Bruker Analytische Messtechnik GmbH
##OWNER= pz
$$ XWIN-NMR		Version 3.5
$$ Tue Aug 19 14:52:16 2025 Russian Standard Time (UT+4h)  she@DPX200
##.OBSERVE FREQUENCY= 200.1308
##.OBSERVE NUCLEUS= ^1H
##.DELAY= (6, 6)
##.ACQUISITION MODE= SIMULTANEOUS
##.ACQUISITION SCHEME= undefined
##.AVERAGES= 8
##.DIGITISER RES= 18
##SPECTROMETER/DATA SYSTEM= spect
##.PULSE SEQUENCE= zg30
##.SOLVENT NAME= CDCl3
##.SHIFT REFERENCE= (INTERNAL, CDCl3, 0, 14.3821)
##AUDIT TRAIL= $$ (NUMBER, WHEN, WHO, WHERE, WHAT)
$$ ##TITLE= Audit trail, XWIN-NMR		Version 3.5
$$ ##JCAMPDX= 5.01
$$ ##ORIGIN= Bruker BioSpin GmbH
$$ ##OWNER= she
$$ F:/spectra/data/she/nmr/H-C/1/audita.txt
$$ ##AUDIT TRAIL=  $$ (NUMBER, WHEN, WHO, WHERE, WHAT)
(   1,<2025-08-19 14:51:06.00 +0400>,<she>,<DPX200>,
      <created by zg, POWCHK disabled, PULCHK disabled
       configuration hash MD5:
       00 E9 B6 7A A2 85 ED C7 34 08 36 98 17 FE 4E 26
       data hash MD5: 16K
       65 F2 CB 9E C0 73 4A D3 77 7B 94 94 AE 90 1A E6>)
$$ ##END=
$$ 
$$ hash MD5
$$ 35 88 EE 4D D6 37 44 5F F4 36 3A 9D 75 95 B8 04
##$RELAX= 
##$RELAX= 
##$RELAX= 
##$RELAX= 
##$RELAX= 
##$RELAX= 
$$ Bruker specific parameters
$$ --------------------------
##$DU= <F:/spectra>
##$EXPNO= 1
##$NAME= <H-C>
##$PROCNO= 1
##$TYPE= <nmr>
##$USER= <she>
##$AMP= (0..31)
100 100 100 100 100 100 100 100 100 100 100 100 100 100 100 100 100 100 
100 100 100 100 100 100 100 100 100 100 100 100 100 100 
##$AQSEQ= 0
##$AQ_mod= 1
##$AUNM= <au_zg>
##$AUTOPOS= <>
##$BF1= 200.13
##$BF2= 200.13
##$BF3= 200.13
##$BF4= 200.13
##$BF5= 200.13
##$BF6= 200.13
##$BF7= 200.13
##$BF8= 200.13
##$BYTORDA= 1
##$CFDGTYP= 0
##$CFRGTYP= 5
##$CHEMSTR= <none>
##$CNST= (0..31)
1 1 145 1 1 1 1 1 1 1 1 1 1 1 1 1 1 1 1 1 1 1 1 1 1 1 1 1 1 1 1 1 
##$CPDPRG= <>
##$CPDPRG1= <>
##$CPDPRG2= <>
##$CPDPRG3= <>
##$CPDPRG4= <mlev>
##$CPDPRG5= <mlev>
##$CPDPRG6= <mlev>
##$CPDPRG7= <mlev>
##$CPDPRG8= <mlev>
##$CPDPRGB= <>
##$CPDPRGT= <>
##$D= (0..31)
0 0.7 0 0 0 0 0 0 0 0 0 0.03 0 0 0 0 0 0 0 0 0 0 0 0 0 0 0 0 0 0 0 0 
##$DATE= 1755600665
##$DBL= (0..7)
120 120 120 120 120 120 120 120 
##$DBP= (0..7)
150 150 150 150 150 150 150 150 
##$DBP07= 0
##$DBPNAM0= <>
##$DBPNAM1= <>
##$DBPNAM2= <>
##$DBPNAM3= <>
##$DBPNAM4= <>
##$DBPNAM5= <>
##$DBPNAM6= <>
##$DBPNAM7= <>
##$DBPOAL= (0..7)
0.5 0.5 0.5 0.5 0.5 0.5 0.5 0.5 
##$DBPOFFS= (0..7)
0 0 0 0 0 0 0 0 
##$DE= 6
##$DECBNUC= <off>
##$DECIM= 32
##$DECNUC= <off>
##$DECSTAT= 4
##$DIGMOD= 1
##$DIGTYP= 9
##$DL= (0..7)
0 120 120 120 120 120 120 120 
##$DP= (0..7)
150 150 150 150 150 150 150 150 
##$DP07= 0
##$DPNAME0= <>
##$DPNAME1= <>
##$DPNAME2= <>
##$DPNAME3= <>
##$DPNAME4= <>
##$DPNAME5= <>
##$DPNAME6= <>
##$DPNAME7= <>
##$DPOAL= (0..7)
0.5 0.5 0.5 0.5 0.5 0.5 0.5 0.5 
##$DPOFFS= (0..7)
0 0 0 0 0 0 0 0 
##$DQDMODE= 0
##$DR= 18
##$DS= 0
##$DSLIST= <SSSSSSSSSSSSSSS>
$$ [...]
##$SUBNAM0= <"">
##$SUBNAM1= <"">
##$SUBNAM2= <"">
##$SUBNAM3= <"">
##$SUBNAM4= <"">
##$SUBNAM5= <"">
##$SUBNAM6= <"">
##$SUBNAM7= <"">
##$SUBNAM8= <"">
##$SUBNAM9= <"">
##$SW= 18.0517779522481
##$SWIBOX= (0..15)
0 0 2 0 0 0 0 0 0 0 0 0 0 0 0 0 
##$SW_h= 3612.71676300578
##$TD= 16384
##$TD0= 1
##$TE= 0
##$TE2= 300
##$TE3= 300
##$TEG= 300
##$TL= (0..7)
0 120 120 120 120 120 120 120 
##$TP= (0..7)
150 150 150 150 150 150 150 150 
##$TP07= 0
##$TPNAME0= <>
##$TPNAME1= <>
##$TPNAME2= <>
##$TPNAME3= <>
##$TPNAME4= <>
##$TPNAME5= <>
##$TPNAME6= <>
##$TPNAME7= <>
##$TPOAL= (0..7)
0.5 0.5 0.5 0.5 0.5 0.5 0.5 0.5 
##$TPOFFS= (0..7)
0 0 0 0 0 0 0 0 
##$TUNHIN= 0
##$TUNHOUT= 0
##$TUNXOUT= 0
##$USERA1= <user>
##$USERA2= <user>
##$USERA3= <user>
##$USERA4= <user>
##$USERA5= <user>
##$V9= 5
##$VALIST= <valist>
##$VCLIST= <CCCCCCCCCCCCCCC>
##$VD= 0
##$VDLIST= <DDDDDDDDDDDDDDD>
##$VPLIST= <PPPPPPPPPPPPPPP>
##$VTLIST= <TTTTTTTTTTTTTTT>
##$WBST= 1024
##$WBSW= 4
##$XGAIN= (0..3)
0 0 0 0 
##$XL= 0
##$YL= 0
##$YMAX_a= 580458
##$YMIN_a= -786803
##$ZGOPTNS= <>
##$ZL1= 120
##$ZL2= 120
##$ZL3= 120
##$ZL4= 120
##$ABSF1= 10
##$ABSF2= 0
##$ABSG= 5
##$ABSL= 3
##$ALPHA= 0
##$AQORDER= 0
##$ASSFAC= 0
##$ASSFACI= 0
##$ASSFACX= 0
##$ASSWID= 0
##$AUNMP= <proc_1d>
##$AZFE= 0.1
##$AZFW= 0.1
##$BCFW= 1
##$BC_mod= 2
##$BYTORDP= 1
##$COROFFS= 0
##$CY= -3
##$DATMOD= 1
##$DC= 2
##$DFILT= <>
##$DTYPP= 0
##$F1P= 0
##$F2P= 0
##$FCOR= 0.5
##$FTSIZE= 0
##$FT_mod= 4
##$GAMMA= 1
##$GB= 0.15
##$INTBC= 1
##$INTSCL= 1
##$ISEN= 128
##$LB= 0.25
##$LEV0= 0
##$LPBIN= 0
##$MAXI= 10000
##$MC2= 0
##$MEAN= 0
##$ME_mod= 0
##$MI= 1.114404
##$NCOEF= 0
##$NC_proc= 0
##$NLEV= 6
##$NOISF1= 3.799351
##$NOISF2= 2.8
##$NSP= 1
##$NTH_PI= 0
##$NZP= 0
##$OFFSET= 14.38212
##$PC= 1
##$PHC0= -1566.375
##$PHC1= 20.39228
##$PH_mod= 1
##$PKNL= yes
##$PPARMOD= 0
##$PSCAL= 0
##$PSIGN= 0
##$REVERSE= no
##$SF= 200.129724274929
##$SI= 16384
##$SIGF1= 3
##$SIGF2= 2
##$SINO= 400
##$SIOLD= 16384
##$SREGLST= <1H.CDCl3>
##$SSB= 0
##$STSI= 0
##$STSR= 0
##$SW_p= 3205.1282051282
##$SYMM= 0
##$S_DEV= 0
##$TDeff= 0
##$TDoff= 0
##$TI= <>
##$TILT= no
##$TM1= 0
##$TM2= 0
##$TOPLEV= 0
##$USERP1= <user>
##$USERP2= <user>
##$USERP3= <user>
##$USERP4= <user>
##$USERP5= <user>
##$WDW= 1
##$XDIM= 8192
##$YMAX_p= 0
##$YMIN_p= 0
$$ End of Bruker specific parameters
$$ ---------------------------------
##NTUPLES= NMR FID
##VAR_NAME=  TIME,          FID/REAL,        FID/IMAG
##SYMBOL=    X,             R,               I
##VAR_TYPE=  INDEPENDENT,   DEPENDENT,       DEPENDENT
##VAR_FORM=  AFFN,          ASDF,            ASDF
##VAR_DIM=   8192,          8192,            8192
##UNITS=     SECONDS,       ARBITRARY UNITS, ARBITRARY UNITS
##FACTOR=    0.0002768,     1,               1
##FIRST=     0,             0,               0
##LAST=      2.2672688,     0,               0
##MIN=       0,             -786803,         0
##MAX=       2.2672688,     580458,          0
$$ Real data points
##PAGE= N=1
##DATA TABLE= (X++(R..R)), XYDATA
$$ [...]
1795B44m09K93R5j47Q0p0r0N3P2l88L42p8k1k8K71j67j75J00k5J55o6l35J74J70
$$ 244 -165 128 223 76 156 86 -4 49 121 -267 75 -3 -24 -52 219 52 -123 -23 -48 107 41 -294 -120 50
1819E0j8p3j20j10L69J06l04r3L06j00r7J85r7Q2J8j23k5K65M0j98l01K0K08p
$$ 50 32 -41 -161 -271 98 204 -100 -193 113 13 -84 101 4 86 104 -19 -44 221 261 63 -238 -218 -10 -17
1843a7R0j43n8j22J18j8L32n1J90j94P4j46L2j02K9mK04l54p2K20K99j61q1J62
$$ -17 73 -70 -128 -250 -132 -150 182 131 321 127 201 55 87 -15 14 10 214 -140 -212 8 307 146 65 227
1867B27l41L32l94N57m87k0K05J6k67N70m17O0l12O01k15j60K97j33l18N05m14
$$ 227 -114 218 -176 381 -106 -126 79 95 -172 398 -19 41 -271 330 115 -45 252 119 -199 306 -108
1888a08P7j48jL55jk32J25J81n06N27k14j60J21Q1L6j0j41J08J57r3j22N9nk2
$$ -108 -31 -179 -180 175 174 -58 67 248 -258 269 55 -105 16 97 133 123 -18 90 247 154 32 91 86 64
1912F4j49J93j95J06L0n3K2l9k0J77j25n8K68j12R8o6j05j46J17K00j00k43M3
$$ 64 -85 108 -87 19 49 -4 18 -21 -41 136 11 -47 221 109 207 141 36 -110 7 207 107 -136 -93
1935i3o3J89L4O7n7j8k6rK00l58J84R0p9j97J40Q5k51P6J27R1j32P2j82J10q6
$$ -93 -156 33 67 134 77 59 33 24 224 -134 50 140 61 -136 4 89 -162 -86 41 132 0 72 -110 0 -86
1960h6K06j04l06L57r1k91K14k3P6k9J43K84l14L0j99R5O7k5K29o7k21K44j7j72
$$ -86 120 16 -290 67 -24 -315 -101 -124 -48 -77 66 350 36 66 -133 -38 29 4 233 166 -55 189 172 0
1984@p0L60j76j06k10N2J77j23L0K83j31m25J48K59k31K50k08K75j10n5j6j78
$$ 0 -70 290 114 8 -202 -150 27 -96 -66 217 86 -339 -191 68 -163 87 -121 154 44 -11 -27 -205
2006b05L31q4n4J25Qk60J29J02k81Q1K04q3M3k21M7K42R9k13L3J36j47oq3J58
$$ -205 126 42 -12 113 121 -139 -10 92 -189 -108 96 13 56 -165 -118 124 223 10 43 179 32 26 -57 101
2030A01j48J84oj48LLj00J12K17k25LO2j27j66K34J55j81r1J73m8j90P3p3L13
$$ 101 -47 137 131 -17 -14 -11 -111 1 218 -7 -4 58 -69 -235 -1 154 -27 -118 55 7 -183 -110 -183 130
2054A30j55k86L57m6Ml67K65K80l86K34J67Qq3J9k04p4J83j5N8n6l5j69K28J42
$$ 130 -25 -311 46 0 4 -363 -98 182 -204 30 197 205 122 141 -63 -137 46 31 89 33 -2 -171 57 199
2078A99l75M3l6K39q7J51m7l30R6K53q9K69n64J46J47k33K24K7J16j14l5k37K49
$$ 199 -176 -133 -169 70 -17 134 87 -243 -147 106 17 286 -278 -132 15 -218 6 33 149 35 0 -237 12
2101A2j69K91j78J17R5k06M4m5j32k8L95l08J39J63M7j85q2o5p9J53K16m55K18
$$ 12 -157 134 -44 73 168 -38 6 -39 -171 -199 196 -112 27 190 237 52 -30 -95 -174 -21 195 -260 -42
2124d2J98k83K5j76L80k60J11rJ54q6j34J53k47K24J30j92O5J70j91J55l71L27
$$ -42 156 -127 -102 -278 102 -158 -47 -56 98 12 -122 31 -216 8 138 -54 11 181 -10 145 -226 101
2146A01O4j81m0K90J09m02j8J40J97l45J50J95k74R2m27L76j70m1K25k31K9K66
$$ 101 165 -16 -56 234 343 -59 -77 63 260 -85 65 260 -14 78 -349 27 -143 -184 41 -190 -161 105
2168A05j42K75l04j62M54l28J67p0j41K6o3M53O0q5q8m1rO2n1q2J43j74l5K44
$$ 105 -37 238 -66 -228 226 -102 65 -5 -146 -120 -183 270 330 245 157 116 107 169 118 36 179 5 -30 214
2192B14l88j05N12l05J97j60j5J35k8L41o58J45mJ68j27q5J29N4RM4j88k1j63
$$ 214 -174 -279 233 -72 125 -35 -50 85 57 398 -260 -115 -119 49 -78 -163 -34 20 29 73 -115 -136 -299
2215b99M03q1J6j72J50r6J10L2K73l58j31K33O3j37K03n4j87j12K51j23j66L01
$$ -299 104 23 39 -133 17 -79 31 63 336 -22 -153 80 143 6 209 155 -32 -144 107 -16 -182 119
2237A19l48L76k91L6J0Q4j14J4J5n7M4L01k93R5J4L6l30K67j26O1J80l75L14J95
$$ 119 -229 147 -144 -108 -98 -14 -128 -114 -99 -156 -112 189 -104 -9 5 41 -289 -22 -148 -87 93 -282 32 227
2261B27o1l08R7J99k89M6L37l70K56l59J47K03l02j20L77j59Jn7O07l49m5Nk90
$$ 227 166 -142 -45 154 -135 -89 248 -122 134 -225 -78 125 -177 -297 80 -79 -78 -135 472 123 78 83 -207
2284b07J67k27K88J99k05J51o1q8J95j20m39J34L20m2j24j55N10k93J88o6j61
$$ -207 -40 -267 21 220 15 166 105 17 212 92 -347 -213 107 65 -59 -214 296 3 191 125 -36
2305c6P0L3J11j9l28L34k16J04J29k36N11l30l15K11K58j53m1Mk81K89k48O8R4
$$ -36 34 67 178 159 -169 165 -51 53 182 -54 457 127 -188 23 281 128 87 91 -190 99 -149 -81 13
2328A3j37L3k23L41q5J1nN6K06P8l14M8K04j02k03J39nj77O4R5L3N4J54j89L0
$$ 13 -124 -91 -314 27 -58 -47 -52 4 210 288 -26 22 226 124 -79 60 55 -122 -58 37 70 124 278 89 119
2353A19j63n6J65J35j20Q4j77r6L35l06n4L02k12l73M33J42j59M6j60J91k04J73
$$ 119 -44 -100 65 200 80 164 -13 -109 226 -80 -134 168 -44 -417 16 158 -1 45 -115 76 -128 45
2375D5j02KJ58l30N84j96k12J47l63K72LK26k37j91K14j3p0j08J02j10K22k6K7
$$ 45 -57 -55 103 -227 357 161 -51 96 -267 5 8 234 -3 -194 20 7 -63 -171 -69 -179 43 17 44
2398D4M0j71J94l52J78p3J44j56J84l8M2J3K77l90P9j1Rj07J47j78K28J6l99O7
$$ 44 84 -87 107 -245 -67 -140 4 -152 32 -6 36 49 326 -64 15 4 13 -94 53 -125 103 119 -280 -213
2422b13j12M74k23J86o2J67j43O0l40L84jr5j07J52l13M44p7j40O4j76K13r4l34
$$ -213 -325 149 -74 112 50 217 74 134 -206 178 177 82 -25 127 -186 258 181 41 105 -71 142 48 -286
2445b86J69J4K16k08L5J23q5K04j05Mk55J03J89q2l3j16K10j35J24q1M5K85j27
$$ -286 -117 -103 113 -95 -60 63 -22 182 77 81 -174 -71 118 36 3 -113 97 -38 86 5 50 335 208
2468B08j94n1J49Q6m10q0N03N7m46L92j22k55o8J95j12K10l5R0rm9J08N8j69j06
$$ 208 14 -37 112 198 -212 -292 211 268 -178 214 92 -163 -231 -36 -148 62 27 117 108 59 167 225 56 -50
2492e0J68j10J02m12K49o5J20Q9r1P3j7K39m21k0J34J64n2j11j13J65m1R4l73
$$ -50 118 8 110 -302 -53 -118 2 91 0 73 56 295 -126 -146 -12 152 100 -11 -124 41 0 94 -279
2515b79L67J8k24K33l2j77r6J66j22K90p8k03J08p8M58k05j15j71L15k21p2M14
$$ -279 88 106 -118 115 83 -94 -190 -24 -146 144 66 -137 -29 -107 351 146 31 -140 175 -46 -118 296
2537B96m69L13j41k15L95l67K23lQ8j84J39Q9j75n4mp7J13k63L79j92L99j18m22
$$ 296 -173 140 -1 -216 179 -188 35 32 120 -64 75 164 -11 -65 -69 -146 -33 -296 83 -109 290 172 -250
2560b50K53k45Q1J36n7J32j76K84M0o6j25N1j49r3K20J4j73N5P8O1L22l47j11
$$ -250 3 -242 -161 -25 -82 50 -126 158 198 132 7 58 -91 -184 36 50 -123 -68 10 71 393 46 -65
2583f5Q9j08R8n7oJ9L6l74L66J14J42j29l28L27j53j04J96K59j11k73%NN9j76
$$ -65 24 -84 14 -43 -49 -30 6 -368 -2 112 254 125 -203 124 -29 -133 63 322 211 -62 -62 -57 2 -174
2607a74q7L06j37J31q0K4L8j52K76j78K25j90J00ml52K08n5J29j9L1n9K2M1K1
$$ -174 -261 45 -92 39 -41 -17 21 -131 145 -33 192 2 102 98 -254 -46 -101 28 9 40 -19 3 44 65
2631F5q2J50k82M12k15K26k00j36K93o3k8r8J44p7J98l60L24j54l2J26j42j16
$$ 65 -17 133 -149 263 48 274 74 -62 231 168 140 42 186 109 307 -53 271 117 85 211 69 -47
2653d7J12k05KJ52J25l4P1j52j66r2M90n0k67k7J17m9j06L64j13Q4j50P9nOm66
$$ -47 65 -140 -138 14 139 105 176 24 -142 -234 256 206 -61 -88 29 -20 -126 238 125 209 59 138 133 139 -327
2678c27J74M24l20pK52k01o0l9L47j01k15l3K55j90K79k1j07k05m8L6K8O7j8m1
$$ -327 -153 271 -49 -56 196 -5 -65 -104 243 142 -73 -106 149 -41 238 217 110 -95 -143 -107 -79 -12 -30 -71
2702g1J17J1J44k31PJ56k97L58n20L2J85J79K0m5n2J94nq7r2k35K01K2l6k27L54
$$ -71 46 57 201 -30 -23 133 -164 194 -326 -294 -109 70 90 45 -7 187 182 95 3 -232 -31 -9 -45 -272 82
2727H2k60J37R4j31p9q5PJ37l8M2j01J64k10J57O6k8Q3k7J00j23l8J14j28N3q
$$ 82 -178 -41 53 -78 -157 -242 -235 -98 -136 -94 -195 -31 -241 -84 -18 -46 37 10 110 -13 -51 63 -65 -12 -20
2752b0K1j03M2J67m4J21k61J09O2p5j15J10k8n5J42m61K81Q2l6K10k84j08J87
$$ -20 1 -102 -60 107 63 184 -77 32 94 19 -96 14 -14 -69 73 -388 -107 -25 -61 149 -135 -243 -56
2775e6L9J1Q2j1j13m1j2P7R3q5m2J70L1Qj2m0q6n4J22K8l31K06K43k95K88j82
$$ -56 -17 -6 76 65 -48 -89 -101 -24 69 -16 -58 112 143 151 139 99 13 -41 81 109 -222 -16 227 -68 220 38
2801C8j19n0J08j38j02K45J0L04k36J85j73P5l69K17J37q1o3J28j93K31j05n9
$$ 38 -81 -131 -23 -161 -263 -18 -8 296 60 245 72 147 -222 -5 132 51 -12 116 -77 154 49 -10
2823a0L9m9R7p4l6q2K35j24J49o2j7m5m4j05r8J76P3k80O80o10J01K6J19l6q7
$$ -10 29 -20 77 3 -33 -115 120 -4 145 83 66 21 -23 -128 -226 -50 23 -257 423 -187 -86 -60 59 23 -64
2848f4q6L50m91M56j32j33J49p6J46j43m8K17k11J1J55m0m40N08k25K94l65J90
$$ -64 -150 200 -291 165 33 -100 49 -27 119 -24 -72 145 -66 -55 100 60 -380 128 -97 197 -168 22
2870B2j36L9K26j99J07l1j71Q6j1p1K24j13k13J12J23k51M41j69J15l09K89p6
$$ 22 -114 -75 151 -48 59 28 -143 -57 -68 -139 85 -28 -241 -129 -6 -257 184 15 130 -179 110 34
2892C4j68k3J61j9J29k13K34J21o75K45l2K02J18j22K56k56r5N8J03l4J64r9J31
$$ 34 -134 -157 4 -15 114 -99 135 256 -419 -174 -206 -4 114 -8 248 -8 -103 -45 58 24 188 89 220
2915B20k65J98l5l4K9j49K03l56K31k3j93K16N2mm05M48j83Q6lL2j01j29N2O1
$$ 220 -45 153 118 84 113 -36 167 -189 42 19 -174 42 94 90 -315 133 -50 36 33 65 -36 -165 -113 -52
2939e2J54m64M52pk33M28j63M1j65j0N2MlJ30l67J17J07r4LK2j7K03j89K46o4
$$ -52 102 -362 90 83 -150 278 115 156 -9 -19 33 37 34 164 -203 -86 21 -73 -70 -48 -65 138 -51 195 131
2964A31j13q2J65Lj97J08nK63k04j7o3k39J65K68r2j92k6K46op5k1N4q8J80k92
$$ 131 18 -64 101 104 -93 15 10 273 69 52 -11 -250 -85 183 91 -101 -127 119 113 38 17 71 -17 163 -129
2989a29O5L0j66J85K0j85J21r2K01k06l2J51J59k0j26J30j46j51J49J0K3k21M4
$$ -129 -64 -34 -200 -15 5 -180 -59 -151 50 -156 -188 -37 122 102 -24 106 -40 -191 -42 -32 -9 -230 -186
3012a86k8L50j46q8K31J55m57K45J44j83k00J20L8M6k29j97N87k74r0R6R5rJ04
$$ -186 -214 136 -10 -98 133 288 -169 76 220 37 -163 -43 -5 41 -188 -385 202 -72 -162 -66 29 20 124
3035A24J29k24m0q0j77L23k84j23M54j8j0J16M3j37q5N0j26j14J99O8j34K02m4
$$ 124 253 29 -11 -91 -268 55 -229 -352 102 84 74 190 233 96 11 61 -65 -179 20 88 -46 156 112
3058A12j42P3q0RK1j54K30j52N1QOR3j50PJ97n0j12K15n2j03qJ24q3n7k35L72
$$ 112 -30 43 -37 -28 -7 -161 69 -83 -32 -24 -18 75 -75 -68 129 79 -33 182 130 27 19 143 60 3 -232 140
3084A40O0l56K03k70K88J25k18J17l4J05J76m93K78J18p5k3k38O3K5n9l3j12R6
$$ 140 200 -156 47 -223 65 190 -28 89 55 160 336 -157 121 239 164 141 -97 -34 -9 -68 -101 -213 -117
3107a17K78k09Oj17J34o0j85J22M03o8m4l09O2n8K91l0j40K6j4J75k35R5J02l1
$$ -117 161 -48 -42 -159 -25 -85 -270 -148 255 187 143 -166 -104 -162 129 99 -41 -15 -29 146 -89 6 108 77
3131G7K1l14J41Q7p1l9L9N6M4J52j62lj25J53r7J25kk27K2K63j08p2N04l00k20
$$ 77 98 -216 -75 12 -59 -98 -59 -3 41 193 31 28 -97 56 -41 84 82 -145 -123 140 32 -40 464 164 -56
3156e6M4J03j57K62k59J45j95R0J89l46L01o5k54K10Op1R2p5J44k59P5K05l62
$$ -56 -12 91 -66 196 -63 82 -113 -23 166 -180 121 56 -198 12 18 -53 39 -36 108 -151 -76 129 -233
3179b33J26oJ51P0M4j21p2K96k2m57J91J87p6j45K40k9q6J76l38J98n6K2k2j56
$$ -233 -107 -113 38 108 152 31 -41 255 233 -224 -33 154 78 -67 173 144 58 234 -104 94 38 60 38 -118
3203a18k9M73l34K21k12k37K81L7m7j00P6l4K56j25k83K84rr3j90M0K86l21M93
$$ -118 -147 326 -8 213 1 -236 45 82 35 -65 11 -23 233 108 -175 109 100 7 -183 -143 143 -178 315
3226C15J1m35R0M1j19K96m76M15j03j71K48j99L03k79K49l59O2J4J59j62J7J22
$$ 315 326 -109 -19 22 -97 199 -277 138 35 -136 112 -87 216 -63 186 -173 -111 -97 62 -100 -83 39
3248C9j02J57j62l13K81N8oJ26J09m0K2q3j6k9r6q9K62J50K5k66j66m0K00L88
$$ 39 -63 94 -68 -381 -100 -42 -48 78 187 147 169 86 70 41 -55 -144 118 268 293 27 -139 -179 21 409
3272D09O1l83J2N3j43r9m5nQ0L27k10r0J81j88J98j95m3J19Q8N9k53J03k55J1
$$ 409 470 87 99 152 9 -90 -135 -140 -60 267 57 -33 148 -40 158 -37 -80 39 127 186 -67 36 -219 -208
3296b08M6K73N7k82M8J41k4j72J15k20M73k32J42n81L23N3J75k3j79j23J28N4
$$ -208 -162 111 168 -114 -66 75 51 -121 -6 -226 247 15 157 -424 -101 -48 127 104 -75 -198 -70 -16
3318a6K33k24K28j57k82j75M2K33K28k48J77L4j6k33K85r1r7N7J56j44%M2j99
$$ -16 217 -7 221 64 -218 -393 -351 -118 110 -138 39 73 57 -176 109 18 -79 -22 134 -10 -10 32 -167
3341a67k1R0K05n11M68N6j30op0j6j38J31J03O0o3q3j11r1M73o7J51l93O5K00
$$ -167 -188 -98 107 -404 64 120 -10 -16 -86 -102 -240 -109 -6 54 -9 -92 -203 -294 179 112 263 -130 -65 135
3365A35q1k19M21k87j11K66J45r7k17k4J57m4m2l3Kr9K15o7J37j15K5j35M7n2
$$ 135 54 -165 256 -31 -142 124 269 172 -45 -69 88 44 2 -31 -29 -128 87 20 157 42 67 -68 -21 -73
3389g3Q3L5j66J09l3J09L9m10K44M3J31j4l63K88k76K34O8k62J20K42k04m1M7
$$ -73 10 45 -121 -12 -45 64 103 -307 -63 -20 111 97 -266 22 -254 -20 48 -214 -94 148 -56 -97 -50
3412e0J11k1j14M9m3p1P7J40j22N2m0o6o1L81N1j70j91Q9k5N3M4O9j87J24M0p8
$$ -50 61 40 -74 -25 -68 -139 -62 78 -44 8 -32 -98 -159 222 273 103 -88 1 -24 29 73 142 -45 79 119 41
3438D1rJ02n5j74Q4j77P3q7j15K93L06l47K34n5Q1l72L77j47KJ93J61l78n4K38
$$ 41 32 134 79 -95 -11 -188 -115 -202 -317 -24 282 -65 169 114 195 -177 200 53 55 248 409 31 -23 215
3462B15n30O68j08k47j14J11o7m3%K00j39Q8J12l64K35r8MJ6J07p9q2K52o4j14
$$ 215 -315 353 245 -2 -116 -5 -72 -115 -115 85 -54 34 146 -218 17 -81 -77 -61 46 -33 -115 137 73 -41
3486d1R1o6N8m4J70k09j33K2J79r8O5j18J94k05K16J8n3j0j83J17J74p9j86M1
$$ -41 50 -16 42 -2 168 -41 -174 -152 27 -71 -6 -124 70 -135 81 99 46 36 -147 -30 144 65 -121 -80
3510h0k02M56o2Q9k34M0J94m13L20k57K30o2p5K33k39K0k6l6P0K8j50K03o7K11
$$ -80 -282 174 112 201 -33 7 201 -212 108 -149 81 19 -56 177 -62 -42 -68 -104 -34 -6 -156 47 -20 191
3534A91j3j86K95l54N0N4k65O25qo50J90J92L1k18j27Q2J65l5j37N3N6JNL04k22
$$ 191 178 -8 287 -67 -17 37 -228 397 389 -261 -71 121 152 -66 -193 -111 54 19 -118 -65 -9 -8 -3 301 79
3559G9k06l5j6K72l1j45K53J8l37k2R5J49o9QK6k69J30p6J77K31o0l21K01L5K6
$$ 79 -127 -162 -178 94 63 -82 171 189 -148 -170 -75 74 5 13 39 -230 -100 -176 1 232 172 -149 52 87 113
3584A13m3n8J54J26n18K16J81k7k2%k99r8K33J47Q7j83R0K20l07r7K10l69L26
$$ 113 70 12 166 292 -226 -10 171 144 122 122 -177 -275 -42 105 192 9 99 319 12 -85 125 -244 82
3607H2k65P9J37p0M0M1k27K98l8j68L38p6j86j95q1L65j31k0j81L10k09Q3J57
$$ 82 -183 -104 33 -37 3 44 -183 115 77 -91 247 171 -15 -210 -291 74 -57 -77 -258 52 -157 -74 83
3630H3o6k91L61j2N5m2k03o8J09K04q7J23j69L8j80J95k9Mj46K50j71O3J96j65
$$ 83 17 -274 87 75 130 88 -115 -183 -74 130 43 166 -3 35 -145 50 21 25 -121 129 -42 21 217 52
3654E2J77l16j45N0O3K53k4k27K3K51l9j69J37k52QK32kM7p1n4q0k5K96j80J31
$$ 52 229 -87 -232 -182 -119 134 110 -117 -94 157 118 -51 86 -166 -158 74 72 119 48 -6 -86 -111 185 5 136
3679A36l01K9J68l3k01J15K30m01M72l14M31k49j22k18N1M60k71L2p1J24J47l06
$$ 136 -165 -136 32 -1 -202 -87 143 -258 214 -100 331 82 -40 -258 -207 253 -18 14 -57 67 214 -92
3701i2o4J70r7J54l0j14K19o7Q9k64K13L9o58M41L9J66o9q1q7K04K74l32J11k95
$$ -92 -156 14 -83 71 41 -73 146 79 168 -96 117 156 -502 -61 -22 144 75 -6 -93 111 385 53 164 -131
3725a31K45r6k06L01j33Nn3L47l54P0J9L1L2K6l75M57q9L9q5PO3p3J70n0j86J03
$$ -131 114 18 -188 113 -20 -15 -68 279 -75 -5 14 45 77 103 -272 185 96 135 50 57 120 47 217 167 -19 84
3751H4k6l74N11j06l30M00k4l29L34k50N7J7K83k56l03L01rN8OL5k07K70l96J27
$$ 84 58 -316 195 89 -241 159 135 -194 140 -110 -53 -36 247 -9 -312 -11 -20 38 44 79 -128 142 -254 -127
3775a27j53K88J82k98J10l8k95M63j40J1K36l96M9J73j25K69j96L9j39j78L00
$$ -127 -280 8 190 -108 2 -36 -331 132 -8 3 239 -157 -108 65 -60 209 13 52 -87 -265 35
3796C5k20J3O4j3R8Q1Rk68N7P0k5J36n2J48k76J37O4K3j69Q8m0j44L6k8K16M0
$$ 35 -185 -172 -108 -121 -23 58 67 -201 -144 -74 -99 37 -15 133 -143 -6 58 81 -88 0 -40 -184 -148 -176 40 80
3822H0j70R2j7K05l10K44l58J24K56r2j33Q4M7j65rmQ3r2L00m83N57j71k44J85
$$ 80 -90 2 -15 190 -120 124 -234 -110 146 54 -79 5 52 -113 -122 -126 -43 -135 165 -318 239 68 -176 9
3846Iml3l9J9K88l03J94j41l1N9k41K93r7K75k25l1L44k90P8qr5k31N80l36RK17
$$ 9 5 -28 -67 -48 240 -63 131 -10 -41 18 -223 70 -27 248 23 -8 336 46 124 116 21 -210 370 34 43 260
3872B60j59J4l80J65N6K14k30l7K19p7R4m04J45K08k28k3O3P3N6l2k72L22o4J9
$$ 260 101 115 -265 -100 -44 170 -60 -97 122 45 139 -265 -120 88 -140 -163 -100 -27 29 -3 -275 47 -17 2
3896Bj73K3J36J54k97J92j02p1K47k81J07K50k08N1%K80l71J95l47L22o7o1KO3
$$ 2 -171 -148 -12 142 -155 37 -65 -136 111 -170 -63 187 -21 30 30 310 -61 134 -213 109 42 -19 -17 46
3920D6j3k0J5J41j74J4j6j52K53K1J36k96Q4J8j25K25r1j80K39q1j10K95j51k04
$$ 46 33 13 28 169 -5 9 -7 -159 94 115 251 -45 39 57 -68 157 66 -114 125 44 -66 229 78 -126
3944a26K10j01O1k6j9J37l20L06k44kL36l21m9K32J67%k43j62J79M4j8Pj56J37
$$ -126 84 -17 44 18 -1 136 -184 122 -122 -124 212 -109 -158 74 241 241 -2 -164 15 59 41 48 -108 29
3968B9o4J52L1j81K55k63r4K29R4j07L2J31l00L85k57j05K22k20O0M9j02j4k39
$$ 29 -35 117 148 -33 222 -41 -135 94 188 81 113 244 -56 329 72 -33 189 -31 29 78 -24 -38 -277
3991b77Q1K29j00L1J42k15ql8L15j26L9m9q1O3J89l24L7Np0J27J8N2P3k39J05
$$ -277 -196 33 -67 -36 106 -109 -117 -155 160 34 73 24 -57 6 195 -129 -92 -87 -157 -30 -12 40 113 -126 -21
4016b1Lr6K65k18K13k17J38k43K72k47J79P8J02m48M02k02K5J08j63m9J04J41
$$ -21 -18 -114 151 -67 146 -71 67 -176 96 -151 28 106 208 -240 162 -40 -15 93 -70 -119 -15 126
4038A26l76n5M85k25j17j08K89K73m85M05M4r2j0k26M6n8L21k12j87K01J29j28
$$ 126 -250 -305 180 -45 -162 -270 19 292 -193 212 256 164 154 -72 -26 -84 237 25 -162 39 168 40
4060D0n3J52k01n6L90l34K31j5Kr8q5q6J51j11j6L19R5l31K8n7l8O5r1Q1L6R6
$$ 40 -13 139 -62 -118 272 -62 169 154 156 58 -27 -113 38 -73 -89 230 325 -6 22 -35 -73 -8 -99 -18 18 114
4086A14l3n5M6q8P5o6J94k06j53K82p8r4L1k99M74j35K22l60J5J06J34j7k85L06
$$ 114 81 26 72 -16 59 -7 187 -19 -172 110 32 -62 -31 -330 144 9 231 -129 -114 -8 126 109 -176 130
4110A30k18J84k09K50J47j28k97n5K68k98K53K13j90k4l1p2j31O5NL52l87K66
$$ 130 -88 96 -113 137 284 156 -141 -196 72 -226 27 240 50 26 -5 -77 -208 -143 -138 214 -173 93
4132I3p1L3J35m62L72k2L2l31M30j07j71l9Qj9M1L78m53N40k32j32jm35M64k93
$$ 93 22 55 190 -272 100 78 110 -221 209 102 -69 -108 -100 -119 -78 300 -153 387 155 23 22 -413 51 -242
4156b42J21J71k05j76L43J8jo2K73l23J24j1k38K96j16p0J73j14l7J90m82M87
$$ -242 -121 50 -155 -331 12 30 29 -33 240 -83 41 30 -208 88 -28 -98 75 -39 -76 114 -368 119
4178A19L8J7m27R6P6r8K9O7J72q7j9n2j47K17k96M63k53q7q1K71k88M79l87n7
$$ 119 157 174 -253 -157 -81 -179 -150 -83 89 2 -17 -69 -216 1 -295 168 -85 -172 -253 18 -270 209 -178 -235
4202b35J78m3K08j69j8K78k56O7Q2j73J90k22%K50L5j78j13L02j61k07J22MJ71
$$ -235 -57 -100 108 -61 -79 199 -57 10 92 -81 109 -113 -113 137 172 -6 -119 183 22 -185 -63 -59 112
4225A12k30m8L00m92K32L12j39j06J73k9J70m41K94q9N0j78j82L27j59P4J08K8
$$ 112 -118 -166 134 -358 -126 186 47 -59 114 85 255 -186 108 19 69 -109 -291 36 -123 -49 59 87
4247H7j21K3L8J6J29k14J23j09K62m15J44K89k56l20M53k56M50l44K42l12M3J15
$$ 87 -34 -11 27 43 172 -42 81 -28 234 -181 -37 252 -4 -324 129 -127 323 -21 221 -91 -48 67
4269F7J10r4j08J1L4Q4k4p4k98L17K13l45M40l23J46o0Qj04k18K57j38n9K07l29
$$ 67 177 83 -25 -14 20 104 80 6 -292 25 238 -107 333 10 156 96 104 0 -218 39 -99 -158 49 -280
4293b80J83q0O1K29k94K76k59M25l45k25K91K23p5Jm7j7m5j70J75j18q8j36L44
$$ -280 -97 -177 -116 113 -181 95 -164 261 -84 -309 -18 205 130 131 84 67 22 -148 27 -91 -179 -315 29
4316B9J06j18m9q1J36q2J44j76L08k84n6L43k54L46k66k7J7K8p2j18K75k42nQ
$$ 29 135 17 -32 -113 23 -59 85 -91 217 -67 -123 220 -34 312 46 19 36 64 -8 -126 149 -93 -98 -90
4340i0M9J32J3j26kn4l7R6JJM1q0K61k66Pj7M6K5J31K57l66j05l6K13l45M39k57
$$ -90 -41 91 104 -22 -24 -78 -115 -19 -18 -17 24 -56 205 -61 -54 -71 -25 0 131 388 22 -83 -119 94 -251 188 -69
4367f9J50j39m5J68j57N6K11l1k15j75Q7PM10l46pL4J11j29o2P5m3J27O1p8j45
$$ -69 81 -58 -103 65 -92 -36 175 144 -71 -246 -159 -152 258 -88 -95 -61 50 -79 -141 -66 -109 18 79 1 -144
4392a44L28l5J01n34L90j55k44L84j50J72k43K52j84K59q2j66m0J88j94j6r8L22
$$ -144 184 149 250 -284 106 -49 -293 91 -59 113 -130 122 -62 197 115 -51 -91 97 -97 -113 -211 111
4414A11L5k10j38K79p8J99o5l35K28j73N0J38r8j96J45P3L2NJ21j33J02Mj70n4
$$ 111 146 -64 -202 77 -1 198 133 -202 26 -147 -97 41 -57 -253 -108 -35 -3 2 123 -10 92 96 -74 -128
4438a28M6J0N3J01p0Q1q6o5J68o2j06m2J50p9j22J74Q6O0k18J28m6j37m2R0Q1
$$ -128 -82 -72 -19 82 12 93 7 -58 110 48 -58 -100 50 -29 -151 23 109 169 -49 79 33 -104 -146 -56 25
4463B5J78l85J96Q8K62k31k6k77L8j22K94P5l0k03l3R1j67L89Q9k32n5L42k27
$$ 25 203 -182 14 102 364 133 107 -170 -132 -254 40 115 85 -118 -151 -60 -227 162 251 19 -36 306 79
4486G9j58J89L0k07O3P7J4j04K11M8j03o1J04m45L09K5M9j00j6oM3N9j95L5Q4
$$ 79 -79 110 140 -67 -4 73 87 -17 194 242 139 78 182 -263 46 71 120 20 4 -2 41 100 -95 -60 24
4511B4J00k29kK08j26j96K67j58K1R7j37L77k06l15J18Q8M1P2j03J31k06N7%K47
$$ 24 124 -105 -107 101 -25 -221 46 -112 -91 6 -131 246 40 -275 -157 -69 -28 44 -59 72 -134 -77 -77 170
4535A70k3j74n2k0j53K32J40j0l06L02j58J65j26O4j59J28M9O3l18L33J3l18K29
$$ 170 147 -27 -79 -99 -252 -20 120 110 -196 106 -52 113 -13 51 -108 20 69 132 -186 147 160 -158 71
4558G1J89k47K51p1Mn23K98L3o9J50j95j23K35j83K4J04J18q6p9L60k41k32J35
$$ 71 260 13 264 193 197 -326 -28 5 -64 86 -109 -232 3 -180 -156 -52 66 -20 -99 261 20 -212 -77
4581g7K99k00m7L5j17Q8OJ59k60lJ36O4l5J87k36O5j02J05R5k92J06K12l41J22
$$ -77 222 22 -25 10 -107 -19 -13 146 -114 -117 19 83 48 235 -1 64 -38 67 162 -130 -24 188 -153 -31
4605c1k54J59R4K69j19N9J27p8k33k13K95n4p6l2J34O4j25r4l4K37m29J32K26
$$ -31 -285 -126 -32 237 118 177 304 226 -7 -220 75 21 -55 -87 47 111 -14 -108 -142 95 -334 -202 24
4628B4o7m6p4K84m1K7k48NJ70o3k12J50L9j8n0J60oj87l0K53l08O4J38K8l1r6
$$ 24 -43 -89 -163 121 80 107 -141 -136 34 -29 -241 -91 -52 -70 -120 40 34 -153 -183 70 -238 -174 -36 -8 -39 -135
4654a35K22l3J20l8j58M4p4j5M4j4J61Pj98k16M61p7j97o6M5K2K69P7m24J75K10
$$ -135 87 54 174 136 -22 22 -52 -67 -23 -37 124 131 -67 -283 178 101 -96 -162 -117 -95 174 251 -173 2 212
4679B12l25L24k9j18j01NJ15l71M61Q0l42k3k7J81k58M09j7N3k07j42K18l5j18
$$ 212 -113 211 182 64 -37 -32 83 -288 173 253 -89 -112 -139 42 -216 193 176 229 22 -120 98 63 -55
4702e5J85j27k46J03k5r6M26K40j51m78L54J31k76j12J98k31J30K8j02l0K49J15
$$ -55 130 3 -243 -140 -165 -261 165 405 254 -224 130 261 -15 -127 71 -160 -30 -2 -104 -134 115 230
4724B30j74q4K01l51O5J65m7K54q9k58M9J30p6j0j79J59J22k27J42m3J80jn6m4
$$ 230 56 -28 173 -178 -113 52 5 259 170 -88 -39 91 15 5 -174 -15 107 -120 22 -21 159 158 102 58
4748E8P1m12L32J98k02J8K17l14M0L0j99K84j88J76j21j05R6J65k9o3P4j62K08
$$ 58 129 -283 49 247 45 63 280 -34 6 36 -163 121 -67 109 -12 -117 -21 144 115 52 126 -36 172
4771A72k17J06J28k52J43q0K54r3q6j54M9JM0l47K02J78j30j40L81K6o0j61p9
$$ 172 -45 61 189 -63 80 0 254 161 75 -79 -30 -29 11 -336 -134 44 -86 -226 155 181 121 -40 -119
4794a19L21j01q9J5k1J60J5k98K8K4J4J13j94M19j02k11K29k95K88j49j2q8j64
$$ -119 202 101 12 27 6 166 181 -117 -89 -65 -51 62 -132 287 185 -26 203 -92 196 47 35 -53 -217
4817b17N9J92N7k63J28L05k69Q4k1j14j49K13l70M45J05k25j43K86j23Q9j37Q1
$$ -217 -158 34 91 -172 -44 261 -8 76 55 -59 -208 5 -365 80 185 -40 -183 103 -20 69 -68 13
4839A3o4J63j87j52K66j13R0k02J37m9j4J84J36k38K59l67J09Q9j29R3k6l1J70
$$ 13 -51 112 -75 -227 39 -74 16 -186 -49 -98 -112 72 208 -30 229 -138 -29 60 -69 24 -2 -33 137
4862A37j94J17P2q7Q7l82J61q3n2j9M53k8m0L5k47L9k4L68k24l9K4M9k33K05j08
$$ 137 -57 60 132 45 132 -250 -89 -172 -224 -243 210 182 142 177 -70 -31 -55 313 89 50 74 123 -110 95 -13
4887a3Q2q0k0J56k11J49J7j96j41J47J63k8j98Q1L36j42j15RP2k19J14J41k46
$$ -13 69 -11 -31 125 -86 63 80 -116 -257 -110 53 25 -173 -92 244 102 -13 -4 68 -151 -37 104 -142
4910a42%K33m49L67J31j80K49k40N2j26J61R9j85n9O4J34j39J8j12K68j67j03
$$ -142 -142 91 -358 9 140 -40 209 -31 21 -105 56 155 -30 -89 -25 109 -30 -12 -124 144 -23 -126
4932a26Q0n6k2J52P8n8j70k5J86j76p3K11r1M2O5k0J92n3j01N0l4r4l4Q8L66m01
$$ -126 -46 -102 -124 28 106 48 -122 -147 39 -137 -210 1 -90 -48 17 -3 189 136 35 85 51 -43 -77 11 377 -24
4958b4l7r0QO9M0l6M49n23P1J30N7m45K52J36m4j57J54j23K04k26N5L68l01L9
$$ -24 -61 -151 -143 -74 -34 -70 379 -144 -73 57 114 -331 -79 57 13 -144 10 -113 91 -135 -80 288 -13 26
4982B6J47k63K15M1m2j40p5m6O6J71pK0k03K1jJ90J81k21rn3j59K60j72L5k43
$$ 26 173 -90 125 166 124 -16 -91 -137 -71 100 93 113 -90 -69 -70 120 301 80 71 18 -141 119 -53 -18 -261
5007b61J88P2q3M5k6oK19j52K4R3k29J76p5J23j30K10J16j59k19kpK0PM2J50k54
$$ -261 -73 -1 -84 -39 -65 -71 148 -4 20 113 -116 60 -15 108 -22 188 304 145 -74 -76 -83 -63 -56 -14 136 -118
5033a18j0L33l22j38K44OK4mj63J81j51K57l14J74Q1k15M08k34J5l4m4j61K64
$$ -118 -128 205 -117 -255 -11 -5 19 15 -148 33 -118 139 -175 -1 80 -135 273 39 54 20 -24 -185 79
5056G9N0q9r2M2k58K2K49Qk02K91m3J9m4P7Q1p6rj94J64o9L01l66l0J06Q3k84
$$ 79 129 40 -52 -10 -268 -246 3 11 -191 100 57 76 32 109 190 114 105 -89 75 6 307 -59 -89 17 100 -184
5082a84L3j54M05l22J27J55L7lk26l9R6L28j74j32j12O8o2K97j97N3OL58k76l9
$$ -184 -151 -305 100 -222 -95 60 97 94 -132 -171 -75 253 79 -53 -165 -97 -159 138 -59 -6 0 358 82 43
5106D3J41q9k21N8j02J72k6r4M1K13j15j3p1J91j87P8q5K1K0J46k89J42K33k88
$$ 43 184 95 -126 -68 -170 2 -24 -118 -77 136 21 8 -63 128 -59 19 -66 -45 -25 121 -168 -26 207 -81
5130h1K16j46L16l78M3j66mK50j23JM7K45k18K52m6P3j99r1K7Q9l7J0k45J30j08
$$ -81 135 -11 305 -73 -30 -196 -200 50 -73 -72 -25 220 2 254 208 281 82 -9 18 107 70 80 -165 -35 -143
5155a43L20j82m4l0K79j7Jq8k95L72o5o1N1N6l11L08N1k17J9K93k75j28P4K78
$$ -143 177 -5 -49 -79 200 183 184 96 -199 173 108 47 98 154 -157 151 202 -15 4 297 22 -106 -32 246
5179B46j91L18l73m5L93k81j3K4j89J15J8j20K34k48K6qo6J50J60j56k24M50j02
$$ 246 55 373 0 -45 348 67 54 78 -111 4 22 -98 136 -112 -86 -94 -160 -10 150 -6 -230 220 118
5202A18m16J66J95j66j57K47J98kj54M1L1j42K73k45k6o1k24k9L06K50O7j90k44
$$ 118 -298 -132 63 -103 -260 -13 185 183 29 70 101 -41 232 -13 -39 -100 -324 -353 -47 203 270 80 -164
5225a64J94K45k93L43k70QL5K3k58j29Q4M12k84j6J82o5j10J12N9j07r9J87K05
$$ -164 30 275 -18 325 55 63 98 121 -137 -266 -182 230 -54 -70 112 47 -63 49 108 1 -98 89 294
5248B94n94J73J09j35L70m4l70J5R1M9k19J91J24O0l6k46JL35j34j64J01J30o9
$$ 294 -300 -127 -18 -153 217 173 -197 -182 -91 -42 -261 -70 54 114 78 -168 -167 168 34 -130 -29 101 32
5271C2j91J46K91k44O5j84L5L2j35P8J8J62l30K07J62l07J95j30P5Q1j99K78N8
$$ 32 -159 -13 278 34 99 -85 -50 -18 -153 -75 -57 105 -225 -18 144 -163 32 -98 -23 58 -141 137 195
5294A95m8l13J59J14m9j7j44J95K43m19j2Q9k1j07L59l12O0j28J29J8J33j03R2
$$ 195 147 -166 -7 107 58 41 -103 92 335 -84 -96 -7 -28 -135 224 -88 -28 -156 -27 -9 124 21 113
5317A13O2l00K39j20K19P0O6l14q2M9k3R8k84O7J96k67L0J33O9n8O6j68j12J94
$$ 113 175 -125 114 -6 213 283 349 35 -47 2 -21 77 -207 -140 56 -211 -181 -48 21 -37 29 -139 -251 -57
5341e7n6L63j91k33K80k28L28K6r7N2k01K8l0Q4j00J5p7K01j96L25k9l30J41N8
$$ -57 -113 250 59 -174 106 -122 206 232 135 187 -14 14 -16 68 -32 -17 -94 107 -89 236 207 -123 18 76
5365G6J09k84J79j36K42j31l7K5j30O0O5M5J91k16j31K52k51L40l40J40k71j6
$$ 76 185 -99 80 -56 186 55 18 43 -87 -27 38 83 274 58 -73 179 -72 268 -72 68 -203 -219
5387b19K66q7M7l70Q61n13M3j86J42N5j25J78j61L49k94m2r4J62L1O8l32N7K94
$$ -219 47 -40 7 -363 498 -15 28 -158 -16 39 -86 92 -69 280 -14 -56 -150 12 43 111 -221 -164 130
5410A30j78l9J92k54J64K1j89K49j24j28P9L12j77j10K29k55O4J20j47M2M4j06
$$ 130 -48 -87 105 -149 15 36 -153 96 -28 -156 -77 235 58 -52 177 -78 -14 106 -41 1 45 -61
5432f1k10L07j46J16K80p2n12J87J06j18K19j84M2J07k37K35n9P5m4r9oJ68j65
$$ -61 -271 36 -110 6 286 214 -298 -111 -5 -123 96 -88 -46 61 -176 59 0 75 31 -68 -74 94 -71
5455g1q8R3K56j53l39J65J51j75P0L0q7J79j29J04N0n40O04N8q7j61j7k9j3K15
$$ -71 -159 -66 190 37 -302 -137 14 -161 -91 -61 -148 31 -98 6 56 -484 120 178 91 -70 -87 -116 -129 86
5479H6j29K62k77K04m40K28q8o1L31k33J16L5l87J09R5LK39J61j38Jk09r4R3J04
$$ 86 -43 219 -58 146 -294 -66 -154 -215 116 -117 -1 34 -353 -244 -149 -146 93 254 116 117 -92 -186 -93 11
5503A1J64j20r3n6M4O3K9N2k82L2J3N0l4k2K93k69l0j3J86r4J57j67P5L4J44k43
$$ 11 175 55 -38 -94 -50 13 42 94 -188 -156 -143 -93 -127 -149 144 -125 -155 -168 18 -76 81 -86 -11 23 167 -76
5529g6K73k00K01j52j49J42Mq5o5K82J5k00L26n43L71j25K6L0N2Jk95J82J77l47
$$ -76 197 -3 198 46 -103 39 43 -42 -107 175 190 -10 316 -227 144 19 45 75 127 128 -167 15 192 -155
5553a55p9J83Q6k37L56j85pm8J53l8k65K73k15J88J29pj8J8k72J7K77k46K2L31
$$ -155 -234 -51 35 -202 154 -31 -38 -86 67 29 -236 37 -178 10 139 132 114 132 -140 -123 154 -92 -70 261
5577B61k26q7J47J41l43J3%J4j86M49mo5n8j43K56N5j94k88lL65l5k59J88O1J32
$$ 261 35 -52 95 236 -107 -94 -94 -80 -266 183 179 114 56 -87 169 224 30 -258 -261 104 69 -190 -2 59 191
5602A91m6L8k46j96L45k5M7k36m1r9K26O1J26j0N6r8n1j84J51rN3J92J14l50l28
$$ 191 145 183 -63 -259 86 61 108 -128 -169 -268 -42 19 145 135 191 93 42 -142 9 0 53 245 359 9 -319
5627c19L26J20j67J79J72l53Q2J11J78m02k7k48J34R0M6L31l24J03J51l47L01
$$ -319 7 127 -40 139 311 -42 40 151 329 -73 -100 -348 -214 -124 -78 253 -71 32 183 -164 137
5648A37l08J04J75j30L4o1l3MM0L08j33k40K6J46Nm3p5O3l24L35K25k40j23R1
$$ 137 -171 -67 108 -22 12 -49 -82 -78 -38 270 137 -103 -77 69 74 31 -44 19 -305 30 255 15 -108 -17
5672a7m1r2L95o6k31j00M26k30K45k13O2j35j54J23N2J21k57j54L18o9k51M86
$$ -17 -58 -150 245 179 -52 -152 274 44 289 76 138 3 -151 -28 24 145 -112 -266 52 -17 -268 218
5694B18k85P6J57j19k45L02j90j16Oj4M50j96J09l65L29j03Q8m41K60r4j1K34
$$ 218 -67 9 166 47 -198 104 -86 -202 -196 -210 240 44 153 -212 117 14 102 -339 -79 -173 -184 50
5716E0oJ15j18n3R4j10p1M8K00mj59j01L04j50j32L7O1L07k28l5K4l4m09L74N2
$$ 50 44 159 41 -12 82 -28 -99 -51 149 145 -14 -115 189 39 -93 -56 5 312 84 49 73 39 -370 4 56
5741E6J42r2l25m5M97j56k67n8K58qn0J64Nm53L11O1Q6j64K64k38m7Q4l1j37K
$$ 56 198 106 -219 -264 233 77 -190 -248 10 2 -48 116 121 -332 -21 40 126 -38 226 -12 -59 25 -6 -143 -141
5766a41K15k19J69j20k5L3K84n66K86q2L99p8l78P9J19J6L4j38J55n4j18L55j20
$$ -141 74 -145 24 -96 -121 -88 196 -370 -84 -166 233 155 -223 -144 -25 -9 25 -113 42 -12 -130 225 105
5789A05k63K54k04j6J06k32R4M06j15l06R5K91k36L5j06n7K73l37M55n4k50q3
$$ 105 -158 96 -108 -124 -18 -250 -156 250 135 -171 -76 215 -21 14 -92 -149 124 -213 242 188 -62 -145
5811a45K66l42K26j36O8K45l56J15M12m21R4N6j36o3P9J36J05k14j41L16l00j83
$$ -145 121 -221 5 -131 -63 182 -174 -59 353 -68 26 82 -54 -117 -38 98 203 -11 -152 164 -136 -319
5833c19J07J65k11L49j03l0q9J84m9r8L3k5L05l93L69k57J89l3k52J26J74q8n4
$$ -319 -212 -47 -258 91 -12 -42 -131 53 4 -94 -61 -86 219 -174 195 -62 127 94 -158 -32 142 54 0
5856@J18R7k5m13L52J68m12M7J17R0j82J44j89J43k33J43j31O1M82l59m1j00J48
$$ 0 118 215 190 -223 129 297 -115 -68 49 139 -43 101 -88 55 -178 -35 -166 -105 377 18 -23 -123 25
5879B5J45l6j71J61qJ45k43j74Ok8o2K1K18J16j27J32k82J93k78N47l4q9KK7j89
$$ 25 170 134 -37 124 116 261 18 -156 -150 -178 -240 -219 -1 115 -12 120 -162 31 -247 300 266 177 179 206 17
5904A7Qp2j22K14L2o1k13K53k04K5P3K23k86%L06l15r9N3N35m34k76L05j36J09
$$ 17 25 -47 -169 45 77 16 -197 56 -148 -123 -50 173 -113 -113 193 -122 -221 -168 367 -67 -343 -38 -174 -65
5928f5q8K87k28p5J3N3n4M12l74K08J90m05J86K1k03J08k0O4r0K7K98k47j22L17
$$ -65 -153 134 -94 -169 -156 -103 -157 255 -119 89 279 -126 60 81 -122 -14 -34 30 -60 -33 265 18 -104 213
5952B13l34K76k18J24j15K1K46o0j21Q9r9J0n5R1p0p8L3K51j94M1j7N7J01j60
$$ 213 -121 155 -63 61 -54 -33 213 153 32 121 22 32 -23 68 -2 -80 -47 204 10 51 34 91 192 32
5976C2O6p8N3j42K29m3m95L83J28j06J5j19j2J40Q3l13N1J86l72M12m0j72j6K6
$$ 32 98 20 73 -69 160 117 -378 5 133 27 42 -77 -89 51 134 -179 -128 58 -314 98 58 -114 -130 -104
6000a04K22j43K65j56o9K13j78q4J7o1L29k87L17l43J00L84o32J39q4k2N57k35
$$ -104 118 -25 240 84 15 228 50 -34 -17 -78 251 -36 281 -62 38 422 -210 -71 -155 -177 380 145
6022A45k89N4J27k00L94j58Lm7j05m4J47O2k6j59n6R8N6r0J76n0k51N8J12K45
$$ 145 -144 -90 37 -163 231 73 76 29 -76 -120 27 89 63 -96 -152 -54 2 -88 88 38 -213 -155 -43 202
6046B02j45J18k49R4Lo9n9L07k28J95k27J77j31J41Q6k76K99l64M22m36k8Q4l4
$$ 202 57 175 -74 20 23 -46 -105 202 -26 169 -58 119 -12 129 215 -61 238 -126 296 -140 -168 -84 -118
6069a18K87J6q7p6j5J20J6J22k26%O7k9j35rN4j15J33j58j04L07o0K05j78K2K2
$$ -118 169 185 98 22 7 127 143 265 39 39 106 77 -58 -67 -13 -128 5 -153 -257 50 -10 195 17 39 61
6094F1K20n47O51k27k83L52j80k8M2J34p3J50l97M47l64j49K09Q9J9Q3j97J4j28
$$ 61 281 -266 385 158 -125 227 47 19 61 195 122 272 -125 322 -42 -191 18 107 126 209 12 26 -102
6117a02p3J99J39j09j5o4j92K71k16K49k71K97j28J58o5j24j11M16Jk47L5j54
$$ -102 -175 24 163 54 39 -25 -217 54 -162 87 -184 113 -15 143 78 -46 -157 259 260 13 48 -106
6139a06o4J00L1q8L05j58o9j11K95o8r1p0K6K76k34L8l19K92K0O7j32J22J91m55
$$ -106 -170 -70 -39 -127 178 20 -49 -160 135 67 -24 -94 -68 208 -26 12 -307 -15 5 72 -60 62 253 -202
6163b02N10n80K31q2N3k07L27j01r7L50j00l8rO6k17l5J15j20J02n5J60k64L27
$$ -202 308 -272 -41 -123 -70 -277 50 -51 -148 202 102 64 55 121 -96 -131 -16 -136 -34 -89 71 -193 134
6186A34k2l14K65lO5j02m1L7J17m9o4oj98K20J1l07K59K9r1Q0J23p1l13J8L47
$$ 134 112 -202 63 60 125 23 -18 19 136 87 23 17 -181 39 50 -257 2 31 -60 20 143 72 -241 -223 124
6211A24Kj70m2L1J26l07N14j47j33q9K93l19%OQ0J11j54J98j39M6j35j40K65k94
$$ 124 126 -44 -86 -55 71 -236 278 131 -2 -91 202 -117 -117 -111 -31 80 -74 124 -15 31 -104 -244 21 -273
6235b73K81j76j08K36J5J78k43J11J26r9J9j74J92ql97L33J0J0ok19L5K87k95
$$ -273 8 -168 -276 -40 -25 153 -90 21 147 48 67 -107 85 77 -320 13 23 33 27 -192 -157 130 -165
6258a65J29K76r7l08P2J02j38J70R0j47j0L7p7j2N3l2R4j37j5L19L3m03K81m37
$$ -165 -36 240 143 -165 -93 9 -129 41 131 -16 -26 11 -66 -78 -25 -57 37 -100 -115 204 237 -166 115 -322
6282c22L64k0j40J57J35j60k46J47j55K86l7J72k55K11k9r4p8k12K63M5j25l3
$$ -322 42 22 -118 39 174 14 -232 -85 -240 46 9 181 -74 137 108 14 -64 -276 -13 32 -93 -126
6304a26J31o7Q6k43K7L98q7p5J4O1o7J32j65m0k41K32j24K02K91o63J09J58K8
$$ -126 5 -62 24 -219 -192 206 119 44 58 119 52 184 19 -21 -262 -30 -154 48 339 -324 -215 -57 -29
6327b9J1k16K01J39m6j50m2J43l6j30m3M58l02L7J54k20L64k38mp3J66j07L9J25
$$ -29 -18 -234 -33 106 60 -90 -132 11 -25 -155 -198 260 -42 -5 149 -71 293 55 51 -22 144 37 76 201
6351B01k81k0O3k07JL87O1k79O3o8J22J32m1j65J63j5j92J6j9M5r0Q9L6k31M45
$$ 201 -80 -100 -37 -244 -243 144 205 -74 -11 -79 43 175 134 -31 132 117 -75 -59 -78 -33 -123 -34 2 -229 216
6376B16n04K62K21j81k52O3J1J17l8P7mJ19q7KL1q7j31K09j19Q9J73j85J55O6
$$ 216 -288 -26 195 14 -238 -175 -164 -47 -85 -8 -12 107 20 22 53 -34 -165 44 -75 14 187 2 157 223
6400B23o09K25J24j65K11r5J39R5j92m8P3L13m54J65j21K09m4m68M66J07j53K12
$$ 223 -386 -161 -37 -202 9 -86 53 148 -44 -92 -19 294 -160 5 -116 93 49 -419 47 154 1 213
6422B13nl8rM3P4n54L10r0J38r3k7M05l45k53L70r0pK53l01J16j26k3pJ5j76J41
$$ 213 208 170 161 204 278 -276 34 -56 82 -11 -38 367 22 -231 139 49 42 295 -6 110 -16 -39 -46 -31 -207 -66
6448f6K22m0j72j9J94k07lj02Q2J82k11JJ35L03k63j89M59j59l57L11q0oL05k79
$$ -66 156 116 -56 -75 119 -88 -91 -193 -111 71 -140 -139 -4 299 36 -153 306 147 -210 101 21 15 320 41
6472D1K3N6J8j71o7n8r5J35K34j81j62L11J84k34M9o5j38J69j68k73L46n8j37
$$ 41 64 120 138 -33 -100 -158 -253 -118 116 -65 -227 84 268 34 83 18 -120 49 -119 -392 -46 -104 -241
6495b41L79l65L40n0k40J66n4j21K20K96j75j88J22j00l22N44j46k60mJ85m0Q7
$$ -241 138 -227 113 63 -177 -11 -65 -186 34 330 155 -33 89 -11 -333 211 65 -195 -199 -14 -54 33
6517C3l2j30J93q3J61m58K41J27n2K5J6l9Q3l30L09q3o8K86l57j71L63k9K52k70
$$ 33 1 -129 64 -19 142 -316 -75 52 0 25 41 2 85 -245 64 -19 -87 199 -158 -329 34 5 257 -13
6541a3q0L02r3l03mqL07l3k09P3m5K08N4q8j24R6K20p8k08j06J8J79k4J06k92
$$ -13 -93 209 116 -187 -191 -199 108 75 -134 -61 -106 102 156 68 -56 40 260 182 -26 -132 -114 65 41 147 -145
6566a45K07P8j63n3j59J08j0O0R7J5p5J22J15j43M2j33J89j68J34j76j3k1J61
$$ -145 62 140 -23 -76 -235 -127 -137 -77 20 35 -40 82 197 54 96 -37 152 -16 118 -58 -71 -92 69
6589F9r1J30j52l5J42r6j91K80M5k3k70P1M57m99J71K26m77J89q2Q5j00j8L50
$$ 69 -22 108 -44 -79 63 -33 -224 56 101 78 -192 -121 336 -163 8 234 -243 -54 -136 -51 -151 -169 181
6612A81j85j45p0J79j56N8J89o5n1K09j59j99J86K18r4k29J1Q8n9R6k43j2K12
$$ 181 -4 -149 -219 -40 -196 -138 51 -14 -65 144 -15 -214 -28 190 96 -133 -122 -34 -93 3 -240 -252 -40
6635d0M2J63q4k13J08K5J5P4N5k28o4O4P4k09K87J25k39P9J84j55K3k31K94j84
$$ -40 2 165 81 -132 -24 1 16 90 145 -83 -147 -83 -9 -218 69 194 -45 34 218 63 86 -145 149 -35
6659c5J19L8j49L55l84j05J63j92j41L42l4J69k25J02om5p5J00K00l50J73j16
$$ -35 84 122 -27 328 -56 -161 2 -190 -331 11 -23 146 -79 23 17 -28 -103 -3 197 -153 20 -96
6681i6n3J60Q1J7k02J20k73J96k9r0K00K2J02p4J72j98j76M3J27P2j81l06L71
$$ -96 -149 11 92 109 -93 27 -246 -50 -79 -169 31 53 155 81 253 55 -121 -78 49 121 -60 -366 5
6704Eo4L26k27k53Q7j07Q6j90L35p3J27qP4N3j74%J37j96P8np1Jl9O1j06L79k89
$$ 5 -59 267 40 -213 -126 -233 -147 -337 -2 -75 52 44 118 171 -3 -3 134 -62 16 11 -60 -59 -98 -37 -143 236 -53
6731e3J05k5q0O8j9J11j80j08r8K71j97N78m59J10l04L60k50M3n5K17N8M2mk19
$$ -53 52 27 -53 15 -4 107 -73 -181 -279 -8 -205 373 -86 24 -280 80 -170 -127 -182 35 93 135 131 -88
6755h8P5m6K6qL55r2k68j35M57k07j70L04k82J07Pk32K67l08K17K13k06K5l3K9
$$ -88 -13 -59 -33 -41 314 222 -46 -181 276 69 -101 203 -79 28 35 -197 70 -238 -21 192 -14 11 -22 7
6779Gq8J92j02J43l27L69l64J35k03M4Q0K13L6o2j89K5J01N9J85k31J46k59J01
$$ 7 -81 111 9 152 -175 194 -170 -35 -238 -194 -114 99 135 73 -116 -91 10 69 254 23 169 -90 11
6802A1m1j87Q4L95l35j03o7K96P5j91qO0k32K12q4L84k9m03N9M0P6l00M21j41
$$ 11 -30 -217 -133 262 -73 -176 -243 53 128 -63 -71 -11 -243 -31 -115 269 240 -163 -104 -64 12 -288 133 -8
6826hN0m11M96j39K5j05K36k85M5J39J15r2L9p7m5k31M87p1k7p0m26J25J1L61
$$ -8 42 -369 127 -12 13 -92 144 -141 -96 43 158 66 105 28 -17 -248 239 168 141 71 -355 -230 -219 142
6850A42l18J89q8J4q1K11J68k82J92j78J0J08JJ23j86p7k1K4Nl6L9j4J11k51L13
$$ 142 -176 13 -75 -61 -142 69 237 -45 147 -31 -21 87 88 211 25 -52 -73 -49 -44 -80 -41 -55 56 -195 118
6875A18n7j37K6l40L18J91P0k87L5J40n4l30K34J26m9ORk91K65n2L5j21J29j15
$$ 118 61 -76 -50 -390 -72 119 189 -98 -63 77 23 -307 -73 53 4 10 19 -272 -7 -59 -24 -145 -16 -131
6899a31n0OJ55Q0j48N0K07r3j52Q7N6Lj27J66Oj28jJ7N2k25K23O5j91K41L3j33
$$ -131 -181 -175 -20 60 -88 -38 169 76 -76 11 67 70 -57 109 115 -13 -14 3 55 -170 53 118 -73 168 201 68
6925F8j48J60n7j21J32n1M8K05l99K38j46J73k21Q4L2k5J33p7m4Q7r3k22L18k5
$$ 68 -80 80 23 -98 34 -17 31 236 -163 75 -71 102 -119 -35 -3 -28 105 28 -16 71 -22 -244 74 49
6949D9K2k65N39j59R8m78J68j8J12l1r5JK15j86K56l81K16n1J08K22k93l58K77
$$ 49 71 -194 345 186 284 -194 -26 -44 68 37 -58 -57 158 -28 228 -153 63 12 120 342 49 -309 -32
6972c2J65m48K52r7K69j36J47j32J23j43J87l19L6J67j75J79p9k1L36k82k8k2
$$ -32 133 -315 -63 -160 109 -27 120 -12 111 -32 155 -164 -128 39 -136 43 -36 -57 279 -3 -31 -53
6994e3M2J54m9R2k7O8k43k05M65m56R4J08Q1j09K23k33M2J44l7k38K67k21n5M78
$$ -53 -11 143 94 186 159 227 -16 -221 244 -212 -118 -10 71 -38 185 -48 -6 138 101 -137 130 -91 -146 332
7018C32m76K17P4m12L47k44j2K94R7m21L22j5k71L36j62K48l97j42M08O9k76L96
$$ 332 -144 73 147 -265 82 -162 -174 120 217 -204 118 103 -168 168 6 254 -143 -285 123 192 -84 312
7040C12l7j18r0j02l1J31J50k24J3MJ33K9q0k71P7L65m40J51q1R7k8J6K12k46
$$ 312 275 157 67 -35 -66 65 215 -9 4 8 141 170 90 -181 -104 261 -179 -28 -109 -12 -40 -24 188 -58
7064e8K27l30K11J0j48L30m13K05kK2K6n1J32j72J6m9O4j78K65j52q6j4K16j2
$$ -58 169 -161 50 60 -88 242 -171 34 32 54 80 29 161 -11 5 -44 20 -158 107 -45 -131 -145 71 59
7088E9J54n7j0j54J66P5m55J62j06Q9J45k98O43m77k04M21j43m6P6K4j03K47j25
$$ 59 213 156 146 -8 158 233 -222 -60 -166 -77 68 -230 413 -64 -268 153 10 -36 40 64 -39 208 83
7111H3O2l16K7R7L23k26J8R1l32K36O1j11L23l52j4K15n09K44j15J83K00l05K74
$$ 83 145 -171 -144 -47 276 50 68 159 -173 63 124 13 336 -16 -30 185 -324 -80 -195 -12 188 -117 157
7134A57j95j4%J4j5r6N4J31j83K38r0J19K3j22j79N1J62j7l07J33r2J33PK6r9
$$ 157 -38 -52 -52 -38 -53 -149 -95 36 -147 91 1 120 143 21 -158 -107 55 38 -269 -136 -228 -95 -88 -62 -161
7159a61J81J63m00J54j55L32K5j47J6L3J56m27n0J10J9J16p4K07k69pK15J95m14
$$ -161 20 183 -217 -63 -218 114 139 -8 8 41 197 -230 -280 -170 -151 -35 -109 98 -171 -178 37 232 -182
7182a82J54j15L2j54M71l34J52K41j91k40K62m30K60p5K55j00L4Q7l17K41J45
$$ -182 -28 -143 -111 -265 206 -128 24 265 74 -166 96 -334 -74 -149 106 6 40 127 -190 51 196
7203A96j30q8K57J59j31p1j08j88J55J57j29J34q3k63j7J35N1k87J13J3K81n2
$$ 196 66 -22 235 394 263 192 84 -104 51 208 79 213 130 -133 -150 -15 36 -251 -138 -125 156 104
7225A04j94j43K82k62J22J21Q4J90l03N5j40K12j62L1p5j7J40j11K22l78K01j74
$$ 104 -90 -233 49 -213 -91 30 114 304 1 56 -84 128 -34 -3 -78 -95 45 -66 156 -222 -21 -195
7247a95Q5J72j51K29j25j7n3j74L96k5p4j87K08k12J46O2j61J60j04j32J43J41
$$ -195 -110 62 -89 140 15 -2 -55 -229 167 142 68 -119 89 -123 23 85 -76 84 -20 -152 -9 132
7269A32J18l56q9J84o6L30m18J35m7k74K69P8k9P3j78P3L43m82J96J64n7m54K56
$$ 132 250 -106 -195 -11 -77 253 -165 -30 -77 -351 -82 -4 -33 40 -138 -65 278 -204 -8 156 99 -355 -99
7292i9J8o2P8J50j56K20k88L31j60k9O7p2l1r5K01J77j57n6O0N0n11J79P8K3P9
$$ -99 -81 -143 -65 85 -71 149 -139 192 32 3 70 -2 -33 -128 73 250 93 37 97 147 -364 -185 -107 -84 -5
7317eRk74R8J00o8k0O3Q5M0l24L43J65l69L58k22M9L9k50L92K16l46j70K01j07
$$ -5 4 -270 -172 -72 -140 -160 -97 -12 28 -296 47 212 -157 201 -21 28 67 -183 209 425 79 -91 110 3
7341CnJ58m19J76K49k95L45r2j08J13j79k57L14K64k49p1j3J40j56J76l5p5j39
$$ 3 -2 156 -263 -87 162 -133 212 120 12 125 -54 -311 3 267 18 -53 -66 74 -82 94 59 -16 -155
7364a55K00k6K11j58Kk20J3O7j2j1p1K37j06m3M1j3L11m21J85p7q5k0M50k32J39
$$ -155 45 19 230 72 74 -146 -133 -66 -78 -89 -160 77 -29 -72 -31 -44 267 -154 31 -46 -131 -151 299 67 206
7389B06j46l6J24k16j99K65M8NK03k17j20J59l6No4J8m4Lj2j71K51M6Kq5N9m08
$$ 206 60 24 148 -68 -267 -2 46 51 254 37 -83 76 40 45 -19 -1 -45 -42 -54 -225 26 72 74 -11 48 -360
7415c60N06o2k68J62j6K11j08j6K9L3j9l72K44J99m1l10K94k29lJ02j0jk7K40
$$ -360 146 84 -184 -22 -38 173 65 49 78 111 92 -280 -36 163 122 -188 106 -123 -126 -24 -34 -35 -62 178
7439A78l05M5J01QLj99L0J87q9j9N8J97k94J34J6R0j01P0j28Q3j2l10K43K7n0
$$ 178 -127 -82 19 27 30 -169 -139 48 -41 -60 -2 195 -99 35 51 141 40 110 -18 65 53 -257 -14 13 -37
7464c7l7K84k05J39j41r0J77j66J4L78k97O8j84J25j92K29Q1j32L7JJ20l76M90
$$ -37 -74 210 5 144 3 -87 90 -76 -62 316 19 87 -97 28 -164 65 146 14 51 52 172 -204 286
7487B86m12K01K87j86o8k1j95J58N2k97K61L1l8r6K8q9n8J52rL25o34M14J7j63
$$ 286 -126 75 362 176 108 87 -108 50 102 -195 66 97 59 -37 -9 -98 -156 -4 -13 312 -322 92 109 -54
7511e4K88p7k88J41n5JK33l28J34J88l94M58j23l89L81m3j25j53L25k85K9J4J03
$$ -54 234 157 -131 10 -45 -44 189 -139 -5 183 -211 247 124 -265 116 73 -52 -205 120 -165 -136 -122 -19
7534a9K20r5j05j98R7J53J89j68j19L68l58j48J58OK16l01K15P9j06k15M46l93
$$ -19 201 106 1 -197 -100 53 242 74 -45 323 -35 -183 -25 -19 197 -104 111 190 84 -131 315 -78
7556g8Q4m9N0p4K09j73J5K2J14o12K93O9R1j11K98k26r7M05m27L42j15J35n5j24
$$ -78 6 -43 7 -67 142 -31 -16 6 120 -492 -199 -130 -39 -150 148 -78 -175 230 -197 145 30 165 110 -14
7580a4j0J56k82M72l65L4j73K46r7P9o8L2J83k48J60l0R6k46Q5l98P8K4K39j41
$$ -14 -24 132 -150 322 -43 -9 -182 64 -33 46 -22 10 193 -55 105 75 171 -75 10 -388 -310 -286 -47 -188
7604a88J5L1K06n9q8p8L69j40k63J99M02n18q1K20o2k10N01m0k41P5j73LJ36p7
$$ -188 -173 -142 64 5 -83 -161 208 68 -195 4 406 -112 -193 27 -35 -245 256 216 -25 50 -123 -120 16 -61
7628f1N1J34nj22j83K08n8j13J19K44l73PO3L70l03q7P6J66M8m8n2Q2l13M0J00
$$ -61 -10 124 119 -3 -186 22 -36 -149 -30 214 -159 -152 -89 281 -22 -109 -33 133 181 133 81 163 -150 -110 -10
7653a0r4J31q3J17Nk22Q7J92k54J79L58l75q8K8J3J4j12K16k71j56J89J43r9J55
$$ -10 -104 27 -56 61 66 -156 -69 123 -131 48 406 31 -57 -29 -16 -2 -114 102 -169 -325 -136 7 -92 63
7677F3l4J31l03R2J06k45LJ64J57l39K69j80J72J33k53k5J35k7m0j04J12J44q0
$$ 63 29 160 -143 -51 55 -190 -187 -23 134 -205 64 -116 56 189 -64 -89 46 19 -21 -125 -13 131 51
7700E1k65M02k32j9q5N8J79J05l1k82L2j24M25j68k05J56J95r3k50J87K6l11M20
$$ 51 -214 188 -44 -63 -148 -90 89 194 163 -119 -87 -211 214 46 -159 -3 192 99 -151 36 62 -249 171
7723A71l97K82J27k42j62M75l20J0O4K03l40J10n6Q7k4Q4J08l6j87j09K44m5R
$$ 171 -226 56 183 -59 -221 254 -66 -56 8 211 -129 -19 -75 12 -12 72 180 144 -43 -152 92 47 56
7746E6M3K3J20k72j26K54r7j0K41m07O2m5K31j06l35L30L12j83l91K46M7J2nK0
$$ 56 99 122 242 -30 -156 98 1 -9 232 -175 -113 -158 73 -33 -368 -38 274 91 -300 -54 -7 5 0 20
7770B0j25P1r8K07j6j2k85J17R7n9J64p7j25K19J00j56j88Q7J3J83oJ4k74J96
$$ 20 -105 -34 -132 75 59 47 -238 -121 -24 -83 81 4 -121 98 198 42 -146 -59 -46 137 131 145 -129 67
7794F7j4o7Q8k07P2J69J5m4j63R9L7J28o4k38j66J66L04n8j49o9M5P7l35L34L97
$$ 67 53 -14 74 -133 -61 108 123 79 -84 15 52 180 116 -122 -288 -122 182 124 -25 -94 -49 28 -307 27 424
7819D24o04J91L1j26P5j04K71j81L3J38j41K0R1j55J09j03J06q7l5K4K13l8j88
$$ 424 -180 11 42 -84 -9 -113 158 -23 10 148 7 27 118 -37 72 -31 75 -12 -47 -23 190 152 -36
7842c6l30K40J65p0j30J08j05M48k20M0q6k35k69L11M3j32K78L3J65k10M1q7J58
$$ -36 -366 -126 39 -31 -161 -53 -158 290 70 110 24 -211 -480 -169 -126 -258 20 53 218 8 49 -38 120
7865A20j93O0J49k86M70l71rJ15k24o1L61m9j14K11l02J77k43K9J31j38M23k10
$$ 120 -73 -13 136 -150 320 -51 -60 55 -169 -230 131 82 -32 179 -123 54 -189 -160 -29 -167 256 46
7887D6k8k25P5J61o9J63J07k74m9K43l52K91j30J04j27K93k62K78j26j74J50q9
$$ 46 18 -207 -132 29 -40 123 230 -44 -93 150 -202 89 -41 63 -64 229 -33 245 119 -55 95 6
7909FK34k16O7J0r4P3j96Q5rL04q5j53k3l9J06lj43M9n3O0j8J81k17k03L24m9
$$ 6 240 24 91 101 7 80 -116 -31 -40 264 179 26 3 -36 70 67 -76 -27 -80 -20 -38 143 -74 -277 47 -2
7935bJ70k96J98p8j5J2j6K34j29J20j87J7j71K22k46J18J9R7j13m9N9k3J41l9
$$ -2 168 -128 70 -8 -23 -11 -27 207 78 198 11 28 -143 79 -167 -49 -30 67 -46 -95 -36 -59 82 43
7959D3q3j36l6K41m37L78n3j17L07l57J70P0J4Op4M2L31m46K25J65j31j89Lj40
$$ 43 -40 -176 -212 29 -408 -30 -83 -200 107 -250 -80 -10 4 10 -64 -22 309 -137 88 253 122 -67 -64 -204
7983b04J60R1pM7l17L84m21L28j55K71k82K35k34m8nJ16nP9Mk22L41k10J16l70
$$ -204 -44 47 40 87 -230 154 -267 61 -94 177 -105 130 -104 -152 -157 -41 -46 33 37 -185 156 -54 62 -308
8007c08K35p2N8k4L33p6k17k5L54l69q1J43j61M88l2j80j61P2j33K79k05J28j51
$$ -308 -73 -145 -87 -111 222 146 -71 -96 258 -111 -192 -49 -210 278 246 66 -95 -23 -156 123 -82 46 -105
8030a05J39j46K88j70j01O4J32j4j68r6K30K15k76j88J50j7Q1j08J48j9k79K32
$$ -105 34 -112 176 6 -95 -31 101 87 -81 -177 53 268 -8 -196 -46 -63 18 -90 58 39 -240 -8
8052hj2k16J4J91m4J01k20P7K05j94M23k15l53L02k9j36J39n3j50J59J8J33k91
$$ -8 -20 -236 -222 -31 -75 26 -194 -117 88 -106 317 102 -251 51 22 -114 25 -28 -178 -19 -1 132 -159
8075a59K80j56j57j66M58o0J90l96K86Rk78J04K10m1q1k91L68j15J03j29K31j89
$$ -159 121 -35 -192 -358 100 40 230 -166 120 129 -149 -45 165 124 43 -248 120 5 108 -21 210 21
8097B1k17K94P2l03J74Q0j10O3l5M6Lj90o8J55k01M91l37l4L7K44k14J15j90m7
$$ 21 -196 98 170 -133 41 121 11 74 39 85 88 -102 -170 -15 -216 275 -62 -96 -59 185 -29 86 -104 -151
8121a51R0L1k41J38L06lj17j97L74j79q7K5P2l46M67l90M10k9j28n4K95o1n33
$$ -151 -61 -30 -271 -133 173 170 53 -144 230 51 -36 -11 61 -285 182 -208 202 173 45 -9 286 225 -308
8144c08N18j16J83m02j6J74L8%j92l1J67O9K1n8J2K03l10N8j61J92j38L06r2Q6
$$ -308 210 94 277 -125 -141 33 71 71 -121 -152 15 84 105 47 59 262 -48 10 -151 41 -97 209 117 203
8168B03j09j3l7J0k60j0J12o0nJ32J22k15q9N59l98k47M13l8J71k35LL6l5
$$ 203 94 81 44 54 -206 -216 -104 -164 -169 -37 85 -130 -219 340 -58 -305 108 70 241 6 9 45 10
8191A0
$$ Imaginary data points
##PAGE= N=2
##DATA TABLE= (X++(I..I)), XYDATA
0@%%%%%%%qJ6j6J6k4M0m8N6p2R3j17J44j76K10k50L01l57M20m92N73o66P70q86
$$ 0 0 0 0 0 0 0 0 -8 8 -8 8 -16 24 -24 32 -40 53 -64 80 -96 114 -136 165 -192 228 -264 309 -357 413 -473
30d73J014j161J321j497J695j910K148k411K698l013L358l735M147m595N085n623
$$ -473 541 -620 701 -796 899 -1011 1137 -1274 1424 -1589 1769 -1966 2181 -2414 2671 -2952
46b952O210o850P553q323R168j0099J1127j2272J3550j4985J6610j8464K0605
$$ -2952 3258 -3592 3961 -4362 4806 -5293 5834 -6438 7112 -7873 8737 -9727 10878
59A0878k3112K6090k9697L4175l9910M7557n8317P4701j02990J65324n47242K06775
$$ 10878 -12234 13856 -15841 18334 -21576 25981 -32336 42365 -60625 104699 -442543 -235768
71b35768N55055p74132L21239M76269m03632j93225O32602m4135k80379K33931
$$ -235768 319287 -454845 -133606 342663 -60969 -254194 378408 334273 53894 287825
81B87825j0732m79070J35336K47159k48728m0447K92117k27057k83800K01099
$$ 287825 277093 -201977 -66641 180518 -68210 -108657 183460 -43597 -327397 -126298
91a26298J24573j59383P4886R8476j02130J6922J57622k833l750R0231P628n8209
$$ -126298 -1725 -161108 -86222 12254 -89876 -72954 84668 81835 78085 168316 175944 117735
103A17735j3260m4991k5382j5306j27362q7672Q0384p445n8286J32888O7851j39516
$$ 117735 104475 59484 34102 18796 -108566 -196238 -115854 -123299 -181585 -48697 19154 -120362
115a20362N9130K25607j2009p2423J01035l2866j80732J9605Q4885q1797k4960
$$ -120362 -61232 164375 152366 79943 180978 148112 -32620 -13015 71870 -9927 -34887
126c4887N0476j07721q6069J05012M4895l0056Q8059K9188j34326j2932J36215
$$ -34887 15589 -92132 -178201 -73189 -28294 -58350 29709 58897 -75429 -88361 47854
137D7854K6239l2320O0630J1205j01277k6350O4632K046l7326l680m0001q8092
$$ 47854 74093 41773 102403 113608 12331 -14019 50613 52659 15333 11653 -28348 -116440
149a16440k5816N3974L7973R1K5417L1221j8925J3244R7002M4989m6697j5199
$$ -116440 -142256 -88282 -50309 -50218 -24801 6420 -12505 739 97741 142730 96033 80834
161H0834l527o8997l9688L3284j5410o0969l821L822k9622M1959P8567j0860j6432
$$ 80834 77307 8310 -31378 1906 -13504 -74473 -78294 -74472 -104094 -62135 16432 5572 -10860
174a0860M6282m518k8931N8828L8954o1022l2505J8880k6972k1777M1940O253
$$ -10860 35422 30904 1973 60801 99755 38733 6228 25108 -1864 -23641 18299 24552
186B4552n6247k2482L881j5594J9074M5692k541j7690J0145Q399J7124M6332K4857
$$ 24552 -31695 -54177 -50296 -65890 -46816 -1124 -3665 -21355 -11210 -2811 14313 60645 85502
199H5502j4351k3384k8715k6181K709Q497j9987k5972j5621k0670P41M6155L9642
$$ 85502 71151 47767 19052 -7129 -4420 4077 -15910 -41882 -57503 -78173 -77432 -31277 8365
212H365P719P904J620r148J5298K2876l159j0972j7535l9375k0656K0199J0535
$$ 8365 16084 23988 25608 16460 31758 54634 51475 40503 22968 -16407 -37063 -16864 -6329
225f329j4490k50L600k2821j175L8257J6756r894M442J80j1034J4628K5887J445
$$ -6329 -20819 -21069 -17469 -40290 -41465 -3208 13548 3654 8096 8276 -2758 11870 37757 39202
239C9202q938p140j7946j5878P480O815j6275j7235q096j1131N931K8896J8409
$$ 39202 30264 23124 5178 -10700 -3220 3595 -12680 -29915 -38011 -49142 -43211 -14315 4094
252D094N667O652L08j701J5145J8012m131k0250j8100j6983j6932J088J4318m8
$$ 4094 9761 16413 16721 15020 30165 48177 44046 23796 5696 -11287 -28219 -27131 -12813 -12861
266a2861j2631n948M416J2314J7871J4221O715n771j1553l201Q490J0069J792
$$ -12861 -25492 -31440 -27024 -14710 3161 17382 24097 18326 6773 3572 12062 22131 23923
279B3923j0403j2253q590o425K794R088m63j2610j0968j615P697J1273J3804P369
$$ 23923 13520 1267 -7323 -13748 -10954 -1866 -2329 -14939 -25907 -27522 -19825 -8552 5252 12621
293A2621l216j742N966O990O907M369j0658j9414j3597l856m47L02l9k887o540
$$ 12621 9405 7663 13629 20619 27526 31895 21237 1823 -11774 -15630 -16077 -15775 -15814 -18701 -25241
308b5241J341J3874J5762J1471L521n505m411m96J136K926P46q199j4131q284
$$ -25241 -23900 -10026 5736 17207 20728 15223 10812 10316 11452 14378 15124 6925 -7206 -15490
322a5490K701N744J637J218j347q126k793Q335J0178N467J158k105k712P32O094
$$ -15490 -12789 -7045 -5408 -4190 -5537 -13663 -16456 -8121 2057 7524 8682 6577 3865 4597 10691
337A0691P055j049o773q627q933m311K999J838k206n063k907K140P820J0734R541
$$ 10691 17746 16697 9924 1297 -7636 -11947 -8948 -7110 -9316 -14379 -17286 -15146 -7326 3408 12949
352A2949J743l001k518o42K209K045l866q568p522n983j055M677O027K49m102
$$ 12949 14692 11691 9173 8531 10740 12785 8919 351 -7171 -13154 -14209 -9532 -3505 -3256 -7358
367g358j137L401L141O098O812j336o012k067J857K628K439P15m018q118m651
$$ -7358 -8495 -5094 -1953 4145 10957 9621 3609 1542 3399 6027 8466 9181 5163 -2955 -7606
382g606Q07K075R64k81l942l073J428N297O658N901R80k248j750J101K336L03
$$ -7606 -6799 -4724 -3760 -4041 -7983 -11056 -9628 -4331 2327 8228 9208 6960 5210 6311 8647 8950
398H950k137n183p482m655R05K459K421J109j497n04J775M773N687J435j815j245
$$ 8950 6813 1630 -5852 -10507 -9602 -7143 -4722 -3613 -5110 -5614 -3839 934 6621 8056 6241 4996
414D996k845j916K796K939k158m996k398q77r88K370L267j719l477l95R56K566
$$ 4996 2151 235 3031 5970 3812 -1184 -3582 -4459 -5447 -3077 190 -1529 -5006 -5401 -4445 -1879
430a879N308J985j506o25o33m48K155K815k203n652l336j038k155K508L351j444
$$ -1879 3429 5414 3908 3283 2650 2202 4357 7172 4969 -683 -4019 -5057 -7212 -4704 -1353 -2797
446b797j762J133J623K642M606K086k321k251j584q21O56J108j201k989k064j331
$$ -2797 -4559 -3426 -1803 839 5445 7531 5210 2959 1375 554 1210 2318 1117 -1872 -3936 -5267
462e267J241L325J246j808K56m93j147K876L961K8k208l54r87m74K353Q90j484
$$ -5267 -4026 -701 545 -1263 -1007 -1500 -2647 229 4190 4218 2010 1656 669 195 2548 3438 1954
479A954k520j819k433M13L360M5j688P95L3m20L730L676n83j352l01j487j524
$$ 1954 -566 -2385 -4818 -4405 -1045 -1000 -2688 -1893 -1860 -2280 1450 5126 4543 3191 2890 1403 -121
496a21J559K99k437k496k07r88Q05L156J152n44l83l58M06K312J096l01o96k203
$$ -121 1438 1737 -700 -3196 -3403 -4391 -3586 -430 722 178 -205 -563 -157 2155 3251 2950 2254 51
514E1j182N93J508O84j407j703q25o83J122J322M00j97p29r31J665K112N43N58
$$ 51 -1131 -538 970 1654 247 -1456 -2281 -2964 -1842 -520 -120 -317 -1046 -1977 -312 1800 2343 2901
532B901K95j739j764J082N53j322r60q03j705r41K012J542L76R04k20k24O37J918
$$ 2901 3196 1457 -307 775 1328 6 -954 -1757 -3462 -4403 -2391 -849 -473 431 211 -13 624 2542
550B542O00j01j394j566j074J35P48K6l29r60j240L95J188R99N74K5q75p7O74
$$ 2542 3142 3041 1647 81 -993 -858 -110 -84 -413 -1373 -2613 -2218 -1030 -31 543 568 -307 -384 290
569B90R42N85N43j308n84K5k53%L08m42k359m44Q19N26j90J563L50q14O73J558
$$ 290 1232 1817 2360 1052 468 493 240 240 548 106 -2253 -2697 -1878 -1352 -1542 21 371 -443 230 1788
589A788k86O27N71j543j727M18l02p05N57J9j374j91P94N77N52R87K27j082M49
$$ 1788 1502 2129 2700 1157 -570 -152 -454 -1159 -602 -583 -1957 -2148 -1354 -777 -225 762 989 -93 356
608C56M31J79N14J48p85j090J71j57L56J90o51p99m45L82J54R88J30k78M5O22
$$ 356 787 966 1480 1628 843 -247 -76 -233 123 313 -338 -1137 -1582 -1200 -1046 -58 72 -206 -161 461
628D61j21R60O20j31j240l78k81k79N8J0o22r92M79N46J16R03O35n80K83L93m18
$$ 461 340 1300 1920 1789 549 171 -110 -389 -331 -321 -943 -1935 -1456 -910 -794 109 744 164 447 840 422
649D22K98O90l74p57n93L7R4NM00n34o31q3M96lM22M38k08k92J22M97O72j84J9
$$ 422 720 1410 1036 279 -314 -277 -183 -178 222 -312 -943 -1026 -530 -533 -111 327 119 -173 -51 446 1118 934 953
672I53l68o54m9j73M38l53n60l38m7M10N76L18M5P9J91j12M25K01m2m61k90m66
$$ 953 585 -69 -118 -291 147 -206 -766 -1104 -1151 -741 -165 153 198 277 468 356 781 982 940 479 189 -277
694b77l05N32K94o84J64j57j61o5Q31J69J6k58r7L2J26J64K45l26k22l07K22j54
$$ -277 -582 -50 244 -440 -276 -433 -594 -659 172 341 357 99 2 34 160 324 569 243 21 -286 -64 -218
716b18Q4J95l99l62N6K38J96N94o7K22m26J44P0K50q8k24l54j81j41L37j96J85
$$ -218 -134 61 -338 -700 -644 -406 -210 384 317 539 113 257 327 577 489 265 -89 -270 -411 -74 -270 -85
738h5j56k44J8J68N19J45m9J55l37k35M5L47L2q0o34J82k52M00J59K7l28k29J62
$$ -85 -241 -485 -467 -299 220 365 316 471 134 -101 -56 291 323 243 -391 -209 -461 -61 98 125 -203 -432 -270
761b70K81J85K27k40J17l00l2K67J94k0j93j81j86k79J59R4j98O0k2K45j83N22
$$ -270 11 196 423 183 300 0 -32 235 429 409 216 35 -151 -430 -271 -177 -375 -315 -337 -92 -275 247
783B47K04p5j79l19N9K62Q8j61m7k26r6K42l38J20L9J17j1j49J40M36r0J91n08
$$ 247 451 376 197 -122 -63 199 287 126 79 -147 -243 -1 -339 -219 -180 -63 -74 -223 -83 353 263 454 -54
806e4K42k73J68m7K72l33qk93lN03l38K10j57j20o0L99L14k1O2q7k45R8k10J44
$$ -54 188 -85 83 36 308 -25 -33 -326 -329 174 -164 46 -111 -231 -291 108 422 401 463 376 131 229 19 163
830A63J21k96k11k54L21j15K64j43J57j68o3J91K56M3Q8l99M3L84m88J08j88K87
$$ 163 284 -12 -223 -477 -156 -271 -7 -150 7 -161 -224 -33 223 266 354 -45 -2 382 -106 2 -186 101
852A01j64K2l29R3K86j29K6j52K98j67M40j97M4j03K98M8l51K5n0j43m12L44j8
$$ 101 -63 -41 -370 -277 9 -120 -94 -246 52 -115 325 128 172 69 367 415 64 89 39 -104 -516 -172 -190
875a90o0n1k0L25j03J82M6j09M91j80l07k37J31J75M2k77N2j32k40K96LJ52K9
$$ -190 -250 -301 -321 4 -99 83 129 20 511 331 24 -213 -82 93 135 -142 -90 -222 -462 -166 -163 -11 18
898A8m3k56K5L57L17j93k13q4J34l6L89m75L91n30L13k49j87K06J97k01K55l21
$$ 18 -25 -281 -256 101 418 225 12 -72 62 26 415 -60 331 -199 114 -135 -322 -116 81 -120 135 -186
920a86J24L17j1j1R0o8Rl11k9j0j00l5j04J20N9L73m38JJ89j34J24J57k3J27l82
$$ -186 -62 255 244 233 323 255 264 -47 -76 -86 -186 -221 -325 -205 -146 227 -211 -210 -21 -155 -31 126 103 230 -152
945a52O29o48j1K41o1l9J08j33oj14J15q3k4M37k96l1J91M2K40k06j14J33n8j24
$$ -152 477 -171 -182 59 -2 -41 67 -66 -72 -186 -71 -154 -178 259 -37 -68 123 165 405 199 85 218 160 36
969C6j45lj64K89k53mJ72L6j36M4K18K10k94J14J64j2n22L78j53O5J72j08k77
$$ 36 -109 -112 -276 13 -240 -244 -72 -36 -172 -128 90 300 6 120 284 272 -250 128 -25 40 212 104 -173
992a73m8J27L00L0m44L05r1j86J95J13J7Nr3l3l6J49k46J17k20K43p7j7J90J75
$$ -173 -221 -94 206 236 -208 97 6 -180 15 128 145 150 57 24 -12 137 -109 8 -212 31 -46 -63 127 302
1016C02m29J83J39O8l58N07k96L5L9j83J95l08N7ol2N5p8j13N2N22m53J90l70
$$ 302 -127 56 195 263 -95 412 116 151 190 7 202 -106 -49 -55 -87 -32 -110 -223 -171 351 -102 88 -282
1039b82J49J07k8P5P0l26p0L85k25K32k09L7l2Q6On6J18J27l34K90o9q5L40j76
$$ -282 -133 -26 -54 21 91 -235 -305 80 -145 87 -122 -85 -117 -31 -25 -81 37 164 -170 120 51 -34 306 130
1063A30l8j71m7k8K65l14K52j21j71J55k49M16O9k36K70q4J39j18k53K80N9l20
$$ 130 92 -79 -126 -154 111 -203 49 -72 -243 -88 -337 79 148 -88 182 98 237 119 -134 146 205 -115
1085a15K43l71J69K84k16m2J90k26O4J5l3L45k34O2k61j03L98j30j1k85K64m27
$$ -115 128 -243 -74 210 -6 -48 142 -84 -20 -5 -38 307 73 135 -126 -229 169 39 28 -257 7 -420
1107d20N75q1P8r9j1j43K96J81k93J78k10P9J6k47KL05k59j17J35k38K59r5n3
$$ -420 155 74 152 53 42 -101 195 376 83 261 51 130 146 -101 -99 206 -53 -170 -35 -273 -14 -109 -162
1130a62j7O5L4J55JN3K5k7j16J59n0j39Pj7P3j25J86l53K72Q9k57j41M56J47l11
$$ -162 -179 -114 -80 75 76 129 154 127 11 170 120 -19 -12 -29 44 -81 105 -248 24 113 -144 -285 171 318 7
1155GK21l44J42R0q4J00J68k34J9l61K91J54l44J37j15K03j59j91K11k09O36j62
$$ 7 228 -116 26 116 32 132 300 66 85 -276 15 169 -175 -38 -153 50 -109 -300 -89 -298 338 176
1177A76l06L6L04m39K15J14j60J15k49O1LM13k56k71J82K50k01r4J04Pj73J01
$$ 176 -130 -94 210 -229 -14 100 -60 55 -194 -133 -130 283 27 -244 -62 188 -13 -107 -3 4 -169 -68
1199f8j69L20q2n0O8q0L31k81K49j81P6l46J93j3j4J17j25k6J67mn8r0K21l2n9
$$ -68 -237 83 1 -49 19 -61 270 -11 238 57 133 -213 -20 -33 -47 70 -55 -81 86 82 24 -66 155 123 64
1224F4M0l1j07J7k01K23j02K99l02J27J32k04K70k58j06M6K51K6m8k02R8j99J58
$$ 64 104 73 -34 -17 -218 5 -97 202 -100 27 159 -45 225 -33 -139 -93 158 184 136 -66 32 -167 -9
1247ik42K45O9k58r2M75l01K02J37n4K09o73M71j41j72l76L84J66j62k4K32r1
$$ -9 -251 -6 63 -195 -287 188 -113 89 226 172 381 -292 179 38 -134 -510 -126 40 -122 -146 86 -5
1269eK84n25K78j60R3k4j98N0K16Mk66K80j21M1J86j23J19N0q5J9j92N29l69j78
$$ -5 279 -246 32 -128 -35 -59 -257 -207 9 13 -253 27 -94 -53 133 10 129 179 94 113 -79 450 81 -97
1293i7L61J3m62J41m0j24K40j49j42K2L7J88n5J16J2j09k27K76%l8m0P2N8M6J18
$$ -97 264 277 -185 -44 -84 -208 32 -117 -259 -237 -200 -12 -67 49 61 -48 -275 1 1 -37 -77 -5 53 99 217
1318B17j29o2j27O1m9J1J50J1j3Q1P6l23L47k03O8j65k8K3R4N5r9K9j29R6j47
$$ 217 88 26 -101 -40 -89 -78 72 83 70 151 227 -96 251 48 116 -49 -77 -54 40 95 -4 25 -104 -8 -155
1343a55L44l83K32j58k59K48O6P3J9r4mj8K37n7j71K12j35K83l32J08R4l32J87
$$ -155 189 -194 38 -120 -379 -131 -65 8 27 -67 -71 -89 148 91 -80 132 -3 280 -52 56 150 -182 5
1366EK6j01J22j21L1k3k35L69k39J69O6oK3J31l20O5J77N2j75q2Jj73J87j23J79
$$ 5 31 -70 52 -69 -38 -61 -296 73 -166 3 69 63 86 217 -103 -38 139 191 16 -66 -65 -238 -51 -174 5
1391Ek92K49J98j6o2l8j34J4L07m87J26J34j8Q8O6l55J85J02o1k48M47j66j2o0
$$ 5 -287 -38 160 144 82 44 -90 -76 231 -256 -130 4 -14 74 140 -215 -30 72 11 -237 210 44 32 -28
1415b8J94j53K23l35J12j99N24o23L11Q3j63l1Q3J08j14N7k1Q5k64L86J33k28
$$ -28 166 13 236 -99 13 -186 338 -285 26 109 -54 -85 -2 106 -8 49 28 113 -151 235 368 140
1437A40j42K26k29N1l57L62K81m01l1L50o8k5M5l01L32j89r9O3j04rJ60M6k66
$$ 140 -2 224 -5 46 -311 51 332 -69 -100 250 182 157 202 -99 233 44 -55 8 -96 -105 55 101 -165
1460a65M8K60l33K10j63K94p4n4j9RlQ9q0k12K93l56K39J72l18J58k21L5K15l16
$$ -165 -117 143 -190 20 -143 151 77 23 4 13 10 99 19 -193 100 -256 -17 155 -163 -5 -226 -191 24 -292
1484b92L75K0m2k4LR6j73K70k51l82L81j59K07l37O56l02l3j92j14K67j83J24
$$ -292 83 103 61 37 40 136 -37 233 -18 -400 -19 -178 29 -308 348 46 13 -179 -293 -26 -209 -85
1506h5O2J4j1L9q0L34j56k25K71k09l8n7J87J33l14J55J51j24nK2o7K68k32O2
$$ -85 -23 -9 -20 19 -61 273 117 -108 163 -46 -84 -141 46 179 -135 20 171 47 42 64 -3 265 33 95
1530I5O8J68j63n11K34R4o2N2R5j32K33j96J5M0J32l11O7J96k08J68p3Q9k63L40
$$ 95 163 331 168 -343 -109 -15 -77 -25 70 -62 171 -25 -10 30 162 -149 -82 114 -94 74 1 90 -173 167
1554A67j81J39l60L06P0k01j03N6N1m2J39q7K28m8l81K44l3n2k8K71l27J78P6
$$ 167 -14 125 -235 71 141 -60 -163 -107 -56 -98 41 -46 182 134 -247 -3 -36 -88 -116 155 -172 6 82
1577H2o0j16K2J7J34n2p2J27M1j83L4j6J53k45M6p8M41l77J75p2k23K34j08l0
$$ 82 22 -94 -72 -55 79 27 -45 82 123 -60 -26 -42 111 -134 -88 -166 275 -102 73 1 -222 12 -96 -126
1601a26J5JM1j86J56k1q4N2J79K5J90l95K55p9k40K58j88J88l22L01j38K31O5
$$ -126 -111 -110 -69 -255 -99 -120 -204 -152 27 52 242 -153 102 23 -217 41 -147 41 -281 20 -118 113 178
1624A78J1j0k65M2j77J20K29Q4j71J04J10k41J5N8l12J39M5L6J63o7k89K90M8
$$ 178 189 179 -86 -44 -221 -101 128 212 41 145 255 14 29 87 -225 -86 -41 -5 158 91 -198 92 140
1647A40J18n80N31j80J76m17L22l93L53l7k86K43m8J75j68Q0j36J50j63o1L80
$$ 140 258 -322 209 29 205 -212 110 -283 70 33 -253 -10 -58 117 -51 29 -107 43 -120 -181 199
1668A99K20l98J56r4j55q1K04l5j19J42r2K09k49K41j37n8O2j77J69j3p2K28J52
$$ 199 419 21 177 83 -72 -153 51 16 -103 39 -53 156 -93 148 11 -47 15 -162 7 -6 -78 150 302
1691C02j06l08k00N20l42Q8Q2k6K4nN0J10k16J13l1O6j50K4N5r2o1J09J23j36
$$ 302 196 -112 -312 208 -134 -46 36 10 34 29 79 189 -27 86 55 121 -29 -5 50 -42 -103 6 129 -7
1715gO7j02k61N07k27R5j77N7J5K8k39J3Q8L99l96Q6O50m69m7k51M18k34O4M9
$$ -7 60 -42 -303 204 -23 72 -105 -48 -33 -5 -244 -231 -143 256 -140 -54 596 127 80 -171 247 13 77 126
1739A26j33j15K85k81j07J18P1j57K00j03J86j25OJ7J32l0K43l84K54l67Q7%K8
$$ 126 -7 -122 163 -118 -225 -107 -36 -193 7 -96 90 -35 -29 -12 120 90 333 -51 203 -164 -77 -77 -49
1762d9K78m26J86k6k50K61K6j0p0P9M8J17M9Rk19j74P1P3q0N5L24m18R5K51k60
$$ -49 229 -197 -11 -37 -287 -26 0 -10 -80 -1 47 164 213 222 3 -171 -100 -27 -107 -52 272 -146 -51 200 -60
1787f0M40k67n2Kj59r4K20j05J1j20K9L37L5k26K03l22l7L44l06K57j94N6k57
$$ -60 380 113 61 63 -96 -190 30 -75 -64 -184 -155 182 217 -9 194 -128 -165 179 -127 130 -64 -8 -265
1810b65J93R1N7n7K11j34j82o0J88K8k37L81k48J47j20%l50N19K8j13nr0L8j42
$$ -265 -72 19 76 19 230 96 -86 -146 42 70 -167 214 -34 113 -7 -7 -357 162 190 77 72 -18 20 -122
1834a22K48k99L94m28M06j6j0k27K29J63n20M52l33n7Q5J33j88M1j82L47m00M65
$$ -122 126 -173 221 -207 199 183 173 -54 175 338 -182 270 -63 -120 -35 98 -90 -49 -231 116 -284 181
1856A81m31L7K33l30L62L8L8j4j36L03J6m46J45L78m04k63J15J88m3Q7K1k80K94
$$ 181 -250 -213 20 -310 52 90 128 114 -22 281 297 -149 -4 374 -30 -293 -178 10 -33 54 75 -205 89
1879H9l2j55k53M37j73L65j46k12k5J6L03j21l54L21P1J6k26K40m11K12J21J46
$$ 89 57 -98 -351 86 -87 278 132 -80 -105 -89 214 93 -261 60 131 147 -79 161 -250 -38 83 229
1901B29k23j43K24o1j88R6K64k96k02p4L65q3O2J35j96P7K8m4R7q0k55J22j2K19
$$ 229 6 -137 87 26 -162 -66 198 -98 -300 -374 -9 -92 -30 105 -91 -14 14 -30 67 -13 -268 -146 -158 61
1925F1k50O2p0K17pJ64q2P7k21L0k82L76n73N79j02K85r3k70O6J42l7N9R9l60
$$ 61 -189 -127 -197 20 13 177 95 172 -49 -19 -301 75 -498 81 -21 264 171 -99 -33 109 72 131 230 -130
1949a30NL6K82m37K50O3l9n9r5R4L1K14k59J16j2K0j2o2J3O4O1j27j32K56j89
$$ -130 -125 -89 193 -244 6 69 30 -29 -124 -30 1 215 -44 72 60 80 68 6 19 83 144 17 -115 141 -48
1974d8K37k03J06P7m11N96o31L46r5K58K5l92O0L57l77K61r0j00K04k80K48%j79
$$ -48 189 -14 92 169 -242 354 -277 69 -26 232 257 -135 -75 282 -95 166 76 -24 180 -100 148 148 -31
1997c1K5K4o8r8J1K60j05j57o8K45P1k21K20O9l94R9J1R4jr4J17J42J14l27n4
$$ -31 -6 18 -50 -148 -137 123 18 -139 -207 38 109 -112 108 177 -217 -118 -107 -13 -14 -108 9 151 265 -62 -116
2022a16K26j15r9l9J51m1j49J22j46J30R2q2J25R0j53J23j82J48Lj64L90l74j6
$$ -116 110 -5 -104 -143 8 -33 -182 -60 -206 -76 16 -66 59 149 -4 119 -63 85 88 -76 314 -60 -76
2045g6k7Q6J89l98K04k44K78k03K01P2j14J81m06K62n0m7j16J30J38L4J0o7Pl28
$$ -76 -103 -17 172 -226 -22 -266 12 -191 10 82 -32 149 -257 5 -45 -92 -208 -78 60 94 104 37 44 -284
2069b84J81o4R4j5J62J21p7J08l94oK80j77K80j98m8Lj05j04j5P2K30J1P2j51
$$ -284 -103 -167 -73 -88 74 195 118 226 -168 -174 106 -71 209 11 -37 -34 -139 -243 -258 -186 44 55 127 -24
2093b4K09l45K63k18J52J14l16l1K25j55n3K86k74q3L59M0j69n9m0J46P8j85L40
$$ -24 185 -160 103 -115 37 151 -165 -196 29 -126 -179 107 -167 -250 109 149 -20 -79 -119 27 105 -80 260
2116B60k52j32M04l96j4j49K80r2O4n4RJ9K24j3k21K7M0q6J8l9J2l1MJ76k22L29
$$ 260 8 -124 280 -116 -130 -279 1 -91 -27 -81 -72 -53 171 158 -63 -36 4 -82 -64 -103 -91 -122 -118 58 -164 165
2142A65j84l4J58j80J42o6K76j56M0q4N2k50J87Mj66O5J85r7k0j76PJ42j04L61
$$ 165 -19 -53 105 -75 67 1 277 121 161 77 129 -121 66 70 -96 -31 154 57 37 -139 -132 10 -94 267
2166B67l79L17k35P9k53J49R2p9J22n8j44j66L14k49M53j87j80J3n2J8K47K9j00
$$ 267 -112 205 -30 49 -204 -55 37 -42 80 22 -122 -288 26 -223 230 43 -137 -124 -176 -158 89 118 18
2189A8K23k59q2J41J52k67j84K68K89l71J80k60M4M6J11J41j32K22j96R0k46J33
$$ 18 241 -18 -100 41 193 -74 -258 10 299 -72 108 -152 -108 -62 49 190 58 280 84 174 -72 61
2211F1J25j90m0n0Lj06J35L23l38J14k76L27j08L23m38R9r9L3L00j64m3r5J83
$$ 61 186 -4 -44 -94 -91 -197 -62 261 -77 37 -239 88 -20 303 -135 -36 -135 -102 198 34 -9 -104 79
2234G9l50O00m63O8L37k27J07k49J47k58L72Kk66j04M48j00p3j14K44l00L12l53
$$ 79 -271 329 -134 -66 271 44 151 -98 49 -209 163 165 -101 -205 243 143 70 -44 200 -100 212 -141
2256a41K48r7O3o0M2JO2j09k25J27K5K7LQ7J81Q4o23L37p1O8K34j59k35J00rj46
$$ -141 107 10 73 13 55 56 118 9 -216 -89 -64 -37 -34 53 234 318 -305 32 -39 29 263 104 -131 -31 -40 -186
2282a86K09k58K20K4l2J42j66j06K22q4K53k18K5l40K85J95l29K51j62N7l13L84
$$ -186 23 -235 -15 9 -23 119 -47 -153 69 -15 238 20 45 -295 -10 185 -144 107 -55 2 -311 73
2304G3o8k18K99k70L03J13m06j00K91p6J51j20K0J13j56j4J54J8m17O28k79M7
$$ 73 5 -213 86 -184 119 232 -174 -274 17 -59 92 -28 -8 105 -51 -65 89 107 -310 318 39 86
2326H6j65J60k7M5j15J01P5l39J65l0m5k0J32j15K7M1o0N7mK47m41J53N0k6J35
$$ 86 -79 81 54 99 -16 85 160 -179 -14 -44 -89 -109 23 -92 -65 -24 -84 -27 -31 216 -225 -72 -22 -48 87
2351H7J38m75N3L49j60k3J23J4j84J48N6o5K51mk59o1l3K65k10j09J96J28k11
$$ 87 225 -250 -197 152 -8 -31 92 106 -78 70 126 61 312 308 49 -12 -45 220 10 -99 97 225 14
2374A4j72R5K39j05k17M88n22K44J39m28L46J1l70J80l1Q9Q9j99K14j51RJ88n5
$$ 14 -158 -63 176 71 -146 342 -180 64 203 -225 121 132 -238 -58 -89 0 89 -110 104 -47 -38 150 95
2397I5J52o20L47R2K08l61K29l9k26o0K24J21j10L6L7J3j98O8K98j62l22J30L9
$$ 95 247 -373 -26 66 274 -87 142 103 -123 -183 41 162 52 88 125 138 -60 8 306 144 -178 -48 -9
2420ij03J45J31j53j4J69k51M1L6K40k66j42L45j84o2J17l4k14R9J96K6o5j06
$$ -9 -112 33 164 11 -3 166 -85 -44 -8 232 -34 -176 169 -15 -77 40 6 -208 -109 87 113 48 -58
2443e8q6K01k29L45M1j84K3L6q3J28j02k69J69J48M0l4j04J28k12K47k13ON4o3
$$ -58 -144 57 -172 173 214 30 53 89 6 134 32 -237 -68 80 120 86 -18 110 -102 145 -68 -62 -8 -71
2467g1K41o4K34p7j36l31K86j7k36J92R9m6j67j67L95l18K69o3k6j08K18j16J50
$$ -71 170 106 340 263 127 -204 82 65 -171 21 120 74 -93 -260 135 -183 86 23 -3 -111 107 -9 141
2490A41K00m25J65l2Q2o5q6J32l8P0o7n9k27K55l7K24j69k45L37j56J65m7M4k78
$$ 141 341 -84 81 49 131 66 -20 112 74 144 77 18 -209 46 9 233 64 -181 156 0 165 118 162 -116
2514a16J38j18K79R7j09o4R2k31p7K01l17K30J26m0p1k91L00K15j77j41K2N9K59
$$ -116 22 -96 183 280 171 107 199 -32 -109 92 -225 5 131 91 20 -271 29 244 67 -74 -52 7 266
2537B66k45m8M5J5m0n7K05O2j85M1M3J84n1k08k23L3M20l30JJ46k28L11r2j12
$$ 266 21 -27 18 33 -7 -64 141 203 18 59 102 286 235 27 -196 -163 257 -73 -72 74 -154 157 65 -47
2561d7M4l19L51m4p1J37j68J79m85O22q9j85p0r8K75j97N9J54Q6k86J69J18j16
$$ -47 -3 -322 29 -15 -86 51 -117 62 -423 199 110 -75 -145 -243 32 -165 -106 48 134 -152 17 135 19
2584A9PJ33l7k31L5R9O2k30j48L61mj36J58l07K85M6p1Q8j09J67l03L9M5mj20
$$ 19 26 159 122 -109 -74 25 87 -143 -291 70 66 -70 88 -219 66 112 41 129 20 187 -116 -77 -32 -36 -156
2609a56J86J15j99K26O4k54j69L2K86j00MK07m80K64r0K7M3J97j95p8J59J07j37
$$ -156 30 145 -54 172 236 -18 -187 -155 131 31 35 242 -238 26 -64 -37 6 203 8 -70 89 196 59
2632E9j55J4J44Q7j12Nk0o3L34k88N7o5K43j75K5o6K43k34j93K07k2j99N7o2K57
$$ 59 -96 -82 62 149 37 42 22 -41 293 5 62 -3 240 65 90 24 267 33 -160 47 25 -174 -117 -179 78
2657G8r7P8l3J90jj77P2J27k61J68l08L16k59K39k71J96k8j39K59n6M8j60m9K79
$$ 78 -19 59 26 216 215 38 110 237 -24 144 -164 152 -107 132 -139 57 29 -110 149 93 141 -19 -68 211
2681B11l56N0J71j61K21j8qN6m3J20n68K65R8k20K41Rrj5n7K27m08K93j63P3q8
$$ 211 -145 -95 76 -85 136 118 110 166 123 243 -325 -60 38 -182 59 68 59 44 -13 214 -194 99 -64 9 -79
2706g9j78qNN62k65l5Pk02M30Nk09J55k03J05l87L43r5j05O8J01J41k79K02r9
$$ -79 -257 -265 -260 302 37 2 9 -193 237 242 33 188 -15 90 -297 46 -49 -154 -86 15 156 -123 79 -20
2730b0K36q8l6k70K04J71l84K67j84J73j10k6rj81K03J44j96J29n1L5j68R3K47
$$ -20 216 128 92 -178 26 197 -187 80 -104 69 -41 -67 -76 -257 -54 90 -106 23 -28 7 -161 -68 179
2753A79l9m3j22O5j65l6J84M5K1j55k6R9K40m26J52P7l0q6J32J3l75M61j46k71
$$ 179 140 97 -25 40 -125 -161 23 68 89 -66 -92 7 247 -179 -27 50 20 -66 66 79 -296 165 19 -252
2777b52l3M16k04J28j72J00J31j49j17j2K63N6k20J92k90J69j32J34RQ7L2m71
$$ -252 -285 131 -73 55 -117 -17 114 -35 -152 -164 99 155 -65 127 -163 6 -126 8 17 104 136 -335
2799c35M02Kn8j5j48M14k28J73n21L07%j21K15j7M7l25K08j4M54k66N6j90k00
$$ -335 67 69 11 -4 -152 262 34 207 -314 -7 -7 -128 87 70 117 -208 0 -14 440 174 230 40 -160
2822a60M02o3j86o6q3M2K03j15r4o5MM50l33L5J9N8K24l46m7K2J60q2Q7k01j35
$$ -160 242 179 -7 -73 -156 -114 89 -26 -120 -185 -181 269 -64 -29 -10 48 272 -74 -121 -99 61 -21 66 -135 -270
2847b70M60l56K46k81L49j80r0R3j90J45qJ10k50L40j07p7O3q1NpL95l02QL46
$$ -270 190 -166 80 -201 148 -32 -122 -29 -219 -74 -82 28 -222 118 11 -66 -3 -84 -79 -86 309 7 15 361
2871C61j24j95O3k88O2l3J26o4M26n24J35L08n14L97j77O5p8J26j34J53l25M6
$$ 361 237 42 105 -183 -121 -154 -28 -92 334 -190 -55 253 -261 136 -41 24 -54 72 -62 91 -234 -188
2893a88J02K01j29j37J70J8j10l5Mn2K25N9K6l60J16J72l20M46j86J97k53K30
$$ -188 -86 115 -14 -151 19 37 -73 -108 -104 -156 69 128 154 -206 -90 82 -238 208 22 219 -34 196
2915A96K2q2j40k65L85o2M3k12k17K50J4O3L16j61j65l4K34k79J23l38L54J36
$$ 196 218 136 -4 -269 116 54 97 -115 -332 -82 -68 -5 311 150 -15 -49 185 -94 29 -309 45 181
2937A81l90N2P4K97n0k50K6L8k65J50J56j60K62k30Q0Q9j08O9K2j9l10M08j86
$$ 181 -209 -157 -83 214 164 -86 -60 -22 -287 -137 19 -141 121 -109 -29 60 -48 21 43 24 -286 122 -64
2960f4K11j68Q0k82j6L07Q6l88M16k37J21j54l1j19L13r9k23M47k33m8J82J2M4
$$ -64 147 -21 59 -223 -239 68 154 -234 182 -55 66 -88 -119 -238 75 -24 -247 200 -33 -81 101 113 157
2983A57l45J6L86j41r3J70j69j69P9K0O1K9pQ7m9j79L35m4K7Q3P7l85J37N6j01
$$ 157 -188 -172 214 73 -20 150 -19 -188 -109 -89 -28 1 -6 81 32 -147 188 144 171 254 331 -54 83 139 38
3008C8P1q5K13k45J38j64R3j74k6K35l70M81k38K53j10k25K46l01P3K06j93q6
$$ 38 109 24 237 -8 130 -34 59 -115 -141 94 -276 205 -33 220 110 -115 131 -170 -97 109 -84 -170
3030a70M3M1K53j26k68M36m09L8J48J89k42j9L91n95R0J69j90P0r3L03J03l98
$$ -170 -127 -86 167 41 -227 209 -200 -162 -14 175 -67 -86 305 -290 -200 -31 -221 -151 -244 59 162 -236
3052b36P4r2L72o8j40K66J6k87j1N7J47k81J18j14L2K35j77P5n0k3k01M35J30
$$ -236 -162 -254 118 50 -90 176 192 -95 -106 -49 98 -183 -65 -179 -147 88 -89 -14 -64 -87 -288 147 277
3075B77m64K79l5J12j08j49K32j69J30j45n7L8K80m10K34M9k84L14l03Q2J60k00
$$ 277 -187 92 57 169 61 -88 144 -25 105 -40 -97 -59 221 -189 45 94 -190 124 -179 -97 63 -137
3097a37j1L02m0j99M38j60k29P4L1m0kJ23k0j72J35K3k76L90l81KK33J81l77M2
$$ -137 -148 154 114 -85 353 193 -36 38 69 29 27 150 130 -42 93 116 -160 230 -151 -149 84 265 -112 -70
3121g0K48k72J28k94M97l14N5Q5j06O6l20M00p4k77j09L26J66L7r3k15L39n7j63
$$ -70 178 -94 34 -260 237 -77 -22 63 -43 23 -297 103 29 -248 -357 -31 135 172 79 -136 203 146 -17
3144a7j68O2K26o2Q5k02k1J01j47L25k25k32L28j3K2j00nj7j5J42j77Rr9J79N0
$$ -17 -185 -123 103 41 126 -76 -97 4 -143 182 -43 -275 53 40 62 -38 -43 -60 -75 67 -110 -101 -200 -21 29
3169B9j1l4j82K04j80J50j5J69j7q7J04j79M8j46M24l90K81o2l00L01O1k06JJ77
$$ 29 18 -16 -198 6 -174 -24 -39 130 113 26 130 -49 -1 -147 277 -113 168 106 -194 107 168 -38 -37 140
3193A40K13l59P2n8O5j74kK78k57O9k30L37k06P2L95k59O7l8k46J31R9k37j77
$$ 140 353 -6 66 8 73 -101 -103 175 -82 -13 -243 94 -112 -40 355 96 163 125 -121 10 109 -128 -305
3216c05L16J22k40K54q0k48J45k45J82J40K27m45K23k12L55p4m11J00J40o5J90
$$ -305 11 133 -107 147 67 -181 -36 -281 -99 41 268 -177 46 -166 189 115 -296 -196 -56 -121 69
3237F9k02J41k48P4M94l97J00J03j4k94J54K22k05l4Q6o1M7N9k93J75J60l10R4
$$ 69 -133 8 -240 -166 328 -69 31 134 120 -174 -20 202 -3 -37 49 -12 35 94 -199 -24 136 -174 -80
3260h0L24n87M58j38j13qM50k23j77K07k80l8K25k00N3P1J44j59j4J15k60L28
$$ -80 244 -343 115 -23 -136 -144 306 83 -94 113 -167 -205 20 -180 -127 -56 88 -71 -85 30 -230 98
3282I8J29k42Q1j17J30j15J68L3n5k96l7J88q2K51N4j23%k71J17K39j13J04l62
$$ 98 227 -15 66 -51 79 -36 132 165 110 -186 -223 -35 -117 134 188 65 65 -206 -89 150 37 141 -221
3305b21N51l16j97L58m97L25L59k9m51K43K9N3j73k85L25J25Oq5l27j53N93k20
$$ -221 330 14 -183 175 -322 3 362 333 -118 125 154 207 34 -251 74 199 205 120 -207 -360 233 13
3327A3r9J48J9j17P4j14o1J43M40m23j50O8N6j22Q7J01j20k1r2K08L2j54J17j2
$$ 13 -86 62 81 -36 38 -76 -137 6 446 23 -127 -59 -3 -125 -38 63 -57 -78 -170 38 70 -84 33 21
3351B1j07R1j70q4M6M15l19j3O8j00l8K78q2n1K0j50K39q9k8K21j43L21m14J52
$$ 21 -86 5 -165 -249 -203 212 -107 -120 -52 -152 -190 88 6 -45 -25 -175 64 -25 -53 168 25 346 -68 84
3375H4q4M9k42L04p0j70J67k4k62M99k61J08Qm8m3O4k95L30Pp7p9m3k4J74K0L8
$$ 84 0 49 -193 111 41 -129 38 14 -248 251 -10 98 106 58 15 79 -216 114 121 44 -35 -78 -102 72 92 130
3401A30j17l5j09N8R6k9Q3l41K48P3o0J07l25J91N4k01K80j49P2N9q3N1J12N4
$$ 130 13 -22 -131 -73 23 -6 77 -264 -16 57 -3 104 -221 -30 24 -177 103 -46 26 85 2 53 165 219
3425B19p7l66K47L6n6p7q9K03L1jj0n1m9M5o5Nj30J84J38k30J06l21L19o4J02
$$ 219 142 -224 23 59 3 -74 -163 40 71 70 60 9 -40 5 -60 -55 -185 -1 137 -93 13 -308 11 -53 49
3450D9R2k83j7N9m4J42j2k27R6q9M50l20J08Q3j91J03j27J94Q7k00j86Q5j40K51
$$ 49 141 -142 -159 -100 -144 -2 -14 -241 -145 -234 216 -104 4 87 -104 -1 -128 66 153 -47 -233 -148 -288 -37
3474c7j92M18p1J46l59K57k65j17L23j37K30j51j1q7o3J94K02k20k08M4J36o4
$$ -37 -229 189 118 264 -95 162 -103 -220 103 -34 196 45 34 -53 -116 78 280 60 -148 -104 32 -32
3496c2l4J97k83k8J77q2J54j38J27q4n5O8j17R6mm7n0M7oJ04J5J80j54K02m91
$$ -32 -66 131 -152 -180 -3 -85 69 -69 58 -26 -81 -13 -130 -34 -38 -85 -135 -88 -94 10 25 205 51 253 -238
3521b38K98j70J83K0k83k5L35N2n6j55q9J3pj05J51J86q6Q4p9O9k09K21r6P7P4
$$ -238 60 -110 73 93 -190 -215 120 172 116 -39 -128 -115 -122 -227 -76 110 24 108 29 98 -111 110 14 91 165
3546A65lj83J12k03J87J59j66J29o3j68K18k94K25k99J64J7j71K45M4K27n46L29
$$ 165 162 -21 91 -112 75 234 68 197 134 -34 184 -110 115 -184 -20 -3 -174 71 115 342 -204 125
3568A25j3k32J72j29Qk5L61j70J18k52J92Nk12q6K85j03k00k5KK53N4l54M8J93
$$ 125 112 -120 52 -77 -69 -94 267 97 215 -37 155 160 -52 -138 147 44 -156 -181 -179 74 128 -226 -178 15
3592A5j37M14k98J87r9k5j75L6J52ol11K90J96l48j27M95m4j87k34K53k3k77L85
$$ 15 -122 292 -6 181 82 57 -118 -82 70 64 -247 43 239 -109 -236 259 215 28 -206 47 24 -253 132
3615A32k27J05J53j91J10j66K27m80N56m03J60m9O1L04l27M8j75K38j18J69n6
$$ 132 -95 10 163 -28 82 -84 143 -337 219 -184 -24 -73 -12 292 -35 13 -162 76 -42 127 71
3636G1o4k57L37J98j3k79j9J5j05J37jk15J54R6L5l44L07j15j39o4K61K03k10
$$ 71 7 -250 87 285 272 -7 -26 -11 -116 21 20 -195 -41 55 90 -254 53 -62 -201 -265 -4 199 -11
3659a1qM0j49j7J83Qj63L08mj79J04k07J65k23P9r2L83l34k3K7K79j2j62%l5J19
$$ -11 -19 21 -128 -145 38 46 -117 191 187 8 112 -95 70 -153 -74 -166 217 -117 -140 -113 166 154 -8 -8 -43 76
3685G6j78K18J21l81K18j70k49J31M07m02R9J62j5K7l97M46q5k61O3J32Q0j0J78
$$ 76 -102 116 237 -144 74 -96 -345 -214 193 -209 -110 52 37 64 -333 113 28 -233 -170 -38 42 32 210
3708B10l6K43m79M4L74m69J16j88K52k08l1L41j04J83k47j98J32p9J27m9P9K25
$$ 210 174 417 -62 -18 356 -113 3 -185 67 -141 -172 169 65 248 1 -197 -65 -144 -17 -66 13 238
3730B38l96L00j56K6K08k71Pm6M27l40L1M5L0j63r9N9K0n2J47J32m68L00m6R3
$$ 238 -158 142 -14 12 220 -51 -44 -90 337 -3 28 73 103 -60 -159 -100 -80 -132 15 147 -321 -21 -67 26
3754B6Po9j75L13m6K61k35j1j2J37j77j82J09L75n26L41l70P2Q3n4J57K6J46j65
$$ 26 33 -36 -211 102 56 317 82 71 59 196 19 -163 -54 321 -205 136 -234 -162 -79 -133 24 50 196 31
3778C1k31K65k20K53j99K5K01L8j13L7N4j65L31k84k48L83k02M4R6m5OJ08L9k68
$$ 31 -200 65 -155 98 -101 -76 125 163 50 87 141 -24 307 23 -225 158 -44 0 96 51 57 165 204 -64
3802f4K59l10N9j9J14j17P5j17P5k7j28K56k32m7L44j0k88J11NJ37j64J26J28
$$ -64 195 -115 -56 -75 39 -78 -3 -120 -45 -72 -200 56 -176 -223 121 111 -177 -66 -61 76 -88 38 166
3825A66m29L44R8l09J81j43M4j6K43j94J35N3l02J19P7q4J05j09M6m45N31J91
$$ 166 -263 81 179 -130 51 -92 -48 -64 179 -15 120 173 -129 -10 67 -17 88 -21 25 -420 111 302
3847C02o02P0J00K79Ok83K99m3l23K33j05O6L1K45k39L9k22K02N1j17j04L01j93
$$ 302 -300 -230 -130 149 155 -128 171 128 -195 38 -67 -1 30 275 36 75 -147 55 106 -11 -115 186 -7
3870gJ8m0LK88k72K63k10k6k1r9l6K48k33L48n1j27L67m96K63l91J36J01k06J97
$$ -7 11 -29 -26 262 -10 253 43 17 -4 -103 -139 109 -124 224 173 46 413 -83 180 -211 -75 26 -180 17
3894A7J16n9J28j99O9j48L39l50K60k73k0J5L05j81J80m23L39j12J0K69l55M1
$$ 17 133 74 202 3 72 -76 263 -87 173 -100 -120 -105 200 19 199 -224 115 3 13 282 -73 -32
3916c2K1N0K3N2Rj42N4J56K8k65J42Q4j43l8J77k01j12L73J9Ql14K0k8j87M27
$$ -32 -11 39 62 114 123 -19 35 191 219 -46 96 180 37 -1 176 -25 -137 236 255 263 -51 -31 -59 -246 181
3941A81o2l21J06J07n8j37L05j03J48j98j60J01K1M9K13l37J21J0rl5L37j44j24
$$ 181 119 -202 -96 11 -47 -184 121 18 166 -32 -192 -91 -70 -21 192 -145 -24 -14 -23 -58 279 135 11
3964A1m3pJ83k24P3j59L53l72K36j39j26J71P2j7O3j65L1J47J1o5k31N30m26j06
$$ 11 -32 -39 144 -80 -7 -166 187 -185 51 -88 -214 -43 29 12 75 -90 -59 88 99 34 -197 333 -93 -199
3988a99L06j77J25k40K21j31o4K25o4k4lj45J97j13L6J93p4J0k33J83J9k51J13
$$ -199 107 -70 55 -185 36 -95 -159 66 2 -22 -25 -170 27 -86 -50 143 69 79 -154 29 48 -203 -90
4011i0J36k27L27k8J58j75p9J4q5nO0j98J59R3k45K32J40j57r0K06j89j77J99
$$ -90 46 -181 146 118 276 101 22 36 -49 -54 6 -192 -33 60 -185 47 187 30 -60 146 -43 -220 -21
4034b1J27R1j89k42l8K61o2J12j8J50mj09n26N76L4J32j41k33O4j35J96n6L81
$$ -21 106 197 8 -234 -272 -11 -73 39 21 171 167 58 -468 108 142 274 133 -100 -36 -171 25 -31 350
4057C50o15K15J4n1N8k06P5Q3J04k7oq5r9L8M20l71j44L2L61j13Q3k01L0r4K6
$$ 350 -265 -50 -36 -87 -29 -235 -160 -77 27 0 -6 -91 -190 -152 268 -103 -247 -215 146 33 116 -85 -55 -149 -123
4082a23L50m66L17l19K99j4L4k93K28k6K90l57k32O89l53n1J02n6J96l73L21k20
$$ -123 227 -239 78 -241 58 44 78 -215 13 -13 277 -80 -312 377 24 -27 75 19 215 -158 163 -57
4104e7L98k18k11J66n4n6P5k00J56K10j49j50j21K17J18k1J27k05k1K15J8k87
$$ -57 341 123 -88 78 24 -32 43 -157 -1 209 60 -90 -211 6 124 103 230 25 4 219 237 -50
4126e0n7J93j5j73k57KJ13J8M09n7j41j06O1ljj28L53j34J36k12M7k27L64j41
$$ -50 -107 86 71 -102 -359 -357 -244 -226 183 126 -15 -121 -60 -63 -64 -192 161 27 163 -49 -2 -229 135 -6
4150fJ13j54m3M8p8l5NL73k62m4J31M8l35J71L45o8j31K39k38J0j38j44K84j67
$$ -6 107 -47 -90 -42 -120 -155 -150 223 -39 -83 48 96 -239 -68 277 209 78 317 79 89 -49 -193 91 -76
4174g6O1nL35j13l39M4J50%j96J32k63M80m03K96j55R4o6O0j60K09j12J75O8j46
$$ -76 -15 -20 315 202 -137 -93 57 57 -139 -7 -270 210 -193 103 -52 42 -24 36 -124 85 -27 148 216 70
4198G0q3n58O05k36K08J20J53o00L24o4o8q1L93n5j76J64n6n1K49l34P9J86R6
$$ 70 -13 -571 34 -202 6 126 279 -321 3 -61 -129 -210 183 128 -48 116 60 9 258 -76 3 189 285
4221B85j42m02K02M6L22m09O4j67N41k08k38J36M4j91N39n51J50j48Nj4L19j37
$$ 285 143 -259 -57 -11 311 -98 -34 -201 340 132 -106 30 74 -117 422 -129 21 -127 -122 -136 183 46
4243D6n7Q9m4J25k65J32q3J67k57J74m3j87K25q8J19lq3NJ95j50j26J37j72L05
$$ 46 -11 78 34 159 -106 26 -57 110 -147 27 -16 -203 22 -66 53 50 -33 -28 167 17 -109 28 -144 161
4267A61m39L31J05l22J24K46P4k98R%K86j70N4m48L54l15L22j82l3J51J11k06
$$ 161 -278 53 158 -164 -40 206 280 -18 -9 -9 277 107 161 -287 67 -248 74 -108 -141 10 121 -85
4289h5j34L02j63m1K3L31k35J41j25J07o4q7j49M71l88K19q2p8J60R9l76J19K00
$$ -85 -219 83 -80 -121 -98 233 -2 139 14 121 57 -30 -179 292 -96 123 41 -37 123 222 -154 -35 165
4312A65k99K35j88O0Q2k02K11L7k08J58j06J22j4q7M5r4j41L75Rj84J59n7k70
$$ 165 -134 101 -87 -27 55 -147 64 101 -107 51 -55 67 53 -34 11 -83 -224 151 160 -24 135 78 -192
4335a92K81j37R5n2K70k98o8k4R8K4K21k57J46N2M5j22j99J5K03j1PJ11m91K50
$$ -192 89 -48 47 -5 265 -33 -101 -125 -27 -3 218 -39 107 159 204 82 -117 -102 101 90 97 208 -283 -33
4359c3lJ11J38l11K98m0k06Oj3k46Q1J76j15L20n51L44L3K43l8K1l34Q1j89M08
$$ -33 -36 75 213 -98 200 160 -46 -40 -53 -299 -218 -42 -157 163 -388 -44 -11 232 194 215 -119 -38 -227 181
4383A81l41J41K9K18k97J72J84n47L10p1j23O1n2L08j57k4J9j0K23n3k20L6oq3
$$ 181 -160 -19 10 228 -69 103 287 -260 50 -21 -144 -83 -135 173 16 -8 11 1 224 171 -49 -13 -19 -102
4407a02q1J45K66l09K3Q9o8n8j8M7k9j87M40o7j0j29K09Lk89K6K90k75J62m26
$$ -102 -183 -38 228 -81 -58 31 -37 -95 -113 -66 -95 -282 158 91 81 -48 161 164 -125 -99 191 -84 78 -348
4431c48M75m17L06K05k22l68K99J07j69J88n3j74rK08k5N8k8R4j57J7jJ27j52
$$ -348 127 -290 16 221 -1 -369 -70 37 -132 56 3 -171 -180 28 3 61 33 127 -30 -13 -14 113 -39
4454c9J24j72j34J99M2j88L05j42K06k18J04O9k61J36K20k80KJ57k19K00j53K08
$$ -39 85 -87 -221 -22 20 -168 137 -5 201 -17 87 156 -105 31 251 -29 -27 130 -89 111 -42 166
4476A66m61L39P2j60J11j15l19N73j23j49J6J30qo1J59l63N24n91K02o6l7L11
$$ 166 -295 44 116 -44 67 -48 -367 206 83 -66 -50 80 72 11 170 -193 331 -260 -58 -124 -161 150
4498A50j64nM0j8n3J55l0j26L68j17j96P2j40q1K06j47n7N1N7l6L40l65J93n7
$$ 150 -14 -19 21 3 -50 105 75 -51 317 200 4 76 -64 -145 61 -86 -143 -92 -35 -71 269 -96 97 40
4522D0k25l7K26J54pk54L9p1J64j00J47J02j84J23q0j1MPk5J0%j91K9J94j68O9
$$ 40 -185 -222 4 158 151 -103 -64 -135 29 -71 76 178 -6 117 37 26 30 37 12 22 22 -169 -140 54 -114 -45
4548d5lR7k16N36l61o6J46j3o4M1j61J25p7L70m41K73o5j14L33m51K2J20L8j25
$$ -45 -48 49 -167 369 8 -58 88 75 11 52 -109 16 -61 309 -132 141 76 -38 295 -156 -134 -14 24 -101
4572a01o2Q7J21k76J36k13J76J06k1M0N9L2J26k90N7O0J5L2O1L8j09k49K30%j01
$$ -101 -163 -76 45 -231 -95 -308 -132 -26 -47 -7 52 84 210 -80 -23 37 52 84 145 183 74 -175 55 55 -46
4597d6K65k95j65K29R2j82l7L42l10J00J2k60K14J72k16p1L52j73J9k80j02K85
$$ -46 219 -76 -241 -12 80 -102 -139 203 -107 -7 5 -255 -41 131 -85 -156 196 23 42 -238 -340 -55
4619e5J08N3k05L58r7l97%J85j18L26k07L06k75M2J0j44K87l60O6k5O1K3J79p8
$$ -55 53 106 -99 259 162 -235 -235 -50 -168 158 -49 257 -18 24 34 -110 177 -183 -117 -142 -81 -58 121 43
4643D3Rj31R6K26n38K49or6K73j07K04k55j08j09M60l32K09j92M1J02k78K87J9
$$ 43 52 -79 17 243 -295 -46 -52 -148 125 18 222 -33 -141 -250 210 -122 87 -105 -64 38 -240 47 66
4666F6k60L65n1Ok86J60n2J25r7K82k07J5j44J0r7L21k92N2J01j08P0J22o9j6
$$ 66 -194 171 120 126 -160 0 -52 73 -24 258 51 66 -78 -68 -165 156 -136 -84 17 -91 -21 101 32 16
4690A6K10l2k39mM06m23J46K82m57R2k4Q8j0O9j05p1R9Q7m24oK63J20M6j16k4
$$ 16 226 194 -45 -49 357 -66 80 362 -95 -3 -27 61 51 120 15 -56 43 130 -294 -300 -37 83 129 13 -11
4715a1P5j29r3L03j77K42k73K73k82J11K2J8R4k22N1j00Q9Q8P0k81K94m3J79j95
$$ -11 64 -65 -158 145 -32 210 -63 210 -72 39 61 79 173 -49 2 -98 -9 79 149 -132 162 119 298 103
4739A03l8o2Q7o8j86K82j68Nj5o0J90j13j58J48J68J46l24J19r9K39p7m31L39
$$ 103 65 3 90 22 -164 118 -50 -45 -60 -120 70 -43 -201 -53 115 261 -63 56 -43 196 119 -312 27
4762B7M5n7q8P2K8Q1O4j22Jj1j45j72L06J13l1p1M8mk53K59j31J53k01J79k08
$$ 27 72 15 -73 -1 27 108 172 50 51 40 -105 -277 29 142 111 40 88 84 -169 90 -41 112 -89 90 -118
4787a18K17J80l18J36j21Q6k4K18l01M3l0L8J02O6k52J19m2P3p2j28L0q3K27j15
$$ -118 99 279 -39 97 -24 62 38 256 -45 -2 -32 6 108 174 -78 41 -1 72 0 -128 -98 -181 46 -69
4811f9J3j09MJ23Q7k30N9K68k42R5K03%k19j25J36R7k53r4N29m79K68j54J04O5
$$ -69 -56 -165 -161 -38 49 -181 -122 146 -96 -1 202 202 -17 -142 -6 91 -162 -256 273 -206 62 -92 12 77
4835G7r6K80j07o9k61oK43q2J72o3k64P2jL38j52J72m93J29L19j90N0N3j22Qk64
$$ 77 -19 261 154 85 -176 -182 61 -21 151 88 -176 -104 -105 233 81 253 -240 -111 208 18 68 121 -1 7 -257
4860b57K27R2Q7j93J28o5R3n6P9P8m48M23j92j87M77l42J55o2l3r8J90q4o2k67
$$ -257 -30 62 149 -44 84 19 112 56 135 213 -235 188 -4 -191 286 -56 99 37 4 -94 96 12 -50 -317
4884c17Q19n45j77J88p8j2K97j83j71k9J58J05j1O7J37k01q1O2j96K00L5rq1J27
$$ -317 502 -43 -220 -32 -110 -122 175 -8 -179 -208 -50 55 44 111 248 47 -34 28 -168 32 67 58 -23 104
4908A04k52J37j37J89J43j73N3N5j11n5pK96k8j80j5pk07L45J45j61L2l71J66
$$ 104 -148 -11 -148 41 184 11 64 119 8 -47 -54 242 214 34 19 12 -195 150 295 134 166 -205 -39
4931c9K85j86r6n3J32j03N5P8k33L10l20J70k96L67m09J46N6K71j78j0J19M2J53
$$ -39 246 60 -36 -89 43 -60 -5 73 -160 150 -170 0 -296 71 -338 -192 -136 135 -43 -53 66 108 261
4954B61j62M2k25M0l31J00K89k63L08l1j33K44j52M4o7o0M0j10L50P9k61K66j45
$$ 261 99 141 -84 -44 -375 -275 14 -249 59 28 -105 139 -13 31 -36 -96 -56 -166 184 263 2 268 123
4977A23m6k99K52J30j8j89o5R2j80L90j12k99L07j39J46j52j8J11J27o4k58l8
$$ 123 77 -222 30 160 142 -47 -112 -20 -200 190 78 -221 86 -53 93 -59 -77 34 161 97 -161 -199
4999a99L77p7j28R9k46J21J35J14j73j82K92l85K68K6k21J90J5j30oM4K24p8k3
$$ -199 178 101 -27 72 -174 -53 82 196 23 -159 133 -252 16 42 -179 11 26 -104 -110 -66 158 80 57
5022E7j40L33l38J80j04J11k14k04M14K43l19J1K31k26q1K34M8m96K86k44K0L51
$$ 57 -83 250 -88 92 -12 99 -115 -319 95 338 19 30 261 35 -46 188 236 -260 26 -218 -198 153
5044A53Kj08J29J45m94J71m6P5r3Q4KK0j73J15m7r7K52j45OK47o4j85J34K0L01
$$ 153 155 47 176 321 -173 -2 -48 27 -66 18 20 40 -133 -18 -65 -162 90 -55 -49 198 134 -51 83 103 404
5069D04n13L86l72k5L0K5J50l31L75n1Q6j77n9K11K0j05P2N2q7P0k20P9o5J05
$$ 404 -109 277 -95 -120 -90 -65 85 -246 129 78 164 -13 -72 139 159 54 126 178 91 161 -59 20 -45 60
5093F0n3n1K5q7J55k28J40M3K0N0O9k28K02l6j8k8K4o9j54J89M1m52M56J5j15
$$ 60 7 -44 -19 -106 49 -179 -39 4 24 74 143 -85 117 81 63 35 59 -10 -164 25 66 -386 70 85 -30
5118c0j94K16j53K82j73l2j39L88j92P5Q9k02l0J14J5n2q1J84j44q3J2J65R5j83
$$ -30 -224 -8 -161 121 -52 -84 -223 165 -27 48 137 -65 -95 19 34 -18 -99 85 -59 -142 -130 35 130 -53
5142e3M4J42J5k65J67K7L58k57l04Q1J70j36k35L12k48L36l24L6k7J6J47q6Q0
$$ -53 -9 133 148 -117 50 77 435 178 -126 -45 125 -11 -246 66 -182 154 -170 -134 -161 -145 2 -84 -4
5165dn1J10k6j10L74m71J97k17j10L89j78M1r1j24K56k21K50m7J08J22o1k81M5
$$ -4 -55 55 29 -81 293 -178 19 -198 -308 81 -97 -56 -147 -271 -15 -236 14 -33 75 197 136 -145 -100
5188a00L42k78K30j22r3j82K5K7K63J1j91l5J84nP7j76p2O2J13j0k3K7k46K7k6
$$ -100 242 -36 194 72 -21 -203 -178 -151 112 123 -68 -103 81 76 153 -23 -95 -33 80 70 47 74 -172 -145 -171
5213a71M00M6j97l57M26r3j62K38P1m54L73j15j44k0l18N74K15l29K95k55j76
$$ -171 229 275 78 -279 147 54 -108 130 201 -253 120 5 -139 -159 -477 97 312 -17 278 23 -153
5234a53N7J69j60m7K91m20K32j88N4J86j22J8m0O4J36n2j07j05L78l39J75o2m9
$$ -153 -96 73 -87 -134 157 -263 -31 -219 -165 21 -101 -83 -123 -59 77 25 -82 -187 191 -148 27 -35 -84
5257h4J45j41K0J66QJ62k58p8j72M21j63O8j09j95L1J75m1N4q1O0M1l1O4j79J
$$ -84 61 -80 -60 106 114 276 18 -60 -232 189 26 94 -15 -210 -179 -4 -45 9 -72 -12 29 -2 62 -117 -116
5282a16J93k17J92j34L3K05j81k08O9M02l1j52J13l47K50k36K05k0K5J8j41q3
$$ -116 77 -140 52 -82 -49 156 -25 -233 -164 238 207 55 168 -179 71 -165 40 20 45 63 -78 -161
5304a61J57J33k03mL39m61L03l61M45j60j79K83m11K06K29L8j56J17j73K7J4j43
$$ -161 -4 129 -74 -78 261 -200 103 -258 187 27 -152 131 -280 -74 155 193 37 154 -19 8 22 -121
5326a21O3j07L69m33L25j17K1Q1J44l47k0P9p9K01l7o8o9K83l13J3M7M7k65L05
$$ -121 -58 -165 204 -229 96 -21 0 81 225 -122 -142 -63 -142 59 22 -46 -115 168 -145 -132 -85 -38 -303 2
5350Bk21K06n0k19J85K05j2l44J89k1J09O6o7J32k63J95l04K10o7R1j48Q7J9l7
$$ 2 -219 -13 -63 -282 -97 108 96 -248 -59 -80 29 95 28 160 -103 92 -212 -2 -69 22 -126 -39 -20 -57
5374e7Q3j55P9K90j99o9Q6k82K43j12n5J91%q1J57k57J00K31K5j29l96N30n16
$$ -57 26 -129 -50 240 41 -28 58 -224 19 -93 -148 43 43 -38 119 -138 -38 193 218 89 -307 223 -293
5397b93M31K1k67J56J10l48K60j31J01k5j07L67n22K53q6M1j01J52n5N8P3J88
$$ -293 138 159 -108 48 158 -190 70 -61 40 15 -92 275 -247 6 -80 -39 -140 12 -43 15 88 276
5419B76k97k2J25nJ17l19J34n3P1j54K28O9k19J03j04P9j11N5J48j89n9J86J70
$$ 276 -21 -43 82 77 194 -125 9 -44 27 -127 101 170 -49 54 -50 29 -82 -27 121 -68 -127 59 229
5442B29l34J04K7R7k52K49r6J63k69P1N2L5N2l7j81Q8K79k43J35j88J13j00K50
$$ 229 -105 -1 26 123 -129 120 24 187 -82 -11 41 76 128 91 -90 -2 277 34 169 -19 94 -6 244
5465B44l19k15K41L5L3K07k86L43j29k16J1K59m31j25N07l32J02P0k13l4M05j98
$$ 244 -75 -290 -49 -14 19 226 -60 283 154 -62 -51 208 -223 -348 159 -173 -71 -1 -214 -248 157 -41
5487d1p0K02o2P2PL3k68O1m9J43k4J60j34J2q3M3nK0k5m8J42k92J19Qk5L38l07
$$ -41 -111 91 29 101 108 141 -127 -66 -115 28 4 164 30 42 -41 2 -3 17 -8 -56 86 -206 -87 -79 -104 234 -73
5514g3J6r1K96k62J58K25m97R0M2j66L14k06J67j59K04j22k11K12K7Q5J97k73
$$ -73 -57 -148 148 -114 44 269 -228 -138 -96 -262 52 -154 13 -146 58 -64 -275 -63 -36 49 246 -27
5536b7J73j60n5j92K63k45L39m8J64j46K12k55l46M38k96P5J49kk5K62k92J95
$$ -27 146 -14 -69 -261 2 -243 96 48 212 66 278 23 -323 115 -181 -106 43 41 16 278 -14 181
5558A81j30J98j16L0o0j00o0N0R1k35K30r2n1k7J67j67J12P2Q5k51L0j7K56l50
$$ 181 51 249 133 163 103 3 -57 -7 84 -151 79 -13 -64 -91 76 -91 21 93 178 -73 -43 -60 196 -154
5582a54L48j36j76J5q5K78r1L5j0l1j53J44Q1J22j41j35J9l5K6J11q9J67n1Q6
$$ -154 194 58 -118 -103 -188 90 -1 34 24 -7 -160 -16 65 187 46 -89 -70 -105 -79 32 -57 110 59 145
5606A45o0j65K7j06N4K00m7l36K74J10k18Qq9q9O6K66k4j65J35K9j86M22k49J56
$$ 145 85 -80 -53 -159 -105 95 48 -288 -14 96 -122 -114 -203 -292 -226 40 16 -149 -14 15 -171 251 2 158
5630A58j07J05j38J94J58m01O5k68R2J8K34n0j2O4j28K06j81J74k22J1j27J72
$$ 158 51 156 18 212 370 -31 34 -234 -142 -124 110 60 48 112 -16 190 9 183 -39 -28 -155 17
5652A7j00k41N42k26J0K69k75p7j41K65P3k67J89l41K88N9J03J3k85J27j31J84
$$ 17 -83 -324 218 -8 2 271 -4 -81 -222 43 116 -151 38 -303 -15 44 147 160 -125 2 -129 55
5674E5K0R4k27J35k61J19K34k61K3j03L46k80N0j63J7L09l9M9j29R2k18J48r8
$$ 55 75 169 -58 77 -184 -65 169 -92 -69 -172 174 -106 -56 -219 -202 107 68 117 -12 80 -138 10 -88
5697h8j60M63j73j15L5R2pM2l6r1n0j9M11k66O7M4k02rK9M6J00p1K61k30k26L90
$$ -88 -248 215 42 -73 -38 54 47 89 53 -38 -88 -107 304 38 105 149 -53 -62 -33 13 113 42 303 73 -153 237
5723B37j69m6j15l8K0K41p1J2J14j52J82k28l0q8N4l5K10M4l5r4m2K04j91J22
$$ 237 68 22 -93 -131 -111 130 59 71 185 33 215 -13 -43 -131 -77 -112 98 142 107 13 -29 175 -16 106
5747A06j34J55%j14k25M63m59M54j02l07k1LJ33k82K34k96M36O8q7O7k58J56K49
$$ 106 -28 127 127 13 -212 251 -208 246 144 -163 -184 -181 -48 -330 -96 -392 44 112 25 92 -166 -10 239
5770B39p8m55K45J73j59M3M5j09K25p9K3O0j42j04L1J32m6j68PK78k54j09L51
$$ 239 161 -294 -49 124 -35 8 53 -56 169 90 113 173 31 -73 -42 90 44 -124 -117 161 -93 -202 149
5793A49j48J22J4K20l62K1Q8J62k12j98K1o1K28J02j76j92L38o1j88K72j51L8
$$ 149 1 123 137 357 -5 16 104 266 54 -144 -123 -184 44 146 -30 -222 116 55 -133 139 -12 26
5815B6Q7m5j26J05r1N6j44O4K2k33K23K76l38K19J21k47l6j65M40l7k04m1N9p3
$$ 26 113 68 -58 47 -44 12 -132 -68 -46 -279 -56 220 -118 101 222 -25 -61 -226 214 177 -27 -68 -9 -82
5839h2q8J74J48O4j40rk55L88Mk89J03J49j52k0j06K37k63K78p7l17K66o8O6Q7
$$ -82 -170 4 152 216 76 67 -188 200 204 -85 18 167 15 -5 -111 126 -137 141 64 -253 13 -55 11 98
5863I8J41Lj33l86M33k46K02k93L68k13j80J61K2j4o9J86K18m49J85P3m69N16
$$ 98 239 242 109 -277 156 -90 112 -181 187 -26 -206 -45 -23 -37 -106 80 298 -151 34 107 -362 154
5885A54j03J0q7j73J60j4j9M3j56j36K21M0J1J25j47R0J5J10q9Q9l75K54J0K8
$$ 154 51 61 -26 -199 -39 -53 -72 -29 -185 -321 -100 -60 -49 76 -71 19 34 144 55 144 -231 23 33 61
5909F1L4k3J12n0R3l69N44m28lJ57n4P9l71K36J80l12J65J63k38Qo6J22O6q5J46
$$ 61 95 72 184 134 227 -142 402 -26 -29 128 74 153 -218 18 198 -114 51 214 -24 -16 -82 40 106 21 167
5934A67k10M8K09j12J23l52%J69J7j50J77K9k19J8J42p5k06N24l74n4K88j71l6
$$ 167 -43 5 214 102 225 -127 -127 42 59 -91 86 115 -104 -86 56 -19 -225 299 -75 -129 159 -12 -48
5957d8J68j50Om5J93l91L68l3r9K44m04N6J70L4J56k23R3k70O9k4K98j50k36L83
$$ -48 120 -30 -24 -69 124 -267 101 68 -31 213 -191 -135 35 69 225 2 95 -175 -106 -130 168 18 -218 165
5981A65j27M2p0j73J92k85L03r5j84K44M6m0j87L44j3k30J26j24j5K21m3Rk10
$$ 165 38 80 10 -163 29 -256 47 -48 -232 12 58 18 -169 175 162 -68 58 -66 -81 140 97 106 -104
6004a04J63J17k62K4j2O9n5M0L0j24N7K38j54j95q3N7K45N8k05Q3J90p4m5j32
$$ -104 59 176 -86 -62 -74 -5 -60 -20 10 -114 -57 181 27 -168 -251 -194 51 109 -96 -13 177 103 58 -74
6028g4o1p3K28L2L3k17K59k50J05j15l9J05j79K46k66N12j94r1J52k24P3R1M8
$$ -74 -135 -208 20 52 85 -132 127 -123 -18 -133 -172 -67 -246 0 -266 246 52 -39 113 -111 -38 53 101
6051A01j43k75K68J38m5j61JOJ62R4j9p6j86N1J45Mj4M5J59k54J13j30J61m06
$$ 101 -42 -317 -49 89 44 -117 -116 -110 52 146 127 51 -135 -84 61 65 51 96 255 1 114 -16 145 -261
6075b61L08j06J63k07J27P8p0J04p3k26M2M69k98q5J55j62l0J46r8j04J16j72
$$ -261 47 -59 104 -103 24 102 32 136 63 -163 -121 348 50 -35 120 -42 -72 74 -24 -128 -12 -184
6097a84K18J70j66J33j00K4k35JK40k11M9J64k01K36j76k20L91j50O1J41L6k96
$$ -184 34 204 38 171 71 95 -140 -139 101 -110 -61 103 -98 138 -38 -258 133 -17 44 185 221 -75
6119g5q4L4N83o42J32k5K55j75P1l21K29J11j09j78r0L02n2j06J21Kn9L07m96
$$ -75 -159 -125 458 -184 -52 -77 178 3 74 -247 -18 93 -16 -194 -284 18 -34 -140 -19 -17 -76 231 -265
6142b65P7Q8PK80k55J37K7J81j29j51Lm3k3j25L24k94K96j98J27P9k91K36j29
$$ -265 -188 -100 -93 187 -68 69 96 277 148 -3 0 -43 -66 -191 133 -161 135 -63 64 143 -148 88 -41
6165d1l0O0k75K29j25K1j21K67K8j26J84Q1j99m5J80J71k62k0J5k06M25j29R3
$$ -41 -71 -11 -286 -57 -182 -161 -282 -15 13 -113 71 152 -47 -92 88 259 -3 -23 -8 -214 211 82 175
6188A75k54Q1j29J48j81K37j67M6k83K68J26j85J05o6J50n5J63k97N31m95K56
$$ 175 -79 2 -127 21 -160 77 -90 -44 -327 -59 67 -118 -13 -79 71 16 179 -118 413 -82 174
6209A74J69k17J1j42j86Q7J89l18M01j67K68k65n0K65l36J11kJ23k79R0j22P4
$$ 174 343 126 137 -5 -191 -104 85 -233 168 1 269 4 -46 219 -117 -6 -8 115 -164 -74 -196 -122
6231a22J35l3J22p8l5r9j45M33j29j5j94J57K8l4M1j06J40Q8k21o6K70k52J34
$$ -122 13 -20 102 24 -11 -110 -255 178 49 34 -160 -3 25 -9 32 -74 66 154 -67 -133 137 -115 19
6254A9J84l06J40L1p2k6j05Q8m5k1J91m9j16m1Q5K00j99O7m7K18k47N4N3j15o4
$$ 19 203 -103 37 68 -4 -30 -135 -47 -92 -113 78 29 -87 -128 -43 157 -42 25 -22 196 -51 3 56 -59 -123
6279a23J00l28N10n8l90N51k02q2n5r1L06k78K74O5j95K17j06n4K88k52j67K22
$$ -123 -23 -351 159 101 -289 262 60 -22 -77 -168 138 -140 134 199 4 221 115 61 349 97 -70 152
6301A52j40P4r4N4LK71k72L2M0k71J29O1Q1p4o4O4j66p0L00l21K69k08L97j27
$$ 152 12 86 -8 46 49 320 48 80 120 -151 -22 39 120 46 -18 46 -120 -190 110 -211 58 -150 247 120
$$ [...]
8191b47
##END NTUPLES=NMR FID
##END=
