##TITLE=1H_DE-106_ch_10_TFA
 200.13MHz, CDCl3,
 8 sc
 
 20.8.2025
##JCAMPDX= 6.0         $$ Bruker NMR JCAMP-DX V2.0
##DATA TYPE= NMR FID
##DATA CLASS= NTUPLES
##ORIGIN= UXNMR, Bruker Analytische Messtechnik GmbH
##OWNER= pz
$$ XWIN-NMR		Version 3.5
$$ Wed Aug 20 14:04:07 2025 Russian Standard Time (UT+4h)  she@DPX200
##.OBSERVE FREQUENCY= 200.1308
##.OBSERVE NUCLEUS= ^1H
##.DELAY= (6, 6)
##.ACQUISITION MODE= SIMULTANEOUS
##.ACQUISITION SCHEME= undefined
##.AVERAGES= 8
##.DIGITISER RES= 18
##SPECTROMETER/DATA SYSTEM= spect
##.PULSE SEQUENCE= zg30
##.SOLVENT NAME= CDCl3
##.SHIFT REFERENCE= (INTERNAL, CDCl3, 0, 14.3821)
##AUDIT TRAIL= $$ (NUMBER, WHEN, WHO, WHERE, WHAT)
$$ ##TITLE= Audit trail, XWIN-NMR		Version 3.5
$$ ##JCAMPDX= 5.01
$$ ##ORIGIN= Bruker BioSpin GmbH
$$ ##OWNER= she
$$ F:/spectra/data/she/nmr/H-C/1/audita.txt
$$ ##AUDIT TRAIL=  $$ (NUMBER, WHEN, WHO, WHERE, WHAT)
(   1,<2025-08-20 14:02:27.79 +0400>,<she>,<DPX200>,
      <created by zg, POWCHK disabled, PULCHK disabled
       configuration hash MD5:
       00 E9 B6 7A A2 85 ED C7 34 08 36 98 17 FE 4E 26
       data hash MD5: 16K
       2E FD E4 74 56 71 79 99 F0 99 9E 37 2C 45 61 00>)
$$ ##END=
$$ 
$$ hash MD5
$$ 78 A3 24 5B 38 FD F0 38 5E EE C4 14 7C F3 27 94
##$RELAX= 
##$RELAX= 
##$RELAX= 
##$RELAX= 
##$RELAX= 
##$RELAX= 
$$ Bruker specific parameters
$$ --------------------------
##$DU= <F:/spectra>
##$EXPNO= 1
##$NAME= <H-C>
##$PROCNO= 1
##$TYPE= <nmr>
##$USER= <she>
##$AMP= (0..31)
100 100 100 100 100 100 100 100 100 100 100 100 100 100 100 100 100 100 
100 100 100 100 100 100 100 100 100 100 100 100 100 100 
##$AQSEQ= 0
##$AQ_mod= 1
##$AUNM= <au_zg>
##$AUTOPOS= <>
##$BF1= 200.13
##$BF2= 200.13
##$BF3= 200.13
##$BF4= 200.13
##$BF5= 200.13
##$BF6= 200.13
##$BF7= 200.13
##$BF8= 200.13
##$BYTORDA= 1
##$CFDGTYP= 0
##$CFRGTYP= 5
##$CHEMSTR= <none>
##$CNST= (0..31)
1 1 145 1 1 1 1 1 1 1 1 1 1 1 1 1 1 1 1 1 1 1 1 1 1 1 1 1 1 1 1 1 
##$CPDPRG= <>
##$CPDPRG1= <>
##$CPDPRG2= <>
##$CPDPRG3= <>
##$CPDPRG4= <mlev>
##$CPDPRG5= <mlev>
##$CPDPRG6= <mlev>
##$CPDPRG7= <mlev>
##$CPDPRG8= <mlev>
##$CPDPRGB= <>
##$CPDPRGT= <>
##$D= (0..31)
0 0.7 0 0 0 0 0 0 0 0 0 0.03 0 0 0 0 0 0 0 0 0 0 0 0 0 0 0 0 0 0 0 0 
##$DATE= 1755684147
##$DBL= (0..7)
120 120 120 120 120 120 120 120 
##$DBP= (0..7)
150 150 150 150 150 150 150 150 
##$DBP07= 0
##$DBPNAM0= <>
##$DBPNAM1= <>
##$DBPNAM2= <>
##$DBPNAM3= <>
##$DBPNAM4= <>
##$DBPNAM5= <>
##$DBPNAM6= <>
##$DBPNAM7= <>
##$DBPOAL= (0..7)
0.5 0.5 0.5 0.5 0.5 0.5 0.5 0.5 
##$DBPOFFS= (0..7)
0 0 0 0 0 0 0 0 
##$DE= 6
##$DECBNUC= <off>
##$DECIM= 32
##$DECNUC= <off>
##$DECSTAT= 4
##$DIGMOD= 1
##$DIGTYP= 9
##$DL= (0..7)
0 120 120 120 120 120 120 120 
##$DP= (0..7)
150 150 150 150 150 150 150 150 
##$DP07= 0
##$DPNAME0= <>
##$DPNAME1= <>
##$DPNAME2= <>
##$DPNAME3= <>
##$DPNAME4= <>
##$DPNAME5= <>
##$DPNAME6= <>
##$DPNAME7= <>
##$DPOAL= (0..7)
0.5 0.5 0.5 0.5 0.5 0.5 0.5 0.5 
##$DPOFFS= (0..7)
0 0 0 0 0 0 0 0 
##$DQDMODE= 0
##$DR= 18
##$DS= 0
##$DSLIST= <SSSSSSSSSSSSSSS>
$$ [...]
##$SUBNAM0= <"">
##$SUBNAM1= <"">
##$SUBNAM2= <"">
##$SUBNAM3= <"">
##$SUBNAM4= <"">
##$SUBNAM5= <"">
##$SUBNAM6= <"">
##$SUBNAM7= <"">
##$SUBNAM8= <"">
##$SUBNAM9= <"">
##$SW= 18.0517779522481
##$SWIBOX= (0..15)
0 0 2 0 0 0 0 0 0 0 0 0 0 0 0 0 
##$SW_h= 3612.71676300578
##$TD= 16384
##$TD0= 1
##$TE= 0
##$TE2= 300
##$TE3= 300
##$TEG= 300
##$TL= (0..7)
0 120 120 120 120 120 120 120 
##$TP= (0..7)
150 150 150 150 150 150 150 150 
##$TP07= 0
##$TPNAME0= <>
##$TPNAME1= <>
##$TPNAME2= <>
##$TPNAME3= <>
##$TPNAME4= <>
##$TPNAME5= <>
##$TPNAME6= <>
##$TPNAME7= <>
##$TPOAL= (0..7)
0.5 0.5 0.5 0.5 0.5 0.5 0.5 0.5 
##$TPOFFS= (0..7)
0 0 0 0 0 0 0 0 
##$TUNHIN= 0
##$TUNHOUT= 0
##$TUNXOUT= 0
##$USERA1= <user>
##$USERA2= <user>
##$USERA3= <user>
##$USERA4= <user>
##$USERA5= <user>
##$V9= 5
##$VALIST= <valist>
##$VCLIST= <CCCCCCCCCCCCCCC>
##$VD= 0
##$VDLIST= <DDDDDDDDDDDDDDD>
##$VPLIST= <PPPPPPPPPPPPPPP>
##$VTLIST= <TTTTTTTTTTTTTTT>
##$WBST= 1024
##$WBSW= 4
##$XGAIN= (0..3)
0 0 0 0 
##$XL= 0
##$YL= 0
##$YMAX_a= 211925
##$YMIN_a= -241449
##$ZGOPTNS= <>
##$ZL1= 120
##$ZL2= 120
##$ZL3= 120
##$ZL4= 120
##$ABSF1= 10
##$ABSF2= 0
##$ABSG= 5
##$ABSL= 3
##$ALPHA= 0
##$AQORDER= 0
##$ASSFAC= 0
##$ASSFACI= 0
##$ASSFACX= 0
##$ASSWID= 0
##$AUNMP= <proc_1d>
##$AZFE= 0.1
##$AZFW= 0.1
##$BCFW= 1
##$BC_mod= 2
##$BYTORDP= 1
##$COROFFS= 0
##$CY= -3
##$DATMOD= 1
##$DC= 2
##$DFILT= <>
##$DTYPP= 0
##$F1P= 0
##$F2P= 0
##$FCOR= 0.5
##$FTSIZE= 0
##$FT_mod= 4
##$GAMMA= 1
##$GB= 0.15
##$INTBC= 1
##$INTSCL= 1
##$ISEN= 128
##$LB= 0.25
##$LEV0= 0
##$LPBIN= 0
##$MAXI= 10000
##$MC2= 0
##$MEAN= 0
##$ME_mod= 0
##$MI= 1.114404
##$NCOEF= 0
##$NC_proc= 0
##$NLEV= 6
##$NOISF1= 3.799351
##$NOISF2= 2.8
##$NSP= 1
##$NTH_PI= 0
##$NZP= 0
##$OFFSET= 14.38212
##$PC= 1
##$PHC0= -1562.896
##$PHC1= 15.39229
##$PH_mod= 1
##$PKNL= yes
##$PPARMOD= 0
##$PSCAL= 0
##$PSIGN= 0
##$REVERSE= no
##$SF= 200.129724274929
##$SI= 16384
##$SIGF1= 3
##$SIGF2= 2
##$SINO= 400
##$SIOLD= 16384
##$SREGLST= <1H.CDCl3>
##$SSB= 0
##$STSI= 0
##$STSR= 0
##$SW_p= 3205.1282051282
##$SYMM= 0
##$S_DEV= 0
##$TDeff= 0
##$TDoff= 0
##$TI= <>
##$TILT= no
##$TM1= 0
##$TM2= 0
##$TOPLEV= 0
##$USERP1= <user>
##$USERP2= <user>
##$USERP3= <user>
##$USERP4= <user>
##$USERP5= <user>
##$WDW= 1
##$XDIM= 8192
##$YMAX_p= 0
##$YMIN_p= 0
$$ End of Bruker specific parameters
$$ ---------------------------------
##NTUPLES= NMR FID
##VAR_NAME=  TIME,          FID/REAL,        FID/IMAG
##SYMBOL=    X,             R,               I
##VAR_TYPE=  INDEPENDENT,   DEPENDENT,       DEPENDENT
##VAR_FORM=  AFFN,          ASDF,            ASDF
##VAR_DIM=   8192,          8192,            8192
##UNITS=     SECONDS,       ARBITRARY UNITS, ARBITRARY UNITS
##FACTOR=    0.0002768,     1,               1
##FIRST=     0,             0,               0
##LAST=      2.2672688,     0,               0
##MIN=       0,             -241449,         0
##MAX=       2.2672688,     211925,          0
$$ Real data points
##PAGE= N=1
##DATA TABLE= (X++(R..R)), XYDATA
$$ [...]
1853C20l22r8m0K87k91O9O1r3j3k7J67lK63j50ON8k2k60O4J3J09j07p6J60k49
1878a74K38k45K49j3k14J36o0L29m61%L81Nl91L47j29k84J08L4J03l10J56M56
1900B61n92O31l94K79k04J14m1n2K17k91M52k05n4k2J22l99j42L09J0R1j40q8
1922a38K82j06N5j44J05n1K54j31k02j63J93P2q4r3j16L41j51r6p9M82j25j11
1944fJ33J65j94Q4m32J77K75K5l63K64j2j63Q9j90J40J19j48L60k74p9L45p0j99
1967D6j35K01j81J07j03M9o9M6j72J05P7J00Mjj64k09N26l4j98J5j5l12J5K42
1991f0P9q8n6L48n31M11j73j08J74N9K7j83J59k10J56L34n49k12J79K36j3K05
2013A84n1l04J90L1K68j26l04JK07j98M9j06L3K70J03l24k9J94k85K9K39q0l3
$$ y = [320, -2, -100, -140, 147, -144, -75, -14, -107, -120, -147, 20, 17, 280, 130, 136, 194, 172, -88, -24, -11, 98, -9, -85, 75, -174, 64, -181, 68, 55, -159, -23, -83, 246, -215, -215, 166, 171, -220, 127, -2, -286, -178, -144, -41, -351, -195, 261, -331, 300, -94, 185, -19, 95, 54, 2, 219, -72, 380, 175, 121, 99, 221, -178, -320, -11, -1, 90, -50, -138, 144, 38, 93, -51, 54, 3, 257, 126, -76, -239, -46, 26, -58, -151, -267, 74, -77, -173, -252, 230, 105, -6, 127, 292, 98, 182, -250, -73, 202, 227, -136, 128, 116, -47, 42, -148, -8, 111, -37, 323, 49, -30, 315, 245, 46, -89, 112, -69, 38, -65, -16, -85, -39, -211, -106, -29, 71, 75, 74, -90, -299, 227, 193, -5, 10, -5, -317, -302, -60, 19, -69, -125, 223, -308, 103, -70, -178, -4, 55, 82, -101, 58, -152, 4, 338, -211, -423, -244, -8, -21, 184, 133, -171, 19, 50, 318, 192, -112, -111, 96, -102, -53, -159, -126, 144, 247, -77, -106, 88, -197, -168, 71, -9, -42]
2036d2L1J09Q1j89J79N3n65N29q7p3K4l13J27o9J24J14j5p0O7J50J92l79J72k79
2060a29J91p5j58J18J72l29J12Oq8O6m0L73j97J0J52r4j68Q9J17k71N0o6J98M6
2084H5l36J42J70O8j03jL20j01k7Mk11n1J00l28K82K2l02K63r6k02L77P5k45J49
2108E4K06j76j1K29o4m09L70m10K44j7J28L8j32K58k39Q5J5r7j41P4J46J36l14
2131b7O2nJ8M3j89Q6k76O22q3k49j74J44J80j10J94j58J44m24J25J64j81P4J38
2154A18j66J10j38J71j73r3l5J93J67Pm8K1p9J73j90K75k89lnJ02l28N6R8K19
2178A63k83J41k96M52j25N8M1l36L06j24j89J29k6j32K20K99k33j27J10j90K0
2199a22j10J74K11k03K03j22j48k6j9L97j53K8l51L18j61J46k1J56r9r9J89k38
$$ y = [-42, -11, 98, 179, -10, 169, 222, -343, 186, 99, 26, 50, -263, -136, -205, -81, 33, 18, -52, 15, 165, 357, -22, 150, -129, 62, -13, -171, -53, 119, -210, -98, -92, -180, -114, -154, 219, 22, 32, 184, 90, -78, 11, 128, -143, -93, -159, 39, 85, -251, -109, 61, 129, 26, 25, 345, 244, 217, 221, 10, -41, 59, -269, 13, 35, -267, -4, -100, -302, 75, 150, -95, 54, 260, 84, 73, 302, 238, -171, 199, -211, 33, 16, 144, 182, 50, 308, 69, 154, 169, 72, -69, 5, 151, 287, -27, 35, 30, 48, 91, -98, -12, -288, 334, 251, 2, -172, -28, 152, 42, 236, 78, 222, -202, -77, 87, -94, -20, 118, -48, 62, -76, 95, -78, -171, -206, -13, 154, 161, 113, 134, 55, 228, 38, 313, 24, 21, 16, 118, -210, -154, -56, 163, -120, 21, -275, 177, 52, 110, 151, -185, 121, -3, -192, -63, -89, -221, -1, 298, 65, -62, 48, -142, -122, -232, -58, 153, -50, 153, 31, -117, -143, -162, 235, 82, 110, -241, 77, -84, 62, 41, 197, 98, -1, 188, -50]
2221e0l8K32J68n00N0M5R5N5p1J50l85J03L84m51K07J12J1q3J76k66J82o71P58
2244B13p3j83J08K42m81JJ03p0pj58K47L5Pl3R3K9k8k8j99L20j52R5j02R5K97
2269C71n36P7MJ80R1n34L71R1j62m6J36k2M7J79k09j82q0K88l71M24j46K13M2
2292B26l64K6K72J8p2P7j96J45%Kj90m1oK61j75kj62P6J89l08J39L91m87J08Q3
2317A0o8J38J70m38M47l62j55K60k1pj04K30m0j1j6J32j79o8N6m2q1K71k84j12
2341b74M42j43l1K87l41q3J05K4n4K06l31K36j06K06Q1n16L65r6O4n0r5K92k12
2364b4o7K03k29jJ6J24J50m11J84QrM0J33k91j34J97K06k52j72O30j63kk66J09
2388b1K67j90j05M15k2j24m43K29k7j66K38k76K78n57N33j18P7l27O44m0k29J11
$$ y = [-50, -88, 144, 312, -188, -138, -93, 2, 57, -14, 136, -249, -146, 238, -213, -6, 106, 117, 34, 210, -56, 126, -545, 213, 140, -43, 65, 307, -174, -173, -70, -140, -147, -305, -58, -23, -16, -49, 44, 73, 45, 17, -182, 138, -14, 81, -21, 74, 371, -165, -88, -84, 96, 187, -347, 24, 115, -47, -93, 43, 21, 68, 247, 38, -144, -224, 64, -307, 117, -29, 184, 226, -138, -112, 160, 178, 106, 183, -13, 132, 132, 134, -56, -97, -103, 158, -17, -19, -181, -105, 84, -224, -85, 306, -181, -73, 10, -58, 80, 250, -188, 259, -103, -258, 2, -19, -26, -130, 100, 60, 49, 33, 165, -14, -82, -26, -68, -149, 122, -162, -274, 168, 25, -6, 281, -60, -143, -38, -14, -68, 138, -193, 43, -63, 143, 224, -292, 73, -23, 41, -9, -104, 188, -24, -91, 112, -117, -118, -102, 22, 172, -239, -55, -47, -56, -16, 117, -174, -308, -111, 95, -157, -329, 301, 138, 136, -130, -21, 246, 56, -49, 366, 344, 220, -223, 6, -21, -187, 51, -225, 53, -504, 29, -89, -12, -339, 305, 265, 36, 147]
2410A47k0J32J4l85Q4J93k55Q5M8q7j12L24j84L07k42J86j23k10K85k64J26n9
2432a0Q9R1k11j87K37J03k15j45L09j69J67J3j52K62k26M2p4m7K19j43j67K87
2454G3j22R1k6J27j05J43j36j77K62M7J5j96j43O7N7K8p8q2O1O4J22J6N3m5l7
2479G9k29K24O1P9n26M74k08k6J10L3om20K12K33Rl95J78L59j94k16K27j92L77
2502B43l61K82m07L39l6k2J54j08r2n4k70K39m9L05l29M14J28n04K00J50j40P5
2524A57j14k30M55l87K9q4k7k1K51k55M27k39l1Q2j14K47l05J06K14k77k23K34
2546a05J76j31J87k6r0K41l70J42O7j64pN5J76k35n2J88j49J97k39K65k82M5M2
2569f9K5K03O7k98mJ95q5q3J49k49J46K5r4J88l04J77r5J33J04j49j38K16L08
$$ y = [147, 127, 259, 273, -112, -28, 165, -90, -5, 43, -44, -156, 168, -16, 291, 49, 235, 112, -98, 187, -77, 49, -10, 79, 170, -41, -228, 9, 112, -103, -248, 61, -108, 59, 72, -80, 182, -44, -2, -76, -123, 96, -47, -214, 73, -49, 42, 16, 143, 38, 181, 45, -132, 130, 177, 192, -4, -147, -80, -23, 5, -73, -155, -94, -30, 92, 108, 161, 116, 79, -150, 74, 135, 214, -312, 162, -46, -72, 38, 71, 65, -355, -143, 90, 99, -296, -118, 241, 47, -169, 58, -134, 243, -118, 164, -243, 96, 60, 38, 192, 84, -8, -62, -332, -93, -142, 163, -166, 248, 376, -128, 72, 222, 82, 157, 43, -187, 268, -119, -90, -174, -201, -222, 29, -226, 201, -38, -69, 13, -101, 146, -159, -53, 161, -116, -339, -105, 71, -60, 127, 101, 11, 252, -118, 24, 91, -73, -80, -25, 151, -84, -136, 52, -97, 100, -139, 126, -156, -111, -69, -44, 159, 226, -72, -76, 119, 34, -49, 100, -149, -3, 22, -72, 116, -188, -11, -106, 27, 131, -18, -156, 60, 368]
2592C68l80k32L42J55j80j13l42M06J16k40J24Nj16J02K0q5K72j61J80n06K54
2613a1Q7j21K54j91N0k88K34k51Q6J54MK13k26J22O1j53P0j09J25PO0r2j74j25
2637b14L03k40J92k10K48J72k32K86k05p3j26L21k70L10j33k35k3J59j28l2k6
2658a56L03j41J14L6j24J61j24J7L1m2j78m6j48N00l53j53K13N1J8J11q7j29J47
2681B1j49L0O0J07q3J34L0r7j59J79p4K19j46j16k82K54O0MK8J58Lr4rl01L10
2706H7j41P2J06p3Q6p3k41J76n1J45j37L7J39k34J66j02%J9R3J7j56K62m99K52
2730e0M9j26l3J28J17j03l5J50q0n0J86j14P8k76K72nj17J0j47j5K23j51moJ30
2755C1j65L20J1j04k00J31Q0k75M51k40r2k73J92K41j73r7m2K5K68q2j36M0oj12
$$ y = [368, -12, -244, 98, 253, 73, -40, -382, 24, 140, -100, 24, 29, -87, 15, 35, -50, 222, 61, 241, -265, -11, 76, -45, 209, 18, 68, -220, 14, -237, -151, 3, 7, 220, -6, 116, 177, 24, 94, -15, 110, 117, 177, 85, -89, -214, 89, -151, 41, -169, 79, 251, 19, 305, 100, 27, -99, 222, -48, 262, 129, -106, -129, 30, -98, -130, -156, 147, 6, 120, 156, 32, 193, 69, 86, 117, 75, -103, -149, -297, 203, -150, -303, -90, -39, -21, 90, 3, -126, 21, -128, -98, -38, 69, -14, 120, 150, 53, -106, 73, -1, 218, 72, -44, -326, -72, -12, -8, 20, 178, 181, 87, 78, -223, 87, -54, 18, 124, 51, 137, 64, -177, -1, -52, 93, -44, -7, 132, -102, 64, -38, -38, -19, 74, 91, -65, 197, -302, -50, -1, -127, -160, -32, 85, -18, -53, 97, 17, -33, 153, 39, 117, -159, 113, 108, -9, 1, -146, -161, 62, -89, -93, -99, 31, -134, 186, 197, 93, -107, 24, 104, -171, 280, 40, -52, -325, -133, 108, -65, -162, -204, -179, 89, 7, -129, -89, -95, -207]
2779b07K29j09k61M10j3j95K21j8k12J06j85K73Q9q9j40J27k25J61R3L1j28J34
2801I2j16R6%l03k3j85N70q2k24K65j33m8J75n7M5R9l43K09P7k47J45j46PL4P5
2826a8Q4l16J13L54O0j65O4j47R0j28Q3j97J40l87L74P0l54K40l4K35j58n9P1
2849A5j94J42K72j33k42J19J04j04j71J02K5R2k31q1O3J87m1o3K26O8j62K27j70
2872E0n0k28j0L44j3l70L36j02j58K53k24k39L18k05K06K73k48K21j69J29J33
2893B47l30K3j36j4k5Q6K79j43n0j6K07k87K16J04j05R8k76L64k85O3l46J77L99
2916B50m64M41j00j36J54l49L81M5k57l7K19j13m38N75p2j87O2k52J24M05k01
2937E0k53L27k41L4J70lK4k2j76J76Q3l45K53L13n04K21l11P5K77k03p4j24K54
$$ y = [-207, 22, -87, -348, 62, 49, -146, 75, 57, -155, -49, -234, 39, 128, 39, -101, 26, -199, -38, 55, 86, -42, 92, -24, 72, 72, -231, -254, -439, 131, 49, -175, 90, -43, -91, 84, 27, 72, 171, -172, 37, 114, -133, 12, -134, -127, -93, -18, 66, -250, -137, 217, 277, 112, 176, 29, 119, -9, 74, -123, 17, -370, 4, 74, -280, -40, -74, 161, 3, -56, 15, -179, -37, 235, 102, -140, -21, 83, -21, -192, -90, -65, 27, -204, -285, -222, -35, -76, -139, 87, 155, -7, 220, 50, 0, -228, -238, 106, 93, -277, 59, -43, -201, 52, -172, -411, -93, -298, -92, 181, -67, 154, -15, 114, 247, -83, -60, -196, -210, -235, -149, 130, -13, -63, -79, 128, -159, 57, 161, 56, 154, -122, 242, -43, 20, -326, -149, 250, -214, 227, 127, -9, 145, -204, 177, 222, -35, -72, 147, 34, -404, 171, 99, -88, -26, -278, -154, 251, 50, -203, 124, -117, -83, 87, 84, 108, 86, -90, 86, 169, -176, 77, 390, -114, 107, -204, -129, 148, -55, -129, -253, 1]
2960AJ57j80K54o4j44j63j42L11J08j12k23K49K05k10K1J12l0j11R2J01j07o0
2982F5k0Q2%R2j64j96J17J48k82J76j72R6j5N1P3J65j19n2j82j1J29l2K67j02
3006A14J04k65k15M20J74j61k74K5j41L76q3j48N8K51k74R1m2P7Q0j73l09N03
3028A88m98M42j53L06m01K00j24J70j4o6OL6J49m35J19n4R4L2k2o5O3r1L39o8
3052A53j37J39K47k76K96m95J40j93L03n00M04q3K04j40j54M1m5j21QK90P5j58
3074bK30k27L0m5p9K34j5k24J55k51M85l03N3j57R2j27M43l0m67L85Q7k83J62
3097A46R1k24j96Q9JM6q1J72l33J73L02j71j96j8K13P2j06j27l1L00j91p7K46
3120A00nj21k17K91J61j99j7j0RJ09o2q7j20r4L52k71J3O8l0K64J9J03k81j50
$$ y = [1, 158, -22, 232, 168, 24, -139, -281, 30, 138, 26, -197, 52, 257, 47, 68, 180, 150, 39, 131, 232, 125, 65, 45, 127, 127, 219, 55, -141, -24, 124, -158, 18, -154, -58, -73, -22, 51, 216, 97, 45, -137, -148, -19, -51, 216, 114, 218, -47, -262, 158, 332, 171, -103, -78, -219, 157, 74, -74, -16, 235, -39, 52, 10, 87, 167, -6, -315, 188, -310, 132, -21, 285, -116, 84, -40, 130, 116, 50, 56, 92, 241, -194, -75, -129, -35, -3, -25, -90, -27, -118, 221, 153, 16, 155, 402, 126, 422, -73, 67, -126, 177, -323, 81, -2, 202, 62, -92, -51, -96, -217, -209, 81, 156, -2, 228, 1, 31, -14, -93, 141, 126, -98, 57, -194, 291, -12, 41, -116, -24, -151, 292, 262, -205, 180, 267, -16, 146, 237, 13, -183, -94, -93, -47, -128, 44, -289, -116, 186, 15, -181, -199, 14, 86, -20, -147, -178, 122, -69, -146, 100, 95, -26, -243, 48, 209, 10, -7, -17, -8, 101, 39, -48, -168, -262, 90, -181, -168, -100, -130, 134, 153, 256, -25, -175]
3144a75J78K76l00J97j52J10r8j02N6k9K8J14p2O6o7K6p0rL24k69m5M9J21j00
3168E7J97j90P7q5oj31k59M09q5K3J39j47m2N7n3K2j02J56O9k22NK06k28QN7J2
3194e6K07j97K19k68j4J24K66l09K88n6k25L4rp9J27j53L7K67l92K94j76L75l27
3217b3J0J67K8j67R4K74k87p8J99k06Q7k63J51K52j06R6l70K44k65J18K80Ok26
3240A5R7j55J07j30J10J36j40k8K2j84K67j48L7p3%j00L5J05L30l14k51L16o0
3263fJ58m27L28j67j60K21J12k87M17k15J19k11K27j66P2K1p2j81L47O4k00n1
3285e7n5k6J24j23r9N1M64j75j08J27n8j47lL32l55J82m1r1k44M48o4m9q7K30
3309A76n26L81O7k34L0L8K75j5j29k15M40k49l1K6ol61M55j23q5K00m10K63J41
$$ y = [-175, 3, 279, -21, 176, 24, 134, 36, -66, -10, -39, -11, 103, 31, 97, 30, 56, -14, -23, 301, 32, -13, 36, 157, 57, 254, 64, 141, 56, 50, -81, -340, 69, -16, 7, 146, -1, -43, 14, -39, -17, -119, 37, 106, -116, -111, 95, -133, -125, -68, -56, 151, -46, 173, -95, -109, 15, 281, -28, 260, 204, -21, 13, 4, -75, 52, -101, -64, 203, -189, 105, -71, 304, -23, -13, 154, 182, 15, 109, 383, 96, 18, 217, 11, 98, -165, -14, 238, 132, 228, -142, 102, -163, -45, 235, 241, 15, 112, -43, 64, -66, 44, 180, 40, 12, 34, -150, 117, -31, 6, -67, -67, -167, -132, -27, 303, -11, -262, 54, -6, 152, -275, 53, -114, -274, -53, 59, -228, 189, -26, 93, -118, 109, -57, 15, 36, -36, -217, 130, 194, -6, -57, -112, -138, -14, -137, -236, -185, 279, 104, -4, 123, 65, -82, -85, 247, -108, 74, 33, -58, -302, 146, 82, 33, -54, 176, -350, 31, 98, -136, -106, -68, 207, 192, 63, -152, 288, 39, 8, 34, 28, -333, 122, -1, -86, 114, -296, -33, 108]
3332A08k11N1kl2L51Q4j89l32J17J59j31J20j2j51K04l68K21m1J41k05K59k16
3354g5K13l6j93j29K32l4N3q1R2j72n5J55J66k87J0K43J80M4j68J2J9l28M7R4
3378Bl69L39k89N02k48j39M23l68Q1J26j85O5J9M5r6m5J76J71l34L11l96J64J42
3401I7K1K71l57n5oM9J98j26k27k25M59K9k41L82l49N3O8K29k40j40K51r3r9L33
3425B82l55n0RK30j47q2M7K94l29k8R3qj35K47k93M01M0l30M01m19K5J57j87j22
3449b59K55j10j34L10j75J02j8o1j11J02M06l74l00L50K64j09j16l3J96m19Q6
3470a48J29oP3J05m03j81M63m6o6K03j26r6J76j57L02k99J8J00o4o4k4j23j6L81
3494A31j45L39l64k72K45N28p56L21j09M5P1j07l3J99nj84j65J95O5Rn5J84p0
$$ y = [108, -103, -52, -54, -86, 265, 349, 160, -172, -55, 104, -27, 93, 81, -70, 134, -234, -13, -54, 87, -118, 141, -75, 138, 102, -91, -220, 12, -22, 31, -50, 42, -130, -185, -30, 136, -151, -141, 102, 282, 326, 158, 170, 189, -139, -92, 2, -367, -28, -317, 185, -63, -202, 221, -147, -66, 60, -125, -60, -41, 4, -92, -137, 39, 210, -124, 187, -209, -45, 97, 118, 389, 32, -23, -29, 20, 218, 92, -135, -360, 99, 128, -113, 269, -80, -27, 41, 270, 30, -110, 141, 48, -51, 282, -73, -123, -114, 116, -31, -113, -66, 228, -101, -129, -36, -44, -179, 68, -225, 176, 216, -114, 287, -132, -107, 50, -137, -259, -4, -114, -248, 62, -113, -11, -29, -90, -201, -99, 307, -67, -367, -17, 247, 138, 22, -11, 185, -234, -148, -19, -25, 48, 153, -250, -431, 32, -14, -80, 123, -3, -99, 77, -80, 222, -77, -59, 41, -23, -87, -111, -234, -250, 131, -14, 325, -39, -311, -66, 462, -294, 27, -82, -37, 34, -73, -106, 93, 88, -96, -261, -66, -1, 8, -47, 137, 67]
3517F7Q7R9l48M2Mj06K42l90L79n9J13k16Q3J01k9j91M3J41L9o1J06q3n8J99k96
3542i2mOj2J94r0K13j9j47k52pK82n4j38J44p1o0J92L06m21j45P6J92J71k49j54
3567a39J91j27J35J3j7K0p7k6J1m8j34J77j39J52m1p4J21oj24j6k19L47J1R5j79
3592i3J8K65l49K87l73J07p4K14R8j53K32k10K2j07J58M7k90N66k03n5j33N3o4
3615c7j7K31j76k14K18J73q4Nj84r6K23P6m7K0k64K10k1j91K62n2J4k55K04j46
3639a48Q2N3R3J41k09J69k08O2O3o9j95J29M5r5J13ON6n9j95M9K84j99qL7K17
3664B14k11K17l20j20K24Q0m0r0j55J47K13l21K1K71j16O3j96K54j55kJ51k54
3686a25J39o1k14N55j84k05q0K19K8p2P0p8n6J01j6q7N0J23J7k89M20l23j7J68
$$ y = [67, 154, 253, -95, -53, -49, -155, 87, -303, 76, 17, 130, -86, -3, 98, 69, -122, -79, 62, 101, 40, 146, 63, 5, 204, -92, -96, -90, -102, 92, 2, 215, 196, 49, -203, -210, 72, 18, -120, 24, -47, -107, 85, 391, -30, -175, -99, 93, 264, 15, -139, 52, -75, 60, 73, 56, 76, -1, -27, -16, -64, -198, -21, -160, -8, -49, -123, -2, -8, -132, -148, -367, -20, -9, 86, -93, -75, 190, -159, 128, -245, -138, -212, 2, 100, -53, 179, -31, -9, -116, 42, 89, -201, 365, 162, 107, -26, 27, -37, -54, 177, 1, -213, 5, 178, 94, 99, -85, -181, 42, 118, 71, 91, -173, 37, 16, -175, 87, 35, 49, -206, -2, -148, -66, -13, 80, 221, 12, 181, -27, 35, 98, 29, -166, -37, 8, -87, 26, 32, 88, 29, -166, -117, 167, -32, -40, -3, 214, 3, 220, -100, -220, 4, 84, 44, -46, -201, -54, 159, -162, -141, 130, 14, 77, -119, 135, -20, -22, 129, -125, 14, -47, -261, 294, 110, -95, -175, 44, 72, 0, 70, -8, -64, 37, 21, -66, -16, 107, 124, -165, 255, -68, -85, 83]
3710H3j55J24j48l3J21Q1j46J00P7l9pm7L4O8o2N0j70K44P9l88RP6j17J47L01
3735B82k73J12n3k1ppP4R6j07j80K3M2J98r9j02K67n14N3K39J54l19N1kJ45j30
3760g8K65L2k16M1j37J48j18J39l0k0k73N19j29m14M41j96K33o2l08J43J37j71
3782e4J0J8J8J04j05K15m06R0L19k13O4k37J50J26Q4k9l17QJ03r4K03j58O7J30
3806I6J01j19jj34q7K87p9N7Jl08k72K13L97Q7k97J07k99J45JM39k81J1r5l8K99
3831B31m95k07M61j08J40N8lk04N9J12K2j64R4r2P0J69n4k40O8L56k93M8K0l9
3855Il8L7j15J78P1j09k89J04L71M2k83K60j59Q1j42K31l24J12J8L1Lp0M9N7j73
3880d8j21J06q2J4J00l41K49K60p6j8m8L82k52l01K26k34R8KM4k32K10KO6n02
$$ y = [83, -72, 52, -96, -129, -8, 73, -73, 27, 104, 65, 58, 11, 45, 113, 51, 101, -69, 175, 254, -134, -125, -49, -166, -19, 282, 9, 121, 68, 47, 40, 33, 107, 203, 96, -84, -61, -19, 179, 80, -22, 245, -269, -216, 23, 177, -142, -91, -93, 52, -78, 187, 219, 3, 44, -93, 55, -63, 76, 46, 26, -247, 272, 143, -271, 170, -26, 207, 145, -163, -20, 117, -54, -44, -26, -8, 96, -9, 206, -200, -110, 209, -4, 60, -177, -27, 99, 183, 154, -163, -155, -52, -146, 57, -101, -34, 96, 197, 78, 77, -57, -144, 143, 64, 121, 122, -186, -458, -245, 152, 239, -58, 49, -250, -105, -104, 335, 54, 65, -30, -68, 231, -264, -471, -10, -118, 22, 80, 77, -127, -68, 44, 66, -98, -4, -96, -26, 143, 89, -151, -83, 273, -20, 28, 48, 9, -29, 8, -107, 71, 142, 33, -256, -152, 219, 261, -22, 238, 79, 160, 18, 249, -75, 37, 55, 86, 89, 19, 68, 125, -48, -169, -63, -145, -131, -31, -372, -123, 137, 61, 43, -5, 377, 125, -176, 50, -184, -86, -84, -40, -272, -62, -60, 6, -496]
3904d96N06J06k41K12j45J88l4k02J3r4J50P2k48J9K3Q6n0L79l04K83k34O3j82
3927a30L4N8k9q4J16j88n2J76J7m1N5P3J85m5p1Q1k18J47j13p2R1M2k04N2M20
3952C00j73R0k04k3n2J22Qj62K46j99J8J62j60j19J60P0j20Q9k35K30J9J17j54
3975C0P0o3No8j07R1k69J95J25K11j86Q5l48l3L96q3j49J86J39j80N2j9j02j08
3999a30J60J7p3Np4J36j97L69j08l2Kq5j67p4N5K2M3M2J16R2q4l0j89j18L04j22
4025a20P1P1K2l30J32l2L6N4K06P9l96J62R6l4n0J50oj30q7L10p2k31J18j21J02
4050@n3K13k67j2J60qj52K41k42j47J17l9L12j05r0K22n7L9k91q0M80j52L2K04
4074C25k35J28j88J51k04j64K91j29J44o1l29M47j17r8l5m3l3J86O2j49J33k46
$$ y = [-496, 10, 116, -125, 87, -58, 130, 96, -106, -93, -187, -37, 35, -213, -194, -171, -85, -135, 244, -60, 223, -11, 52, -130, -96, -38, -67, -151, -35, -223, -275, -99, -82, -123, -68, 5, 190, 145, 74, 155, -63, 84, -29, -101, -10, 32, -172, -120, 300, 127, 217, 13, -10, -62, 60, 68, -94, 152, -47, -29, 133, -27, -146, 14, 84, -36, 53, -182, 48, 67, 184, 30, 100, 37, 42, -26, -133, -42, -311, -116, 9, 220, 34, 119, -229, -262, 134, 51, -98, 88, 227, 47, 99, 80, -22, -130, 30, 47, -26, -21, -95, 41, -156, 213, 105, 73, 75, -10, -177, -251, -196, -174, -131, -89, 27, 119, 35, 5, -184, -302, 2, -120, -49, 22, 44, -286, -154, -186, -150, -96, 110, 189, -207, -45, 51, 17, -33, 117, 111, -19, -106, 204, 132, -99, 19, -102, 0, -53, 160, -107, -119, 41, 33, -119, 122, -120, -267, -150, -189, 123, 18, -72, 150, 93, 132, -159, -239, 241, 89, 121, 325, 90, 218, 30, 181, -23, -187, 104, -25, 119, 58, -271, 176, 59, -39, -74, -117, -150, 36, 98, -51, 82, -164]
4096a64K00r3J42o9p1O8J29j70J76n34M73r2k69J78p4J14j63K13L02k50j84J21
4118a7j28J02p3J69n4j17K69m74K18J20lm8P5k46K11k64M77r3J42j62L8q8L2r5
4142ij1J16k29J20o7J04J0J17k24J88J30k60J6k09J92l2L19q9k37J19k4j12L44
4165B72k83K42q0j0J8j89Lj60L25k8k00J11R5J4o1K37k75j69J81l9L30l16J43
4188A61L82m84P0m0j26l4q9K47L43m10Q1J30k72N1Q2j17O1l01L38j06J80l08M23
4211B62q8j84Pq4J24j01J3P1q3K43j31RR2K3k7k68oJ51J43J2m07K11K88l04J43
4236A09j45J27k21p9L02l03P3K53j94J55O4m7k01J9j6K14l50K71L5O0k6p8O7q3
4260FJ45j66J17k27R3K29j36Rp1j71N2L79R3n26J23K27k92K04j85L0k2J47l61
$$ y = [-164, 36, -57, 85, 16, -55, 13, 142, -28, 148, -386, 87, -5, -274, -96, -170, -56, -219, -6, 296, 46, -138, -17, -145, -43, -116, 53, -1, -118, 151, -323, -105, 15, 12, -36, 39, -207, 4, -260, 217, 124, 266, 104, 142, 54, 86, -9, -20, 96, -133, -13, -80, 24, 34, 151, -73, 115, 245, -15, 1, -208, -16, -48, 271, 182, -55, 64, 40, -72, 272, -11, 231, 151, 141, 159, -30, -27, -187, 138, 110, -90, 21, 116, 130, 69, 306, 31, -138, 43, 4, 334, 18, 161, 543, 59, 129, 89, -37, -71, -160, 87, 430, 20, 101, 231, -41, 10, 92, -25, 36, -265, 73, -33, 147, -161, 262, 174, -10, -3, -87, 37, -64, -51, 20, -63, 180, 49, 58, 150, 173, 146, -122, -128, 23, 166, 178, -229, -18, 270, -34, 109, -36, 91, -130, -209, 93, -210, -137, 116, -78, 77, 141, 94, -107, -88, -104, 110, -240, 31, 66, 126, 100, 22, 89, 6, 151, -15, 102, -125, -32, 197, 61, 70, -1, -172, -120, 259, 352, -174, -51, 176, -116, 88, -97, -67, -89, 58, -303]
4283c03J96M4J69O4j71J43j49l7Ol8J32M3l78K35J7M2N1k2J28k70J23k98J46N4
4307g3k33L27K08k21LL5k4P6l35K36L58k09j49L2m79K32M53k02o3O5k09k5J50
4330d7R3k5j08J53k92K24k62J24K50j21n7J19L8Q8k5J70m51K78L8p4kk4N1Q4n37
4355c15O96o33R4Q8L16r9k36J27lj84K98m23J82J50m3P8k32N7J92r7p8K2L5N2
4379D4j5n3r1L21m59K89J98j26j35j30J91j43J24M09m97J81p8j01K98j37l75K00
4401h5L35n08J30N6J11O8p9j49R1J54Mj62j2R8j26k01M16R3k6j67j56J10K5k0
4425@J76l14M5N8M1Q9k34K21L6l05L33r1j24K37j35r0m3J55k5r4K8o3p4L49j32
4450D4OR0n9j24O0K00j35R9o3k88J87L46n29K63k58K42Rj37K80o4l22K06mm00
$$ y = [-303, -107, -63, 106, 170, -1, 142, -7, -44, -38, -76, 56, 99, -279, -44, -27, 15, 66, 44, 172, -98, 25, -273, -127, -73, -306, 21, 229, 8, 11, 46, 22, 98, -237, -1, 357, 148, -1, 31, -448, -216, 237, 35, -28, 37, -172, -197, -47, 46, 21, -87, 66, -226, -2, -264, -140, 110, -11, -68, 51, 89, 177, 152, 322, -129, 149, 187, 113, 111, 87, 138, 222, -315, 381, -252, -158, -70, 246, 147, -89, 38, 35, -149, 149, -274, -92, 58, 15, 93, -139, -82, 110, 13, -65, -43, -8, 44, 29, -24, -115, 206, -253, 36, 234, 108, -27, -157, 34, -109, 15, 424, -73, 108, 30, -71, 227, 90, -285, -85, 250, -258, -128, -72, 39, 107, 28, -121, -30, 124, 128, -34, -46, 52, -74, -275, 141, 234, 208, 41, -115, -5, 20, 0, 176, -138, -93, -35, 6, 95, -139, 82, 118, -187, 146, 55, -69, 168, 33, -57, -100, 55, 30, -64, -36, -99, -173, 176, 44, 50, 140, 81, -43, 17, 217, 82, 181, 118, -170, 17, 363, -166, 97, -161, 81, 90, -47, 233, 169, -153, 53, 49, -351]
4474c51K12K28k50R9J63pl34K26K4O8K3j10j4LJ02j1J9M0j25j46K51j45J5k55
4498b75L23Km3J60l11L6j0J83j02J56Rj28M4N5k00R3l4m3J9Q2l6K6J79k82r9J68
4524b8r8J01J65k17J67l7k7L40j46l23J04j22J96k32K43j88K14o9J03r7o5J63
4546A47m67K97Q2l24OK99k38J80R2k24K93l44K15q9K05j82N6OL7K02l29k53M29
4569I6j4k1r5n2l11L28R7o0L00j62m01L11m8J2J46p6L5j07J40j51J03j73O4J12
4593G3j14n5j66Q2R6J08k0n7L94m80o8K89N7oJ63l33R9P6p0q6K5K89j17p6j64
4618f1M8R9o6K69k89j28L14l32J50r7j49N76l51j72M12l12RK65k9J4k12nK14m68
4642c01M34k67M4J44J3m57N92j04k65M37k98J01k55j10J22K87l03K88j64K41j35
$$ y = [-351, -139, 89, -161, -62, 101, 94, -240, -14, 10, 78, 101, -9, -23, -20, 82, 71, 90, 130, 5, -141, 110, -35, -20, -275, 48, 50, 7, 167, -144, -108, -118, 65, -37, 119, 128, 0, 44, 99, -101, -8, -42, -85, -66, 16, -20, 6, 185, -97, -196, -28, -126, -25, 140, -77, 90, 53, 26, 366, 220, -103, 1, -121, 75, -157, 86, -102, 112, 43, 146, 49, -16, 147, -320, -23, 59, -265, -259, 40, -198, -18, 74, -150, 143, -201, 14, -75, 130, -52, 4, 10, 47, 249, -80, -333, 96, 82, 61, -34, -86, -397, -69, 28, -32, 268, 106, -295, 16, -32, -20, 126, 50, 85, -22, 118, -33, 70, -103, -39, 73, -41, -96, -262, -180, -84, 24, 4, -53, 341, -139, -207, 82, 139, 133, 296, -37, 62, 138, 68, -18, 7, 296, 179, 103, -61, -13, 86, 20, 289, 0, -128, 186, -146, 4, -93, -242, 334, -17, -189, 223, -89, -80, 185, 156, 170, -42, -47, 167, -301, 133, -134, -90, 54, 67, -390, 202, 98, -167, 270, -28, 73, -182, -292, -170, 117, -186, 102, -62, 179, 44]
4663D4J87j54n5k22J29J1J22k31K41K36k35M2j52k1Ln0K23k2R6k86N6L7k16K24
4687GJ54n6j21p6M16k71k8R8l48J07k1N32l46j12K2N0K29K7j66j53J90j46P1m22
4711c63L44n8R5j28K7K15j83l7j02J31O7P2kO4l3j14n1k09K78l00K39J13j52K97
4735B10k73j10J42L0j12k2lL25k70J30j08J8j0M9n0LJ24P8j83K52p1k02J22j32
4759f3j14J84LN0l06L26j08K27j57j41J08j69K37m8K4n9O9L9o46O11O3P0l30L20
4783A90l18L39k18O7j28K22o0L2j86j3m9K08J12J40n70J46N0J11k99K41j94J29
4805d8K42j84Q6l8J82J5m19l9K53K0j77K55q4j56J68k97K39J75l72K61j12J36
4827A06n2q5N4J24l6k24J50q2j48K77N6j52J25j59p3l36N91k8l05K31k48L17m6
$$ y = [44, 231, 77, 22, -200, -71, -60, 62, -169, 72, 308, 73, 115, -37, -58, -55, -105, 118, 96, 192, -94, -38, -1, -217, 7, 161, 105, -16, -92, 324, 53, 25, 123, -225, -118, -139, 393, 47, -65, -43, 7, 236, 263, 97, -56, 134, -12, 59, -363, -19, -77, 18, -110, -83, 132, -51, -88, -190, -59, 8, 80, 78, 142, 109, -5, -56, -265, 13, -287, -48, 65, -87, 210, -63, -173, -31, -1, -113, -135, -138, 187, -83, 47, -61, -43, -53, -4, -54, -51, 73, 151, -32, 220, 149, -53, 69, -63, -177, 7, 10, 60, -246, 80, -28, 199, 42, -99, 9, -160, 77, 29, 53, -6, 63, 102, -544, 67, 130, 200, -130, 190, -128, 211, -7, 60, -68, 154, 94, 126, -60, -73, -122, 86, 198, 338, -232, -86, -36, 75, -224, 17, -177, -48, 194, 10, 96, 58, 240, 255, -164, -203, 50, 70, -107, 148, 64, -92, 76, -221, 18, 193, -179, 82, -30, 106, 54, -31, 23, 147, 111, -113, 37, -45, -193, 84, 140, -12, 113, -46, -119, -455, 136, 108, -197, 34, -214, 103, 57]
4850E7k63M94j1k74P7k17j0J94j60M4J80m2j36Kj52L54j66L9K46k56N2J5j96K8
4874a01K90K7n38K94P5K0p6p1J29m04K22J09J32k9K9oj02J47l81K14nJ03k50K46
4898G4J07l77L07k07k8K70k62J50K74m17Q8N9L6j0n2P2n2J13m16K56k0k1K45l15
4922a26RJ34L0J47j57O6Qk86L58k93j47J37J18Q3j73J20j35J33K6o1K59m82K22
4945a0r9J70m0j6j13K42r2j03K64k93n1N7M3J02k41J00J8R7p9j1J51k62J78L0
4969D2j07K3j40J90jn7J65k00K8L48m70K73Rj51l0J02j28m5m9m7L01k22p6M73
4993B31k91m23N79P4j77O3m5O8M4l26R6M9k1J26o7k41Q7K89r2K6j82L24j84j15
5017a08RK49j39J6J11k88L73k61J01m6J89l47N6K2Q6K88k51R7k33k0K79J75n60
$$ y = [57, -206, 288, 277, 3, 80, -137, -147, 47, -113, -69, 111, 69, -67, -65, -217, 137, -29, 10, 256, 0, 52, 67, -129, -101, 189, 216, -322, -28, 47, 67, -9, -80, 49, -355, -133, -24, 108, 79, 108, 102, 0, 147, -234, -20, -25, 78, -172, 74, 181, -196, 111, -96, -124, 146, -116, 34, 308, -109, -21, 38, 74, 64, 12, 84, 32, 145, -271, -15, -35, -56, 189, -126, -117, 17, 47, 194, 37, 103, 111, -175, 183, -110, -257, -120, -2, 81, -92, 28, -107, 26, 52, -9, 250, -232, -10, -109, 61, 21, 5, -108, 134, 42, -61, 203, -90, -141, -84, -41, 61, -180, -80, -62, 35, -44, -55, 96, -166, 12, 42, -65, -42, -182, 8, 7, -50, 115, -85, -57, 291, -179, 94, 103, -48, -78, 24, -104, -149, -198, -245, 56, -166, -242, 231, -60, -483, 96, 170, -7, 56, 11, 79, 123, -203, -107, -58, -79, 47, -20, -261, -174, 115, 23, 49, -133, 191, 7, -108, -99, 150, 11, 27, 138, -150, 223, -38, 63, 17, 206, -141, -85, -63, 23, 311, 60, 157, -76, -96, 183, 358, -202]
5040b02L28j15j75K83l2j89j1k9J80J9JPR9o7o5j4j28J16r5L45l03k9J23p5J52
5065A24N6j64k63M29l58P1K29k9k45M01l38OJ31j08O4p2j35K74j16J43j11N7J51
5088A97m19K6o7N30l52J22k32K5K52j06J27p6k8l04K82l2r3J38k96O05m62N2J16
5111EL35m42J77nj05r2j31K66j9J86k45N1j34L22j41m4l7K16k19J76J59k11k15
5134a47k7L3rK85m3k9P8j55o6J35j09k8K89l00K21j94K28m80N8k0L33j27J20o6
5158b0q4j08K71J59j94O0k42J6L02l13L55M5k94j39J41K61k31p8J12J03k36K0
5180i4p3L09j52m1J47m6J32k22k33L59p9j18J46o8P7K44k86k82K37oJ1K10j12
5203F0l7K3P2o3j29J5Q3L3j02p0m0L4l2J84J31r5ll5m0J66k11K12l86K31k29K68
$$ y = [-202, 126, 11, -164, 119, 87, -102, -113, -142, 38, 57, 58, 65, 164, 97, 32, 18, -110, 6, -89, 256, -47, -76, 47, -28, 124, 180, 16, -247, 182, -176, -105, 124, 95, -150, 251, -87, -81, 50, -58, 6, -66, -201, 73, -43, 100, -11, 46, 197, -222, -196, -263, 267, -85, 37, -195, -170, 82, -24, 103, 27, -1, -305, -23, -55, -148, -10, -306, 299, -163, -111, 5, 340, -102, 75, 70, -35, -127, -258, 8, -11, 175, -70, -19, -153, 169, 28, -16, -53, 163, -56, 120, 279, 68, -147, -174, -141, -150, 135, 92, 63, 141, -14, -80, 55, -54, -82, 207, -93, 128, -66, 162, -318, -260, -280, 53, -74, 46, -20, -104, -212, 59, 218, 24, 84, -158, -142, 160, -153, 202, 247, -47, -186, -45, 216, -15, -93, 19, 122, -114, -94, -167, 142, -10, -51, 96, 50, 182, -40, -273, 86, 7, -111, 35, -33, 44, 288, 2, -280, -43, -49, -38, 172, 60, 23, 46, 118, 55, -74, -59, 24, 57, -45, -115, -155, -121, -153, 31, 162, 67, 64, 29, -11, 155, -56, 156, -230, 1, -228, 40]
5229D0p6k0J18k08M1K9L36j98k12J88j05J02k37L29j34r8K15j29l2j05K51J9o
5252A08k2P4ok80J46p3J32nj21K06l05K85j53q3j5J82J09l2j63J8M8r6o3J54l4
5277A1k12K06Q7P7p6J5q3q7m1Q8J26O8j20j39J68J3l18L60k39r5K41k7o9j23M65
5302B96o4k13J02j17J55j12M7o3r8kJ33k0R5k86J46k34R9N02j93J8k72Mq4K49
5326H8K1k08J11J33j45N5J17k54R6k1j62J66o5j22Jj10K09m4j5L7Q8o4K10m0l20
5351b38J61p8J31r4R3j09L95j78k42o0J00J47O0l09J49p7J19O5K01j63k41L63
5373A95j97Lj84l8O9L57R3l40j0j72L22r2k15J32J4j51K96p0J40j67m8K38O3n01
5397b63L34j26n4K48k70J24k31L38K6n2K10l33n3M1J11K55m02K2J27Q2k32M0J80
$$ y = [40, -36, -56, 62, -146, -105, -76, 260, 62, -150, 38, -67, 35, -202, 127, -7, -105, 110, -19, -51, -156, 95, 114, 108, 86, 160, 154, -126, 20, -53, 79, 74, -47, 159, -146, 139, -14, -97, -112, 70, 179, 147, -16, 2, 50, -46, -109, 45, 11, -201, 5, 92, 169, 93, 108, 25, -62, -103, -15, 111, 179, 59, -80, 88, 101, -217, 143, -96, -191, 50, 23, -46, -169, 296, 232, 19, 121, 4, 159, 47, 94, 31, -67, -69, 64, 44, 139, -147, -1, -235, -136, 366, 173, 191, -81, -77, -161, 88, 109, -99, 12, 145, 0, 55, 172, -82, 14, -7, -169, -3, -68, -190, -189, -299, -90, -134, -149, -112, -24, -88, 122, 82, -238, -77, -155, -24, -118, -25, -134, 261, 83, -159, -219, -119, 28, 88, -221, -72, -149, -30, 35, 236, 73, -168, 195, -2, 1, -183, -221, -152, 205, 298, -42, -52, -224, 98, 6, -209, -77, -63, -214, 82, 12, 152, -15, -63, 175, 238, -263, 71, -55, -109, 139, -131, -7, -238, 100, 126, 74, 284, -49, -102, -61, 50, 305, -97, -75, 52, 134, -98, -58, 122]
5420A22k10j24K49j23o4J97o7J65j71J32Jn1j14J64l96J35J44Q5N1J4j90M5q9
5443i5K69r1n4l02lL76k97K73k40K50n8K0J12Q5k34q8RK7K42l92P8P3j55K58k01
5468a38j07K59M05l86k21L61m73K09n1L43j55j51j19L31j27N6j61M46l17lk53
5489b52N55j48m27K92J17j17l7L07j58M5j70L5J4m9P6j96o9J06J94k66L13r3N4
5512A26j36rJ9j05N1L9l72L53nj94j03M20j79K77j92p1K31m02M85m19J6KK47l14
5536b35K31Q7J59l81QM7Qo9J32p0J92j69j32O3M69k90j82k7K71j62Q1j28N6k22
5560b63M38q7L1l51J78J8J53j6M0k39p2J33j19o7J41p3K60O4k61loj42J73R1j50
5585a29r1K71j51K30K16k88K3j43J34L56n47o9L66k19J23P0k29qM27l38j10M5
$$ y = [122, -88, -212, 37, -86, -150, 47, -20, 145, -26, 106, 107, 56, -58, 106, -290, -155, -11, 74, 125, 139, -51, -6, -95, 174, 83, 29, -273, -276, 100, -197, 76, -164, 86, 28, 48, 160, 245, 11, -77, -68, -41, 201, -191, -113, -40, -195, 63, -138, -245, 14, 419, 33, -188, 173, -300, -91, -142, 201, 46, -105, -224, 107, -20, 36, -125, 321, 4, 1, -252, 303, 155, -272, 20, 137, 20, -17, 290, 132, 177, 7, 42, 56, 7, 83, -113, -182, -76, 118, -148, 165, 72, 126, -10, -19, 0, -105, -54, -15, -387, -34, -39, -233, -336, 84, -95, 182, -10, -81, 150, -252, 233, -186, -170, -168, 79, -235, -4, 83, 242, -139, -131, -84, -76, -145, -13, -83, 109, -60, -192, -129, 340, 50, -132, -159, 112, -50, 31, -97, -41, -263, 175, 88, 119, -232, -54, -36, 117, 101, 141, -98, -170, -37, -156, -223, -82, -155, 105, 169, -92, -95, -101, -243, -70, 21, -129, -220, 51, -100, 130, 346, 58, 81, -62, 72, 428, -119, -188, 178, -41, 82, 152, -77, -85, 342, 4, -106, -61]
5607f1J35k84Q3L01q8M6j39j62K81N7k64K4L06k02rJ01r5j99M1J20o9K1o7K40
5631A17j38l7K47k55j35K97j72j92J17J07J7k17L36j12k39J59J90m4K9o2J83j4
5653A82j86q5Q5L20m95oK57J11k11O5J54l09lL14O4j66j27j19Q5K04j44J04J35
5676B29l43J61k0l09J30J41k2J94n5j56L70n19J68m4P2L0J2qk51K04j88K93k79
5699a90K97J81p8j96j00R1Q2j12K21j45j09K79l70J42j94K11L0P8K63k93k12K91
5721A67J09n39L22n6M1r5q4K04l09L14j85J51n3J49j59N7p4j32K82n7j56J02j04
5744a05j3J40J47l03j18L03k90L53j73J45q1o3JJ07K00j96L3K3J44k26p6J11J15
5767A78k99K3j25M46j01k29Q7N6j21J61K2j26J83l73K46j48O6Jk3K59o3k54j68
$$ y = [-61, 74, -210, -127, 174, 86, 132, -7, -169, 112, 169, -95, -71, 235, 33, 24, 125, 30, -169, -128, -8, -77, -56, -123, 117, -21, -58, 189, -66, -201, 96, -76, -268, -151, -44, -27, -244, 92, -20, -259, -100, 90, 46, 75, 13, 196, 182, -4, -89, -4, 316, -179, -185, 72, 183, -28, 37, 191, -118, -121, 193, 257, 91, -36, -155, -70, 134, -10, 94, 229, -114, 47, 27, -282, -152, -11, -33, 161, 106, -50, 320, -199, -31, -75, -3, 27, 39, 31, -220, -16, -204, 89, -190, 107, 288, 210, 14, -86, 5, 87, -25, 196, 51, -58, 221, -149, -7, -201, 10, 40, 118, 381, 88, -124, 167, 276, -263, 59, 3, 44, -51, -135, 69, -240, 74, -111, 40, -13, 136, -23, 34, -40, -172, 110, 53, -103, -1, -105, -118, 22, 169, -134, -252, 51, -239, 114, -59, 86, 5, -58, -57, 50, 250, 54, 87, 110, 254, 28, -48, 63, 178, -121, -98, -223, 223, 122, -107, -20, 36, -85, 76, 98, -28, 155, -218, 28, -120, -54, -53, -76, 183, 120, -134, -302]
5790c02L03l5L16j2l01J54j94J33J59j04l10N1O6m2OQ8j18J98k38J07K31J23k08
5813G1k19K09n44N53o3r0K3J1m0K31O1j90p8J06K93l50J6j85L46k25j31M99Q3
5836C87j92k57K1r3m6J54J24m9R3q6Q9k55R9J85k35J48k95L41r6P9o2O7M4r2o0
5861A3J29J45l34l8o5L04k01r8R5NJ74j81K97l09J31K3l7M4j55L03j82l5l04R5
5885a81P7K63k01L04m63K7K63on5k96K97j74J61l0K3P6o3J77M1k28j73J70M7J03
5909A59j55J00j8J26j45Q1l5k98Q5N1k40N54m6k67Q5K77m48kL67j96L42m77L1
5932f9Nl5j03J89J65Q3j82l23L63J78j63l64KK79r9J53o7J61q3k95K13K94l34
5955c2L62j63k89L11o2k01j23L1J32j78K44j08Mj03P6mQ0k01R7J4N9K3k15K81
$$ y = [-302, 1, -34, 282, 270, -31, 123, -71, 62, 221, 117, -193, -142, -76, -118, -112, -24, -142, 56, -182, -75, 156, 279, 71, -148, 61, -483, 70, 7, -83, -60, -49, -89, 142, 203, 13, -65, 41, 334, -16, 0, -185, 161, -64, -195, 304, 387, 195, -62, -41, -134, -180, -26, 98, 49, 142, 56, 145, -110, -11, 174, -61, 87, -208, 133, 37, 116, 54, 121, 165, 73, 13, 142, 287, -47, -85, -150, 154, -47, -145, -50, -45, 129, -52, 245, -64, 67, 90, 53, 97, -58, 245, 63, 28, -276, -181, -104, 159, -42, 262, -201, -174, 89, 83, 28, -268, 29, -145, 16, -14, 9, 85, 22, 199, 240, 12, -161, 9, 56, 159, 4, 104, 86, 212, 67, 148, 113, -185, -100, -49, -289, 265, 219, -48, 37, 314, -134, -136, 231, 35, 377, -100, -69, -64, -99, -202, -13, 152, 235, 53, -270, 93, 271, 108, -256, -254, 25, -74, 79, 12, 173, 90, -205, 8, 302, -32, 330, 167, -122, 189, 127, -74, -197, -166, -34, -212, 32, -76, -72, -175, -99, -103, -23, -224, -127, -113, -54, -31, -246, 35]
5979C5J24k94L53l58kO7L3J29j67J3J32l12K16J33O9M6j58L1k9m9r6m5K35K1P6
6004B03P4k62J14J15p3p2j35k9L6PN4J92j58MJ14k4n4P4l31J84Q6k1M3j44J57
6029A54j88p1p2L43j10n4L5L7m9r5K58m6o7l26N22m21J60R7O6j95N8LK38l65J26
6054C8l4q0J5J87j62J01J99n65N99m37P1J01Q1M8k59J23K66k52K56l57l6K05P6
6077A84j89Q4p5J28k2j71L1J04L8j21K5K3j3q2J8K5J52k16K17m9k07q9J57J49
6101A01k95j01J24J14J93l02k3J84k04J97K0J08m08M19K14n82K1J02M7J95q3j2
6123B9J4j57J83l19Q4J16j2N8%jJ60l86m5M07j00j24j04M03l46P4J45O2k58K08
6147I1N1k93J60J68l52K60j98j4J45K10R6k91J69n2j54k09L29Q6r5J16q0l8r1
$$ y = [35, 159, -135, 218, -140, -142, -75, -42, 87, -80, -67, 65, -247, -31, 102, 171, 217, 59, 90, 61, 12, -84, -129, 106, 127, 203, 277, 15, 129, 244, 171, 99, -36, -65, -29, -22, 32, 224, 66, 70, 184, 160, 106, 180, -151, 33, 119, 98, 141, -3, 154, -34, -105, -177, 166, 56, 2, 37, 74, 25, -70, 188, 142, 75, -251, 271, -150, 10, 107, 173, -22, 36, 39, 277, -88, 38, 4, -76, -61, 126, -36, 65, 264, -301, 298, -139, -68, 33, 114, 162, -97, 26, 292, 40, 296, -61, -97, 108, 184, -5, 79, 4, 132, 110, -61, -30, 74, 112, -9, 16, 39, 26, -56, -38, -13, 139, -77, 140, 91, -116, -205, -48, 101, -194, -295, -171, -57, 136, -166, -189, -5, -209, -12, 8, 116, -292, 127, 341, -241, -220, -118, -71, 124, 41, 29, 43, -114, 69, -250, -166, -50, -62, -4, -4, -5, 155, -231, -276, 131, 31, -93, -197, 206, -140, -66, 79, 141, -117, 91, 142, -151, 9, 177, -175, 85, -113, -127, 18, 228, 324, 33, 202, 150, -4, -213, 116, 202, 107, 223, 143, 105, 14]
6170A4j06J47j61J00Q7Q8j69k9Q7k13J2J62j93L68l67J28O5l1L65l58J2j13K83
6193A78k92J99P5j05J88j18j18j32J68j19j26K01J80M3j78J8k4J02nj52J39j11
6215A1j85M51k08L6r7o7J60j39J66j4j66j54N19k43j58P5M7Lk24L15l06J04K27
6238A53j69L10l22J25K26n23K55K51m55k18N20m9k2J7l9j42K02j28K60k88p8M15
6260C01k56m0k69N40k79M9j65J09Q0j2k39N1K95k48J30k1j61J03j56J94J16n6
6282F6j47p7L14j37q1O9j78K66j28P1K34l29K42r1j79J89j22K1J69j80K16r8q7
6305B3j44J93j49j5r5K4L36k47j0Q8K34j55k3j34M6j94M16l52K26j67J50o4K00
6328A87l37L5J1J05J6L0m0R7q5J6J66k21N0Q3k52j34L56j08k28L56Lq2r9k4J88
$$ y = [14, -92, 55, -106, -6, 81, 169, 0, -29, 58, -155, -143, 19, -174, 194, -173, -45, 20, -11, 354, -4, 8, -105, 178, -114, 85, 160, 55, 243, 125, 7, -125, 43, -76, -202, -1, 179, 222, 44, 62, 38, 140, 135, -17, 122, 11, -174, 277, 69, 105, 8, -59, 101, -38, 128, 114, -52, -206, 313, 70, -88, -13, 34, 37, -187, 128, -178, -74, 153, -16, 294, -28, 97, 323, -200, 55, 306, -149, -367, 153, 104, 82, 99, 60, -82, 120, -8, 252, -36, -114, 301, 45, 5, -264, 276, -3, 46, -119, -10, 70, 58, -181, -130, 165, -83, 47, 26, -135, -32, -188, 6, 122, 66, -81, -158, 156, 19, -62, 7, -171, 95, -33, 38, 272, -57, 185, 94, -85, 104, -18, 3, 172, -8, 208, 110, 23, -121, 72, -77, -92, -187, -163, 173, -74, -84, 4, 238, 83, 60, -74, -28, -222, 194, -158, 68, -99, 51, -13, 187, -150, -115, -104, 1, 17, 47, 7, 104, 19, 35, 201, -20, 30, 113, -139, -273, 83, -25, -253, 103, 106, 24, -75, -99, 89]
6353H9k82J66j75k4J0J52k13L65j97oJ54o4M4L22j86mr9Oj25R7L7j33k04K38L6
6378Dj76L76k69N7J62J0j22J2K04k29r3j58J02J14P6q2j57K19J16j02N9j23r4
6401i4K48j68J20k75J69J04l71J90J06j82J50o5q3k0J60L6k12K77pr4J6r5J85
6424I5j62Q5J13N7l05K31Q8m68J43L1j1K17j2qj77J45k1n2j08j99M56j10l40J39
6448a73J55j40J02J29k98J93J9M9J01k10j38J42n3l5J55J60k37J45j13J10m0q
6470A5K06l05j21R5J71P6M5k17J27Q9m37Q5K74j02J09P0j90qK06j95j51J53k08
6493b13j88L30O7L12l81j25J64j24J17J70P1k07M2K33m92K75j03J22mj91o6R2
6515i9J09j57M93k83J4R9M3j37l55N15l76J99r5k85J71k9R8o1J01Rr7j7K74j35
$$ y = [89, -193, -27, -202, -226, -216, -64, -277, 88, -109, -115, 39, -25, 19, 341, 155, 151, 52, 58, -67, 30, 67, -66, -270, -32, 4, -172, 204, -65, -8, 154, 164, 42, 54, 258, 29, -64, -222, -120, -6, 70, -12, -169, 50, 166, 64, 123, 0, -94, 154, -14, 106, -169, 0, 104, -267, -77, 29, -153, -3, -68, -151, -171, -11, 25, -187, 90, 83, -11, 5, -90, 95, -67, 18, 131, 188, -117, 114, 202, -266, -123, -92, -103, 114, 102, 94, -83, 62, 41, -11, -119, -318, 138, 28, -312, -173, -18, -158, -56, 73, -225, -32, -13, 36, 137, -73, -211, -69, -122, -157, -2, 158, -79, 66, -47, 63, 23, 15, 221, -84, -205, -110, 61, 137, 182, -35, 92, 181, -256, -171, 103, 1, 110, 180, -10, -18, 188, -7, -158, -5, -213, -401, -71, -4, 308, -73, -198, -34, -158, -41, 129, 200, -7, 35, 268, -224, 51, -52, 70, 66, -125, -191, -99, 10, -147, 346, 63, 77, 176, 219, 82, -273, 242, -134, 65, -30, -315, -144, -173, -75, -136, -35, -26, -123, -140, 134, -1]
6539aj47K25j11K83q5K4l73K71n8j3k74J37o2J20N2r3j61N27j98k74K80j00J15
6562H4k84J7K66j89L0K03l5k2j14r6J25j99K40q0j4j42J03J30j07K13j96N6J54
6585A43m6k75M63j57k30J07J31o2R8j35J10k37L11k79K78k94kJ36Q4j55K4j46
6607a33P3p2L03k99J72J18k26Q6o8j78O4J02P8j7O9j81k1L3%j12k0j6M95j03k85
6632a38K6O2Q7o5j9N4J26l47K37k94J97M1O8k02O63p53J36O4J48j19J23m15N52
6655B32k15J69Q4l51M0J43nk58K28j90k54L44R3j21K91j36j95J96O7k53L17k95
6677f9m3P7J36j6m60K55j44K72J79l41j8K26j33n9K23k43K20j94L26l25K22J69
6699B60m31R2Q8j4M81m92L48k53O6j17k55K15L92k06l50J32j42j32J19P0J06Q2
$$ y = [-1, -148, 77, -34, 249, 164, 188, -185, 86, 28, 15, -259, -122, -184, -64, -12, -105, -266, 261, 63, -211, 69, -31, 84, -200, -183, 83, -106, -76, 127, 92, 70, -44, -140, -15, -214, 26, -54, -68, -210, -107, 23, -84, 129, -67, -11, 143, 97, -178, 285, 128, -102, 5, 136, 74, 172, 37, 147, -90, 221, -58, 220, -74, -76, 60, 144, -11, 13, -133, -60, -132, 171, -128, 44, 162, -64, 22, -46, -224, -160, -58, 20, 3, 72, -109, -130, -97, -97, -209, -229, -245, 250, 147, -138, -112, -50, 37, -28, -47, 7, 133, -214, 23, -271, -74, -33, 35, -167, 496, -257, -121, -57, 91, -28, 95, -320, 232, 17, 186, 270, -81, -41, 102, 97, -161, 67, -123, -377, -33, 60, -61, 230, 94, -101, 95, 162, -91, 226, -69, -112, -35, 101, 85, -375, -120, -264, 8, 187, -154, -172, 54, -79, -138, 85, -158, 62, -132, 194, -131, 91, 260, -171, -79, 9, -5, 476, -16, 332, 79, 145, 28, -227, -12, 380, 174, -176, -44, -186, -318, -199, -129, -23, 59]
6721E9M1l51M05j31J39l27J00J66j69j37K59n1J8R9j32n2J74O5k28oJ02Rj78L03
6745A77l03j08L21k27J5pP6n0j27J96J47j49K45k64K3K40l89Q8J75m2P1k72J62
6768bl23L25M2J79J11l51J21k09j39O12m20r1L44j87J22l55K94K9n6p3q0K03m41
6791c45M40r3K59j18K7m4r0j00J60J71k68m8O4J79k10J60o9l68K63m6nO7K23k25
6815a6k5k0L04l15j93L45j03K4l4n3j28J85l0J47m18K69j7J99J4m74K90N2j06
6838a03K52j27P5J72l34o2pK26k37l3L81k80J82l59K00J76j52J39k56J09K04j80
6860a4L54m23J56o4N1J39JO3k59J70l33K24P6l12O3K08j77J46j36k1K15l14J17
6883g0NK28l15j58L36K48k15q4J64l63L1K4L14k41M6R1N9l7j74k0l1J75l9J33
$$ y = [59, 100, -251, 154, 23, 162, -165, -65, 101, -68, -205, 54, 3, 21, 120, -12, -64, 110, 175, -53, -59, 43, 52, -126, 177, -126, -234, 87, -140, -125, -132, -56, -106, -233, -37, 110, -39, 206, -58, -35, 205, -184, -96, 79, 37, 108, -164, -2, -325, 0, 42, 221, 332, -19, 102, -107, -246, 366, -54, -145, 199, 12, 134, -221, 73, 102, 46, -27, -107, 96, -345, 95, 2, 261, 143, 170, 126, 36, -64, 96, 267, -1, -49, 15, 194, -16, 144, 75, -293, -30, -76, -81, -14, 209, -16, -41, -61, 243, -72, -265, 80, -23, 1, -33, -86, -214, -29, -59, 88, -330, -61, -78, 121, 135, -339, -49, 3, -103, 149, 22, 97, 269, -65, -127, -134, 92, -145, -178, 203, -77, 105, -254, -54, 122, -30, 109, -147, -38, 166, -14, 340, -83, 73, 9, 60, 199, 200, 263, 4, 174, -159, 65, 141, -171, -108, 100, -77, 69, -67, -88, 127, -187, -70, -65, 163, -152, -310, 26, 274, 59, -25, 139, -224, -193, -169, 145, -96, -50, 41, 100, 63, -111, -131, -162, 13, -26, 107]
6907A07n6j53K50n0Q3j95j11P1k10K78n3L7j56K09j38j86N30k38j98K82p7j54
6929a28J34J97j23k40j82M46j96J24J63j93J67j75J10J90l28j11M3N3p4M6J83
6950A06j91L72l06j16M4N0K41l18P6o4K04k8l34K49J57j48J77j99L6n0N5k45L06
6973G4m07J23K95j57J82j51R2j02r0K06l09K85j03k10J78J28J7NL6j27p7O0J91
6996A39l23L39j90p7K68j85J90p1j15R7o6R7j18Q0n5j13J28j10j07J93%J94O4
7019B59n38J56%L14l53J94l7j69J07o4K09k7J8j1k55K01M4o5J20l08M31j18m5
7042F3P5m57J14k5M32n5o6j04l1K35j81m2l8P4o1R6j5P5j79j52J27R6Po8J31j47
7068i6M1l7L29l59k97O15j52j33J00j73K28mj88K58j71m8Q2l0K07p9j92J06O4
$$ y = [107, 51, -102, 148, 98, 181, -14, -125, -54, -264, 14, -39, -2, -158, 51, -87, -273, 257, 19, -179, 103, 26, -128, 6, 203, 80, -160, -342, 104, -92, 32, 195, 2, 169, -6, 104, 294, -34, -145, -102, -49, -123, -77, 106, -85, 287, -19, -135, -91, -41, 200, -118, -42, -106, 98, 70, -264, -15, 142, -6, 171, -28, 8, -42, 13, -232, 74, -333, -210, 85, -72, 110, -41, 51, -51, -141, 65, -244, 41, -62, -272, -94, 34, 51, 56, 92, -35, -112, -52, 139, -184, 155, -35, -112, 156, -29, 161, 90, -25, 72, 6, 103, -15, 65, 10, -103, 25, -85, -192, 1, 1, 195, 259, -279, -123, -123, 191, -162, 32, -5, -174, -67, -131, 78, 51, 69, 58, -197, 4, 48, -17, 103, -205, 226, 108, 63, 138, -319, -205, -230, 202, 147, 81, -23, -54, 181, 0, -42, -80, -6, -67, 29, 14, 89, -90, -242, -115, -19, -12, -80, 51, -96, -55, -92, 237, -122, -419, 196, 44, -89, 11, -162, 66, 62, -126, 132, -39, -87, -5, -35, 172, 93, -99, 7, 71]
7091G1k88M11l06Q0k7j51Q1L39k04k08M15l21J46k2L33l36J35p5l25L23p5j59
7113a63K25o4K18l08J56l4K2m0j49Q1J37j81J27k08K10K6J95k04O7r9l5R2j39
7136f8J24J49j39j19J42M2o6j95K54j31q6J57j6O5k85J24Q0K4k5j09j4J68j56
7159h0M4j43K82n8n7m3R6O7j33K2K51l45R0M59m90P3j23R8Q3j46J21L4j58J69
7183A13k84J01R5l28L83l73L36R8o2j36r7k11M34j47J4J1J0K72n0r6k30K93k58
7206a12P8J11j01j39M42l84m3K66k09m9O8j88K16r7J88K7j22J46j8j14%J3q3K51
7230A47o2L0k70J36j3J0k71K06K41l25J32j41K65L05m27J50j34K62j70l2k2r6
7252g9P2j15O0N1R7k32K89j14P9k30k9p1K86J48j50K78m87j98N25j92j68J90J81
$$ y = [71, -217, 194, -112, -32, -59, -210, -129, 210, 6, -202, 213, -108, 38, 16, 349, 13, 148, 73, -252, 71, -4, -163, 62, -2, 216, -92, 64, 30, 52, 12, -137, -56, 81, -100, 27, -181, 29, 55, 250, 46, 113, 14, -21, 71, -68, 56, 205, 66, -53, 89, 131, 65, -130, 124, -7, -93, 64, 48, 113, -172, -48, 32, 56, 31, -78, -92, 76, -80, -36, -179, 103, 45, -12, -55, 41, 108, -25, -3, 248, -97, -7, 452, -38, 35, -88, 10, 93, -53, 68, 102, -56, 113, -171, -70, 25, -303, 80, -293, 43, 141, 79, -57, -154, -365, 69, -78, -64, -53, -43, 229, 179, 83, -147, 146, -112, -34, 77, -24, -163, 279, -105, -148, 118, -91, -140, -72, -260, -44, -141, 47, 74, -48, 98, 80, -34, -34, -21, -104, 147, 85, 115, -155, -19, -32, -22, -293, -87, 154, -171, -39, -180, 85, 390, -37, 113, -21, 241, 71, 39, 17, -79, -7, -122, -62, -11, 86, -146, 143, 29, 108, -122, -151, -222, 64, 212, 62, 340, -147, -345, 180, -12, -180, 10, 191]
7275A91n8m68L46J1J99k53J20k87K56k21L11k15M1k7qj3P9Q2J90l64kNNJ03p6
7300e3j28J87J30j02o6n8J51p1j20Ll7L56k25J46k36J64k34N17m53K86k1r2J18
7323A62k31K1j01L74k68L5M1J31o2O7N5l06j91M50Q9j79k41o8Q4J22K8l1M4J56
7347A81l41K58k33M01j9k35J12O2j52k3p1j46M17N7l26K10j86pL18k61MQ3j90
7370h7K79l07J4P5K2pJ11k00R7J10o9m00K57M05k71J33j14l28M45j49k7q8j41
7393b40M38l84J97j86m5M00k21J50Q1l31L06j96Q9J04l23N5K14j41j59k1J83j04
7415a34j7J79r0K02k5p1l14L97m36N52j9p5q2J33Q3l3l86K18Q5j46M8j36Q1j38
7439a24P6Q1j63L01k40oL37l15j97j7L93l9K60j94j17Q1M8j1j67J36j77r5J45
$$ y = [191, 133, -335, 11, 22, 221, -32, 88, -199, 57, -164, 147, -68, -27, -54, -62, -75, 4, 86, 276, -88, -90, -85, -80, 23, -53, -181, 6, 136, 34, -32, -90, 61, -10, -130, -127, -164, 192, -33, 113, -123, 41, -193, 324, -129, 157, 136, 44, 162, -69, -48, -149, 225, -43, -8, 33, 164, 102, 169, 224, -82, -273, 177, 266, 87, -154, -222, -138, -16, 12, -19, 25, 181, -160, 98, -135, 266, 247, 12, 124, 186, 34, 11, -60, -206, 211, 268, -58, 152, -34, -41, 277, 16, 20, 103, -87, 192, -115, -101, -26, -4, -11, 100, -100, -3, 107, 38, -362, -105, 300, 29, 162, 48, -280, 165, 16, -11, -99, -240, 198, -186, 11, -175, -220, 180, -41, 109, 190, -141, 165, -31, 58, 162, -161, -106, 108, -33, -192, -213, -30, -134, -151, 28, -62, 140, 115, 44, -270, 127, -309, 243, 224, 149, 67, 200, 283, 250, -136, 82, 167, 21, 69, -67, 14, -124, -48, 33, -130, 171, -69, -75, 262, -53, -250, -267, 126, 87, 347, 153, 36, 117, 165, 154, -13, 123, -54, -149, -4]
7462dO3l0j14J89J3m2R1l63L86p1k2o2N0j16P9j06qj4rL7J32m1rJ78k47n1n7l5
7490a83K8o3J25j4J83j06M01l99L33l66K20p6j73J70m7j09L6M6j83o8L33j43J84
7513A29j5M7J0k47LK2L22l82j5L5p7J41r2L09j47j13J45m5p5J51j66j44l4L0L02
7538I4n0M01l51ON1koj02l2J59Q8p7l17j18j97N02l9qJ42k64J08K6J4j40K83p9
7564I2l69K53j55Q4J50l19N20l56l1K57k02N0J61j64J75l69L89j28m0kn2J23r9
7587c2R0j67K07nk82L21nj89J24o0j6l07K94J14J21k08j69K2J02J50k1Q0J20l38
7611e4L5k4j15L3%O2K3J30k88k7K11pl9L0p7P1J53k27K72Jk98L37j62j81L7Q2
7637b2k9j41Q0J40q7J33l21N36k54j01kK31j85p9K23j99J99K1L4n2l05o5J37J54
$$ y = [-4, 59, 29, -85, 104, 117, 75, 166, -197, 189, 118, 96, 34, 84, -32, 47, -59, -67, -81, -90, -53, 79, 38, 29, 207, -40, -91, -148, -183, -155, -218, -93, -107, 76, -30, 371, -28, 305, -61, 159, 83, -90, 80, 33, -76, -40, 6, -177, -245, 88, -55, 129, 114, 161, 171, -76, -73, -51, 271, -111, -126, -91, -168, -27, -119, 190, 43, -70, 75, 30, -45, 106, -60, -204, -238, -208, 94, 44, 445, 94, 100, 151, 149, 143, 41, 9, 168, 256, 179, -138, -256, -453, 49, 10, 2, 144, -120, -12, 14, 28, -112, 171, 92, -277, -24, -179, -95, 55, -264, 256, -100, -131, 126, -76, -26, 135, -29, 146, -223, 166, 38, -2, -4, -56, 67, -32, 58, -109, 98, 93, -189, 132, 127, -62, 62, 2, -14, -321, -27, 87, 208, 0, -169, -147, -45, 105, 84, 164, 284, -54, -19, -43, -158, -125, -125, -63, -40, 90, -198, -225, -14, -21, -60, -30, -107, -36, 117, -110, 162, 163, -135, 202, 40, -141, -104, -22, -51, -192, -112, 28, -59, 74, -247, 289, 35, -66, -68, 163, -22, -101, 122, -77, 122, 143, 177, 125, -180, -245, -108, 46]
7661D6K62m54J27K77m65J29O5L12j44rm07N20J26n98N8K96k84r1K30K23j18k82
7683a81K64j34J29k47J66o1L7O8l3O4p3K52j70k49K03L3l14J03L54k94K01k68
7705a50J53j45j77L21J62L0o0m9o6L11n29r4K55J84j48J39j43N0R9r4Ll7m2K19
7729A92j71J15l33L26J04m09J25J34Q0J49l29j43j14M25j53J7J47j61k48K95P0
7750A18m4j20J27J36k46K8K94l33j48K17j16J06m7k2j08L16j37M4N1k68p5J37
7772i0J35m2K43m26J33J28j95J03K12j83j78L48j04L3k81R8p1J54L9j05J24K6
7794A01M9k33J90M6k3M0k03l4L3J9K8K73j65m07N95m43O9L0j32J08K29n47K45
7817a32m5K39J95n9j72j39j11J59K11j07j56J54L2j61j77L30M1J10l05K41j97
$$ y = [46, 308, -146, -19, 258, -207, -78, -13, 299, 155, 146, -261, 259, 385, -213, -155, 141, -143, -234, -4, 219, 101, -181, 83, -51, 78, -169, -3, -64, -27, 41, 8, 72, -1, 251, 81, -168, 35, 68, -246, -143, 211, -83, 118, -150, 3, -142, -319, 2, 164, 194, 134, 85, 19, 330, -199, -293, -38, 146, -2, 137, -6, 44, 143, 49, 52, 15, -27, 192, 21, 136, -197, 129, 233, -176, -51, 83, 163, 312, -17, -160, -274, 151, -2, 15, 162, 1, -247, 48, 118, 74, -46, 81, 217, -29, -1, 293, -40, -188, 29, -87, 19, -28, -50, -158, 158, 21, 65, 116, -152, -227, -90, 45, 3, 246, -180, -47, 81, -114, -11, 201, 18, -160, 188, 84, 117, -164, -66, -137, 17, 56, -49, 75, 101, 150, -83, 107, 153, 130, 170, -33, -67, -34, -15, 13, 286, 121, -286, 309, -134, -65, -35, -167, -59, 170, -377, -132, -177, 62, 257, 198, 26, -113, -224, -65, 146, 39, -117, 37, 69, -92, -269, 61, 102, 212, -93, 148, -49]
7838d9Q0l8k2R1j19j92M62k51m0L2J46j79J70k76M51L0k98K60m04K59k99Q8J48
7861E0j9L2k8K14k16j77M21m11j23J05L58l79J85k1l07K24l7M4J29j51K65j99
7883d1p5L9OJ29l78L90j12K96j80J94k0k66j37J47j77R0J37q9N3Kj10P2k6p7K6
7908a07K20k19R6pJ60l44J22J03j26M11o03L07J42j36q9j5L89j59k1L2Q1j57r1
7931a1rk22NL59k19J36L3j88j9M33n92K96p4K15j2j33l7o2m6M05l95J00J06p8
7955iJ3q9K39k31J1r8K35O0l98L47L3r0J17j11k28P4Q5J21j46K9n7Q9j72Q4OJ12
7981B6Q8o0J41r1j63o1L51j95j55p1J81L2Q2k66L35L5k55mJ62j49Q3m25M30K37
8005B88k87J14j3j58N19p44O3P1J13O8m0j49J97Kj42R8M7j95N3K28j60K5M3J5
$$ y = [-49, 31, -7, -29, 62, -57, -249, 213, -38, -78, -46, 100, -79, 91, -185, 266, 296, -2, 258, -146, 113, -186, -98, 50, 31, 63, 35, 249, 33, -144, 277, -134, -257, -152, 206, -173, 12, -9, -316, -92, -129, -85, 44, -107, 158, -41, -116, -77, -71, 58, -320, 70, -42, 254, 74, 268, 248, -18, -155, -8, -185, -95, 42, -47, 6, 8, -102, -30, -56, -133, -107, 113, -106, -10, -17, 143, -201, -79, 24, -102, 309, -294, 13, 155, 19, -70, -85, 304, 145, 124, 156, 237, 80, -11, -20, -242, -237, 122, -97, 39, 72, -116, -135, 298, -294, 2, -72, 143, 131, -2, -39, -101, -147, 258, -137, -37, 69, -9, 4, -85, 154, -77, -66, -164, 71, 131, -267, 80, 113, 23, 140, 29, -199, -125, -40, 81, -65, -36, -93, -4, -176, -92, -86, 26, 114, 54, 195, 104, -59, -120, 231, 36, -119, -190, -9, 23, 105, -161, 174, 209, -46, -50, 112, -37, 46, -379, 51, 288, 1, 115, 102, -56, 463, -281, -218, -147, -34, 34, -6, -155, 42, 44, -98, 0, 47, -148, -95, 133, -27, -2, 41, 56]
8029E6l21K38Q7P5n8N7k38J63j01K4j36J61J29j18k29L41k12K88j44r0J02N5r3
8052C6j10K3N1l2J45Om04O07k98J30k39K69m48J36P8q0K23j90K72n9j89J93j62
8075d2J59l20K65p4p7L10l41J11Oj18MJ43k88L61j60J90j31l4o8K34k05J36J06
8098A67m3J80j59J44k72n1mO4j34J2J84j89L27j99k48K40K00l83n6Q8o4L73j30
8121D7j90J68Pk67K94O4p2K19l67%p1R6J73j42j04j20K64R1m23N17j89Po0m1J84
8146H5QQ3k83K24M7o2p0K02k55K90k53m7M1J24k37M6J68lO6j83M5k2j44K94k76
8171a12k4L23p1j31l7k07K12q5ML46j38j83K08j60K44k27J55j54o4M33
$$ y = [56, -265, -27, 60, 135, 77, 134, -104, 59, -42, -18, -154, 7, 136, 18, -211, 130, -82, 206, 62, -28, 74, 129, 36, -74, -51, 0, -32, 113, 119, -285, 322, 24, 154, -85, 184, -264, -128, -50, -130, 93, -97, 175, 116, -73, 120, -42, 117, -203, 62, -12, -89, 221, -120, -9, -3, -121, -117, 26, -262, 99, -61, 129, -2, -36, -104, 130, -75, 61, 167, 124, 304, 145, 289, 17, -34, -38, 26, -108, -96, 88, -101, 226, 27, -221, 19, 219, -164, -220, -132, -196, 177, 47, -143, 25, 32, -235, 59, 123, 51, 270, -97, -97, -168, -72, 101, -41, -145, -265, -1, 90, -333, 184, -5, 2, -58, -99, 85, 93, 176, -107, 117, 164, 102, 32, 234, -21, 269, 16, -31, 10, 134, -103, -57, 111, 108, 174, -9, 36, 14, -130, 164, -112, -136, 187, 116, -15, -52, -259, -47, -132, -128, 218, 80, -103, 105, -55, 189, -38, 117, -37, -101, 332]
8191C32
$$ Imaginary data points
##PAGE= N=2
##DATA TABLE= (X++(I..I)), XYDATA
0@%%%%%%%%%%Qj6J6j6K4l2M0m8N6p2Q8j04J20j44J73k02K37k72L12l60M13m71
32b50N35o08O88p76Q72r78J095j223J362j513J680j863K062k280K519k779L062
49A605l374L716m093M513m977N493o075O734p487Q357r374J0584j2050J3872j6209
64h765J9324k3716L0418m2026O7742k29391R5006K90619l01540K1337J87347o7425
76C8930j26786J72288K7639j14602N3715Q0158j70995o2453J16193k9761j17206
87a32880J02270Q9792r1453m7155Q5710L4047l97J7384q746l1464j680j5672k0620
100b0864J5164J1354k9053n874n52l2901J5109O6733j580j2730N7237m043q3643
113b5643J8761P1595l8371m6852M0934j0669p9184J5166O5087k8272k5313O6421
$$ y = [0, 0, 0, 0, 0, 0, 0, 0, 0, 0, 0, 8, -8, 8, -8, 16, -16, 24, -24, 32, -40, 48, -56, 64, -80, 93, -109, 128, -144, 168, -192, 221, -250, 285, -323, 365, -411, 461, -517, 578, -645, 717, -796, 884, -979, 1083, -1197, 1322, -1457, 1605, -1769, 1947, -2146, 2367, -2610, 2883, -3192, 3542, -3945, 4412, -4962, 5622, -6428, 7444, -8765, 10559, -13157, 17261, -24765, 42977, -186414, -91408, 199211, -102329, -80992, 106355, 38930, -87856, 84432, 112071, -2531, 51184, 131342, -39653, -102106, 14087, -15674, -132880, -30610, 59182, -32271, -79426, 6284, 40331, 39934, 57318, 48572, 17108, 15428, -244, -20864, -5700, 5654, -23399, -29273, -29825, -62726, -47617, 19116, 17536, 4806, 62043, 58000, -25643, -6882, 64713, 26342, -20510, 20424, 9755, -69429, -54263, 10824, -17448, -42761, 23660]
125B3660J6487o2620Q763N7085j0297k3282K1141k396m3552k1984J2202R430J249
138a4114J1199L867j8826n946K3429J7013l566O951J9824j2874m1585k413K9827
151A2786j2062k2904K2280M932l7591n96L1149j357J733L2073j673l8288N314
164d204L1098j7819k1512K8679M651m5298j1879K1238J333K967J8504M71p423
177H06O434m96p341J3369J8960j1068k4908o556o21p588L914P367K010P897k959
192g80j6287R626K6733J290o798N858m068j8156p495L932j335J536O788j3043
206a2199j8911J5461J9772p822N912K6723l530k3957j092R360k301j728J900j0328
220b740j5265j196J231m912J3154K2924l149j1941O327N848j377M957N096m308
$$ y = [23660, 40147, -22473, -13710, 43375, 33078, 9796, 30937, 28541, -15011, -36995, -24793, -15363, -14114, -2915, 952, -17874, -23820, -391, 16622, 13056, 20007, 39831, 26957, -14628, -17041, 12786, 724, -22180, 100, 5032, -32559, -33155, -2006, -3363, -1630, 30443, 28770, -9518, -4204, 26894, 9075, -12437, 16242, 20893, -24405, -36284, -15046, -13713, -10746, 7758, 8229, 806, 7240, 6744, -597, 12772, 31732, 20664, -4244, -10800, -11421, -19009, -15095, -7728, -5718, 2179, -780, -17067, -7441, 19292, 20582, 13784, 19642, 15574, -2582, -10077, -6145, -7480, -5944, 844, -12199, -31110, -15649, 4123, -3699, 2213, 28936, 25406, 1449, 357, 9717, 7416, 5688, 7588, -2740, -18005, -19201, -17970, -22882, -9728, 13196, 10047, -1894, 4433, 10281, 8904, 13861, 18957, 14649]
234A4649r006j1482j1803m808Q753J0182m055m488P421K713j974R370J3941O600
248B6013l823j3009j0528j876j620j643J41j788k320n241m901P535J5589J0502
262A3031L155k292j711j639n538j867M460j190q019r694j0461o45J1238O119J671
277c382P266O609l688o808N377J2783L45r229m380p265j0580k380J926K659P658
292c089K447n404k329P078J0653L625n76L465j774j2991p865N89K181K348k341
307c983o661j654K583L247M627P317Q704K060j0163p022L690K221k784k464p20
322a002k531p552m496O211R067L855K918p03m005J467J755j330J277K637l189
337D379r911p827L531O326P8J873M895r73k758mK271N615L510l444o875m987j928
$$ y = [14649, 5643, -5839, -17642, -22450, -13697, -3515, -7570, -12058, -4637, -1924, -3898, 5472, 19413, 26013, 22190, 9181, -1347, -3223, -4843, -6486, -6345, -8133, -10453, -15694, -20595, -13060, 2529, 13031, 16186, 13894, 12183, 10544, 5006, 3139, 7599, 6409, -1610, -11304, -21765, -22410, -11172, -5053, -3382, 3884, 10493, 6805, -3, 5374, 18157, 18502, 9273, 4893, -2372, -12952, -15332, -13406, -10747, -3089, -642, -6046, -8375, -1297, 9356, 12981, 12405, 15870, 14096, 1105, -6760, -6171, -3990, -1642, -3983, -10644, -12298, -9715, -6468, -1841, 5476, 14180, 16240, 6077, -945, 2745, 4966, 2182, -282, -1002, -3533, -11085, -15581, -9370, -303, 3552, 6470, 5767, 1762, 3229, 4984, 3654, 4931, 7568, 4379, -5532, -13359, -9828, -3502, -3424, -1551, 3344, 2371, -387, -391, 1880, 7495, 11005, 7561, 686, -4301, -6229]
354f229L33j191K481O538j190o196O59N484L829K962P89q1l910p022j512L08j80
371d128L676N20o407k498M777L697J307L688N590q63q016k575L341j021j066L56
387C78l406m083j97q64J565O714O193j1m794J37L786j078k200L457k19o263n050
404e935k329k58L807L359J001n48L56K240r4m19O287M043n441o240j700p46j354
421c971r03J762J980k007l016J379K665M768M352q32j601K48k329l145J8K278
437A646Q37m360m901m1J485P18L308L562P74L63j828j555K424K471J265k436m356
454f24j522o36l419Q63M540J311j663j841Q26K679R59J833K647j079k667j559
470F48k404r61L053J138k877j901J07K14m72J674M931J111k799k0p00j700L132
$$ y = [-6229, -5896, -7087, -4606, 1932, 742, -5454, -4795, 689, 4518, 7480, 8269, 8188, 4278, -2744, -4256, -3948, -4128, -452, 68, -6339, -8837, -4060, -363, 944, 4632, 10222, 9359, 1343, -1232, 2109, 1088, 22, 378, -3028, -7111, -7308, -8172, -6607, 107, 6300, 6289, 1495, 1632, 5418, 4340, 2140, 5597, 5378, -885, -5935, -8264, -8522, -4715, -1356, -355, -903, -547, 1693, 1599, 1180, 7467, 11510, 6069, -171, -1871, -2617, -3971, -4874, -3112, -1132, -3139, -6155, -4776, -2111, 2657, 7009, 6177, 4576, 4824, 2495, -650, -632, 1646, 2483, -1877, -6778, -6819, -5334, -4616, -1308, 2254, 3028, 3391, 1563, 8, 2432, 4903, 6168, 3732, -624, -2146, -2782, -6201, -5338, -798, 513, -1150, -2991, -2165, 514, 1473, 3306, 5953, 4874, 2207, 648, -1756, -2717, 336, 1474, -1403, -3304, -3197, -2983, -3455, -1781, 3150, 4261, 1462, 1442, 742, -958, 2174]
487B174J937l281n86O56l561l461K817M515k75k404J486O32k622J697L096k71
503B549K95K64l887k642K251J650q22j39R97q13k694j88K799J595J203K0k576
520a38n49J116j292J69K099P12j917k193r99J818J784L88Nm3n74j523j304J909
538e32K822r09p12m46j901j06J650O3N80K131j053k930j012K008J595j132n9J003
556A060k163j762J475R29R21K088j146j868J83Q61j93K49O69J144k269l123J67
573b778J688j91J295O79p15N7m64L55J464P86Q60k74l412p59J180p45r80J377
591e77J114j869j711Q92K088J096P04J405r59j237P02j226j058J866n7k742j721
608c290P42M36j66J341K352O3j241O77O7l34J917P62k499r04k41j535q76J97J591
$$ y = [2174, 4111, 830, 244, 900, -2661, -6122, -3305, 1210, 935, -1469, 17, 649, -1973, -276, 2820, 2549, 2844, 3108, -779, -3421, -1170, 480, -342, -481, 516, -297, -2991, -3179, -380, 1215, 2418, 2438, -138, -687, 429, -863, -694, 1405, 2117, 200, -1993, -2992, -1174, 610, 998, 1003, 960, 386, -1137, -2441, -532, 2290, 1381, 669, 223, -1678, -1784, -134, -71, 509, 2640, 1587, -1343, -2355, -347, 1248, 116, 57, 1060, -1103, -2865, -1390, -461, 460, 2548, 1402, -466, -283, 578, 385, 634, 1303, 2447, 178, -2945, -2778, -1090, -1281, 14, 693, -22, 35, -429, -74, 1390, 2176, 3036, 2762, -650, -1409, -229, -974, -1954, -577, 537, -1332, -3043, -2151, -63, 1033, 1737, 3142, 2183, 946, 1648, 422, -636, 1230, 1173, -1569, -3290, -2548, -2112, -2278, -937, 1415, 1478, 237, 914, 981, 647, 2564, 3326, 827, -77, -318, -1853, -2729, -2532, -941]
627i41J024j270o97J744Q1R47J318L08J89q55k022L6l06J18K30j066j268N03L45
646a582m35J408K183M33m43j095N52L17j148J092P0j707m39p95j181R46J911q0
664Go77K23J024J24q10J061J598p95j550J87q16n19N95J37k72j11r3l12l65J043
684c21J814j24j537P64O3q47L84N75m0k05m86o15r56L63J197K43r08M78O98j536
704i96o0J737L13j57n33J54l6p90J71Q87n25j99L88j198o89J255J69j0Q8L4R4
725I7k88m08J895O0n16n03j02j037M62j39M0jN36m52p53l4Q71J182r55P26P04
746A385o87o77N81J13L3k52r91k58l73k65J108j11J17P31k62q36Q44O10N32l84
766I58or7p32j171N32N27n83J37M7q41M55O03j50L32P67K84n54m41J81O38n77
$$ y = [-941, 83, -1187, -1884, -140, -59, 888, 2206, 2514, 2703, 1848, -174, -138, -444, -326, -96, -1162, -2430, -1927, -1582, -2017, -609, 1574, 2007, 1564, 469, 1021, 1338, 190, 1282, 1352, -355, -794, -1589, -2770, -1824, 87, 7, -670, -447, 577, 701, -109, 952, 2550, 1755, 205, 392, -424, -943, -348, -211, -483, -594, -687, -999, -1364, -321, 1493, 1369, -168, 596, 659, -188, 196, 771, 731, 526, 40, -575, -1531, -1168, 29, 272, -636, -158, 540, -996, -1056, 681, 994, 837, 304, 458, 422, -368, -197, 690, 165, -34, 354, -844, -1533, -278, -109, -119, -31, 3, 97, -191, -599, 1296, 1356, 840, 337, 235, -802, -340, -479, -439, -440, 96, -356, -1109, -1143, -272, 910, -45, 681, 1385, 698, 21, 602, 715, 748, 496, -495, -753, -1126, -1391, -283, -394, -277, 454, 192, -644, 200, 810, 1342, 958, 952, 855, 123, -1048, -516, 11, -572, -435, -388, -1229, -774, -171, -321, 11, 778, 1062, 508, 67, 248, 886, 309]
787C09k34L84j052m52N05m39J97P35O04k27q52M04P34n0k12Q27n9j133k93J87
807a17j37j01N4l30o4j80M63K37r2R51N19r53K2L75l37O7j00J54k13r20j33L61
829d74m10P01J69o35R5P88k94NO65K5N68q67o58L86O2o45N23j62o10K26j39l74
851a055R24L88J24Q3m26M73K41n88L98n0l27p89J75m71K44K41k90O62l65K8M43
872F3k8K91J110r17l3J54l40j94n15M1M05o64l54L43M2N2R92j34k30K52M47o22
894A61K10P9q8m0n14p3j73n08L21L23l7R5R6j22L02O23j39L94o92kL44m87j91
917a18J91j59l70p2L29k81k23O57Q2l3n0O25j97j87L29K77p57J9J52l26m72O0
939e24L83J84o86M14J02k01M43L76m55O4P41m65m70K82lj66m68k6L94m93K42k
$$ y = [309, 75, 459, -593, -1045, -540, -979, -782, -47, 557, 330, -522, -118, 616, 566, 354, 1181, 1122, -11, -304, -117, -254, -355, -301, -631, -695, -875, -412, -175, -267, 684, 1203, 250, 272, 647, 310, 377, 277, 431, 218, -702, -835, -474, -884, -183, -14, -649, -554, 234, -60, -55, 610, 635, 1203, 336, -322, 64, 126, -519, 4, -158, -768, -542, -681, -1055, -131, 257, 381, 464, 38, 511, 752, 164, 562, 512, 185, -604, -429, -900, -656, -415, -705, -43, -408, -380, 63, 35, 326, 1436, 519, 486, 640, 300, 106, -409, -368, 37, -627, -981, -638, -596, -544, 448, 314, 84, 336, 783, 161, 371, 450, 362, 322, -192, -265, -438, -946, -625, -302, -339, -244, -148, -270, 32, 655, 516, 910, 218, 216, 560, 73, -118, 73, -86, -456, -528, -199, -480, -703, -46, 36, 3, -47, 578, 381, 194, 523, 800, 43, 62, 214, -112, -584, -524, -141, 43, -643, -229, -127, -328, 115, 491, 36, 100, 841, 376, -94, 188, 185, 19, -449, -475, -81, -574, -332, -334]
961c34K78l26N22J25k76K88q6L64j33l70N65p56k88K76M1m81K92J76j08M9q3p8
983c43N95l12M08L41q54M69L44p43k22N97m45m81K56j27K65J26J09K99m88K22
1003A6M63m3NK76m20k37rl63P2Oo03M51J71l24O9N76p6L00J82J17j37j25K66k20
1027D13m31M2N0q59p7N97j14j45P56k40N5J51j52M01j83N70l30m33k73K31K0o02
1049e53L53j61j85K41k11P1L91K27J63K75k45J26j15j80J59k55l91n4j65m2J00
1070d51R6j64O71k82M0L39j20K93J26Q7l43o6j45k34j25RK37l45m73N58k6n3L47
1093b4Q3J41p2J78L38j51n15L34J16n27j21J23m56p1N70j83J67j38J04L11j69
1114C8m2L76j18q2j6k0l90M24l82l53M12k12K06j80J27L85o6R0J61J98l43K24
$$ y = [-334, -56, -382, 140, 265, -11, 277, 191, 555, 422, 52, 617, -139, -427, -151, -110, -591, -299, -123, -231, -182, -265, -343, 252, -60, 348, 689, -165, 304, 648, -95, -317, 280, -165, -646, -390, -517, -252, -126, -17, 282, -206, 16, 479, 436, 441, 717, 297, 60, 51, -312, -240, -234, -837, -386, -215, -539, -470, 106, 30, 330, 512, 629, 492, 367, 633, 413, -18, 24, 74, -785, -862, -265, -379, -524, 232, -8, 47, 198, 46, 447, 264, 834, 504, 71, -202, 29, 49, -553, -200, -361, -546, -305, -516, -445, -54, 173, 336, 611, 366, 492, 377, 197, 356, 101, -290, -344, -509, -551, -451, -355, -519, 152, -130, -90, 249, 129, 422, 548, 635, 292, 226, 81, -153, -278, -269, -32, -377, -850, -292, -318, -371, -24, 59, 200, 128, 306, 644, 493, -22, 312, 428, -99, -220, -97, -553, -624, -54, -237, -70, -208, -104, 207, 38, -4, 372, 254, 172, 156, 136, -254, 170, -212, -565, -153, -365, -159, -339, -212, 173, 107, 197, 358, 556, 213, 437]
1136D37j91k39K30j53k57J9k70J94J49l83N44k32K99n3K68j14j21K89l63J18m7
1157A24n7J13p99N6L78j36l12P17k11L2K43j60J44p5Q9K91k12k50K03q5k83J31
1179e9l5n67L61J66l16L24Q7K34J53j97j8Q7J6j59J85j54k58j39%p7k02L7O10
1202G9j5l68O16O7m71L36m6O4k48k6J13j31j07K97l45j06J5K85l20J85O12k32
1224B54O9k38Q2m9J70O6j61l40J78P4m93o7Q9mk22P21l2O9nj74M22on0J29m37
1249D5j30o8J34k37J50j86J51O6j09N4K77j44J24L62l43J19k73K19p4k11k35J83
1271a26l46L52%j48m5L67k4j28L09l6P3qN1j00k13o3j63PJ03J49k93k98M68K0
1295i2n0j4n3K77L49m52L26K29n24%j01R6j21Q7l55K04K12n53M43M5J72N8l00
$$ y = [437, 246, 7, 237, 84, -173, -154, -424, -230, -81, -464, 80, -152, 147, 94, 362, 248, 127, 416, 53, 171, 124, 67, 180, -619, -563, -185, -321, -633, 84, -127, -95, 148, -12, 132, 57, 146, 437, 225, -25, 178, 93, -190, -59, -94, -661, -300, -134, -450, -126, -39, 195, 348, 151, 133, 220, 236, 77, 262, 108, -150, -289, -289, -366, -568, -531, 79, 64, -304, 312, 379, -92, 244, 198, 262, 14, -12, 101, -30, -137, 160, -185, -291, -276, 9, -311, -126, 486, 254, 323, 85, 167, 118, 288, 354, 193, -147, 31, 105, -388, -455, -366, -370, -592, 129, 97, 166, 161, -13, 409, 403, 353, 482, 45, -85, -153, -19, -256, -106, -292, -141, -75, -184, -130, 147, 3, 127, 489, 146, 265, -8, 211, 137, -74, -309, -126, -472, -120, -120, -268, -313, 54, 30, -98, 211, 175, 248, 240, 291, 191, -22, -85, -248, -241, -138, 11, -282, -580, -112, -92, -142, -156, -209, 68, 417, -35, 291, 520, -4, -4, -105, -9, -130, -43, -398, -194, 18, -535, -92, -47, 125, 183, -117]
1318a17M31Q5l68j64L05l84J67K09m49J05Q6M7j93L21k3M9l77K07N28o9m20J80
1340A56Kj92R8k27r5K19l78K68k6k66K84K71j2K36n1p8k1K42k86p3J36n63N46
1363A90j42k63n7l6j3J27J88R1K8J9q6L1l1J79r3k17j54K82k36Q3j12J48k02j47
1387d23M68Q1l03M59J18q1k05P4O5k95J77M3j57j30K8j03J56O1k44M03Q1Q1l18
1410C6J49P4R0K4j95n9k12J99l13QJ09o8J73j50n4J93J27j5K29k16J05q7j23L2
1434E6O8q4l03R9r7J59j6m8J79K79n65L23J66k07M49k77k66L94m46O3L7m94K00
1457c31L70l79K37k2j12K55K61j28K24k82k43L69l27P7J37k31l5J09l25L22M9
1478eR9n5O9k25LM25j75N9j59P8J38m14N3J27j01j83M79o02N4K06J38l5L39o41
$$ y = [-117, 314, 399, 31, -133, 172, -212, -45, 164, -285, -180, -94, -47, -240, 81, 58, 107, -270, -63, 465, 396, -24, 156, 158, -34, 64, -163, -258, -39, -417, -149, -175, -441, -157, 114, 102, 338, 287, 209, 188, 430, 144, 71, 207, -356, 190, 48, -215, -272, -308, -321, -194, -6, 85, 113, 132, 46, 77, 46, 225, 132, -85, -239, 43, -193, -110, -222, -74, -276, -423, 45, 126, -177, 282, 400, 319, 114, 188, 253, -42, 135, 178, 21, -109, -81, -184, -28, 33, -211, 192, 273, 354, 36, 185, 259, 349, 373, 178, 119, -93, 106, -207, -199, -90, -158, 15, -135, -189, 4, 131, 116, 345, 129, 234, 147, 24, 56, 124, 40, -263, -164, -261, -102, -118, -166, 13, 292, -273, 50, 216, 9, 458, 181, -85, 309, -137, -74, -37, -531, -331, 39, -340, -103, -125, -237, 18, 279, 151, 375, 93, -150, 219, -108, -31, 106, -125, -160, -51, -376, -54, -5, 94, 39, 108, -117, -114, 311, 136, 195, 36, 114, 252, -162, -109, 18, -83, -266, 213, -389, -335, -129, 9, -26, 313, -328]
1502c28M32n0k16L53O8j27j73M17m08O4j25J65j75k03J57P2K26l63K37J54J12
1523B89n9l93J21R6J86j64k07J11O7Pl27J08K2LL17k45M3K44L6j08O9j90K90l86
1547g0j66J89k87p8K43m1K29j09L7P0Q1K77j86K97k15j99K04l32L2J54l35j1N
1570b11J35j99J46K9J34J62j65K33l0k76o2L14l8l20o0m0p1K96k51qQ1J95J08
1593A02j42L64j34j58o9K92j61k17L15k17l77L53j29L28n59N13j22j78O2J49K20
1614B35m6R8j11q7J35k71m2J19j77J01Km2K34j89R6K45r1R0j17p8p3J49n6k84
1638a60J17l0J52k71J57J27j96J57j61Oo5N5R0J01J24Nj49l0no3Q9k48L59k13
1662e2j20J02q2J87o0Q8j03R4P1r7K20m17L50k7k68q6J06J41j03J06p4k00L47
$$ y = [-328, 104, 54, -162, 191, 259, 132, -41, 376, -32, 32, -93, 72, -103, -306, -149, -77, 149, -214, 23, 177, 289, 230, -163, -42, 54, 240, 76, -131, -20, 47, 54, -273, -165, -143, -140, 177, -68, -25, 219, 255, 147, 216, 26, 316, -70, -236, -47, -334, -412, -169, -210, 19, -90, -53, 17, 98, 375, 189, 486, 271, 72, 276, -56, -24, 130, -205, -216, -211, -76, -275, -129, -100, 34, 196, 31, 264, 234, -42, -104, 210, 172, -148, -208, -248, -319, -23, -274, -282, -201, -6, 102, -40, 324, 190, 32, -37, 255, 94, -123, 192, -25, -402, -49, -178, 150, -409, 104, -18, -196, -134, 15, 235, 189, 287, 176, 89, 224, -47, -89, 30, -147, -46, -44, -86, 148, -41, 55, 300, 209, 299, 182, 104, 31, 180, 124, -160, -43, -73, 79, -192, -35, 92, -104, 53, -108, -102, -167, -112, -22, 79, 203, 208, 59, 29, 24, -39, 50, -198, 161, -52, -172, -70, -152, 35, -25, 63, -40, 54, 125, 28, 248, -169, 181, 154, -114, -200, -94, 47, -56, 50, -24, -224, 123]
1685A23j82j88L78j03L32l71J31Q2k79j65P0K1J31j43j5K10L1j25M7R2l57L73
1707I3J11J20p5j22l33J80J19J15j81k82K1J63J64k9Q7OL0M7j94J57k2m4l00K48
1731G9M8p6k25N8K27j89K0oj74J97L4K20k1l98N74m82K30k43mo5j9L04l02K8J27
1756e8n7k47L58J70J04m46J1K64K9k21K2o8Q9M4J02j56J13j43O2j28j80L10J86
1779A60K2k13R1J7N7k33K5o8k6J95p4j02L14j17j44j9L14P5k68J24k34L20k48
1802c2K77l40J84Kj13q4J62j38K27k25j35K68M4o5K3j08J03Po9K0M1k63j15K50
1826g9M2K2K07j87K5l6k26M12j93j08K24j90Q4n1J45O6k03OK6k56L70k20P8j41
1850a83K18o5o1n3K39j21p7P9L03k98P3r3j16R7j41J1k73P00j19K4l60L44Q0q2
$$ y = [123, -59, -247, 131, 28, 360, -11, 120, 202, -77, -242, -172, -151, -20, -163, -178, 32, 63, -62, -15, 77, -280, 93, 204, 324, 249, 127, -206, -26, 93, 208, 27, -255, -234, -71, 93, 64, 151, 157, 187, 234, 40, 197, 175, 131, -169, 79, 127, 51, -174, -116, 111, -78, -58, -64, -238, -41, -7, 213, 192, -206, 368, -114, 116, -127, -131, -196, -215, 89, -213, -185, -58, -115, -362, -4, 166, 270, -176, -165, 99, 128, -93, -71, -139, -50, -6, 96, -60, 53, -90, -28, -156, -336, -26, 160, 182, -31, 60, 77, 134, -99, -74, -142, -168, 27, -47, -149, 165, 48, -96, -115, 199, 274, 6, 130, -104, 216, -32, 245, -95, 89, 91, -22, -106, 56, -82, 145, -80, -215, 53, 97, 32, 55, -53, 50, 57, -12, 8, 49, -214, -329, -79, -37, -15, 192, 5, 30, -6, -232, 180, -13, -121, 103, -87, -3, -54, 91, 157, -46, -40, -14, -270, 100, -120, -42, -183, 35, -30, -91, -144, 95, -26, -103, -24, 279, -19, 54, -39, -155, -58, -199, -188, -461, 239, 120, 144, -216, 128, 208, 126]
1874A26qJ21Ol68L73k53j60J37J32j24j3K25k51%J8j40j8J74l7m4J43j64J16J67
1898A58k6J02l10K3Jk72K17k13M25j52J58J3j27J5J26J01l97K23K6J0j05l2N2
1921A6k37K08R6k88L57k6o0J53j59K90k52P8j51j99K45J03l09K89j08j76p1K83
1943H2l28O80m28J81k72K91mj35p9j80L30o9k52PM68l62K04k7Rk21J7J91n4Q2
1967A31q8N7j57K32N5k13M7K6k31n9J39k4l5J39l9J90k23R1P8j91M8K62k19k23
1991b07M6L30o93N50k04J98J64k23J94k22NJ59k17K46P6j18O2j34j14j19K51J2
2013D2m0j02J24j49J41P1l07K69p5K97j73r6N1K1k21K86k13j73mK59j62J66j71
2036a59J00j39K49ll3M7k56J64P3K4r8j00J90j20j56K08j3PJ07N1k31J6J50J2
$$ y = [126, 118, 239, 245, -123, 250, -3, -163, -26, 106, -18, -31, 194, -57, -57, -39, -179, -197, -23, -60, -104, 39, -125, -9, 158, 132, 234, -76, -53, -52, -324, -107, -320, 105, -47, 111, 124, -3, 12, 138, 239, -158, 65, 91, 101, -4, -36, 16, -221, -13, 83, -205, 152, 126, 66, 219, 60, 350, 98, 176, 25, -174, 71, 174, -135, 154, 46, -130, -201, 82, -246, 434, 6, 187, -85, 206, 202, 67, -12, -192, 138, 69, -183, -176, 292, -70, 134, 107, 116, -105, -88, 103, 49, 131, 43, 100, -57, 175, 230, 17, 64, 90, -141, -200, -61, -85, -120, 19, -20, 170, -53, 38, 116, -75, -27, 235, 16, -207, -161, 169, -524, 26, -178, 20, 184, -39, 155, -67, -62, 97, -120, 126, 202, 84, 146, 12, -102, -221, 30, 42, 2, -100, 24, -125, 16, 87, -220, 49, -26, 271, 98, 2, 53, 74, -147, 139, -74, -247, -251, 8, -154, 12, -159, -59, -198, 51, 48, 15, 62, -194, -30, 43, 67, -31, -131, 59, -61, -217, -9, -22, -15, 92, 143, -88, -72, 78, 90]
2060I0l49N56n8k74m0K62l23M08m54J01J3J31q5m1p4qL09k23J93O5l06L16r4j41
2084b6n0J35j51q5j3k19L96j95l4K80k12J71P1K32j02P7k76k07J97M8l11J27J47
2107@k13J20J03j19L16K2K44n12j68M10k61j4O9m7O3J6o9j97nO2K35q6j46K50
2131G3k01K14l9O3n05M43O6k53K66o9k12o9Q7j15K06M3r2K41m02K56R9j02K44
2154B42j58m32J72K32j11J3J15j18J62k27M8J31L8j62R8K16p6r9m89K84M1K56
2176A76m33K25J47j91J75r9j04L30j92j48J00J06j6j35R1j5qj93L75l6k38jR3
2199Im13L70k05O1K90m0J71k58R6l1K7RK9k88K12k26j13J69K02K3k01j03K76M6
2223A12rO6k39O5K5J6k4K54m6m78J97j66K06L7k5R7l17L77k43M7k5J16K45j74
$$ y = [90, -259, 297, 239, -35, -75, 187, -136, 272, -182, -81, -68, 63, -22, -63, -137, -145, 164, -59, 134, 199, -107, 209, 115, -26, -76, 59, -92, -177, -190, -409, -13, -208, -242, 38, -174, -3, 68, 300, 198, 275, -1, -208, -11, 37, -274, -147, 0, -213, -93, 10, -109, 207, 229, 473, -39, -207, 203, -58, -72, -3, -50, 13, 29, -40, -237, -242, -180, 55, -31, -177, 73, -128, 86, 47, 110, -395, 48, 114, -139, 127, 58, -154, -223, -136, -251, -45, -2, -94, 147, -255, 1, 100, -2, 242, 84, -348, -176, 56, -55, -42, 73, -45, 117, -110, -62, 69, 107, -55, 43, 259, 183, 84, -405, -121, -80, 176, -257, -32, 115, -76, 99, 0, -104, 226, 34, -114, -14, 92, 76, -59, 32, 17, 9, -184, 191, 155, -83, -84, 9, -404, -34, -239, -178, 112, 72, 243, -15, 81, 50, 77, 86, 115, -173, 39, -187, -300, -131, 71, 94, -107, -210, 66, 112, 103, 169, -70, -5, 20, 36, 12, 266, 220, -258, -61, -227, -21, 16, -9, 88, -229, 148, -95, -48, -73, 43, 288, 114]
2247A14l13J76J47k15J68k07J94j45J89j92J95k74L85l7Mk99L17j56l5R1j06r6
2269i5N7K2K9J01k68M3J05nN6p4k15K70qm2L0J12j35R7j78l1Q5P0pJ56l63K63
2295G5O7k85K46p5j79K06j43K31l36K11o3K36om20L50l18O8J41o6k2Q0jj71J65
2319ij24K26l8j23j1K05k03l03K30R3J64K2k37n2L59j2o8l28M02K00n00K3Oj91
2343b69J44O5o7L67k07j66K35r0N6N0j95K02j48j02N9L4J8op4J58p2k93M71j0
2367A60l6j17j06J8j36K58R8RK9p4j13m3J08P2M4m94M11Nj87M1J29K6k45K43k16
2392a16J71J72k79M0O1Lj62j59J89k37K05j6K35r9RQ9R9k93N8J85j65J83j86l2
2416d5J51k51L5K35l41K35q1K32q5k80K03J60q9j95J71M7l2m6n7r0J25Q6k20n0
$$ y = [114, -199, -23, 124, -91, 77, -130, 64, -81, 108, -84, 111, -163, 222, 185, 189, -110, 207, 51, 16, 107, 1, -95, -38, -16, 13, 114, -154, -111, -6, -11, 45, -29, -244, 26, 18, -24, 6, 118, -17, 80, -98, -129, -44, 26, 19, 175, -188, 75, 142, -143, 103, 28, -151, 55, -88, 143, -193, 18, -45, 191, 185, -235, 115, -203, -135, 6, -60, -82, -2, -3, -174, -9, -133, 93, 55, -68, -79, 126, -77, -380, -150, -57, 107, 129, -108, -160, 199, 187, 119, -209, 193, 393, -107, -84, -78, -269, -125, -60, -127, 240, 33, -133, 102, 12, 68, 118, -77, 125, -23, -125, -66, -32, -14, -20, -94, 64, -8, -301, 170, 160, 124, 7, -99, -81, -217, 41, 139, 148, 177, 103, -10, -53, 55, 127, 171, -323, 88, 93, -94, -53, 76, 102, -143, 100, -116, 55, 227, -52, -12, 49, 52, -110, -269, -80, -317, -112, -128, 107, 8, 17, 106, 205, -88, -30, 155, -10, 173, -13, -45, 106, -145, -110, 125, -216, 19, -62, 170, 85, -195, 8, 168, 79, -116, 55, 102, 70, 24, -33, -123, 2, 88, -132, -182]
2440a82J77L0k25n4K99L4J48l31J90r7J35k34J56K5j03P0j20P5j6j05J53lJ28
2463A50l47L60o1j43J17J27p0o0J15l40P1j96J45J28j45J9j35L96p5J59j62k38
2485a85M05o2k54L52j49o5M6l63L62oj14Q5k83J70L48k85K69k79k73M11P3j23
2507H0Ln1K7J2j36j02J96k36J82j11K73p9j00j60L05J12l85o3N40k78j54J64K72
2530C11p4m66L92l47QJ8L23l49L64n4j59K06k21j19L67j36j59k40K09M55n37J98
2552a0o2l7R6L07l14J27K0n7J09j67M2M1Qj25p0p4P0L1j23N5j2J43J84l0j26k06
2578a80K1M60l80K35K9k52J23j70J55q3Q4l7j03K40j67K04k90N42l05j26M6J11
2600A57J15j53j20k12R5K27l39J35J20j66J92r5NJ63r3R7P9j04M5k48M1L13l29
$$ y = [-182, -5, 25, -200, -254, 45, 79, 227, -104, 86, -11, 124, -110, 46, 71, -32, 38, -82, -7, -23, -128, 25, 22, 150, -197, 163, 102, -41, 76, 203, 133, 73, 188, -152, -81, -277, -132, -4, -149, -130, -265, 131, 56, 215, 53, -185, 220, 158, -96, 256, 107, 42, 88, -275, 87, 81, -33, 52, -231, -61, 287, 2, 271, -8, -281, 130, 203, 80, 83, 32, 59, 71, -65, -167, 29, -207, -25, -136, 137, 58, -42, -202, 103, 215, -170, -233, 307, 29, -125, 39, 311, 237, -229, 163, -184, -176, -158, 165, -184, 180, 126, -33, 173, -48, -167, 200, 64, -95, -335, -126, 329, -208, -10, -72, -109, -13, 294, -20, 107, 127, 70, 179, 12, 54, 95, 103, -22, -92, -166, -96, -65, -188, -133, -145, -2, 182, 152, 26, -180, -159, 301, -79, 156, 185, -67, 56, -114, 41, -42, 42, 5, -98, 142, -25, 179, -111, 431, 126, 0, 46, 157, 272, 119, -1, -213, -118, 109, -230, -95, 25, -141, 51, -44, -39, 124, 31, 128, 207, 103, 148, -100, -59, 254, -75]
2623g5l80K19J17K8k1J24Q0l5j03j39K91j32K95k21j98K93K72n36J02j78l2K49
2645B0k10K21l68M40j55K52q6N0k55M6L0J29m8k77J9P9K96j78J99l04J06M4L05
2668C55l65j5r9K62j02j92J86r0J13r4j92J91L4R2j05k01J32M1K41O7l23J9j62
2691b07O7J41NNnK41l29J20j71j77R2L96ml12J03p6J21K3J20k11K71r7l1j47l
2716f5P5n5Q6r2K9J57j39p4p1K65m50L13j7q5N1K74l0m04O6O1J44k36N13q9j59
2741F8j70J12K24l35L32k56l5P2Q3j51n1K84l6j41k67m8M26r2j21J38q9K40J14
2764C01l72rL2N4o4K34Kk18o8l7M2j7j47J54J75q4J79j79pn9J16l30M45p0M9j90
2790f8J56n2j09J29k06K24j91k1Q0K66j35M0P5l44J04K19m51L68j5k9L4j44p5
$$ y = [-75, -455, -236, -119, -91, -112, 12, 92, 57, -46, -185, 106, -26, 269, 48, -150, 143, 415, -121, -19, -197, -229, 20, -190, 31, -337, 103, -52, 200, 114, 164, -91, -45, -15, 114, 66, -211, -192, -113, 183, 5, 204, -100, 6, 50, 355, -10, -25, -124, 138, 36, -156, 30, -60, 53, -41, -233, -42, -8, 84, -21, -222, -90, -49, 192, 259, -64, -45, -207, -140, 1, 6, 11, 6, 247, -82, 38, -133, -310, -218, 178, 174, -138, -35, -111, 10, 33, 153, -58, 213, 116, 85, -62, -65, 10, -45, 41, -51, -22, 135, -4, -78, -149, 116, -334, -21, -38, -123, -72, 202, 172, -232, -166, -105, 39, -197, 316, 227, 68, -102, 10, 234, -101, 231, -25, -60, 12, 95, -56, -107, 177, 141, 0, -267, -315, 111, 19, -102, 36, -53, 187, 301, -71, -80, -48, 6, -58, 176, 178, -40, -108, -145, -103, -120, -267, -113, 62, -22, 157, -22, -29, -88, 28, -302, 143, 73, 122, -68, 88, 36, -73, 56, -150, 74, -117, -138, -58, 208, 73, 113, 188, -156, -52, 167, -284, 84, 69, 40, 74, -70, -145]
2813a45J33L87n56j5J3M62p5j02j65k18J73K3L17l35L1P2k11L44j23k52M07M4
2835B09n9l19J19K58j36k13L50j11k11J9L02k67k56J75J28j45L15l08J01K91k22
2856B0k17J25J28R2j10j69K83j82J52k62k48K41L37j94j46K08j64J02j32K34L6
2877A34l1J7p2p9k2q5Q6J50j22m7M8j02K25J53n24L87q5J25r9j30kJ62j91N0R9
2902D5l27L52m31K68K40M0l95R1J39o6k1L51j99j32r6J83j86N4N1J30Mj59P2J17
2926A25j23J1k08M52q3J4M0m51J20K0L4j22J24k22P5K02M0j72kJ87j31K1K84j83
2950E2l8m6K6l5p6K21o5r9L15l63J76n4l8J24n2J70o9p0j15J03j02R4q8J7j0n
2976b7M3j1L29n42J14J41j99K60j59R8J33l0k09N8l2M5L3k5N4k7J40j46K4J57
$$ y = [-145, -12, 375, -181, -196, -183, 279, 204, 102, -63, -281, -108, -85, 232, -103, -72, 0, -211, 133, 10, -242, 165, 209, 150, -169, -50, 208, 72, -141, 209, 98, -113, -94, 208, -59, -315, -140, -12, -157, 158, -150, -49, 242, 20, -197, -72, 56, 148, 38, -131, 152, -30, 122, -140, -388, -147, 190, -4, -150, 58, -106, -4, -136, 98, 134, 103, 120, 48, -31, -53, -138, -52, 98, -24, -71, -23, -125, 100, 253, -271, 116, 31, 156, 57, -73, -75, 87, -104, -54, 45, -282, 70, -361, -93, 147, 187, -208, -117, 22, -44, -65, 286, 87, -45, -141, 42, -144, -90, -39, 91, 95, -64, 8, 125, 2, 13, -195, 257, 174, 188, 228, -223, -103, -83, -49, -171, -47, -269, -194, 8, 48, -124, -126, 61, -70, -49, 235, 52, 14, -32, -6, -41, -117, 104, 39, -60, 255, -108, 68, 14, -24, 100, 48, 218, 149, 79, -36, 67, -35, 59, -29, -12, -22, -27, 16, 5, 334, -208, -94, 47, -152, 108, -51, 47, 180, 150, -59, -1, -33, 12, 45, 20, 74, 47, 187, 41, 65, 222]
3000B22k18k1N0o2J72k53J14j60N2K78k47p6P2M78n75Q0K5j07K33%m4j87K32J12
3024A70j35RK9j14J49j72L7k88K14J6J85k24NM2J68M1K1l57J96o5j92K73L7l19
3048b74K67J5j6K9L1J8j94K78r3j07K97k46m4J8k09R5K2O7n5J66J10j62j80L68
3072B01l31J75P3j56K02j33J70l8j26J41j38L1j67K31k09K19l6j09K54l94r6L44
3094A08m66J54J31L35j98j39J99j48j56n1J83l4k10J66M06l00n9j43L67j24j31
3115a10J10l8R9L79j75k63j78J75lj25J71o4k5n7P6J31j19j91l4K50N9j20N1k05
3139b06J44q0K81j29L3l72L96j3k53Q4K09M0k35j42M58k80J70J10j50j02o5K81
3161A79n6j06j36p2j04L23m5J69m38L37L98m36K27j28k87L06j84J50N8o4J5j93
$$ y = [222, 4, -17, 33, -29, 143, -110, 4, -156, -104, 174, -73, -149, -77, 401, -174, -94, -69, -176, 57, 57, 13, -174, 58, 170, 35, 44, 73, -41, 108, -64, -27, -315, -101, -85, 100, -124, -119, -77, 91, 132, 153, -204, -8, -73, -265, 8, 45, -274, -7, 8, -8, 21, 52, 70, -124, 154, 61, -46, 251, 5, -39, -21, -230, -135, -113, -46, -101, 65, 175, 13, -167, 201, -130, 45, 118, -38, 164, 31, 201, 163, 37, 178, 40, 71, -96, 135, -74, 145, 109, 0, 254, -140, -236, 108, -358, -204, -73, 262, 64, -75, 124, -24, -180, -231, -48, -82, -292, -126, 280, -20, -79, -222, 145, 21, -110, 0, -38, 61, 440, 265, 2, -176, -1, -4, -129, 42, -22, -47, -104, -28, 103, -16, -207, -241, 9, 68, -52, -1, -206, -62, -142, 139, 10, 43, -329, 67, 54, -199, -115, 94, 134, -101, -243, 215, -65, 105, 215, 65, -37, -102, 179, 123, 17, -119, -191, -295, 28, -17, 152, -286, 51, 449, 13, 240, 112, -175, 131, -53, 97, 155, 91, 106, -87]
3183h7OP4J16j1k19N4J40N0j66K64m25J42J53K13k40k94K36k01J54J02K8j78K44
3206A55j00r7j32K96k08K02l5l21L88n3k0Qj37pr2J36n6o7J9J98q2j9R3q5L36
3231C20j68k22L3J97n13M83k24Q7l4J55r0j34L23l84K4J53J35Nk79L08l17R0K9
3254b3jJ6l6L09j62j60J40L7k87K47p2J38j36r8J31j9p4L9p5P1J34j44pp3J67
3279F2K61l91r6J89N1k60J57J81l86J87J27J03j06k01m8L5P6j72K98j39K64k76
3301h4p1K36K3k74L49k92j49K00O3L2j25r8K66j93L5J32j0J33j16Q0O3k87J26
3324C9J74j40j48Q1P2j51L06r6k49K33n7l14K69J1n2KR7j52j16R4J66p0n4l9L34
3349B40k99RJ69j08n8j52L71k41J98r4m3K4J13p9Jj86J97j73NK56j29r8J93K83
$$ y = [-87, -81, -7, 109, 98, -121, -67, 73, 123, -43, 221, -204, -62, 91, 304, 64, -230, 6, -195, -41, 61, 89, -89, 155, 55, -42, -174, 122, -86, 116, 81, -240, 148, 95, 75, 83, -54, -61, -153, -17, -73, -140, -121, 77, -5, -24, 69, -16, 320, 152, -70, -37, 160, -353, 130, -94, -7, -41, 114, 24, -110, 213, -171, -147, 6, 141, 146, -133, 175, -142, -52, -23, -24, -8, -44, 265, 103, -57, 83, 120, -167, 80, 8, 146, 10, -88, 43, 24, -50, -11, -86, -15, 119, -25, -32, -105, 62, 323, -68, -164, 25, 76, -184, -27, 154, -232, -45, 82, 185, 79, -122, -170, -135, -59, -231, 67, -72, 192, -84, -155, 81, 104, -170, 179, -113, -262, -62, 1, 33, -92, -190, 76, -117, -82, 50, 40, 173, 57, 137, 200, -87, 39, 213, 73, -75, 6, 78, -73, 233, 137, -112, 121, 64, -250, 19, 30, -22, -20, 77, -75, -191, -97, 69, -1, -55, -94, 240, -59, -50, 119, 11, -47, -199, 172, -69, 129, 35, -8, 16, 129, 50, 51, -135, 62, -111, -106, 150, 21, -77, 116, 399]
3373C99m42J25M1j60J58j2k96L76k49J26M4k69j13K99j26L23o56M08K7N8n0j11
3395a00J51j25N0l7J60j23q2j0m5J60j39K96k22j1l7K61j75L78k26j79K67k24
3417a2l00N12k62J02O3k01N9N6j52lL68k31L1K3J1k40%J28K87p1K8p2k47K95j60
3442A2Rl8N9J31r2J4M2l6j11N0k04L67j37J8j98L48L7r9k39L43l49J01P0N8k36
3467h0O5j59M1M2k5J72r3J58k26j74K93j55J06Rk3L0pJ18Q4l34J79J08k33J95
3491I1Q0k46q6J03J26r8N7o1M5k8q8R1m1n0J97J13l50M16p2k63K23Jk61O5j86
3516b22K45p1K25j65J48l35K85l71L08k25J73OJ36j83r8K45j87J46Q2j01qR5j0
3539A18J12j40k75K91l80K71K51n17K94m09O16p9j03mk2j6L3J61k98k73K53J62
$$ y = [399, -43, 82, 123, -37, 121, 109, -187, 189, -60, 66, 110, -159, -272, 27, -99, 224, -432, -24, 3, 61, 11, -100, 51, -74, -24, -61, 99, -24, -106, -116, -161, -1, -140, 156, -66, -77, -114, 147, -28, 350, 124, -55, 212, -12, -312, 200, -62, 40, 103, -98, -39, 17, -135, -138, 230, -1, 30, 53, 64, -176, -176, -48, 239, 168, 196, 124, -123, 172, 12, 21, -17, 42, 173, 81, 95, 137, 101, -10, 40, -164, 203, 66, 84, -114, 234, 271, 172, -67, 276, -73, 28, 98, 156, -80, -15, -174, -133, -91, -116, 56, -37, 121, -105, -279, 14, -141, -35, -26, -49, -19, -26, 92, 176, -158, 21, 129, -104, 91, 171, -75, -161, -58, 68, -30, 27, -34, 11, -17, -105, -14, -55, -105, 92, 205, -145, 271, 199, -64, 159, 160, -101, -36, -222, 23, -48, 177, 12, 160, -175, 110, -261, 47, -178, -5, 1, 137, -46, -144, 101, -86, 60, 142, 41, 33, 128, 118, 230, 90, -185, 106, -274, -3, 248, -269, 25, -384, 232, 153, 50, 46, 24, 8, 41, 202, -96, -369, -116, 46]
3561D6o9J60J30l39K98j93K66l16K14l29j38L00P8Nj8m12K24Q4j39L08j55J37
3583A42j9k63J77l2pm1j59k1L92k23j26ML23l02J69N3Q6j02J77j07l82M01k02
3606f2O9o6J70l78K49j09M3j65O6R1pQ4L0l80J89K72J8j09rq8J58k7k8Kj7K8J73
3633A97k55O6R5j95J68j68J08R7k14Q2P0m2o0q5R1o0P5K0k24O24k01j92L8j92
3657a57K06p6L43l26L01m47Q8K06m7P8Q7j71l71K36J86k84l5M33j21j38j60J88
3679A9k93L34J08j18j21Q5l8j91M23q7j07k0j8Q1pl5j30N2L35j30k25j9J06j43
3703a39kO1J00j94J71J36k27M3k43J09K32j05K56k42J85r6P9L7k42j50K69J23
3725A61o3n8k0k38K28K71j87j58L7J51j87P1J84k75J5j38O6L35j43j2l60K66K37
$$ y = [46, -23, 137, 267, -72, 226, 33, 299, -17, 197, -132, -270, 30, 108, 113, 95, -317, -93, -9, -148, 160, 5, 142, 123, -140, 37, 5, -2, -43, -202, -223, 169, -54, -180, -176, 147, -155, 14, 67, 153, 51, 228, 121, -261, 140, -62, 7, -59, 111, -267, -18, -127, -84, -249, -183, -92, -99, -15, 15, -365, -176, 96, 114, 5, -4, -92, 66, 39, 11, 13, -4, 24, 197, -58, 8, 103, -92, 76, -92, 16, 113, -101, -19, 51, 9, -51, -136, -45, -105, -30, -10, -234, 390, 189, -3, 35, -157, 49, -27, 316, -10, 291, -156, -68, 138, 91, 169, 256, 85, -286, -50, 136, -148, -183, 250, 129, -9, -169, 19, -274, 60, 168, 50, -71, 14, -24, -215, 208, 121, 14, -6, -24, 57, 50, 15, -115, -63, 272, 142, -83, -102, 4, -139, -141, -80, 20, -174, -3, 133, -94, -51, -294, -185, 47, -58, 198, -44, 141, 45, 124, 161, -81, -231, 38, 161, 98, 40, 20, -218, 10, 281, 94, -64, -27, 124, -63, 8, 192, -83, -68, -206, -140, 195, 52, 40, -320, -54, 183]
3748A83q0kj10l7LK13k79K01k43J94j4R2k24j66J19M20m95K22J47j84p4j11K91
3771F6l02L70j07k3j21l8K95j39l1O3N3k6o2rlk25P09n69K9n0k51L76J18j31k2
3796c0J35J05m05K63K7j86R7k0J13p8j16J15j51l5J50lJ46j91j18P9J38q2n5L8
3820f4K86j52J84k06k48K14rL07k42K12l34J40k50J47J23j18l4j65K40L3K9k26
3842a33K22o6r9K82J9k67j31M5L08m22O3J39P1o9N4k44K28%k19L46r3p9K00o4
3866I1R1k38P0ml01J04J81L03j16l35J12M1j01k62K69J14j02Q3r7K35l21L3K03
3889E3K74o19M1P2J02J76m4L03k32m8q3l2mJ41J37l62K58l97L6L10Q0j28Rl53
3913c10L35j62J76J04j78k83N21m7j33P6k01K78m59KK97k11K11O0j63k38K48o8
$$ y = [183, 103, 101, -9, -46, -43, 170, -109, 92, -151, 43, 29, 121, -103, -269, -150, 270, -225, -3, 144, -40, -114, -225, 66, -236, 134, 27, 4, -117, -155, 140, 1, -30, 33, 86, 60, -2, -11, -14, -239, 470, -99, -70, -120, -371, 5, 123, -8, -30, 105, 210, -195, 68, 95, -91, 6, -14, 99, 21, -95, 20, -131, -166, -16, -19, 127, -64, -182, -103, 35, -47, -102, -64, 222, 70, 254, 48, -200, 14, 5, 312, 70, 282, -52, 88, -162, -15, 108, -10, -44, -209, 31, 64, 93, -133, 89, 23, -76, 206, 225, -42, -173, -128, 180, -242, -179, -40, 31, -38, 16, -228, 0, 0, -219, 127, 34, -45, 155, 91, 182, -56, 14, 10, -291, -187, -6, 297, 181, -154, -42, -1, -102, -364, -95, 19, -83, 0, -97, 138, -183, -150, 53, 327, -292, -251, -179, -77, 99, 55, 358, 126, 78, -5, -37, -41, 100, 237, -125, 133, -264, -228, 82, 162, 34, 43, -310, 25, -137, 39, 143, -35, -318, 203, 156, 23, 99, -102, 176, -283, -281, 16, -195, 16, 76, -87, -325, -77, -145]
3935a45J68j40K30k6J82m42K10k67J95J12Jj64k51Q7L40K41m39J18j12J6R3j11
3957a04N5j16m2P8K31L1k68mm1j05K06Nk37K02J6j59L39J46m52J37K31k35M8k56
3981b94J30L24k57j22K82j76J20L07k53j43K6j53L72k0j99L85m58J77k80K97j87
4002a22N0P5L13m08k72N64k07O2J31l3j41J19j57J06Q4J7k08J23l37M72j23o9
4024C9j39O2J23n8N3j67K58k43j04R0N3k63N56k95j74LP2n7L24j64Q9K1j16J56
4048A19j51J05l38K60n0j19K71j00j54M5K02k81J39km2j2j16K34J47l3j26p5J17
4071D0K39m22r6M82k08%j18lJ43o4l3j03J65m0j43J10R7j34J06J6k05K16J74k50
4095c1J54r1L72l05o5%J17k9k46o9L42j61J35j32J1N9J08k22P7j39J17J14j02
$$ y = [-145, 23, -117, 113, 87, 269, -173, 37, -230, -35, 77, 78, -86, -337, -250, 90, 331, -108, 10, -102, -86, 7, -104, -49, -165, -207, -129, 102, 133, -135, -139, -180, -285, -79, -74, -311, -109, -93, -252, 87, 233, -219, -82, 149, -86, -38, -294, -164, 160, -97, -219, 63, -113, 7, 314, 61, -82, -56, -209, 163, 143, -56, 329, -129, 48, -232, 65, -122, -72, 3, 316, -92, -364, 200, -7, 55, 186, 153, 12, 131, -26, 80, 164, 181, -27, 96, -241, 231, 108, 39, -100, -38, 85, 27, 80, -87, 171, -72, -176, -86, -33, -296, 260, -35, -209, -206, -134, -191, 133, -31, 58, 79, -37, 119, -32, 73, -265, -5, -55, -174, 97, -3, -157, -112, 90, -191, -52, -54, -96, -108, -224, 10, 157, 124, -2, -77, 40, 279, -143, -239, 243, 35, 35, -83, -86, 57, -7, -40, -143, 22, -18, -161, -51, 46, -88, 18, 34, -171, 45, 219, -31, 123, 32, 404, 99, 34, 34, 151, 122, -124, -193, 149, -12, 123, -9, 2, 61, 169, -53, 24, -115, 2, 116, 14]
4118A4O6k93M4J89J57m9k42j5K32K1q4K18m53J9L37q4k70J89j04k28N81j2r3M8
4142A88l16k24K51jL9r7MK53k76KK07P7j63K72m37L34j04k5k5J94m77K09r2J27
4166h0L78l04J39l15K47j72q1j11K11J27J5j14j89lK47r8O2k7p8J85j57j46J82
4189h2J65J87j24R1l54j47L10K22o9l44j72K28J68K20l33K85k35K6J21j21J25
4210A67k19O2j93N1L54l51jJ04L4l2J96j25R4j32j97K5K47N0j31J15k81J64l9
4233c8m7K57k28%N6j3J65k37J94k3m4P8j56j0O5j17L33j75j26K58k79M6K13l85
4257b13J74L47j92j05O2N2l05L05m36K50N9j06M2N7J04l1j90J69N1p4J26k10J7
4280d7m5K28J60m41Q9m5j90L14j11L8j37J51j78L84k07j59J09L23l24J33j06J62
$$ y = [14, 80, -213, -169, 20, 177, 128, -114, -129, 103, 124, 40, 258, -195, -176, 161, 77, -193, -4, -108, -336, 245, 233, 140, 188, -128, -352, -101, -102, -63, -160, -156, 97, -179, -177, 30, 107, -56, 216, -221, 113, 9, -16, -41, 153, -324, -115, -207, -80, 298, -6, 133, -182, 65, -107, -188, -299, -88, 39, 54, -60, -249, -252, -5, -103, -41, -68, -146, 39, -118, -264, -82, 83, 270, 146, 237, -117, -264, 46, 268, 199, -145, -317, -89, 79, 299, -34, 251, 16, 42, 163, 42, 167, -52, 10, -183, -132, 222, -129, -130, -26, 8, -24, 172, 47, 141, 9, -188, -163, 84, 134, 3, 118, -163, 1, -38, -85, 172, -56, -56, 0, -13, 152, -85, 109, 86, 42, 120, -36, -46, 19, -98, 235, 60, -66, 192, -87, -41, 172, -213, -39, 308, 116, 11, 73, 125, -180, 125, -311, -61, -2, -108, -66, -9, 95, 64, -126, 43, 94, 20, 146, -64, -47, -92, 136, 296, -145, -56, -101, -291, 23, -88, -50, -187, -36, -214, 170, -37, -196, -87, 236, -88, 45, -61, 101]
4302A01j07j3j9M7k3O1k04K38j85O6M6n8j09L15m36L71k2r2N0j18nR5K8m10N98
4327B15k14q2o7L42l61M26k13j92L24k27p7rJ29P1O4k35K13q9o6J92j31R1k28
4350a24j6L55j34J91k07r7K44j76j66j11J09Q3o9j7J41K11k21L5O6k62K42m6J79
4373B10j60r0j16M00l39J0K32l5m21J43J27J04j9j83R9k85K93K9j18R1J07n7K80
4396C02k33MNq0k63J48L67k72Mk41J69Q2Q5k27R1J6J94k46J63j08J99k37r0J16
4420e2m3K18k00qJ92j03L1mk23K63m3k22K87j52J42Q7j4j62Lq7j15J15K44j14
4444D0J70k89K03k29L11k93R6l8L6K75l37j54j13K72J16j22J86n2j61j13K60M2
4466A06k63p8R2J27J4R4j75q5J76J3p4K9PJ27j93j50K08o0K49j07JK43l32j58
$$ y = [101, -6, -19, -38, 9, -14, 47, -157, 81, -104, -38, 8, -50, -159, 156, -280, 91, 69, -23, 27, -91, -96, -1, 27, -383, 215, 1, -81, -148, 194, -167, 259, 46, -146, 178, -49, -126, -135, -6, 65, 129, -106, 107, 18, -48, 144, 13, 104, -124, -140, 215, 81, 272, 65, -32, 212, 36, -130, -241, -132, -49, -118, -135, 6, 217, -4, 31, 97, -165, 77, 31, 210, 50, -40, -156, 244, -95, -85, 147, 112, -309, -166, -39, 65, 46, -137, -38, -323, -30, -1, -119, -28, 79, 22, 302, 69, 73, 78, -2, -265, -117, 250, -22, -18, -259, -90, -8, 77, -150, -59, -43, 151, -95, 68, -40, 159, -78, -168, -52, -95, 123, -77, -85, 107, 4, 35, 31, -192, 71, 28, -194, 93, -59, 83, 170, 156, -6, -3, -90, -205, -90, 154, 40, 210, -79, 124, -105, 206, -87, 9, -29, 7, 282, -55, -209, -322, -50, 66, -56, 130, 78, -83, -196, 64, 106, -157, -235, -143, -16, -2, 92, -83, -168, 8, 21, -53, -24, -17, 110, -83, -233, -25, -85, 164, 57, 58, 301, -31, -189]
4490a89L60j11k08L05m14O4L49J49k10N5J09k47Rl17M61k19L5J78j70j4JM6o9
4513d7j00K25Qq6O3k55K17J88m4j61J39j5j05J08k40K28j95mKL5j3K24k34k1N0
4538c3j69L50j65M3j44J12k20L58k18J74j46J80q6q9J40k42K98%l41R4K29n45
4560d20P38n57J01n5O58l29k21P1J32N3nl50J23J95Q1k69N3N9r5j06M6P2P0j84
4584a39L32j07k12j43K34r%J18j40K8j91L11l37L40l5k1n8L2J77j87OP3K5j76
4608g9J77K5k98P3QK01k26Q6l00N11l07j09J71K32j17l87M27j01J78l31J5L4J60
4631D3P7J84m90nL84j54rQ3k7k46J77n7J43j33n0JQ0Pq0J04N9k60R0K08J19j54
4657I4q1K46l68K28m11L88j13j48pL12K05K5o32O8L50j48l9J44q0k56K9P1K97
$$ y = [-189, 171, 60, -148, 157, -257, -193, 156, 305, 95, 150, 259, 12, 21, -296, 165, -54, -19, 159, -11, -25, -24, 22, -47, -147, 78, 86, 0, 63, -192, 25, 213, 169, 8, 147, 132, 27, 135, -105, 123, -72, -76, -74, -39, -52, 172, -62, -83, -33, -202, 148, -17, 26, -118, -6, -226, 132, -86, 88, -58, 122, 36, -53, 87, -155, 143, 143, -198, -104, 125, -420, 318, -239, -138, -193, 465, 136, -85, -14, 118, 171, 166, -184, -61, 134, 215, -54, -1, 58, -37, -143, -97, -25, 45, -139, 193, 86, -126, -269, -35, -44, -44, 74, -66, -38, -229, 82, -255, 85, 50, 29, -29, 3, 180, -7, -1, 72, 97, -79, 98, 123, -175, -102, -94, 107, -119, -33, -333, 178, -129, -238, -67, 165, 48, -339, 88, -13, 165, -166, -151, -117, 43, 120, 304, -186, -191, 193, 39, 30, 113, 86, -160, 17, -40, 103, -30, -80, -79, 1, 8, -72, 32, 91, -169, -79, 129, 248, 94, 13, 259, -109, 119, -292, 96, -17, -165, -172, 140, 345, 370, -262, -194, 156, 8, -31, 113, 33, -223, -194, -123, 174]
4680A74j85R1m5j43L32j65K2n0K0l3n3j41L05p1l34M57j11L5l41M30j02l69J50
4703a27K03n8M3j15j42J98Q5j98m9M50l29N8O7N3j67m8M5P0p3R0rl04p6L25k77
4728b85L18K1l08N1O5J37LJ11k44K40j91mJ14n6J00Q4k99O5p2J79NQ7pk81N5L47
4754B35k04k34K00j25q8L77l82K20j25J38j51J5L72l22J81j55J09O8r3K20j89
4775F7P7j37p1l8L86l89j09K31P7nl18J2L44p4K6m56L27m0K56j38K57q8j33j49
4799h5N0j23L52k05mk20K46J35m37K22K01kk16M6l8%K20K00l91Q7N7j01l5J60
4823A19k77K49k82J05K86l84K26j04M8N5P6j98j43N49l09o6Qm9K18m07L95j28
4845a3Q3k63K10r2Q5j42O9J47l02J82m7J40N3J57n3j41j86M1LOJ22Q7Q0m4R7l61
$$ y = [174, -11, 80, 35, -108, 224, 59, 81, 31, 51, 18, -35, -176, 129, 58, -276, 181, 70, 105, -236, 194, 92, -277, -127, 76, 18, 61, -54, -196, 2, 87, -111, -160, 290, -39, 19, 86, 139, -28, -76, -31, 39, -34, 56, 47, -257, -333, -8, -285, 33, 54, -254, -203, -138, -1, 2, 113, -131, 109, -82, -86, 28, -28, 72, 156, -143, -78, -150, 29, 34, 121, 114, -167, -112, 235, 31, -203, -3, -128, -216, 161, -221, -1, -126, 12, -139, -124, 248, -74, 107, -48, 61, 129, 36, 256, 67, 144, 7, -64, -102, 284, -105, -214, 17, 94, 89, -229, -217, 127, 53, 79, -377, -50, -90, 166, 28, 285, 197, 64, -85, -35, -158, 194, -11, -15, -235, 11, 146, -291, -69, 132, 130, -86, -40, -78, -78, 142, 342, -49, 38, 95, -6, -41, 119, -158, 91, -191, -86, 200, -184, 42, -62, -14, 41, 117, -81, -224, 325, 16, -50, -42, -91, 127, -280, 115, -13, 70, -193, 17, -75, 10, -132, -63, 84, -218, -36, -83, 57, 110, 267, 214, 73, -113, -72, -69, -63, 59, 146, 226, 182, 279, -82]
4871h2J83k68J37Q3q6p0M9L7L0O5R6k11K11k52m5NJ52J44l29M01k84j07J42J46
4895A47q6J7j86L5q6J93K71l01j83k96M03J85l4k20J54Q5O2k91K18J07l43J28
4917b1Nnj6j39L18j5p4k57L7L46k72nJ54J39k33J36k1k61K25J00k36K79m7l15
4941a78L83O5m28K53j96l0J24q4K78k10j19J82j27J11J7j08j9O1N8K8j48J56o4
4964EL19o71N63l86K81k20K14k08j29J15Q3l40L49r6MM1L72m35J67m1R6k68J12
4987g3K8N5L24m15J54j42O9o8l7K67l34L16J27m01J33k26L26J34k89N5K9J04k16
5010h0J91Rq1k2n5Q2Q1n7k30J07j52J94J15nJ08j30j50j03L45K8J4j03m34K97
5034c1K62l40J33j03O1l7j06J62l34K98J9J50Jk52J48j8k9J97J24l14m9j9L8p5
$$ y = [-82, 101, -167, -30, 53, -33, -103, -54, -17, 13, 78, 174, -37, 174, -78, -123, -118, 34, 178, -151, 250, -34, -141, 1, 147, 61, 78, -108, -73, -159, 34, 305, 4, -179, -475, -72, 113, 79, -141, 13, 98, 160, -131, 87, 194, -149, -21, -16, -21, -37, -176, 142, 127, 53, -204, -167, 179, -93, -98, 56, 195, -38, 98, 77, -184, 41, 141, -95, 184, 137, -178, 205, 270, -158, 95, -101, -131, -7, -91, 187, -23, -142, 40, -87, 24, 41, -67, -86, -25, 33, 61, -87, 69, 5, 324, -347, 216, -170, 111, -109, 105, -103, -232, -117, -34, -374, -25, -121, -117, -76, 296, -139, 28, -13, 83, -185, -73, -45, 10, 334, -81, 73, -69, 0, -68, -105, 162, -172, 144, 271, -130, 3, -223, 103, 237, -52, 3, 32, 136, -80, 111, 120, 39, 17, -38, 44, 125, 68, -162, -55, -207, -13, 102, 97, 205, 75, -75, -178, 167, 195, 209, 106, -328, -31, 231, -109, 24, -79, -18, -55, -161, 1, -333, -35, -16, 134, 135, -117, 31, 13, -16, 181, 305, -9, -58, -77, -39, -114]
5058a14L67k45K43l01j71K98k4k4K08K4l24K80l09J70p0M0J27j90M7J7r7K04j90
5081c4J5K9j58j32K51L38j57k25R5o0n7J60j58J72k60K71J4r0m7O2M6j49l8K85
5105A73j38J64j53J32m1j10r0k5J6K9K49l82J74j92J04rJ78k59J20M2n7j3M5J82
5129A39k22J38M3j4j61q5J65J33o7j32J35r6j10K21k34K25l42L02K8k37K47lR6
5152A69q1j23J22R2m29R7L17n8ml45M4K47K64l63J67j52N8j82L90k10o0L02m15
5175a53K58j68J79p1k03J21o1R8L49n45K33K9q5L52m98L3k1J83l4P5j15Q0j22
5198h6J01Ko5J1j53J40J40Q9k75L67l00l6j2J02K78k72P0j48K53l46M51l57K43
5221A97j76j22l5O9K44j65n1l8M08l82J31j35p8NJ91j74kj24M09j34j97O6K27
$$ y = [-114, 253, 8, 251, -50, -221, 77, 53, 29, 237, 261, -63, 217, -92, 78, 8, 48, 175, -15, 32, 49, -48, 156, -34, -19, 10, -148, -280, -29, 309, 152, -73, 22, -38, -95, 65, -93, 79, -181, 90, 104, 14, -33, 29, 75, -74, -112, 173, 35, 199, 46, 178, 137, 27, -63, -88, -72, -43, 206, -176, -2, -194, -90, -99, 79, -180, -60, -18, -75, -88, -43, 139, -83, 55, 98, 84, -77, -162, 3, 136, 69, -63, 72, -24, -134, 87, -147, 78, -264, 38, 66, -171, 76, 73, 169, 88, -35, 87, 179, -250, -153, 164, 106, 102, -243, -199, 48, 312, -51, 116, -36, 22, -160, 230, 20, -40, 262, -153, 105, -63, 116, 45, -158, -37, -98, 0, 349, -196, 37, 66, -19, 333, -165, -132, -153, 30, -4, 71, -44, 36, -86, 15, 17, -48, -37, -190, -50, 90, 179, -96, 271, -29, -65, -77, 25, 303, 31, 101, -47, 206, -140, 311, -46, 197, 21, -101, -136, -67, 177, 12, -39, -77, 331, -51, 80, -55, -133, -128, 63, -111, -113, -237, 172, 38, -159, -93, 134]
5244A34n6j85P2q2K32k09J53K9j04J28j45j4P5n9Q8j19K64j85K66p8j34J55j55
5267G1j28R7l8j38K78k48j5K39n4Kl31K87J29k29K1K3J26q3j80J49J9j99K66k18
5291a54K69j53J5k32J33R4p8J49p4j48J87r9j02K5j01K48R6L27n85J81J95k43
5313e0O8j21M1J51k55J29r3j9L58k51m2J85J37l73K26j19J09j1L7j38k07M18k70
5336i0M8j42J76J24n5J22k31j1K4J91J4p4p3q3qk4%K48j74j52K05L9J11p4m5r
5362E7j29J2Q0l27K94k93M28o8l0j62K62k58L74k69M4J95k85J26L6k75J09J77
5384I8j33k3QK78j45l9k84K57K61j36N3m07L08m2r5n7J15j59J59L14l91P2j7J57
5408A52p8n8R0k43J29M2l78J07J5K33j08L52l72J51j83P3O2L5j34K5J1o8K63l4
$$ y = [134, 78, -107, -35, -117, 115, -94, 59, 88, -16, 112, -33, -47, 28, -31, 57, -62, 202, 17, 283, 205, 71, 226, 71, -57, 40, 2, -136, 142, -106, -121, 118, 64, 66, -265, 22, 151, -78, -57, -34, 92, 9, -171, -22, -3, -202, 64, -154, 115, -38, -23, -255, -122, -28, -106, 43, -31, -179, 8, -91, -193, -168, -269, -21, 75, 402, -183, -2, 193, -50, 18, -103, -62, 89, -166, -37, -130, -149, 209, -42, -84, 101, 238, -135, 91, -28, 81, 70, 107, -31, -238, 180, -90, -42, -184, -8, 116, 61, 183, -48, -59, -35, 156, 170, 96, 23, -60, -68, -92, -92, 156, -18, -170, 35, 74, 185, 111, 66, 57, -72, -60, 20, -307, -13, -306, 122, 54, 24, -138, 124, -134, 240, -29, 15, 210, -75, 51, 87, -188, -79, 98, -35, -58, -50, 228, 83, 44, -240, 17, 278, 142, 195, -212, 96, 54, -41, -98, 17, -142, 17, 331, -60, 12, -5, 152, 74, 16, 106, -137, -8, 34, -344, -237, -222, 11, -97, 255, -117, 34, -149, -76, -14, 21, -113, -88, -77, -145, 118, 84]
5432H4O2p8R4j11j34r0p6Q9j9M46m15J87r0j33J26K08k05nM1r1K9L29n7k44j10
5457a63J36j08j75L92l5j80J43j62K89k30j41K56j5k4N4Q8O5j91k80M26o3k83
5479b01L34R3l89J73k2K1R3j05K76m86K12R9o5j90Q0J11R0j64K4O8O5k20K75p
5503A65k79K0M7P5J10k23J7J68n8m1j5j2J0O7L5N0j80q1J67J15k29N3k10J53J0
5528f6K72k56M3j2M2k25J76j8J5K22l61J18J45jr1J22P0l02K15r5j25M70l99n6
5552i7K47k57R9O2l37K84K0n4n8m8J51M0j87R1j4JJ55K25m49O3k6L79k37nj93
5577a45k00O68n01J90j00p7M12j85N7l8L2n45M09L12k37q5j06L27q3p7j56OL32
5600B10j65j06J95R8m05Q8K91k63r8J95k3k11N5K82j31P2n9k00j0j3J25K85m21
$$ y = [84, 146, 68, 162, 51, -83, -173, -249, -160, -179, 267, -148, 39, -51, -184, -58, 150, -55, -60, -19, -110, -81, 248, 191, -53, -163, -27, -135, -310, 82, 47, -133, 10, -152, 137, -93, -234, 22, 7, -17, 37, 125, 190, -1, -281, 145, 82, -201, 133, 226, -163, 10, -12, 9, 102, -3, 273, -213, -1, 98, 33, -157, -77, 34, 124, -40, -16, 52, 117, -103, 172, 165, -114, -94, -47, 28, 138, -85, -68, 100, 42, 1, -14, -26, -16, 51, 86, 136, -44, -125, 42, 157, -72, -19, -229, -76, -66, 206, -50, -7, -19, 23, -202, -26, -44, -29, 193, -168, -50, 95, 94, 3, 125, 195, -107, 108, 13, -112, 358, -41, -97, 150, -107, -8, 54, -283, 1, 21, -33, -91, -139, 12, 52, -135, -44, -58, -57, 98, 323, -126, -63, -89, 290, 53, 48, -145, -345, 323, -178, 12, -88, -165, 247, 62, 119, 81, 113, -432, -23, 289, 52, -33, -139, 188, 105, 28, -128, -122, 210, 45, -61, 134, 232, -173, -85, 206, -57, -155, 40, 17, -194, -139, 143, 12, 84, 25, -175, -185, -198, -73, 212, -209]
5623b09J44j02J75j44M75j65j25M8j12J41j3j47o9J01l14K92l7K07j51N7M4k21
5645a25Q3O8Q0j6L4j50N0O1q7k67R1J26J74q3Q4j20n2K86k63j13j13M48k01Kj82
5670a85K56k09J81j05lj29J25L05k83J47l70L53J1k14P7K25n6M1l93J9J84J82
5692A59j38J0r7PoJ00K26l36o6Q0J41J02l46K17L3k40J30N5P6R4n4j13Q2k42J54
5717B8k85L06j96R8K3L3q5K38J1k24K48j90J02k25K82p9q8J02n0k31L36o2m34
5740c42L33J07J24l91K81Q4k17N3m6J59k39o5J24N8j16J29Q6j05j83J37r1qK20
5763I2r1J49j13k93K68k63P4J77l0j56J64r0kJ96J13j24o1%M6n8k1j57J74R3l4
5788E3n6j46m3K86J26k55R6k85L77m18M48k65K64l41L38k10J19k46N3J94k69K3
$$ y = [-209, -65, -167, 8, -136, 339, 174, 49, 97, -15, 126, 113, -34, -103, -2, -316, -24, -61, 146, -5, 52, 96, -125, -42, 26, 106, 90, 124, -26, 24, 85, -2, -269, -178, -52, 122, 39, 123, 3, -49, 237, -26, -139, -252, 196, -5, -3, -185, 71, -138, 43, -62, -65, -194, -69, 236, -47, 100, -270, 83, 94, -120, -43, 182, 126, 167, -226, -207, -23, 159, 21, 31, -66, -59, -65, 35, 261, -75, -141, -61, 80, 182, -164, 53, 86, -154, -24, 31, 107, 201, 147, 34, 116, -126, 28, -257, 49, -147, -49, -26, 7, -78, 160, 171, -53, 195, 5, 107, -118, 164, 85, -3, 99, 49, -182, 154, 92, -342, -9, 98, 222, -169, 112, 196, -21, 32, -14, 145, -94, -159, -35, 23, -93, 36, 122, 17, -166, -29, -120, -128, 92, 1, 150, 37, -256, 12, -251, -177, 0, -30, -186, -22, -112, -114, 82, 195, 71, 10, 10, 56, -2, -23, -180, -6, 87, 53, -3, -149, -192, 94, 220, -35, 61, -224, 153, -265, 183, -82, 182, -159, 179, -31, 88, -158, -105, 89, -180, -157]
5810a57N2q1j30M25P0k58L18k64J76k37K45k76J98J12j35J35k53L09j10k00%j0
5832g1K18J03k77o8R3P6k79K26l6jr9J49j97K40p0N3q2J37r8n1r1r8M30l60K18
5857F5r0j1J04j87L9L9K23k20l31N62k49j18L57N5j38k72J46J75K0p1p6j23L14
5880B13J30j64j03M1K21j36l08O1lj18J18j67M36m08J68l15L86l41J81JK09j72
5902g0om3J63j00K79j06j89j99J96J21L7l20J58P0N7J13k24K75l06k4J55m8K38
5925B27Nj11j7K2j91J23m0k7j70M54l35K4J78k93K19k13m3K76k46J22J7kn7O2
5949a6K17p5O7k34r4P7L13l54L00j58rq9m9K34J03k38J7J33l39M29k33j91P5J66
5973E2j16r9K37m6l81M46k82M81m16NJ61q4K78k21j26l0P3J38l1L09j75j97K28
$$ y = [-157, -105, -186, -316, 109, 179, -79, 239, -25, 151, -86, 159, -117, 81, 193, 58, 193, -60, 249, 139, -61, -61, -71, 147, 250, -27, -95, -2, 74, -205, 21, -15, -16, -115, 34, -163, 77, 7, 60, -22, 115, 17, -34, -125, -223, 207, -153, 65, -25, -36, 68, -119, -80, -41, 182, -38, -369, 193, -56, -174, 183, 238, 100, -172, -26, 149, 169, 98, 22, -101, 213, 343, 179, 76, 117, 338, 202, -106, -45, -48, -166, -48, -215, 221, -187, -19, -334, 52, -289, -108, -107, 102, -70, -76, -119, 44, -56, 223, 117, -72, -271, -75, 46, 83, -237, -79, -9, 48, 161, -63, 212, -94, -118, 37, -11, 227, 232, 121, 104, 126, -65, 58, 18, -9, -179, 275, -60, -36, 142, -151, 68, -145, -188, 88, -158, -36, -19, -21, -78, -16, 201, 126, 193, -41, -135, -58, 255, -99, 201, 43, 34, -55, -104, 130, 233, -5, 12, 145, -194, 235, 2, -189, -114, 52, -64, -163, 74, 28, -353, 93, -189, 292, -124, -119, 42, -42, 236, 15, -111, -141, -68, 70, 39, 348, 173, -24, 204]
5996B04k68Q0Q6j49O2k5p1k9L0J19k40J26M0k05M6L23N0J1k71J4K03j41pR1j6
6021F3l53L85k58Q7K9J8J69p6L3j47J74l65J65m1P6j10r2K47j91K25k44M5J99
6044C8l34L51j13r2J13q5j32O0K95k60K81j49K68j08j24M7l5J25k53k78K57L1
6066i7Q4J60r1k35R2O07o35J3J85j31K5O8J14k85J21j1j20J19Q4J1l3Q3lP7M2
6091B44k82j08J69r6R5J17k01j66J8J92j77K33k0OJJ16k83J23J05o5k24K42K61
6114C00l26J92l82O42n15K18k68J26K8j60J13l31K31M07k83j49J43j92K36J44
6134A74j56O7m2O0j6m5j13J74mj16k2k32K77jp3J77M7r7Kp2k43L21r3j23J24k35
6160b60L84n0J57m3j39l3J33p1j77L0J88k38L43r1k7q5j1J87k32j54k4J40j6L28
$$ y = [204, -64, 16, 102, -47, 15, -10, -81, -110, -80, 39, -201, -75, -35, -240, -194, 129, 179, 190, -81, -67, 136, -5, -12, 79, 63, -290, 95, -163, -76, -47, -29, 140, 64, 97, -50, 124, -241, -76, -117, -41, -151, -243, 4, -187, 38, -206, -161, 38, -296, 55, -58, -150, -37, -122, -254, -194, 101, -159, 122, -27, 241, 133, 9, 56, 21, 146, -107, -385, -128, -97, -13, 147, 56, -179, -87, 520, -115, -102, 83, -48, -23, 45, 159, -126, -5, -16, -136, -17, 67, 78, 45, 128, 125, 202, 244, -38, -146, 23, -73, 22, 139, -62, -228, -210, -18, -195, 38, 18, 24, 25, 141, -142, -19, 86, 21, -203, 39, 300, -26, 166, -216, 426, -89, 129, -139, -13, 15, -145, -32, -363, -132, 275, -8, -157, -14, -206, 30, 174, 18, 85, 43, 103, 87, 42, -71, 103, 99, -17, -39, -271, 6, 5, -68, 109, 156, 59, 61, -11, -254, 67, -26, -149, -25, -260, 124, 74, 231, 188, 49, 16, 149, 78, -99, -69, 119, -119, 224, 133, 106, 21, 10, 197, -35, -189, -213, -73, -89, 239]
6184B39k12K83j88K1N6k11j80K39k6j07J88J29o3n5p4j79J92k26J56J06j17j66
6206a95J20J51r5q2K13k24J91n6J44m12J91K08k43n3L12j01j21n1J41J81l72R8
6228e5Q5j38R8K05l76L52j19k32K10j5J79m86K72K1R1K58j18p5P4l27Q9j18J56
6251C1L22j96l66K60l4o7q3J36j04Q7N6k39M04k56O7L5l01M60j37j54j44K88j77
6274a12N9J09O4k11K73n7j58K7j8K17j81n4J63o8q0K95l67J15j58N8q8L57k45
6297f0J70j20J6O0M3l13L04J71n25L24p8J63M3m41K07q1l36M63J81k84P4J38k6
6320I3ro6j35M14m42K34q0J12k70N7J30k11K74r6k28L78j61j29j14R2L37l17R6
$$ y = [239, 27, 310, 122, 143, 199, -12, -192, 47, 21, -86, 102, 231, 168, 113, 39, -140, 52, -174, -18, 88, -29, -195, -75, 76, -19, -101, 112, -112, 79, 23, 167, -245, -54, 154, -89, -142, 170, 69, -52, -103, 38, 219, -153, -55, 30, -108, -10, 195, -181, 171, 52, -180, 30, 15, 194, -292, -20, 1, 92, 350, 232, 157, 231, -96, -7, -125, 31, 353, 157, -209, 51, 17, -50, -133, 3, -101, -14, 42, -197, 207, -49, 18, 53, -248, 212, 75, -79, -223, 65, -112, -53, 56, 120, -91, 182, 125, -33, -6, -24, 193, 12, -42, 121, 53, -27, 268, -99, 16, -142, -84, -172, 185, -60, 110, -10, 6, 66, 109, -204, 100, 271, -254, 70, -8, 155, 198, -243, -36, -117, -453, 10, 191, -93, -19, 119, 93, 84, 18, -117, 297, -145, 89, 9, 121, -149, -92, 38, -173, 101, 5, -223, 155, -6, -135, -249, -157, 180, -137, -41]
$$ [...]
8191b21
##END NTUPLES=NMR FID
##END=
