##TITLE=1H_DE-106_EXT_EtOH_TFA
 200.13MHz, CDCl3,
 8 sc
 
 20.8.2025
##JCAMPDX= 6.0         $$ Bruker NMR JCAMP-DX V2.0
##DATA TYPE= NMR FID
##DATA CLASS= NTUPLES
##ORIGIN= UXNMR, Bruker Analytische Messtechnik GmbH
##OWNER= pz
$$ XWIN-NMR		Version 3.5
$$ Wed Aug 20 15:14:25 2025 Russian Standard Time (UT+4h)  she@DPX200
##.OBSERVE FREQUENCY= 200.1308
##.OBSERVE NUCLEUS= ^1H
##.DELAY= (6, 6)
##.ACQUISITION MODE= SIMULTANEOUS
##.ACQUISITION SCHEME= undefined
##.AVERAGES= 8
##.DIGITISER RES= 18
##SPECTROMETER/DATA SYSTEM= spect
##.PULSE SEQUENCE= zg30
##.SOLVENT NAME= CDCl3
##.SHIFT REFERENCE= (INTERNAL, CDCl3, 0, 14.3821)
##AUDIT TRAIL= $$ (NUMBER, WHEN, WHO, WHERE, WHAT)
$$ ##TITLE= Audit trail, XWIN-NMR		Version 3.5
$$ ##JCAMPDX= 5.01
$$ ##ORIGIN= Bruker BioSpin GmbH
$$ ##OWNER= she
$$ F:/spectra/data/she/nmr/H-C/1/audita.txt
$$ ##AUDIT TRAIL=  $$ (NUMBER, WHEN, WHO, WHERE, WHAT)
(   1,<2025-08-20 15:13:05.23 +0400>,<she>,<DPX200>,
      <created by zg, POWCHK disabled, PULCHK disabled
       configuration hash MD5:
       00 E9 B6 7A A2 85 ED C7 34 08 36 98 17 FE 4E 26
       data hash MD5: 16K
       B4 CD BB 4F 97 5E 9D 9A D6 D3 A5 05 3F FB 25 B7>)
$$ ##END=
$$ 
$$ hash MD5
$$ 34 A4 5D 00 CA A7 1D 4E 00 8D 20 50 EB EE 32 4D
##$RELAX= 
##$RELAX= 
##$RELAX= 
##$RELAX= 
##$RELAX= 
##$RELAX= 
$$ Bruker specific parameters
$$ --------------------------
##$DU= <F:/spectra>
##$EXPNO= 1
##$NAME= <H-C>
##$PROCNO= 1
##$TYPE= <nmr>
##$USER= <she>
##$AMP= (0..31)
100 100 100 100 100 100 100 100 100 100 100 100 100 100 100 100 100 100 
100 100 100 100 100 100 100 100 100 100 100 100 100 100 
##$AQSEQ= 0
##$AQ_mod= 1
##$AUNM= <au_zg>
##$AUTOPOS= <>
##$BF1= 200.13
##$BF2= 200.13
##$BF3= 200.13
##$BF4= 200.13
##$BF5= 200.13
##$BF6= 200.13
##$BF7= 200.13
##$BF8= 200.13
##$BYTORDA= 1
##$CFDGTYP= 0
##$CFRGTYP= 5
##$CHEMSTR= <none>
##$CNST= (0..31)
1 1 145 1 1 1 1 1 1 1 1 1 1 1 1 1 1 1 1 1 1 1 1 1 1 1 1 1 1 1 1 1 
##$CPDPRG= <>
##$CPDPRG1= <>
##$CPDPRG2= <>
##$CPDPRG3= <>
##$CPDPRG4= <mlev>
##$CPDPRG5= <mlev>
##$CPDPRG6= <mlev>
##$CPDPRG7= <mlev>
##$CPDPRG8= <mlev>
##$CPDPRGB= <>
##$CPDPRGT= <>
##$D= (0..31)
0 0.7 0 0 0 0 0 0 0 0 0 0.03 0 0 0 0 0 0 0 0 0 0 0 0 0 0 0 0 0 0 0 0 
##$DATE= 1755688384
##$DBL= (0..7)
120 120 120 120 120 120 120 120 
##$DBP= (0..7)
150 150 150 150 150 150 150 150 
##$DBP07= 0
##$DBPNAM0= <>
##$DBPNAM1= <>
##$DBPNAM2= <>
##$DBPNAM3= <>
##$DBPNAM4= <>
##$DBPNAM5= <>
##$DBPNAM6= <>
##$DBPNAM7= <>
##$DBPOAL= (0..7)
0.5 0.5 0.5 0.5 0.5 0.5 0.5 0.5 
##$DBPOFFS= (0..7)
0 0 0 0 0 0 0 0 
##$DE= 6
##$DECBNUC= <off>
##$DECIM= 32
##$DECNUC= <off>
##$DECSTAT= 4
##$DIGMOD= 1
##$DIGTYP= 9
##$DL= (0..7)
0 120 120 120 120 120 120 120 
##$DP= (0..7)
150 150 150 150 150 150 150 150 
##$DP07= 0
##$DPNAME0= <>
##$DPNAME1= <>
##$DPNAME2= <>
##$DPNAME3= <>
##$DPNAME4= <>
##$DPNAME5= <>
##$DPNAME6= <>
##$DPNAME7= <>
##$DPOAL= (0..7)
0.5 0.5 0.5 0.5 0.5 0.5 0.5 0.5 
##$DPOFFS= (0..7)
0 0 0 0 0 0 0 0 
##$DQDMODE= 0
##$DR= 18
##$DS= 0
$$ [...]
##$SUBNAM0= <"">
##$SUBNAM1= <"">
##$SUBNAM2= <"">
##$SUBNAM3= <"">
##$SUBNAM4= <"">
##$SUBNAM5= <"">
##$SUBNAM6= <"">
##$SUBNAM7= <"">
##$SUBNAM8= <"">
##$SUBNAM9= <"">
##$SW= 18.0517779522481
##$SWIBOX= (0..15)
0 0 2 0 0 0 0 0 0 0 0 0 0 0 0 0 
##$SW_h= 3612.71676300578
##$TD= 16384
##$TD0= 1
##$TE= 0
##$TE2= 300
##$TE3= 300
##$TEG= 300
##$TL= (0..7)
0 120 120 120 120 120 120 120 
##$TP= (0..7)
150 150 150 150 150 150 150 150 
##$TP07= 0
##$TPNAME0= <>
##$TPNAME1= <>
##$TPNAME2= <>
##$TPNAME3= <>
##$TPNAME4= <>
##$TPNAME5= <>
##$TPNAME6= <>
##$TPNAME7= <>
##$TPOAL= (0..7)
0.5 0.5 0.5 0.5 0.5 0.5 0.5 0.5 
##$TPOFFS= (0..7)
0 0 0 0 0 0 0 0 
##$TUNHIN= 0
##$TUNHOUT= 0
##$TUNXOUT= 0
##$USERA1= <user>
##$USERA2= <user>
##$USERA3= <user>
##$USERA4= <user>
##$USERA5= <user>
##$V9= 5
##$VALIST= <valist>
##$VCLIST= <CCCCCCCCCCCCCCC>
##$VD= 0
##$VDLIST= <DDDDDDDDDDDDDDD>
##$VPLIST= <PPPPPPPPPPPPPPP>
##$VTLIST= <TTTTTTTTTTTTTTT>
##$WBST= 1024
##$WBSW= 4
##$XGAIN= (0..3)
0 0 0 0 
##$XL= 0
##$YL= 0
##$YMAX_a= 76080
##$YMIN_a= -111573
##$ZGOPTNS= <>
##$ZL1= 120
##$ZL2= 120
##$ZL3= 120
##$ZL4= 120
##$ABSF1= 10
##$ABSF2= 0
##$ABSG= 5
##$ABSL= 3
##$ALPHA= 0
##$AQORDER= 0
##$ASSFAC= 0
##$ASSFACI= 0
##$ASSFACX= 0
##$ASSWID= 0
##$AUNMP= <proc_1d>
##$AZFE= 0.1
##$AZFW= 0.1
##$BCFW= 1
##$BC_mod= 2
##$BYTORDP= 1
##$COROFFS= 0
##$CY= -3
##$DATMOD= 1
##$DC= 2
##$DFILT= <>
##$DTYPP= 0
##$F1P= 0
##$F2P= 0
##$FCOR= 0.5
##$FTSIZE= 0
##$FT_mod= 4
##$GAMMA= 1
##$GB= 0.15
##$INTBC= 1
##$INTSCL= 1
##$ISEN= 128
##$LB= 0.25
##$LEV0= 0
##$LPBIN= 0
##$MAXI= 10000
##$MC2= 0
##$MEAN= 0
##$ME_mod= 0
##$MI= 1.114404
##$NCOEF= 0
##$NC_proc= 0
##$NLEV= 6
##$NOISF1= 3.799351
##$NOISF2= 2.8
##$NSP= 1
##$NTH_PI= 0
##$NZP= 0
##$OFFSET= 14.38212
##$PC= 1
##$PHC0= -1566.574
##$PHC1= 19.59229
##$PH_mod= 1
##$PKNL= yes
##$PPARMOD= 0
##$PSCAL= 0
##$PSIGN= 0
##$REVERSE= no
##$SF= 200.129724274929
##$SI= 16384
##$SIGF1= 3
##$SIGF2= 2
##$SINO= 400
##$SIOLD= 16384
##$SREGLST= <1H.CDCl3>
##$SSB= 0
##$STSI= 0
##$STSR= 0
##$SW_p= 3205.1282051282
##$SYMM= 0
##$S_DEV= 0
##$TDeff= 0
##$TDoff= 0
##$TI= <>
##$TILT= no
##$TM1= 0
##$TM2= 0
##$TOPLEV= 0
##$USERP1= <user>
##$USERP2= <user>
##$USERP3= <user>
##$USERP4= <user>
##$USERP5= <user>
##$WDW= 1
##$XDIM= 8192
##$YMAX_p= 0
##$YMIN_p= 0
$$ End of Bruker specific parameters
$$ ---------------------------------
##NTUPLES= NMR FID
##VAR_NAME=  TIME,          FID/REAL,        FID/IMAG
##SYMBOL=    X,             R,               I
##VAR_TYPE=  INDEPENDENT,   DEPENDENT,       DEPENDENT
##VAR_FORM=  AFFN,          ASDF,            ASDF
##VAR_DIM=   8192,          8192,            8192
##UNITS=     SECONDS,       ARBITRARY UNITS, ARBITRARY UNITS
##FACTOR=    0.0002768,     1,               1
##FIRST=     0,             0,               0
##LAST=      2.2672688,     0,               0
##MIN=       0,             -111573,         0
##MAX=       2.2672688,     76080,           0
$$ Real data points
##PAGE= N=1
##DATA TABLE= (X++(R..R)), XYDATA
$$ plain form
0 0 0 0 0 0 0 0 0 0 0 0 0 0 0 0 0 -7 7 -7 7 -7 7 -14 14 -14 21 -21 26 -28 33 -37 42 -49 56 -63 70 -78 88 -98
38 -98 109 -123 136 -152 167 -185 205 -225 248 -274 303 -332 365 -404 445 -491 544 -601 669 -748
58 -748 841 -949 1080 -1243 1456 -1735 2126 -2715 3692 -5599 10687 -53854 -111573 59594
72 59594 76080 -27563 341 74804 5834 -39743 15957 19275 -37397 -6890 32521 -16022
84 -16022 -42403 2064 -2270 -29430 4327 37398 12831 -6623 1681 10204 8684 8279 12707 10352
98 10352 -9103 -22346 -14460 -5510 -10917 -6620 12249 7768 -17184 -7331 16941 3937 -383 27092
112 27092 19003 -15439 -9306 7624 -8963 -15004 6365 5521 -17438 -12259 8813 -1082 -8786 13743
126 13743 19017 -2184 -2733 8682 1513 -6695 908 6444 -3549 -12481 -5335 429 -5665 -2486 7633
$$ packed form
0@%%%%%%%%%%%%%%%pJ4j4J4j4J4k1K8k8L5m2M7n4O1p0P9r1J05j19J33j48J66j86
38i8K07k32K59k88L19l52L90m30M73n22N77o35O97p69Q49r36J035j145J270j417
58g48J589j790K029k323K699l191L861m841O407r291J6286o4541n7719J71167
72E9594J6486j03643K7904P4463o8970m5577N5700L318n6672L0507L9411m8543
84a6022k6381M4467m334k7160L3757L3071k4567j9454Q304Q523j520m05M428k355
98A0352j9455j3243P886Q950n407M297J8869m481k4952R853K4272j3004m320K7475
112B7092q089l4442O133J6930j6587o041K1369q44k2959N179K1072r895p704K2529
126A3743N274k1201n49J1415p169q208P603N536r993q932P146N764o094L179J0119
$$ plain form
141 7633 4521 -2811 1760 6107 1427 -1443 4979 5393 -6239 -6547 2356 -2515 -8234 2475 5768
156 5768 -3970 -3216 4381 1930 -2475 2624 6145 -1051 -4503 2201 395 -5595 -746 3556 -1954
171 -1954 -2931 1724 1879 -243 450 2299 1712 -1805 -1383 878 -983 -1568 279 -447 -1600 -1303 113
188 113 2008 550 607 3305 827 -2252 1066 2086 -1799 -1926 468 -1246 -3429 -1967 1162 45
204 45 -861 2297 2126 -1028 626 3631 557 -414 1534 -251 -2736 -2368 -329 -780 -1978 -239 840
221 840 -1027 -742 2030 1571 756 2046 1589 70 -405 -422 -27 -1038 -1235 -355 -1230 -2370 -944 115
239 115 152 785 1374 1223 1151 770 790 1123 269 -140 -91 -1442 -1589 -780 -1118 -1317 -295 98 430 292 437
260 437 1938 1218 922 1409 475 -184 -486 -686 -877 -863 -910 -754 -608 -1153 -126 898 257 1175 1374 814
$$ packed form
141G633l112p332M571M347m680k870O422M14j1632l08Q903m871n719J0709L293
156E768r738P54P597k451m405N099L521p196l452O704j806n990M849M302n510
171a954r77M655J55k122O93J849n87l517M22K261j861n85J847p26j153K97J416
188A13J895j458N7K698k478l079L318J020l885j27K394j714k183J462L129j117
204D5r06L158j71l154J654L005l074r71J948j785k485L68K039m51j198J739J079
221H40j867K85K772m59q15J290m57j519m75j7L95j011j97Q80q75j140J426J059
239A15L7O33N89j51p2l81K0L33q54m09M9j351j47Q09l38j99J022L93L32j38J45
260D37J501p20k96M87r34o59l02k00j91J4m7J56J46n45J027J024o41R18J99n60
$$ plain form
280 814 247 429 259 146 -153 -464 -690 -1072 -1343 -449 -599 -446 553 104 277 483 783 819 753 647 584
301 584 -95 -504 -576 -549 -994 -245 -425 -682 -263 -277 -37 597 469 713 727 148 152 521 -130 31 -30 -546 -265
324 -265 -679 -603 -39 -245 -239 50 91 142 510 151 665 269 332 13 -118 -574 16 -63 -225 -46 -131 -515 -300
347 -300 7 106 381 83 371 31 -98 -68 196 36 -116 -56 -524 -408 -46 -191 -285 -25 -101 -67 -54 -218 229
370 229 360 -97 111 -150 -261 -136 -30 -64 151 62 19 -78 -378 72 241 -8 63 37 -29 40 76 184 490
393 490 186 339 183 20 -382 -45 -401 -298 -167 -338 -93 -358 152 -280 134 275 442 -9 -68 79 -77
414 -77 236 83 154 -171 -119 -106 -80 296 10 -53 -72 -171 104 332 -43 281 327 -62 34 -449 10 -20 -211 -281
438 -281 -157 -55 -197 22 -42 95 165 26 16 -26 59 65 179 17 128 -200 -159 99 -74 -1 125 -181 -416
$$ packed form
280H14n67J82j70j13k99l11k26l82k71Q94j50J53R99m49J73K06L00L6o6j06o3
301E84o79m09p2K7m45P49j80k57M19j4K40O34j28K44J4n79ML69o51J61o1n16K81
324b65m14P6N64k06OK89M1N1L68l59N14l96O3l19j31m56N90p9j62J79q5l84K15
347c00L07R9K75k98K88l40j29L0K64j60j52O0m68J16L62j45r4K60p6L4J3j64M47
370B29J31m57K08k61j11J25J06l4K15q9m3r7l00M50J69k49P1k6o6O9L6J08L06
393D90l04J53j56j63m02L37l56J03J31j71K45k65N10m32M14J41J67m51n9J47j56
414g7L13j53P1l25N2J3K6L76k86o3j9r9K75K28l75L24M6l89R6m83M59l0j91p0
438b81J24J02j42K19o4J37P0j39j0m2Q5OJ14j62J11l28M1K58j73P3J26l06k35
$$ plain form
461 -416 27 -67 24 293 204 306 328 -44 5 90 5 1 -186 -163 -147 -325 -336 -147 108 245 144 -3 -26 179 66
486 66 276 11 -113 -239 -12 -135 -115 -234 42 44 -1 -126 168 155 -60 193 295 66 164 350 137 91 -80
509 -80 -197 -42 -104 -175 -96 -88 117 -40 -14 331 329 -42 59 15 -73 -216 -271 62 -351 139 76 11 -242 -91 -161
534 -161 -41 40 211 117 111 143 174 38 32 75 -65 -47 -208 -123 149 -83 -8 -166 109 25 -124 -163 115 -197 -6
559 -6 13 -30 30 250 81 27 1 -184 -247 -51 -57 -231 -1 -88 98 63 -17 212 63 152 392 -97 355 -48 -57 -74
585 -74 147 17 -374 61 81 -44 -4 -280 340 12 175 40 75 89 -16 -220 183 -25 44 -39 138 -272 329
608 329 232 -1 38 147 221 175 63 -52 35 176 42 -87 14 -63 -51 -116 -68 73 -116 49 -119 -91 101 100
632 100 269 74 61 185 118 46 115 -35 -88 -29 17 119 -13 13 53 79 -37 66 89 -141 -38 -201 -124 -253
$$ packed form
461d16M43r4R1K69q9J02K2l72M9Q5q5mj87K3J6j78j1J89K55J37j01j47k3K05j13
486F6K10k65j24j26K27j23K0j19K76Km5j25K94j3k15K53J02k29R8J86k13m6j71
509h0j17J55o2p1P9QK05j57K6L45kl71J01m4q8j43n5L33m13M90o3o5k53J51p0
534a61J20Q1J71r4oL2L1j36oM3j40J8j61Q5K72k32P5j58K75q4j49l9K78l12J91
559fJ9m3O0K20j69n4k6j85o3J96oj74K30q7J86l5q0K29j49Q9K40m89M52m03rj7
585g4K21j30l91M35K0j25M0k76O20l28J63j35L5J4j05k04M03k08O9q3J77m10O01
608C29r7k33L9J09P4m6j12j15Q7J41j34j29J01p7J2o5M8J41j89J65j68K8J92j
632A00J69j95j3J24o7p2O9j50n3N9M6J02j32K6M0K6j16J03K3k30J03j63P7j29
$$ plain form
656 -253 185 85 -81 72 -117 -45 -40 125 6 -200 188 54 73 134 257 -46 303 251 -40 63 42 185 -35
679 -35 -60 5 48 117 197 -259 125 70 -41 104 195 56 -221 -228 -136 -30 52 -91 150 -279 15 30 103 -27 88
704 88 36 -41 176 127 7 61 175 -55 -43 -138 37 -189 -275 -113 -175 -173 264 -59 244 -85 180 -43 115 -103
728 -103 95 158 78 103 -66 -246 -120 -41 -18 -1 -34 -20 8 235 -174 248 -19 382 125 -27 115 103 60 -121
752 -121 47 -249 18 115 17 -163 -57 107 41 -47 283 24 -159 4 96 236 -201 27 -292 20 32 -98
774 -98 42 -27 140 -47 -146 -128 -31 43 151 -16 -207 89 -276 -333 -269 -5 -41 200 -308 -26 58 -74 -9 -180
798 -180 97 116 -54 309 -42 -298 7 46 231 227 97 93 -138 212 -310 -127 41 62 -158 45 207 83 355
821 355 206 260 120 -57 68 -213 85 -37 -288 76 94 141 177 57 -377 208 -208 366 -15 191 99 168
$$ packed form
656b53M38j00j66J53j89P2NJ65j19k06L88j34J9O1J23l03L49n2k91J03k1J43k20
679c5k5O5M3O9Q0m56L84n5j11J45R1j39k77pR2J06Q2j43K41m29K94J5P3j30J15
704H8n2p7K17m9j20N4J14k30J2r5J75k26q6J62o2KM37l23L03l29K65k23J58k18
728a03J98O3q0K5j69j80J26P9K3J7l3J4K8K27m09M22k67M01k57j52J42j2m3j81
752a21J68k96K67R7r8j80J06J64o6q8L30k59j83J63R2J40m37K28l19L12J2j30
774i8J40o9J67j87r9J8R7P4J08j67j91K96l65n7O4K64l6K41n08K82Q4j32O5j71
798a80K77J9j70L63l51k56L05L9J85mj30mk31L50n22J83J68K1k20K03J62j24K72
821C55j49N4j40j77J25k81K98j22k51L64J8M7L6j20m34N85m16N74l81K06r2O9
$$ plain form
843 168 18 -14 -99 37 150 -187 -176 11 213 43 -51 -193 -26 -128 -62 -194 91 172 -358 148 -38 -12 25
866 25 39 -92 -151 148 -176 165 117 -103 46 64 -72 -65 -293 87 66 -177 15 -128 193 59 158 10 -65 89
890 89 7 41 -175 -199 -347 -20 4 -157 -184 -106 196 -8 -146 -166 74 212 -159 104 -51 -186 -2 -166 110
913 110 -15 -52 107 49 212 -119 -36 -17 242 150 -37 149 -27 119 -11 -96 -303 -180 -122 -120 -221 -242 175 -92
937 -92 -21 151 -273 -87 64 -290 20 61 14 -137 169 -124 -75 -117 -134 87 173 -158 -104 -105 -215 -160 24 -197
961 -197 193 29 -201 -205 210 206 24 157 -182 144 261 -182 -30 116 -208 -92 -266 -74 2 -25 173 47
983 47 20 213 196 -86 -20 95 -132 137 -21 32 -85 -68 -88 -241 -2 120 -176 -31 161 -158 -253 -121 -146
1006 -146 194 48 9 -196 -174 26 124 305 43 130 73 125 88 -24 232 11 143 40 -179 -171 -338 -72 -21
$$ packed form
843A68j50l2q5J36J13l37J1J87K02j70r4j42J67j02O6j32K85Q1n30N06j86K6L7
866B5J4j31n9K99l24L41m8k20J49J8j36Pk28L80k1k43J92j43L21j34R9j48p5J54
890H9q2L4k16k4j48L27K4j61k7P8L02k04j38k0K40J38l71K63j55j35J84j64K76
913A10j25l7J59n8J63l31Q3J9K59r2j87J86j76J46j30q5k07J23N8Kj01k1M17k67
937i2P1J72m24J86J51l54L10M1m7j51L06k93M9m2j7K21Q6l31N4jj10N5J84k21
961a97L90j64k30mM15mj82J33l39L26J17m43J52J46l24J16j74J92P6k7J98j26
983D7k7J93j7k82O6J15k27K69j58N3j17J7k0j53K39J22k96J45J92l19r5J32k5
1006a46L40j46l9k05K2K00R8J81k62Q7n7N2l7j12K56k21J32j03k19Qj67K66N1
$$ plain form
1029 -21 -56 70 169 -57 -71 -15 -306 255 10 46 17 112 -102 14 238 -2 -99 49 153 -60 22 -16 140 -37
1053 -37 256 -194 -35 32 271 -16 -55 -103 -213 -135 -223 1 -67 189 -226 197 484 -17 -132 269 -169 -206 -24
1076 -24 23 166 -90 -35 150 55 -15 -169 -62 129 168 -4 -87 123 -25 111 -14 -13 122 -32 266 -98 37
1099 37 287 -136 -132 -82 204 -78 -28 -42 -137 -51 229 -65 -161 94 25 21 82 229 -41 133 -215 35 -96 41
1123 41 -23 145 13 -50 -54 -60 -74 86 -72 89 226 45 -38 56 270 -33 -72 173 -8 -113 -47 78 -119 114
1147 114 15 26 143 -219 -30 -250 118 19 -285 -134 190 -61 127 -52 28 63 51 62 67 -192 -198 2 6 180
1171 180 -215 53 65 183 -115 -190 -29 -58 -185 235 127 171 103 122 -303 -145 -47 -62 -94 -32 -131 54 109 -142
1195 -142 246 -27 7 81 285 58 -227 161 305 -47 78 -172 50 -219 41 -131 -15 82 -225 -272 -164
$$ packed form
1029b1l5J26R9k26j4N6k91N61k45L6k9R5k14J16K24k40r7J48J04k13Q2l8J56j77
1053c7K93m50J59O7K39k87l9m8j10P8q8K24o8K56m15M23K87n01j15M01m38l7J82
1076b4M7J43k56N5J85r5p0j54J07J91L9j72q3K10j48J36j25JJ35j54K98l64J35
1099C7K50m23MN0K86k82N0j4r5Q6K80k94r6K55o9mO1J47k70J74l48K50j31J37
1123D1o4J68j32o3moj4J60j58J61J37j81q3R4K14l03l9K45j81j05O6J25j97K33
1147A14r9J1J17l62J89k20L68r9l04J51L24k51J88j79Q0L5j2J1Nk59oK00MJ74
1171A80l95K68J2J18k98p5J61k9j27M20j08M4o8J9m25J58R8j5l2O2r9J85N5k51
1195a42L88k73L4P4K04k27k85L88J44l52J25k50K22k69K60j72J16R7l07m7J08
$$ plain form
1216 -164 141 -73 -9 17 -152 17 3 -437 -215 -17 2 103 -45 -76 22 -46 241 54 -68 102 -23 15 -6
1239 -6 -131 138 -117 -1 -98 -60 -51 143 102 -104 -46 -113 -133 161 42 257 218 174 136 58 197 78 1 187 92
1264 92 -41 126 -58 -179 -118 177 -202 118 129 287 108 -67 256 -78 90 -99 97 123 15 -143 -108 -65
1286 -65 -81 88 86 -14 26 -39 -118 2 194 15 -10 -42 206 14 -125 289 -87 139 -94 -158 79 81 322 -166
1310 -166 48 234 -199 101 71 -103 -52 15 185 -92 129 -63 -22 -86 -115 -181 -88 68 -165 -18 -85 192 -116
1333 -116 35 -95 70 -183 235 66 -28 -119 43 -203 -172 104 81 -23 -100 52 -261 -24 9 -116 -20 -50 68
1356 68 10 86 -19 -23 -217 -23 -166 79 218 249 157 157 161 -13 -141 157 -51 81 146 -153 -82 41 74 42 -180
1381 -180 -100 -167 167 27 -84 -52 -284 -24 -72 -191 50 103 -248 5 198 18 3 2 20 -164 -54 46 199
$$ packed form
1216a64L05k14O4K6j69J69j4m40K22J98J9J01j48l1R8o8K87j87j22J70j25L8k1
1239fj25K69k55J16r7L8RJ94m1k06N8o7k0K94j19K15l9m4l8p8J39j19p7J86r5
1264I2j33J67j84j21O1K95l79L20J1J58j79j75L23l34J68j89J96K6j08j58L5M3
1286f5j6J69kj00M0o5p9J20J92j79k5l2K48j92j39M14l76K26k33o4K37KK41m88
1310a66K14J86m33L00l0j74N1O7J70k77K21j92M1o4k9o6R3J56k33J47o7K77l08
1333a16J51j30J65k53M18j69r4r1J62k46L1K76k3j04p7J52l13K37L3j25R6l0J18
1356F8n8P6j05mj94J94j43K45J39L1r2%Mj74j28K98k08J32O5k99P1J23L3l2k22
1381a80Q0o7L34j40j11L2k32K60m8j19K41N3l51K53J93j80j5jJ8j84J10J00J53
$$ plain form
1404 199 229 -70 181 -105 -28 -159 -63 -279 81 -205 -11 -217 -208 211 117 221 133 223 1 33 204 111 -44
1427 -44 225 -122 -123 -161 31 17 49 7 -315 106 3 226 2 109 61 3 -128 208 -11 -150 -16 110 -150
1450 -150 51 18 101 -91 214 95 -410 180 -14 132 164 -17 -135 -88 -189 -89 -175 -148 152 141 178 -26 -162
1473 -162 -21 -23 -145 31 -26 -81 -264 18 30 9 -171 114 18 -56 99 -63 27 -121 154 171 -3 -87 -3 -115
1497 -115 124 -348 114 85 183 -225 -5 -247 30 -117 204 156 -47 222 -302 -30 255 14 138 -150 -5
1518 -5 62 -89 110 46 113 202 71 -16 -96 -196 -167 -56 -9 -216 43 -42 69 71 132 118 4 -64 223 40 223
1543 223 -38 194 46 83 -100 -47 -374 -32 33 90 -167 -255 192 -159 -19 52 86 -285 164 -228 -126 -73 165
1566 165 120 -152 56 180 -58 198 -235 -96 -21 -140 -286 -109 -36 -295 -32 -8 169 -106 -370 74 22 -43
$$ packed form
1404A99L0k99K51k86P7j31R6k16L60k86J94k06RM19r4J04q8R0k22L2J71r3j55
1427d4K69l47jl8J92j4L2m2l22M21j03K23k24J07m8n8j31L36k19j39J34J26k60
1450a50K01l3Q3j92L05j19n05N90j94J46L2j81j18M7j01J00q6K7L00j1L7k04j36
1473a62J41kj22J76n7n5j83K82J2k1j80K85r6p4J55j62R0j48K75J7j74q4Q4j12
1497a15K39m72M62k9R8m08K20k42K77j47L21m8k03K69n24K72K85k41J24k88J45
1518eO7j51J99o4O7Q9j31q7q0j00K9J11M7k07K59q5J11KO1j4j14o8K87j83J83
1543B23k61K32j48L7j83N3l27L42O5N7k57q8M47l51J40P1L4l71M49l92J02N3K38
1566A65m5k72K08J24k38K56m33J39P5j19j46J77P3k59K63K4J77k75k64M44n2o5
$$ plain form
1588 -43 -248 84 -184 98 -107 -269 109 87 377 72 265 -290 -107 -205 -135 143 -85 -114 83 61 85 40 118
1611 118 12 -82 47 -74 -104 -26 219 -20 -90 326 200 -39 364 38 -52 88 -276 -202 -30 -118 -237 -197 -42
1634 -42 -234 81 374 43 33 -109 -193 -304 80 -163 61 277 116 -141 209 -154 -38 -242 -35 -119 19
1655 19 -21 -41 153 -1 9 -5 -113 -131 138 104 -214 271 241 65 82 -5 -185 -24 114 -74 -12 32 30 276 70
1680 70 -10 -10 -80 -73 -98 -155 109 7 33 -2 -68 -4 -61 -13 108 -49 46 -96 -83 -153 125 -38 -349 62 -24 256
1706 256 54 -212 174 -176 -80 231 143 -78 171 77 157 154 -54 -17 45 63 40 -98 49 2 220 225 -105 -29 -236
1731 -236 116 33 -11 43 -117 51 -103 167 37 112 327 47 41 -141 65 -135 -118 -147 -3 126 179 71 82
1754 82 -86 -70 -35 -194 1 42 51 -54 51 -157 -54 -38 33 -290 244 -27 130 159 96 140 28 -118 -107 -248
$$ packed form
1588d3k05L32k68K82k05j62L78k2K90l05J93n55J83r8P0K78k28k9J97k2K4m5P8
1611A18j06r4J29j21l0P8K45k39p0M16j26k39M03l26r0J40l64P4J72q8j19M0J55
1634d2j92L15K93l31j0j42q4j11L84k43K24K16j61k57L50l63J16k04K07q4J38
1655A9m0k0J94j54J0j4j08j8K69l4l18M85l0j76J7q7j80J61J38j88O2M4kK46k06
1680G0q0%p0Pk5n7K64j02K6l5o6O4n7M8J21j57R5j42J3p0K78j63l11M11q6K80
1706B56k02k66L86l50R6L11q8k21K49r4Q0lk08L7O2J8k3j38J47m7K18Nl30P6k07
1731b36L52q3m4N4j60J68j54K70j30P5K15k80oj82K06k00J7k9J44J29N3j08J1
1754H2j68J6L5j59J95M1Rj05J05k08J03J6P1l23N34k71J57K9o3M4j12j46J1j41
$$ plain form
1778 -248 -135 -143 -15 62 -318 -235 -83 -19 -72 -14 51 93 -64 -126 86 -83 117 70 -414 64 68 -21 149 157 87 -72
1804 -72 -85 115 -114 -180 182 86 353 33 -127 8 -34 72 -94 19 226 -176 91 164 61 -38 -168 59
1826 59 -43 49 -31 111 170 -70 13 189 67 -58 162 -248 165 100 69 113 -99 -152 -99 15 -31 -188 130 33
1850 33 155 -87 -228 -172 190 -28 52 68 -378 46 112 121 338 129 -207 -107 -99 -242 39 230 -70 -7 33 32
1874 32 318 -70 62 70 101 227 -141 -122 31 52 199 -100 -180 -92 135 -197 -208 213 40 -145 55 7 -87 140
1898 140 -184 -64 -105 -236 -76 5 272 -81 -69 0 76 -38 201 2 -61 -213 -177 -218 -60 -5 -132 -81 136
1921 136 -29 -93 -8 -190 -166 354 -111 111 -34 -27 246 31 -84 77 137 -37 -112 1 68 32 40 -472 56 -209
1945 -209 -49 29 -82 92 49 -150 -32 60 95 -88 92 -59 -28 -263 69 -102 4 -75 18 -133 -48 234 27
$$ packed form
1778b48J13qJ28P7l80Q3J52O4n3N8O5M2j57o2K12j69K00m7m84M78Mq9J70Qp0j59
1804g2j3K00k29o6L62r6K67l20j60J35m2J06j66J13K07m02K67P3j03r9j30K27
1826E9j02R2q0J42N9k40Q3J76j22j25K20m10M13o5l1M4k12n3N3J14m6j57L18r7
1850C3J22k42j41N6L62k18Q0J6m46M24O6RK17k09l36J00Qj43K81J91l00O3M0j
1874C2K86l88J32QL1J26l68J9J53K1J47k99q0Q8K27l32j1M21j73j85K00m8r4K27
1898A40l24J20m1j31J60Q1K67l53J2O9P6j14K39j99o3j52L6m1J58N5j27N1K17
1921A36j65o4Q5j82K4N20m65K22j45PK73k15j15J61O0j74p5J13O7l6Qn12N28k65
1945b09J60P8j11J74m3j99J18R2L5j83J80j51L1k35L32j71J06p9R3j51Q5K82k07
$$ plain form
1968 27 98 -166 106 49 288 57 72 -177 -293 6 -232 -204 62 99 -163 131 -196 -172 7 14 48 110 -42 -41
1992 -41 101 -43 13 80 41 -146 -78 241 157 -31 22 145 -199 194 -57 110 65 -59 39 -142 78 123 -1
2015 -1 260 25 183 -46 -113 53 -227 -97 -304 -222 -135 35 89 -229 -89 -105 -127 -138 40 -140 -88 134 73 -10
2039 -10 -47 161 -123 4 58 -346 21 9 -48 -132 44 -113 160 33 -96 19 -13 111 87 134 -44 -44 269 -151
2063 -151 -48 -40 34 104 107 -81 -77 189 3 -32 -91 -164 -10 -22 189 -55 -45 42 93 -188 10 -139 -63 13 58 -43
2089 -43 -74 137 -140 -25 108 195 -208 100 -55 -194 -114 -83 90 -5 215 250 -23 121 -94 319 43 24 29
2112 29 -168 1 63 86 93 -93 -75 112 -61 134 -46 -120 -135 116 158 201 -121 140 -76 -193 130 121 81 248
2136 248 29 202 151 -138 106 -40 -191 -236 49 14 -17 232 74 -267 107 40 -263 273 170 192 -105 238
$$ packed form
1968B7P1k64K72n7K39k31J5k49j16K99k38K8K66L7k62K94l27K4J79PL4O2j52J
1992d1J42j44N6O7l9j87O8L19q4j88N3J23l44L93k51J67m5j24R8j81K20M5j24
2015aK61k35J58k29o7J66k80J30k07Q2Q7J70N4l18J40j6k2j1J78j80N2K22o1q3
2039a0l7K08k84J27N4m04L67j2n7q4J76j57K73j27j29J15l2J24k4M7j78%L13m20
2063a51J03QP4P0Lj88MK66j86l5n9p3J54j2K11k44J0Q7N1k81J98j49P6P6M5j01
2089d3l1K11k77J15J33Q7m03L08j55j39Q0L1J73r5K20L5k73J44k15M13k76j9N
2112B9j97J69O2K3Pj86J8J87j73J95j80p4j5K51M2M3l22K61k16j17L23rm0J67
2136B48k19J73n1k89K44j46j51m5K85l5l1K49j58l41L74o7l03N36j03K2k97L43
$$ plain form
2158 238 107 136 41 134 94 -16 -1 -253 -37 173 -43 149 -201 -8 20 115 -49 -10 -83 167 -151 -160 -48 -63
2182 -63 10 -129 -35 37 -93 -30 -185 125 89 -242 49 134 119 237 -12 -123 -71 127 -89 -78 -42 87 78 138 -112
2207 -112 45 98 -8 -23 37 33 -75 -237 76 -104 147 -96 -109 -155 138 68 -178 -42 106 -81 100 107 28 -27
2231 -27 47 294 -93 127 45 -4 -214 -387 -93 -110 -65 -22 -367 -4 156 -68 -63 277 113 203 116 -51 -250 121
2255 121 -89 196 22 -219 142 125 -72 -25 -5 -90 104 -41 -39 103 143 -150 -115 -141 -129 105 -140 34 64 -152
2279 -152 -141 -146 -148 -235 -247 -164 -218 160 221 -40 397 -61 -43 -100 -225 116 -52 -424 486 133 -4 -167 -81 -110 21
2304 21 17 -89 201 56 392 -94 -92 12 117 -8 162 -105 70 -159 64 -241 -66 -190 -201 -149 -113 68 -181
2327 -181 177 0 7 -409 -244 226 82 -266 -112 206 -168 92 -197 316 -44 9 124 -254 281 181 170
$$ packed form
2158B38j31K9r5R3m0j10J5k52K16K10k16J92l50J93K8R5j64L9p3K50l18rJ12j5
2182f3P3j39R4P2j30O3j55L10l6l31K91Q5j5J18k49j11N2J98k16J1L6J29rO0k50
2207a12J57N3j06j5O0mj08j62L13j80K51k43j3m6K93p0k46J36J48j87J81Pp9n5
2231b7P4K47l87K20q2m9k10j73K94j7M5M3l45L63J60k24NL40j64R0q7j67j99L71
2255A21k10K85j74k41L61j7j97M7K0q5J94j45KJ42M0k93L5k6J2K34k45J74L0k16
2279a52J1nkq7j2Q3n4L78O1k61M37m58J8n7j25L41j68l72R10l53j37j63Q6k9J31
2304B1mj06K90j45L36m86KJ04J05j25J70k67J75k29K23l05J75j24j1N2L6J81k49
2327a81L58j77Pm16J65M70j44l48J54L18l74K60k89N13l60N3J15l78N35j00j1
$$ plain form
2348 170 45 -25 143 -48 42 89 -2 96 -270 -1 94 38 -116 39 170 -184 183 -75 -251 -149 31 146
2370 146 -73 137 -59 161 -98 207 245 -180 4 -195 -186 151 12 -55 183 78 199 8 -36 33 77 147 -6
2393 -6 101 -46 -163 -152 111 -55 104 138 -51 -100 -41 -90 132 288 85 -90 58 85 -2 40 176 203 -59 -47
2417 -47 287 23 20 6 -53 242 -32 26 60 61 -229 4 6 70 -219 92 52 125 7 66 58 -55 -22 -80 -89 163 406
2444 406 -190 -92 -6 -59 32 169 -160 107 -239 -55 -18 126 -10 151 -63 128 -203 -14 49 156 110 64 -140
2467 -140 186 -166 20 87 150 96 146 -147 227 -37 107 51 -253 27 21 107 -172 13 -155 -108 -288 7 -81
2490 -81 -324 107 143 260 -66 -154 -17 37 100 -94 -4 -11 87 -112 -82 172 -297 86 -198 -38 25 72 -105 -31
2514 -31 320 51 37 -27 119 -161 -176 -134 -206 93 -218 113 161 -186 51 120 12 21 51 -259 166 -191 -75 -115
$$ packed form
2348A70j25p0J68j91R0M7r1R8l66K69R5n6j54J55J31l54L67k58j76J02J80J15
2370A46k19K10j96K20k59L05L8m25J84j99RL37j39o7K38j05J21j91m4O9M4P0j53
2393fJ07j47j17J1K63j66J59L4j89m9N9m9K22J56k03j75J48K7q7M2J36K7k62J2
2417d7L34k64lj4n9K95k74N8L4Jk90K33KO4k89L11m0P3j18N9qj13L3n8rK52K43
2444D06n96R8Q6n3R1J37l29K67l46J84L7J44j36J61k14J91l31J89O3J07m6m6k04
2467a40L26l52J86O7O3n4N0k93L74k64J44n6l04K80oQ6k79J85j68M7j80K95q8
2490h1k43M31L6J17l26q8J37N4O3j94R0pR8j99L0K54m69L83k84J60O3M7j77P4
2514c1L51k69j4o4J46k80j5M2p2K99l11L31M8l47K37O9j08RL0l10M25l57J16m0
$$ plain form
2538 -115 -118 128 -47 167 133 -160 10 -25 -74 279 -164 161 -64 -62 296 -41 85 234 145 182 -100 120 -187
2561 -187 236 -111 -15 261 -312 -32 -56 -305 56 4 -2 190 121 38 75 -113 -432 -94 9 48 179 -39 28
2584 28 -32 -158 -40 111 34 -136 -32 49 -168 -186 202 -36 150 -81 77 -11 18 45 -267 -280 62 -54 -71
2607 -71 96 -51 -226 21 -13 -255 -72 -196 20 94 -69 191 -42 -261 -119 306 36 -77 -52 3 -190 -7
2629 -7 88 -93 -40 89 155 -211 -229 254 -15 -88 -16 96 -270 59 14 -269 74 -346 -253 417 -124 -224 221
2652 221 215 268 -282 53 -104 171 40 5 322 -41 141 59 7 -113 59 48 217 -10 152 -48 289 243 77
2675 77 140 -52 -184 -55 -77 -155 12 13 -76 -195 135 -116 -63 -229 -79 121 214 -67 -168 -141 -54 14 200 25
2699 25 21 13 26 -59 -89 -89 -3 194 201 -159 226 -47 8 182 395 -46 -189 -34 17 -93 103 -11 -55 -12 -117 15
$$ packed form
2538a15lK46j75K14l4k93J70l5m9L53m43L25k25KL58l37J26J49q9L7k82K20l07
2561a87M23l47R6K76n73K80k4k49L61n2oJ92o9q3L7j88l19L38J03L9J31k18O7
2584B8o0j26J18J51p7j70J04Q1k17j8L88k38J86k31J58q8K9K7l12j3L42j16j7
2607g1J67j47j75K47l4k42J83j24K16P4j63K60k33k19J42M25k70j13K5N5j93J83
2629gR5j81N3J29O6l66j8M83k69p3P2J12l66L29m5k83L43m20R3O70n41j00M45
2652B21oN3n50L35j57K75j31l5L17l63J82q2n2j20J72j1J69k27J62k00L37m6j66
2675G7O3j92j32J29k2p8J67Jq9j19L30k51N3j66J50K00R3k81j01K7Q7O8J86j75
2699B5mqJ3q5l0%Q6J97Pl60L85k73N5J74K13m41j43J55N1j10J96j14m4M3j05J32
$$ plain form
2725 15 -32 103 -8 56 18 24 -54 -145 -35 133 -37 217 -277 -206 -12 -132 -34 62 -63 -46 76 129 81 -11 -105
2750 -105 -106 -214 106 -130 -78 -109 -24 -59 -19 61 61 96 -164 153 68 -26 5 38 9 -184 96 148 -109 76 -143 109
2776 109 -227 257 54 161 -111 -305 106 350 -33 17 -72 77 -145 -11 -214 123 -7 129 -172 24 -146
2797 -146 11 -21 -263 195 200 -76 -177 200 126 -81 245 87 0 -14 4 149 -34 190 161 -48 -31 -18 -24 -195
2821 -195 4 21 9 24 -80 119 -27 72 43 117 223 -91 71 121 115 -28 227 20 10 102 -39 167 66 -69
2845 -69 152 -160 -113 -14 -328 250 57 -89 -44 90 77 -30 -37 -189 -246 63 -29 271 191 46 -164 -147 73 173
2869 173 -171 234 -75 107 -66 -154 -26 -31 -20 -164 -56 -249 66 -33 -169 33 -203 82 166 -216 179 75
2891 75 -140 -8 -145 190 -101 -25 -38 51 206 -52 365 -19 -171 14 31 -73 104 1 261 -210 276 102
$$ packed form
2725A5m7J35j11O4l8Op8r1J10J68j70K54m94P1J94j20R8R6j25J7J22N3m8r2r4
2750a05jj08L20k36N2l1Q5l5M0Q0%L5k60L17q5r4L1L3k9j93K80N2k57J85k19K52
2776A09l36M84k03J07k72j94M11K44l83N0q9J49k22J34k03L37j30J36l01J96j70
2797a46J57l2k42M58Nk76j01L77p4k07L26j58q7j4J8J45j83K24k9k09J7J3oj71
2821a95J99J7j2J5j04J99j46R9k9P4J06l14J62N0oj43K55k07j0R2j41K06j01j35
2845f9K21l12M7R9l14N78j93j46M5J34j3j07pj52n7L09r2L00q0j45k10J7K20J00
2869A73l44M05l09J82j73q8J28nJ1j44J08j93L15r9j36K02k36K85Q4l82L95j04
2891G5k15J32j37L35k91P6j3Q9J55k58M17l84j52J85J7j04J77j03K60m71M86j74
$$ plain form
2913 102 104 -120 -200 62 -54 98 120 352 -141 -206 -49 -82 208 -2 96 128 -160 -14 -111 89 219 133 -233
2936 -233 58 34 -117 8 -114 101 -388 15 109 -168 131 361 -57 -82 -164 -56 -104 165 -101 -101 -12 -144 133
2959 133 -227 -267 62 27 136 135 -334 87 -46 73 -38 42 88 52 125 62 -124 -359 -53 88 -193 -64 67
2982 67 226 -66 -121 36 24 46 -13 137 -219 -75 -141 -208 -16 219 -121 -26 91 -125 -5 284 153 225 42
3005 42 -63 -59 -222 345 73 -4 -174 146 54 -80 79 182 -120 -166 -162 -117 213 -83 -263 170 123 -97 -72 19
3029 19 -315 -9 -180 -133 188 74 -57 165 1 34 69 -290 -168 249 13 231 198 -181 161 62 -150 -328
3051 -328 -2 192 -77 93 -351 95 21 83 -209 -18 206 29 117 45 35 27 -25 108 285 97 63 160 16
3074 16 29 18 -46 74 39 189 41 41 -182 -72 223 241 -59 -63 -1 -82 153 98 -226 -151 140 -121 -60 21 -170
$$ packed form
2913A02Kk24q0K62j16J52K2K32m93o5J57l3K90k10R8L2k88J46r7K00J30q6l66
2936b33K91k4j51J25j22K15m89M03R4k77K99K30m18k5q2J08m8K69k66%Q9j32K77
2959A33l60m0L29l5J09jm69M21j33J19j11Q0M6l6P3o3j86k35L06J41k81J29J31
2982F7J59k92n5J57j2K2n9J50l56J44o6o7J92K35l40R5J17k16J20K89j31P2j83
3005D2j05Mj63N67k72p7j70L20r2j34J59J03l02m6MM5L30k96j80M33m7k20K5R1
3029A9l34L06j71M7L21j14j31K22j64L3L5l59J22M17k36K18l3l79L42r9k12j78
3051c28L26J94k69J70m44M46p4O2k92J91K24j77Q8p2j0qn2J33J77j88l4R7j44
3074A6J3j1o4J20l5J50j48%k23J10K95J8l00mO2q1K35n5l24P5K91k61O1Q1j91
$$ plain form
3099 -170 -141 -28 -143 -3 -107 -203 -126 81 129 -181 -28 0 236 105 135 29 -245 43 29 -94 -5 290 -24
3122 -24 28 -124 35 173 -99 88 119 -50 -125 173 -10 28 -165 43 -33 34 3 126 86 200 145 69 40 115
3146 115 83 -16 68 70 -34 -26 -277 -75 122 -107 -6 75 137 -64 1 -86 138 -156 -67 138 75 -110 31 53 -55
3171 -55 -179 -252 52 -197 -219 24 -25 70 -165 -92 -293 135 63 -326 75 -41 -352 222 -161 119 -46 -225
3193 -225 339 148 -3 -179 20 171 119 -7 -271 -8 268 161 -45 -62 122 34 16 -149 160 154 -113 30
3215 30 -17 129 118 19 120 189 -80 -104 -294 54 -75 140 96 -161 164 79 -142 155 198 90 17 132 -13
3238 -13 -282 15 -135 70 -117 9 -87 53 125 -40 280 -359 -22 49 30 198 36 66 -145 -143 41 30 89
3261 89 164 -54 -59 24 -19 52 260 263 267 84 -155 -243 183 -89 94 136 9 -52 -29 -164 -66 236 -113 -51 58 307
$$ packed form
3099a70K9J13j15J40j04r6P7K07M8l10J53K8K36j31L0j06k74K88j4j23Q9K95l14
3122b4N2j52J59J38k72J87L1j69p5K98j83L8j93K08p6O7l1J23m0J14n5p6k9P5
3146A15l2r9Q4Kj04Qk51K02J97k29J01Q1O2k01O5q7K24k94Q9K05o3j85J41K2j08
3171e5j24p3L04k49k2K43m9R5k35P3k01M28p2l89M01j16l11N74l83K80j65j79
3193b25N64j91j51j76J99J51n2j26k64K63K76j07k06j7J84q8j8j65L09ok67J43
3215C0m7J46j1r9J01O9k69k4j90L48j29K15m4k57L25q5k21K97M3j08p3J15j45
3238a3k69K97j50K05j87J26r6J40P2j65L20o39L37P1j9J68j62L0k11KJ84j1N9
3261H9P5k18nQ3m3P1K08LMj83k39q8M26k72J83M2j27o1K3j35R8L02l49O2J09K49
$$ plain form
3287 307 56 -209 252 -72 -127 -79 24 -43 -24 267 -106 -166 54 -1 263 4 -139 127 139 -44 -56 -287 121
3310 121 -64 32 131 135 169 246 80 -38 -216 35 -139 4 373 195 165 -303 202 -128 7 -31 93 -51 -174
3333 -174 -53 25 6 -18 -3 -313 107 54 112 56 66 8 -172 -147 71 -126 33 194 -34 66 124 -288 264 19
3357 19 -67 225 47 274 -249 -2 242 6 322 198 -201 100 32 32 121 -180 -67 -89 133 621 45 -161
3379 -161 131 25 -45 61 -181 -168 -67 91 87 337 223 -148 -52 145 95 203 -117 85 34 -20 355 -43 34
3402 34 76 159 -220 155 -42 -57 288 424 103 -79 -83 -2 179 -107 76 12 142 -79 184 89 -141 -173 -104 117
3426 117 -82 -48 -106 309 170 59 152 -178 -265 145 -259 152 88 -89 -31 130 44 -125 -54 289 -35 54 -39
3449 -39 118 10 -45 8 128 167 15 89 174 176 12 -12 -9 -110 -40 36 -27 22 -36 157 -97 -33 -190 -72 80 210
$$ packed form
3287C07k51k65M61l24n5M8J03o7J9K91l73o0K20n5K64k59j43K66J2j83j2k31M08
3310A21j85R6R9ML4P7j66j18j78K51j74J43L69j78l0m68N05l30J35l8J24j44j23
3333a74J21P8j9k4J5l10M20n3N8n6J0n8j80K5K18j97J59J61k28J00N8m12N52k45
3357A9q6K92j78K27n23K47K44k36L16j24l99L01o8%Q9l01J13k2K22M88n76k06
3379a61K92j06p0J06k42J3J01J58mK50j14l71R6J97n0J08l20K02n1n4L75l98P7
3402C4M2Q3l79L75j97j5L45J36l21j82mQ1J81k86J83o4J30k21K63r5k30l2O9K21
3426A17j99L4n8M15j39j11R3l30q7M10m04M11o4j77N8J61q6j69P1L43l24Q9r3
3449c9J57j08n5N3J20L9j52P4Q5Kj64k4Lj01P0P6o3M9n8J93k54O4j57J18J52J30
$$ plain form
3475 210 129 -70 -10 169 -24 -43 -280 -51 -85 112 37 -99 39 -126 161 -153 66 49 -36 191 -59 -39 24
3498 24 -110 73 -401 -5 -14 62 -164 144 -65 86 170 -206 -187 111 67 156 28 -232 -126 67 55 -173 294
3521 294 17 -245 -190 5 181 -206 57 -54 -68 289 140 134 -37 43 64 172 -223 -37 118 55 -107 37
3543 37 78 -44 -278 -205 -48 -42 -77 159 110 0 55 -151 -188 -67 -26 16 -72 -107 139 7 -22 -120 71 -151 36
3568 36 5 -85 -8 58 -20 -118 -33 -208 78 230 137 6 76 89 224 21 -64 -131 -185 213 -115 -2 -226 -68 -48
3593 -48 -266 -12 13 -114 51 -42 -82 -173 40 -98 56 52 196 138 196 114 -57 -11 -124 123 -269 -181 30 -100
3617 -100 -8 429 -186 -218 -122 98 -75 -200 -8 164 -11 -415 -125 -218 -104 179 273 -43 4 -24 -203 71
3639 71 -359 158 -252 -97 -33 -44 86 -577 154 -41 15 -24 214 116 46 176 117 -255 145 -36 72 68 -219
$$ packed form
3475B10q1j99O0J79j93j9k37K29l4J97p5j36J38j65K87l14K19j7q5K27k50K0O3
3498B4j34J83m74L96rP6k26L08k09J51Q4l76J9K98m4Q9j28k60J06J93j2k28M67
3521B94k77k62N5J95J76l87K63j11j4L57j49oj71Q0K1J08l95J86J55o3j62J44
3543C7M1j22k34P3J57Ol5K36m9j10N5k06l7J21M1M2q8l5K46j32k9r8J91k22J87
3568C6l1r0P7O6p8r8Q5j75K86J52r3j31P0J3J35k03q5o7n4L98l28J13k24J58K0
3593d8k18K54K5j27J65r3m0r1K13j38J54mJ44n8N8q2j71M6j13K47l92Q8K11j30
3617a00R2M37o15l2R6K20j73j25J92J72j75m04K90r3J14K83R4l16M7k8j79K74
3639G1m30N17m10J55O4j1J30o63P31j95N6l9K38r8p0J30n9l72M00j81J08mk87
$$ plain form
3662 -219 129 -86 43 43 -97 -118 -148 24 57 132 -130 -103 130 56 -9 143 -92 87 -303 206 -161 -35 -311
3685 -311 -117 193 -170 182 -25 -87 -27 137 103 -2 -85 117 57 -86 453 -217 83 -127 -70 255 -13 -16 68
3708 68 -134 35 -81 144 350 169 -270 47 271 -81 11 264 77 -85 -60 -25 84 148 -157 -26 97 87
3730 87 36 -34 24 -74 204 37 10 65 101 299 -73 12 -32 53 211 121 -111 33 245 -20 57 77 -226 -164 -86
3755 -86 -122 -41 -80 -53 97 22 -104 -325 7 198 -15 -46 -49 183 -51 132 -236 59 -214 124 172 79 20 279
3779 279 -382 -21 21 93 -155 82 64 -1 165 137 2 26 3 -63 57 -346 158 62 28 -193 -222 43 -61 72
3803 72 -228 -81 -75 -78 139 -55 179 -29 -65 164 414 281 72 -106 -56 119 31 399 -82 149 88 -129 83
3826 83 -57 178 125 0 59 -146 9 86 -26 -21 -35 262 -21 -64 43 35 -41 -61 -25 240 165 -158 46 58 134
$$ packed form
3662b19L48k15J29%j40k1l0J72L3P5k62K7K33p4o5J52k35J79l90N09l67J26k76
3685c11J94L10l63L52k07o2O0J64l4j05q3K02o0j43N39o70L00k10N7L25k68lQ4
3708F8k02J69j16K25K06j81m39L17K24l52R2K53j87j62K5L5J09O4l05J31J23j0
3730H7n1p0N8r8K78j67k7N5L6J98l72Q5m4Q5J58r0k32J44K12k65P7K0l03O2P8
3755h6l6Q1l9K7J50p5j26k21L32J91k13l1lK32k34J83l68K95k73L38M8r3n9K59
3779B79o61L61M2P2k48K37j8o5J66k8j35K4k3o6J20m03N04r6l4k21k9K65j04J33
3803G2l00J47OlK17j94K34k08l6K29K50j33k09j78N0J75q8L68m81K31o1k17K12
3826H3j40K35n3j25N9k05J55P7j12Nj4K97k83m3J07qp6k0L6K65p5l23K04J2P6
$$ plain form
3851 134 -185 2 99 133 -161 28 -41 -64 149 14 -21 160 97 -146 -16 82 268 -4 41 184 -238 188 -222
3874 -222 -18 104 -36 -63 -44 -128 -81 -256 23 -192 -252 1 139 232 -64 -12 55 133 44 -100 33 353 -116
3897 -116 -212 185 -235 38 134 -117 -86 -81 173 -191 55 64 50 -282 -152 -105 217 -148 -144 -21 15 76 38 -118 -104
3922 -104 -279 97 91 4 -213 154 -39 67 7 -40 57 68 -71 -123 116 -105 7 -77 -104 -23 -152 42 85 151
3946 151 44 23 -155 -85 -366 -45 64 -2 -15 254 -7 22 -143 -20 281 -35 72 106 13 42 -70 128 -151
3969 -151 99 -46 -2 -108 271 90 -357 205 10 -319 -223 -151 45 -28 61 221 22 190 -167 68 -173 58
3991 58 81 -56 256 -5 -54 354 342 -221 -180 27 1 -64 -84 -127 43 336 -119 236 -110 -59 7 -61 -66 166 -142
4016 -142 63 242 -136 -178 108 102 122 15 -6 27 220 148 3 -111 156 141 114 -67 41 -152 30 -233 -13
$$ packed form
3851A34l19J87R7L4k94J89o9k3K13j35l5J81o3k43J30R8J86k72M5J43m22M26m10
3874b22K04J22j40k7J9q4M7j75K79k15o0K53J38R3k96N2O7P8q9j44J33L20m69
3897a16r6L97m20K73R6k51L1NK54l64K46Rj4l32J30M7L22l65MJ23L6O1l8j56J4
3922a04j75L76oq7k17L67j93J06o0m7R7J1j39n2K39k21J12q4k7Q1j29J94M3O6
3946A51j07k1j78P0k81L21J09o6j3K69k61K9j65J23L01l16J07L4r3K9j12J98k79
3969a51K50j45M4j06L79j81m47N62j95l29R6P2J96p3Q9J60j99J68l57K35k41K31
3991E8K3j37L12k61m9M08j2n63M1K07k6o5k0m3J70K93m55L55l46N1O6o8nK32l08
4016a42K05J79l78m2K86oK0j07k1L3J93p2j45j14K67j5k7j81J08j93J82k63K20
$$ plain form
4039 -13 263 85 83 76 -170 -204 -48 -221 14 106 -123 -353 150 48 265 0 -6 148 -188 90 -92 2 121
4062 121 244 79 -105 56 80 0 -133 -31 52 -206 -395 -223 -31 -41 31 354 -184 -179 221 24 45 338 -89
4085 -89 -51 16 146 112 -60 72 92 42 138 -136 -118 37 -147 -267 -136 -93 -9 -122 152 88 -27 77 -161 -80
4109 -80 -243 -47 -121 -62 -53 -93 181 389 -19 -96 -228 36 -157 -83 -94 51 -101 239 -29 -214 92 -24 283
4132 283 -34 -102 179 -361 -66 82 -21 266 -43 -225 130 92 -64 -66 -184 33 -364 139 -311 189 187 85
4154 85 70 -48 -5 -3 160 200 -42 104 331 -294 221 39 -41 279 -254 -79 -54 -45 52 112 -256 0 -153 241
4178 241 -36 125 306 94 55 -75 171 -28 -151 -7 -167 -250 -141 -22 268 11 -190 108 -66 100 -142
4199 -142 -32 92 -76 27 66 -153 -131 173 167 3 -97 13 104 -45 82 120 211 76 42 5 -210 108 122
$$ packed form
4039a3K76j78kpk46l4J56j73K35R2k29k30N03j02K17k65oJ54l36K78j82R4J19
4062A21J23j65j84J61K4q0j33J02Q3k58j89J72J92j0P2L23n38NM00j97K1K93m27
4085h9L8O7J30l4j72J32K0n0R6k74J8J55j84j20J31M3Q4j13K74o4j15J04k38Q1
4109h0j63J96p4N9Rm0K74K08m08p7j32K64j93P4j1J45j52L40k68j85L06j16L07
4132B83l17o8K81n40K95J48j03K87l09j82L55l8j56kj18K17l97N03m50N00kj02
4154H5j5j18M3KJ63M0k42J46K27o25N15j82q0L20n33J75K5RR7O0l68K56j53L94
4178B41k77J61J81k12l9j30K46j99j23J44j60q3J09J19K90k57k01K98j74J66k42
4199a42J10J24j68J03L9k19K2L04oj64j00J10R1j49J27L8R1j35l4l7k15L18J4
$$ plain form
4222 122 70 41 41 233 -148 -59 -59 -88 -143 105 -55 126 76 23 -121 92 -197 -232 -57 -39 123 -144 -112 -76 181
4247 181 -2 -94 267 -15 97 -101 -64 -59 -103 50 200 -86 147 198 -131 -127 -65 16 -152 196 197 46 -44 9 -133
4272 -133 -156 -105 139 89 404 13 -217 67 107 9 -17 51 -82 -17 63 -104 -117 116 70 18 -55 -114 -57 29 -60 -115
4298 -115 162 -165 42 175 -149 22 193 174 -2 -137 -197 -142 175 -69 334 188 -79 179 163 166 -14 -309
4320 -309 -40 -121 68 170 91 110 -36 -341 -34 86 47 96 58 -116 -216 87 20 -54 -82 144 138 45 12 -45 -22
4345 -22 129 -33 61 20 75 -135 44 168 -32 -85 -135 -123 -39 -111 137 56 -41 -251 -70 156 214 -17 -121 38
4369 38 -7 -29 83 107 -138 183 -421 -54 193 -76 -27 190 152 200 -152 -134 32 -331 2 51 -45 139 -196
4392 -196 -33 -166 -192 -9 128 -117 -21 -138 -209 396 107 36 238 -145 -74 -55 156 59 -162 54 -64 -196
$$ packed form
4222A22n2k9%J92l81Q9%k9n5K48j60J81n0n3j44K13k89l5J75J8J62k67L2L6K57
4247A81j83r2L61k82J12j98L7Nm4J53J50k86K33N1l29MO2Q1j68L48Jj51r0N3j42
4272a33k3N1K44n0L15l91k30K84M0r8k6O8j33O5Q0j67j3K33m6n2p3n9N7Q6q9n5
4298a15K77l27K07J33l24J71J71j9j76j35o0N5L17k44M03j46k67K58j6Lj80k95
4320c09K69q1J89J02p9J9j46l05L07J20l9M9l8j74j00L03o7p4k8K26or3l3n7K3
4345b2J51j62R4m1N5k10J79J24k00n3n0J2Q4p2K48q1r7k10J81K26N8k31j04J59
4369C8m5k2J12K4k45L21o04L67K47k69M9K17l8M8l52J8J66l63L33M9r6J84l35
4392a96J63j33k6J83J37k45R6j17p1O05k89p1K02l83P1J9K11r7k21K16j18j32
$$ plain form
4414 -196 11 -245 -2 -20 -47 -59 114 -150 -242 147 -7 -110 258 -140 -154 373 -259 -371 -153 -302 73 -117
4436 -117 62 41 51 186 -60 95 -53 158 93 -136 -192 -177 -30 -71 -124 -111 -125 -109 184 -254 -201 -220 -40 57
4460 57 10 144 -65 168 -132 -12 -31 -48 -49 265 99 32 91 -135 -92 -146 -91 -218 188 189 -58 -2 -220 125 245
4485 245 -330 -32 318 -7 -52 103 -142 -5 -257 65 -140 33 19 -77 -360 69 4 -168 -82 43 86 -122
4507 -122 -247 -8 -237 90 24 -29 -20 -189 -113 82 336 -74 33 124 65 -20 -169 -108 106 114 219 -377 21 -175
4531 -175 -127 282 -207 -16 -64 -195 77 128 74 -214 -118 172 -47 267 45 64 120 149 204 -43 -271 -193 -77
4554 -77 151 -244 39 -211 -339 -196 39 31 -15 170 93 -249 -17 68 71 101 35 -3 -106 334 -48 -24 -129 269
4578 269 -63 159 12 104 110 162 -113 -37 -202 191 -108 127 65 -36 -121 68 -93 -263 212 -114 63 -236
$$ packed form
4414a96K07k56K43j8k7j2J73k64r2L89j54j03L68l98j4N27o32j12K18j49L75j90
4436a17J79k1J0J35k46J55j48K11o5k29n6J5J47m1n3J3j4J6K93m38N3j9J80R7
4460E7m7J34k09K33l00J20j9j7jL14j66o7N9k26M3n4N5j27M06Jk47N6k18L45J20
4485B45n75K98L50l25m5J55k45J37k52L22k05J73j4r6k83M29o5j72Q6J25M3k08
4507a22j25K39k29L27o6n3Rj69P6J95K54m10J07R1n9q5j49O1K14QJ05n96L98j96
4531a75M8M09m89J91m8j31K72N1n4k88R6K90k19L14k22J9N6K9N5k47k28P8J16
4554g7K28l95K83k50j28J43K35qm6J85p7l42K32Q5LL0o6l8j03M40l82K4j05L98
4578B69l32K22j47R2ON2k75P6j65L93k99K35o2j01q5J89j61j70M75l26J77k99
$$ plain form
4600 -236 14 66 -39 30 161 -48 -123 -70 -142 62 -135 -172 -92 37 171 -6 -48 272 -126 706 -72 -212 -62
4623 -62 -217 -167 -40 -157 113 133 232 54 90 -55 7 -162 -210 28 -145 44 83 92 -3 81 -187 68 43 -18 -29
4648 -29 90 176 101 -20 74 31 30 -245 -122 -79 -79 161 17 112 -260 280 -77 -47 -17 223 -30 134 -163 -102 155
4673 155 -4 -95 103 231 -3 85 -108 -182 -20 175 70 85 32 -66 -37 228 -25 -124 128 136 97 -126 -29 -77
4697 -77 62 280 409 285 -5 -40 118 116 -264 -25 -102 -99 -72 -324 -204 217 163 -75 -47 -9 101 189 163 -152
4721 -152 -28 -220 -7 -68 -3 252 147 0 -60 190 230 -34 211 176 34 -15 291 2 88 59 -23 -55 4 34
4745 34 34 175 -63 -11 22 -149 107 -9 -187 85 230 60 -143 -37 217 44 -270 286 -141 -3 -25 -187
4767 -187 -223 -48 -39 120 9 -181 103 220 -56 31 62 -356 -105 41 73 -37 96 -32 197 97 13 338
$$ packed form
4600b36K50N2j05O9J31k09p5N3p2K04j97l7Q0J29J34j77m2L20l98Q32p78j40J50
4623f2j55N0J27j17K70K0R9j78L6j45O2j69m8K38j73J89L9Rr5Q4k68K55k5o1j1
4648b9J19Q6p5j21R4m3jk75J23M3%K40j44R5l72N40l57L0L0K40k53J64k97O1K57
4673A55j59r1J98J28k34Q8j93p4J62J95j05J5n3r8K9K65k53r9K52Ql9k23R7m8
4697g7J39K18J29j24k90l5J58kl80K39p7LK7k52J20M21n4k38K8L8J10Q8k6l15
4721a52J24j92K13o1O5K55j05j47o0K50M0k64K45l5j42m9L06k89Q6k9q2l2N9L0
4745C4%J41k38N2L3j71K56j16j78K72J45j70k03J06K54j73l14N56m27J38k2j62
4767a87l6J75RJ59j11j90K84J17k76Q7L1m18K51J46L2j10J33j28K29j00q4L25
$$ plain form
4789 338 23 228 88 66 246 14 51 -207 -17 -46 13 228 197 -82 13 -26 -65 -236 -5 -3 80 18 55 -141
4813 -141 -264 232 66 69 -142 -194 -39 -97 13 201 -8 22 -223 164 -104 -82 73 120 46 -45 -15 -150 392
4836 392 -147 -10 -227 -45 182 -146 245 -159 -50 -113 83 -35 17 -8 106 -200 -126 -25 -15 -54 5 -259
4858 -259 -36 -143 -153 221 85 -13 -31 -181 -33 45 149 337 -144 -174 -62 -14 -47 -8 -124 51 29 291 476
4881 476 -119 52 -30 288 -11 -113 171 -40 30 -111 -112 77 89 -28 24 -180 77 121 0 -49 -78 99 -43
4904 -43 -211 -321 -144 277 55 -14 -194 34 280 7 -109 223 -6 94 194 130 -69 -96 136 11 214
4925 214 -106 -54 58 194 273 -154 -83 212 -135 2 -98 -217 -378 148 -139 154 -345 174 248 -180 181
4946 181 -53 -157 -71 110 27 56 -134 172 160 -57 6 -19 267 169 -187 6 -21 -289 -187 253 177 242 48
$$ packed form
4789C38l15K05j40k2J80k32L7k58J90k9N9K15l1k79R5l9l9j71K31KQ3o2L7j96
4813a41j23M96j66Lk11n2J55n8J10J88k09L0k45L87k68K2J55M7p4r1L0j35N42
4836C92n39J37k17J82K27l28L91m04J09o3J96j18N2k5J14l06P4J01J0l9N9k64
4858b59K23j07j0L74j36r8j8j50J48P8J04J88m81l0J12M8l3L9j16J75k2K62J85
4881D76n95J71q2L18k99j02K84k11P0j41jJ89J2j17N2k04K57M4j21m9k9J77j42
4904d3j68j10J77M21k22o9j80K28K46k73j16L32k29J00J00o4j99k7K32j25K03
4925B14l20N2J12J36P9m27P1K95l47J37j00j19j61N26k87K93m99N19P4m28L61
4946A81k34j04Q6J81q3K9j90L06j2k17O3k5K86r8l56J93k7k68J02M40p6O5j94
$$ plain form
4969 48 -40 142 208 -10 -61 -37 149 -68 -242 0 -173 18 304 -176 97 -144 241 -194 -189 69 -33 106
4991 106 112 -141 133 152 -125 -151 -205 97 -55 -31 13 75 -141 -161 112 -39 -51 -88 202 3 -124 -201 -58 -49 202
5016 202 4 -91 -126 -63 76 121 71 -263 7 -103 -111 -56 13 123 85 87 -165 119 11 113 40 -96 211 310 144
5041 144 -68 176 -163 7 -163 -122 -43 -109 26 271 31 109 -88 -43 -143 -110 121 -87 -111 -340 232 -29
5063 -29 -189 53 24 99 -98 -139 -40 199 -80 256 -182 65 -57 -18 233 19 15 19 -68 -12 -139 294 -134 74
5087 74 -108 55 99 76 87 243 -134 -166 -203 -19 83 -37 99 198 -301 -227 -12 -130 44 171 -87 5 110
5110 110 -123 60 -274 216 -95 -34 27 -8 -33 -181 -73 -32 -29 39 -71 64 88 -154 66 277 162 -126 59
5133 59 -12 -6 203 103 -87 160 -43 -83 260 184 -69 77 -199 74 -41 -112 16 37 13 194 24 179 -36
$$ packed form
4969D8q8J82O6k18n1K4J86k17j74K42j73J91K86m80K73k41L85m35NK58j02J39
4991A06Ok53K74J9k77k6n4L02j52K4M4O2k16k0K73j51j2l7K90j99j27p7J43RK51
5016B02j98r5l5O3J39M5n0l34K70j10qN5O9J10l8Kk52K84j08J02p3j36L07R9j66
5041A44k12K44l39J70j70M1P9o6J35K45k40P8j97M5j00L3K31k08k4k29N72k61
5063b9j60K42k9P5j97m1R9K39k79L36m38K47j22L9K51k14mMq7N6j27M33m28K08
5087G4j82J63M4k3J1J56l77l2l7J84J02j20J36R9m99P4K15j18J74J27k58R2J05
5110A10k33J83l34M90l11O1O1l5k5j48J08M1LO8j10J35K4k42K20K11j15k88J85
5133E9p1OK09j00j90K47k03m0L43p6k53J46k76K73j15p1J28K1k4J81j70J55k15
$$ plain form
5156 -36 80 -41 73 100 260 -40 350 -46 -76 121 88 -222 -437 -17 -39 296 9 -206 -67 161 29 0
5178 0 -39 -218 221 -110 -1 37 166 -94 -261 -124 -183 208 12 217 173 -68 -90 -232 115 -249 -22 -349
5200 -349 -221 2 -68 -82 -245 -1 84 -124 -143 -116 63 -116 197 203 121 63 54 51 -33 63 60 79 65 165 -53 -76 21
5227 21 -21 -134 -78 203 -46 -219 -22 -58 314 362 -134 134 -106 21 51 -256 133 -171 27 -87 -154 4
5249 4 -156 211 -212 -141 72 1 70 -52 41 -189 -142 -6 15 -29 118 -21 97 25 34 14 -89 -31 -154 91 15
5274 15 -124 -83 96 -179 -258 -25 -90 99 84 -159 65 16 -100 27 -242 -37 95 51 -165 11 -149 42
5296 42 60 17 -85 175 88 19 11 -66 -69 71 66 183 91 53 166 14 80 -107 263 -184 35 22 -277 30 103 -134
5322 -134 -29 173 23 -230 -203 250 195 174 207 27 -22 -341 -109 58 -207 43 -157 -274 364 14 160 134
$$ packed form
5156c6J16j21J14K7J60l00L90l96l0J97l3l10k15M20k2L35k87k15J39K28j32k9
5178@l9j79M39l31J09L8J29k60j67J37n9L91j96K05m4k41k2j42L47l64K27l27
5200c49J28K23p0j4j63K44Q5k08j9K7J79j79L13Oq2n8rlq4R6lJ9j4J00k18k3R7
5227B1m2j13N6K81k49j73J97l6L72M8m96K68k40J27L0l07L89l04J98j14o7J58
5249Dj60L67m23P1K13p1O9j22R3k30M7J36K1m4J47j39J18p2Rk0j03N8j23K45p6
5274A5j39M1J79k75p9K33o5J89j5k43K24m9j16J27k69K05J32m4k16J76j60J91
5296D2J8m3j02K60q7o9qp7lJ40nJ17r2l8J13j52O6j87L70m47K19j3k99L07P3k37
5322a34J05K02j50k53K7M53n5k1L3j80m9l19K32J67k65K50k00j17O38l50J46k6
$$ plain form
5344 134 -36 -226 -322 -67 -22 12 133 15 -224 -78 77 119 -6 -108 -81 139 8 52 331 42 49 -388 -173
5367 -173 46 -39 191 124 -89 95 66 69 183 2 -39 -25 -1 43 -37 -235 338 168 84 25 257 10 -12 -69 -95
5392 -95 -28 -105 23 132 34 -254 -78 -94 -24 -171 -33 132 332 97 24 143 -73 -81 -163 -291 46 -15 -292 -94
5416 -94 -104 90 95 18 11 96 -27 50 -48 131 -21 116 72 -31 -66 -152 165 123 104 -6 -65 -111 -41 114 159 20
5442 20 -140 25 -164 143 25 -81 17 68 152 -60 -81 -98 256 -70 -252 -127 12 -212 -85 -1 -77 434 57
5465 57 77 -67 45 -49 207 187 -67 297 -50 15 -145 308 -92 -100 230 -15 -81 -156 -117 -77 97 234 -229 206
5489 206 -134 103 187 -42 71 -60 163 92 11 59 6 82 260 -228 -241 10 -92 -145 -51 166 382 132 91
5512 91 -37 -359 -197 114 159 278 -27 -39 29 -198 130 -64 98 -205 -48 98 -103 236 52 69 -2 38
$$ packed form
5344A34j70j90r6K55M5L4J21j18k39J46J55M2j25j02K7K20j31M4K79k89Pm37K15
5367a73K19q5K30o7k13J84k9LJ14j81m1J4K4M4q0j98N73j70q4n9K32k47k2n7k6
5392i5O7p7J28J09r8k88J76j6P0j47J38J65K00k35p3J19k16qq2j28L37o1k77J98
5416i4j0J94Np7pQ5j23P7r8J79j52J37m4j03l5q6L17m2j9j10n9m6P0J55M5j39
5442B0j60J65j89L07j18j06R8N1Q4k12k1j7L54l26j82J25J39k24J27Q4p6N11l77
5465E7K0j44J12r4K56k0k54L64l47O5j60M53m00qL30k45o6p5L9M0J74J37m63M35
5489B06l40K37Q4k29J13j31K23p1q1M8n3P6J78m88j3K51j02n3R4K17K16k50m1
5512I1j28l22J62L11M5J19l05j2O8k27L28j94J62l03J57J46k01L39j84J7p1M0
$$ plain form
5534 38 19 169 134 178 -52 -16 -138 62 19 -56 -26 -125 -60 112 -134 159 82 26 -361 -98 29 -47 57 -302
5558 -302 -225 -110 -162 128 -90 22 109 -71 381 -54 -7 -185 -490 53 269 182 195 7 -33 65 52 -179 176
5581 176 -187 111 70 206 132 -21 125 -103 66 -97 156 -73 -43 -3 -50 -225 89 4 -137 64 -119 -179
5603 -179 -274 -118 -225 -90 -105 166 -191 186 -84 -229 -192 -3 -10 52 266 155 72 188 -114 -287 -133 -153 -19
5626 -19 -47 113 -74 -142 -85 29 60 -238 -49 -244 -240 116 64 -131 108 103 168 205 -109 -148 -40 -61 298 -169 -209
5651 -209 55 -285 -179 231 -13 -197 158 -239 78 55 200 37 67 -161 -108 -27 260 197 96 235 -166 -47
5673 -47 -171 145 127 76 228 83 -402 -166 -65 139 15 108 -60 -47 -55 137 35 -115 -173 93 84 -137 54
5696 54 -82 1 169 219 -86 284 83 -66 -61 -7 -96 49 -187 195 -117 -155 21 -93 116 -80 -104 66 2
$$ packed form
5534C8j9J50l5M4k30L6j22K00m3p5L0r9O5J72k46K93p7n6l87K63J27p6J04l59
5558c02P7J15n2K90k18J12Q7j80M52m35M7j78l05N43K16q7J3j88m0R8j3k31L55
5581A76l63K98m1J36p4j53J46k28J69j63K53k29L0M0m7j75L14q5j41K01j83o0
5603a79r5J56j07J35j5K71l57L77k70j45L7J89pO2K14j11q3J16l02j73J54k0J34
5626a9k8J60j87o8N7J14L1k98J89j95ML56n2j95K39nO5L7l14l9J08k1L59m67m0
5651b09K64l40J06M10k44j84L55l97L17k3J45j63L0k28N3Q1K87o3j01J39m01J19
5673d7j24L16j8n1J52j45m85K36J01K04j24R3j68J3qJ92j02j50n8K66rk21J91
5696E4j36Q3J68N0l05L70k01j49NN4q9J45k36L82l12l8J76j14K09j96k4J70o4
$$ plain form
5719 2 -197 87 27 272 -37 31 86 0 -116 76 80 -32 -280 -135 -187 -158 27 106 82 106 86 74 192 94 107 82
5745 82 -20 -29 136 -127 -127 31 -60 -169 37 -46 163 -63 39 71 -60 -6 80 63 -21 162 -15 16 -143 -60 -198
5770 -198 -4 -88 -21 -124 -302 128 100 -140 86 -56 -134 131 274 -166 51 124 30 -2 178 -217 -124 57 46
5793 46 140 -37 28 125 -92 195 179 -90 -45 236 107 -43 53 -110 135 8 99 -35 165 319 61 -61 125
5816 125 -73 -205 -260 94 -118 22 77 -78 -86 -224 101 52 -238 -16 -48 -87 39 -72 -198 -10 -79 162 -26
5839 -26 72 -21 -22 -11 -124 -91 141 241 -11 295 324 81 -12 -142 155 97 -23 -126 15 -50 221 152 308 -152
5863 -152 -12 28 37 -31 176 -178 -59 86 -1 -70 -122 -125 24 -45 50 18 -182 67 -81 -40 -309 -73 114 12
5887 12 34 56 207 -152 183 -50 -89 311 47 -70 137 -6 -86 -115 -186 23 35 114 30 -233 81 255 -75
$$ packed form
5719Bj99K84o0K45l09O8N5q6j16J92Mj12k48J45n2K9J85P9k4K4k0j2J18r8J3k5
5745H2j02rJ65k63%J58r1j09K06q3K09k26J02L2j31N4Q6j7q4J83j77L1j59Q3j38
5770a98J94q4O7j03j78M30k8k40K26j42p8K65J43m40K17P3r4l2J80l95R3J81j1
5793D6R4j77O5R7k17K87j6k69M5K81j29j50R6j63K45j27R1j34K00J54k58j22J86
5816A25j98j32n5L54k12J40N5j55qj38L25m9k90K22l2l9J26j11j26J88o9K41j88
5839b6R8r3jJ1j13L3K32J00k52L06K9k43r3j30K97n8j20j03J41o5K71o9J56m60
5863a52J40M0Ro8K07l54J19J45q7o9n2lJ49o9R5l2k00K49j48M1k69K36J87j02
5887A2K2K2J51l59L35k33l9M00k64j17K07j43q0k9p1K09J2P9q4k63L14J74l30
$$ plain form
5910 -75 139 -55 -39 147 213 71 122 -262 -358 7 214 -253 109 187 -12 -59 -61 -241 -289 263 198 -223 220 -13
5934 -13 -231 196 40 170 195 -102 119 -232 -179 -31 117 177 117 48 -191 219 -78 55 8 141 -17 -73 -151
5957 -151 29 225 186 -102 -16 80 -90 -179 66 -22 -118 72 133 -111 75 -139 -125 -39 66 173 142 176 129 61
5981 61 -186 -94 14 -150 28 108 182 151 -189 -202 67 108 -27 -40 -92 -37 15 -119 15 122 24 225 182 241 -73
6006 -73 30 -105 80 142 11 106 53 -58 232 60 -71 -10 -137 -130 128 -102 -101 228 -70 166 33 -173 109
6029 109 17 169 -126 -160 12 7 -334 103 61 82 38 -140 104 -32 -8 60 61 124 -23 -114 -107 -112 0 -200 -59 159
6055 159 43 142 16 175 66 193 109 -89 -130 100 -77 -232 -59 -220 144 17 -62 121 182 -196 -153 -128
6077 -128 -209 -26 15 -76 86 172 -49 260 148 45 31 15 10 201 205 52 84 252 -83 42 -170 43 211 -61
$$ packed form
5910g5K14j94J6J86O6j42N1l84r6L65K07m67L62P8j99m7kj80m8N52o5m21M43k33
5934a3k18M27j56J30K5k97K21l51N3J48J48O0o0o9k39M10k97J33m7J33j58n6p8
5957a51J80J96l9k88Q6R6j70q9K45q8r6J90O1k44J86k14J4Q6J05J07l1L4m7o8
5981F1k47R2J08j64J78Q0P4l1l40j3K69M1j35j3n2N5N2j34J34J07r8K01m3N9l14
6006g3J03j35J85O2j31R5n3j11K90j72j31O1j27PK58k30JL29k98K36j33k06K82
6029A09r2J52k95l4J72nl41M37m2K1m4j78K44j36K4O8JO3j47r1PnJ12k00J41K18
6055A59j16R9j26J59j09J27q4j98m1K30j77j55J73j61L64j27p9J83O1l78M3K5
6077a28q1J83M1r1J62Q6k21L09j12j03j4j6nJ91Mj53L2J68l35J25k12K13J68k72
$$ plain form
6101 -61 -15 76 -129 124 -220 50 147 15 102 -12 96 34 90 114 262 157 138 103 250 3 -243 250 99
6124 99 -114 -175 -281 54 201 -26 -181 43 15 40 -35 -173 50 -225 122 47 39 -239 -270 187 -211 -38 -119
6147 -119 -18 39 -58 -119 -47 -235 270 -159 298 23 140 13 -293 270 -160 -93 -114 -31 155 39 115 83 -223
6170 -223 137 58 -37 178 -23 114 51 -231 -112 67 10 115 150 -187 82 29 122 69 -66 -68 -36 -223 149 44
6194 44 8 -76 -314 153 -226 -37 51 79 -36 -238 15 -69 -63 -154 -140 208 16 -92 22 58 35 -44 -206 -120 -67
6219 -67 233 14 187 -10 146 -165 -76 31 -15 57 63 -105 -114 50 77 236 -49 183 -119 -330 -180 325 -41
6242 -41 -14 -11 397 129 -30 -37 -100 -83 -75 49 10 15 25 5 -75 -347 -49 -53 140 107 -79 8 4 -249 -153 172 -74 -205
6270 -205 79 199 -135 93 155 -50 -138 -111 95 40 242 60 28 -48 -77 130 -130 -86 -163 122 60 253 -153
$$ packed form
6101f1M6R1k05K53l44K70R7j32Q7j14J08o2N6K4J48j05j9l5J47k47k46M93j51
6124I9k13o1j06L35J47k27j55K24k8K5p5j38K23k75L47p5qk78l1M57l98J73q1
6147a19J01N7r7o1P2j88N05m29M57k75J17j27l06N63m30O7k1Q3J86j16P6l2l06
6170b23L60p9r5K15k01J37o3k82J19J79n7J05L5l37K69n3R3n3j35kL2j87L72j05
6194D4l6q4k38M67l79J89Q8K8j15k02K53q4Or1J4L48j92j08J14L6k3p9j62Q6N3
6219f7L00k19J73j97J56l11Q9J07m6P2Oj68rJ64K7J59k85K32l02k11J50N05l66
6242d1K7LM08k68j59po3J7QJ24l9NJ0k0q0k72K98mJ93l3j86Q7mk53R6L25k46j31
6270b05K84J20l34K28O2k05q8K7K06n5K02j82l2p6k9K07k60M4p7K85o2J93m06
$$ plain form
6293 -153 142 196 -74 202 120 -105 102 -206 43 -11 -183 149 -87 9 159 285 266 102 -24 -14 -16 71 -78
6316 -78 -213 -11 129 -92 0 72 -267 181 170 -57 135 1 180 17 107 -98 40 41 -119 -200 25 184 -54
6339 -54 300 94 -77 19 -191 -95 -154 -62 86 -223 120 82 111 -293 248 114 -330 163 -69 184 -123 -85 84
6362 84 185 -247 -102 99 -137 162 -33 -67 -69 -56 403 107 -166 -139 94 -91 -112 -59 73 -84 -8 22 -18 -29
6386 -29 209 -265 142 202 -288 -103 179 -252 -282 -126 -260 -175 92 -16 -113 46 32 181 -27 -79 33 189
6408 189 99 -108 -131 -356 -147 6 200 -94 -11 -94 -72 132 -184 -44 -128 -126 173 21 -82 100 -51 47 -98
6431 -98 140 81 -223 2 -40 -85 -204 172 219 -133 -227 55 62 -87 -52 -20 -131 -21 -78 255 -213 -93 -309 -187
6455 -187 -65 -129 48 -62 -40 223 -175 -66 -134 -70 92 -54 -205 17 121 -66 220 0 25 54 -238 -50
$$ packed form
6293a53K95N4k70K76q2k25K07l08K49n4j72L32k36R6J50J26j9j64j26J0kQ7j49
6316g8j35K02J40k21R2P2l39M48j1k27J92j34J79j63R0k05J38Jj60q1K25J59k38
6339e4L54k06j71R6k10R6n9R2J48l09L43l8K9m04N41j34m44M93k32K53l07L8J69
6362H4J01m32J45K01k36K99j95l4kJ3M59k96k73K7K33j85k1N3J32j57P6L0m0j1
6386b9K38m74M07O0m90J85K82m31l0J56j34Q5K67j08r7J59j4J49k08n2J12J56
6408A89r0k07k3k25K09J53J94k94Q3q3K2K04l16J40q4KK99j52j03J82j51R8j45
6431i8K38n9l04K25m2m5j19L76M7l52r4K82Pj49L5L2j11J10n7L33m68J20k16J22
6455a87J22o4J77j10K2K63l98J09o8O4J62j46j51K22J04j87K86k20K5K9k92J88
$$ plain form
6477 -50 -156 49 -104 99 56 93 234 14 -46 102 -110 -76 6 -256 72 119 -87 87 -130 230 45 -167
6499 -167 -66 182 -185 312 -115 -38 112 -82 420 71 242 -193 131 220 -278 136 -83 16 46 73 129 -161
6521 -161 -186 -177 -221 -6 93 -194 -83 -27 -108 -21 19 -72 146 58 25 213 -44 -133 -61 269 75 113 35 -80 -368
6546 -368 45 84 27 109 65 -178 73 264 -32 76 -222 69 -58 -50 -225 214 47 46 83 58 1 -65 139 66
6570 66 129 -24 206 96 -121 9 29 351 89 -191 50 -119 27 10 33 -154 -38 209 -344 176 -29 200
6592 200 -5 -137 399 14 117 67 -14 107 -9 -84 32 -176 10 -304 50 112 127 14 159 50 195 -241
6614 -241 -204 135 -74 109 -47 -227 21 -38 -242 -68 100 139 107 -35 -99 194 133 129 -120 -149 119 -55 -21
6637 -21 -10 -67 -33 36 167 127 -318 -67 -5 251 260 -72 15 34 -209 64 131 42 -155 102 0 217 -5 151
$$ packed form
6477e0j06K05j53K03m3L7J41k20o0J48k12L4Q2k62L28M7k06J74k17L60j85k12
6499a67J01K48l67M97m27P7J50j94N02l49J71m35L24Q9m98M14k19R9L0K7N6k90
6521a61k5Rm4K15R9k87J11N6q1Q7M0r1K18q8l3J88k57q9P2L30j94L8p8j15k88
6546c68M13L9n7Q2m4k43K51J91k96J08k98K91j27Qj75M39j67jL7k5n7o6K04p3
6570F6O3j53K30j10k17J30K0L22k62k80K41j69J46j7K3j87J16K47n53N20k05K29
6592B00k05j32N36l85J03n0q1J21j16p5J16k08J86l14L54O2J5j13J45j09J45m36
6614b41L7L39k09J83j56j80K48n9k04J74J68L9l2j42o4K93o1mk49k9K68j74L4
6637b1J1n7L4O9J31m0m45K51O2K56Rl32Q7J9k43K73O7q9j97K57j02K17k22J56
$$ plain form
6661 151 -10 144 53 22 95 -14 288 -47 -11 -85 -91 -131 216 48 146 -80 -30 117 135 138 -94 -23 7 240 6
6686 6 -108 -28 51 140 -239 -235 40 -217 40 -116 -47 -7 -57 188 -232 -41 -140 229 -144 229 27 71 -47 52
6710 52 120 316 -2 -113 -134 -64 51 -111 -199 -46 74 -149 -162 -50 24 -59 222 138 34 -30 -70 95 12 -68
6734 -68 127 33 -65 -70 7 -46 229 47 -185 69 -2 207 175 260 108 -465 90 71 255 10 66 -169 193 -55
6758 -55 81 -2 149 -23 159 55 177 99 125 -249 -43 108 -99 104 144 213 48 61 78 43 93 -96 -71 -17
6782 -17 -202 -49 13 35 32 -67 -146 -331 -175 250 105 191 72 -109 260 -56 -45 166 119 -247 68 36 211 -137
6806 -137 -205 -140 84 26 -35 -134 198 89 -17 13 49 -118 -217 -144 74 -44 47 195 -66 203 16 23 -131 -41
6830 -41 -209 81 -116 336 5 61 135 -160 324 -43 -273 256 -42 74 -149 120 17 248 -165 68 -9
$$ packed form
6661A51j61J54r1l1P3j09L02l35L6p4om0L47j68R8k26N0J47J8Lk32P1L0K33k34
6686Fj14Q0P9Q9l79MK75k57K57j56O9M0n0K45m20J91r9L69l73L73k02M4j18R9
6710E2O8J96l18j11k1P0J15j62q8J53J20k23j3J12P4q3K81q4j04o4m0J65q3q0
6734f8J95r4r8nP7n3K75j82k32K54p1K09l2Q5j52n73N55j9J84k45N6k35L62k48
6758e5J36q3J51j72J82j04J22p8K6l74K06J51k07K03M0O9j65J3J7l5N0j89K5N4
6782a7j85J53O2K2lr9p9j85J56M25j45Q6j19j81L69l16J1K11m7l66L15l2J75l48
6806a37o8O5K24n8o1r9L32j09j06L0L6j67r9P3K18j18R1J48k61K69j87Pj54R0
6830d1j68K90j97M52l31N6P4k95M84l67k30N29k98J16k23K69j03K31m13K33p7
$$ plain form
6851 -9 121 22 -194 106 -330 -48 67 33 184 -52 22 263 -57 27 -21 -33 202 -113 -73 -23 -88 207 217 97
6875 97 -158 -212 200 10 212 -112 -243 -263 72 19 -319 27 -88 -27 -201 51 54 17 -187 -15 17 -164 89
6898 89 -173 233 262 -198 77 158 -137 -18 -252 63 -232 39 183 40 -163 80 -56 176 -6 90 -273
6919 -273 42 -156 -12 73 -142 59 312 -54 -89 -39 51 245 -51 -76 -120 130 19 -132 -245 -29 189 -18
6941 -18 85 404 -224 -86 -204 66 158 -42 182 -10 -56 -75 67 -210 -188 -90 49 -10 -52 221 -127 184 -243
6964 -243 7 200 -156 -155 168 79 -337 -174 19 282 -22 -288 -137 164 -31 -77 -98 -114 -104 57 -37 -40 189
6987 189 45 2 -52 107 -259 -204 -114 108 36 -125 97 189 35 122 10 220 6 -42 0 88 120 70 -99 31
7011 31 -191 -17 -198 -50 -49 104 -27 120 58 -106 -10 -168 -122 30 -159 27 0 97 -304 -6 -27 -14 -112 -141
$$ packed form
6851iJ30r9k16L00m36K82J15l4J51k36P4K41l20Q4m8j2K35l15M0N0o5K95J0j20
6875I7k55n4M12j90K02l24j31k0L35n3l38L46j15O1j74K52Ll7k04J72L2j81K53
6898H9k62M06K9m60K75Q1k95J19k34L15k95K71J44j43k03K43j36K32j82R6l63
6919b73L15j98J44Q5k15K01K53l66l5N0R0J94k96k5m4K50j11j51j13K16K18k07
6941a8J03L19o28J38j18K70R2k00K24j92m6j9J42k77K2R8J39n9m2K73l48L11m27
6964b43K50J93l56JL23q9m16J63J93K63l04k66J51L01j95m6k1j6J0J61r4lK29
6987A89j44m3n4J59l66N5R0K22p2j61K22R2j54Q7j12K10k14m8M2Q8L2n0j69J30
7011C1k22J74j81J48JJ53j31J47o2j64R6j58M6J52j89J86k7R7m01K98k1J3r8k9
$$ plain form
7035 -141 -29 -17 -50 70 38 -73 -128 12 -62 60 164 -181 -115 110 361 -164 -271 39 93 -243 -225 -28 -4
7058 -4 -67 -69 -227 -29 -78 105 40 -64 -36 11 142 47 -140 26 11 0 -38 133 -410 -48 144 107 44 15 97 -121
7084 -121 156 227 -30 88 87 7 44 252 39 -77 17 34 10 97 -79 168 -8 -186 -199 -16 -9 144 -71 -21
7108 -21 288 -39 165 39 224 44 96 333 -20 -56 210 1 190 -247 -240 -44 293 -264 -74 111 265 -200
7130 -200 252 -71 -252 106 -141 189 -36 -273 171 -20 -210 -41 82 49 15 78 65 -10 39 -88 18 162
7152 162 17 -91 -15 -44 54 -29 -47 111 -50 -98 260 282 71 28 265 -231 46 -121 33 120 166 18 177
7175 177 -49 -60 138 -153 -48 10 168 -195 22 -72 -67 147 56 -43 210 291 25 166 -100 80 259 60 -31
7198 -31 55 -240 0 189 -5 215 2 99 -129 -124 -141 156 -21 -127 244 -257 110 -86 -95 281 11 283 151
$$ packed form
7035a41J12J2l3J20l2j11n5J40p4J22J04l45O6K25K51n25j07L10N4l36J8J97K4
7058do3kj58J98m9J83o5j04K8M7J31r5j87J66j5j1l8J71n43L62J92l7o3k9Q2k18
7084a21K77P1k57J18jq0L7K08k13j16R4J7k4Q7j76K47j76j78j3J83PJ53k15N0
7108b1L09l27K04j26J85j80N2K37l53l6K66k09J89m37PJ96L37n57J90J85J54m65
7130b00M52l23j81L58k47L30k25k37M44j91j90J69J23l3l4O3j3p5M9j27J06J44
7152A62j45j08P6k9R8q3j8J58j61m8L58K2k11m3K37m96K77j67J54Q7M6j48J59
7175A77k26j1J98k91J05N8J58l63K17r4NK14r1r9K53Q1k66J41k66J80J79j99r1
7198c1Q6k95K40J89j94K20k13R7k28Nj7K97j77j06L71n01L67j96rL76k70K72j32
$$ plain form
7221 151 -97 -86 12 -51 -49 -18 -4 -201 -32 -185 -335 -161 59 -71 -41 -25 14 114 -1 70 -25 -27 -160 -36 -60
7246 -60 129 68 58 149 -378 -70 291 46 -37 61 31 254 63 31 98 -53 -107 187 98 -19 -84 -71 -257 -30
7270 -30 -73 -153 -146 19 -328 -126 138 -34 -45 -89 134 129 -401 -25 175 -60 -64 -393 149 -225 17 -86 154 -148
7294 -148 -167 60 37 -35 187 181 -109 -126 -226 289 -296 -61 -15 47 -174 138 123 -100 -251 -81 -31 -86 105 -45
7318 -45 -92 13 -72 -64 -148 -161 66 52 -240 128 187 -53 -95 -51 79 162 -150 -76 -215 98 206 -210 -212 -38 -110
7343 -110 -220 32 -88 -67 -236 -4 45 -58 -118 68 -153 55 -262 51 44 -40 -95 -131 260 -45 210 49 113
7366 113 -92 169 -86 298 -88 -101 127 266 -92 62 116 -90 -120 47 -145 59 -104 -65 54 211 246 -140
7388 -140 -176 -30 72 79 100 160 -195 -31 147 134 14 27 233 -99 163 89 -32 137 -197 77 -100 -104 268
$$ packed form
7221A51k48J1R8o3KL1J4j97J69j53j50J74K20j30L0J6L9J00j15P1r5kj33J24k4
7246f0J89o1j0R1n27L08L61k45q3R8l0K23j91l2O7j51n4K94q9j17o5J3j86K27
7270c0m3q0PJ65l47K02K64j72j1m4K23nn30L76K00k35ml29N42l74K42j03K40l02
7294a48j9K27k3p2K22ok90j7j00N15n85K35M6O2k21L12j5k23j51J70N0n5J91j50
7318d5m7J05q5Qq4j3K27j4k92L68N9k40m2M4J30Q3l12P4j39L13J08m16kJ74p2
7343a10j10K52j20K1j69K32M9j03o0J86k21K08l17L13pq4n5l6L91l05K55j61O4
7366A13k05K61k55L84l86j3K28J39l58J54N4k06l0J67j92K04j63L9J19J57L5l86
7388a40l6J46J02PK1O0l55J64J78j3j20J3K06l32K62p4j21J69l34K74j77mL72
$$ plain form
7411 268 168 150 250 -158 66 -42 -62 82 19 -92 158 -49 62 -63 -75 -115 -24 112 -48 -83 -172 -145 -254
7434 -254 220 -11 -93 -10 11 -176 -113 -9 -189 154 162 -275 126 57 -24 75 39 -142 88 256 -105 84 131 142
7458 142 420 117 -266 -11 -36 -20 -129 -12 81 82 180 122 156 409 210 -196 57 -90 58 203 333 -24 -54
7481 -54 -180 -197 -143 364 241 139 -76 -42 -15 177 161 6 184 -203 -83 -41 -198 174 -1 126 154 -151 5
7504 5 -262 -48 33 6 231 -17 -226 -248 -36 168 161 -146 -196 104 -265 297 86 125 -136 -114 227 104 22 -45
7528 -45 -43 -142 -52 187 -88 117 -272 -210 -64 -73 43 -17 202 227 -150 -254 46 139 -123 -51 23 35 16 23 202 137
7554 137 120 -49 73 159 -76 136 140 113 1 -135 -18 -32 125 84 -68 85 -140 100 -230 -115 124 -275
7576 -275 -28 -244 14 194 -152 -120 166 -26 115 -107 172 24 -147 164 241 199 171 -73 -125 -196 -193 -65 20
$$ packed form
7411B68j00j8J00m08K24j08k0J44o3j11K50k07J11j25j2m0R1J36j60l5q9K7j09
7434b54M74k31q2Q3K1j87O3J04j80L43Qm37M01o9q1R9l6j81K30J68l61J89M7J1
7458A42K78l03l83K55k5J6j09J17R3JR8n8L4K53j99m06K53j47J48J45J30l57l0
7481e4j26j7N4N07j23j02k15L4K7J92j6j55J78l87J20M2j57L72j75J27K8l05J56
7504Ek67K14Q1k7K25k48k09k2K12K04pl07n0L00l69N62k11L9k61K2L41j23q2o7
7528d5Kr9R0K39k75K05l89O2J46rJ16o0K19K5l77j04L00R3k62P2P4J2j9PJ79o5
7554A37j7j69J22Q6k35K12Mk7j12j36J17j4J57m1j52J53k25K40l30J15K39l99
7576b75K47k16K58J80l46L2K86j92J41k22K79j48j71L11P7m2k8k44n2p1LJ28Q5
$$ plain form
7599 20 -230 -304 -61 124 -132 -73 -117 -183 112 -96 -63 -91 124 63 -85 44 54 -96 175 -34 148 -109 -40
7622 -40 19 -207 -336 75 281 -25 -218 70 229 38 -161 -50 -111 53 -209 138 -128 -95 127 -67 -91 -30
7644 -30 -111 -12 -89 148 -227 -48 294 191 -87 -127 -189 162 27 -229 81 -275 -115 -41 87 304 -145 34
7666 34 90 -16 -14 205 -17 -120 98 -123 131 116 86 -157 63 7 48 -97 48 -66 -84 23 -111 240 56
7689 56 328 97 -143 -167 2 -3 -75 -61 152 21 128 30 221 18 -80 151 -172 -77 -7 223 160 -188 -214 -48
7713 -48 254 -24 -120 26 -130 107 -92 177 57 67 69 143 -54 -153 34 175 -235 -56 -124 69 103 324 177
7736 177 -159 29 -25 -154 -42 370 197 77 -91 -74 -87 50 -172 -35 -18 102 -28 -164 -47 191 160 64
7758 64 23 102 -21 -20 64 77 157 54 -98 89 204 89 -24 6 -36 -334 -140 -40 94 346 -259 179 80 -57
$$ packed form
7599B0k50p4K43J85k56N9m4o6K95k08L3k8K15o1j48J29J0j50K71k09J82k57O9
7622d0N9k26j29M11K06l06j93K88J59j91j99J11o1J64k62L47k66L3K22j94k4O1
7644c0q1R9p7K37l75J79L42j03k78m0o2L51j35k56L10l56J60P4J28K17m49J79
7666C4N6j06KK19k22j03K18k21K54j5l0k43K20n6M1j45J45j14j8J07j34L51j84
7689E6K72k31k40k4J69np2J4K13j31J07r8J91k03r8K31l23R5P0K30o3l48k6J66
7713d8L02k78r6J46j56K37j99K69j20J0KP4j97r9J87J41m10J79o8J93L4K21j47
7736A77l36J88n4j29J12M12j73j20j68J7j3J37k22J37J7J20j30j36J17K38l1r6
7758F4m1P9j23JQ4J3Q0j03j52J87J15j15j13L0m2k98J94J00J34K52o05M38r9j37
$$ plain form
7782 -57 -11 133 -211 128 115 -183 -237 -111 -100 -138 80 -196 191 215 25 142 -9 -160 4 -235 53 -3 -178
7805 -178 -170 -116 -261 -32 -1 44 -226 -34 -18 119 -17 90 73 -240 -163 2 -156 -18 417 15 -68 -118 -200 220
7829 220 -159 -75 -252 -37 154 -87 163 110 3 -414 19 -49 5 -70 29 201 72 -1 248 -11 306 52
7851 52 -30 15 241 19 32 84 -18 -183 94 64 162 180 48 -125 -1 79 25 -34 -223 -60 52 -114 -8 253
7875 253 200 -68 127 -1 316 59 -241 147 -135 14 -30 -27 3 140 3 270 166 -18 22 -39 144 -13
7897 -13 -31 -273 84 -119 -6 57 149 200 -50 126 116 29 162 186 -37 -172 132 -80 -131 136 113 31 154 -208
7921 -208 -21 -18 -134 48 -72 -141 -48 -172 -1 -59 -20 120 -103 -62 -81 -89 -229 -86 39 -65 -65 334 4 -61
7945 -61 -7 131 -99 45 -185 254 35 201 66 -79 105 -9 104 109 -30 -5 -316 47 -140 99 106 -7
$$ packed form
7782e7M6J44l44L39j3k98n4J26J1l8K18k76L87K4j90J17j51j51J64k39K88n6j75
7805a78QN4j45K29L1M5k70J92J6J37j36J07j7l13P7J65j58J38M35m02q3n0q2M20
7829B20l79Q4j77K15J91k41K50n3j07m17M33o8N4p5R9J72j29p3K49k59L17k54
7851E2q2M5K26k22J3N2j02j65K77l0R8J8j32j73J24Q0n4n9j89J63J12j66J06K61
7875B53n3k68J95j28L17k57l00L88k82J49m4LL0J37j37K67j04j84M0o1J83j57
7897a3j8k42L57k03J13O3R2N1k50J76j0q7J33K4k23j35L04k12n1K67k3q2J23l62
7921b08J87Lj16J82j20o9R3j24J71n8L9J40k23M1j9qj40J43J25j04%L99l30o5
7945f1N4J38k30J44k30M39k19J66j35j45J84j14J13Nj39K5l11L63j87K39Pj13
$$ plain form
7967 -7 39 -84 -41 -39 -122 -81 -49 -57 -115 -91 267 -88 49 -50 -149 -52 -338 -8 -109 39 32 -149 339 45 122 95 -310
7994 -310 25 -57 145 152 93 93 -108 76 22 51 -93 102 31 -4 -254 -228 -86 160 77 -33 -149 60 80 -146
8018 -146 164 93 -120 -5 -134 180 74 299 -125 75 -136 -136 86 163 -68 27 59 -5 -46 -182 143 184 44
8041 44 -128 -245 78 -369 -56 -61 36 186 94 33 -83 134 -249 -13 -122 78 9 -90 195 -173 -37 -1 -104
8064 -104 211 146 -266 57 146 -67 80 37 -49 -57 108 -4 -255 124 -65 -6 41 -73 -191 -31 31 -63 169
8087 169 -219 116 29 84 24 -48 54 -273 -36 231 40 205 -376 -226 77 -255 78 -211 147 175 2 -26
8109 -26 -33 35 -96 167 47 -103 58 -163 78 188 -75 -10 101 -171 -218 -144 -34 -337 -8 156 81 87 7 68
8133 68 -32 19 -341 222 -163 -58 -261 127 -191 -34 -8 240 103 -199 -40 -65 73 -95 14 70 -8 -255
$$ packed form
7967gM6j23M3Kq3M1L2qn8K4L58l55J37r9r9R7k86L30j01J48pj81M88k94P7k7m05
7994c10L35q2K02Pn9%k01J84n4K9j44J95p1l5k50K6J42K46q3j10j16K09K0k26
8018a46L10p1k13J15j29L14j06K25m24K00k11%K22P7k31R5L2o4m1j36L25M1j40
8041D4j72j17L23m47L13nR7J50r2o1j16K17l83K36j09K00o9r9K85l68J36L6j03
8064a04L15o5m12L23Q9k13J47m3q6qJ65j12k51L79j89N9M7j14j18J60O2r4K32
8087A69l88L35q7N5o0p2J02l27K37K67j91J65n81J50L03l32L33k89L58K8j73k8
8109b6pO8j31K63j20j50J61k21K41J10k63O5J11k72m7P4J10l03L29J64p5Oq0O1
8133F8j00N1l60N63l85J05k03L88l18J57K6K48j37l02J59k5J38j68J09N6p8k47
$$ plain form
8155 -255 146 -67 -79 -117 -60 -39 2 306 137 89 -84 63 -155 236 -83 -196 -405 -197 117 -145 -24 244
8177 244 -132 -307 77 220 30 124 -37 -190 -100 -52 -56 123 176 -97
$$ packed form
8155b55M01k13j2l8N7K1M1L04j69m8j73J47k18L91l19j13k09K08L14k62J21K68
8177B44l76j75L84J43j90R4j61j53R0M8mJ79N3k73
8191i7
$$ Imaginary data points
##PAGE= N=2
##DATA TABLE= (X++(I..I)), XYDATA
$$ plain form
0 0 0 0 0 0 0 0 0 0 0 0 0 0 7 -7 7 -7 7 -14 14 -21 21 -28 35 -35 42 -51 63 -70 82 -91 105 -120 139 -155 175
35 175 -198 223 -249 279 -311 347 -385 428 -472 522 -577 635 -703 775 -852 938 -1034 1141
53 1141 -1260 1389 -1539 1707 -1901 2127 -2393 2711 -3100 3590 -4227 5096 -6356 8348 -12011
68 -12011 20993 -94898 -64407 70112 -31418 6740 68444 3673 -71547 11193 49234 9871
80 9871 18414 57654 -4661 -47962 -8949 3900 -32933 -8843 19602 -8750 -33336 -9327 10965
93 10965 14931 13902 17420 13113 -1478 -10906 670 9213 770 -5989 2746 -4209 -27242 -18894
107 -18894 10977 4136 -6423 16637 16047 -15503 -7613 19321 7842 -5522 10859 10327 -16036
120 -16036 -15287 6289 -838 -14254 3414 11400 -10236 -10839 8012 6407 -1731 5683 11541 1155
$$ packed form
0@%%%%%%%%%%%%Pj4J4j4J4k1K8l5M2m9O3p0P7r3J14j33J52j73J96k25K59k94L30
35A75l73M21m72N28n90O58p32Q13r00R94j099J212j338J478j627J790j972K175
53A141k401K649k928L246l608M028m520N104n811O690p817R323j1452J4704k0359
68a2011L3004j15891L0491J34519j01530L8158O1704o4771p5220Q2740L8041l9363
80I871Q543L9240o2315m3301L9013J2849l6833K4090K8445k8352k4586K4009K0292
93A0965L966j029L518m307j4591r428J1576Q543q443o759Q735o955k3033Q348
107a8894K9871o841j0559K3060n90l1550P890K6934j1479j3364J6381n32k6363
120a6036P49K1576p127j3416J7668P986k1636o03J8851j605q138P414N858j0386
$$ plain form
134 1155 -8323 -1577 4904 -2340 -4186 3396 -343 -8922 -3914 3421 614 -1846 4261 6191 -2964
149 -2964 -4443 5676 3138 -5087 2039 5595 -5636 -6680 2408 1319 -3859 379 5139 -883 -4020
164 -4020 2638 3402 -2973 -187 4532 -1423 -4137 1153 1210 -1758 -1263 1154 1151 -1436 -359 2624 1575
181 1575 -671 731 152 -1799 -1723 -502 407 -931 -1485 844 362 -2599 966 3652 336 -286 2226
198 2226 756 -1917 -569 1247 -232 -3057 -679 101 -3033 -1180 2501 672 -573 2152 1830 -454
214 -454 450 2409 1303 -812 -977 -130 -2276 -3202 -501 -295 -1589 222 604 -385 427 1855 2072 1466
232 1466 736 1061 132 -1574 -1038 -333 -1426 -1610 -915 -1112 -803 -312 1037 1869 1466 1498 2114 635 -82
251 -82 785 97 -673 -781 -1103 -1619 -1535 -1415 -100 148 -91 725 1216 615 1165 1545 652 1115 145 -271 -537
$$ packed form
134A155r478O746O481p244j846P582l739q579N008P335k807k460O107J930r155
149b964j479J0119k538q225P126L556j1231j044R088j089n178M238M760o022l137
164d020O658P64o375K786M719n955k714N290N7k968M95K417lk587J077K983j049
181A575k246J402n79j951P6J221R09j338n54K329m82k961L565K686l316o22K512
198B226j470k673J348J816j479k825K378P80l134J853L681j829j245K725l22k284
214d54R04J959j106k115j65Q47k146r26K701K06j294J811L82r89Q12J428K17o06
232A466p30L25r29j706N36P05j093j84O95j97L09M91J349Q32m03L2O16j479p17
251h2Q67o88p70j08l22n16Q4J20J315K48k39Q16M91o01N50L80q93M63r70m16k66
$$ plain form
272 -537 -1282 -772 -516 -1150 -786 117 -295 -67 788 857 1270 998 287 763 66 -284 106 -250 -939 -200 -647
293 -647 -1393 -612 62 117 286 313 346 474 227 746 816 497 322 -203 -758 -273 -518 -833 -155 -321 -373 20
315 20 -165 112 583 362 166 366 349 -234 -14 -67 304 -269 -668 -408 -392 -697 38 56 355 37 187 -123
337 -123 123 265 225 497 -14 38 -26 -500 -297 104 -310 -119 -202 -324 -14 -209 257 377 364 186 114 93 195
360 195 375 53 334 106 -302 -448 -264 -216 -241 -106 32 388 49 -125 91 394 155 142 402 -28 188
381 188 -150 278 -15 -158 -145 69 -171 -200 198 158 480 383 191 -45 295 244 341 124 6 322 -217 -115
403 -115 180 -23 -35 -116 -132 -102 -101 206 343 257 128 -22 298 18 -174 176 79 57 -71 -22 -145 -284 -264 -144
427 -144 -247 96 204 -80 77 99 239 419 419 104 222 58 -100 26 -78 -215 -171 -205 8 13 -216 35 64
$$ packed form
272e37p45N10K56o34L64R03m12K28Q55O9M13k72p11M76o97l50L90l56o89P39m47
293f47p46P81O74N5J69K7L3J28k47N19P0l19j75n25n55M85k45l15O78j66n2L93
315B0j85K77M71k21j96K00j7n83K20n3L71n73l99K60J6l05P35J8K99l18J50l10
337a23K46J42m0K72n11N2o4m74K03M01m14J91q3j22L10j95M66J20j3j78p2k1J02
360A95J80l22K81k28m08j46J84M8k5J35J38L56l39j74K16L03k39j3K60m30K16
381A88l38M28k93j43J3K14k40k9L98m0L22r7j92k36L40n1R7k17j18L16n39J02
403a15K95k03j2q1j6L0JL07J37q6j29j50L20k80j92L50r7k2j28M9j23j39K0J20
427a44j03L43J08k84J57K2J40J80%l15J18j64j58J26j04j37M4l4K13Nk29K51K9
$$ plain form
450 64 102 -4 56 52 95 136 -29 -129 -232 -223 -269 -391 -297 168 -90 40 4 -55 -42 405 -152 145 159 106 18 68
476 68 -241 -45 -275 -265 -84 197 -58 -92 -13 -84 233 -10 -41 319 134 37 126 -212 -1 26 -142 -144 -98 -251
500 -251 -79 47 -213 182 40 204 118 469 177 511 -84 -27 -68 -106 45 -131 380 3 180 -26 264 20
522 20 78 229 87 -22 45 33 151 25 -28 -43 89 -229 -83 -36 -78 95 -257 -97 364 101 248 117 31
545 31 9 254 -76 7 -190 -111 -109 -28 -76 -157 43 -153 -78 -1 -102 -19 -69 -73 -241 2 26 47 10 -90 -262 19
571 19 -11 -100 -179 32 -236 -31 -175 161 75 143 -56 -50 397 161 -7 -100 -42 13 -13 -60 -7 -26 150 -246 -219 12
597 12 -97 -190 293 184 -106 175 96 -408 -18 -83 -159 132 160 -165 16 -143 104 -10 102 95 -5 -173 94
620 94 222 -113 -190 155 39 158 -156 -153 -180 165 47 5 -19 53 -4 211 -59 -63 169 66 41 28 70 36 10 -300
$$ packed form
450F4L8j06O0mM3M1j65j00j03Rm6j22R4M65k58J30l6n9J3M47n57K97J4n3q8N0
476F8l09J96k30J0J81K81k55l4P9p1L17k43l1L60j85r7Q9l38K11K7j68kM6j53
500b51J72J26k60L95j42J64q6L51k92L34n95N7m1l8J51j76N11l77J77k06K90k44
522B0N8J51j42j09O7j2J18j26n3j5J32l18J46M7m2J73l52J60M61k63J47j31q6
545C1k2K45l30Q3j97P9KQ1m8q1K00j96P5P7j01Q3n0mj68K43K4K1l7j00j72K81
571A9l0q9p9K11k68K05j44L36q6O8j99OM47k36j68r3N8N5k6m7N3j9J76l96K7K31
597A2j09r3M83j09k90K81p9n04L90o5p6K91K8l25J81j59K47j14J12pj00j68K67
620I4J28l35p7L45j16J19l14Lk7L45j18m2k4P2n7K15k70mK32j03k5j3M2l4k6l10
$$ plain form
646 -300 158 193 199 -203 -160 53 -285 -36 -3 26 -204 -96 17 32 -162 177 -77 117 41 -121 -313 -17 -21 -83
670 -83 259 9 215 -163 -169 -23 37 188 205 -32 174 -16 -128 -279 14 24 41 -107 115 -6 10 -173 36
693 36 159 -22 126 -60 229 -113 19 171 48 -212 11 -49 158 130 -50 47 -7 -19 -74 -126 1 184 9
716 9 130 75 -31 -41 118 -119 -1 117 198 -263 45 -206 -199 190 110 -22 426 -12 -139 -45 137 -125 -157 -344
740 -344 -218 -30 -104 -19 -369 -58 14 -32 -71 -19 -98 -93 0 444 -51 -339 118 107 171 129 -299 -328 194 131 -18
765 -18 -68 5 195 87 233 -157 269 21 199 -50 22 -46 -85 148 -75 -81 -20 27 -113 -38 -8 -211 225 -42
789 -42 181 86 151 -50 -202 165 -53 -67 265 314 268 39 -148 136 24 -187 106 51 47 119 -39 -237 81 158
813 158 45 190 76 99 -63 -169 169 0 201 -5 -32 31 -375 -227 187 -91 134 82 302 218 -118 116
$$ packed form
646c00M58L5Om02M3K13l38K49L3K9k30J08J13J5j94L39k54J94p6j62j92K96mo2
670h3L42k50K06l78oJ46O0J51J7k37K06j90j12j51K93J0J7j48K22j21J6j83K09
693C6J23j81J48j86K89l42J32J52j23k60K23o0K07k8j80R7n4j2n5n2J27J83j75
716IJ21n5j06j0J59k37J18J18Q1m61L08k51PL89q0j32M48m38j27R4J82k62l2j87
740c44J26J88p4Q5l50L11P2m6l9N2p9NR3M44m95k88M57j1O4m2m28k9N22o3j49
765a8n0P3J90j08J46l90M26k48J78k49P2o8l9K33k23oO1M7j40P5L0k03M36k67
789d2K23r5O5k01j52L67k18j4L32M9m6k29j87K84j12k11K93n5mP2j58j98L18P7
813A58j13J45j14K3j62j06L38j69K01k06k7O3m06J48M14k78K25n2K20q4l36K34
$$ plain form
835 116 -271 50 -150 -100 86 194 158 58 29 156 -118 102 -143 -212 144 -15 3 10 277 -50 141 29 53
858 53 -21 -92 -67 -182 -86 28 98 32 62 -245 99 194 -94 7 -96 130 51 124 -28 -14 -45 -227 402 35 173
883 173 31 -139 -165 -132 -3 32 33 90 -101 48 -186 5 173 -368 12 -18 -48 13 -16 167 2 2 72 -121 -222
908 -222 88 -117 -108 -168 -215 77 135 -27 -46 24 128 -171 -42 -130 -221 -115 116 42 72 175 -162 -149 23 49 -8
933 -8 123 -18 13 60 67 51 233 58 1 104 -33 26 140 -81 -71 -161 -160 18 -73 40 106 -87 71 97 51 105
959 105 -47 151 -122 104 -117 -183 52 -100 -113 -156 168 -208 -53 33 241 -130 -161 230 49 -36 108 -69
981 -69 51 -27 -151 110 -58 -101 3 -155 43 57 -97 42 -66 156 -117 26 -21 119 0 137 -75 73
1003 73 191 14 -103 -149 128 218 -73 272 176 166 -29 160 133 240 -71 56 324 -92 -131 90 -8 -136 1
$$ packed form
835A16l87L21k00N0J86J08l6j00k9J27k74K20k45o9L56j59J8PK67l27J91j12K4
858E3p4p1K5j15R6J14P0o6L0l07L44R5k88J01j03K26p9P3j52J4l1j82O29l67J38
883A73j42j70k6L3J29L5JN7j91J49k34J91J68n41L80l0l0O1k9J83j65%P0j93j01
908b22L10k05Ro0m7K92N8j62j9P0J04k99J29q8r1J06K31p4L0J03l37J3J72K6n7
933hJ31j41L1M7Pj6J82j75n7J03j37N9J14k21J0r0JJ78r1J13O6j93J58K6m6N4
959A05j52J98k73K26k21o6K35j52j3m3L24l76J55Q6K08l71l1L91j81q5J44j77
981f9J20p8j24K61j68m3J04j58J98J4j54J39j08K22k73J43m7J40j19J37k12J48
1003G3J18j77j17m6K77R0k91L45r6j0j95J89k7J07l11J27K68m16l9K21r8j28J37
$$ plain form
1026 1 -207 142 -231 205 -101 -98 -110 10 -380 17 -32 25 126 68 -61 68 -213 139 89 -105 -150 -27 -286
1049 -286 133 69 -14 74 206 239 -111 175 -65 134 -149 254 -81 127 -110 -248 146 -48 -55 -40 -109 -124 -118 9
1073 9 -220 124 100 -448 195 168 308 -78 1 -73 -17 50 155 -121 -27 43 54 117 -61 12 -180 143 108 144 59
1098 59 -55 -171 38 101 -95 -182 69 118 -146 -8 184 93 -278 -109 -28 237 -6 137 61 -223 144 203 -35
1121 -35 30 81 125 -63 -74 -76 417 -43 -46 0 251 -62 -100 -44 -16 51 -15 51 49 57 324 -29 185 -16 -50 -104 -32 -297
1149 -297 -198 95 -114 -210 -109 -13 6 10 18 2 122 -52 -40 -20 126 -46 118 243 146 -175 109 -117 -29 17 156
1174 156 -101 -7 -195 106 40 -44 63 -225 -152 189 68 54 -191 87 -18 -107 -131 117 252 -13 38 -48 116
1197 116 -388 71 81 190 3 -245 -36 -35 -103 -92 162 236 -225 -110 192 -162 121 -123 25 53 -38 -150 -194
$$ packed form
1026Ak08L49l73M36l06Lj2J20l90L97m9N7J01n8j29J29k81L52n0j94m5J23k59
1049b86M19o4q3Q8J32L3l50K86k40J99k83M03l35K08k37j38L94j94pJ5o9j5OJ27
1073Ik29L44k4n48O43k7J40l86P9p4N6O7J05k76R4P0J1O3j78P3j92L23l5L6q5
1098E9j14j16K09O3j96q7K51M9k64J38J92r1l71J69Q1K65k43J43p6k84L67N9k38
1121c5O5N1M4j88j1kM93m60lM6K51l13l8N6K8O7o6O6kQK67l53K14k01l4n4P2k65
1149b97R9K93k09r6J01R6J9MQj6J20j74J2K0J46j72J64J25r7l21K84k26Q8M6J39
1174A56k57R4j88L01o6q4J07k88P3L41j21j4k45K78j05q9k4K48J35k65N1q6J64
1197A16n04M59J0J09j87k48K09Jo8J1K54P4m61J15L02l54K83k44J48K8r1j12m4
$$ plain form
1220 -194 -32 27 35 0 9 222 262 -194 -111 -28 -32 -35 60 69 -69 43 12 319 -192 -142 -248 -282 -15 62 32 -58 79
1247 79 230 -68 53 42 33 -69 -234 -11 -139 -122 -71 127 -29 34 96 210 -247 169 147 107 -154 38 217
1270 217 49 -39 -117 -90 -5 111 89 -10 90 126 111 78 -61 -49 126 -201 348 -163 132 31 -110 218 77
1293 77 -179 -29 45 -6 -123 -118 -44 47 -94 -261 138 -122 229 -120 194 -167 -85 161 -105 -253 -221 -9 -133
1316 -133 16 -383 18 -298 149 -193 29 -104 128 -63 54 -58 -22 -11 -97 39 153 -170 -311 4 -223
1337 -223 -94 -93 316 -43 -53 -75 0 -174 0 -119 31 -29 107 73 79 -131 35 119 51 -183 136 30 187 -295
1361 -295 -2 230 -176 -2 -31 -76 115 139 136 -83 113 13 -152 -26 28 86 166 63 -152 62 -38 213 26
1384 26 127 152 -9 -84 22 101 154 31 0 -53 -221 20 -84 -110 255 202 95 -24 -7 -128 177 51 109 11
$$ packed form
1220a94J62N9Ql5RK13M0m56Q3Q3mlR5Rj38J12l1L07n11N0j06l4K67P7l0r0J37
1247G9J51k98J21j1rj02j65K23j28J7N1J98j56O3O2J14m57M16k2m0k61J92J79
1270B17j68q8p8K7Q5J16k2r9J00L6j5l3j39J2J75l27N49n11K95j01j41L28j41
1293G7k56J50P4n1j17NP4R1j41j67L99k60L51l49L14l61Q2K46k66j48L2K12j24
1316a33J49l99M01l16M47l42K22j33K32j91J17j12L6J1q6J36J14l23j41L15k27
1337b23J29JM09l59j0k2P5j74J74j19J50o0J36l4Ok10J66Q4o8k34L19j06J57m82
1361b95K93K32m06J74k9m5J91K4lk19J96j00j65J26N4N8Q0j03k15K14j00K51j87
1384B6J01K5j61p5J06P9N3j23l1n3j68K41j04k6L65n3j07j19J7j21L05j26N8r8
$$ plain form
1408 11 -55 -130 -199 107 -175 -66 96 -120 -188 -80 146 13 -248 -21 140 46 -21 -103 140 23 5 -39 -79 10
1432 10 -122 74 -83 -99 11 -27 -84 -205 -29 157 -150 104 239 -152 -8 305 -18 210 180 -8 189 130
1454 130 236 -193 184 -10 -260 190 65 41 -299 73 -30 -77 -6 134 -101 68 -13 -78 -96 -118 -4 92 84
1477 84 -89 -268 120 228 -2 106 -68 -4 92 -37 -201 173 90 -18 14 -64 -130 -50 103 142 -43 -16 3 -23
1501 -23 -107 81 403 -83 120 120 -156 -263 155 -39 -76 -72 7 -362 55 -12 92 179 -160 210 -64 118 63 -179
1525 -179 -99 -162 35 -139 -134 -106 -410 18 100 105 -161 -323 -311 -179 15 114 -12 -25 227 -90 262 -95 -107 -134
1549 -134 37 -64 40 -78 279 96 -108 94 -104 11 128 330 -87 -136 71 -144 39 -92 -162 -27 -227
1570 -227 -332 -13 140 99 170 -297 39 -125 -70 -32 -72 28 77 -264 15 9 98 -107 -96 -76 -71 -69 48 -83 460
$$ packed form
1408A1o6p5o9L06k82J09J62k16o8J08K26j33k61K27J61r4o7q2K43j17j8m4m0Q9
1432A0j32J96j57j6J10l8n7j21J76J86l07K54J35l91J44L13l23K28l0j88J97n9
1454A30J06m29L77j94k50M50j25k4l40L72j03m7P1J40k35J69q1o5j8k2J14R6q
1477H4j73j79L88J08k30J08j74O4R6j29j64L74q3j08L2p8o6Q0J53L9j85K7J9k6
1501b3q4J88L22m86K03%k76j07M18j94l7MP9l69M17o7J04Q7l39L70k74J82n5k42
1525a79Q0o3J97j74NK8l04M28Q2Nk66j62J2J32J94R9j26j3K52l17L52l57j2k7
1549a34J71j01J04j18L57j83k04K02j98J15J17K02m17m9K07k15J83j31p0J35k00
1570b27j05L19J53m1P1m67L36j64N5L8m0J00M9l41K79oQ9k05J1K0NKJ17j31N43
$$ plain form
1595 460 162 -119 -25 130 -3 -3 -11 43 153 -268 62 -118 -22 -247 34 4 75 491 -6 -127 -32 63 257 43
1619 43 105 79 187 230 -37 221 -189 -82 -135 -80 -69 -86 169 103 -233 51 38 -11 -174 -155 237 367 182 -20
1643 -20 254 15 50 30 241 -89 -156 -19 -18 -44 -98 -81 -57 -270 -2 121 -37 285 122 16 48 190 159 -84
1667 -84 71 118 -109 40 34 92 -64 -37 29 -135 -143 -5 79 132 -252 8 266 -82 -122 188 -109 -342 -67 -1
1691 -1 43 257 -34 116 165 125 96 -135 -156 187 127 -110 254 -8 -210 105 45 -197 -145 200 231 -134 -232 -179
1715 -179 295 -70 61 40 -138 101 -306 58 -52 119 106 155 -199 -76 65 124 -222 48 -46 -67 -109 158
1737 158 -88 -304 40 15 88 -176 221 106 64 34 -189 114 -237 8 -61 -272 57 -204 -37 371 267 -146
1759 -146 295 -265 104 170 -42 213 -118 38 3 -157 -135 -139 -234 -146 72 -176 -455 -55 33 -12 21 -318 -19
$$ packed form
1595D60k98k81R4J55j33%qN4J10m21L30j80R6k25K81l0P1M16m97j21R5R5J94k14
1619D3O2k6J08M3k67K58m10J07n3N5J1j7K55o6l36K84j3m9j63J9L92J30j85k02
1643b0K74k39L5k0K11l30o7J37Jk6n4J7K4k13K68J23j58L22j63j06L2J42l1k43
1667h4J55M7k27J49oN8j56K7O6j64qJ38Q4N3l84K60K58l48m0L10k97k33K75O6
1691aM4K14k91J50M9m0k9k31k1L43o0k37L64k62k02L15o0k42N2L45L1l65r8N3
1715a79M74l65J31k1j78K39m07L64j10J71j3M9l54J23J41N9l46K70r4k1m2K67
1737A58k46k16L44k5P3k64L97j15m2l0k23L03l51K45o9k11L29k61J67M08j04m13
1759a46M41n60L69O6k12K55l31J56l5j60K2mr5Q8K18k48k79M00Q8m5L3l39K99
$$ plain form
1782 -19 -173 -49 36 -58 124 204 111 162 -46 4 86 40 13 -18 163 58 -92 145 207 187 -81 -66 -255 -289 -17
1807 -17 -14 -2 -366 -60 -210 1 18 -17 196 225 -10 -55 38 145 -133 200 -152 146 -8 -58 166 11 170
1830 170 -63 44 -328 -172 16 -148 167 -293 274 -59 139 206 147 -113 -108 131 119 207 168 -142 -10 102
1852 102 199 21 104 25 87 -43 -201 63 139 46 126 -160 49 -78 -29 -90 -3 -80 -62 278 -55 100 -234 -68
1876 -68 -203 9 105 212 154 -35 84 -272 -108 174 -21 0 12 -48 -450 -56 59 -12 251 141 -323 -51
1898 -51 -55 -100 360 -26 -230 -38 103 261 -238 -132 164 -113 -52 168 66 -110 89 244 -95 81 127 -11
1920 -11 -31 -81 54 -196 51 -3 83 -118 184 179 14 -21 33 -26 -263 32 345 -213 6 183 -80 -64 -162 114
1944 114 76 -174 -218 113 -327 -6 101 9 -11 -29 -235 89 -14 42 -49 11 -255 -211 29 -131 194 -108 113
$$ packed form
1782a9j54J24Q5r4J82Q0r3N1k08N0Q2m6k7l1J81j05j50K37O2k0k68J5j89l4K72
1807a7LJ2l64L06j50K11J7l5K13K9k35m5R3J07k78L33l52K98j54n0K24j55J59
1830A70k33J07l72J56J88j64L15m60N67l33J98O7n9k60NK39j2Q8l9l10J32J12
1852A02R7j78Q3p9O2j30j58K64P6r3Q0k86K09j27M9o1Q7p7J8L40l33J55l34J66
1876f8j35K12R6J07n8j89J19l56J64K82j95K1J2o0m02L94J15p1K63j10m64K72
1898e1mm5M60l86k04J92J41J58m99J06K96k77O1K20j02j76J99J55l39J76M6j38
1920a1k0n0J35k50K47n4Q6k01L02nj65l5N4n9k37K95L13n58K19J77k63J6r8K76
1944A14l8k50m4L31m40L21J07r2k0j8k06L24j03N6r1O0k66M4K40j60L25l02K21
$$ plain form
1967 113 115 137 -121 97 -44 -108 168 38 57 -64 8 94 27 140 194 -42 2 -94 -107 202 112 -10 -56 -84 -48
1992 -48 43 264 73 101 40 -74 -88 173 -9 -74 27 30 -201 -35 -192 -57 261 -112 11 -14 -232 -67 53
2015 53 -87 -182 -31 -30 90 -3 120 107 207 -76 -52 172 63 -62 120 -91 -140 182 -88 66 73 -121 195
2038 195 -91 0 111 -7 -20 -183 77 69 -243 -293 62 138 -122 -28 -26 -142 183 24 205 -35 140 283 -36
2061 -36 59 -145 111 352 138 -252 -30 89 29 27 -143 175 -76 -224 -56 -337 161 -3 0 -70 -40 265 -207
2084 -207 107 -173 15 -69 41 85 173 -33 -222 271 31 62 76 104 142 -90 -90 122 -46 -23 -130 -1 61 51
2108 51 139 -140 92 -26 64 -37 -72 79 18 -9 27 -59 -170 112 47 54 92 -105 181 -8 -6 120 221 64 -2
2133 -2 -168 112 433 -86 70 11 -27 111 13 -79 -258 -99 54 -22 -159 72 159 16 -136 114 67 -89 186
$$ packed form
1967A13KK2k58K18j41o4K76j30J9j21P2Q6o7J13N4k36M4r6j3L09r0j22m6k8L6
1992d8R1K21j91K8o1j14j4K61j82o5J01Lk31J66j57J35L18l73J23k5k18J65J20
2015E3j40r5J51JJ20r3J23j3J00k83K4K24j09j25J82k11m9L22k70J54Pj94L16
2038A95k86R1J11j18j3j63K60ql12n0L55P6k60R4Kj16L25j59J81k40J75J43l19
2061c6R5k04K56K41k14l90K22J19o0kj70L18k51j48J68k81M98j64Lp0L0L05m72
2084b07L14k80J88q4J10M4Q8k06j89M93k40L1J4K8L8k32%K12j68K3j07J29O2j0
2108E1Q8k79K32j18R0j01l5J51o1k7L6q6j11K82o5PL8j97K86j89KJ26J01j57o6
2133bj66K80L21n19J56n9l8J38r8r2j79J59J53p6j37K31Q7j43j52K50m7j56K75
$$ plain form
2156 186 259 4 88 -7 147 -20 -126 118 72 -293 243 20 -42 -38 -199 186 31 164 -59 83 109 109 -116
2179 -116 227 -5 -88 147 -143 77 26 -40 71 8 -76 182 90 -8 -40 137 15 -31 -127 -20 123 -49 83
2202 83 -247 48 -191 143 199 224 71 -2 163 -210 -140 -20 157 133 111 -173 -113 -216 -77 202 83 -161 -214
2225 -214 -94 76 262 175 14 -182 -200 -9 37 -274 -41 -188 -49 -109 -100 179 129 -115 -24 -144 -257 -91 -27
2248 -27 -3 -54 -72 -145 154 -3 48 44 52 30 255 -74 269 -134 158 65 -2 145 193 204 39 -454 -33 32 27 88
2274 88 -155 162 -131 111 -52 42 -16 83 -67 3 -22 -58 31 -20 -35 -55 317 -138 -13 -52 -25 75 -73 162
2298 162 -101 42 -1 -212 -265 -48 55 -86 -157 -73 86 -33 -340 -164 0 208 214 22 -83 -310 -125 -87
2320 -87 171 -132 88 30 -150 -158 -111 133 139 8 -52 9 110 -23 72 113 129 172 -337 -125 -189 -272 245 -289 -87
$$ packed form
2156A86P3k55Q4r5J54j67j06K44m6l65N36k23o2Mj61L85j55J33k23J42K6%k25
2179a16L43k32q3K35k90K20n1o6J11o3q4K58r2r8l2J77j22m6r6J07J43j72J32
2202H3l30K95k39L34N6K5j53p3J65l73P0J20J77k4k2k84O0j03J39K79j19k44n3
2225b14J20J70J86q7j61j96j8J91M6l11K33j47J39o0RK79n0k44R1j20j13J66O4
2248b7K4n1j8p3K99j57N1mQk2K25l29L43m03K92r3o7J47M8J1j65m93M21O5nO1
2274H8k43L17k93K42j63R4n8R9j50P0k5l6Q9n1j5k0L72m55J25l9K7J00j48K35
2298A62k63J43m3k11n3K17J03j41p1Q4J59j19l07J76J64K08Oj92j05k27J85L8
2320h7K58l03K20n8j80qM7K44Oj31o0O1J01j33R5M1J6M3n09K12o4q3N17n34K02
$$ plain form
2345 -87 20 85 205 323 -166 96 6 96 62 -41 13 71 -126 68 -432 -7 169 121 -453 140 197 -129 -268
2368 -268 -212 11 50 -51 -205 77 -161 151 134 208 -91 -146 22 55 -93 264 54 72 -40 -111 -91 54 178
2391 178 -67 -101 -182 -114 261 -98 -108 -88 223 -51 -170 79 -57 124 -154 53 320 175 55 25 206 75
2413 75 -60 97 -36 -176 -48 36 6 -39 -66 -212 -133 12 18 -237 -100 164 -293 -96 -87 -312 181 -169 28
2436 28 182 -31 142 13 -52 81 339 163 -30 -100 -15 38 -39 130 -5 36 73 -98 138 240 128 -21 144
2459 144 -291 188 212 -40 -56 -69 -5 -100 137 -20 67 184 24 159 -72 -44 -163 -64 -170 -28 112 286 12
2482 12 -19 -90 -31 97 53 -72 294 57 -138 -244 -170 93 31 -65 38 110 55 77 -207 -180 -43 -30 -218 8
2506 8 -10 159 77 -149 19 -66 -243 -233 -149 -209 28 58 50 -145 -159 -86 -41 -21 38 119 103 59 62 88 250 -139 104
$$ packed form
2345h7J07O5J20J18m89K62r0R0l4j03N4N8j97J94n00M25J76m8n74N93N7l26j39
2368b68N6K23L9j01j54K82k38L12j7P4k99n5J68L3j48L57k10J8j12p1K0J45J24
2391A78k45l4q1O8L75l59j0K0L11k74j19K49j36J81k78K07K67j45j20l0J81j31
2413G5j35J57j33j40J28Q4l0m5k7j46P9J45Ok55J37K64m57J97Rk25M93l50J97
2436B8J54k13J73j29o5J33K58j76j93p0Q5N3p7J69j35M1L7j71K36J02j12j49J65
2459A44m35M79K4k52j6j3O4r5K37j57Q7J17j60J35k31K8j19R9j06J42J40J74k74
2482A2l1p1N9J28m4j25L66k37j95j06P4K63o2r6J03P2n5K2k84K7J37J3j88K26
2506Hj8J69q2k26J68q5j77J0Q4o0K37L0qj95j4P3M5K0N9Q1j6m4LK6J62l89K43
$$ plain form
2533 104 31 -51 208 -27 79 203 174 57 93 75 -156 93 96 -148 -12 -90 -223 137 -7 11 40 2 210 31
2557 31 34 93 -172 -269 128 -85 -53 -145 134 164 -50 53 72 86 9 -81 29 -18 34 -263 6 -73 103 267 -71
2582 -71 223 60 -54 264 92 -97 -54 90 26 -130 39 178 105 246 -14 -124 178 -174 -245 -343 90 320
2604 320 -82 187 119 154 229 -26 322 190 -69 -65 146 -59 -141 -38 -104 -306 258 -107 95 -70 118 62 -33
2627 -33 61 114 192 0 -322 89 205 56 -98 -186 -28 -235 -196 -201 -293 -11 -255 -133 -219 -119 86 123 -72 -14
2651 -14 64 170 -86 -74 -5 26 -17 -132 46 147 -24 174 228 69 93 -2 -40 -81 -132 178 245 455 -62 130
2675 130 -31 21 22 71 80 -53 4 166 91 168 -82 -139 39 50 354 208 -25 170 -52 19 155 -202 -228 -171 48
2700 48 -162 135 -283 178 197 100 -24 33 128 -186 -136 -227 -77 58 -25 63 273 -399 -95 -137 108 -212 -22
$$ packed form
2533A04p3q2K59k35J06J24k9j17L6j8k31K49Lk44J36p8j33L60j44J8K9l8K08j79
2557C1LN9k65r7L97k13L2r2K79L0k14J03J9J4p7r0J10m7N2k97K69p9J76J64l38
2582g1K94j63j14L18j72j89M3J44o4j56J69J39p3J41k60j10L02l52p1r8M33K30
2604C20m02K69o8L5P5k55L48j32k59MK11k05q2J03o6k02N64l65K02j65J88n6r5
2627c3R4N3P8j92l22M11J16j49j54q8J58k07L9nr2K82k44J22q6J00K05L7j95N8
2651a4P8J06k56J2O9L1m3j15J78J01j71J98N4j59K4r5l8m1n1L10O7K10n17J92
2675A30j61N2JM9Rj33N7J62p5P7k50n7J78J1L04j46k33J95k22P1J36l57k6N7K19
2700D8k10K97m18M61J9r7j24N7R5l14N0r1J50J35q3Q8K10o72L04m2K45l20J90
$$ plain form
2723 -22 -125 -6 -321 -53 152 188 27 87 71 -157 4 -154 63 -141 14 -149 -77 -83 -162 -63 255 -96 -17
2746 -17 34 -48 222 287 -76 78 -204 -183 219 121 49 264 -140 359 -10 -198 -290 -122 31 12 138 -2 -39
2769 -39 39 146 -282 -166 -90 74 -155 37 234 -130 56 -50 59 280 -29 -19 -205 -235 -184 -137 68 45 236
2792 236 -39 -74 -221 217 113 -30 107 6 58 179 125 -99 81 42 221 244 -131 -60 -36 48 -204 -105 -197
2815 -197 228 -17 125 132 -77 148 -19 -311 68 -37 -248 20 98 -190 -71 262 -66 -189 1 -13 125
2836 125 291 286 193 103 60 0 97 -38 42 225 211 237 42 68 166 -45 43 133 -70 196 2 -49 -107 4 55 -77
2862 -77 -130 91 159 136 -87 68 -51 -4 244 28 -136 -139 -7 -167 300 120 63 166 -137 -138 19 -6 -40 -99
2886 -99 -80 126 95 218 -178 33 5 98 24 -30 -3 8 188 75 0 -159 108 261 -98 42 167 -61 -55 -87
$$ packed form
2723b2j03J19l15K68K05L6j61O0j6k28J61j58K17k04J55j63P2op9R9L18l51P9
2746a7N1q2K70O5l63J54k82K1M02r8p2K15m04M99l69j88r2J68J53j9J26j40l7
2769c9P8J07m28J16P6J64k29J92J97l64J86j06J09K21l09J0j86l0N1M7K05k3J91
2792B36k75l5j47M38j04j43J37j01N2J21n4k24J80l9J79K3l75P1K4Q4k52R9r2
2815a97M25k45J42Pk09K25j67k92L79j05k11K68P8k88J19L33l28j23J90j4J38
2836A25J66nr3r0m3o0R7j35Q0J83j4K6j95K6R8k11Q8R0k03K66j94n1n8J11N1j32
2862g7n3K21O8k3k23J55j19M7K48k16j64lJ32j60M67j80n7J03l03jJ57k5l4n9
2886i9J9K06l1J23l96K11k8R3p4n4K7J1J80j13p5j59K67J53l59J40J25k28Ol2
$$ plain form
2910 -87 -226 358 214 -122 77 -173 83 -26 -96 -134 -26 63 48 72 216 -208 -197 -139 269 -68 -52 6 -49 -167
2934 -167 -119 -58 -127 -155 -51 -57 61 -161 6 -164 153 153 -101 187 164 53 24 -47 -181 -199 -97 -150 170 -119
2958 -119 -7 -11 -135 80 91 -305 -286 -118 -34 -32 230 332 21 -65 157 -216 -48 -257 139 -33 -67 -120 -148 217
2982 217 150 -37 6 191 18 -250 -202 -170 135 -20 -393 -54 -158 -149 -226 15 32 -143 -186 135 38 -90 -57 96
3006 96 88 58 97 26 79 206 68 175 149 198 174 34 8 -102 -60 -168 -25 -263 153 -258 152 57 -226 71
3030 71 -62 -96 -30 -85 58 15 -53 15 47 -65 74 -109 -262 -232 -51 -267 -19 -21 -18 317 -56 -102 -239 -221 162
3055 162 241 -157 -11 -77 195 -125 17 -90 -154 -106 33 94 91 86 144 50 74 -233 -240 157 -91 -114 -28 -89 29 206
3081 206 -95 40 13 81 88 -68 -141 78 -51 -1 -282 -276 126 96 77 -150 -167 327 -150 -303 -154 256 -176 -194
$$ packed form
2910h7j39N84j44l36J99k50K56j09p0l8J08Q9j5K4J44m24J1N8M08l37J6N8n5j18
2934a67M8O1o9k8J04oJ18k22J67j70L17%k54K88k3j11k9p1j34j8J02n3L20k89
2958a19J12mj24K15J1l96J9J68Q4KK62J02l11q6K22l73J68k09L96j72l4n3k8L65
2982B17o7j87M3J85j73k68M8L2L05j55l73L39j04Rp7K41J7j75m3L21r7j28L3J53
3006I6ql0L9p1N3J27j38J07k6M9k4j40k6j10M2j08J43k38M16m11M10r5k83K97
3030G1j33l4O6n5J43m3o8O8L2j12J39j83j53L0J81k16K48kLL35l73m6j37J8L83
3055A62P9l98J46o6K72l20J42j07o4M8J39O1lnN8r4K4l07pL97k48k3Q6o1J18J77
3081B06l01J35k7O8Pj56p3K19j29N0k81OM02l0j9k27j7M94m77j53J49M10m32j8
$$ plain form
3105 -194 -50 -218 233 -60 244 311 -1 -239 -98 -17 -3 40 -64 111 24 -75 -123 -161 -11 169 70 17 20 176
3129 176 -49 82 69 112 -15 34 201 -89 -174 -184 -126 123 4 161 251 -423 108 -39 81 -82 -190 180
3151 180 -207 -17 37 -148 -18 264 -6 33 -129 -77 -251 47 178 -125 166 -349 -13 135 175 50 17 -51
3173 -51 74 -96 -101 -146 -187 -220 -93 94 135 -275 -64 136 30 -50 213 230 27 52 214 -82 -72 177 -16 115
3197 115 -4 -39 13 -118 -139 219 -391 220 -91 -42 -60 -279 159 103 -146 -155 14 25 201 -32 287 85 161
3220 161 3 177 335 263 -61 38 -23 -70 143 -166 -160 30 -67 116 51 119 119 -2 101 377 -98 -84 18 355
3244 355 125 -220 -34 165 -47 -17 161 15 170 -16 -16 -187 -162 231 -103 108 378 78 43 -26 -95 116
3266 116 191 -15 70 -24 102 254 81 -159 15 -93 -5 135 -155 -72 6 15 -252 66 66 133 64 150 -96 75
$$ packed form
3105a94J44j68M51k93L04O7l12k38J41Q1J4M3j04J75q7r9m8l8J50J80r9n3LJ56
3129A76k25J31j3M3j27M9J67k90q5j0N8K49j19J57R0o74N31j47J20j63j08L70
3151A80l87J90N4j85J30K82k70L9j62N2j74K98J31l03K91n15L36J48M0j25l3o8
3173e1J25j70nm5m1l3J27J87M1m10K11K00j06q0K63J7k03K5J62k96J0K49j93J31
3197A15j19l5N2j31k1L58o10O11l11M9j8k19M38n6k49rJ69J1J76k33L19k02P6
3220A61j58J74J58p2l24R9o1m7K13l09OJ90r7J83o5O8%j21J03K76m75J4J02L37
3244C55k30l45J86J99k12L0J78j46J55j86%j71K5L93l34K11K70l00l5o9o9K11
3266A16P5k06Q5r4J26J52j73k40J74j08Q8J40k90Q3P8Rk67L18%O7o9Q6k46J71
$$ plain form
3290 75 1 -92 7 17 36 -169 -42 79 99 79 -25 -19 5 -39 -25 -77 63 -25 40 137 229 8 86 84 203 -18 -94
3317 -94 -122 9 156 118 141 -82 -52 109 -91 52 31 219 207 -94 -156 -109 119 -53 35 -24 -198 107 135 -43
3341 -43 -43 -2 -21 -21 63 162 138 109 124 66 -85 44 -5 113 -161 222 62 -12 201 84 24 69 190 211 -55 73
3367 73 -46 35 7 98 -81 11 60 22 80 11 147 92 -29 131 21 103 -161 -22 216 59 73 16 203 42
3391 42 -65 39 32 -66 -67 -46 -139 -23 109 76 456 -221 -132 92 -63 199 111 149 -213 184 375 -43 77 -225
3415 -225 144 188 307 135 -388 82 -6 -260 -259 368 17 74 258 198 -43 -123 -224 8 -84 -85 78 13 59 -165
3439 -165 169 -22 -118 -30 -29 110 11 119 -172 98 41 77 -53 -14 312 21 -294 52 -39 -187 -28 -13 -74 -204
3463 -204 23 -165 32 64 -164 213 40 217 -221 93 -233 49 -59 237 146 -278 64 -198 47 -69 141
$$ packed form
3290G5p4r3R9J0J9k05J27J21K0k0j04OK4m4J4n2J40q8O5R7R2k21P8kJ19k21p6
3317i4k8J31J47l8K3k23L0J61k00J43k1J88j2l01o2M7K28j72Q8n9j74L05K8j78
3341d3%M1j9%Q4R9k4k9J5n8j51J29m9J18k74L83j60p4K13j17o0M5J21K1k66J28
3367G3j19Q1k8R1j79R2M9l8N8o9J36n5j21J60j10Q2k64J39K38j57J4n7J87j61
3391D2j07J04pr8jK1r3J16J32l3L80o77Q9K24j55K62q8L8l62L97J91m18J20l02
3415b25L69M4J19j72n23M70q8k54JO27l51N7J84o0k41q0j01K32r2jJ63o5M6k24
3439a65L34j91r6Q8JJ39r9J08k91K70n7L6j30L9L26k91l15L46r1j48J59J5o1j30
3463b04K27j88J97L2k28L77j73J77m38L14l26K82j08K96r1m24L42k62K45j16K10
$$ plain form
3484 141 -79 229 -101 271 102 -315 -119 -273 126 45 0 -20 -7 -110 124 279 -182 68 -117 -44 -133 -22
3506 -22 -160 -141 -125 -167 117 -83 11 267 53 70 103 212 -25 -48 10 -83 2 284 37 20 -100 -170 -210 143 -91
3531 -91 -90 4 -4 -116 150 -109 183 91 -97 122 -240 -131 36 73 58 -158 -55 -99 81 76 -134 44 -19 -104 65
3556 65 196 -262 -108 -42 -37 64 143 52 -282 158 -219 32 5 41 133 -20 124 -99 58 169 -128 -90 -80 299
3580 299 -236 127 -159 -193 58 56 108 24 52 106 -137 -23 3 175 3 -224 -110 29 -181 166 -65 61 20
3603 20 235 201 159 -90 -276 -227 -16 10 -212 95 -23 35 173 64 116 17 -61 -78 -49 -114 -5 -55 233 -47
3627 -47 -66 124 -105 -326 172 87 -75 51 -214 184 -132 -227 226 210 92 -145 -115 167 128 -7 -156 135
3649 135 120 -38 4 56 -3 -112 -28 243 -131 110 107 346 -223 -96 -16 -234 35 -126 161 120 181 75 -65
$$ packed form
3484A41k20L08l30L72j69m17J96j54L99q1m5k0J3j03K34J55m61K50j85P3q9J11
3506b2j38J9J6m2K84k00R4K56k14J7L3J09k37k3N8r3Q5K82k47j7j20p0m0L53k34
3531i1JR4qj12K66k59K92r2j88K19l62J09J67L7j5k16J03m4J80nk10J78o3q5J69
3556F5J31m58J54O6NJ01P9r1l34M40l77K51k7L6R2j53J44k23J57J11k97L8J0L79
3580B99n35L63k86l4K51kN2q4K8N4k43J14K6J72j72k27J14J39k10L47k31J26m1
3603B0K15l4m2k49j86M9K11K6k22L07j18N8J38j09N2r9p8j7K9o5J09n0K88k80
3627d7j9J90k29k21M98q5j62J26k65L98l16r5M53j6j18k37L0K82l9j35j49K91
3649A35j5j58M2N2n9j09Q4K71l74K41lK39n69J27Q0k18K69j61K87m1O1j06j40
$$ plain form
3672 -65 3 21 24 -128 37 -63 -460 105 -102 42 -173 121 -48 307 -19 18 -119 198 0 -294 37 -62
3694 -62 -162 41 -32 -137 -44 -106 69 154 38 -178 -148 -101 -193 1 -30 -14 248 43 -63 8 -12 -15 -325 24 267
3719 267 -74 -59 -68 -83 125 90 -171 121 54 -282 -5 91 -45 254 -94 224 160 -49 -114 -255 82 84 204 -304
3743 -304 -172 210 224 -255 -35 -76 -34 116 -360 -112 157 -169 143 85 -2 -54 -172 71 -100 80 84 88 203
3766 203 102 -198 -33 -83 193 13 114 -21 12 152 -53 -118 54 377 -246 98 -42 -165 -341 -119 105
3787 105 190 -82 -16 41 270 45 59 -135 -38 15 135 -58 12 154 3 -55 130 211 -130 22 -172 65 -196
3810 -196 -42 -56 10 20 183 -150 -20 -273 182 -28 13 -88 -48 -79 -114 29 -108 227 -194 115 -13 -29 -94
3833 -94 143 0 -76 166 -6 -358 53 -88 -268 111 -293 -160 -66 58 55 52 39 -20 -150 79 141 -95 130
$$ packed form
3672f5O8J8Lj52J65j00l97N65k07J44k15K94j69L55l26L7j37L17j98k94L31r9
3694f2j00K03p3j05R3o2J75Q5j16k16L0M7r2J94l1J6K62k05j06P1k0ll10L49K43
3719B67l41J5rj5K08l5k61K92o7l36K77R6j36K99l48L18o4k09o5j41L37KJ20n08
3743c04J32L82J4m79K20m1M2J50m76K48K69l26L12n8q7n2j18K43j71J80MMJ15
3766B03j01l00J65n0K76j80J01j35L3J40k05o5J72L23o23L44j40j23j76K22K24
3787A05Q5k72O6N7K29k25J4j94R7N3J20j93P0J42j51n8J85Q1l41J52j94K37k61
3810a96J54j4O6J0J63l33J30k53M55k10M1j01M0l1l5J43j37L35m21L09j28j6o5
3833i4K37j43p6K42j72l52M11j41j80L79m04J33R4J24llj3n9j30K29O2k36K25
$$ plain form
3856 130 297 160 -312 -27 -155 -89 -335 63 14 160 266 -91 169 -44 104 293 112 205 52 -68 38
3877 38 -54 165 -127 -63 233 -22 -39 -143 -8 173 94 -127 112 36 -17 80 195 111 163 118 138 -99 6 -171
3901 -171 -168 171 58 40 -40 -136 192 22 -8 -15 -297 47 112 38 -24 -115 25 -74 86 211 -174 -118 -35 126 176
3926 176 77 67 -105 85 -355 239 40 -131 -262 -181 31 239 290 132 -38 -110 171 18 -29 -161 179 34
3948 34 -53 5 46 -93 117 -7 34 -23 -195 412 283 50 -98 -154 376 -50 112 -8 -94 121 -211 101 -81
3971 -81 -237 -32 191 -132 -42 200 -16 -43 -242 12 -166 -311 47 -121 -163 52 -259 -260 95 -19 118 26
3993 26 -148 17 -47 14 -21 -244 248 -207 -105 -3 -83 156 -320 169 72 -186 -5 126 -154 231 209 -26
4015 -26 -88 -345 -18 -99 4 45 126 -46 -98 194 -46 38 -2 50 99 84 -325 -61 87 -5 -193 -83 -94 241
$$ packed form
3856A30J67j37m72K85j28O6k46L98m9J46J06l57K60k13J48J89j81R3j53j20J06
3877C8r2K19k92O4K96k55j7j04J35J81p9k21K39p6n3R7J15q4N2m5K0k37J05j77
3901a71LL39j13j8q0r6L28j70l0pk82L44O5p4o2r1J40r9J60J25l85N6Q3J61N0
3926A76r9j0j72J90m40N94j99j71j31Q1K12K08N1j58j70p2K81j53m7j32L40j45
3948C4q7N8M1j39K10j24M1n7j72O07j29k33j48n6N30m26J62j20q6K15l32L12j82
3971h1j56K05K23l23R0K42k16k7j99K54j78j45L58j68m2K15l11jL55j14J37r2
3993B6j74J65o4O1l5k23M92m55J02J02q0K39m76M89r7k58J81J31k80L85k2k35
4015b6o2k57L27q1J03M1Q1j72n2K92k40Q4m0N2M9j5m09K64J48r2j88J10j1L35
$$ plain form
4039 241 49 -189 211 -84 -135 25 -5 2 21 41 -47 199 20 200 127 -149 -33 -90 -57 307 -203 -123 73 -5
4063 -5 -210 237 138 -117 46 110 30 145 288 73 -268 208 63 -178 155 -190 -49 60 198 -68 -73 102
4085 102 -58 -28 80 246 -258 10 -122 69 -31 -20 170 -85 60 -13 228 -80 -9 -202 -101 80 147 -124
4107 -124 -78 35 -207 44 1 210 -102 -211 165 -97 226 209 -61 -130 -114 182 -239 247 -5 47 -73 225
4129 225 -114 -86 -2 24 91 -48 256 -10 -183 418 231 107 297 117 174 56 75 -149 -150 162 -61 305 191
4152 191 -108 84 37 -20 182 -15 -82 -275 -84 214 77 -49 34 4 26 -115 -33 216 -247 74 -259 62
4174 62 28 -134 171 -110 143 -159 144 69 142 43 112 119 -197 118 92 -55 -34 -115 86 -37 -198 212 -35 95
4198 95 20 -125 -248 -89 -77 44 -3 -93 -108 192 -71 195 -203 -191 -42 -33 -131 208 -236 -11 -10 -15 76 281 -251
$$ packed form
4039B41j92k38M00k95n1J60l0PJ9K0q8K46j79J80p3k76J16n7L3L64n10Q0J96p8
4063ek05M47r9k55J63O4q0J15J43k15l41M76j45k41L33l45J41J09J38k66nJ75
4085A02j60L0J08J66n04K68j32J91j00J1J90k55J45p3K41l08P1j93J01J81O7k71
4107a24M6J13k42K51m3K09l12j09L76k62L23j7k70o9J6K96m21M86k52N2j20K98
4129B25l39K8Q4K6O7j39L04k66j73O01j87j24J90j80N7j18J9k24jL12k23L66j14
4152A91k99J92m7n7K02j97o7j93J91K98j37j26Q3l0K2j41Q2K49m63L21l33L21
4174F2l4j62L05k81K53l02L03p5P3r9O9Pl16L15k6j47K1q1K01j23j61M10k47J30
4198I5p5j45j23J59J2J21m7r0j5L00k63K66l98J2J49Rr8L39m44K25JnR1K05n32
$$ plain form
4223 -251 -290 -73 125 -51 63 -4 53 -2 14 -50 -81 34 13 34 -148 -6 -198 -45 157 0 -66 -49 -180 70
4247 70 143 100 -192 -42 -50 -278 96 -75 -135 249 32 -89 11 -98 -140 133 101 30 -102 -21 11 58 68 -98
4271 -98 19 140 167 235 250 83 -140 -54 -53 -51 -76 -67 -28 -97 -145 237 9 -37 -54 -18 61 -136 42 -107 -96 -118 -299
4298 -299 73 -178 -73 -106 -85 -110 -65 220 386 -60 -60 -34 101 35 204 -91 -79 -86 18 -1 57 10 44 22 -217
4323 -217 -188 -92 426 122 362 109 41 123 93 -59 -18 -58 243 -68 75 -152 1 -56 -24 -38 224 -77 -65 -93
4347 -93 -104 -5 -99 -28 -198 193 -32 18 -31 246 -75 224 173 152 -127 -106 -96 -219 3 334 -138 82 -37 -332
4371 -332 -128 -55 113 -60 -310 107 69 -131 84 121 24 15 -48 -133 85 107 -292 -9 39 -102 41 178 154 -17
4395 -17 126 -228 -73 -245 63 -338 206 87 59 67 -43 132 23 6 -204 190 179 26 119 -153 71 175
$$ packed form
4223b51l9K17J98j76J14o7N7n5J6o4l1J15k1K1j82J42j92J53K02j57o6J7j31K50
4247G0P3m3k92J50qk28L74j71o0L84k17j21J00j09m2K73l2p1j32Q1L2M7J0j66
4271i8J17J21K7O8J5j67k23Q6JKk5RL9o9m8L82k28m6j7L6P9j97J78j49J1k2j81
4298b99L72k51J05l3K1k5M5K85J66m46%K6J35o6J69k95J2pJ04j9N8m7L4k2k39
4323b17K9R6N18l04K40k53o8Q2l0j52M1m0L01l11J43k27J53n7L2j4K62l01J2k8
4347i3j1R9r4P1j70L91k25N0m9K77l21K99n1k1k79K1J0j23K22L31m72K20j19k95
4371c32K04P3J68j73k50M17l8k00K15L7r7ro3q5K18K2l99K83M8j41J43J37k4j71
4395a7J43l54J55j72L08m01N44j19k8Qj10J75j09j7k10L94j1j53R3k72K24J04
$$ plain form
4417 175 -342 159 61 -62 39 -91 -147 -110 154 62 -74 -126 -29 103 -10 86 -100 20 19 -32 151 -127 180
4440 180 65 55 -136 261 43 -62 2 17 -156 258 -49 -125 172 161 66 44 -66 -45 280 3 -82 173 81
4463 81 151 213 -60 -234 -87 -252 84 -1 53 172 19 -9 24 -205 -89 56 66 -134 -5 29 -175 46 6
4486 6 -16 -97 240 -109 -35 241 106 65 -31 153 -149 52 -18 -24 198 -111 -55 -210 -42 -58 74 134 73 -97 165
4511 165 -53 -81 18 241 -15 7 118 -61 147 -41 56 -120 -35 -25 240 168 -13 -78 167 121 179 257 81 36
4535 36 32 93 -50 192 -92 131 -67 14 60 61 -81 312 92 -34 -83 353 269 -10 -176 -78 102 213 146 -103
4559 -103 70 47 92 -72 -184 -46 10 89 111 145 53 -336 -154 8 48 -65 18 -178 -94 -3 -27 0 10 -87 34
4584 34 -163 265 -2 -208 212 -62 -169 -132 -24 -362 39 -113 245 117 -460 -50 -133 77 91 -256 -66
$$ packed form
4417A75n17N01r8j23J01j30n6L7K64r2j36n2R7J32j13R6j86J20jn1J83k78L07
4440A80j15j0j91L97k18j05O4J5j73M14l07p6K97j1r5k2j10K1L25k77q5K55r2
4463H1P0O2k73j74J47j65L36q5N4J19j53k8L3k29J16J45J0k00J29L4k04K21m0
4486Fk2q1L37l49P4K76j35m1r6J84l02K01p0oK22l09N6j55J68j6J32O0o1j70K62
4511A65k18k8R9K23k56K2J11j79K08j88R7j76Q5J0K65p2j81o5K45m6N8P8j76m5
4535C6mO1j43K42k84K23j98Q1M6Jj42L93k20j26m9M36q4k79j66R8J80J11o7k49
4559a03J73k3M5j64j12J38N6P9K2L4r2l89J82J62M0j13Q3j96Q4R1k4K7J0r7J21
4584C4j97M28k67k06M20k74j07L7J08l38M01j52L58j28n77M10q3K10J4l47J90
$$ plain form
4605 -66 -56 196 -170 -52 -47 9 137 -109 14 169 -196 -75 37 35 -13 -31 -112 25 178 -8 -47 183 35 106
4629 106 -211 -114 -74 -33 319 213 -128 131 125 30 -137 16 -104 231 -172 -268 -228 28 154 66 -165 151 -90
4652 -90 167 131 -141 -27 49 94 -80 171 -27 25 19 285 -177 188 -67 -238 -104 42 -121 79 -54 -26 89
$$ packed form
4605f6J0K52l66J18NN6J28k46J23J55l65J21J12km8j8q1J37J53j86l9K30j48P1
4629A06l17R7M0M1L52j06l41K59or5j67J53j20L35m03r6M0K56J26q8k31L16k41
4652i0K57l6k72J14P6M5j74K51j98N2oK66m62L65k55j71J34J46j63K00j33K8J15
$$ [...]
8191B24
##END NTUPLES=NMR FID
##END=
