##TITLE=1H_DE-106_7_8_oil_TFA2
 200.13MHz, CDCl3,
 8 sc
 
 1.9.2025
##JCAMPDX= 6.0         $$ Bruker NMR JCAMP-DX V2.0
##DATA TYPE= NMR FID
##DATA CLASS= NTUPLES
##ORIGIN= UXNMR, Bruker Analytische Messtechnik GmbH
##OWNER= pz
$$ XWIN-NMR		Version 3.5
$$ Mon Sep  1 14:09:06 2025 Russian Standard Time (UT+4h)  she@DPX200
##.OBSERVE FREQUENCY= 200.1313
##.OBSERVE NUCLEUS= ^1H
##.DELAY= (6, 6)
##.ACQUISITION MODE= SIMULTANEOUS
##.ACQUISITION SCHEME= undefined
##.AVERAGES= 8
##.DIGITISER RES= 18
##SPECTROMETER/DATA SYSTEM= spect
##.PULSE SEQUENCE= zg30
##.SOLVENT NAME= CDCl3
##.SHIFT REFERENCE= (INTERNAL, CDCl3, 0, 14.3821)
##AUDIT TRAIL= $$ (NUMBER, WHEN, WHO, WHERE, WHAT)
$$ ##TITLE= Audit trail, XWIN-NMR		Version 3.5
$$ ##JCAMPDX= 5.01
$$ ##ORIGIN= Bruker BioSpin GmbH
$$ ##OWNER= she
$$ F:/spectra/data/she/nmr/H-C/1/audita.txt
$$ ##AUDIT TRAIL=  $$ (NUMBER, WHEN, WHO, WHERE, WHAT)
(   1,<2025-09-01 14:07:39.87 +0400>,<she>,<DPX200>,
      <created by zg, POWCHK disabled, PULCHK disabled
       configuration hash MD5:
       00 E9 B6 7A A2 85 ED C7 34 08 36 98 17 FE 4E 26
       data hash MD5: 16K
       ED 32 18 B7 52 89 BC 82 95 D1 6A 4B 9A EE 57 A4>)
$$ ##END=
$$ 
$$ hash MD5
$$ 8D D3 47 0D 2F 5D 6E 5B 92 CA 4C 0B A8 73 28 2C
##$RELAX= 
##$RELAX= 
##$RELAX= 
##$RELAX= 
##$RELAX= 
##$RELAX= 
$$ Bruker specific parameters
$$ --------------------------
##$DU= <F:/spectra>
##$EXPNO= 1
##$NAME= <H-C>
##$PROCNO= 1
##$TYPE= <nmr>
##$USER= <she>
##$AMP= (0..31)
100 100 100 100 100 100 100 100 100 100 100 100 100 100 100 100 100 100 
100 100 100 100 100 100 100 100 100 100 100 100 100 100 
##$AQSEQ= 0
##$AQ_mod= 1
##$AUNM= <au_zg>
##$AUTOPOS= <>
##$BF1= 200.13
##$BF2= 200.13
##$BF3= 200.13
##$BF4= 200.13
##$BF5= 200.13
##$BF6= 200.13
##$BF7= 200.13
##$BF8= 200.13
##$BYTORDA= 1
##$CFDGTYP= 0
##$CFRGTYP= 5
##$CHEMSTR= <none>
##$CNST= (0..31)
1 1 145 1 1 1 1 1 1 1 1 1 1 1 1 1 1 1 1 1 1 1 1 1 1 1 1 1 1 1 1 1 
##$CPDPRG= <>
##$CPDPRG1= <>
##$CPDPRG2= <>
##$CPDPRG3= <>
##$CPDPRG4= <mlev>
##$CPDPRG5= <mlev>
##$CPDPRG6= <mlev>
##$CPDPRG7= <mlev>
##$CPDPRG8= <mlev>
##$CPDPRGB= <>
##$CPDPRGT= <>
##$D= (0..31)
0 0.7 0 0 0 0 0 0 0 0 0 0.03 0 0 0 0 0 0 0 0 0 0 0 0 0 0 0 0 0 0 0 0 
##$DATE= 1756721259
##$DBL= (0..7)
120 120 120 120 120 120 120 120 
##$DBP= (0..7)
150 150 150 150 150 150 150 150 
##$DBP07= 0
##$DBPNAM0= <>
##$DBPNAM1= <>
##$DBPNAM2= <>
##$DBPNAM3= <>
##$DBPNAM4= <>
##$DBPNAM5= <>
##$DBPNAM6= <>
##$DBPNAM7= <>
##$DBPOAL= (0..7)
0.5 0.5 0.5 0.5 0.5 0.5 0.5 0.5 
##$DBPOFFS= (0..7)
0 0 0 0 0 0 0 0 
##$DE= 6
##$DECBNUC= <off>
##$DECIM= 32
##$DECNUC= <off>
##$DECSTAT= 4
##$DIGMOD= 1
##$DIGTYP= 9
##$DL= (0..7)
0 120 120 120 120 120 120 120 
##$DP= (0..7)
150 150 150 150 150 150 150 150 
##$DP07= 0
##$DPNAME0= <>
##$DPNAME1= <>
##$DPNAME2= <>
##$DPNAME3= <>
##$DPNAME4= <>
##$DPNAME5= <>
##$DPNAME6= <>
##$DPNAME7= <>
##$DPOAL= (0..7)
0.5 0.5 0.5 0.5 0.5 0.5 0.5 0.5 
##$DPOFFS= (0..7)
0 0 0 0 0 0 0 0 
##$DQDMODE= 0
##$DR= 18
##$DS= 0
$$ [...]
##$SUBNAM0= <"">
##$SUBNAM1= <"">
##$SUBNAM2= <"">
##$SUBNAM3= <"">
##$SUBNAM4= <"">
##$SUBNAM5= <"">
##$SUBNAM6= <"">
##$SUBNAM7= <"">
##$SUBNAM8= <"">
##$SUBNAM9= <"">
##$SW= 18.0517328524113
##$SWIBOX= (0..15)
0 0 2 0 0 0 0 0 0 0 0 0 0 0 0 0 
##$SW_h= 3612.71676300578
##$TD= 16384
##$TD0= 1
##$TE= 0
##$TE2= 300
##$TE3= 300
##$TEG= 300
##$TL= (0..7)
0 120 120 120 120 120 120 120 
##$TP= (0..7)
150 150 150 150 150 150 150 150 
##$TP07= 0
##$TPNAME0= <>
##$TPNAME1= <>
##$TPNAME2= <>
##$TPNAME3= <>
##$TPNAME4= <>
##$TPNAME5= <>
##$TPNAME6= <>
##$TPNAME7= <>
##$TPOAL= (0..7)
0.5 0.5 0.5 0.5 0.5 0.5 0.5 0.5 
##$TPOFFS= (0..7)
0 0 0 0 0 0 0 0 
##$TUNHIN= 0
##$TUNHOUT= 0
##$TUNXOUT= 0
##$USERA1= <user>
##$USERA2= <user>
##$USERA3= <user>
##$USERA4= <user>
##$USERA5= <user>
##$V9= 5
##$VALIST= <valist>
##$VCLIST= <CCCCCCCCCCCCCCC>
##$VD= 0
##$VDLIST= <DDDDDDDDDDDDDDD>
##$VPLIST= <PPPPPPPPPPPPPPP>
##$VTLIST= <TTTTTTTTTTTTTTT>
##$WBST= 1024
##$WBSW= 4
##$XGAIN= (0..3)
0 0 0 0 
##$XL= 0
##$YL= 0
##$YMAX_a= 143623
##$YMIN_a= -185184
##$ZGOPTNS= <>
##$ZL1= 120
##$ZL2= 120
##$ZL3= 120
##$ZL4= 120
##$ABSF1= 10
##$ABSF2= 0
##$ABSG= 5
##$ABSL= 3
##$ALPHA= 0
##$AQORDER= 0
##$ASSFAC= 0
##$ASSFACI= 0
##$ASSFACX= 0
##$ASSWID= 0
##$AUNMP= <proc_1d>
##$AZFE= 0.1
##$AZFW= 0.1
##$BCFW= 1
##$BC_mod= 2
##$BYTORDP= 1
##$COROFFS= 0
##$CY= -3
##$DATMOD= 1
##$DC= 2
##$DFILT= <>
##$DTYPP= 0
##$F1P= 0
##$F2P= 0
##$FCOR= 0.5
##$FTSIZE= 0
##$FT_mod= 4
##$GAMMA= 1
##$GB= 0.15
##$INTBC= 1
##$INTSCL= 1
##$ISEN= 128
##$LB= 0.25
##$LEV0= 0
##$LPBIN= 0
##$MAXI= 10000
##$MC2= 0
##$MEAN= 0
##$ME_mod= 0
##$MI= 1.114404
##$NCOEF= 0
##$NC_proc= 0
##$NLEV= 6
##$NOISF1= 3.799351
##$NOISF2= 2.8
##$NSP= 1
##$NTH_PI= 0
##$NZP= 0
##$OFFSET= 14.38212
##$PC= 1
##$PHC0= -1553.28
##$PHC1= 0.5922792
##$PH_mod= 1
##$PKNL= yes
##$PPARMOD= 0
##$PSCAL= 0
##$PSIGN= 0
##$REVERSE= no
##$SF= 200.129724274929
##$SI= 16384
##$SIGF1= 3
##$SIGF2= 2
##$SINO= 400
##$SIOLD= 16384
##$SREGLST= <1H.CDCl3>
##$SSB= 0
##$STSI= 0
##$STSR= 0
##$SW_p= 3205.1282051282
##$SYMM= 0
##$S_DEV= 0
##$TDeff= 0
##$TDoff= 0
##$TI= <>
##$TILT= no
##$TM1= 0
##$TM2= 0
##$TOPLEV= 0
##$USERP1= <user>
##$USERP2= <user>
##$USERP3= <user>
##$USERP4= <user>
##$USERP5= <user>
##$WDW= 1
##$XDIM= 8192
##$YMAX_p= 0
##$YMIN_p= 0
$$ End of Bruker specific parameters
$$ ---------------------------------
##NTUPLES= NMR FID
##VAR_NAME=  TIME,          FID/REAL,        FID/IMAG
##SYMBOL=    X,             R,               I
##VAR_TYPE=  INDEPENDENT,   DEPENDENT,       DEPENDENT
##VAR_FORM=  AFFN,          ASDF,            ASDF
##VAR_DIM=   8192,          8192,            8192
##UNITS=     SECONDS,       ARBITRARY UNITS, ARBITRARY UNITS
##FACTOR=    0.0002768,     1,               1
##FIRST=     0,             0,               0
##LAST=      2.2672688,     0,               0
##MIN=       0,             -185184,         0
##MAX=       2.2672688,     143623,          0
$$ Real data points
##PAGE= N=1
##DATA TABLE= (X++(R..R)), XYDATA
0@%%%%%%%%%%%%%%Qj6J6j6J6j9K7l2L6m4M9n7P1q0Q9j04J20j36J53j74J97k22
36a18K50k80L13l49L88m31M79n29N84o46P15p89Q69r57J053j161J279j409J558
55H19j726J916k136K394k698L062l512M080m823N845p337R727j4153K4964j00506
70h4084j01100K69819K8543j81816N6507J55754j09109r9545Q2287l241j09253
81i5238O0249R3993p7809m6991R4054m695p3613O0868P8172n2440m3076J8733
93A2207j1611k3817J4394J160j3181P254K923j2848J4497K5735l491Q614K9181
106E1017k5395m3332J7613J508m6451K0777N1789m0308l9097N0550J9855m0221
118b1695K1613N7948k0864m2152K4899Q119n4332p507M2910j4472l2717K4558
$$ y = [0, 0, 0, 0, 0, 0, 0, 0, 0, 0, 0, 0, 0, 0, 0, 8, -8, 8, -8, 8, -11, 16, -16, 20, -24, 25, -32, 39, -41, 48, -56, 64, -72, 81, -93, 104, -118, 132, -148, 165, -184, 204, -227, 252, -277, 307, -339, 376, -413, 456, -501, 552, -609, 670, -739, 819, -907, 1009, -1127, 1267, -1431, 1631, -1881, 2199, -2624, 3221, -4116, 5611, -8542, 16422, -84084, -185184, 84635, 113178, -68638, -12131, 143623, 34514, -65031, 17256, 14015, -95238, -34989, 59004, -18805, -65796, 28258, 23563, -50050, 10818, 88990, 36550, -6526, 12207, 596, -23221, -8827, -7667, -20848, -13594, -10671, -23519, -9022, 16713, 13222, 21836, 51017, 25622, -17710, -97, 1411, -45040, -24263, 27526, -12782, -51879, -1329, 18526, -21695, -82, 57866, 37002, -5150, 19749, 27868, -26464, -33971, 8939, -5533, -38250, -13692]
130a3692J2940k4285J2885L9089N649j1428K354k182j8463j4680M047M997j0554
143a3323q022L850O95l998O955K4454J9181q286l854J2287j6066k8693J3069J3252
157A1501k7193r605J9318r524j9216K2798K8290o836l282K3613l532l1063L188
170a543J7381j8594j2951J6246o857k1423Q872J6418m68O067J5751J750j1084
183I565m417J573m570m647J623l405n906k387m533J901J6252O018j665J0542R27
198A6871j5522j587P442p173o770O770p58j4765k060J4626L237m193J4292J0847
212B1257j5019p556R316n480j0010P328K829j1713n664O167K774r84R647J3365
226A6257k780q806K668j441r732N21N101m019o325k258Q6J341K775J0256J0081
$$ y = [-13692, -752, -25037, -12152, 26937, 32586, 21158, 23512, 21330, 2867, -11813, -7766, -2769, -13323, -21345, -17495, -16800, -20798, -13843, 10611, 29792, 21506, 17652, 29939, 13873, -14820, -1751, 11501, -15692, -25297, -5979, -15503, -34719, -11921, 16369, 9533, 6251, 29864, 26332, -4731, -1543, 15838, -2756, -15707, 539, -6318, -27741, -18869, -2451, -2919, 3148, 18899, 20649, 9565, 5148, 6721, 2151, -2496, -873, -4278, -10184, -12571, -17104, -15203, 1049, 7067, 5402, 15944, 16871, 1349, -238, 7204, 31, -6739, 31, -727, -15492, -17552, -2926, 311, -3882, 10410, 21257, 6238, -1318, 7998, 2518, -7492, -164, 2665, -9048, -14712, -8545, -5771, -6755, 2892, 16257, 13477, 4671, 7339, 5898, -3834, -3313, 1788, -2231, -8556, -10814, -10728, -9387, -6612, 3644, 13725]
241A3725k062k896K417n171q545J600K800m915o325k058J162j767K199J2688Q340
256A1192k512L028J719q491m677L627j386n599l625j507l752l822M151J1563M917
271D826J491N867K79o604j954J167j482k968l728k493m086n691L154R317K587
286c18K552P536Q07n525j005K418l66l799k707q89o454o060M309M276J27O165
302A067O609k572k270K348M16q91p16k65k529o881l097J426P79K102N712J678
318B916p99O33j64mQ22j19N02j719n376k306J347l12J472M263J492o08r05o00
336E35O07L00J85K128k501m389L13o35j743L815M275k19n57l05r06j012j20J412
354A183R92k559j447j85k469M9M568K225L66N77p84j238j401r41J811Q36k711
$$ y = [13725, 11663, 8767, 11184, 6013, -2532, -932, 1868, -3047, -9372, -11430, -10268, -12035, -9836, 2852, 11192, 8680, 11708, 13427, 4936, 259, 3886, 2500, -3099, -6724, -8231, -11983, -15805, -11654, -91, 4826, 6317, 12184, 12463, 5859, 3905, 5072, 3590, 622, -3106, -5599, -9685, -15376, -12222, -2905, -318, 2234, 9770, 10577, 5052, 4047, 6465, 6099, 2300, -407, -1296, -7750, -13810, -9501, -5225, -5098, 1067, 7676, 5104, 2834, 5182, 5598, 4707, 3991, 3726, 1197, -5684, -8781, -7355, -6576, -4474, 1238, 2916, 2117, 2750, 2586, 2582, 3404, 3285, 3787, 2068, -3308, -5614, -4267, -4579, -3107, 1156, 2648, 2040, 1135, 535, 1142, 1442, 1627, 3755, 1254, -3135, -2822, -3457, -5200, -1385, 2890, 2671, 2114, 1809, 903, -109, -229, 1183, 2175, -384, -1831, -2016, -4485, -4436, 132, 2357, 2723, 3300, 2516, 1278, -123, -1064, 747, 1583, -1128]
371a128j020j79k127K67L276K632J345L37Q9p09k822o86K321p88l197Q16q86k897
389e356M24L640K316O96J419J357j289k956J211R55k469j216J098l443k132J183
405d562K134J566K000K001P01q84j424N13k03q88k47q75k712j554J78Q53J850
422a553J548J760J725j231j086J457k68j267M97q91k521j802m65O85J320J255
438h37K411R29j834O91J241j491K08J379j559k286j130r06k79Q04K166J422O0
455I89j61O31n87m21J418M44j275j358j177q42l20M97J490J904n37l51Q72k74
473I42r56J290P48r47q95j090m30j514N62K611M88r71J453O50k208L5K184o33
491A319r19K74q77j800q68J375J548n55J216Q30q50q93J342q1o99Q84l63j594
$$ y = [-1128, -2148, -2327, -4454, -4187, -911, 1721, 3066, 3403, 3492, 2783, -39, -725, 1596, 808, -2389, -1573, -2459, -5356, -4932, -1292, 1024, 1720, 3139, 4496, 3207, 251, 1462, 2417, -52, -1268, -170, -3613, -5745, -4562, -2428, -862, 1138, 3139, 3840, 2956, 1532, 2045, 1842, 954, 707, -168, -2880, -4434, -4256, -3403, -1553, -5, 1755, 3480, 2249, 1163, 2620, 2352, 1085, 1582, 691, -1830, -3632, -4097, -3412, -2092, -837, 1574, 2503, 669, 1360, 2601, 1110, 1318, 2697, 1138, -1148, -2278, -3184, -3463, -2659, -493, 929, 989, 828, 1459, 872, 451, 1869, 2313, 1038, -320, -1497, -2339, -2659, -2162, -672, 1232, 695, 344, 1216, 942, -14, 1276, 2024, 1077, 182, -908, -1338, -2852, -2290, 321, 809, -162, 1291, 1941, -267, -232, 1952, 1319, 400, 674, -203, -2003, -2871, -1496, 52, -503, 713, 1543, 693, -200, 1142, 1061, 362, 1246, 883, -711]
509g11o64l75R1J082N33Q38L56o36n02K07O46K67n6n55K41j594j354R82Q60l18
529f62Q22R43o30r03R09J05k74N98L37p44j517n25R34p70O91J917r18n30N05m25
549a37m16J016N43k88p91m52j81m44j3J465P53o78L22j09j191K71L12N36Jj81
569C38r86l72J38k08J243O71r6j09j35m18k17l2M93M06r74l30J22n87J42R28O19
590F36K62r4j96n73n42N17K01j65m77J34k59r19O32J062P1K92N94l35n97j88L60
611D16J19l10m31K13j039o80J131M58j44Q39M65m26l62j27K77J18k19o0p26k24
631g12k93J4K4Q13P43l29J26M00n58K41L17k52k60k4p82o14J86L03L85K98M10
652D36j68J26n62N27r8J40N37n89r77J12J84l65K32N76N1l5O7l14j11K36O37M49
$$ y = [-711, -1375, -1750, -1659, -577, -44, 794, 1150, 514, 12, 219, 865, 1132, 1076, 521, 762, -832, -2186, -1204, -344, -662, 160, 1103, 473, -430, 479, 584, 310, 908, 1245, 501, -1016, -1541, -607, -1377, -686, 1231, 313, -217, 288, -137, -553, 463, 1006, 718, -73, -525, -706, -1150, -1163, 302, 1055, 377, 699, 590, -601, -330, -18, 518, 519, 338, -648, -1020, -882, -1090, 153, 824, 728, 619, 484, 66, -151, -183, 310, 716, -258, -588, -466, -1053, -911, 17, 636, 898, 804, 608, 35, -507, 10, 211, 46, -431, -297, -556, -1475, -843, 219, 290, 582, 1176, 841, 244, 56, 416, 535, 225, -206, 7, -1032, -1712, -581, -123, -267, 572, 1037, 611, 249, 122, 399, 517, 298, 238, -488, -712, -1005, -991, -967, -154, 589, 260, 386, 786, 228, 469, 786, 534, 274, 250, -532, -1146, -960, -657, -272, 26, 436, 268, 394, -168, 359, 261, 401, 938, 349, -628, -516, -332, -697, -465, 111, 162, 127, 194, -120, -231, 5, 642, 1091]
674A091j250K82l03p48J44M91M94n7o8K93m13j73N12J66ro2J20p63j40l3M53j09
696h2K95m4j23j28k33L3M32K86j58k61pn10j31O05M1J46P3pl57p7J69p0J35J61
720A88J43m35p3K25l54M10L43j66K94l17l71j58L92J49Om03j01k5J99l02L76L00
742C20J75j24k50o3j38L9J2M28o38m4p9o0K88K87QK82j08l34j57L05l34K29O1
765A05j16l01K41l59R7K32M44l6j66J47l7m20j19J89K49k4o1j18l57K10K36K74
787C10j96J7j76M7q4k10K54M8J37q2l25J80pl5K53L19j54j6j98j87k07O2K23l23
811c50M99j03l68P8J7P89k78j36J97j38l27Q8K0k02M17o7l12jo1j42M52J58J16
834C46j07k75J73k06j90L02j35P0l7K2k65l88R32n1Q3J74n21L7k7K17k52N2j64
$$ y = [1091, -159, 123, -180, -928, -784, -293, 201, 144, 76, 369, -44, -217, 295, 461, 452, 390, 510, -253, -393, -426, 27, -82, 213, 169, 46, -82, -315, -282, 150, 436, 278, 17, 10, -500, -631, -26, 15, 161, 234, 227, -130, -207, -38, -108, 27, 188, 331, -104, -177, 48, -306, 104, 447, 281, 575, 258, -113, -271, 121, 270, 276, -127, -228, -253, -54, -356, 20, 320, 495, 371, 121, 58, -80, -41, -29, 399, -239, -283, -362, -422, -134, 153, 161, 443, 335, 1, -156, 149, -185, 44, 105, -11, -312, -71, -430, -333, -101, 343, 307, 141, 288, 251, -169, -288, -99, 150, 126, 65, -53, -410, -200, 36, 310, 114, 131, -45, 2, -82, -292, -38, 10, 147, 65, -260, -80, -87, -122, 131, 450, 296, 280, 82, -105, -312, -250, -27, -350, 149, 46, -322, -244, -227, 562, 284, 148, 345, 207, -120, -32, -12, -214, 203, 136, -176, -177, -238, -380, 72, 230, 346, 239, -36, 137, -69, -259, 43, -92, -22, -59, -37, -302, -690, 242, 191, 274, 448, -73, -36, -63, 154, -98, -46, -210]
857b10K02k70j9K36J65L3r7Q7K2Pl03q2J83M10m39K5rm59J98o6M80q7J56r4j66
882i7q4J24J26N5L4J8j86j39Pj8L13P9m3j25k81K41l3k86L92K47k47j85J34j81
906a35K43m24M10k64K3K43k93M0M06l71M19l35P7Q9n3o1r0L8j48N24k21l19R1
929a11l3M8j0J9J0K68m27M37k16J68K58n17j9K01k50l75O55k63L0J59r9k41N34
952B26n5m24M63Q5O4l40k37j01K06n8L31l38L0N9J28QK22K31l32l38K87k47k82
975d12L71j34M2Q5Qn4L17o8L06k73Q6j18P9m25K33l7k38L98O6p27L20J02J05K60
999B92j71K51q4j87M4j8l05n4L60m30J94q5P2j19M92j12j5K99l48J07j36k21K10
1022C6j67j63O41p70J95J37j54K79J82O9p4l9k8n08M43K44n98L0n0K79l93K77
$$ y = [-210, -8, -278, -297, -61, 104, 137, 40, 127, 149, 156, -147, -229, -46, 364, -75, -50, -59, -518, -320, -386, 94, 7, 163, 69, -97, -181, -57, 69, 124, 158, 176, -10, -149, -142, -160, 153, 232, 189, 64, -217, 24, -9, -295, 97, 344, 97, -88, 46, -135, 108, -316, 94, -170, -147, 96, -197, -157, 249, -122, 297, -38, 39, 128, 75, 14, -76, -38, -186, 338, 117, -202, -111, -144, -96, -106, -87, -77, 191, -236, 201, -15, 153, 411, -106, -125, 76, -174, -549, 106, -157, -127, 32, -67, -308, 226, 171, -253, 210, 295, 359, 19, -218, -319, -113, -171, 160, -178, -148, -89, 39, 47, 269, 500, 168, -170, 117, -130, -412, -41, -175, -133, -48, -40, -94, 223, 155, 461, 188, 274, 156, 235, -190, 43, 6, -232, 166, 232, -495, -175, -73, 32, 292, 121, 372, 288, 101, 145, 127, -178, -232, 128, -302, -108, -193, -121, -240, 252, 140, 125, 424, 76, 183, 47, -174, 36, -131, -294, 347, -423, -228, -91, -245, 34, 216, 285, 211, 172, 144, -364, 79, 323, -275, -245, -295, -16, -409, -132]
1044a32P9J93k50M76j73o54O18j70j14R4M23q21P2K11k39M81k6n6j87K84o1L2
1066H0o2k15K26m0%K25m90q4N07j18m09N22J81l66J17J6j98J25J44k50p3j9K44
1089F3l55J93J44K13n95J79K65k00r9O82k27j67O7N6l87J18K7N4o0k90L13m15
1111d21N9M50k43J31K05K19l63P5L8m7O7jk08j11m8l9P4j8J94n8J20J24p3m19
1135b93Q97k56n91J77J51l12M5O1Q8n38L12M37n6m34M47K66k93o2L37m44Q5J56
1157A80k91k60OJ55j06L37j11K10k4L36j30j21l94L93l54l03N43j67m18L10J54
1178e5n9o0L32l12N86j04j69Q5j65J47m23k23M84k40l74J26N96l85J1M67m00L4
1200a01R0K70k61r4O9q3j66P9q7P8Q3l7K57P3o3j7m8P2p7l5K67m63j4PL31m07
$$ y = [-132, -53, 140, -110, 366, 193, -461, 157, -13, -127, -33, 390, -431, -359, -148, -387, 94, 68, 12, -175, 109, 48, 80, 18, -197, 29, -11, -11, 214, -276, -360, 147, 29, -380, 142, 323, -43, 74, 90, -108, 17, 161, -89, -162, -181, 63, -292, -99, 45, 258, -337, -158, 107, -93, -192, 490, 263, 96, 163, 219, -168, -50, -23, 31, -29, -319, -6, -421, -362, 88, -155, -24, 181, 400, 37, 112, 150, 103, 170, 169, -39, -150, -198, -237, -163, -181, 13, -45, 75, 199, 126, -293, 604, 348, -243, -66, 85, -227, -182, -121, -33, -571, -259, 178, 122, -312, 135, 401, 108, 46, 383, -61, 24, 180, -111, -371, -365, -210, -316, 21, -90, 120, 96, 432, 302, 181, -213, 180, -174, -477, 66, -101, -519, -209, -55, -114, -174, 158, -154, 432, 328, 159, 244, 79, 226, -197, -420, 64, -176, -550, -424, 172, -213, -202, 265, -135, -101, -11, 259, -2, -96, -27, -110, -276, -197, -284, -206, -123, -160, 97, 170, 107, 90, 42, 114, 37, 2, 269, -194, -208, -201, 130, -277]
1226b77K64L28k90J61j82K20O1k12P6K09m28p9L22l91j43O56m64M25k87J53l47
1247b25K07k1N3K36l49K96k92K22j94Rj66J46j64K03M13m83l3K89k56l5L82k94
1269e6q7P2pJ78j04j67K27rj77M36j44k95K29j12Q6R5L06n66Q1L69m15n1j01J55
1293e7j43j90M07l5k45L45L8k16K24J41l65R5M3j97Q4J71l9j36M8K7j17n1L47
1316A79k9l0j28J33j94k41M70j51l94K27J1j24J31K70o1q8J63K13j11l71K79J86
1338C40n97K63L2j67r1K25N7j12J89j71M01k3j21l70L92k84k64K94o1j89K47K46
1360B36k53j68j27N25n1k47L37p4j24L4j55j92j8Q1k67M69j68J33N5J4L00j4l73
1383d7l3L83n16K45N2j09q4K38k64J91k69K36J37j07R6l3J29l74P1l0J24P8k24
$$ y = [-277, -13, 315, 25, 186, 4, 224, 285, 73, 149, 358, -70, -149, 173, -218, -361, 295, -169, 256, -31, 122, -225, -18, -39, 14, 250, -99, 197, -95, 127, -67, -58, -224, -78, -242, -39, 374, -109, -142, 147, -109, -144, 238, -56, -143, -71, -78, 100, -4, -171, 56, 47, -130, 306, 162, -133, 96, -16, 70, 165, 471, -95, -14, 355, -60, -111, -212, -57, -200, -390, 17, -18, -263, 82, 120, -96, 128, 269, -96, -1, 42, -155, -71, 100, 61, -75, -27, 0, -117, -168, 179, 150, 120, -8, 125, -69, -310, 160, 9, -385, -158, -147, -271, -140, 130, 69, -19, 144, 357, 246, -125, 154, 340, -257, 6, 38, -129, -220, 5, 62, -50, 139, -32, 369, 346, 225, -145, 247, -37, -301, -7, -68, -257, -10, 236, -17, -185, -312, 213, 162, -85, 252, 178, 54, 88, -67, -259, -277, -196, -463, 6, -162, -29, 26, 40, 340, 326, -47, -80, 303, -213, 32, 84, -25, -109, 129, -135, 56, -213, 23, 160, 53, 149, 116, 245, -129, -58, -88, 36, 114, -110]
1406a10j18J93r6j75M79L5p9j56J66k81J71J02j25J11j16l37M56m11K80K78n03
1427b36M54j11j36n4J90j1o1Q2k98K50m3j17Q1n1L6O8m1j05J99j41m8K65o4J82
1451B90k87J9k34L07k66L48m08L64j02n4r8j99K15Q0L9rJ8p4J01J5o8L7k39j90
1475c95J35M32m3Jqj99L69m0p4j07k26K91J37k59J01k88j16K43l1J21r1M3K85
1498B81l02j64J46L40j84j91J55l50L76j47P3M7K47m51K01j07J84m9M2J74k92
1519B9J29j57J75l79j91L16J0j19J29J40j33j6K72k04K72l77N9K89m03J55j14
1540a18K7j67J78p4L11j70KJ52mJ05k65n4j35L28k59J43k15K48j87J67j59O5M10
1563C29k76j6K65n72K72q8J25j78Q9O6r4k04k2J98m2K28L2K96j81k48K19J35k45
$$ y = [-110, -228, -35, -131, -306, 173, 208, 129, -27, 139, -142, 29, 131, 6, 117, 1, -336, 120, -291, -11, 267, -236, 218, 107, -29, -83, 107, 96, 35, 117, -181, 69, 26, -91, -10, -61, -25, 43, 2, -103, 96, -45, -93, 172, 108, 290, 3, 22, -212, 95, -171, 177, -231, 133, 31, -23, -121, -320, -105, -25, 14, 5, 23, -51, 50, 65, -3, 34, -205, -395, -260, 172, 129, 130, 122, -77, 292, 252, 178, 71, -155, 136, 273, 14, 115, -173, -289, -46, -77, 44, -47, -4, 281, -21, -185, -39, 301, 117, -74, 81, -269, 107, -40, 33, 80, 327, -124, 77, -30, 154, 105, 147, 321, 29, 158, 1, 176, -203, -394, -78, -68, -187, -58, 82, -51, -67, 205, 1, 273, -104, -45, 244, -159, -4, -118, -91, -258, -80, -154, 157, -13, -11, 141, 137, 242, -23, -77, -212, 116, -143, 0, -215, 33, -154, 13, -146, -81, 329, 53, 37, 302, -270, 2, -86, 39, -139, -50, 16, -78, -282, -304, -106, -148, 80, 112, 408, 227, -21, 198, 333, 88]
1586H8l60Q2J85j45J11P2o7k50M98oL1j78j17R8oQ3K4k73J92J57j47L2j22J66
1610A48r2j7m7p7L79n28M06j95L3K8q5j55r0J83KO1jJ14O6O6p1r7j37p7K19j09
1636g3j96J54L28k07R5r5j41L16m20J07QL09j41J58p5k07K31k82LJ36J16k01p2
1659a49P0o0R7K32k84L07j66o1q9L08k27J48m74K67q0K57O3r9l31M97j19r9KK55
1683B65j42k54K97j28oj72J92q5j64J82J97k45J35j01L3M4j07P3n9J31K42n35
1705b07L06Q4j55K9k80o2K95j36Q4L07O6l97J42l7N0K9k6j52P2j96R3J97K32l22
1729A6J47%k12O02o50K60k44J07QK31k79j70j5J98J16lp1J57l84J11J30j51K21
1752A25k34m35N75J22k43j39K01j63M42j43M3j08k1J51j08k9o4N3N3l18J18O4
$$ y = [88, -272, -190, -5, -150, -39, 33, -34, -284, 214, 208, 239, 61, -56, 42, 36, 119, 143, -130, 62, 219, 72, 104, -18, 148, 56, 39, -8, -85, 294, -234, 172, -23, 10, 38, -47, -202, -292, -109, -107, -46, -47, 67, 133, 199, 128, 31, -106, -183, 36, -73, -269, -115, 213, 6, 101, 6, -135, 181, -239, -132, -124, 185, 44, 202, 127, -80, 151, -131, -128, 8, 124, -77, -149, -79, -139, -42, 190, -94, 213, 47, -14, -103, 205, -22, 126, -348, -81, -161, 96, 159, 60, -271, 226, 107, 8, 10, 265, 123, -131, 166, 38, 32, -140, 52, -33, -197, -15, 182, -63, 72, -29, 4, 48, -59, 14, -45, 86, 328, -207, 99, 183, 28, 57, -223, -285, 10, -126, -42, 265, 331, -66, 76, 39, 89, 118, 92, -60, 12, -184, -91, 106, 338, 16, 163, 163, -49, 553, -97, 163, -81, 26, 34, 265, -14, -184, -199, -1, 115, 112, 41, 198, -186, -75, 55, -96, 125, -109, -544, 31, 153, -90, -229, -28, -191, 251, 108, 151, 43, 22, 173, 65, 36, -28, 25, 78, -240, -122, -58]
1774e8J05R5j10j8m9J22m5J34j22k13P0K37m31Q3L23m89Q7L88j90Q8J24O3m28
1797b34L44j38o9J18Lj92J11p7J58jk99K95J65k11J11r9j35Pj42K53K00m4J37
1820B61j99l07M40k18K4R3j4l24O87o09KJ56N3Jj73p8K87p0j61J57j32K51j47
1843b0Q7l3K44j56j80J16P3m87O32k42o1J8o3k4O1k6K35l07L7K26J51n01J00J7
1867a03J22J15l36K48k16J76l89K07P3j03L20j85K32j50j84K88J7n5N9j64j0j05
1889a43M5J11J64J85l11j52NJ85l18L52j72j25K06J21k41Q1j96L95o8m36J84K62
1911A34j15j21L08j93r4K86m07M42k40l0L2K6k19J29j15oM46l62l8J14L15l78
1933h6M68k85k19K32k48p9J90l14K60j67J79K63J09k38J14j80n6K11j72L5j29
$$ y = [-58, 47, 142, 32, 14, -35, 87, 42, 176, 54, -159, -89, 148, -283, -200, 123, -366, -279, 109, -81, 7, 131, 194, -234, 110, -28, -97, 21, 24, -168, -57, -134, 24, 23, -276, 19, 184, -27, 84, -15, -150, -143, -285, -32, 168, 124, 261, 62, -245, 195, -23, 1, 94, 80, -244, 443, -166, -164, -8, 45, 46, -127, -205, 82, 12, -149, 8, -124, 127, -20, 67, 34, 278, 122, -58, 58, 131, -356, 276, 34, -27, -9, -72, -96, -35, -61, 174, -133, -96, 130, 281, -220, -120, -103, 19, 134, -202, 46, -170, 6, -383, -176, -103, -206, 114, -71, 161, 11, -173, 115, 132, 77, 136, -28, -38, -143, -98, 13, 177, 362, 51, -101, -96, 89, -229, 123, -49, -174, 32, 153, -88, -7, -203, 192, 124, -312, -128, 134, 19, -102, 206, 13, -81, 205, -202, 240, 0, -30, 2, 28, -191, -62, -177, -183, 263, -99, -137, -23, 292, -86, 382, 97, -122, 110, -138, -217, -27, -341, -81, -248, -69, 194, 303, 65, 179, -1, -57, 154, -18, 17, -112]
1954a12J4j07R4l7K84r3j36N0P5K11k70k2k0n3n6J48k13L92k14L5p9J07M7j89
1978a44J46n8p9k6J41k52M08j58k31R0k4K71k79J15P0R3j60j70K38k42K80k13
2000a84j80J84J70J03q0o5K61k80K38l50J37K06K11k57l48L84J3J32j40j12j72
2021a29K22j99q1J8J1J20K4J13j57k09J52K69j52o8Q0k24K40M5J40k57n5k6OJ41
2045B4M6L6j6r6j41J55j54M9K11N5J05m25Q5J36j85J8J79k28N67m09k04J50K83
2068B41o2k62K68j37nJ51l53L43l11K94n16J32M14m23jm9J14J29j69K19l9K56
2090B34k27k55K07J27Ll78L68mO7L7k07Qj18Q7r6K11j77N9j63m7K02O8J08q1j85
2115a52K36K3j08J98m50K85j56J42K0m11K98K58m44j2M17m5N4j19k41K82j01K1
$$ y = [-112, -98, -205, -111, -148, 136, 43, -93, -43, 32, 243, -27, -49, -69, -122, -178, -30, -243, 149, -65, -30, -109, -2, 45, -144, 2, -56, -135, -161, -20, -272, 136, -22, -253, -163, -187, 84, -195, -80, -10, 83, -77, -247, -9, -251, 29, -184, -364, -180, -10, 93, 13, -52, 209, -71, 167, -183, -46, 160, 371, 114, -234, 150, 163, 295, 155, 43, -129, 93, -106, -187, -169, -158, -38, -14, 99, -58, -267, -115, 154, 2, -66, 14, -210, 30, 75, 215, -42, -97, -123, -117, 24, 70, 106, 90, -6, -147, 8, -146, -97, 114, 169, 274, -151, -66, 70, -115, -97, 82, -146, 421, 12, -192, -42, 241, 179, -83, 185, 48, 43, 194, -159, 184, -127, 167, -349, -217, 197, -226, -227, -276, -162, -33, -202, 17, -22, 234, 7, -248, -41, 86, 89, -289, 79, 75, 142, 179, -28, -20, -138, -51, -147, 64, -113, -54, -217, -264, -62, 6, 114, 33, -152, 84, 107, -1, 197, -253, 32, -124, 18, 38, -373, -75, 183, -261, -273, 144, 99, 153, 34, -207, 75, -26, -5]
2137eO1Q4ml2q0j16k28K26K06k9q0k33K33O1j27p5K22l45K50j86J80P1n4L6jk15
2163a80J89n5j02O1K20l0l85K49kK9k00M0L31j81P0j14J63N9j69J19k85J3J73
2186A3r0j46L52j05r3K65k18o3J97J32k16k9j44o1M5K15j43k29K58J34k93J37
2208h2K49j83l5O8J34m7P7k06K88l70J49j56O3Q1k4M8j91R6J0j26L40l2j97Q0
2232C4J63l64J66m1mn9J06J23p0K84l63j94K52j22R8L18m03n8J83p2k7j35M98
2255C13n01Q0K73k11K8K38J98m05j39K66l4k28L82j94k99J30l3M69k90j81K10
2276G2k97L69N9j19R8j01j59NJ29j26J49n17O61k90L2Q6O3j87K40l33J46J36L00
2299D16m33k1L1J14r5j46K2K04p6J5J93k6k24O5m4O2o6R1k14J05J86k16m3P0r1
$$ y = [-5, 56, 140, 136, 104, 24, -92, -320, -94, 112, 83, 3, -230, 3, 64, -63, -138, 84, -261, -11, -197, -17, 54, 0, 36, 35, -180, 9, -46, -148, -87, 133, 103, -282, -33, -35, -6, -206, -166, 165, -16, 54, -60, 103, 162, -7, 112, -173, -160, 13, -77, -223, 129, 24, -69, 196, -22, -85, 112, 244, 28, -1, -145, -206, -161, 54, -89, -318, -60, 74, -219, -82, 167, -16, -51, 17, 151, 104, 181, -25, 263, -107, 42, -114, -51, 30, 6, 54, -137, -41, -31, -157, 183, 151, -46, 34, 197, -167, -1, -42, -46, -105, 1, 124, 54, 338, -25, -219, 33, -89, 9, 327, -76, -134, 49, -23, -50, -185, 313, -188, -108, 165, -46, -18, 220, 418, 13, -126, 140, 106, -122, 260, 66, -233, -103, -136, 333, 43, -138, 72, -225, 144, 203, 84, 182, 81, -78, -73, 56, -70, 79, -438, 223, -67, -35, 51, 114, -73, 167, -166, -20, 116, 416, -17, -38, -7, 107, 12, -134, -112, 92, 16, 31, 224, 198, -26, 39, -5, 57, -9, 82, -132, -27, 159, -57, -100, -30, -121]
2324a21o5J36r1L55k15K8k79K81J25N7j76K8P5k91j27K99j53K16L2j15JJ60j39
2347B1R5k49J21K02k3O5l32O6J09L46m19K32l14K17L7k82J21r7M9J28l04N19l10
2370bJ63l56J15p1L1j78L70k36j15L16L8J52m49J62K1P7Mk80L74n0j49l63K52
2393a74j4J83P2l55J93l9J78r2p5%J28Q6j24P1j52J35k0m1L29n6l20K60j08j61
2417i6J3m7L3J2K02o1k08L24l62J74k56K72p8K11m5k42m7K44j28j32R3K67Rk72
2441a20J56K44k67j01J31j65L74j64m0J22k29p7L01nk27j33K22n3l7j36K67o8
2463eJ91o0j81K5J31J0k25L93j57j55k52J44J57O2k01J84O0j35j00J44r6J21p7
2486b2k51K14j9k4L9j6o6Q1L48l86L5J28l9j67K25m0k51K48j61K55r1k57L37m9
$$ y = [-121, -186, -50, -141, 214, -1, 27, -252, 29, 154, 211, 35, 63, 138, -153, -280, 19, -134, 82, 114, -1, 0, 160, 21, 116, -133, -12, 190, 167, 232, -100, -34, 75, 421, 2, 234, -80, 137, 174, -108, 13, -84, -35, 93, -211, 308, -2, 161, -195, -80, -151, -120, -298, 72, -164, -279, 37, 75, 227, -222, -60, -39, 38, 42, -238, 136, 86, -63, -426, -174, -188, -5, 67, -288, -95, -134, 44, -48, -123, -123, 5, 91, -33, 38, -114, 21, 1, -40, 289, 233, -87, 173, 65, -96, -83, -130, -97, -85, 117, 56, -152, 172, -190, -16, -272, 0, -78, 133, 88, -154, -201, 43, -85, -217, -124, 143, 152, -120, 36, 280, 13, -88, 43, -122, 252, 88, 48, 170, -59, -136, 165, 160, -67, -200, 22, -31, -68, -204, 63, -5, 186, 126, -55, -30, 101, 111, -114, 279, 122, -33, -285, -141, 16, 78, -123, 61, 121, -14, -114, 30, -66, 55, -22, -273, -59, -78, -102, -63, -79, -145, -64, 284, -102, -67, 61, 22, -145, 80, 40, -211, 37, -124, 131, 40, -217, 120, 71]
2510G1n5N1p7R9n7j89J37l97L22J82p5J02m2k55j11L23J2J72k4j96n1J77k19j11
2534b11J53J22l3L5J4k05J81K7j28j06L60k71K03L9n7k44P4k4j27R3J30P5r4q5
2558g9k61M30j26K54j83M2M2l24K98k83NM63p3j67J24k84P8%n7L26l02Q5j9L4
2582B3q6R2J34l62M8K61n4k36K34j53L5J15q1J1L50m15K37l1r7k01K25q6R2j59
2606a04M9J67l23J67N86m78J4J03l06J84j55K15M7n9j23n1J33j56J66o7j20L4
2628g7m3K37l01o7K74j81J58j38J50j74O1L98n22J73K02k91m7M0r3K20J58k80
2650a43J88j18j24J06J1N7N7K17r7k16K7K31j87k4M5j78K98k61J88l96K17O1J11
2673G0l69K24J76j25M4k7J10l48K49K64l15k69M32jj57k4J28J76n28J51O0N1p6
$$ y = [71, 16, 67, -10, 89, 32, -157, -20, -417, -95, 87, 12, 114, 72, -183, -294, 29, 41, 213, 189, -7, -58, 119, -100, -211, -58, 64, 31, 66, 80, -125, 56, 83, -45, -151, 209, -62, 141, 180, 123, -121, -47, -71, -198, -105, 25, 100, 6, -79, -340, 90, -36, 218, 35, 77, 119, -205, 93, -190, -185, 278, 205, 38, 162, -122, -44, -44, -101, 225, -77, 8, -11, 23, -63, 29, 163, -199, -151, 110, 56, -180, 54, -99, -64, 51, -30, -19, 331, -84, 153, 122, 25, -176, 49, -37, 55, -104, -55, 112, -211, -44, 542, 64, 78, 181, -125, 59, -96, 119, 166, 107, -16, -67, 66, -90, 76, 9, -111, -77, -120, 117, -184, -251, 23, -158, 0, -138, 12, -162, -101, 297, -225, -52, 150, -141, -188, -148, -241, -21, 137, -143, 45, -73, -197, -91, -80, -23, 34, 251, 154, -62, -35, 196, 9, -15, 30, -148, 150, -111, 77, -319, -102, -41, 70, -299, -75, 101, -24, 20, -7, 103, -245, 4, 268, -47, -316, 116, 115, -42, -66, 62, 238, -290, -139, -79, -28, -104]
2696a04P3M77m12m6j30K25j2j47P9p4j18J48j37K43l14K37j18K8J1J85k48L36
2718A82j86j58j04L04O7J6k44K01r4K64j14M2j72R1J1j63J98k72J05k05K37j06
2740a00Q8j05P3k1K43l20J63m2j90L68l6j9Q0j35L44o74K57j43n5L42l3p6J91
2763B00l41jL2J77l42L65k6p1l6L9n1L5K0Q3M6l00K04l26K30J33J40j79l7O2J38
2788A94l68L5J45J70o9p8k2OJ4o6k1L7o4Lr3K08j02M4k8p6p1K38J70j94O4j32
2814e6k4K32j78J66m6k02K05%j16r8J91k7k14J51m4K55P9m60L64j88J29j34N4
2837C9J51k88K09j43J52m6k03J27J29j72k0l0O2n9M7j8J90r1P2j15K6j45O5K14
2861A53j66j29P5K15l79L11j67J58J65m6k01j39J56J33m1Nr8Q9k15J55j32R2j10
$$ y = [-104, -31, 446, 34, -12, -142, 83, 71, -76, 3, -71, -189, -41, -178, 65, -249, -12, -130, -102, -91, 94, -154, 182, -4, -162, -266, 38, 105, 121, -123, 78, -16, 248, 134, 176, 4, 95, 106, -57, 141, -131, -26, -231, 6, -100, -12, -117, -44, -65, 178, -142, 21, -21, -211, 157, 121, 102, 182, 47, 391, -283, -26, -169, -224, 118, 85, 9, 200, -141, -142, -110, 67, -275, 90, 64, -7, -43, -4, -55, -20, 0, 83, 129, -171, 33, -293, -63, 70, 210, 31, -6, 56, 194, -174, -139, 6, 176, 107, 29, 7, 13, 27, -39, -60, -23, -87, -84, -177, 31, -71, -27, -55, -131, -202, 36, 206, 12, 76, -56, -80, 152, -26, 140, 94, -108, 97, 97, -19, -117, 74, 47, -167, -16, -60, 195, 274, -186, 178, -10, 119, -15, 39, 190, -98, 111, -32, 120, 74, -129, -2, 127, -45, -65, -95, -33, -92, -45, -63, 127, 36, 108, -7, 19, -126, -61, 153, -13, -142, -67, 148, -231, 80, -87, 71, 236, 190, -11, -150, 6, 139, 98, 103, 5, 94, -121, 34, -98, -6, -116]
2884a16K25k96J98j88J55R8k54K88j7R3L7j28J96j72k74K13J20R8l92J64q6Lr5
2907a30o1N22l41p2R0mj31J81J20j53j15K21j50Q8J5l73M90j64J62n21M22j24
2929b8J3K31l98J84o1J06l45L71P6O0l21J29k6K21k15J22k6J0o0j4n3k2oK44l59
2954a67j48n8J66M02m63K94N5k2l05L52j39j83K97j52k0M2j34j49N1J81J49j10
2976f1P5J8j1J98rn60K94J76k51J60J68j54R7l54L91j56J57kJ21l74q0J64l1p6
3000a00K29j85J59p0j9O8%jr1qj56J72o5J52k36K65l8r2l1L38m61J90j70K10J50
3025B10k43J64j18n1k61J15O5N8j22K17K91l84j02Q4j8P4p6L11k51k05K50OL9
3048E3rm8L27k44j18k53L74p4N2k49J59m3J10p1j87L62k49Q3m9L40k77l0J32k14
$$ y = [-116, 109, -187, 11, -177, -22, 76, -178, 110, 93, 186, 223, 95, 291, 119, -155, 58, 178, 276, -116, 48, -38, -35, -130, -191, 331, -10, -82, 8, 4, -127, 54, 174, 21, -94, 127, -23, 65, 80, -293, 197, 33, 195, -326, 96, -28, -15, 216, -182, 2, -59, 47, -298, 73, 149, 209, -112, 17, -9, 212, -3, 119, 93, 103, 43, 29, -24, -46, -52, 192, -167, -315, -373, -207, 195, -268, 26, 81, 59, -246, 106, -33, -216, 81, -71, -91, -49, -183, -332, -281, -100, 49, -61, 14, 32, 21, 219, 210, -350, -56, 120, -131, 29, 197, 43, 140, -214, 177, 21, 178, 176, 297, -77, -157, 7, -24, -100, 129, -56, 103, 33, 14, 82, 82, 81, -10, -18, -174, -2, -67, 85, -151, 114, 76, -16, -47, 291, -170, 20, -150, 60, 210, -33, 131, 13, -38, -299, -184, -119, -61, -183, 34, 325, -59, -161, -77, -95, -21, -97, 214, -37, -242, 8, 14, 53, 44, -4, 323, 79, -39, -292, 82, 8, 60, -189, -30, -73, 37, -34, -221, 141, -108, -25, -74, 266, -11, -41, 91, -123]
3072a23L01k34n5M6OJ26k10L58l30J85p7j76L88r4j05l56J64o1K69J02j01L57
3094C80m33L06j02j68j53L06R2k38j23K00j2k50K63n3P8n8K57R8j23m46K75O8
3116A64j55J30j80m7oP9K4L5k21M78k73l32L19k4L05k85Qo0n2J70L7Q5k69J14
3140D4n0K34n6j49J39p2m9o0Q0l22K89o8n8J82l73M00M8j69K65k90j60L89k39
3163d5K40l36Q7Qq5R2k70K66K84l99N08m48L19j66%J3j5k32K19l3k11Q4l5J34
3187b1L3L0m6q2J27K20l77K83k51J86j61L05k52J90j17q7j65L0L27j16J00o5m2
3210D9j07nn9K43j34J60j00j42n1O3K34k73j11J93K12J62l98J8q6J15M9J79l56
3233a45K53k90J19MJ36O2j97J36j47j00K25n8P9M1m6J88l59R6R9q2k49K54M8J86
$$ y = [-123, 178, -56, -111, -65, -59, 67, -143, 215, -115, 70, -7, -183, 205, 111, 6, -350, -186, -247, 22, 124, 23, 380, -53, 253, 151, -17, -170, 136, 228, -10, -133, 67, 55, -195, 68, 15, 93, 35, 292, 390, 267, -179, 96, 164, 9, 139, -41, -88, -94, -15, 9, 44, -177, 301, 28, -304, 15, -9, 296, 11, 19, -41, -93, 77, 114, 199, -70, 44, -6, 228, 172, 23, 162, 90, 41, -19, 61, -261, 28, -40, -98, 84, -289, 111, 159, -10, 255, -35, -195, 194, -45, 195, -141, -54, -46, -131, -39, -309, -43, 241, -158, 350, -98, 221, 55, 55, 68, 53, -179, 40, 7, -204, -120, -155, -21, 12, 42, -4, -86, 41, 261, -116, 167, -84, 102, -59, 246, -6, 184, 67, -20, -185, -155, 172, 56, 156, 91, 49, -58, -63, -122, 121, -13, 147, 47, -95, -146, -83, 151, -122, -233, -40, 172, 334, -64, -46, -132, -17, 32, 211, -145, 108, -182, -63, -59, 77, 139, -58, 78, -69, -169, 56, -2, 77, 118, 72, 260, -99, -3, 96, 14, -235, 19, 67, 253]
3257B53L3k55qj60L76m66K92m1k3l5J8j9K26l31k6J46m9J18K05j42k5k49K6L1
3281a05J08J19r4J25l38M28j88J15R9m05J05L38o02L36Qj38J0k06J68K64j37J6
3303B6J53k25J2Op7J10N6P2j74n4J91J23j71l52K11k40L28j18M32m85L17l5R1
3326A97l27L56j22j0k59LL16r5k12L11K4Qk60O0J6j14K15J2j36j77J81J9J51k18
3350f1J14j57k18K94o8j38J50j33R0J11K0J33l03R6m9J63j22J68n5k2k91K49L16
3373B87j77j74J46jk63RJ84Q4j63K15j13j90J22q4J70m8Q0k80L4j46K94n6K55
3396A85k77L05q8M7k89L39m53Q4M21k45R0l17J07L05j78J2l78J82J26K9j9M0j58
3419a30J95k68L6k0K63k2j8J94l63j31L43p5Q1j36L18k15L5j70jN1m3j05J58o8
$$ y = [253, 286, 31, 23, -137, 239, -227, 65, 24, 1, -34, -16, -35, 191, -140, -166, -20, -69, 49, 254, 112, 87, -162, -136, -105, 3, 122, 28, 153, -185, 243, 55, 170, 269, -136, -31, 307, -295, 41, 49, -89, -79, -285, -117, 147, 10, 26, 179, -46, -34, -28, -105, 5, 61, 133, -41, -95, 96, 219, 48, -304, -93, -333, -5, -123, 309, -176, 141, 106, 197, -130, 226, 104, 94, -165, -162, 154, 59, -153, 158, 182, 190, -70, -10, 6, -108, 107, 119, -17, -194, -13, 6, 157, -61, 53, -104, -322, -28, -96, -234, -84, -217, -127, -16, 4, 137, -166, -70, -119, 44, -78, 90, 35, 13, -278, -29, 287, 110, -64, 82, 81, -182, -173, 11, 95, -68, 147, 34, -156, -34, -118, 52, 4, 84, -196, -162, -308, -14, -70, 185, -92, 213, 125, 172, -117, 222, -231, -147, 274, 29, 119, -198, -91, 214, 36, 48, -330, -148, -22, 7, -12, 28, -130, 65, -203, -167, -187, 76, 54, 36, 230, -133, -264, 79, 4, 85, -51, 267, 52, 87, -83, -84, -33, -76, -181, -23, -91]
3443i1J31j6J78m16M39k36j94L2J58K62l07l5L32j24p5r0m8P9J23k28K10P8j05
3466E7O5j1j21j38R7j9m0K51O0k1j26j74l1N9M1j19r1M05j41R4j2j69J92p3j95
3491a60R6j36j01K55J20J62l68J10p5k7J73j51J7J13n5n0K44m03L19Ll07N08j75
3514A12J4j17L90m49J7j41J43J34j04K5J03j59M3q1K75m25L0K24J26j68J13j95
3536i0o6M01L1o22K91N7J5N0q8lL7K3J30j46l07N43l69L78l47K69q5Or3n5k33
3561b73L52j99J37j2l1J30m9k20J91k39J82m4L06j70M1l36L38p1j21L4J27k6j52
3584a05J68j24L2m8P1m06L24l26N30k6k91m0K65Q7k32K68q4q3P7m3j3n8j48J13
3608i2l6K26k02K31p8J67k20k59K95j43K89k06j88J93m7j29L12o1k8J11k56K12
$$ y = [-91, 40, 24, 202, -214, 225, -11, -205, -173, -15, 247, -60, -95, 237, 113, 38, -52, -100, -21, 102, -126, 84, 162, 57, 122, 111, -10, -148, -51, -70, -110, 141, 201, 180, 54, -120, -151, -92, -51, -170, -261, 144, 3, 97, 85, -84, 108, 35, -160, -64, -200, -301, -46, 74, 236, -132, -22, -97, -124, 49, -102, -85, 28, -27, -77, 167, -236, 83, 86, -221, 287, 112, 126, 9, 399, -50, -33, -174, -31, 103, -1, 24, 127, -32, 11, -70, 205, -220, -190, 34, 160, -8, 105, -90, -156, 245, 276, -346, -55, 2, 17, 67, -21, -24, 13, 36, 166, 20, -287, 256, -113, 265, -82, 187, 102, 108, 15, -40, -273, 79, -120, 17, 5, -26, 104, 55, -165, 26, -213, -31, -75, 231, 61, 102, -234, 104, 33, -88, -54, 73, 47, -105, 63, -61, -29, -77, -6, -412, -88, -414, 116, 90, -201, -241, 24, 111, -121, 147, 63, -20, 57, 14, 1, -57, -205, -92, -128, 98, -104, 127, 49, 216, -4, -263, 32, -111, 178, -28, -216, -23, -70, -199, 113, 52, 24, 135, -121, 91]
3630I1j10k9J87Lj29n8j13K78l04pq3j3J82J26j52J38j24J86J9p3m6N8P5p4J45
3655A73j56J57l13N4K31o8K50l91j5k0K31n07M14l39J27P6K26K05l13J46m06L45
3677A07J07p6L3n1j21j55L32k01n8mJ58j91K68Q0m85K39n5K42j05l62L32L0o4
3700@n5J35l18M27m32L67k14N8J22k26j08K17k77K68P8Oo3M8j29j98L22L7j05
3723d0J7K11n29J18M5N23l54k75K3L28j52m8K72j59k8L1J73k45R4j47J14K63k10
3746B5l2k69M18j01M4j2l7R3k80L2O3Q3k36L82l60J17N9o7K84j32m6r2J44M05
3770D85l28j11J54m35PM22q1n4J23k6k30k5K60l04J31mjM1k38K84j83L2PK5K7
3795b2K05j22l06J95J82J34l88J73j44M5J32l3p2j53J77J15k17J83j0K39j91j17
$$ y = [91, -19, -48, 139, 142, 13, -45, -158, 120, -184, -191, -274, -287, -105, 21, -131, 7, -117, 69, 88, 15, -31, 27, 102, 28, 173, 17, 174, -139, -85, 146, 78, 328, -63, -78, -98, 133, -374, 40, -299, -172, -96, 130, 335, 22, 168, -238, 107, 214, 138, 171, 120, -1, -156, 176, -25, -83, -87, 71, -120, 148, 228, -257, -18, -73, 169, 64, -298, 34, 64, 0, -55, 80, -238, 189, -243, 124, -90, -32, 90, -136, -244, -27, -304, -36, 42, 48, -15, 33, -96, -294, 28, 65, -40, -23, 188, -341, -223, -178, 345, -9, -284, -261, 67, -85, -133, 139, -20, -48, -17, 156, -89, 5, -142, -28, 235, 25, -7, -276, 142, 41, 85, 73, 36, 129, -151, -119, -56, 27, -209, 173, -187, -70, -11, -78, 206, 74, 28, -64, 80, 485, 157, 46, 200, -235, -228, 194, 113, 59, 182, 156, -74, -99, 161, -143, -12, -16, -17, 24, -214, 70, -113, -81, -74, -49, -22, 183, 61, -245, -50, 132, 266, -122, 51, -93, -48, 84, 51, -21, -174, 3, 118, -99, 84, 74, 313, 122, 5]
3817EM4o9M3O1J9k44J26J51l53J91n1LN0J80k62J93p5l5j09J06k73J45j5OJ15
3842d8J5P5Ll82N09k28j30Q5J13J84j26l53K42O8o9J94q5j61J1L68k90K02k84
3865h7r7J08l5L1R3l1Q9p8l3m1J99l35K77j36l3j3j06J83KpK20m08K26J52m5p4
3891B1o4J1l8P9j29J63j77J64l1J75j04J4o8J44l43K58j23K93l68J57J7J55l56
3914a50J30K0p6K37j11R9l64L22k74Q7M8J74r1j62K3M6J07R1j80K09j07L0j2j15
3938a9P8o2k03M65j02l3J69m50pK01O9r8J65k93o8L68p9j41K12j34J20L3k03j39
3962a51J4J36jk7P4q6m2J70n0M7j49jrm3J40k02J64Q6j45J68J03j80q5P2l3l1
3988f1PLJ74L10l36j95M77m81j8J80l04M18l50J85MK64l13m40N22n3J17j96J50
$$ y = [5, 49, -20, 23, 84, 103, -141, -15, 136, -217, -26, -77, -74, -24, 156, -106, 87, 12, -23, -132, -26, -299, -154, -169, -163, -48, -33, 42, 45, -337, 172, -56, -186, -101, 12, 196, 70, -283, -41, 27, -42, 152, 67, -94, -83, 285, -5, 197, -87, -184, -76, -111, -80, 13, -18, 71, -7, -40, -81, 118, -217, 60, -76, -109, -122, -228, -45, -43, -50, 170, -238, -12, 140, 95, 21, -43, -32, -70, 9, -120, 43, -134, 30, -1, 174, 70, 84, 16, 160, -183, 75, -48, 245, -123, 34, 51, 206, -150, -20, 0, -76, 161, 50, 149, -215, 107, -167, -80, -32, 142, 51, -111, -88, -42, 65, 156, -24, 185, 78, 108, 96, -19, 59, -3, -206, 259, 157, 124, 293, -157, -164, 37, 106, 8, 173, -120, -188, 180, 101, -40, 172, 38, 158, 191, -12, -151, -137, -1, -2, -29, 45, -41, -83, 87, 37, 84, -65, -66, -75, -118, 22, -180, -16, 70, -75, 93, 196, 16, -69, 3, -30, -61, -54, -51, 123, 433, 97, -98, 379, -102, -120, 60, -244, 174, -176, 9, 13, 277, -36, -476, 46, -7, 110, -86, 64]
4011F4p9J92k10n5K45l15J3j6L45j46J88j81o1j0J06j86K61j03k86L13O9j6j62
4034c0M4k56M8J79K0P0j97N7J13j13J91k19J57j6J46j96m2K91j94K6k05j43P6
4057a93J05LJ57O3m3q2K13l19J51n3l7L4o7P6R3j8j94K50n03M58Q4j13l1o3k3
4082e2J41j00J32p0k39J31J04J59j53j16k4j48J81J15M16p63L17J71j06Pm31K04
4104a24j06r3J71M09j70r6R0k83L71k57N8jJ88j82k0j28R9n9K09J68l27J19j21
4127h5k69M77l85K22j37J7M18l36K05k24O9K6J32l2k54J40l9M6L3j14J48q9NM12
4151C86m13O5j08L7j29L32pR6j86k0j51o5J67Q5j63L35k99j19J87J25k53J42K5
4174F9j53O1K93j84J59q4n2k22j5j34K00L61l53L6P0j68O6Q6o3mk8O9n8j55R3
$$ y = [64, -15, 177, -33, -88, 157, -158, -145, -161, 184, 38, 226, 45, -16, -26, 80, -106, 155, 52, -234, 79, 148, 132, -30, 14, -242, -194, -15, 5, 75, -122, -65, 48, -65, 126, -93, 64, 48, 194, -2, -44, 247, 53, 79, -126, -269, -193, -88, -85, 72, 135, 92, 10, 223, -96, 55, 2, -35, -1, -68, 8, 101, 83, -111, 139, -364, 94, 178, 65, 34, -29, -52, 89, -11, 121, 51, -188, -57, 47, 206, 53, -63, -87, -235, -54, 61, 477, -286, 31, 202, 96, 103, -328, -124, -230, -323, -152, 257, 87, -9, 81, -202, 169, -88, -30, -31, 157, -25, -45, -173, -74, -133, 76, 244, -83, 36, -85, -354, 123, -262, -40, -177, -160, 258, -78, 127, -97, -28, -2, 130, 98, -156, -16, -55, -9, 24, -90, 58, -31, -26, 386, -27, 38, -70, -33, -162, 170, 163, 259, 73, 53, -98, -163, 4, 89, -74, 261, -38, -157, 30, 155, -98, 44, 69, -84, -23, 270, 86, 245, 161, 109, -113, -128, -262, -62, 299, -54, -18, 52, -116, -50, 36, -27, -31, -59, 10, -48, -203, -110]
4199a10J49qJ1r8J23j94K97j73J02k64J70j58K79k89K66j87J07l00L15m5j99J40
4221f6n0J01n9j14L00n6N2j76J58l23J80K00j42K61k97M5j55L61m04M71j52K0
4243A55m11O8N7N5J05j47K93m16J28K83k33j01O1O4J08Or0J1M5j08k9K05j9r9
4267iJ07k03J35j33K03j94M4L00l85M17j37j89O2J17o7k38K71k23Q2q1L45l83
4289a59L0J47L4k20J99l73K72j70J3K78n6k30L33p3Lk9J8j34L3O7j53M50p2k23
4313a5j00J33k1J0j69J83l48K17P7jL21j97j93K06j33j68L85k79K19j6j48J93
4335A56k19J83j29J01j72l1L98k38Q6j65qk0Q0RK15l55J39O6J40r7j30L4j5R8
4359A26k11NL1J66k56P6RJ15k37N8K5p6K51j47Q7j07j50J31O4j7N7j73K44l4q
$$ y = [-110, 39, 31, 42, -56, 67, -127, 170, -3, 99, -165, 5, -153, 126, -163, 103, -84, 23, -277, 38, -7, -206, -66, -116, -15, -74, -188, 112, 56, 108, -68, 90, -233, -53, 147, 5, 266, -31, 14, -141, 220, -184, 287, 135, 155, -256, -188, -131, -76, 29, -118, 175, -241, -113, 170, -63, -164, -103, -39, 69, 75, -15, -4, 41, -67, -96, 109, 90, -9, 98, -105, 30, -103, 100, -94, -50, 250, -135, 282, 145, -44, 18, 135, 68, -170, 101, -122, -40, -121, 224, -159, -129, 18, 52, -168, 31, -342, -70, -240, -227, 51, -5, -235, 98, 25, 28, -1, 17, -117, -84, -17, -170, 280, 208, -15, -115, 18, -3, 7, -162, 21, -327, -110, -33, -34, 287, 90, -103, 103, -30, -198, 187, -92, 127, 111, -37, 156, -63, 120, -9, 92, -80, -111, 287, 49, 135, -30, -38, -58, 22, 31, 246, -109, 30, 96, 236, 139, 9, 43, 28, 126, -85, -80, -49, 117, -139, -63, -54, 61, -176, -118, -93, -169, 82, -65, 22, -85, -235, -104, -40, -57, 0, -173, 71, 37, 29]
4384B9j58J94m3J0N9j94O9j38K79J20l62K70o4j00K92l79K55q5j03L32l14j49
4406a80L00q8k14L1K46J88k21rJ4l4j57L33M1m32K59r9p0K09O9j8L2m39L24K9
4430A14k43j11K28j08m9Q5J48r4J08j30K61n8j43j86KM90m89K3L65k92J22KN4
4453I9j18o0J42l52L94L1j6j45j66L85m79L70L40m36L25j02l19K76j33P2j43j13
4475a48J12M7k5j0J49j3p7%j62n7J88K74l58kJ17q2l48K61N8J54j09j96L81J1
4499A65k25j33R5j50K11k4K36j89q2J73J79n31K08j17J37K6nm6pL92m01k94K61
4522a21K76j39N4k42L21o4n7Q2n0r6J75j17J63%l46m3K49J2pJ88j68k83L75j54
4546HQ8m8K84l63m6j57L80m4K36m60l3J02K36n1jj95j31L58K21j36m46J19O0o2
$$ y = [29, -129, 65, 22, 32, 91, -103, -34, -172, 107, 227, -135, 135, 71, -29, 263, -116, 139, 54, -49, 283, -31, -180, 120, 32, -182, -151, 95, 283, 62, 53, 67, 33, -124, 209, 250, -182, 77, -22, -92, 117, 186, 168, 200, -239, 85, 114, -129, -240, -12, -120, -169, -84, 64, -30, 78, -52, 209, 151, 8, -178, -176, 314, -175, -152, 213, -79, 43, 45, 99, -19, -79, 63, -289, 105, 136, 120, -25, -191, 194, -285, 85, 425, -11, 314, 212, -107, 169, 36, 108, -35, -148, -36, 11, -14, -24, 125, 112, 35, 35, -127, -184, 4, 278, -80, -82, 35, -47, -395, -134, -76, 78, -31, -227, 154, 165, -60, -193, -98, -248, -37, -61, 175, -14, -96, 77, 256, -275, -67, -184, -47, -21, -26, -72, -79, 313, -88, -382, -121, 155, 16, 70, -172, 149, 85, 28, 110, 60, -36, 139, 22, 185, 185, -161, -204, 45, 57, 50, 238, 70, -213, 162, 8, 96, 48, 332, -31, -77, -234, 146, 102, 338, -122, -155, -53, 183, 132, 131, -64, -195, 163, 384, 248, -198, -79, -19, -81]
4570h1K9L09n11J09K22o8o1LL27R0m23L8O6k12M36k58J06l86N11j40P0r8p8l97
4594c97N83j40O0k07J42k42K86m83N25%l2J83n64M02k53P3j31N08k54J78k25r9
4616h7p0L34MQ8j38j42j0J51k10J21J0l83P1M28j64K1q0K11Q7k38j03K48j14l5
4640@J49O0k88%l9L14m16O5J90K0R8Qj07q3K03q7j64L2J16Q9k05Q1m8p3J95j53
4666d3RK6lJ50o2j18K14j89N5o5p4n4m7J63m0J42J05k57Pj2j59N90l40R8n0l41
4692b95J90N4j45M1K73m4k78K47K16k61j3K2j2Pk89K45J79J73k79k32K58j73r7
4715b13M29k47J21k16L47j28r6J0n5o2j37J01k9lK54k39J41O8j65n0Q3O1N6k21
4739a90k7M86l80p9K83n1mN3j24k60L65o6l98L07J34J85l6k18r1K19k37L77n08
$$ y = [-81, -52, 257, -254, -145, 77, 9, -52, -49, 278, 368, -55, -17, 49, -163, 273, 15, 121, -265, 246, 106, 176, 78, 0, -397, 186, 46, 106, -101, 41, -201, 85, -398, 127, 127, 95, 278, -286, 116, -137, -64, -195, 313, 59, 237, 12, -87, -157, 177, 181, 269, 131, -11, -21, 130, -80, 41, 51, -332, -261, 167, 3, 24, -56, 155, 242, 4, -99, 149, 35, 0, 149, 209, -79, -79, -118, 196, -220, -155, 35, 55, 153, 161, 54, -29, 174, 87, -77, -45, 71, 160, -45, 36, -12, -85, 110, -43, -34, -8, -11, 139, 77, -41, 173, -16, 39, -26, -100, -154, -201, -38, -78, 64, 169, -88, -81, -93, -252, 338, -2, 96, 46, -295, -105, -51, -196, -155, 118, 74, -204, 43, 259, -2, -15, 7, -5, 2, -287, -42, 137, 310, 31, -201, 57, -116, -213, 216, -31, 90, -126, 221, 93, -3, 7, -48, -110, -247, -146, -175, -178, 76, -163, -22, 46, -119, -169, -86, -25, 31, -190, -217, 269, -111, -190, 93, 42, 38, 91, -33, -293, 72, 6, -392, -85, 49, 234, 198, -20, -111, 108, -129, 248, -260]
4762b60M62j16%j95R3j85j59J11J65K28k1j63k14K38j63J50J24j13P6o5KL4q2
4785e3K7J24J43l02J59k39J86j06M45n44j7K02J39r4m02L53K23Jl71J29Nm6J57
4808A19l22K47j62J71Q3j27j2JK03l7l69K73j20P6J04l56L31p1J28l15J31q1l0
4831a35J82J04q2O1K4j16J01l52M14l01j23M73k65k00J83R1J32kk05j50K94j70
4853d2j63K29J21j95R6J19l69J57J70j74J73m15K47J44j03n5J09L7n5Kl19K25
4875f1l9q9L36j09k09J07o3K17j59l4K88k6j36m5L1p2N2N2J2p1Q0j72L19k48J58
4900A19j14K51l63N7j8p6J31K74k55J36p2J27k55k4J35k8J05l71L57l07M0LL0
4923a18j57J54M4J82n4K27l90K71j71r2j09K04k7K03j51j9l9M0R5qN5N9j90j1
$$ y = [-260, 202, 86, 86, -109, -16, -201, -360, -249, -84, 144, 123, -40, -254, -16, -179, -29, 95, -18, 58, -7, -5, 29, -53, -26, 98, 241, -61, 98, -141, 45, -61, 384, -160, -177, 25, 164, 70, -332, 21, 244, 245, -126, 3, 8, -38, 119, -203, 44, -118, 53, 136, 9, -3, -2, 201, 164, -205, 68, -52, 24, 128, -228, 103, 32, 160, -155, -24, -105, -135, 47, 151, 69, 130, 154, 38, 139, -213, 201, -100, -223, 250, -15, -215, -32, 59, 191, 189, -16, -166, 128, -42, -205, 24, 145, -50, 46, 165, -204, -47, 123, -51, 122, -293, -46, 98, -5, -60, 49, 86, 31, 33, -286, -61, -100, -189, 147, 38, -171, -64, -127, 90, -69, -103, 185, 159, 23, -22, 9, -63, -11, 41, 53, -18, 62, -110, 209, -39, 119, 5, 256, -107, -50, -68, -144, -13, 261, 6, 142, 70, 197, -58, -82, 53, 25, 130, -241, 116, -191, -151, -148, -118, -275, -121, -77, 105, 51, 278, -112, 159, -12, -104, -213, -9, -36, 167, 16, -3, -42, -2, 93, 85, 140, 199, 9, -2]
4947bk62J07J30j07L90k59L4Lj42K69k83J76j9k84L69L3k64J65J5l28O1J03Q3
4970a2J68n6j74l75L27j02K66J92k33J09k29J35k01k53L59K89l6l85L65l4j51
4991c1M4r2L8k51K15L25j75k12K90k52J93Kj44%J26o8j11M8jJ99l64K87k10R9
5015d5Nk09K61j84L5L14j85J56j08R7l62L70q1k36J22K2J25n3j66J93q6k35J74
5038g6J49P1l86J56P2J52j41J36k19J57j24K08q4j75L3J16k04R0LN6N5l5R5M4
5062A49k36k71J21K89k34J30L6K52l78K25r9m7J63k80J40kJ86k40l1J32K00j80
5084B5r3l1J36pN9l1o0k5l8K6K81n9l17R5j55K07q6L75l74Q0N9n2j2K14k18Jj59
5111a59J80J80q3l40K72j9J25PO1j41k16J98k0J84j93O6q8l82O02l54K4J51k29
$$ y = [-2, -264, -157, -27, -134, 256, -3, 31, 34, -108, 161, -122, 54, 35, -249, 120, 153, -111, 54, 69, -259, -198, -95, -12, 156, 100, -74, -449, -122, -224, 42, 234, 1, 110, -119, 16, -185, -438, -79, 210, 174, -211, 154, 120, -31, 13, -79, -41, -292, -77, 248, 73, -139, 151, -101, 92, 94, -50, -50, 76, 8, -103, -55, -56, 143, -221, 66, -144, -45, -40, -249, 12, -172, -137, 177, -8, 148, 40, 137, -225, 145, 64, -172, -50, -28, 97, 44, -122, 71, -15, -250, -76, 73, 144, -242, -86, -14, 138, -3, 133, -86, 71, -53, 155, 71, -104, -71, 45, -159, -69, -66, -10, 45, 10, 105, 149, -87, -358, -237, 52, -182, -52, -16, 236, -142, 83, -16, -63, 100, -180, -40, -42, 144, -96, -127, 5, 205, 25, -68, -99, 37, 30, 89, 58, -2, -27, -65, -39, 242, 183, -134, -39, -194, 13, -73, 302, -72, 8, 67, 15, 3, 217, -1, 0, -159, 21, 201, 118, -222, 50, 31, 156, 163, 224, 83, -133, 65, 45, 229, 36, 102, 14, -368, 234, -120, -96, 55, -174]
5134a74K99p1k2n1Q6k09K2L19k9j61k36K45lP6j38m5K00l89K19N7o7L21l64K83
5158A68k30J96r8p4R0k70K1J32J84j83J91j08K56m30lL27l0j79M4K33l6l9q3k03
5182a24L78j73p2j02j78K05mk96M29n11K02J41R3o0M1l3J04r7PK33o2j17J89l8
5206A55p6J1j51Q8J77j50j21j1J05o7p1K06m7n7O0J03k09j18K21J37j82Lp0K4
5230d0J23RkJ99m02Q1j16L30j53J66k69l36K66J70J26j80q0J07j47j02K86K06
5252B42m47qN35m16P1l70M51J05j37j30K74k36J16r0p9J32k35J91K17l25J78L
5274D2l3K78n15J86N3j06J6J18k60L66L9r3j87j86M87l26J00K23l62J27J7j36
5296a52J69o6K47j74J37k73J85j02j01J76m7pM7K8j55Q5j22J25K30k33M2mj7O0
$$ y = [-174, 125, 54, 32, -19, 67, -142, -120, 199, 170, 9, -227, 18, 15, 91, -47, -92, 108, -281, -62, -5, -72, 249, -115, 168, -62, 134, 36, -38, 52, -218, -197, -65, 119, -64, 127, 19, 275, -155, -158, 169, 139, -40, 4, 237, 201, 162, 79, -124, 254, 81, 9, -93, -271, -66, -70, -366, 63, -448, -246, -105, -12, -72, -31, -64, 40, -57, -50, 183, 121, 4, 193, 155, 79, 90, -61, 27, 204, 54, -67, -78, 27, -40, -111, 95, 48, -9, 51, 154, -55, -173, 48, 185, 3, 6, -64, -40, 83, 92, 90, 289, -113, -32, -148, 182, 29, 195, -74, -410, -144, 26, 152, -28, -108, -1, -148, -250, 36, 242, -205, -213, 322, -94, -23, -393, 58, 163, 26, -104, 170, -66, 50, -40, -119, 13, -222, -31, 186, -139, 39, 42, 9, 287, -228, -42, 11, -95, -79, 39, -221, 145, 184, 91, -96, -282, 205, -121, -21, 202, -160, -33, -16, -152, 17, -49, 198, 24, 161, -112, 73, -29, -130, 46, -1, -8, 39, 67, -88, -3, -125, 0, 230, -3, 39, 35, 18, 78]
5320G8L7p0r4m03L91n3J37j11J53K01l93K82l27l1J11j04kM2J57k4K05j51l2n3
5344e4j6J2N9M4l9J32j04l31K75R4k99L11J27J2k55J75q6J15j45j6J53j6M3j07
5368H4J7J6k31M5O7J09m2j7J68l30P8k6K61j65j16j99L44k46M9j1K70l1L8k21
5392h9O0l3r5K6K17o5k29J68K1N6l9n8J02k05K59k10l7r9L88Q3n8l72J55J13p7
5417a8J2pj17N7K06k20K4J81Q2k48n0K0kJ16Kk9L0J93l6k18k14N7M52k28j64K57
5443A38j40j9J04j21p4K18R9l69J39k25K76j91J76K06m71M05l3j45L3k31J76j53
5465b02K49Pj65K83k92J40j17J08O3J43o6j14m5J51j20j52K96j38j11K15k08O8
5487gJ52l54R7K08k29R1J78j53O2j00P8R6l8j51J31LJ42nj32m4J31j75K90k73
$$ y = [78, 115, 45, -49, -452, -61, -114, 23, -88, 65, 266, -127, 155, -172, -203, -92, -196, -198, -156, 1, -23, 182, 31, -1, -54, -70, -58, 1, 45, 6, 138, 34, -297, -22, 72, -227, 84, 211, 223, -32, 143, 57, 172, 27, 11, 164, 148, 191, 84, 101, 117, -114, -69, -2, 107, 65, 48, 216, -114, -36, -62, 199, 34, -82, -281, 63, -183, -134, -145, 125, 94, 132, -89, -29, -62, -157, -131, 86, 21, -208, -40, -19, 37, -2, -60, 42, -163, 96, -114, -151, -250, 138, 221, 163, -209, -54, 59, -18, -6, -13, -130, -73, 133, -87, -63, 118, 200, -48, -98, -78, -80, 36, 38, 9, 39, 232, 196, -22, -236, -179, 273, 45, -119, 138, -2, -21, 83, -38, -112, 106, 205, -164, -25, -250, 26, -165, 11, 217, -254, 151, 118, -27, 6, -225, -49, -202, 47, 54, -111, 172, -120, 20, -97, 11, 74, 217, 151, 37, -8, 143, 23, -129, 167, 29, -82, 133, -75, -7, 145, -209, -112, 96, -133, -42, 136, -17, 45, -55, 23, 119, 81, -70, 61, 64, 206, 201, 69, 25, 156, -19, 271, -2]
5511bk00K85j14j34K51p3J58%l87K03J77k50Q9j74M9L03n9k94J48r9j1L40l20
5534a14M6J59k01L7J34J3J41J14j49J80l71k65M88km22O3P3J07J97j91J34p7j02
5557hnJ2J56k25LJ46j69J62k93K88o2q7%J60j71r3J00R7L3j67L1N9j27R7K95j96
5583C6J56l72K49J5m9j32J70j12J90K12n26O5K51Qj96j14J26J97m6j55j06j7q8
5606b38M24j24j68K77j90p1R7K4J68j63j87K01j61k15J40K43n4J21k45J25l5j08
5628a39K84r0L0m7K3k05K21n5k94L03j32J74j93M15m10K20k13J76oj77J77k59
5650a97J86n4mN6j4q6N2J74j13K17m58L47p3J8k10J7L13k1k02J98q0j48j39M33
5674B12j91k06L02j02R0l48L88k27l8M9P9J19j37m3Q2j65j27M40j1l21M10l77
$$ y = [-2, -202, 83, -31, -165, 86, 13, 171, 171, -216, -13, 164, -86, 3, -171, -122, 181, 122, -172, -24, -123, -134, 206, -114, -68, 91, -110, -73, 61, 74, 215, 329, 180, 360, -11, -276, 212, 210, -212, -149, -76, 31, 228, 37, 171, 94, -8, -13, -1, 155, -70, -67, 79, -90, 72, -221, 67, 5, -82, -82, 78, -93, -186, -86, 11, 44, -123, -92, -33, -160, -63, 232, 36, 192, -180, 69, 84, 35, -97, 73, -39, 151, 363, -163, -98, 153, 161, -35, -149, -23, 174, 128, -27, -133, -150, -238, 186, 62, -106, 171, -19, -90, 7, 31, 199, 36, -151, 50, -111, -326, -186, 57, 3, 124, -121, 4, -31, -139, 145, 55, 85, 38, 61, -144, 77, 22, -272, 31, -101, 73, -120, 295, -115, 105, -108, 68, 62, -115, 62, -197, -11, -65, -69, -13, -27, -113, -61, 113, 0, 217, -241, 106, 33, 51, -159, -142, 171, 150, -52, 146, 66, -82, -221, 212, 21, -185, 117, 15, 105, -243, 145, -82, -120, -71, 8, 127, -10, -53, 29, -136, -263, 177, 166, -155, 255, -122]
5696a22l9J65O5j68J45K1R3N3j1J54j11j34k62O0J34k79L90m12L74l10J38J04
5718D8N1L5j06q8R1L40k36p2o3J39j47r6J38K73k08j03j93K53J10k42J49j76J94
5741I1j00J36k33L36j70Q6q6O9J20j63j0j53L1J2J1o6K11l79J25Op3l2J99J54
5765A22k43K00M5k46Q1j85J53R4k31L95k4o9j24k08L84j63j53J48P0R9pj66J64
5788A36k86n4J78K1nj9j36J60q1j27L70K0k76l9K61K6l61L86r2J27l2j2k57K09
5812A17q8J59l55J69L0j74K18j11qj02R3J78L82m36L9j47P4J58k13l96O76l00
5834c7O5n2O4k90L08N4q9Qj58R9l31J79J82L9j97O6j56K00J10k1n7j04O2K07k04
5859e3P3o9K6j05J35p1J09J74n5Oj13j27P6n6J5O9q1L18nj69r8Mk00J91k28K52
$$ y = [-122, -161, 4, 69, -99, 46, 67, 160, 213, 202, 356, 245, 111, -151, -91, 43, -236, 154, -258, 116, -194, -56, 48, 99, 134, 28, -60, 31, 371, 135, 63, 0, 139, -8, -104, 34, 307, 99, -4, -197, 56, 166, -76, 73, -103, 91, -9, 127, -106, 230, 60, 146, 60, 129, 249, 86, 76, -77, -46, -34, -23, -89, 122, -257, -132, -126, -199, -231, -32, 122, -121, 79, 124, -122, -41, -226, -73, 21, -210, 185, 161, 92, -32, -240, 144, -19, -172, -24, 46, 145, 138, -28, 136, -150, -204, -26, -5, -10, -29, -165, -5, -86, -213, 157, 177, -99, -138, 123, 149, -212, 174, 82, 209, 177, 165, -92, 117, 29, 188, -167, 2, 32, -142, 76, -35, -43, -145, -52, 126, 508, 72, 111, -36, 38, 196, -17, -413, 263, -37, 28, -24, 40, -250, 58, 112, 23, 31, -127, -28, -359, -180, 2, 41, -156, -90, -246, -46, 64, 43, -14, -118, -56, 151, -53, 20, -49, -23, -128, 7, -64, 45, 219, 164, 170, 57, -70, 6, -50, -35, 34, -47, 271, 266, 97, -1, 3, -197, -6, -234, 18]
5885A8M0p3k4k7J53l39J42J63n9r0J32kj52L4M9L43k03J4m7K1j11J32j81r1J06
5910e2K6k10J00M49p2j27k14J89j65R9R6j55J29j42J26k73J61J50k34M73k23k32
5932a01K93j54p3r0j41L8K53k0q2J02l0J50k5K89n64J05o3p4j34M38q6j09N9K75
5956B56l12O6Jj17K55j1j61Q7p4R1j28P2j50Q7K0J24l21K91k75J47Q2k90K08J71
5980A19j36k89M27o1J00m12J95P7Jn1J37j8j00Lq9K92m02L54n3j29j22nr6L50
6004I2j89Q6L76k72j12NJ90J6k95K6q9j03K43K5j62L8J33q8Jr6J95K78l51n8P9
6029c2J04j48J59p4l8N8j8J24j00J54l37J50j02J45o7j62J07Rj38R4j59L18l2
6052A5J7K02n5j67K8M0q6j23K57k41q7J77K8k9J35R5k96J26j4k8J84O4k68N7k81
$$ y = [18, 58, -15, -39, -66, 87, -252, -110, 53, -6, -96, 36, 34, -118, -84, -35, 308, 105, 119, 72, 93, -18, 114, -67, -158, -52, -26, -236, -136, 313, 241, 114, -100, 89, -76, 23, 119, -36, 93, -49, 77, -196, -35, 115, -119, 354, 131, -101, 192, 38, -35, -125, -266, -228, 25, 5, -77, 25, -5, 145, 120, 409, -155, -50, -113, -187, -321, 117, 31, -78, -19, 256, -56, 10, 11, -106, 149, 138, -23, 64, -10, 81, -47, 25, -125, -38, -18, 106, -215, 76, -199, -52, 30, -260, -52, 119, -17, -306, 121, 60, 160, -252, -57, 20, 21, -30, 107, 89, -11, -8, -97, 195, -207, 147, 94, -35, -157, -162, -258, 92, -97, -11, 365, 93, -19, -14, 176, 192, -103, -77, -166, -269, -26, -1, -163, -125, 8, -80, -79, -175, 20, 298, -53, -111, -32, 72, -76, 83, 9, -29, 29, 11, 135, 35, 189, -148, 2, -100, 45, -22, -184, -77, -68, -206, -112, -271, 47, 15, 32, 234, 179, 12, 40, 80, -6, -129, 128, -113, -200, -23, 5, -24, 111, 206, -90, 36, 22, -6, 178, 242, -26, 31, -250]
6077b50K24j48J97j81J05J05K96k13j86Q4J52O2J12O8o73K93qk68K90K7j22L8
6099DJ35j70j47J22P7P7p9J95J56n22K03k6J42j36j89j23L56l84L75l78N95k19
6121F4MN1j71O4r8J73j34L9k98J50K99P6k67k2j97J85J87j88O0j02J11J5j12J70
6145E9p8J92k78J31J92p8J05P8k46l65M32O5l17J2K85j64k0J1K38j41k68J8K77
6168A40lk37K29j61J08o9l41J71j45K81l8L04n11L10n3J12J52l44oJ7j34J98J7
6191cO3j07K08k13K3K24k12k1J96o0n9n0J39J20r3m2j92J09N1P5k45J55j45K22
6215A43P9j45Jm8J2p1J36j84L25r7l26L6K22k81K98j51o4J96R1M0l90l5L72M5
6239B04o9j46J24k03P7M2K24l06m3L47j51j08k82R3M7M0n9k04J72J52K13j58K04
$$ y = [-250, -26, -174, 23, -158, -53, 52, 348, 135, -51, 33, 185, 247, 359, 427, -246, 47, 39, -229, 61, 88, -34, 4, 139, -31, -178, -56, 21, 98, 19, 214, 370, -152, 51, 25, 167, 31, -158, -281, 75, -309, 66, -312, 283, 64, 68, 119, -52, 12, -86, 87, -47, -8, -306, -156, 143, 219, -48, -70, -267, -82, 105, -83, -23, -125, -14, 1, -111, 59, -19, 173, -105, 26, 218, 140, 245, 323, 77, -288, 144, 209, -108, -96, 189, 25, 5, 16, 254, 113, -155, -137, 140, 137, -100, 129, -32, 76, 7, -334, -163, -308, -27, -65, 239, -272, 38, -15, 97, 249, -95, -101, -84, -218, -20, -3, 60, -47, 161, -52, -29, 195, -17, -38, 158, 98, 39, -11, 128, 248, 155, 113, -79, 30, 81, 156, -89, 66, -79, 143, 222, 77, 78, 30, 42, -29, 107, -77, 248, 151, -175, -139, 83, -198, 100, -51, -115, 81, 172, 212, -178, -213, 159, 204, 135, -11, 113, -90, -13, 29, 253, -53, -96, 251, 100, -8, -290, -197, -150, -110, -169, -373, -201, -49, 164, 6, 210]
6262B10Jj85r9J32k85L46k76O3P6k4n2n7J17j25L90j71K04k49l4J00J2j2O6oM4
6287A86j43J09k64J41j80J33j18J99k25J76L2K8m4O6P6k38J97j21l32K02M8J67
6309I5k23J54k3k17K61k2J29k75R8L4M6q6J37J25j98N6J2j19K22l31J29K8j47
6332a15O5Q3MM6j22j7L31j03j33R1o2L5Nk15p3K05l14K15PJ50Q8q2l43L43l57
6357b68L89n3k30J98j0j2J20l76K97J55j36j38P3k9l5L83j14J18l28j74P1L0M1
6380b8O2j06O5R1j76L61l34j10L35j71j64K68J04m44J79m6L15j60J7J61k90j37
6402b08K30J22j11J80q9j38L6Q4R4j56K31j34k58K76j04LnJ39k37J36o9q0J07
6425D9Kn2J91l10K36j6J26J11k93L2n1J26j97j98J22K30q9o7J60r2r5qJ35p7m5
$$ y = [210, 211, 26, -73, 59, -226, 120, -156, -93, -17, -41, -93, -150, -33, -158, 232, 61, 265, 16, -18, 82, 94, 82, 148, 142, 186, 43, 152, -112, 29, -151, -18, -136, 63, -162, 14, 46, 74, 30, 96, 172, -66, 131, 10, -322, -120, -72, 95, -128, 26, 3, -214, 47, 25, 154, -121, -23, 11, 57, -29, 108, 233, 35, 91, 103, -16, 206, -125, 4, 32, -115, -50, 33, 37, 83, -39, -56, 275, 172, 39, 130, 68, 103, 108, -107, -180, 25, -289, -74, -67, 83, 171, 89, -254, 89, -268, 121, 68, -162, 36, 26, 14, 134, -242, 55, 210, 74, -64, 9, -20, -55, 328, 214, 332, 4, -170, -99, -69, -28, 34, -72, -7, 84, -92, 269, -65, -175, 160, -11, -175, 93, 197, -247, -68, -114, 201, 41, 58, 219, -71, -208, 22, 144, 33, 213, 124, -14, 22, 106, 200, 44, 275, 141, -117, 159, 55, 58, 53, 192, -45, 91, 22, -58, 49, 51, -1, 190, -120, 116, 100, 226, 337, 44, 76, 25, 151, -46, -244, -122, 108, 19, -48, 112, 20, -75, -83, 52, -25, -70]
6450g0L01j80k1j27J47P0j4k71J67j23J8n2O6j5M99l89j29J16j5p1m0J11L9O4
6474H1j08n6j66J1K64K86j38l7r8m5n1J74Kk03P5q6J9O8r5r7J48J45m1j14j19
6499a81M73m82L10K86n78J16P5kn7p3K10j0j10N4j40J18R8K0j34O5l87J15J18
6522i6L16o8k89L12l10j91K49K70l71KR1J7k0P1R6j93j71J76J00j09j0O2o6K57
6546A25k23M8K5K6J30j69M3J00J10j78k7j51K15l58N18N2l30K08j85J14m3l12
6568b62J61L04k95P4Q0j70M70m29j32N11l44k02J29j39N2L83l66n6J67l0J18j38
6590a14j15L05p9J80l68L22m4P1k59QM5J36j1j95M5N6k46M01j73K31j95j30J99
6613G0P9l09R2m5J73rl30L74j00K33k3l94N15j90j33K10j03Qm2Rj31j15K36q3
$$ y = [-70, 231, 51, 30, -97, 50, 120, 106, -165, 2, -121, -103, -155, -89, -104, 395, 6, -123, -7, -22, -93, -133, -22, 17, 81, -27, -83, -249, -238, 26, 312, 174, 137, 39, -6, -57, 117, 119, -84, -9, -95, -76, -8, -103, -200, -52, 93, 52, -62, -181, 292, -190, 120, 406, -172, -56, 19, 17, -40, -113, 97, 87, -23, 31, -109, 9, 107, 127, -7, 58, -329, -214, -96, 220, 152, -137, 175, -135, -326, -77, 193, -178, -176, -85, -68, -88, -17, 79, -114, -285, -109, -9, -118, -128, -66, -132, 125, -98, -50, -25, 1, 131, -38, 5, 105, 215, 37, 10, -141, 74, -284, 234, 286, -44, 164, -21, 93, 50, -262, -101, 203, -92, -18, 62, -108, 362, -67, -199, 312, -32, -234, -105, -244, -192, 191, -175, -231, -64, -94, 24, -114, -229, 76, -3, 177, -191, 131, 87, 158, -101, -93, -48, 88, 77, -118, -73, -17, -263, 138, -35, 196, 1, -129, 70, 149, -160, -68, -113, 60, 51, -279, 95, -5, 228, 205, -189, 326, 136, 3, 213, 110, 118, 76, 85, -46, -161, 75, -8]
6637hJ41J13m77M19l37K6L27l81O4O0J97l19M2J08K02j41j14L8J90j83J54j01
6659B0o5j7K87k61k5q9j86L78N8j14m7L6j25J3J85k01L28j40j01l0j13J13K70
6682A74l82K64Q7l7J02j19o2J10Q6k99K16M4l53j1L17k04J75j68J96q2j97Q6J70
6705A13r4q1J80O4rk7l67K41o0l7J63j20J18m6j88r2K96N5k25K47j8j99j33J84
6729c5k2k7K03j87K04j84k1J08J79j29j28P9R3j87K83m57J91k65L73o5k05K6L8
6752a35K98p5j76Ll3J56j2l34J82K38K11l44k5R2k33n0L40J0m6q5J58j61n6J75
6776I8l01J54K9K59l48K44Nj04j51L60K26m49K64l20j29K65J14k17j98K31J0o4
6798b2J75N9n71L23M3j18Q3j12K14k39J16m9J18Q2m9P0j30O6j6k3k12L27k08J44
$$ y = [-8, 133, 246, -231, 188, -149, -123, 204, -177, -113, -53, 144, -175, -133, -25, 177, 36, -78, -40, 150, -33, 121, 20, -45, -62, 225, -36, -61, -150, -336, 42, 100, -14, -61, -25, -150, -137, 48, -153, 175, 35, -66, -96, -209, -96, 174, -208, 56, 143, 106, 208, 89, 27, 137, 223, -76, 140, 184, -169, -180, 137, -67, 108, -60, 136, 54, -143, -57, 113, 19, -62, 118, 182, 173, 146, -221, 20, -40, -77, 86, -34, 84, 38, -150, -242, 54, 109, -116, 131, 113, -86, -219, -35, -57, -84, 119, -68, 136, -48, -69, 39, 218, 89, -39, 40, 133, -54, 229, -228, -37, -302, 71, 6, -199, -173, -135, 163, 88, -88, -85, -118, 38, 26, -308, -126, 112, 323, -21, -46, 46, -187, -237, 103, 113, 67, -18, 140, -21, -77, 98, -203, -49, -20, 239, -109, 135, 140, 36, -115, 245, 471, 22, 286, -34, -163, 102, 216, -1, -199, 32, 42, -22, 153, 212, -359, -36, 7, -111, -28, -140, 74, -165, -49, -98, 20, 102, 53, 123, -7, 59, 43, 20, -192, 135, -73, 71]
6822G1k22j46J17J14j52K78p0j32K21j16n8K18j92J45J75l81J70P5K41k67q7n1
6844d9J11k87K39Q0k78J23J50j83K27j09l1J72K7k58K45k04Q7j70L41o2k78j7
6866a24N8K69m36O04l55LO6j46p5J73n5j73R3k87K83L1q9M87n14J82k24N87l55
6889Ck70P9K6J97j65K62j76J30j2Kk92r2K72R8j01m8k4K07k82J87Q8q2Q0P9p4
6914I2k91J09M11j17j32p7p0J86k04RJ49K70m56J81j67Q2N2j46j5J22n9J75q1
6937B3O3o3l4oL21m80j27nM53k07P2k11L20q5J15k80J42J1Jk73J68J10k75K05
6961d2j39J27M3j93K40o4J66J2j41O1j08L68l61q6J06R5J39k33M3l10K69m9j39
6984a96J73J43q1O7j79p0O4j6J36j47l5K86l41O4P2lq1j25L59m5j7o6L1J60j37
$$ y = [71, -151, -297, -180, -66, -218, 60, -10, -142, 79, -37, -95, 123, -69, 76, 251, -130, 40, 115, 356, 89, 2, -49, 62, -225, 14, 94, -184, -61, 89, -94, 133, 24, -7, 165, 192, -66, 179, -25, 62, -108, 233, 171, -107, -124, -66, 203, -233, 371, 16, 19, 85, -61, -136, 37, -18, -191, -98, -385, -102, -71, -160, 327, -187, -5, -229, 358, 3, -267, -188, -162, 35, -130, 132, -44, 86, 74, 76, -216, -308, -36, 62, -39, -87, -111, 96, -186, 1, 89, 7, 87, 166, 92, -199, -90, 321, 204, 72, -5, -75, 111, -93, -84, 65, 335, -121, 60, -107, -25, 27, -119, -134, -12, -71, 104, 23, 86, 23, -11, -17, 304, -176, -303, -308, 145, -62, 10, -201, 119, 34, 149, -131, 11, 22, 23, -250, -82, 28, -247, -42, -181, -54, -11, -204, 36, -28, 138, 150, 9, 70, -38, 330, -31, -117, -11, 84, 223, -10, 33, -277, -8, -57, -196, -23, 120, 39, 106, -73, -143, -79, -95, 41, -106, -141, 145, -196, -132, -60, -63, -144, -269, 90, 45, 28, -38, -7, 153, 16]
7009A6k5m3n1L43L7j58k93M06r3l8N6j90M8j62J10j1K66l17m5J05J39q1J30m3
7033A06l33L35r3P9k82m9J54J01Q1R6j35pJ11q7Nk08J30J53l91J01r1N8J52J5
7057Aj61K17PJ05n7j36qJ75k93N8K47j77m0m8J34R5o3j61j44J21R2J06j01N7R9
7082A25N0k90J42N5j17r0qJ00K8m1K62m45L33Qp0o9j82j59M05j80J80l4j12L42
7106B33k01k3n6J9M9p7J52j20K1K64k0o2k81M05m82K35j6J55k20Q4k05K30m0K8
7130G2k68M48j69j8k23K25q2r3J99l03L10j02K29n03L12o9M1j52L28r6O2j48M1
7153D1j0q3J90j8k57P5o3J59j57Q4qj31j63K85j8J26o6J79k78N8j83K69M0n6j22
7178a07R5Q1o5pP4q5K5O5p3J16k06K75k63j03J32q4Q1K5j67J94m50J52J77K40
$$ y = [16, -9, -52, -103, 240, 277, 119, -174, 232, 139, 101, 157, -33, 15, -147, -37, -48, 218, -99, -144, -39, 100, 19, 149, 106, -227, 108, 15, 94, -188, -237, -83, 18, 99, 195, 60, 53, 164, 77, 82, -126, 4, 157, -234, -133, -224, -166, -14, 1, -160, 57, 64, 169, 112, -24, -32, 143, -150, -92, 155, -22, -62, -110, 24, 119, 56, -105, -249, -128, -36, 70, -31, 26, 125, 175, -115, 27, 82, -35, -125, -133, -33, -5, -46, 216, -229, 104, 112, 42, -27, -209, -368, 37, -143, 37, 3, -109, 233, 32, 9, -47, -28, 21, -56, 96, -24, -3, 261, 241, 179, -102, 303, -179, 56, 40, 195, -25, 59, -146, 84, 44, 72, -196, 252, 83, 65, -158, 67, -15, -108, 91, -212, 98, -4, 225, -278, 34, -35, 6, -146, 182, 86, 148, 0, 41, 31, -52, 138, 120, -137, -62, -125, 34, -123, -39, -47, -178, -341, -56, -74, 52, -14, 165, -113, -55, -238, 31, 71, 15, -107, -12, 69, 4, -3, 71, -14, 11, 76, 3, 119, -87, 188, -75, -178, -46, -130, -49, -24, -191, 3, -447, -295, -118, 122]
7202A22l7k77K27k59L53r6k63K80Q8r3k35J27K16k22J73j11q4K67J02k20k33P9
7224i6J75m9O8l24K34O4Q6j53J67j54l7j58M50k23j52j27N1M7J37L4p7K90j29
7247A24o2j01J11J0J08j49J81j06k16K66Q6m46J11J70k39L05J03l82K44k18K64
7268A64j29q9Q9j46j03N2L79k75r4J21k07L2K70k46O6L59j3k42j95R8J21J84n08
7291c12K94mJ29r7l08L51j91J94K7j18N6k8j8K57k87j70O0L18j66q7k12K79Q2
7314D9j05J75K12l30K7o7j10O8K50j64k8Q9k9L4p9j23J10J38J10k38j09O7J03
7337E0M1nr3k25j19J42J07J56k5n0j80q3O3J00L15k07k91J87j00Q5K84j70N9M6
7361H7j11K45j51J69k14j35L14j50k02P7J51j38j78L41m19L37K12ql16J20L7J16
$$ y = [122, 85, -192, 35, -224, 129, 33, -230, 50, 138, 45, -190, -63, 153, -69, 104, -7, -91, 176, 278, 58, -175, -96, 79, 30, 98, -226, 8, 72, 158, 5, 172, 18, -19, -177, 273, 50, -102, -229, -178, -131, 6, 40, -37, 253, 124, 62, -39, 72, 82, 190, 41, 222, 116, -100, 166, 252, -194, -83, 87, -152, 153, 256, -126, 118, -100, 164, 35, -54, 35, -111, -214, -162, 217, -58, -152, -31, -238, -206, 64, -182, -116, 243, 230, -12, -207, -109, 12, 196, -312, -18, -22, 107, 10, -298, 53, -138, 56, 83, -35, 21, -7, -25, 232, -55, -225, -165, 153, -13, -100, -312, -33, 49, -56, 119, 331, 1, 28, -39, -149, -81, 169, 5, -23, 66, 37, 71, -8, -131, -21, 117, 227, -11, -120, -53, 50, 91, 86, -7, -232, -351, -209, -102, 54, 29, -21, -201, -284, -221, -121, 194, -13, -304, -117, -217, -132, 152, -18, 41, 87, -24, 221, 70, 239, 25, -110, 204, 54, -148, -71, 80, -58, -236, 105, -314, 23, 235, 227, -89, 31, 68, 184]
7383A84k97p1J69j2r2J94J66l38j02M74k91j87J22J11L74m74J19p2j12K56j75
7404e4J78M6j20l90M70j68m2J69k65P2J11nMr8J42j38J71j01J29k71K72j50M9
7427A1k48J54O8q2K57k98L4L15Q7n86M58l05R4Kj01K65k29q1K86K3k58L21l19
7450a32j50M50M2m5l22JJ51R6n2l97M81j00K29l70J95P9k63L16q8k86L48j35J18
7473A66k42%K15lp6j05mJ2kj40J78l44L11q3P7o5J14P9k29K65J7k33J70Q8m4N3
7499A75l3k48j24P0O8K29l2k11L71l88K25q1k77Q4J07M1M27m57J07m1J30Q6m14
7522a86P0j46L32l13L41J67L3n12M16k95K31k09m9o8j39K41m9Nj00M56l67J55
7544A4l1O0L5j52j56L94j0q1l56K30J7K00l6q1k76J2J67j20K72pk72P1q8M79m26
$$ y = [184, -113, -184, -15, -27, -119, 75, 241, -97, -199, 275, -16, -203, -81, 30, 404, -70, 49, -23, -135, 121, -54, 124, 170, 50, -340, 130, -38, -80, 89, -176, -104, 7, 2, 6, -92, 50, -88, 83, -18, 111, -160, 112, -38, 11, -237, -83, -15, -97, 160, -138, -104, 211, 298, -288, 170, -135, -41, -39, -140, 125, -104, -185, 101, 124, -134, 187, -132, -282, 168, 210, 165, -157, -156, -5, 91, 39, -358, 123, 23, 252, -118, 77, 156, -107, 209, 121, -165, 183, 48, 166, -76, -76, 139, 136, 60, -45, -49, -37, -39, -179, -1, -345, -34, -117, -40, -105, 9, 88, -141, 124, 141, -92, 78, 166, 122, 175, 142, -106, -230, -160, -92, 137, 105, -106, 265, -123, 102, 21, -256, -172, -65, -24, 403, -54, 53, 12, 142, 228, -186, -116, -262, 70, -243, 98, 265, 298, -214, 202, -93, 138, -71, -120, -188, -327, -86, -135, -130, -230, 226, -141, 14, -17, 43, 78, -74, -230, 164, 154, 73, -283, -53, -36, 164, 128, 47, -229, -217, -50, -170, 102, 95, -177, -106, -194, 285, -141]
7569a41K04O2m14LJ37J38K77k13J02k73P4n0OJj49M87m28L92k85j53K53kK01p3
7593A56n07K68L18r2q2qr3o7L00q1J13r8J5K6k58J07j2J32m3j69o4N2J87n3j05
7618e8M4J25k94N7J79j35K04q4j07M00l06k2Q8j59Q7k19L29k07J1J26k99M34l93
7641a99J63KQ1j45J70j56K36Ro5O5p7j02J57N9j85N0Lj32n3L5J33j31j02L11l69
7666b42M38k19o3L07j16P6l5k95K75j21N7j96o8K71j38J13P0k62J55O6k38K30
7688F5kJ24l40R0j43J02K20J03j84O1M7j69J13j25k3L08l37K5K8L0J00J5q7j79
7712a58l9K12J17j68J24O8k55N1J16j55j24M17k11Q5j57J40K90l38N0J86m24K27
7734E4mp5K52j64k68L85p2M5k14j48J92j26J13K51j88ol9k20L8K08rK52%l32L32
$$ y = [-141, 63, 125, -289, -286, -149, -11, 266, 53, 155, -118, -44, -94, -88, -87, -236, 251, -177, 215, -70, -223, 30, 28, 229, 156, -351, -83, 235, 143, 61, 53, -40, -107, 193, 112, 225, 127, 142, 168, -90, 17, 5, 137, 94, -75, -139, -87, 100, 47, -58, -14, 111, -183, -126, 53, -82, 122, 38, -69, 331, 25, 3, 91, -68, 19, -200, 129, -78, -67, 59, -240, 194, -199, -36, -34, 47, -98, 72, -84, 152, 161, 96, 161, 84, -18, 139, 198, 13, 63, 66, -66, -119, -84, 49, -82, -184, 127, -242, 196, -23, -86, 221, 105, 181, 146, -149, 126, 5, 62, -134, -202, 69, -69, 44, 114, -148, 7, 73, -165, 65, 63, 187, -153, -63, -206, -104, 116, 219, 35, 96, 143, -26, 87, -38, -61, 247, -90, -65, -37, -7, 93, 108, 21, -158, -197, 15, 132, -36, 88, 156, -99, -48, 68, -87, -211, 206, -5, 80, -77, 63, 353, 15, 65, 251, -173, 54, 50, -25, 227, 63, -205, 180, 108, 153, -61, -209, -17, -143, -30, 221, 33, 27, -12, -232, -194, 14, 5, 257, 257, -75, 257]
7759B57k45k07L28l37J64K28k75J52l61L05l22K22l22M25q0J03j24k48M12j82
7779a07J54J21l39L54j24p0oM7K21k75Q9k18J46j42J12Kn4j35J91K7j44j7q4L83
7803A32l95L78J01k42p0j94M49k62j57L55k34l9L32j90R8J15j46J41r4j33r0P5
7825g0J52K0k74L79k14M8j56jK46l24K05m2R4j44nm6K3J37P7k11J39R8k11j04
7849a84K22P0k36p2J7J46J28j4k95L44r9L4q3n3R3j20P3J57j63R2O1mm3j31J65
7874A05j74K31k14j52J4n8J90l8M5p5R5Rm9J38l9j73J14K86j74j2l4rP3j17J65
7899A47Q7l21o3k7J41J92m12L44n5l1j24R5j56RL9M34m75K13j77J5K14m9j5l6
7923a1j06J18q0J40J49m92L06K43l42K4l5P2J0m0j76L73j27J54r4J42j72j0J22
$$ y = [257, 12, -195, 133, -204, -40, 188, -87, 65, -296, 9, -313, -91, -413, 12, -68, 35, -89, -337, 75, -107, 47, 168, -171, 183, 59, -11, -17, 30, 251, -24, 65, -153, -7, -149, -37, -35, -89, -224, -33, -6, -150, -167, -251, 132, -263, 115, 216, -26, -96, -290, 159, -103, -260, 95, -139, -178, 154, -36, 62, 177, 31, 172, 78, -55, -145, -70, 82, 102, -172, 207, -7, 41, -115, -116, 130, -194, 11, -31, 63, -81, -86, -132, -109, 28, 105, -106, 33, 131, -80, -184, 38, 108, -128, -200, -183, -37, 91, 77, -218, 126, 27, 61, -22, -75, 18, -102, -29, 128, -35, 57, 118, 114, 71, -60, 105, -69, 162, -52, -204, -190, -248, -58, -96, -51, -126, -31, -22, -71, 67, 28, -145, -31, 255, 81, 69, 35, 26, 99, -18, 147, 234, -87, -150, -177, -36, 156, -256, 88, 33, 2, -122, -27, -183, -174, -135, 299, -176, 37, -140, -125, 89, 40, 25, -11, -117, 1, -79, 61, 210, -282, 24, 267, -75, -51, -86, -14, -4, -44, -220, 153, 26, 180, 86, 228, 56, 46, 168]
7946A68l1q0j14R7Q4j73R8j8j07L37p8q6j27J09n1l3P4m4j00j44K90j25kj04K09
7971D9K1J23j57L95l89n1j16K28J29l82r2L28R9l47J56pj91J45J15m1J2J7Rk21
7995a68K41o2QJ55k79o8K44j01K40k82N3kJ94k47P8j33L77l07J63ln76M24oJ08
8019E1j61k73K98J85j88j3j66K55O6J58r4l9R5j07k89J35M2R7l7J31l98J45J83
8042G6k43n9l6N52j13k88k31L33j70J41j04N4J9K30o3j38j09J54J47k42Q9J54
8064A53N3j88N2P7j54n8K27l35N87l98q2J58J5l97J21J36j09J49k3Q2L0J32k40
8087a2j27K77j46j17K25j51j19K34p5j55J99j02r6K11j6J48j93j84K4K33n5O4
8109F7j47QQ6k89L66k52J99k03J56j99J50J63k75j22L84M8j54K4rl8R7j27j43
$$ y = [168, 137, 57, -57, 40, 124, -49, 49, 31, -76, 261, 183, 97, -30, 79, 28, -5, 69, 25, -75, -219, 71, -54, -56, -160, 49, 70, 193, 36, 431, 42, -9, -125, 103, 232, -150, -242, 86, 185, -162, -6, -13, -204, -59, 56, 15, 27, 44, 53, -168, 73, 11, 19, 174, -105, -173, 71, -30, 210, -72, -19, -21, 173, -74, 4, -129, 248, -59, 104, 101, -475, -51, -57, 51, -110, -383, -85, 100, -88, -101, -267, -12, 54, 212, 118, 79, 174, 67, -222, -87, -45, 52, 15, 146, -252, -107, 76, -167, -226, -262, 290, 177, -111, -342, -9, -179, -38, -142, -88, -69, 161, 98, -40, -149, 5, 152, -90, -1, 153, 206, 18, 70, 147, -7, -65, 162, -173, 414, 16, -66, 92, 107, -290, -169, -33, -142, 7, -16, 66, 96, 228, -12, -139, 138, -8, -125, 100, -51, -170, 64, -11, -166, 33, -69, -165, 46, 30, 178, -15, -199, -175, 58, 3, 67, -80, -72, 14, -275, 91, -161, 38, -165, -9, -208, -58, 105, -170, -292, 92, 140, -14, 10, 1, -37, 60, -67, -210]
8132b10K38K5J51l43K60k31Q2qp9L06j12K3m05M19k0l35j32K96k7J4K26j56k19
8155b37K03j57R3Q5j96J42j07K10o4J5o5J53o7l20J83J1O1Q4k63K87r0j55K21
8178B7r1J4K6k00J12J29k58L23m08K34J2L6j30
$$ y = [-210, 28, 53, 204, -139, 121, -110, -28, -36, -115, 191, 79, 102, -303, 116, 96, -239, -371, -75, -102, -88, 138, -18, -237, -34, -191, -98, -13, -209, -67, -174, 36, -28, -13, -78, 75, 8, -312, -129, -118, -57, 27, -236, 51, -39, -194, 27, -64, -50, -24, -224, -112, 17, -241, 82, -326, -92, -80, -44, -174]
8191a74
$$ Imaginary data points
##PAGE= N=2
##DATA TABLE= (X++(I..I)), XYDATA
0@%%%%%%%%%%%qJ6j6J6j7K5l2M0m8N6p2Q8j04J20j36J60j85K09k41K80l21L63
33A93m13M68n27N93o65P44q31R26j031J146j270J406j553J714j893K086k296K529
51A326k787L073l390L742m138M586n098N691o383P207q207R448j1040J3163j6156
66h963K0729k8660M6285j59921N7794J80652j90944N3551J39116q0736j16341
77h7438J45788O0923j00471k103P7070j01887q5294O9872J2308r2887M8597R5013
89C9491l4463m2318N5960K4240j1414J5372N838l3035j6371j4035k7447n095J8516
102b4761n417n25K7928r11k3295L6859L6001k5765Q582M2438m6482o4218L0560
115i006J7936n3065O39N3613j4258m1066L5583L8319k9392n39N2141p560m8181
$$ y = [0, 0, 0, 0, 0, 0, 0, 0, 0, 0, 0, 0, -8, 8, -8, 8, -9, 16, -16, 24, -24, 32, -40, 48, -56, 64, -72, 88, -97, 112, -129, 151, -170, 193, -220, 248, -279, 314, -351, 393, -438, 488, -543, 603, -667, 739, -814, 900, -993, 1093, -1203, 1326, -1461, 1612, -1778, 1964, -2174, 2412, -2686, 3005, -3378, 3829, -4378, 5070, -5970, 7193, -8963, 11766, -16894, 29391, -130530, -72736, 107916, -83028, -29477, 109639, 28903, -87438, 58350, 119273, 18802, 16699, 93769, -8118, -93412, -23540, -11232, -104119, -55522, 39491, 5028, -37290, 18670, 42910, 31496, 46868, 52706, 19671, 3300, -10735, -38182, -43277, -24761, -30178, -30703, -2775, -3686, -26981, 9878, 45879, 20114, 28696, 71134, 24652, -39566, -9006, 8930, -44135, -43496, 10117, -4141, -45207, -9624, 28695, -697, -1236, 50905, 43345, -4836]
128d836P884J0316l5437n584K9975m535k1424N015J2497o6M023J8969J3422r509
142B0710j3487k600n701j1661k008J2214O539j3086p823J6749K541j3368K0697
155I716K4402k3125j7531J5826q396k6639J2145K2863j3932j3072J9982O129k0512
168a2144R724L0243r072j7826J2299m830k7691K280J4930o586l497J1068J768
181F66p538L075J3318N201o69J681m296j2027p075n584l334Q761K990o456O690
196d597P010o452N652J7972M4p614K916m405j8942q077R104l68j0530P287J1371
211C71r632k181K0128P643o097Q065L244j5446j1153J527k017p816J266P116l941
226h923p103Q869J0944J085O538R904l752r815n062l820m425k901R07K158n000
$$ y = [-4836, 3048, 13364, -22073, -27657, 2318, -2217, -23641, -18626, -6129, -6195, -2172, 16797, 30219, 20710, 7223, 4623, -1078, -12739, -14747, -2533, 4006, -9080, -16903, -154, 2387, -10981, 9716, 34118, 10993, -6538, 9288, 892, -25747, -13602, 9261, -4671, -17743, 2239, 8368, -12144, -2420, 27823, 18751, 925, 13224, 8394, -19297, -17017, -2087, -8673, -12170, -1102, 666, -6872, -3797, 9521, 14722, 14053, 15734, 11438, -589, -7664, -13248, -16582, -7821, -4831, -11287, -4597, 2413, -4039, 1613, 19585, 19629, 12015, 14931, 10526, -8416, -16493, -7389, -7757, -18287, -11000, 371, -9261, -11442, 8686, 16329, 10232, 18297, 21541, 6095, -5058, -3531, -5548, -13364, -12098, -4982, -8923, -16026, -7157, 3787, 4872, 11410, 21314, 17562, 7747, 2685, -1135, -5560, -8461, -7554, -5396, -10396]
241a0396m425P301N725R84R517R444l046p029l019k503n104m407L536R47q152
256a0627j391N557m51K550J2343N566k694k453j612m670n584l57M225j821o437
271g856M11J054k029L939Q854M701M00j597k031l502n555j5M460k569n438K529
287d244K55m358L555Q207M277p67k48J38m936n792K503K157m174n92K609m245
303e655k299N613N051K344J345J172j532n015l166J115k39k087J058q63l220R59
319e419K812L052L719K293O54q52m387l009J390j280j709R32j023k758j03J897
335c791L176L563J672K500j600m649nK22k877M06J469k531k836O55R06K162K705
352A147L223J576k138k299L09k154j684K685k03k912j096jk88J750K179L630K017
$$ y = [-10396, -14821, -7520, -1795, -811, 8706, 18150, 15104, 8075, 5056, 2553, -2551, -6958, -3422, -2475, -10627, -12018, -6461, -6912, -4362, 7981, 13547, 10853, 8400, 6788, 2118, -3466, -3823, 402, -1419, -7856, -7445, -6391, -8420, -4481, 4373, 9074, 9474, 7877, 5846, 2344, -3211, -3226, 1234, -1335, -6773, -4244, -3989, -8347, -4792, 3415, 7692, 6925, 6677, 6815, 1879, -3913, -1410, 747, -3427, -4019, -1410, -5655, -7954, -2341, 2710, 5054, 6399, 7571, 6039, 1024, -2142, -1027, -1266, -3353, -2295, -3158, -6378, -5419, -2607, 445, 4164, 6457, 7111, 6259, 1872, -1137, 253, -1027, -2736, -1804, -2827, -5585, -5688, -3791, -615, 2948, 4620, 7120, 5520, 871, 866, 1088, -1789, -1383, 86, -2445, -5281, -4626, -3720, -1558, 1147, 4370, 5946, 3808, 1509, 1818, -336, -2020, 665, 462, -2450, -3546, -3547, -3835, -2085, 94, 3724, 5741]
369E741k556j543Ok330j045J916K46j871j039n18P19k60J878M447Q30k973L21
386A969K14l453q03K263L08j753o07J94l94q50K902L970j186p43J303k251l456
403b373J070J316r09o24n3m41m09L43K478K786j34K19M9k521j782M1L0l33o0r33
423b240J98n78k41L452K130q7Q82K81k589j344m81k73k93m62j69m32j535J322
441b459K695R55J037K203o23k188p73o58r46Oj59n65j233r86J195J206J041K614
459B362J504j075p92n05q30q4n35l2l05j817j561R97R25m0K346K373o10p62J38
478A697n11j013k36J441j039k486j89Q29j209L43L482O39o28M68K91j542m96J238
496A079L66j506p80K76j247q26J642J249P2O43L84j196n2J50j89N33ko05n06q33
$$ y = [5741, 3185, 1642, 1648, -682, -1727, 189, 435, -1436, -2475, -2993, -2274, -2534, -656, 3791, 4621, 1648, 1969, 2183, -1270, -2073, 190, 498, -1255, -1862, -1668, -2062, -2912, -10, 3960, 2774, 2031, 3334, 1083, -2373, -1303, 13, -896, -1520, -1573, -2014, -2423, -2080, 398, 3184, 3050, 3269, 3318, 797, -985, -944, -914, -1247, -1307, -2240, -2042, -2620, -2861, 591, 2721, 2634, 3516, 3797, 1208, -136, -617, -890, -1183, -1645, -1814, -2246, -3781, -2459, 236, 1191, 2228, 4431, 3808, 1620, 847, 189, -757, -751, -910, -1475, -2708, -3694, -2499, -1293, -252, 2362, 3866, 2791, 1999, 1494, 664, 580, 45, 13, -292, -2109, -3670, -2673, -1748, -1788, 558, 2931, 2321, 1559, 1697, 1186, 173, -63, 1378, 339, -2147, -2336, -1507, -2716, -2373, 1109, 1748, 1120, 1588, 1879, 337, -159, 1079, 1445, -61, -841, -565, -1812, -2638, -996, 253, 325, 968, 1352, 156, 104, 254, 65, 598, 596, -9, -515, -1348]
516a348l10N50J243N96nm58K22o80r28J247J089j146j68P38j421q96J261P86L04
535F76K29Q9p41j378K74J281p00q8P43m9j725N94Q74j85J118Q11p50j014j31m62
555e34%O0P95j61o56m28L37N9M13J091K31n6l50o13o60J88k45N87n5o27j42J6
577g50K3M68Q05P64M55j183m21J19o56l93O62K35p35j73j00J55J35J002J047l60
597A099m84j11k75p27K31Q36o75o52K76k55n89O99Q49R04l83J56m1n19q51P09
617A97K78q53J1j14l56k25L96P33M99K28k16k66j76o3J74k71o8L85m84m83q3L85
639c72P8J056M1l75K7k71n95K67K86Q6k06j68J8o14J03Q14J00Q8O06r3j039J68
661Ej41%j0K98j39m19j08l9L19L74O71qn05k94L56l83k41N87l91l69K1m2L9K00
$$ y = [-1348, -1658, -1108, 135, 731, 726, 268, 490, -190, -1118, 129, 1218, 72, -96, 642, -779, -1675, -414, 372, 676, 905, 994, 253, -1125, -851, 430, -270, -358, 385, 336, -1389, -795, 79, -106, 1012, 1823, 1073, 59, -72, -534, -534, -474, 321, 160, -496, -924, -587, -528, -115, 976, 1207, 1151, 801, 188, -472, -284, -529, 58, 3, -624, -766, -750, -727, -259, 546, 1310, 1765, 582, 161, 280, -376, -769, -107, 128, -607, -780, -880, -725, -590, 412, 1459, 1099, 615, 504, 229, -498, -267, 569, -106, -758, -482, -737, -1326, -627, 222, 1126, 743, 899, 858, 339, -512, 197, 475, -378, -367, -481, -837, -1062, -666, 67, 566, 794, 578, 312, 136, 73, 247, -24, -92, 293, -191, -674, -757, -372, -294, 762, 803, 428, 455, 184, -411, -144, 142, 228, 22, -146, -128, -742, -639, 175, 275, 363, 969, 876, -163, 5, -136, -136, -146, 152, 13, -406, -514, -553, -234, 140, 811, 803, 298, 4, 360, -23, -264, 323, -68, -437, -416, -458, -419, -219]
685b19J35L77J57k63j78L5q2J32K67q4m43j32j23l24K58L10N78L98m90J36q0k68
707I7r4jK69R4k84j33m52L1K85L88J58j33j80j49k70J81O22m38Q7M2j77k53o7
730c77L38K20O6j39P5o84L76P8k81N24Q8n01K24j04p3m9L59J73k11J59k76O2j31
753h4Q4R2O6J77m19l36L30K21J07k34O69o60J2m5k64j9N29k6J4k05m82K22K55
776Dm7K87L96k25m73q3j77J64Q0J30L23n17k08J72r0M61L09J21j82k63l33J0R5
799d6j38J05O6lj62K4M0J57J11K73j2k55l20k2l48N08J77l8k16n2j75J72J00L20
823B66M2J81k17m06l47N29j86N1J17r4M4K0j39K29Q4M08j62o73P2J40l60K89R5
846a7J18j24p0k20Q4L37Q2LK72k40j20k18l7m9L00k11o2M06m73J89o6J88n5L90
$$ y = [-219, -84, 293, 450, 187, 9, 44, -38, 94, 361, 277, -166, -298, -421, -745, -487, -177, 401, 799, 309, 445, 365, 97, 3, 2, 271, 365, 81, -52, -504, -473, -188, 200, 358, 225, 45, -104, -374, -193, 429, -9, 78, 120, -57, -310, -377, -39, 181, 247, 108, 183, -501, -125, -47, -328, 196, 284, -217, 7, -97, -170, -219, 140, 313, 102, 261, -15, 47, -84, 0, 92, 158, 335, -84, -420, -90, 131, 238, 4, 673, 13, 25, -20, -284, -303, 226, 200, 214, 9, -473, -251, 4, -43, 244, 640, 415, -58, -141, -318, -154, -74, 56, 379, -138, -346, -174, -264, 197, 506, 627, 445, 182, -151, -141, -46, -184, -79, -13, -16, -178, -154, -114, 43, 154, 427, 415, 160, -160, -182, -530, -22, 155, 117, -99, -151, -326, -154, -54, 266, 308, 489, 272, -134, -481, 48, -138, -87, 30, -64, -20, 0, -139, 90, 174, 582, 420, -253, -181, -41, -401, -112, -17, 101, -23, -93, -313, -229, 108, 190, 193, 465, 225, 105, -113, -150, -199, 101, -110, -172, 234, -239, -50, -116, 72, 17, 407]
870D07l85q5j32L4j06MJ69K86O5p19K21r7M92K7l6Lk07q4Rn9m3O2K77j93k67M07
896E0J21l46L93P2r8k97n5J79rr8L65j79l45K00O9O4q6L32m37L86l02o7Q3J33
920A28j93K61j84qJ92m78m3J46L42o8L39k06o82M45k46J36K63J5L0j46j08K3m4
943h6j28K10k4r1L4O5j71j15K80J59j83M08o2j21J57k56j61RK29p9l73k68O69
966A02k96P7M37n67R5O13k28j47K98l65J44J01k73j87k65J60K77J00K3oJ22l34
988a19L73P1j16L05m01l20l17N57k17k46M22K70l59K25J71R6l55K45J91l89k66
1009a79K49l12k48L30j89L5J47J40P4j19K11K63k47J0J12l45j45P1Q3l27K07M1
1031a38r3K67J10l94M83J11k40q3j0O8Q6l53J7J26k77K30N7k4m0L85j72K05k37
$$ y = [407, 22, -63, -195, -161, -267, -263, -94, 192, 257, -462, -241, -338, 154, 181, 145, 148, -59, -143, -134, -193, -236, -174, 103, -90, -357, 50, 171, -175, 218, 290, 192, -105, -160, 19, 10, -88, 277, 98, -247, -47, 22, 86, 0, 332, -105, 281, -21, -88, -5, 128, -65, 196, 12, 4, 196, -282, -325, -179, 163, 95, 434, 228, -454, -9, -255, -119, 144, 159, 189, 43, -65, -42, -86, -214, -4, -28, -119, -85, -20, -191, -306, -26, 133, -50, 358, 296, 175, 332, 76, -85, -76, 153, 74, -299, -567, 102, -194, -117, 320, -247, -152, 461, 233, 86, 384, 19, 163, 264, -9, -196, -461, -301, -24, 76, 99, 93, 215, -119, 254, 325, 209, 514, 113, -207, -524, 33, -184, -430, -8, 262, -97, 128, 299, 395, 40, 285, 476, 87, -179, 70, -242, -490, -160, -349, -314, -167, -27, 47, -72, 139, 402, 155, 165, 277, -68, -213, -142, -59, -386, -179, -138, -231, 36, 146, -248, 235, 346, 106, 23, 13, 81, 167, -186, -169, -43, -320, -90, -33, -57, -97, 288, 116, 321, 84]
1054H4N3j86q1j0J1J85j46p1J21j36L08l79J91L44j73j02J03j81r1L84P7n61O0
1077a96K88n25M96l1k55J00K42J84l38N5J02Mj54j7L76p21L95Q2p6K5M2p5m43
1100d40M35K8J05l14L99M0p5k3Q8k78J97M2m9k46M10n13j76O95m47pL48l7m9j8
1124A15K8K48m94J47j80o4l77N59k88o9O22J71l45j81O66l26m00K83J89l47j64
1145b07M35l24l77L65kQ8o7L40k61j03K04N1p9K58k03k91J03j84J06l4J99k56
1167b39L78k94O60k09l79K99l1l97L85k77m27N13j26j75Q5L98k01k1m7N68j47
1188C16l94L54j28m31m3J10j6J95J83l78L12J6J49O3o1n8P1K40q01K79l05J68
1210a59J63m02J18K19l19L70K02P1j92L18M9l79P3k67L5qJ05k22J44J00K27L2
$$ y = [84, 137, -49, -130, -140, -129, 56, -90, -161, -40, -176, 132, -247, -56, 288, 115, 13, 116, -65, -156, 228, 305, -256, -196, 92, -433, 63, 32, -223, -123, 119, 303, -35, 20, 122, 126, -28, -45, 331, -390, 5, 87, 11, 36, 78, 3, -440, -5, 23, 128, -186, 213, 253, 178, 155, 243, -35, 162, 204, 155, -91, 319, -194, -370, 325, -122, -129, 219, 182, 133, 115, 143, 391, -103, 44, -136, -200, -577, -18, -306, -375, 247, 418, 73, -108, 558, 232, -168, 115, 304, -43, -207, 228, -96, -473, -108, -110, -22, -89, 251, -10, -113, 91, 142, 63, 321, 118, -173, -70, -254, -148, -182, 17, -239, 139, -155, 505, 296, -83, 216, 185, -212, 173, -104, -531, -18, -144, -319, -234, 164, -37, -58, -105, 463, 316, -78, 276, 148, -283, -326, -216, -232, -37, 146, -232, 80, 96, 245, 308, 247, 189, 260, 500, -301, -22, -327, -159, 4, -398, -280, -61, -380, -10, 192, 263, 71, 389, 438, 59, 132, -135, -100, -108, -3, -225, -81, 19, 246, 278]
1232B78l31J01J22k39k9J31j66J65Mk12K54ln1k72K67j7r4L06k63J37Qj47j10
1255a61N4K33j40j15J57j44K11J86q2j07r6L1p8l0j15K58K5M1r8K01k58j36L87
1278B24k16k43N54j56l32l8L96k13m6J25L28j66k10p7N5J86k81K25j85l13J54
1299b29J54k36J40J15k0M99j97j57J1P7l04J56Rl0j72K05q5L8J91N8kk64K14K67
1323D38l29J99rj87k14l7k39J26L16j34M96l53J53J2k51J97J81m58kJ70j0p9k25
1346b39L04j2r0jj5K55j72K12l0j03j93J16j24K60l05j91K82j89N0L21J35k91
1368b0J57l4K31m76J62J47l06m3j61J46QJ90J06j64K86l0o2J80j16K1l36K92k86
1391a08j69K27j52K34M4Jj05L14l69Q8O6o0Q9o1J29j61j31j04R8J88l67J95J57
$$ y = [278, -53, 48, 170, -69, -98, 33, -133, 32, 36, -176, 78, 75, 24, -248, 19, 2, -92, 214, -49, 88, 96, -51, -161, -107, 126, -14, -129, 28, -116, 95, 281, 199, 92, -4, 27, -51, -81, -196, 62, 87, 128, 30, 231, -27, -163, 224, 8, -235, 319, 163, -169, -207, 189, -24, -70, 55, 383, 217, 7, -70, -15, 171, -110, 115, -70, -383, -229, -75, -311, -171, -56, -76, 423, 226, 69, 80, 157, -147, 9, 18, -12, -184, 21, -64, -26, 165, 223, 221, -43, 171, 438, 109, 308, 299, 112, -102, -139, -378, -252, 64, -70, 426, 73, 226, 238, -13, 184, 365, -93, -95, 75, 65, -14, -239, 65, 53, -37, -38, -53, 202, 30, 242, 212, 109, -84, 32, -92, 168, -137, -328, -46, -235, -185, 136, 271, -20, 137, 103, 334, -142, 20, 167, -139, -182, -343, -197, -189, 1, 107, -57, 229, 199, 137, 317, 201, 222, -114, 178, -108, -277, -50, -202, 32, 76, 77, -28, 286, -83, 5, 71, 11, 100, 39, 168, 7, -124, -228, -130, 58, -309, -114, 43]
1414D3j97K65J67k71J92k6r2j5l79J79L03l24J06J27l33K40k3k1K73l55J19O5
1436D3L4L6m6pk45K56O3j47j63L43j69j53J87k16L57j03j2l4J7j17J77k97J40
1459e6j4p1LO9K39k04j00J50JM27n03J51n4j13O8O3j32j21R4j41J91j87J56j6
1483a00j88J78J65q0K25j86m9O3k8R5l00L11q1k43N1r1M00k69J98K86j94j23N6
1506I6o5j74Q4J75m21lM60j61l8q5N6J94l6j75J89j39J5K6J53m57L75k66K16K42
1530B61m83J37K0p4L67q6k05J02J37j84J27L6k72K99k01j65J27Po2K95Q3k30j12
1553g6L58m38K13k5Rp2l1j46P6l50L31K34p1J46L24j03k40%k17j61L86p1k66K03
1577A3j68K96j38k76K71K4K62O2l13Q3j95K6p4L56k37j58J41J42l14K00j23M0
$$ y = [43, -154, 111, 278, 7, 199, 173, 81, 66, -313, -134, 169, -155, -49, 78, -255, -15, -38, -59, 214, -141, -22, 43, 77, 113, 67, 60, -185, 71, 134, -13, -176, 167, -2, -155, 32, -184, 173, 70, 58, 24, 41, -76, 101, -196, -56, -70, -141, -138, -69, 170, -34, -134, 16, 17, 444, -59, 92, 38, -75, -7, 56, -76, -197, -103, -244, -53, -240, -84, -100, -288, -110, 55, -25, 200, 14, -35, 28, 0, 95, -205, 106, 25, -218, -167, -258, 142, -127, 71, 357, 163, 40, 96, 31, -143, -59, 116, -305, -308, 152, -9, -47, -132, -76, 118, 82, -93, 96, -43, -28, -2, 151, -306, 69, -197, 19, 261, -222, -85, -65, -139, 228, 142, -63, 39, 176, -8, 119, 155, -117, 182, -19, -184, -57, -50, -112, 183, 266, 36, -76, 282, -156, 57, 32, 41, -31, -62, -208, -132, -482, -151, 83, 12, 158, 482, 379, 139, 139, -78, -239, 147, 76, -190, 13, -155, 141, 3, -273, -2, 22, 284, 346, 33, 116, -79, -53, -127, 229, -8, -166, -25, 117, -197, 3, -120, -80]
1599h0R6K03k07R2P6n2j77k17L98L6l61K27N1l72K05K53J82l27j32J46m1m7M7
1622aR2l07L72k36r3r7L50o5l8J75j7k91L96K61n64J88l82M8L13j6k05L14m22
1645b25L57k26N2K7j98K22K04j51L7k6P8N7m0j44J35l33L06j48j30k23L60L2K3
1668D6k36K30j70K12p7K13k60%lk00L61k66J69j47m34M69O3K06mj91K0q9J07k19
1692b00Q7j16L14n5k37rO9J42J75p0k27L49j17j06j27L90m18K04n1QJ4j00J3n
1716g3J61J64k13K4p5J9K08l65K04j0L4L6j8j05k46N1L13q6j66J12L18k06r6N08
1740D93n92r5KL62j38M7k92J93R4L8J4P8j11J90j23j30K1J11j56k52J32Jj15J77
1764e1L16m55M64k54k22L40j26p9K5K28r1r2m63N01lq7j26M37j48Q0o5Jq3j15
$$ y = [-80, 16, 219, 12, 104, 180, 128, -49, -266, 132, 168, -193, 34, 85, -287, -82, 171, 353, 26, -106, 40, -1, -48, -1, 91, -216, 156, -80, -173, -270, 80, 15, -23, 152, 135, -156, 240, 501, -63, 125, -257, -209, 104, 88, -117, 197, -225, 132, -94, -42, -15, -213, 9, 213, 62, 99, 73, 151, 208, 168, 24, 159, -174, 132, -16, -146, -369, -9, 23, 46, -190, 40, -130, 82, 5, 218, -42, -42, -45, -245, 116, -150, 19, -128, -562, -93, -30, 176, 172, -19, 1, -88, 19, -200, -113, -229, 85, 30, -207, -216, -147, -5, 170, 100, -127, 222, 105, -1, -128, 262, -156, 48, -3, 5, 19, -81, -68, -73, 88, 252, 39, 63, -12, 7, 215, -150, 54, 44, 78, 114, 96, -9, -255, -204, 109, 23, -143, -31, 287, 81, -15, 493, -99, -194, -192, 170, 32, 79, -213, -20, 74, 112, 126, 204, 93, 283, 160, 30, 51, 162, 6, -246, -114, -113, -228, -51, 265, -190, 274, 20, -202, 138, 12, -67, -42, 186, 95, 3, -460, 41, 38, -49, -175, 262, 114, 194, 129, 130, 47, -68]
1788f8J47J13j66m6J2J9j99K72j07N7R2l05L10O5l67J28K2r5Q3j3O5m1k00J38
1812h4M0LJ54k56K77l8M2k67K53q9M4Q0K1m17K5n0L62k48J21l0R6k23J38J10n1
1837A3m7j91K30j02J24N5K18m67K94j15Q5K14k56j79J90m0pRj20O4J61K04o78
1860c41J42K58J54k54P8K98m08O9J25j54Q6K24J3r8K8k68j51K10j59R3q2M48k28
1883H3N3l30L57k31O4n8n9J42N8j05M6j73P4Q8K92l29k39o1M33j43m4J6p6po7
1908b16J20L1Q7j05r5J07J27j13J01j10L63l97OLJ69j06J30j50J24j96k9J77K99
1931C27o36K42J52o3m9J13M7l63J00J09j40J79j78J31m3J06j81M8j53K45k2J78
1953A49Q6j25j6k77P0O4J98j83L92l95k9Oj59L3K4L03j03q5m7J57J14K5l01J08
$$ y = [-68, 79, 192, 26, -20, -8, 11, -188, 84, -23, 34, 126, -179, 131, 196, -171, -43, -21, -116, -33, -46, 19, -22, -222, -84, -44, -41, 113, -143, 134, 96, 138, -129, 124, 35, 79, 159, 180, -237, -212, -262, 100, -148, -27, -57, 39, -184, -46, 64, 13, -34, -225, 5, -97, 27, 82, 300, -167, 127, 12, 97, 311, 55, -124, 66, 26, 19, 28, -92, -28, 133, 337, -341, -199, 59, 213, -41, 37, 335, -73, -4, 121, -33, 53, 277, 290, 192, 220, -48, -199, 11, -148, -55, -137, 311, 83, 136, -194, 163, -68, -4, -62, -121, 21, 79, -26, 20, -153, -79, 9, 301, -28, -267, -328, 105, -38, -82, -66, -142, -149, -216, -96, -65, 22, -83, -178, -71, 56, -57, 44, -66, 297, -100, -94, -91, 78, -28, 102, -48, 76, -120, -149, 28, 327, -309, -67, 85, 22, -27, 86, 133, -230, -130, -21, -161, 18, -160, -29, -72, 34, -147, -99, -252, -7, -29, 149, 235, 110, 94, -183, -113, -49, 149, -34, 358, -37, -66, -60, -219, -186, -162, 141, 38, -47, -94, 63, 177, 202, -99, 9]
1977IJ6Q3m0P4k08Q8J62k76P2l2K52k03k66K00K8m9j21P0J68j21J40K7rQ6rk42
2003a01J77j89k1J86K12k46k65J07J87j46K09p8k57L94P6l13p1o2J08J3RP4k05
2026b02J89R3L1J11m17J00K50k17R8q4Q4K2l09K58k02M26r7R3m91J14J02R4Q0
2049A26q1Ll15L47k82R2M78l94j90J71K1o7K11j73R6Jk08K72k61J45K21j21l16
2072b24L14j6j75j35O04l89L55n17J44r2J57J22j78J33r6J33q9O2p6J57k80k7
2094a13O5k7K62j45nK1n5J26j14J23l11o7L50l35m9L94m68N99r0j74Lk28K32R8
2118I2Nj60O0N7n6L91n20n0NK25L4j73J23m1O2J91j73j05O9n9J75j81J68o3M6
2143A22j10J8k70J76n3j21J45M33l64K39l90M9K57k12M8j85K12j90K30N7j87K26
$$ y = [9, 25, 108, 68, 142, -66, 22, 184, -92, -20, -52, 200, -3, -269, -69, -41, -90, -211, -141, 27, -94, 46, 73, 64, 150, 141, -101, 76, -113, -134, 52, 264, 18, -247, -140, 47, -99, 110, 32, -225, 169, 245, -68, -139, -201, -93, -80, -71, 3, -202, -13, 80, 111, 222, -195, -95, 155, -62, 36, -48, 36, 58, -251, 7, -195, 231, 134, 227, -264, -150, -48, 46, 126, 45, 48, -267, 80, -202, -110, 368, -26, -216, -45, -24, -91, 120, -53, 43, 44, -164, 108, -153, -8, 213, 92, -224, 90, 74, -101, -236, 368, -21, 334, -183, -39, -131, 26, 148, -30, 103, 7, 140, 51, 113, 37, 194, -86, -113, -48, -75, 187, 42, 37, 58, 3, 129, 15, 138, -173, -240, 110, -225, -274, 120, -348, 251, 161, -13, -10, -238, -6, 92, 97, -63, -3, 54, -2, 389, -131, -181, -176, 49, 83, -90, 33, -8, 54, 245, 72, -33, 36, -23, 152, -29, 139, 76, 122, 12, 30, -240, -64, -117, -238, -93, 340, -24, 215, -175, -126, 131, -81, -33, -218, -6, -196, 34, 91, -96, 130]
2165A30j47J80m46M52j47J34k21J91k16m1J01o3j3N8m8q8K27J68n9j59J21l87
2187b73K89l39L16k37L10k10J94N4j53R3k8j61j6K77m88M25j92L00l27L15Nj38
2209A6k7M6R7j97K49j53J1j33j7n3O6l8J46L5k46K55J8j72M7L1L6l4L7P4J32k55
2235b9J44j13j0j61N7K39k38J60j31R6j00KK74l02j19J01Q0R1k36K34k4j64K02
2258E3l14K26R7n8R6m08M26n3j13R6m22L25J8O2nl29L92k61R5J29k74L45j40j21
2282a38L18n13L55N5m0Rr7L7o3N9K59m0k10P9j40J77K3j36K06nl50l9Q9K67j15
2307D7O3j75j89R8l0lJ77L4j2J8K02k59J44j18j11J89j77K17k81J75j21m3L44
2330A89j57Q8k21N9j0j76J07J01j5J27L3k69J33Nj53J74k27K05O5n4j71J33Km7
$$ y = [130, -17, 163, -283, 169, 22, 156, -65, 126, -90, -131, -30, -93, -106, -48, -96, -184, 43, 211, 152, -7, 114, -273, 16, -323, -7, -244, 66, -144, 50, 104, -49, 44, 16, -145, -161, 116, -372, 53, -139, 161, -166, 149, 154, 16, -11, 35, 132, -65, 184, 31, 42, -91, -108, -161, -95, -133, 13, 48, -198, 57, 75, -97, -50, -19, 17, -17, 20, 94, 226, -29, 115, 2, -8, -169, -112, 127, -111, 49, -82, 14, -86, -84, 190, -112, -231, -130, -50, 41, -195, 39, 15, -149, 53, -261, -35, 62, 4, 100, -308, 118, 65, -48, 48, -374, -49, -31, 31, 26, -303, 89, -172, -77, 52, -222, 123, -17, -138, 180, -333, 22, 77, 37, 46, -51, -14, -77, -18, 241, 201, -9, 70, -70, 107, 130, -6, 200, 195, -155, -194, -105, 162, 47, 110, -65, -254, -156, -186, -189, -12, 22, 10, 28, 230, -29, 115, -3, -114, 75, -102, 115, -166, 9, -112, -155, 189, 32, 120, -101, -42, -52, -228, -121, -20, -35, 92, 125, -144, -11, -6, -159, 15, -212, -7, 58, 4, -167, -34, -32, -79]
2354g9K79p8l27J52J56j6j23J29j99J56J24k27K34n19K56j00K67k72P8j37K95
2375D9M1k07N1j87K06n7M6K05l7o0L86k93k25K76j43L8j9M3k61n1J74J66q6J60
2399B15j05j97mK61l01J30K09K3l38J41lL74l83J15j53J47l8n7L3k8K2K4k3k99
2423b35K14M5j98L88m25Q2K94j52j49L05k32J35o4o2L38m83L16r2rj06J28k2j70
2446a54J77j00r7K01p8j4K7M7L8o4J81j65j9J24j8j51J32K79m67J01K13m06K06
2469go4K57j47j21J99q6k5J5j56N7J5J9J52k58K05J00j02O6j86K96k34k14K7J02
2493i0L45j84k93K63P1j17r9P7M1J3j33J86M6j59Q3j94N9m0K16k34o3L76o3k36
2517a29J21qp2K8K5N1l19L51j36J25k28K47Q1j0l4m3q6J2J10o2j26N9L16k44K07
$$ y = [-79, 200, 122, -205, -53, 103, 87, -36, 93, -106, 50, 174, -53, 181, -338, -82, -182, 85, -187, -109, -246, 49, 90, -117, -66, -253, -47, -104, -58, 147, 110, 50, 436, 143, -82, 194, 51, 89, 70, 113, -148, -199, -25, 141, 55, 215, 110, -87, -91, 170, -131, -1, 208, 231, -107, 34, 31, 405, 22, 137, -16, 131, 93, 36, 69, 41, 63, 87, 64, -235, -21, 24, -174, 214, -211, -129, 165, 13, -136, 169, -63, 72, 8, -54, 284, -199, 117, 25, 16, -90, 38, 16, -154, 23, -77, -174, 27, -51, -65, -38, 9, 47, -17, 164, -1, -20, 104, 86, -65, 67, 346, -121, -20, 193, -213, -7, -71, 186, 39, -82, 117, 31, 6, 21, -135, -78, -63, -44, 108, -150, 55, 155, 53, 119, -67, 229, -5, -219, -192, -90, 255, 71, -222, 41, 112, -5, -104, -27, 14, 27, -106, 80, 126, -33, 50, -144, -85, -125, 91, -143, -206, 170, 107, -129, -8, -16, -88, -60, -35, 16, -303, 48, -88, 37, -191, 56, 137, 127, 93, 50, -36, -24, 86, 24, -102, -43, 273, 29, 236]
2542B36k71j30j9K2%L27J9l8k38k3R6M6r8J56k76j0N8J91P3qk83N0J28k36N53
2567C25o74J99j29J32R0J2k0Q9k34K59R0j25j30J82Q0j05K4j73K76L2l01j50K98
2590D7Q7l61L49r7j46K42k7k91L03J68l30k32L19J0k70K98j1K30l67r0M54k46
2612C9j92M6N3J59p0K07k09L5j0p0R0l00j32J94L66k83l2J79K54o4l45K4J54J50
2636B43p8j96j35K25k17K02l46K52r8J41J66o7j1k1K04m1k44J54q1J0j49O9l4
2659e2K1K00j40j81L85l57L74k70l6j69K12j55m7R7p1L61j6j76m3j97K95k31k29
2682d25O34k49o4j72L54j23k6K09k88K36j89J87n5J92N7n7j26pj92J22J72j2k60
2705h2j18J54L33l33m2o1lJ76J44k00K54l01K75l06rK89k76n5Q8K20J3j46J42
$$ y = [236, -35, -165, -184, -162, -162, 165, 184, 146, -92, -115, -19, 27, -71, 85, -191, -201, -143, 48, 121, 113, -170, -120, 8, -228, 325, -349, -150, -279, -147, -57, -45, -65, 24, -210, 49, 139, 14, -116, 66, 146, 41, 65, -108, 168, 200, -101, -251, 47, 134, -227, 122, 25, -121, 121, 94, -197, 106, 274, -56, -288, 31, 41, -229, 69, 58, 288, -79, -169, 285, 39, -153, -107, -54, 105, 35, 242, 33, 68, 58, -12, 78, -222, -354, -160, 206, -77, -109, 70, 324, 260, -85, -61, 93, 243, 165, -31, -166, 59, -158, 44, -302, -50, -148, -7, 159, 92, 81, 60, 264, 223, -21, 133, 52, 62, -87, -18, -52, -31, 169, 29, -152, 233, -124, 250, -20, -56, -225, -13, -168, -215, -118, -189, 172, 156, -20, -63, -260, 35, -196, -425, 209, -40, -104, -276, 78, -45, -71, 138, -150, 86, -103, 84, 29, 221, 278, 221, 95, 88, -104, 18, 190, 178, -82, -200, -46, 287, -46, -88, -149, -152, 24, 168, -32, 222, -79, 196, -110, -119, 170, -106, -161, -73, 147, 160, 14, 156]
2728A56r7j57J69q3J38Qn9j2n2k15J43j3K70j43m4j48o8M31j06o5J24Lr4J65m08
2753a57N8Q7oQr2J16p5N7J26k42J96j70J3K2O4J18k23L79k33j7k5L5J4J52q1l27
2779b03R7P4R3l49M48j12j2j72J06J52J45R7j25k75K68j77j95L72k67j66J14K91
2801B04j99l31K57nJ48J30q0P8ok46k5Q2K8J66j55j71K73m8p8j52O2J02J61k18
2825b3n1J76o7k0L4J73l54Q4J2K95l37J53r8K5J21m3j82L2P2R3N3j23L6J59k61
2850d1J30R9m59L61r2j55J20Q3j38j32K04R2l5m9K38k15J6J47k7m0q2J2M4lnm1
2876C2q6L42k99J12o2O5j04K5J94j74m0j07K82j66M7J7k39L47j18j01L3J36k91
2899a55L08n17K72l9O6k02J27O1n0K63Kk48K21m9j05J80k02n6R1L1P3O7k47J92
$$ y = [156, 59, -98, 71, -12, 126, 134, 75, 63, 11, -204, -61, -74, 196, 53, 9, -139, -207, 224, 118, 53, 177, 180, 86, 251, -157, -99, -12, -18, -10, -102, 14, -61, -4, 122, -120, 76, -94, -81, -59, 5, 123, -100, 279, 46, 29, 4, 39, 53, 205, 124, -203, -106, -32, 61, -288, 160, 48, 36, -136, -30, 122, 267, 364, 239, -36, 232, 55, -140, 232, -35, -201, -87, 204, 5, -326, -69, -74, 74, 204, 124, 202, 196, -50, -75, 7, 35, 201, 46, -125, 148, 100, 22, -130, -68, 34, 195, -23, -74, 102, 35, 15, 49, 222, -132, -48, -36, 259, -78, 75, -23, 2, 123, 80, -102, -70, 2, 95, 148, 25, 61, 220, -41, 89, 188, -271, 90, -2, -157, -37, 46, -92, -224, -20, 72, 37, -12, 226, 11, 27, 174, 147, 107, 25, 37, 81, 78, 73, 32, -54, 288, -11, 101, 39, 104, 0, 25, 219, 45, 5, -102, 180, 14, 61, 78, -161, 186, 68, -33, 0, 136, -155, 153, -364, -92, -131, -65, -267, -140, -79, -129, 134, 136, -112, 109, 60, -45, 135, -67, -123, -32, -1, 72, 139, -108, 84]
2923H4k74j35J82K95k02R5j39P8K06j74L6l05K65R9j04K6m2L4K20k79o8M0O0R6
2947I4K2l04J47J8J07r3J09j90J41l51L73m2j67r4M5L92n71L74l9J18p2l5j82
2970b00J62l5J60L4m29L15M3j59K48p5K6J3k00J89Oj37j03R4j96L04J14j09k40
2993a75J60%p5r5J10N3M5J6j05K4Q7k7N1J51r2K13m03M3j85K10J72k44o6J45j28
3018a15K71j84p4J27k18L14j48j91K35j37R6J11j76J40Jk36L29rl31J1OL06r3
3041C5o5m6J70j35J7J72j88k00L96l18K26k5J94l31Rm5p8K42mq7J48P9q5j91K8
3066h2K16j38J01o3R9j46J71l90M55l49K67q1N7Q3k98K21j05J36k07O3j44K37
3088A03m02Q3K39o5M3J67k49o3J35j47K39J53m01L70k43k23M20k62o9j5L57k86
$$ y = [84, -190, -325, -143, 152, -50, 45, -94, -16, 190, 16, 52, -253, 12, 111, 7, 33, -9, 25, 245, -34, -102, -62, -2, 94, 116, -188, -41, -23, 84, -9, 100, -90, 51, -300, 73, 31, -136, -230, -185, 207, -364, 10, -29, 89, 17, -18, -200, -38, -73, 87, 121, -308, 7, 50, -109, 139, 64, 90, 103, -97, 92, 98, -39, -142, -48, -244, 60, 174, 65, -175, -15, -15, -90, -185, -75, -22, 23, 39, -66, -42, 45, 18, 69, 220, 128, 341, -62, -19, -204, 6, 178, -66, -132, 13, -115, 156, -28, -102, 25, -193, 121, -27, -218, 17, -120, -24, 87, -89, 51, 52, -184, 145, 136, -195, -184, -178, 128, 35, -30, -76, 94, -41, -24, 148, -40, -240, 156, -162, 64, 39, 233, -98, -89, -134, -212, 30, 26, -61, 87, 166, 81, -110, -82, 134, -4, 97, 34, 133, -13, 158, -232, 223, -126, 141, 60, 117, 200, -98, 123, 18, 154, -53, 10, -134, 103, -299, -216, 23, -42, 1, 168, -81, -144, -9, -156, 83, 236, -165, 205, -38, -261, 159, -103, -172, -187, 170, -116]
3110a16K64r9J8j21J18l07K96j8l5n6l14M00K51J9l83j36k4K57O1J3J20j38J92
3133B62k99L89l02M1j03J20o6k81J73k10J99N4N7j08mL6K9QJ29r6K24l62O2kJ36
3158H6o8P1l43J62r8J78J12o7Rm9j99M06l9k56K62l24K49j00ON5p7K21j36j72
3182a11M6J81k8k23m6QQ4m2J48o3q0N1K33j92l0j36J36M6P7l6J6J07k2j79n8j6
3208a29N9J56nnn19L73J64j21j62K40j68J32l9j59J62J31O5l96J69M2R2l78N37
3231B41j98k13Po5Q4J74O9j30J21p8PJ60j41j64K66k24J63k44K40j57n1N4L31
3254B52k01l46K89r7o7m1M10j95o1J6l8P0K3k93K46j3j38M21m55K81k03J36J11
3277A07j06J58K6k49L11j61O5k7Jj25j84M2L41k41k2K49Jm29J07L36Jj03J31j79
$$ y = [-116, 148, 49, 67, -54, 64, -243, 53, 35, 0, -56, -370, 30, 281, 300, -83, -219, -243, 14, 75, 88, 208, 70, 262, -37, 352, 50, 91, -12, 108, 42, -239, -66, -276, -77, -23, 34, -74, -78, -42, -13, -5, 124, 28, 252, -110, -48, -50, 86, 18, 89, -254, -92, -190, -12, 100, 33, 42, -7, -206, 200, 161, -95, 167, -157, 92, -8, -2, 53, -24, 197, 61, -111, -65, 116, 88, -135, -181, -173, -89, -131, 17, -46, -126, -75, 158, -34, -64, -200, -64, -18, 59, 23, 39, 146, 124, -55, -113, -129, -70, 86, 81, 76, -443, -70, 94, -27, -189, 51, -117, 15, -24, -183, -21, 110, 175, -221, -52, -10, 82, -296, 241, 43, -170, -163, -228, -144, 30, 99, -31, 90, 12, 19, 179, 38, -126, 140, -84, 79, -165, 75, -82, -133, -79, 252, 51, -295, -6, -103, -170, -211, 199, 4, -57, -41, -79, -9, 14, -279, -33, -46, -184, 237, -218, 63, -140, -4, 107, 1, 159, 185, -64, 247, 86, 151, 124, 125, 0, -184, -142, 199, -42, -64, 185, 186, -243, -136, 200, 201, 98, 229, 50]
3301E0j94q3P7J47K2j50J84k70J2K27q8L24k67j18Rj1J03j36M1J40Kj27P9N3j19
3326i3M9J69Nm32N52n69K59L4o8M3K78k68M65m91J65qj6J32k47J58l00J96lo2
3350e2N5R9j1j86K45j94q5n8j00j5L24j11J36K06m08J84r9k62J80L89q0J29k89
3373cL0o8j84K04K10k22K75m01K17n2J22l6j27k18O4K83J17m21K33q4k0j80M05
3396A44l2n3k37KL03l70K58k2K6k30L28j71K77l27J49K34k38k76J55P0J57m39
3418b92L69k5q4R1k86L76j22l03N46l41K7N2J3o7L4KJ17M5k40K48j0n4j72j62
3442b38J44K5J30J21k32r8K86o2j19J05Q4k50J88k64k4K89n3J28l55l5K31j85
3464a84M76q5l63K35q8m2lj55J35mQ9n1K40q3J08l81J52N3j26J96j53P2j20p6
$$ y = [50, -144, -227, -150, -3, 19, -131, 53, -217, -205, 22, -66, 258, -9, -127, -118, -129, -26, -162, -121, 19, 21, -106, -27, 26, -93, -44, 125, 130, -302, 250, -319, -60, -26, -94, -51, 227, -41, 424, -67, 98, 90, 74, 206, -41, 117, -183, 13, 10, -52, 3, 102, 91, -95, 150, -44, -129, -187, -287, -302, 22, -89, 47, 253, -155, 29, -70, -332, -152, 237, 157, 286, -3, 27, -41, -225, -21, 189, -33, 242, -159, 58, 6, 128, 92, -35, -253, -189, 94, 211, -210, 23, -61, -81, -261, 144, 112, 59, -178, -176, 127, -243, 15, -7, 19, -211, 117, -54, 223, -104, 45, 279, 41, -235, -80, -10, 147, -292, 77, 52, -32, 59, -227, 149, 27, -276, 270, -71, -44, 8, 21, -46, -12, -10, 107, 152, -88, 160, 150, 96, -76, -238, -94, -69, 61, 182, -50, -148, 138, 76, -43, 62, 146, -104, 84, -180, -204, 85, 32, 160, -195, -230, 1, -184, 292, 207, -156, 79, -9, -51, -54, -209, -74, -78, 11, -40, 200, 117, 225, -156, -4, 49, -77, 119, -34, 38, -82, -158]
3488a58K93J37l34K50j77k10M03R8M9m23p3j3J42K59k78L35r0l67M50k53o5J90
3510A65N0k41J50j36lk73N72l68K20j09j90L6l6K14R5j47O2J5j28p1Oj0J65j9
3534A9M0p4J11j33O4l6P4j84K76j94J07k46J63j8j87L93k7j15k73K82q8k0K39
3557A73k28k12M56mj53J37k67L39l7k33lj1M1N7J7j78r2J80r6J02J12J54j27n7
3581G0k64L07j12L8J6J46j84j14K56m03L45J21j2p3j58O9r4J82n5K4k08p1J68
3604fM6r4M5J6l4K3J15j39l16R2J94K54j49j31K0N2q9m7J00K1m1k97L80o7k48
3629c00L01l44L81J04m63M32q1J75l77j0K87j73L8m5J39J49ll08K55p1L1p1N6
3652A02q0L4j64K83P7k59j15K25K28k82n0p4q5j13L9K68n3L6j97J9KJ18K45k83
$$ y = [-158, 135, 272, -62, 188, 11, -199, 204, 302, 351, -72, -145, -158, -16, 243, -35, 300, 210, -157, 293, 40, -25, 165, 215, -26, 124, -12, -15, -288, 284, -84, 136, 27, -163, -127, -163, 51, 146, -1, 61, 76, -52, -123, -117, -127, 38, 19, 59, -15, 96, -37, 27, -9, 65, -119, 157, -37, 70, -176, -13, -31, -218, 175, 148, 33, -240, 42, -46, -66, 173, -55, -267, 189, 185, 32, 169, -98, 241, 204, -29, -32, -43, -2, 55, 72, -106, -198, -18, -114, -12, 100, 254, 127, 70, -194, 113, 1, 39, 55, 201, 17, -97, 159, -244, 101, 222, 210, 137, -21, 48, -46, 136, 81, 105, -103, -174, -6, 40, -54, -9, 7, -27, -4, 111, -28, -344, -252, -58, 196, 47, -84, -64, -12, -101, -148, -48, -27, -68, -365, 15, -52, -300, 1, -343, 38, 142, -321, 111, 30, 205, -172, -182, 105, -68, -30, -75, 64, 213, 210, -98, 157, 86, 117, 46, 102, 22, 56, -108, 175, 252, -7, -122, 103, 331, 49, -1, -75, -160, -273, -234, 34, -19, 17, -180, -161, -159, -41, 204, -79]
3676g9l2J43p1R6j42K13J36l43L26l36K18j3j98QPl00L18Q9j05K50j55qJ33m8
3700A07j9k9l51L95J02k70J79j33R0N4l12l1J89J23j24J99K6j32k55K55k33R7
3722g3Q5L5j49J51o2q8K49p5k4k36K86m5J22l59L6j34K89n4J54k17m4M34k37J70
3746B14k78J41lk66L39k72J36o6L1k23M46j23k66K25k4R0k22R5L33j03m31M52
3768B25l78K77J27l24J33j65o9Q9K44m19M09l33J55k61J76Q1lL41m77J56K04k77
3790h9N1L34r3k65J01k84J99l4K78j80J12n0j55j19L40j20J07j49l3p7K08j2j30
3813f0Q6J08k1l38J72l3l5J96k3l87N25k80J30n8J58j39j90J8K78l10K69P4lP0
3837B07j09p1J34k56L27l53j6L04k43J82k56Km1k0L12k12K13j6k94J99J69k06
$$ y = [-79, -111, 32, -39, 57, -85, 128, 264, -79, 247, -89, 129, 116, -82, -74, -67, -367, -49, 40, -65, 185, 30, 22, 155, 107, 88, 59, -292, 103, 205, -65, 114, -19, 71, 125, -187, -218, -29, 94, -30, 169, 195, 63, -192, 63, -170, -73, 12, 47, -102, 49, -13, -101, 148, 73, 49, -187, 99, 54, 176, -183, -147, -281, 8, -46, 108, -109, -153, 281, 44, 214, -64, 77, 74, -192, 147, -125, 11, -55, -24, -247, 199, 76, -190, 35, 11, 101, -121, -26, 307, 204, -227, 225, -153, 124, 251, -73, 60, -105, -174, -85, 159, -260, 149, -184, -29, -290, -114, -33, -36, 305, -172, -16, 188, -89, -38, 296, 203, -62, 39, -245, -46, -80, 198, 18, 130, 80, -75, -194, 146, 26, 133, -16, -49, -126, 82, 70, -60, 26, 134, 113, -225, -53, -86, -121, 75, 52, -335, 190, -90, 40, -18, 140, 1, -189, -171, 107, -203, 66, 140, 137, 207, 98, 27, 161, -95, 232, -121, -137, 167, -76, 106, -150, -148, -189, -209, 103, -109, 104, 88, -206, -7, 162, -44]
3859d4j19K93l84J82N1oJ28m71M30L4K5l93N9J63P0pj89K00j75J36r1KpJ78m79
3884d14N89k59J14Q6j16k50J86j02O1k1Q3J05k24L7R1j42K72J33m93K46k4P8r0
3907e4J38j91O4j2K09q0j23J40j34N8L8k3L4k4j37P7K2J30jj16q2k6K66m1q8P7
3933A21j14p3j15K40j96O0L3J42rj40j8K37k38J82p9k10R1J21k19J35J70j28J8
3956A1m5J71m4j5M3l6N3k14p8j88J8M25R3j74p7k8J26m3m7J22L4k5k98J12K05
3981A01r9o8j25j5n2M69j86q2P0K44k77n3P3j23J34r0J4KJ55l9N1L9j34Q6Q1k57
4007h1J13K25k06N2Q4l43J63j90L66q2J06j95j90K29j35k7o8N9J26K5J75o8l7
4030A01P1j11L3k76N9Q1K1J19Q6L8k88m9k18K08K92P4l10O5K6l7J92k82L54k63
$$ y = [-44, -163, 130, -254, -72, -21, -27, 101, -370, 60, 94, 119, -274, -215, -52, 18, 11, -178, 22, -153, -17, -108, -106, -113, 65, -414, 175, -84, 30, 116, 0, -250, -64, -166, -105, -126, -43, 62, -162, -125, -34, -176, 96, 229, -264, -18, -42, 36, -54, 84, -107, -43, -55, 154, 74, -49, 91, -43, 15, 53, 30, 64, 40, -97, -20, 2, 132, 131, 15, -67, -93, 173, 132, 44, 121, 7, -66, -181, 59, -137, -77, -44, 98, 89, -51, -69, 168, -70, 112, 33, -177, -86, 35, -184, -49, 121, -7, 11, -34, 137, 93, 78, 121, 85, 138, -76, -154, -342, -324, 101, 194, 20, -57, -85, 41, -2, -49, 73, 107, 82, -216, -104, 101, 2, -66, -191, -206, -258, 211, 25, -57, 13, 257, -20, -73, 0, -123, 11, -79, -65, -63, 92, 53, 104, 143, 9, 95, 176, -81, 32, 257, 51, 103, 187, -156, 7, -183, 183, 101, 207, 12, -178, 51, -84, -111, -179, -120, 6, 31, 206, 138, 101, 172, 61, 94, -182, -123, -42, -21, 98, 184, 222, -66, -115, -333, -125, 167, 241, -69, -4, 22, -15, 177, -105, 249, -14]
4054a4J92N1r2k82J38j7J19jL8j62L51l94Q3k8l8L17k79J25j37K1o2j17M15k93
4078f6q1J93K44j94oJ23j06J6j36r4L64j59k75K87J7J23j65k7k13O7P3j2l3M9
4102a1j19j14M50l34j10L19j03K61l22L2J4M7j69K55O7o8k20K60J46m24J49j7
4124a1Q2j48k4M5J78r9p8j7N0k1J61j13Q8r4R6n4K85jm32k2M75m45J66k57Q3n1
4150a58JL04k53L71m36J01P1J1k78M64j7k26N0L3j26k38K91o2N9R9L9j12J14r4
4174HN6j56J16K04j40l60M12L9k74J35l43M02K40k96MK47m04J86J33k76J30j11
4196d8J6j25J61p4K7L5Q2n2q6K7l9P9O3j24R5j6j78j62K93Q2M1j54K29k24k85
4221c37N11k11R4j81m6Q2j22J72K9pK15k29K23l87N54m39M06l26R8l28K72K7k3
$$ y = [-14, 178, 229, 137, -145, -7, -24, 95, 94, 132, -30, 321, -73, 10, -18, -56, 261, -18, 107, -30, -9, -71, -188, 227, -66, -147, 46, 290, 96, 90, 213, 107, 123, -13, -107, 257, 98, -177, 110, 127, 250, 85, 58, -155, -88, -15, -27, -60, -11, -130, -244, 206, -128, -238, 81, -22, 239, -83, -51, -37, 10, -159, 96, 163, 95, -125, 135, 281, -143, 6, -11, 71, -77, -101, -56, 122, 23, -55, -72, -22, -43, 118, 5, 93, -1, 95, 41, 326, 325, -107, -129, 346, -99, 67, -190, -107, -158, -157, 147, -106, 265, -171, -70, 1, 12, -266, 198, 181, -45, 5, 38, -88, -326, -35, -97, -38, 61, 100, -12, 102, 8, 64, -92, 24, 228, 88, -272, 140, 179, -95, 40, -303, 99, 339, 43, 47, 294, -110, 76, 209, -67, 63, -48, -32, -157, 4, -70, -43, -8, 74, 22, -64, -37, -76, 3, 66, -58, 37, 21, -157, -319, -26, 56, 97, -57, 172, -52, -337, 174, -37, 57, -124, -170, -88, -210, -38, -9, -16, 199, -30, 193, -194, 360, -79, 327, 1, 99, -229, 43, 70, 47]
4244D7l28J9M81j46M5j09J59j25k72K98j49k65K38l5J21j14M0O7K2j80J06Q6j06
4267a00J7N6J15j24q7J46P2o6l89L04m2L5K8p8QJ81k11J40L15l74L1r1J95j44
4291f3j96L22J26k12J28P0l21J33K28j76L5j35k8K24Jj67J18l03J63K56k13K09
$$ y = [47, -281, -262, 219, 73, 118, 9, 168, 43, -229, 69, -80, -345, -107, -142, -21, -135, -95, -28, -6, -186, -80, 6, -100, -83, -27, 88, -36, -123, 23, 95, 29, -360, -56, -98, -63, -35, -113, -105, 76, -135, 5, 320, -54, -23, -114, 81, -63, -259, 63, 189, -23, 105, 175, -146, -13, 215, 39, 74, -61, -89, 135, 136, -31, 87, -216, -53, 203, -10, 199]
$$ [...]
8191A69
##END NTUPLES=NMR FID
##END=
