##TITLE=1H_DE-106_7_8_oil
 200.13MHz, CDCl3,
 8 sc
 
 25.8.2025
##JCAMPDX= 6.0         $$ Bruker NMR JCAMP-DX V2.0
##DATA TYPE= NMR FID
##DATA CLASS= NTUPLES
##ORIGIN= UXNMR, Bruker Analytische Messtechnik GmbH
##OWNER= pz
$$ XWIN-NMR		Version 3.5
$$ Mon Aug 25 14:15:51 2025 Russian Standard Time (UT+4h)  she@DPX200
##.OBSERVE FREQUENCY= 200.1308
##.OBSERVE NUCLEUS= ^1H
##.DELAY= (6, 6)
##.ACQUISITION MODE= SIMULTANEOUS
##.ACQUISITION SCHEME= undefined
##.AVERAGES= 8
##.DIGITISER RES= 18
##SPECTROMETER/DATA SYSTEM= spect
##.PULSE SEQUENCE= zg30
##.SOLVENT NAME= CDCl3
##.SHIFT REFERENCE= (INTERNAL, CDCl3, 0, 14.3821)
##AUDIT TRAIL= $$ (NUMBER, WHEN, WHO, WHERE, WHAT)
$$ ##TITLE= Audit trail, XWIN-NMR		Version 3.5
$$ ##JCAMPDX= 5.01
$$ ##ORIGIN= Bruker BioSpin GmbH
$$ ##OWNER= she
$$ F:/spectra/data/she/nmr/H-C/1/audita.txt
$$ ##AUDIT TRAIL=  $$ (NUMBER, WHEN, WHO, WHERE, WHAT)
(   1,<2025-08-25 14:14:22.48 +0400>,<she>,<DPX200>,
      <created by zg, POWCHK disabled, PULCHK disabled
       configuration hash MD5:
       00 E9 B6 7A A2 85 ED C7 34 08 36 98 17 FE 4E 26
       data hash MD5: 16K
       95 BF 35 76 72 68 E1 4B 63 EF 18 81 B8 34 F9 C9>)
$$ ##END=
$$ 
$$ hash MD5
$$ 44 AD 8C 7A E8 F5 C5 1C 77 33 15 1D 18 35 7D CE
##$RELAX= 
##$RELAX= 
##$RELAX= 
##$RELAX= 
##$RELAX= 
##$RELAX= 
$$ Bruker specific parameters
$$ --------------------------
##$DU= <F:/spectra>
##$EXPNO= 1
##$NAME= <H-C>
##$PROCNO= 1
##$TYPE= <nmr>
##$USER= <she>
##$AMP= (0..31)
100 100 100 100 100 100 100 100 100 100 100 100 100 100 100 100 100 100 
100 100 100 100 100 100 100 100 100 100 100 100 100 100 
##$AQSEQ= 0
##$AQ_mod= 1
##$AUNM= <au_zg>
##$AUTOPOS= <>
##$BF1= 200.13
##$BF2= 200.13
##$BF3= 200.13
##$BF4= 200.13
##$BF5= 200.13
##$BF6= 200.13
##$BF7= 200.13
##$BF8= 200.13
##$BYTORDA= 1
##$CFDGTYP= 0
##$CFRGTYP= 5
##$CHEMSTR= <none>
##$CNST= (0..31)
1 1 145 1 1 1 1 1 1 1 1 1 1 1 1 1 1 1 1 1 1 1 1 1 1 1 1 1 1 1 1 1 
##$CPDPRG= <>
##$CPDPRG1= <>
##$CPDPRG2= <>
##$CPDPRG3= <>
##$CPDPRG4= <mlev>
##$CPDPRG5= <mlev>
##$CPDPRG6= <mlev>
##$CPDPRG7= <mlev>
##$CPDPRG8= <mlev>
##$CPDPRGB= <>
##$CPDPRGT= <>
##$D= (0..31)
0 0.7 0 0 0 0 0 0 0 0 0 0.03 0 0 0 0 0 0 0 0 0 0 0 0 0 0 0 0 0 0 0 0 
##$DATE= 1756116862
##$DBL= (0..7)
120 120 120 120 120 120 120 120 
##$DBP= (0..7)
150 150 150 150 150 150 150 150 
##$DBP07= 0
##$DBPNAM0= <>
##$DBPNAM1= <>
##$DBPNAM2= <>
##$DBPNAM3= <>
##$DBPNAM4= <>
##$DBPNAM5= <>
##$DBPNAM6= <>
##$DBPNAM7= <>
##$DBPOAL= (0..7)
0.5 0.5 0.5 0.5 0.5 0.5 0.5 0.5 
##$DBPOFFS= (0..7)
0 0 0 0 0 0 0 0 
##$DE= 6
##$DECBNUC= <off>
##$DECIM= 32
##$DECNUC= <off>
##$DECSTAT= 4
##$DIGMOD= 1
##$DIGTYP= 9
##$DL= (0..7)
0 120 120 120 120 120 120 120 
##$DP= (0..7)
150 150 150 150 150 150 150 150 
##$DP07= 0
##$DPNAME0= <>
##$DPNAME1= <>
##$DPNAME2= <>
##$DPNAME3= <>
##$DPNAME4= <>
##$DPNAME5= <>
##$DPNAME6= <>
##$DPNAME7= <>
##$DPOAL= (0..7)
0.5 0.5 0.5 0.5 0.5 0.5 0.5 0.5 
##$DPOFFS= (0..7)
0 0 0 0 0 0 0 0 
##$DQDMODE= 0
##$DR= 18
##$DS= 0
##$DSLIST= <SSSSSSSSSSSSSSS>
$$ [...]
##$SUBNAM0= <"">
##$SUBNAM1= <"">
##$SUBNAM2= <"">
##$SUBNAM3= <"">
##$SUBNAM4= <"">
##$SUBNAM5= <"">
##$SUBNAM6= <"">
##$SUBNAM7= <"">
##$SUBNAM8= <"">
##$SUBNAM9= <"">
##$SW= 18.0517779522481
##$SWIBOX= (0..15)
0 0 2 0 0 0 0 0 0 0 0 0 0 0 0 0 
##$SW_h= 3612.71676300578
##$TD= 16384
##$TD0= 1
##$TE= 0
##$TE2= 300
##$TE3= 300
##$TEG= 300
##$TL= (0..7)
0 120 120 120 120 120 120 120 
##$TP= (0..7)
150 150 150 150 150 150 150 150 
##$TP07= 0
##$TPNAME0= <>
##$TPNAME1= <>
##$TPNAME2= <>
##$TPNAME3= <>
##$TPNAME4= <>
##$TPNAME5= <>
##$TPNAME6= <>
##$TPNAME7= <>
##$TPOAL= (0..7)
0.5 0.5 0.5 0.5 0.5 0.5 0.5 0.5 
##$TPOFFS= (0..7)
0 0 0 0 0 0 0 0 
##$TUNHIN= 0
##$TUNHOUT= 0
##$TUNXOUT= 0
##$USERA1= <user>
##$USERA2= <user>
##$USERA3= <user>
##$USERA4= <user>
##$USERA5= <user>
##$V9= 5
##$VALIST= <valist>
##$VCLIST= <CCCCCCCCCCCCCCC>
##$VD= 0
##$VDLIST= <DDDDDDDDDDDDDDD>
##$VPLIST= <PPPPPPPPPPPPPPP>
##$VTLIST= <TTTTTTTTTTTTTTT>
##$WBST= 1024
##$WBSW= 4
##$XGAIN= (0..3)
0 0 0 0 
##$XL= 0
##$YL= 0
##$YMAX_a= 157318
##$YMIN_a= -198359
##$ZGOPTNS= <>
##$ZL1= 120
##$ZL2= 120
##$ZL3= 120
##$ZL4= 120
##$ABSF1= 10
##$ABSF2= 0
##$ABSG= 5
##$ABSL= 3
##$ALPHA= 0
##$AQORDER= 0
##$ASSFAC= 0
##$ASSFACI= 0
##$ASSFACX= 0
##$ASSWID= 0
##$AUNMP= <proc_1d>
##$AZFE= 0.1
##$AZFW= 0.1
##$BCFW= 1
##$BC_mod= 2
##$BYTORDP= 1
##$COROFFS= 0
##$CY= -3
##$DATMOD= 1
##$DC= 2
##$DFILT= <>
##$DTYPP= 0
##$F1P= 0
##$F2P= 0
##$FCOR= 0.5
##$FTSIZE= 0
##$FT_mod= 4
##$GAMMA= 1
##$GB= 0.15
##$INTBC= 1
##$INTSCL= 1
##$ISEN= 128
##$LB= 0.25
##$LEV0= 0
##$LPBIN= 0
##$MAXI= 10000
##$MC2= 0
##$MEAN= 0
##$ME_mod= 0
##$MI= 1.114404
##$NCOEF= 0
##$NC_proc= 0
##$NLEV= 6
##$NOISF1= 3.799351
##$NOISF2= 2.8
##$NSP= 1
##$NTH_PI= 0
##$NZP= 0
##$OFFSET= 14.38212
##$PC= 1
##$PHC0= -1558.442
##$PHC1= 7.392281
##$PH_mod= 1
##$PKNL= yes
##$PPARMOD= 0
##$PSCAL= 0
##$PSIGN= 0
##$REVERSE= no
##$SF= 200.129724274929
##$SI= 16384
##$SIGF1= 3
##$SIGF2= 2
##$SINO= 400
##$SIOLD= 16384
##$SREGLST= <1H.CDCl3>
##$SSB= 0
##$STSI= 0
##$STSR= 0
##$SW_p= 3205.1282051282
##$SYMM= 0
##$S_DEV= 0
##$TDeff= 0
##$TDoff= 0
##$TI= <>
##$TILT= no
##$TM1= 0
##$TM2= 0
##$TOPLEV= 0
##$USERP1= <user>
##$USERP2= <user>
##$USERP3= <user>
##$USERP4= <user>
##$USERP5= <user>
##$WDW= 1
##$XDIM= 8192
##$YMAX_p= 0
##$YMIN_p= 0
$$ End of Bruker specific parameters
$$ ---------------------------------
##NTUPLES= NMR FID
##VAR_NAME=  TIME,          FID/REAL,        FID/IMAG
##SYMBOL=    X,             R,               I
##VAR_TYPE=  INDEPENDENT,   DEPENDENT,       DEPENDENT
##VAR_FORM=  AFFN,          ASDF,            ASDF
##VAR_DIM=   8192,          8192,            8192
##UNITS=     SECONDS,       ARBITRARY UNITS, ARBITRARY UNITS
##FACTOR=    0.0002768,     1,               1
##FIRST=     0,             0,               0
##LAST=      2.2672688,     0,               0
##MIN=       0,             -198359,         0
##MAX=       2.2672688,     157318,          0
$$ Real data points
##PAGE= N=1
##DATA TABLE= (X++(R..R)), XYDATA
0@%%%%%%%%%%%%%%%qJ6j6J6j6K4l2L2m0M8n5O3p2Q5r3J04j20J37j57J78k00K24
37A18k52K82l13L48l86M29m76N24n78O39p04P75q55R41j034J141j261J394j546
56h14J719j916K148k422K752l163L685m369N313o704Q956j3168K3568r6123j17821
71a98359K63828K6411j48620J03338J10720j55684m7667J08832m0668p6735Q7866
82C3262N581j17904J3246O2702o0821M345R9535p304n2475L8540K3911j9836J4899
95C7681R309l0621j2557l288k3332r141Q043q488J566J6358j0869L001N0680M423
109C2765l1904K8615J5157n0583O511M5767l5973m2580K7499r22l9753K0513L7730
122A2842k3220j0582L4276r562k6021L5704K3343k9986n20J6552k5721j3352K4646
$$ y = [0, 0, 0, 0, 0, 0, 0, 0, 0, 0, 0, 0, 0, 0, 0, 0, -8, 8, -8, 8, -8, 16, -16, 16, -24, 24, -31, 32, -40, 45, -48, 56, -64, 73, -84, 94, -106, 118, -134, 148, -165, 183, -203, 226, -250, 274, -304, 335, -369, 406, -449, 492, -542, 599, -662, 732, -814, 905, -1011, 1137, -1285, 1467, -1696, 1989, -2380, 2933, -3771, 5185, -7983, 15585, -80538, -198359, 65469, 91880, -56740, 46598, 157318, 1634, -46033, 62799, 22131, -54604, 33262, 38843, -79061, -65815, -3113, -63934, -59589, 39946, 32642, -19833, 18707, 42618, 22782, 37681, 46990, 16369, 3812, 524, -22808, -31949, -23906, -32394, -30828, -14470, -25339, -22338, 28342, 32765, 861, 29476, 44633, -5950, 561, 46328, 10355, -32225, -4726, -5648, -45401, -24888, 12842, -10378, -20960, 13316, 3754, -22267, 13437, 36780, 6794, 6274, 22826, -2895, -16247, 8399]
135H399M739j8745k789L487r877n915J3515J1086l934j966L054J35K8O426J1800
150A9443N02j6797m426N894j2475m922J7326o157k0562Q183R788r433R315K2996
164A8675m275j4178J0122M935j5311M814J4245j7921j6662Q603l923r938J4807
177f007R676q823N60Q120j214J620J0143K549q755m762k900o440R40L693m018
192e618q87J059n981K548J2250R79m30O155l889p197L992M644m212j717J393p247
208d158p403O264N461n055K833M818p452j807R012K000n68L594k127n742K72K957
224B899k63j639L39l317o657N51M362O54J921K496k061j69K372K095M092J867
240I542l739k725k999l496P12O84j312j727j298m38L21L874O487J474j131J552
$$ y = [8399, 13138, -5607, -8396, -4909, -14786, -20701, -7186, 3900, -34, -2000, 1054, 1189, 1217, 7643, 19443, 19945, 3148, -1278, 4616, -7859, -12781, 4545, -1612, -22174, -13991, -4203, -13636, -4321, 18675, 14400, 222, 10344, 15279, -32, 4782, 19027, 1106, -15556, -6953, -10876, -20814, -6007, 3669, -5154, -4594, 3526, 2312, 3932, 14075, 16624, 7869, 3107, 207, -6233, -5293, -1600, -5618, -6505, -5446, -11427, -8879, 3371, 4350, 3920, 10075, 6186, -1011, 2981, 7625, 3413, 1696, 3089, -4158, -11561, -5297, 164, -4891, -2058, 2760, -4692, -6499, 2513, 4513, 3945, 7539, 5412, -330, -58, 2899, 2636, 997, 1336, -1981, -8638, -8087, -3725, -3071, -1150, 1346, -715, -884, 1488, 3583, 7675, 9542, 5803, 3078, 79, -3417, -2705, -2021, -3333, -5060, -6358, -6796, -6475, -2601, 3886, 5360, 4229, 5781]
256E781q16k751K372J494l968k737k619l621n43K476K308M52k66J465O86Q43L704
273D260L025j242k321k000j375l00o70o2N01l594j869J787M96J111L404O90j557
290B84l70J601J185J99J714M77m039k829J159l81j261J728q03k732k78J004J637
307a705J706J970Q85j129q11J908N20l52J78j590l412q62p57M98Q66k30O03R9
325a615n71K247K611L46N54j60j722j325L59K35q63r17p73p55j647J689K136M7
343a24O17O34j124L04J350N42J56q24o82j485j073P81J083r69o0L2r95j28J735
362b30Q14L16M7j85o74l38J170Q96n70q89r0j465n81R45J002l02o06m24N52L36
382b76L36K008q4j487O19j105k96O08O13r87j155O6K1j25L81J892n7r57M40K07
$$ y = [5781, 4965, 2214, 4586, 6080, 2112, -625, -3244, -6865, -7408, -4932, -2624, -2172, -2438, -973, -287, 556, 4260, 7285, 6043, 3722, 1722, 347, 47, -623, -685, -184, -3778, -5647, -3860, -3364, -2253, 1151, 1841, 284, -86, 1515, 2700, 2899, 4613, 5090, 1051, -1778, -619, -1000, -2261, -533, -1336, -4068, -4346, -3342, -1705, 1, 1971, 2856, 1727, 916, 2824, 3344, 2992, 3170, 1580, -1832, -2694, -3451, -2953, -2087, -2317, -1714, -1615, -2186, 61, 2672, 3018, 3572, 3412, 1690, 365, 724, 959, 96, -821, -1594, -2349, -3996, -2307, -171, -124, 493, 1127, 3, 307, 1657, 2199, 2355, 1531, 849, -636, -1709, -928, 155, -814, -874, -842, -1837, -1965, -230, 584, 900, 947, 762, 88, -250, 920, 1816, 1246, 357, 267, -1198, -1779, -834, 168, -134, -740, -1164, -612, -276, 60, 2068, 1984, 497, 1116, 11, -285, 323, 936, -51, -1206, -1140, -1119, -1244, -863, 1029, 972, 15, 455, 662]
402F62m01P95M59p79q76l40l26l01M42N43J96j065j04J065L0N75P67k08m24r52
422b42p5L82j04j25M5p17o42N42L10Q09N11k85l55k84O89M03j64r4K01j208l53
443g56N15Jj76O68q63m48M94L36J83J42O91J7n22m5M08J06k83M3n07j007L11j87
465h79K19M25k9o7p7J10M92P24mO5l90j31n22J1J39j51l92k07n2n90P72O67n20
488c87M99P29p11l1O31M4R1m36j37o06l44N46M5l45k25K20m63N05N33J17K76l8
510E13m20J17PJ15r5j20l9m81j3l11J52L35j10j03p5Q16n28L58L99J99m02j07
532B07J17k84J16j06N0n03k62K36j87R5N55n6mP7L12j44L50k35J21l41J73l56
554f9K7q2j2l23j24j9K43J51M35J0N8J1j45k90J34M53m52M7j54k0Q6j77l8K39
$$ y = [662, 261, 1056, 1515, 736, -140, -480, -806, -1107, -665, -122, 74, -991, -1095, -30, 0, 575, 1342, 1134, 710, -242, -317, 65, -39, -164, -119, -836, -1478, -936, -626, 183, 694, 409, 54, -230, 459, 862, 698, 604, 805, -403, -756, -241, -240, -416, 252, -611, -1059, -565, -229, -46, 96, 787, 804, 282, 237, 645, 751, 468, 511, 4, -1003, -692, -879, -660, -235, -264, -331, -408, -298, 194, 918, 914, 979, 589, 458, -64, -53, 86, -65, -457, -664, -716, -1306, -534, 133, -387, 112, 841, 130, 99, 730, 774, 865, 429, 292, -314, -658, -112, -67, -412, -637, -417, -880, -375, 158, 275, 551, 513, 93, 210, 217, 332, 237, 117, 78, -403, -416, -727, -575, -240, -350, -453, -528, 288, -240, 118, 517, 716, 314, 207, 324, 40, 156, 50, 100, -403, -665, -429, -616, -521, 34, -22, -26, 51, 363, 219, 569, 334, 455, 114, 287, -69, -42, -124, -136, -459, -583, -602, -359, -208, 227, 237, 295, 306, 161, -129, 5, 458, 6, 53, -101, -121, -35, -212, -250, -11]
578a1k8mp8J63O8NJ54P2l99KO7K60j32l62M15m17j08J26L45k72R1L53n36n7N36
603B53r6J35j78Q6k55J64L5k58K55l41Q6j07K52K49j20j87K18l30L1L6K05l2K49
626C50m28k8j34J41K39m0j4K42k13m0l6k36K17K92l49j63J24j62j93N06K2k13
648a16P1J42j11J27K6R2k03J18n3r6J3J89k51j86P3j39J99L79j26l02J58K1p6
671e1p2L91m3p0n0j5l86L45J82k58Kl19K73J29J44k86k3K04J59j33m6K8J8N9Q6
696B68k74l84K73K7k85J81P1o5r7L50l4J00J78k8l49K53L1r3L4l22L00m01J8J23
720a25KK90m24J50J19k1j95Q9K15J24l09J49j37k2J04p9J78j57j77J83j4o5K99
743A77l82K06J05k65L13o4O7m0m5m2l4J09k86P6P4k79J77J06r3j9m6K73q2O8L8
$$ y = [-11, -39, -43, -121, 42, 110, 115, 269, 341, -58, -56, 11, 271, 139, -223, 192, -225, -333, -207, 138, -134, -43, 310, -226, -283, 253, 157, 292, 114, 200, -55, 109, 144, -114, 141, -200, -114, -221, 31, 280, 160, -27, 191, -139, -108, -72, 133, 101, 350, -78, -106, -240, -99, 140, 100, 86, 328, 115, 75, 39, -197, 20, 312, -37, -200, -76, -238, -431, 75, 97, -116, -45, 97, -14, 113, 139, 231, 28, 146, 93, -3, 10, 199, -52, -238, -165, -304, -105, 274, 148, -154, 4, 25, -51, -123, 268, 225, 155, 105, 90, -296, 49, 231, -27, -25, -344, -71, 58, 202, -84, -107, 97, 256, 123, 77, 105, 123, 182, 268, -6, -390, -117, -90, -375, -194, -123, -188, -285, 65, 31, 131, 309, 281, -68, 185, 216, 123, 157, -165, 135, -266, -248, -125, -123, 167, -257, -107, 12, -9, -204, -115, 100, 224, -85, 64, -73, -95, 9, -70, 108, -49, -226, -43, -57, -122, 177, -205, 1, 106, -159, 154, 90, 157, 117, 72, 30, -4, 105, -181, -105, -31, -310, -133, -27, -120, -139, -185, 88, 6, 74, 112]
768A12Jk99M90j55k29j07K20J32k93LJ05m8K22j2j2k6p9J8J22k53J16j92K28n
792E9k16P2J43J14j05q3j81Q4l5O3R4j0J32l85M55l30n8Q8K26p3J23o7j58l04
816c52L83J50o5j43k1l3n4J74q5J06k7p2L3N5J60l37K11m5j86k25N83k99J28N
840D4j35K93k06m2O5p5j99J93Qj62M23m83M16j40l5k5J81j89k4j80L09p5NK41
864B08o5n69P13k52M8j29J47pj79J87j38q8J14j40K10j31R5P5L1j67k68L90J29
887B14l05K00J02j63J34J12k06o9j7r0m7K62l5N2m8k30q9M6J85m2R3N1K37o8l07
912b8r5K21j89J23j86L18j28p8J55J9j74J27j56m5J42J53r0j74k9K48q1J65j55
935F3J26j6o6l1j22j4J15q2J44r0j18K38l03K02j27K46r6p3J2N5p5K4o6N8j08
$$ y = [112, 113, -186, 304, 149, -80, -187, 33, 165, -128, -125, -20, -68, 154, 142, 130, 104, 25, 43, 165, -88, 28, -164, 64, 59, -157, -85, 58, 172, 67, -16, -197, -113, -148, -85, 9, -1, 131, -254, 201, -129, -187, -99, 127, 54, 177, 110, -48, -352, 31, 181, 116, -27, -48, -81, -135, 39, -46, 60, 33, -39, -6, 49, 209, -128, 83, 38, -148, -373, 210, -89, 39, 44, -91, 202, -4, -46, 19, -56, -255, -62, -54, -216, 207, -276, 140, 0, -35, -60, 121, -68, -92, -272, 37, -38, -33, 208, 143, -426, 287, 35, 83, -46, 101, 94, -85, 102, -36, -124, -10, -150, 60, -71, 24, 99, 130, -37, -305, 85, 214, -91, 109, 211, 48, 182, 294, 88, 19, 2, -88, -135, 127, 92, 144, 96, -134, -223, -177, 8, -34, 59, 110, 347, 279, -28, -123, 98, -91, 32, -154, 164, 36, -42, 113, 132, -42, 85, -71, -116, 26, 179, 89, -85, -114, 134, 53, 218, 63, 189, 173, 107, 76, -46, -60, 55, -27, 117, 27, -91, 147, -156, 46, -81, 165, 69, -4, 8, 63, -12, 12, -54, 4, -104]
960a04J6J53o4P9j56J36j42p0K32l1J61k64J04M9j25K39pj64J7j2r1M2k2J9p1
985g6R6J8m3K36j85L2J29j26l12K18o2J19l8j29j55N49K3k03j37K31k7k26Q3m27
1009d12L67k89J52R2M3Q4k89L81j00n9j0Q3j25J17o1rn2r8K53l7n0J6J50k16K13
1034A44j15l32N26o4J0m6k23M4k7N3j50J10L6j9J82k3q2KL6j09O9j32J50J42j16
1059F6m6l6P6J9l26J81K88p6k01K40j82L3r4J87m7Q0j63j01M7j30J2j20J62K78
1083A47k16J35Mk32L03k68L44j52p7r9J5J48K1o0K38l90J11j02J58N0j61K68j
1106A84n5j41K1j68M82k00J13j98m3k76K12j1M9j61M97l63J77k06j12K03N2j19
1128f3L39l52K34L9l11K54j03J85k20l48L71p4pj62N9j03K93J87l42L8K83j86
$$ y = [-104, -88, 65, 1, 80, -76, 60, -82, -152, 80, 49, 210, -54, 50, 99, -26, 213, 206, 42, 59, 47, -44, -2, -24, -5, -76, 20, 38, -5, 231, 46, 78, 207, 81, -231, -13, -75, 44, 6, -123, -278, 271, 294, 91, -46, 185, 158, -68, 15, -412, -45, -334, -182, -90, -47, 37, -252, 129, 29, -30, -40, 43, -82, 35, -26, -35, -87, -185, 68, 31, -19, -3, 147, -69, 144, 29, -303, 223, 159, 169, 123, -100, -56, -83, -30, -180, -70, -34, -53, 129, 106, 24, 26, 62, -47, 22, -110, 40, 182, 66, 20, -16, 60, 79, -247, -66, 222, 146, -55, 185, 3, 36, -58, 129, 82, 162, -1, -102, -55, -185, -173, -293, -131, 147, -69, 66, 70, -162, 141, -127, 217, 65, -12, -111, -96, 52, 73, 13, 251, -139, -28, -130, 28, 78, -83, 185, 184, 129, -12, 9, -159, 323, 123, 236, 38, -5, -281, -69, -80, -31, -192, 305, -58, 119, -87, -199, 4, 56, -63, 276, -76, 158, 197, -114, 140, 37, 222, 2, -346, 25, -49, -56, -218, -159, -262, 31, 218, -124, -86, 197, 11]
1150A1j31J56J95r1j77QN9L6k68J17j0l7L73L9k32o9l44K84M6J97j81N0p6J45
1174A00j52N7k31M68m38J56P2j52L18n60K86j2Q9J34k28n1O1j93M77l86J35K07
1196A57l23J05K2K24r3p6rJ24j27l00L0M14k14m3K4O7K07m41R5J82J23j46L32
1219C34l50J22K8j09N2j18Q1j4j60p4J05J16jk19J64J15k77J99K13k92l1J92j76
1242a00Q8n2j34J70l2q0J82J46k71J37j1K70m17K00q8Q7l30J59R2K96k12q7O4
1265G7j36J53r8j12K54j17k9r7oL2rj56K18J42j74j2L25l57N5m2J59J12r5m5K3
1290F5k0J74m13J29J54R7l50L70J93q59J96K60P5K43l38P9p4k41J69J9M9k5L5
1313a3K23l46P8M18k70l87L01K0n91O23q9Rl21M47k85k2K88q7j74J6P3M07k97
$$ y = [11, -120, 36, 231, 140, -37, -29, 30, 66, -202, -85, -95, -132, 241, 280, 48, -21, -365, -81, -35, 162, -19, 31, -45, 100, -52, 5, -226, 242, -196, -40, 32, -120, 198, -362, -76, -88, 1, 135, -93, -144, -83, -276, 201, -185, -50, 157, -166, -61, -39, 185, 92, 16, 7, 131, 4, -296, -266, 148, -66, -109, -85, -18, 189, -252, -157, 25, 148, 2, 334, -16, 106, 134, 25, 77, -41, 40, 26, -134, -208, -103, 13, 12, -207, -43, 72, -205, -6, 207, -85, -116, 76, -100, -12, -64, -198, -28, -60, -140, 42, 188, -83, 54, 43, 313, -104, 96, 8, 95, -235, -76, 16, 312, 100, 13, 77, -59, 94, -4, -116, 138, 21, -8, -105, -111, -79, -88, -244, -26, 116, -58, -70, 255, -102, -47, -89, 70, 182, 87, 42, 65, 45, 219, -194, -65, 89, 186, -164, 206, 399, -460, -264, -4, 71, 314, -24, 55, -19, -260, -91, -72, -23, -48, -13, 210, -136, -58, 360, 90, -297, 4, 24, -567, 56, -33, -24, -345, 102, -183, -205, 83, -4, -178, -162, -89, 318, 21]
1336B1j15k6L84k81p6J07j72J40j20L5R7P8P7k50J57J11j77m0q2L58o6j80j3j09
1360a42K54M9k07Q4k04M6Q1J53J3k9N0j09j04n9J80k47J96j6JlN1o6k01J15J72
1385E8j7p3m3n7P5l1L34l2n76K98J20j83J63Kj64K17j69N4k27O5K04k15K14J34
1409A51l92L0P2J98j40j81K85N3L5j30n3M94n26j1N4l8k30M43R5m34K69j00K54
1432A98j80Pn7l8M13n45J48J14j21kJj55l6M45k83K69j05l7j21K50L7k26j19j82
1456c25M25nr6J14K4J26m83R3M6J28L6j77M0K82k91j45L10N4r9k14J68Qj67J96
1480D8j0j24K37k64m9K89j87K63k24q7j18K01k63m5L55p4J01R3j54J29k9k19Q8
1503d3K25r0j51K55J85j84j84j89Jn7p9M15j12l5m6L78k35k60P0KM49m56J44K8
$$ y = [21, -94, -120, 264, -17, -93, 14, -158, -18, -138, -103, -6, 72, 149, -101, 56, 167, -10, -50, -132, 226, 160, -20, -33, -142, 112, 161, -46, 38, -166, -120, -39, 114, 127, 98, 148, 39, -65, -124, 56, -191, 5, -11, -10, -13, 38, -28, -229, -114, 58, 41, -32, -75, -132, -57, -88, 246, 214, -362, -64, 56, -127, 36, 38, -126, 91, -78, -24, -251, -186, 18, -197, 17, 151, -241, -211, -139, 59, -81, -262, 23, 76, 111, -19, -72, 422, -104, -115, -61, -99, -329, 114, 209, -225, 44, -56, 198, 18, 25, -32, -70, 343, -202, -54, 60, -61, -63, -62, -217, -253, 192, -91, 178, 73, 36, -85, 165, 202, -24, -143, -325, 100, 95, -1, 113, 137, 263, -220, -127, -81, 47, 83, -94, -54, 228, -63, -208, 102, 156, 57, -157, 11, 19, -148, 48, 38, -86, 151, -113, -162, 127, -60, 203, -21, -108, -226, -25, -288, -333, 22, -52, 49, 142, -12, 117, 88, -131, -43, 182, 92, -59, 196, 381, 197, 13, -176, -175, -232, -311, 104, -8, -43, -89, 289, 54, -206, -136, -134, 315, -141, 3, 31]
1527C1j91P2o2r5M01k62QJ90o1M8n5L41l26Lj19rK17J2j06p1m6Q4k65L48K2j68
1553e9P2k30L93j16k43J41J11j88K69j28p6o6p6J52J84r0Jm1J61j79K78n9l4k91
1577a14J66j15P1L62m88K86j92K29k95J02K20l6m00K99q0K18l31Qr4J17J72j56
1599e1k31L03K24l14J1O8J32j16k51O07m24K78k64K20j69Q1m2k18O3K19M3K1k37
1622d7j36K17N2J9j32J53J5k23N5M5j0j23J30j03k99J92P1J52m3q2L05j08l81
1645b81M61k10Q9Q6k38K51M8j22RPJ25k12j90R8P7J01Lj13P1J8j47N1j74L10r6
1670B2R0j08q8K55l26n6J79j61K99j89J19k9j71M08m14k6L25k59r8M18j08q0m0
1693c8J72k32J23J96j47q0J49k45K43r1J7j04N6j03K03j65n4LJ99J44l19L9J24
$$ y = [31, -160, -88, -150, -245, 156, -106, -98, 92, 31, 79, 24, 365, 39, 42, -77, -86, 131, 143, 37, -34, -80, 4, -261, 87, 109, -59, 13, -217, 176, 60, -183, -42, 69, -119, 150, 22, -54, -120, -196, -44, 140, 50, 51, 10, 171, -8, 270, 211, 177, -114, 52, -63, 8, 370, -118, 168, -24, 205, -90, 12, 232, 196, -204, 95, 15, 233, -98, -90, -184, -67, 105, -51, -282, 21, 245, -69, -58, 10, 142, 26, -225, 382, -42, 236, -28, 192, 23, 104, 62, -156, -93, 126, 169, 190, -47, -183, 34, 86, 105, -27, 126, 141, -82, -27, 18, 8, -115, 15, -88, -387, -195, -124, 28, -15, -97, 208, 100, -281, 180, -30, 59, 145, -93, 158, 206, 84, 93, 100, 225, 13, -177, -79, -2, 99, 102, -11, 60, 78, -69, -18, -192, 118, 22, 112, 4, -84, 171, -155, -211, -32, -193, 106, -83, 36, 7, -164, 244, -170, -196, 129, -130, -228, 190, 82, 2, -38, 134, -98, 25, 221, 74, -6, 143, -102, 141, 50, 67, -37, 19, -84, 119, -46, -100, -97, 102, 246, -73, -34, 90]
1716I0j67k5j24j11L27J37p1Q1K5L0l02K81l0J04l40m3K36k15k0K84j90j54K93
1739I6j60O1K08l06P7Q3n0J33j06k26J94o3J5r6L12q1k04J44j43RJ06q2J54j08
1763c3o9J35J7j98l6M81k64j40L49j41k04L01k87J52Q3l40K65N0k29n3MJ42Q8
1786G3j84J32k0n0j08K90l97M76l19q0K45p3Mk14J92q2J66L1k66j9K95j30K53
1809B15j57R5m14J57M1J84j76R3k36O3o3J05K1j01K85k80J00j60J30L5O4n0j19
1832a68J50K18j37K17k46L0j08K14l07P0J88k53J38j80K53rj90Q3j59Q7J98j58
1854f9K26j94K0k10N4K69j38J26k04J94r9j80Q0K40j9r9m7NO7j01J63J4j82j49
1878b33K62k00M76j98l48M62j58j70j77L33O0j58r2K62j05j84K98k90J64j95J85
$$ y = [90, -77, -102, -226, -337, -10, 127, 56, 137, 162, 192, -110, 171, 141, 245, -95, -138, 98, -117, -137, 147, -43, -197, 96, -64, -3, 205, -101, -24, 59, 9, 142, 36, -190, 4, -59, -44, -140, 172, 91, -113, 31, -112, -103, 3, -79, 75, -33, -102, 33, 50, -148, -184, 297, 33, -107, 242, 101, -103, 198, -89, 63, 146, -194, 71, 121, -108, -161, -157, -15, 73, -111, 21, 1, -49, -157, 133, -264, 212, -107, -187, 58, -15, -11, -225, -33, -115, 51, 82, -184, -203, 92, -38, 215, 58, 153, -261, -104, -63, 121, -55, 38, -198, -135, -198, -93, -72, -173, 112, -168, -68, -228, -98, -63, 1, -49, -168, -18, 200, 63, 280, 34, 64, -44, 170, -137, -67, 121, -132, 6, -174, 79, 70, -120, -37, -196, -109, 89, -69, 157, -37, -17, -227, -173, 96, -42, 84, -120, 74, -25, -205, -125, 115, 96, -3, -50, -45, 22, -79, 84, 98, -84, -233, 29, -171, 305, 107, -241, 221, 63, -107, -284, 49, 109, -49, -141, 121, 16, -168, 130, -160, 4, -191, -6]
1899fJ31K07k79j36J72K26k97j96J16P0K24k16j40J40n3R7L07j27m21K10r3J77
1921A13p2on3o5n0K87l35K65j69p2Q1K22l36K21Mm3k9j62K5P5P3J52k29J94k93
1946b02K70j74L6O7J57j35K39k60j17J95j33o8J56P7r6q6j50L13M6j49K19q5l29
1969b09J87J60j67O2j9MJ34k15P0K25l51j95L02J40l55M05l18L12j17j68R6j03
1991a20qJ97j39q5J72j10J41k41R3K5L3m4j98J15J19K5mM3L5L4k60P9j0L77k06
2016F3J39m64K69M0p9J08j20q7o5L68L0k21j08J08Jj74K40j81K34j68O0K24l27
2039a10J9K01k50J13l0J9P2J77j16J3l33L45m5j50k3k33M27J9Po0j77j42K75K0
2063C8r6nK03J00j29k33R2J49Kj4q1J42p5M2j15M1j72p8M7K48j24l6J36p2r8L1
$$ y = [-6, 125, 332, 53, -83, 89, 315, 18, -178, -62, 8, 232, 16, -124, 16, -37, 60, 367, 240, -181, 29, -64, 113, 41, 35, -18, -83, -133, 154, -181, 84, -85, -157, -76, 146, -190, 31, 35, -8, -37, -199, -174, -99, -26, 126, -103, 91, -202, 68, -106, -70, -3, 154, 19, 258, -2, -119, 76, -57, -125, 31, 108, 12, -74, -224, 89, 135, -14, 205, 120, -209, -22, 138, -29, 33, 14, 18, 152, -63, 7, 232, -119, -314, -12, 128, -227, 178, -140, 172, 55, -113, -17, -120, -128, 69, -70, -155, 17, -93, 48, -193, -100, -75, -42, -86, -284, -169, -50, -25, -29, 14, 49, 83, -177, -98, -108, 269, 63, 202, -262, 7, 47, -32, 76, -44, -131, -196, 172, 202, -19, -127, -19, -18, -192, 48, -133, 101, -67, -7, 217, -110, -91, 110, -140, -27, -57, -38, 34, 211, 95, 108, -225, 120, 75, -75, -98, -331, 96, 115, 122, 62, -115, -257, 18, 38, -58, -63, 140, 240, 111, -122, -30, 119, 121, 107, 26, 168, 93, 135, 20, 61, -111, -189, -142, 106, -18, -54, 82, 10, -88, -57]
2089e7j5K27j69J00k59K10J03k01MJ6K27m23J93j8P2LK8m5o6J70k28K02k9j09
2113f4o8O5j4j25J03M07n13L69j91j05K14po5j72K54Pj08o8L82j64k00J3j24K52
2137G8j9l41LK68O7L2R2k3j66p3J03J0j96M8n5L08k30q4L74k66p6J40k2o6p6J47
2163b3J64n7j70J45Jl15L36j92j15K71j03K43M2k38J09j2k94K9R0j31J7K46j96
2186a53J70j09L7M31m50J94j78J48l04J25L78m66K8K09R0m94L45j01O2J29l67
2207b76j16L48k93K50J62M4j76j22J22J5J04Np7k21L36k06K70j13k9J61m49J21
2229a40J98j08K7k4Q4j60P9qL1l6J71j31P6k24N7L02r9j19k9lm6L42j41q0Jk35
2255b15M21Q9l16J12k97K65K5P0o3j12J21j83J9K8l4K4K0L6j26J16j01K34j26
$$ y = [-57, -72, 155, -14, 86, -173, 37, 140, -61, -57, -41, 186, -237, -44, -62, 10, 13, 41, -4, -70, 100, -128, 74, 45, -64, -132, -67, -81, -206, -103, 304, -209, 160, -31, -136, 78, 71, 6, -166, 88, 95, -13, -81, 301, 137, -63, -50, -174, 78, 59, -282, -279, -11, 56, 88, 180, 157, -9, -82, 21, 31, -165, -117, -172, 136, -94, -178, 196, -70, -146, -6, -28, -94, -170, -23, 141, 84, -86, 59, 60, -255, 81, -111, -226, 45, -58, 185, 227, -11, 98, 86, -208, -179, -89, -220, -203, 43, -153, 17, -92, -55, 376, -74, 120, -58, 90, -214, -89, 289, -177, -149, 60, 150, -344, 1, -100, -38, 91, -276, -392, -44, -337, -87, 75, 119, -57, -179, -57, -42, 62, 67, -10, -231, 105, -101, 169, 56, 27, 188, -261, -140, 58, -50, -23, -47, 37, -123, -44, -52, -21, -57, 114, -17, 59, -165, -108, 194, 95, -24, -53, -56, -102, 240, 99, 19, 20, -215, 206, 295, -21, 91, -206, 59, 84, 154, 91, -21, 100, -83, -64, -36, -70, -46, -26, 10, -116, 0, -101, 133, 7]
2278Gk51O89l42R1o5L01k88j05k43K74r6J30j34q4J16j03L14l76L14Ok38K99o2
2301A54k57M6J07P8m05M32k46k30L05j19n2L32k9j02q4J38k45K89j51j53J47q1
2323a26j08K85j51J94k58lK07l49K48j26L49m0j29J42M0l80Q9K37l1R2k46O1J88
2346A85j51j40oJ14M6p8r0o3L38J33k21k00K96k22j48L57j32k93M21j63k37L46
2368I2o6J09m50P8k1K38J72j54O9J2j42Q1K0j37L51l88J08K39k04o4J36j47L0
2391c8m1j23k4L16k08J31l1q7J4J12k62J19J23k7L4j10K0mJ41m0n2O8J6J5l31
2416b69K17J61lk25L18j10j90Q6M3n7k7K22k92J55m0k1J68j29K16l69J37MJ77
2439A72l91J79k03L85k35J38k07q0L81l10N9J93j68k6J70n6J5j17K50j56m3J97
$$ y = [7, -244, 445, 103, 194, 129, 430, 142, 37, -206, 68, -28, 102, -32, -116, 0, -103, 211, -165, 149, 155, -83, 216, 154, -103, -57, 50, 128, -277, 155, -91, -321, -16, -135, -187, 145, 116, 14, -70, 68, -177, 112, -39, -192, -45, -126, -234, 51, -100, 94, -164, -167, 40, -309, -61, -187, 162, 122, -7, 135, 175, -205, -116, 121, 90, 182, -64, -3, 185, 34, -106, -112, 2, 48, -30, -120, -183, 155, 288, 67, -133, 163, -59, -207, 150, 18, -275, 146, -17, -254, 92, 26, 135, -315, -237, -258, -20, 152, -2, 67, 79, -63, 18, 38, -99, 252, -136, -28, 211, 7, -57, 79, -68, -38, -79, -202, -226, 90, -118, 13, -18, -105, -91, 21, -241, -122, 1, -26, 8, -102, -82, -86, 55, 15, -37, 31, 47, 62, -269, -52, 109, 106, -119, 199, 89, -101, -15, 28, -29, -56, 166, -126, 29, -11, -32, 136, 7, 223, -146, -9, -5, 172, -219, -40, -243, 142, -93, 45, -162, -242, 139, -171, -112, 81, -87, -113, 57, 1, 16, -101, 149, -7, -50, 147]
2461A47k60J33O0kp8N3j78K47k53n3R6J18J7p2K79l27k6L27j58l05K87J2O2j12
2485A4j03J1J3k41J90L00r4j92K32l22K84q9j10J80r3j9J59P0m14M62k60N3j55
2508a24Q6Q0r1K31k34n0J13N0m4K9K77l18R2j3p3L13l82M4K10j96k2n1K58j2l16
2533a43K46k36O1p8K05n3J54n2j59J15j42J01K4K48k32M7N8l0j9l18j0mO1J73
2557A7k26O72k75l45J40O1K4l86M71L1n35M78J88k31p9n2J4J18q5k32K21j0Q0
2580E9j60j17K49J54k39J67l15L49j01O5JP7j78j3L9l8j88lM48o06K72m1R4L6
2604A1j57R5J31k11J64m06N08k30J92O2j36j75R6Q4K27k09p8n4J94M9l17J38J68
2627A46N6J25j77k87N1k9J85k02l0m3J7J54r5R8J17k46J75n0R3k68N3J43l1J15
$$ y = [147, -113, 20, 80, 78, 0, 53, -125, 122, -131, -184, -88, 30, 47, -25, 254, -73, -99, 228, 70, -235, 52, 64, 126, 14, -89, -78, -65, -306, -116, 184, 90, -102, 130, -192, 92, 3, -107, 73, -20, -39, 120, 190, -224, 238, -22, 31, -124, -38, 42, -49, 182, -52, -102, 11, 61, 17, 46, 323, 5, 97, 84, 11, 324, -58, -14, 196, 0, -22, -73, 185, 173, -143, 103, -133, -72, -150, 55, 2, 156, 104, -55, 60, -82, 19, 43, 291, 59, 106, 164, 134, 115, -203, -213, -217, -156, 17, -209, 463, 188, -157, -17, 44, 68, -318, 153, 184, -351, 127, 315, 84, 5, -47, -33, 85, 0, -232, -11, -21, 59, -101, -218, 31, 185, -54, 113, -202, 147, 46, 111, 112, 189, 11, -2, 37, -1, -189, -192, 256, -350, -78, -119, -25, 11, -146, -51, 80, -131, 33, -373, 135, -95, 97, 159, 23, -152, -56, 28, 255, 46, -32, -86, 108, 157, -160, -22, 146, 202, 327, 150, -137, -86, -115, 70, -132, -162, -205, -188, -34, -129, -31, 86, -160, 15, -35, 58, -210, -157, -14, -45, 70]
2651G0r1m6J03n6q0L3L39l42m4L7J01L92l74j3R5ro1j30O2n7p1J37k17J12MQ2
2677b4jj55O8m1JK01R6l10M9K14k05J43j69O4J77k75K32J5o7m8k9j55J58K41r3
2702H7o6J96nk80O0K88k39l7J93n35o9J16L71k79K7M3K45J9k17n0P1K66k87K40
2726A58j86m1q9J61J93j18j22O8k52N07k87j28N0P8k93L22K75l23j30K86k22L14
2748B21oJ10n56M69l20K31q1k23J80l39M01l32L06r3J30o1Q3J2k22m4J60o6m8
2771h8M4J29j75n9J77j58K18J48j08k36J09M1J64j05qk62K82k1k59J57O0k49J01
2794i8L10Nl36m2J24j8ln7J78k95J09K1J37m16N44J33k42q3J3j17J13J43k9k09
2818a15K57k5r3K70l80P7Q7j11J80j19r4l9lj1K19j16J24J27m32J98J42j70j25
$$ y = [70, -21, -67, 36, -20, -100, -67, 272, -70, -114, -77, 24, 416, 42, 29, 124, 115, 54, -76, -14, -71, -142, -5, -222, -110, -106, -24, -25, -180, -112, -153, -152, 49, 145, -165, -116, 98, -107, 36, -133, -69, 108, -167, 65, 80, 13, -35, -64, -219, -61, 180, 87, 21, 217, 212, -68, -8, 280, 41, 4, 197, -338, -407, -291, 80, -199, -172, -129, 116, 135, -82, -132, -61, 205, -82, 158, -28, -69, -158, 3, 196, 78, -44, 24, -228, 279, -8, -136, -86, -8, -301, 21, 296, -27, -157, 129, -93, 221, 215, 325, -231, 238, -82, 149, 68, -155, 25, -314, 87, -245, 61, -32, 98, 37, 120, 132, -90, -134, 26, -40, -88, -44, 85, -90, -149, 28, -130, 88, 236, 128, -108, 1, 42, 206, 101, 93, -169, 113, 92, -167, -10, 50, -199, -98, 212, 217, -119, -161, -37, -55, -58, -115, 63, -232, -123, -102, 35, -381, 163, 296, 54, -29, -16, -133, -20, 123, 94, -115, 142, 117, 24, 294, -86, -9, 78, -33, 147, 28, -66, -105, -108, -119, 100, -16, 108, 235, -197, 1, 143, -27, -152]
2841a52J91J1J02j48J53n2q8L0J6k52K10Q8J23l15j91K23O6k09L40j74M4Lj07
2864h8K26J71j90p8j50K23L7j36J11j05o5k8K26l37M33l6k97o8L92j74j10K29
2886A86J00O3l95J48j78o7J65j18K20j19J91k05mK24j74k8j15j34P9J00L36m10
2908a35J39O4k98J58n2K21M7o5Q5l7j05J3o9j6Q5K7r2k5l1m6R4J2K32k10j08K68
2934A56j80P5Pp8O4M1j15oJ31k81J04o0K20m49L31J47J72k99j05J43o5N7k33M80
2958B57l59K40n40N13r7L78m61J22o8J07mJ60j12n2l20J34K52m5j54J08J14k46
2980g3N8J75J26n93L25j12rL5R0k5mj34m0L18k78jo3J52qJ13O6k33q4J74j52K16
3006C9L30n92M42j87K1J35L9k38j07P4L4K8J60l30L96n2k85K18l64j6J62Q7N1
$$ y = [-152, 39, 50, 152, 4, 157, 105, 17, 47, 63, -189, 21, 109, 232, -83, -274, -51, 15, -194, 146, -28, 16, 19, -88, 138, 309, 119, 41, -109, 114, 151, 15, 126, 21, -44, -72, 154, -183, 250, 214, -83, -151, 241, 67, -43, 186, 286, 349, -46, 102, -76, -143, 22, -96, 124, 5, 196, -9, -13, 211, 37, 9, -106, -240, -161, -61, 275, -135, 4, 68, -230, -72, -124, 97, 144, 79, 164, 127, 22, 35, -34, -50, 35, 62, -30, -55, -86, -132, -38, -26, 206, -4, -112, 156, -24, 51, 58, -20, 44, 85, -30, -36, 95, -186, -82, -142, 78, -371, -40, 107, 279, -20, -125, 18, -47, 10, -223, 257, -102, 138, -402, 111, 14, 392, -69, 53, -15, 92, 88, 248, 136, 84, -236, -102, 150, 105, -49, 59, 173, -73, -15, 160, 286, -307, 18, -94, -103, -68, 22, -3, -7, -141, -181, 137, -141, -142, -205, -53, -61, 52, 118, -115, -199, -25, -177, 39, 369, -223, 219, 32, 53, 188, 227, -11, -118, -44, -10, 18, 178, -152, 244, 192, -93, 125, -239, -255, -93, -6, 45]
3029D5nM5mk99L02k33K56pJ6rj98j02N5Q3K19k00J30Nj74K46j0j00J38m92L62
3054F9k96K13o3j87L90m57LK22K32j31k03K39K32m77N18j89j15j97L13k04K11
3075A23m52L15KNK47k32J46j76j13K10o2l4O6m9Q0J80l81o6K63J67l80J70L3m09
3099c47N64k83K76j53J59k86N57k07l49k14K59K16l56J32j63R0n8N9q8L71j37
3120D2q1L11j97m0M8J03k40r2J34j7p0l8K98o9M8j02p4R7%jr6J10P2k00N0K4q5
3147f5K78j58j6p4J17J05p0J60k33J18k50j41M06m47L73q1kj69R4J89k82J98K16
3170B66l37L05k1j49q4o0J42j38K4j20K03l38L24r2j80K49J27j82L5N6j77M7J66
3193F6j89Q9L51k32k76K34j82j4qJ95k15j10J1L68P5j69J07K1k20J6LJ76k14L5
$$ y = [45, 40, 85, 81, -218, 84, -149, 107, 100, 116, 107, -91, -193, -138, -55, 164, -36, 94, 99, -75, 171, 161, 61, 199, -293, 69, -227, -14, -77, -264, 126, -331, -328, -106, 126, -5, -208, 31, 263, -214, 304, 115, 0, -197, 116, -88, 123, -329, -14, -12, -7, 240, 8, 154, -22, -135, 75, 13, -21, 45, -4, 76, 256, -125, -191, 72, 239, -141, 29, 62, -347, 217, -66, 210, 57, 216, -70, 487, 280, -69, -283, -24, 192, -164, -32, -195, -105, -163, -104, -192, 179, 42, -39, 272, 75, 35, 83, 186, -54, -146, -12, -29, -99, -137, 161, 92, 140, 38, -36, 61, 61, 60, -36, 74, 146, -54, -4, 20, -65, 213, 55, 39, -35, 82, 187, 117, 277, 44, 162, -88, -229, 177, -270, 103, 22, 20, -149, -55, 134, -148, 50, 266, -71, 234, 213, 64, -20, -80, 62, -76, -52, -172, 31, -307, 17, -75, -255, -6, 121, -61, -26, 30, -147, -100, 66, -123, -34, 317, 85, -191, 43, -139, -153, -161, 34, -181, -291, -280, 88, 163, -6, 101, 122, -98, -82, -79, 97, -117, -82]
3217h2Q8k20K14L03k40M7Jj63J79j06Q8k8K86n22K55o1J01j03n6J75l9j16L29
3240C30o70M65m4m6o9K01mr3o9q2j69K17n5J79k58N6L7J33l29J87Q0j45o0O2L67
3265B21k17L3p7K27k90o8J91j63O3J31N1j62O0j85J05Q6k16L39j47J03r0O1l38
3288b82M02j25O7K9k89J94j8p7L9J77J87l32L66m05J33L24k89q5k31J72J3lr7
3311a30K35j83q1J35L15l62N0j03k24N86k09J42l30K87NO7k64Q5J06J81k80j62
3333a34M6L9K86q4p5R4j02k64J57r0J84RQ8o2k78L49k55O7MJ80K38k36r6k52j7
3358b04J02j15J63r4K4J59O3m2N4j70K61l25l0j0J84J50k56J42K68k93K36l71
3380a04K16j1j12j28O6K41l70K86j57k42N90l11l65J79K40J14l43J24J07m9Q0
$$ y = [-82, 6, -214, 0, 303, 63, 110, 111, -52, 127, 21, 109, 81, 367, -155, 100, 39, 140, 37, -19, 156, 117, 1, 330, -340, 125, 81, 35, -34, 167, 163, 70, 1, -81, -250, -33, -88, 91, -167, -111, -74, 59, -270, -83, -3, -148, -208, -146, 221, 4, 37, -40, 187, -103, -171, 20, -143, -80, 51, 102, -60, 0, -185, -80, 6, -210, 129, -18, 85, -5, 56, -282, 120, -5, 62, 91, -198, -4, -22, -99, -60, 117, 304, -28, 338, -67, 66, 390, 101, 16, -215, -43, -30, -33, -130, 105, -78, -159, -24, 291, -71, -21, -124, -348, 238, 29, 171, -159, 128, 133, 200, -64, 21, 127, 308, 28, -134, -88, -49, 237, 153, 78, 172, 70, -194, -37, -127, 57, 66, 154, 92, -186, 163, -92, -25, -21, 159, 397, 161, 65, -187, -204, -102, -217, -54, -148, -124, 35, 98, 56, 110, -60, 201, -124, -154, -164, 20, 170, -86, 56, 324, 31, 267, -104, 112, 101, -11, -139, -73, 168, -202, 84, -73, -315, 275, -36, -401, -222, 18, 132, -211, -87, 20, -29, 51]
3401E1k00K35j34j0o3M84m28r3K63N2l17m5J5J33j29J43rj19M02k91L49j23j33
3424C3J57m11K81o0p8J15J49k23J53k78J06K62l42J19j67K10j45J57j42J76k11
3445a39j2K90j41J26l1L8j03k4j38n5J56J55m3n7K44k38K42l40M6J62J20l65L34
3468B27j98k26J94R8J0q2m4J13K0J0j64K93k85J53k66k8J69j4k30K85j86K25J35
3491B09m59K83J32Q1l51J49k84K90k20K11Q9l23j5K42K6j82J94j03j23K15j38
3512g7J50k20K47j1J8k75J37l35M37J2j70p7l20N71j46J92Op1o2M3o6M0J48j55
3536A6K03j98k26L14q5r1J15K03m6j57j13j9l9J34j19K31o3Q6K00k56k86K93j70
3559g3j6q1K9R8l7j58L26k84J27l6J37k80J10J50R5o0JK27k43j75J00j16J26N6
$$ y = [51, -149, 86, -48, -58, -121, 363, -65, -158, 105, 157, -160, -205, -190, -57, -186, -43, -52, -171, 231, -60, 289, 166, 33, 190, -221, 60, 0, -78, 37, 186, -37, 116, -162, -56, 206, -136, -17, -184, 26, -119, 38, -104, 72, -139, -151, 139, -2, 124, 93, 131, 28, 4, -134, -189, -33, 122, 79, 22, 266, 28, 270, -70, -24, 138, 258, -107, 227, 29, -197, -3, 95, 105, 23, -21, 92, 112, 122, -42, 251, -34, 119, -147, -175, -6, -20, -250, 35, -151, 74, 209, -250, 33, 165, 246, -105, 44, -240, 50, -170, 41, 130, -193, -208, 34, 60, -122, 72, -31, -154, 61, -77, 73, -147, 100, 89, 107, -168, -31, -366, 71, 83, -87, -164, -484, 87, -59, 133, 139, 68, 6, 49, -17, 23, 171, 16, 219, 21, -205, 109, 24, -67, 48, 251, 205, 48, -65, -84, -123, 11, -108, 123, 60, 146, 346, 90, -196, 97, -73, -89, -170, -141, -43, -80, -238, 88, -196, -69, -105, 32, -248, -138, 12, 107, 47, 48, 275, 32, -143, -43, -159, -33, 23]
3583B3M6k00J02M9M6L4k34L60m63J93j82J18M7J55R2j69l1o6K68l36J09M5N7r5
3607c2j42J00P1k16J42K71k38Q9j79m4L62L8k61k2K55k54K5k09L04o1l7R3J80
3630B35j86J66k45L25k12m57L07K95m06L46j03N7%j80J67k70K12mj11p1k1K8M19
3653B91n2m50K41j86K69k23O4O6Nk02K48J72J6k56m5mj48J7K26j08O5L0j76N5
3677h5PM2n0P6n2L93l99L00k13k76K84K2k27J89P4MJ29l04K07J74m45N5K51k72
3701a16K63k38l4J84Mk5p5K21j57j17K5J36NK32k70k47L75l89l6R9l2o7M46k73
3725h6K12l5J93p2k51j4o5J15k85M90l2j16j00j28K51j40N3k61K23r2L12j25m1
3748Fp1L21k98N9qL7q0L9l6M2O5q5OJ6J40k51P3K84K9l85K93k83J88p1l11K60
$$ y = [23, 69, -131, -29, 20, 66, 100, -134, 226, -237, -44, -226, -108, -61, 94, 186, 17, -14, -80, 188, -148, -39, 6, 63, -32, -174, -74, -3, -219, -77, 194, -44, 45, -134, -178, 184, 222, -39, -61, 194, -60, -35, -244, 60, -1, -38, 55, 235, 49, 215, -30, 295, 83, -374, -67, 228, -178, 168, 65, 122, 122, -58, 109, -161, 51, 47, -64, -135, -156, -128, 291, 239, -211, 30, -156, 113, -110, -46, 20, 25, -177, 71, 243, 259, 3, -42, -46, -194, -177, 49, -59, 6, 36, -140, -85, -78, -36, -86, -10, -62, 331, -68, 232, 19, -257, 27, 49, -178, 11, 85, 89, 218, -86, 121, 295, -150, -95, 156, -116, 147, -91, -125, 59, 63, 38, -37, 184, 27, -90, -65, 71, 76, 308, 38, -209, 166, -223, -259, -160, -192, -259, 187, -86, 126, 91, 284, 212, -39, -53, -118, -3, -288, 202, 170, 54, -46, -174, 77, -63, -10, -271, -48, -140, 172, 47, 6, -65, 256, -42, 17, 9, 46, -34, 5, -31, 11, 76, -9, -3, 13, 153, -98, -25, 259, 288, -97, 196, -87, 101, 30, -281, -21]
3774b1k1q8J45r2On3j1J56j0K49j71J27o7k81JK15K60k69O4J56j39j55K0j46K81
3799A56r9j89J74k17k5J96K88m39K08o8L4j93R4J1J32m8J16j97K80N0k23j5k8
3822bJ59m03K58K4j19O4K2j70K02J85m15J44J28J25l61o1N43k57p4K30j25j99
3844a02J87n1m8k28J90M9J81j50j73J89O7j13K56l64J09j41M1J7R3jn7m0K47p8
3868H0k98Q7J89Q1l03J99k59L96N5j49Mj60k2L44j70j43M76k92QJ99l85q2K84
3891A39j89O3l32L92K8m1r1j2k93J04L64j47K41j53m7J26j30K3Q2l7j20J68O6
3914B04q2r3Qj06p8N2K31r2rK17l51P0M9L0j67nK40k52J12O5r0J6L59m38J2M00
3940C02m57p2K55j5k09K64k15J35M7l9J30j44J06j13Mj69J73p1J21j80OJ14o8
$$ y = [-21, -42, -130, 15, -77, -71, -124, -135, 21, 11, 260, 89, 216, 149, -132, -131, 84, 344, 75, 139, 295, 156, 1, 21, -125, 156, 57, -132, 42, -175, -200, -4, 284, -155, 53, -15, 19, -174, -80, -69, 63, 15, 131, -66, 214, 264, 41, 26, -2, 157, -246, 12, 36, -83, -19, 3, -167, 35, 220, -195, -51, 77, 202, -159, -220, 323, 66, -8, 222, 97, -102, 85, 34, -14, -242, -52, -3, 178, 28, -145, 44, 111, -2, 254, -110, -1, -142, -101, -84, 9, 8, -49, -89, 158, 80, -218, -131, 58, 139, -164, 35, -224, 172, 227, 78, 82, -78, -100, 244, 74, -69, 407, 115, 123, 322, -63, -145, 139, -50, 13, -319, 73, 101, 60, -31, -43, -336, -232, 132, -15, 226, 73, 26, 152, 22, 45, 127, 90, -30, 138, 204, 122, 29, 37, -69, -147, -95, 136, 44, 35, 252, -99, -29, 20, 50, -117, -122, 118, -134, -22, 43, -47, -31, 328, -110, -98, 302, -155, -227, 28, 13, -196, 68, -147, -12, 35, -4, 126, -18, 88, -25, -21, -190, -17, -88, 33, -147, -141, -27, -95]
3963i5k57L50J5q2r5K75k58J34O4j72j91M32M8k09J34k1l09J34J23J5j1J3R3j05
3987B5j37K7K0Q6N0p0k0K06j56j09J04oJ2j87M25N1j88k95K60K43k40q8rM7Q9
4012A40k25J7K6K17l94K22K37k35J48o1P4l47K32l34K20K66j44l41L92k39J6j37
4034b50K29J71k6m33K32J36n5J52J13k31k43K62J00k71j68L02p7K48k03j90R5
4055a07M6N3j93M72k28J64k94q3K91k90J77l6K57r3q9J25k32J2jj4P9j58J13m8
4079g7J24Q4k22K07R4l4l4l78K91j36O5J54j45O4k74J51J5J50k86L45J6N4j65
4102F3L42n42Q2J12j90lM37k78M7k9L47k13k29lp8K87m35M08q1p7J09k35K63m5
4126E9k61N87m45L09r8k06L8J3M9k69L37j61n0J11k43L52l12lL25k09j10L01j66
$$ y = [-95, -352, -2, 13, -69, -164, 111, -147, -13, 51, -121, -312, 120, 168, -41, 93, 72, -237, -103, 20, 35, 24, 37, 130, 25, -112, -85, -65, 21, 71, 1, -19, 187, 31, -78, 26, 20, 32, -155, 270, 321, 133, -162, 98, 341, 101, 13, 4, 51, 140, -85, -68, -42, 175, -219, 3, 240, 5, 153, 92, 166, -181, 51, -283, -63, 203, 59, -282, 110, -129, -113, -250, -21, 150, 124, -309, -77, 59, 4, 156, 269, 38, -205, 57, 157, -114, -282, 20, -57, 191, -12, -202, -107, -61, -8, -201, 271, 43, 207, -87, -170, 121, -169, 8, -28, 229, 136, 47, 172, -60, -48, -49, -63, 16, -142, -29, -77, 47, 131, -91, 116, 210, 176, 142, -236, 55, -81, -16, 138, -7, 57, -217, -66, -51, 99, -187, 158, 174, 228, 63, 405, -137, -55, 57, -133, -136, 301, 23, 70, 41, 388, 175, -54, -57, -135, 152, -283, 125, 44, -33, 76, -159, 104, 59, -202, 385, -60, 249, 151, -55, -17, -4, 45, -224, 113, -48, -98, 13, -230, 122, -190, -193, 132, -77, -187, 114, -52]
4149e2pj09K48j38K17l29K02K36m51m3J6L08l54K21K85k16k1n0J44j50J18k09
4171a34K9K45N3j00m2j11J84l5j69J29j78J64K3j03R3j38j06P5J95K1m08K91R3
4194G1l2r2j00Q3l3J46r8N32j79k99k0J56j95%o0L80k36q1K44l43Q9J82l34M81
4218B62j99M6m2j54j21K90M5j92K31Q6k69O2p8J92j02k49K10M9l30K22J16j62
4240h7R9j61L6J2%m3J86n7J30l88L81M6k30j84j9L28j94K29R4K9j02j07J93j49
4264D2n7J56nm3l75M70k55l8J32Q7j65q9K04l98L74k7k69J11R5q5J45R5L3j98
4288f0M1q2P7k15K66O1j17p9mR6J96k85l3K29l69N16n13K02M77o44M77j1k06M0
4312F0j84j8K03q9KJ28q5K23j42O1j19K75m4o0k63K24k1j53K17j00j00K16%k11
$$ y = [-52, -59, -168, 80, -58, 159, -170, 32, 268, -183, -226, -210, 98, -256, -35, 250, 34, 13, -37, 107, -43, 75, -134, -105, 140, 193, 93, 51, -60, 124, 89, -80, 49, -129, 35, 58, -45, 48, -90, -196, -121, 74, 95, -313, -22, 71, 39, -53, -153, -70, -103, 43, -55, 477, 298, -1, -21, 135, -60, -60, -120, 260, 24, -57, 187, -156, -67, 115, -219, 262, 63, 109, 67, -87, -208, 82, 127, -65, 166, 252, -17, 45, -33, 159, 57, -192, 18, 67, -263, -41, 75, -87, 12, -149, -113, -101, -101, -144, 42, -15, 115, -273, 108, 154, -76, -260, -279, 49, -145, 84, 178, 207, 105, -2, 191, 42, -15, 141, 136, 93, -282, 188, -67, -105, 27, 114, -51, -140, 64, -334, 40, 13, -256, -145, -50, -135, 10, 105, 138, -60, -19, -101, -24, -239, 27, 88, -29, -108, -112, -16, 180, -105, -138, 91, -278, 238, -275, -73, 404, -240, 237, 226, 20, 60, -124, -142, 61, -28, -26, 102, 17, 240, 98, 159, 40, 315, 271, 211, -52, 172, 151, -2, 215, 115, 15, 231, 231, 20]
4336B0r6K02j71O2J08l1q4J47j36M1j45J32J34L5k43J26j31M5j94K96j28Q1o0
4359A0r7J48o2Q1j85K36j16J69k74K13J46l21J69j59k47J67K57r1N1p1J3R1l37
4382b09L65l25L10k51K17k78K79j27%J06l36L50j83L09k05N5q3J00l32L48L6j89
4404d3mj17K86n8Q5k49J02K20l84J26j10l7M39k41l6N9j19N2Q8J41k48P2o3R8
4428E9j69J97m2R0j68nJ20j66J60q8j49J3l6J74nJ18k23L51k97J69j37J41J80
4451B87l36J98k57LJ51J24N6n60K01K24j6k57L07l26K18j78P3P1k18J82L77j54
4473A70k72k1J87l39M9m2j45M92N6J51o98L26J30L2j57O2K8p8N5o7K22q1l8J43
4497A65J2l08J97j03J05j65L15k29m8p8J38q4J20P8j99J4J59j80L48l82J45M2
$$ y = [20, -76, 126, -45, 17, 125, 94, 10, 157, 21, 62, -83, 49, 183, 218, -25, 101, -30, 15, -179, 117, -11, 70, 10, -87, 61, -1, 80, -105, 131, 15, 184, -90, 123, 269, -52, 117, -42, -289, -122, 135, 44, 95, 24, 37, 128, -209, 156, -169, 141, -110, 107, -171, 108, -19, -19, 87, -249, 101, -82, 227, 22, 77, -6, 94, -238, 110, 146, -43, -47, -164, 122, 64, 149, -100, 2, 222, -162, -36, -146, -183, 256, 15, -21, 38, -81, -29, 59, 200, -48, 24, -39, 59, -110, 87, 45, 135, -33, -38, 82, -84, 76, -12, -161, -148, -184, -10, -15, 103, -120, 231, -66, 103, -34, 107, 287, -49, 149, -108, -105, 46, 170, 226, -334, -133, 91, 75, -182, 125, -201, 17, -161, -88, -17, -235, -53, 324, 170, -102, -123, 64, -275, -226, -268, -413, 79, 135, 286, -412, -86, 44, 76, -81, -19, 9, -69, -14, -81, 141, 60, 22, 165, 177, -131, 66, -37, 68, -97, 218, -11, -59, -137, 1, -83, 37, 115, -84, -70, 89, -91, 257, -125, 20, 62]
4519F2r1J6J49q8k00J69o7L8q9P5k19M76j53j4k50j08K74Q6J43j17k25M3j44K25
4543iM6L09k48M4j89j85M91j40k29Rl9J21O2k54M20m68J82J97j11M6L6k33J32
4566a0o3j08K21o4j41K03j46L25l03L3n6r3j19N11m6j70K53j45m2M0K74l39J06
4589A21j18l4J1K0n1K28J13k14R7j94n2j2N6k1M5j89J55J09j00k4N7r8J12j73
4613a56Q0k87K54j07L63j15J97l04k4L7J91J7j21K46m82K01p0n7K47j79m9Q7m4
4636g5P7k2K8J12P0O7k03j22J05L9j18o1L17m00L41k96K47j74J11n6m4R2O5K8
4660A28J9M7j28k12J68L3j41J61Nk64L57k01l1Q8k22O1j9K88n1p3J97j76J92j40
4684H6K01j17k54r3J26P5j55K37n1m3L7j41K13j90R9k66L91K5j17j10o1J58k71
$$ y = [62, -29, -13, 136, 48, -152, 17, -50, -12, -101, -26, -245, 231, 78, 64, -186, -294, -20, 66, 209, 92, -133, -90, -234, -9, 37, 346, 98, 142, -47, -232, 259, 119, -110, -101, -140, -19, 43, -211, 209, -259, -77, 120, 9, 55, 91, -142, -10, -73, -181, 40, -24, -165, 38, -108, 217, -86, -53, -109, -202, -321, 190, 144, -26, 227, 82, 40, 80, 354, 15, 121, 3, -31, -20, 0, -51, 177, 290, 76, 173, -21, -73, -85, -29, -50, -5, -194, -39, 70, -30, -54, 3, -95, 17, -156, -76, -363, -109, -216, 147, 32, 229, -75, -99, -62, 129, 146, 25, 271, -211, -10, -80, -137, 110, -69, -118, -31, -75, 2, -20, 8, 120, 190, 257, 54, -68, 37, 76, -42, -103, 214, -186, 155, -141, 106, -68, 43, -13, -57, 35, 100, 128, 147, 194, 66, -146, 22, 55, -86, 75, 80, -184, 173, -28, -59, 29, -193, -132, -151, 137, 86, 13, 210, 34, 226, 86, 287, 170, -84, -177, -51, 24, -131, 106, 55, 12, 49, -92, 121, -69, 30, -236, 155, 180, 63, -47, -108, 50, -221]
4707b21L78j59j43k1K27P4J3r1J9j85O0kJ38q2j29Q0L23k07p2J2q6J57k3J34k85
4732i1J13m1j30L53k22nK81j03k23M8j55M7J23N4K00k01k99J72K32k94J6J03O
4755a6K77m57J91J16k00J63l9k23K51j34K09j6k60J21j36K07j07K6J69q5q7O1
4777C1j19J26k1R5j38l3k04N47l80J97j35L0K9r9K46k11Q1m8M9k51L02l36K98
4800E6m8On2K7M7n3K1l2L3j04K82l98N0J17pJ46p0P9J10j12k25J29j63J87k67
4825b41K54q1r3J87K18l05J28p4J53N6k14p7M31l23l06L01O9k16N5j35J07k2J17
4848a1J64k28m5L0k48L55o3Lk0N8J2O9j75p0M37j74j4M0j21j08J84k24jM5L4J81
4874A10k36J65R4m2k4j42J27pL9K20k03n4mJ24K5k66J22l66O10l89R2k03p6M00
$$ y = [-221, 157, -2, -145, -166, 61, 135, 148, 57, 76, -109, -49, -51, 87, 5, -124, -44, 279, 72, 0, 12, -74, 83, 60, 194, -91, 22, -19, -149, 204, -18, -23, 258, 155, -68, -20, -175, -128, -5, 49, 249, 48, -251, -79, 153, -141, -125, -22, -16, 261, -196, -5, 111, -89, 74, 35, -188, 63, -71, 138, 122, -138, -17, -153, 54, -53, -27, 142, 57, -30, 31, -88, 38, 17, 112, -26, -59, -263, 284, -96, 101, -34, -4, 25, -74, 172, -39, 42, -6, 43, -208, 94, -242, 56, 8, 14, -38, -11, 36, -17, 4, -28, 5, -99, 183, -215, -165, -48, -55, 91, 21, 100, 210, 98, -127, 2, -161, 26, -241, 13, -68, -161, 26, 244, -61, 67, -7, 146, 202, -12, -89, 342, 19, -287, 14, 83, -133, -78, -213, -106, -128, -11, 153, -75, -120, -90, -338, 17, -46, -43, -63, -5, 7, 76, -99, -169, 268, 94, 80, 120, -1, -109, 75, -149, -150, -105, -71, 110, -126, 39, 133, 91, 67, -75, 52, 45, 84, 304, 101, 47, 43, 167, 192, -74, 48, -318, 292, -97, -5, -208, -284, 116]
4898A16M8j23O6J72l25J41O2l1l26L35J1k44K49j80j32N9J68j67K59j64J54l75
4920b27J06K8L06n7j65k9j63J75j34q3K16o5J86L7O6j88j73R9K31j97J77j74k3
4943e1J82m3o9k18J96K31Q1j58l25J95j9N8m4K85k02k5k07K63K8m08L40J0r5J91
4967A96k48j2m9rL21m08j3J88m8n1J41p5k40L91r5Q7k82J50r7J92O4l71K49K48
4991B29l85J70L3j0o6J68K02m03j5J22J6j7K14k91k9L0M6q1J05j75J70J64j03
5014I4J65k43m2n6nq4L04J53k70q6K03N0k67R5J74k52N4k34O8J33j17L68m97L86
5038I4o1j3j53R1K78k50MK1K02k92J52j98J24L27j30j40Mo8j14m1J1N7R9P1M7
5063A22qk37K4R1O2J12j47N6k30K5K3L86l67K01K88l11j79J74jk65M53j53QN4
$$ y = [116, 164, 41, 107, 279, -46, 95, 157, 126, -200, 135, 146, -98, 151, -29, -161, -102, 66, -101, 158, -6, 148, -227, -121, -93, 213, 156, -9, -38, -201, -26, -160, -243, -27, -92, 94, 131, 197, 9, -164, -65, 166, -31, 146, -28, -51, 131, 88, 19, -199, -3, 228, 309, 151, -174, 21, 2, 60, 16, 301, 99, 74, -133, 130, 158, -250, 90, 100, 5, 196, -52, -64, -113, -122, 199, -209, -222, -34, -82, -133, 8, -67, -307, 84, -11, 76, -206, -56, -153, 39, 103, -268, -19, 229, -156, 14, 47, 37, -29, 139, 341, -62, -77, 45, 61, 44, 258, -33, -62, -32, 14, -67, 38, -137, 33, 197, 94, 259, 16, -26, -82, -87, -171, 133, 286, 16, -70, 133, 183, -84, 11, 185, -67, -13, -247, -179, -46, -163, 205, -292, 94, 33, 20, -133, -42, 236, -14, -10, 11, 213, -79, 73, -125, -1, 326, 196, 56, 60, -8, -122, -163, -152, -95, 4, 75, 122, 114, -123, -99, -8, 54, 166, 19, 75, -155, -130, -107, 279, -88, 113, 401, 90, -89, 85, 84, -181, 272, 119, 127, 181]
5087A81l39K48k70J39K66l6J49k03j47q2R4q0J33L8j91m6M7K08K1l61K88l18L94
5110A33K7j41J62q8p5j59N7M0m7m0m1M7K19k86J04K56j95M6k5j0L2%oJ29J14k20
5136C3j37j27R8J31j31P3K8p1L51o1k87N1n6L11j07N5m05L71J59m66K82r1j75
5159a71N3j64K10P9K15p4j51N2J95l38Q0J78l02Qn0J41K38k80K74o0j92l14J65
5182b08j73O5R7K72l42K32j30kL41J47l15r1K42q7Qp1j98K83j12K2j9J00p8l8
5206e5R5j26J33r0o0K09n5J33k43R5M2l6j2k8O0O6n9j85J62P9j37J22N1j28j03
5231g0J2K09j48pJ26k25J78Q7j75j23L11k54K46j23j98K63j19k13L85k31R9k5
5253EJ6K6k90L6K01k19L32J8n3k05J78Ql19K45o0j14j29K63J58m32Q2L14m7J24
$$ y = [181, -158, 90, -180, -41, 225, 189, 338, 135, -12, -94, 0, -80, 53, 91, -100, -146, -99, 109, 130, -231, 57, -261, 133, 160, 19, 181, 93, 18, -141, -84, -44, -91, -131, -172, -125, 94, -192, -88, 168, -27, 19, -6, -16, 16, 16, 10, 139, 253, 33, -104, -231, -133, -2, -133, -60, -32, -103, 248, 187, -100, -49, -105, 206, 99, 154, -251, 120, 279, -187, 95, 4, -171, -118, -282, -72, 7, 222, 148, -3, 49, 244, -94, -14, 164, -138, -130, -180, -39, 199, -81, 193, 133, -59, -373, -208, -381, -316, -219, 53, -289, -57, -187, -189, 152, 299, -16, -107, 135, 48, 56, -15, -213, 70, -42, -20, -39, 61, -17, -55, 40, -86, 47, -43, -103, 106, 51, 184, -59, 36, 78, 42, 30, 2, 62, 128, 69, -116, 46, 125, -12, 110, 161, 33, -70, -58, 151, 3, -4, 122, -103, 75, 162, -13, -136, 175, -79, 167, 44, -154, 109, -10, -223, 162, -69, 30, 5, 21, 47, -243, -207, -6, -225, 107, 125, 72, -133, 45, 53, -266, -21, -81, -195, -324, -61, 97, -335, -253, 61, 14, 138]
5277A38j99L25Q8l52j7Qp3j01L95k83j78K79Q3j54j7k48J64J4Q9M8Q7P6RK5k2
5302A84K6p8k12L34m00p7L05j61J26j23N5j80L1L08j29J06j89j22L23j21Q0j11
5324b5J57q9j32J17j23P7l6K65k98J69J48m16M15j93q6J59o5J84m11L11J6n19
5346c75M36j88K49k24K71m77M53j99m7K50j95J16J51l22k61L13n8J10M8J03j87
5367c3l3L42m19L19k1k68jM9l9J41rk61J27k09K94j02K69Q8l37J47k30Q9L34k48
5391a1j02J32P1k16J66l84K62J57k96J0K48M1Q4k52M8J81Nk75R6J33k56K8MM6
5415h0P4L8j75K11j47K3j22K98j52M6J10JLM8j26k14L81l63oK95k0o7k89o1L96
5440A02r4Rn5n3q7nR1J64j58J5R3J78j32J0J66l76J88k26M7J45J32k39N8r8L5
$$ y = [138, -61, 264, 352, 0, -17, -9, -82, -183, 212, -71, -249, 30, 113, -41, -58, -306, -142, -128, -39, 9, 96, 172, 181, 206, 184, 210, 132, -80, 254, -146, -223, 82, -79, 47, -76, -21, -201, -170, 138, 9, 115, -74, -196, 127, 6, 86, -25, 132, 43, -89, 28, -95, -18, -54, 211, -87, 82, 230, -186, 229, 36, -50, 109, 44, 228, -183, 128, 144, -375, 61, -127, 122, -102, 169, -308, 145, -54, -101, 149, -46, 70, 221, -101, -362, -49, -107, 3, 51, 154, -33, -66, 276, -143, 176, 155, -113, -114, -65, -104, 37, 28, -233, -106, -315, -21, -123, 146, 234, -103, 44, -186, -97, 237, -11, -113, 19, 90, -126, 40, -344, -82, 75, -221, -211, 37, 78, 162, -90, -42, 139, 144, -131, -35, 98, -158, -130, -126, -80, -6, 32, -143, 68, -79, -56, -178, 120, -32, 14, 124, 125, 128, 176, 50, -164, 217, -146, -152, 143, 123, 56, -233, -294, 102, 8, 17, -38, -91, -178, -183, -92, 72, -86, -71, 22, 200, 68, 78, 244, -132, 56, -170, -123, 22, 154, -85, -27, -125, -90]
5465i0J87l07L18J05j29R5l3o3j64L18j68P4k31J84J13l17L0Q0m0N7k13J58L50
5488C14l63L4L2L1p7J89j32N9m6k66L81k44J18o8J73j49N1k22J30k1J6j77N9J35
5512d3RK07J47Ll99J68k43J84m4l2j02K22q3j90K94j35n9K37m4L7l82K49Q5n7
5536B9n0K09j07K5n7J34k92J68J74j35n17N09j30q5K93J9j14j65J35j0J04r6j52
5559a11Q0J43l23L24Q9n8k39J76l46L50J52k76R1j2P0Pl21J19L75p7n7r1l17K45
5583gJ43o2j18J09K13n47M35j30J50k87J49j31N8J2k25Q8J99J01j47n8K3J85J44
5606B97j19m1J42k71J5p1r2J10J56O2j80O9J0k01K30j54J21j64J41RJ49J54k86
5629H6J75o9L8m22K19L15k03j40O2j87L56k18Q4m8q8J0J98P4m68M00k77j78J35
$$ y = [-90, 97, -210, 108, 213, 84, 179, 146, 83, -81, 237, 69, 143, -88, 96, 209, -108, -78, 2, -38, 19, -194, -36, 314, -49, -15, 17, 48, -29, 160, 28, 87, 41, -225, 156, -88, 30, -38, 135, -14, 37, -185, -55, -76, -60, -237, -178, -43, -34, 173, 320, 323, -76, 92, -151, 33, -11, -43, -145, 77, -6, -196, 98, -37, -96, 141, 97, 134, -248, 1, 86, 29, -21, 188, 81, 106, 49, 183, -109, 59, 233, 98, -419, 90, -40, -125, 168, 187, 73, -92, 43, 33, 137, 41, -111, -31, 112, -211, 113, 202, 144, -95, 81, -265, 85, 237, -39, 52, 40, 110, 117, -204, -85, 290, 213, 156, 65, -252, -7, 136, 74, -44, 65, 278, -269, 166, 36, 186, -101, 48, -83, -25, -13, -238, -150, 49, 150, 3, -55, -32, 153, 297, 178, 137, 279, 8, 23, -48, -140, -30, 126, 188, 8, 77, 87, -114, 116, -38, 83, -81, 60, 69, 218, 372, 86, 261, 192, 230, -192, 27, 342, 139, -1, 61, -126, 230, 12, 96, 48, -40, -30, 168, 242, -226, 174, -103, -281, -146]
5652a46K83R8j21j83J14j12J32j68RK91l55R8J73o6k04J60k57L08J46j87o4k72
5674c23M58m12K47Mk67L21L1j14o2K09m16K19L7R3j16P4j02L2j00L69j63l6N1
5697C4j39O1O2K10k00p7p2J37k22K70L24k30p8j05J42Q1l48J22M5J7k8j66m9K43
5721C4Qj24J34l9J04j51n5J7K36j01p0n6O9Q7j90J83J44j85k6J65k06K65j50M
5745I7LR5k51K17k03J9O9J05l19K38K59m03J80j99N1j0J10q0J29j15J3j80K25
5768E0j82n2K6L33k55L17l14m3M74p3m13R9K26j84o4P2k00M24j20j42K05J5l07
5791a08J29O0k54N9M6K57n3l00L34K4j66L4j7J20J1n2l90J87qJ43j32K32j25j66
5815a35K13j03J07k04J35j28J4J34k66J59r8J61K06l08o0J00Lk9N5K5l06L66j29
$$ y = [-146, 137, 235, 114, -69, 45, -67, 65, -103, -94, 197, -158, -60, 113, 47, -157, 3, -254, 54, 200, 13, -51, -323, 135, -277, -30, -26, -293, 28, 59, -55, -117, 92, -324, -105, -68, 25, -91, -17, -119, -87, -187, 182, 19, -17, 34, -105, -44, 18, 228, 28, -49, -121, 16, -206, 64, 388, 158, 80, -25, 117, 198, -150, -28, 17, 34, 6, -160, -209, 34, 42, -82, 52, 13, 117, -34, -89, -72, 164, 63, -7, -63, 6, 93, -97, 86, 230, 45, 19, 184, -22, 243, 93, 97, 100, 195, -56, 161, -42, -23, 46, 151, -168, 70, 329, -74, 106, -93, -42, -52, 58, -22, 107, -8, 5, -175, 50, -132, -184, -158, 175, -80, 237, -77, -120, 354, 281, -132, -33, 193, 9, -55, 17, -183, 241, 121, -21, 184, 199, -108, 21, 81, -173, -114, -68, 189, 136, -164, 170, 194, 28, 62, 45, 165, 176, 124, -266, -79, -87, 56, -76, 156, 31, -135, 78, -25, 82, -122, 13, -115, -101, 33, -233, -74, -172, -11, 195, -113, -173, -73, -70, -99, -44, -19, -325, 41, -88]
5838h8K22k35N8J34j23J50j58k17K17j88L50n6J74k97K57k47O8P1P0l27O9Pk53
5861c42M31L6j06r7J82j66J60j00J97k10L07l30K62j25j84mJ28k15M8L71l21J33
5883E5J9j01J00jn6k06Q8M9K5q5L63j24N6M2k40J16o4k21J72J03k14j6J85o9R2
5908F8Oj1j29J49l4j19J4J57j14j27J72J2K6K4n3l2J21j01j23J08m5P1J55rK5
5933B11j27n9J47n4p0n3j51L54j78R5o8l36J25L57k15N4J34k34J50J99k93l2O3
5956A9K19k44L7M0o9r6J61J03j41l18K09J17j43j07M62k01k06R9j73M10k77L13
5978B14r5K8J7k91o1J62O4J49m7j88J53k23K83P4l13r0l4L08k31J63j75mK81J66
6002C10l3j68n2k10Q9J22Q3J0k65J04j90J11K75j20MP6q2j61K06j69r5K16J82
$$ y = [-88, 134, -101, -43, 91, -32, 118, -40, -257, -40, -228, 122, 66, 240, -57, 200, -47, 21, 92, 162, -165, -96, -89, -342, 89, 125, 19, -78, 104, -62, 98, -2, 195, -15, 292, -38, 224, 99, -85, -89, 39, -176, -128, 243, -78, 55, 74, -27, 73, 72, 16, -190, -102, -53, -28, -113, 250, 126, 182, 224, -16, 100, 36, -185, -13, 90, -124, -140, 45, -24, 68, 74, 63, -66, 83, 49, -70, -56, 101, -13, -140, 32, 44, 70, 94, 41, 9, 130, 29, -94, 14, -31, 40, 195, 186, 211, 84, 25, 172, 118, 48, -5, -156, 198, 20, 115, 47, -289, -164, 193, -22, 32, 166, -68, 82, 281, -12, -44, 19, 238, -6, 31, 71, 2, -94, 67, 170, 29, -289, -80, 37, -106, -213, 249, 48, -158, -59, -232, 178, -99, 214, 119, 147, 164, -127, -188, -26, 38, 187, 140, -48, 105, -118, 165, 239, -74, -164, -198, 110, -121, 42, -133, -137, 144, 310, 277, 109, 57, -153, -64, 58, 141, 151, -114, -10, -200, -89, 186, 66, 70, 146, 64, -97, 109, -60, -155, 61, 243]
6025B43j81J43Qn08O10n31o5M15l14J31J54J15j92J40j16k96L38M8k59R9k1MO
6048b9J49K79k32j91j13J95n6l04K51j34J97j6MK19k85%j52L75j30k25L29j65
6070c4M3Kk14r0M40J55m04P5J1n4j3J87q7J21k59L36r7k10j96K19N4k05q2J33
6094a69L21J24k35j33L22j21r4J55n05L23k48L15p3L6J86j19k80J96J77PM9j02
6116A32l7pJ15p3M1k5k25Q6mJ44k57K3R9j5O3r8M4L9j61j1J37o6K04j92k13M67
6142B10l11M0P1j81K2J18j68RPk7K02M7k78K52L6j81J62k6J33j37j94J46O7J58
6166A77l49N7R5R9q%m41K27L88k45m9Rj89K3K50k00J46q5L55k09J40j21n3NM0
6191F2j09J40m7o8J32J59n47L33j00K69j56kQ4m3j93L64j54k66OJ29r2M5N1j40
$$ y = [243, 62, 205, 213, -295, 315, -216, -281, 134, -180, -49, 105, 220, 28, 168, 52, -244, 94, 142, -117, -18, -39, -35, -29, 120, 399, 167, -24, -137, 58, 2, -302, -51, -185, 12, -4, 0, 219, -66, -66, -218, 157, 27, -198, 131, -34, 9, 11, -203, -293, 147, 302, -102, -27, -16, -70, -83, 104, 17, 138, -121, 215, 118, -92, -288, -69, -15, -220, -302, -169, 152, 276, 41, -92, 230, 109, 15, 170, -335, -12, -260, 55, -18, 18, 204, 85, -195, 1, 178, 185, 234, 132, 95, 88, 203, 130, 171, 146, -79, 7, 3, 147, -110, -87, 12, -3, 60, -38, 6, 45, -116, -127, 10, -56, 148, -44, -257, 210, -101, -61, 10, -171, -149, -31, -199, -190, -183, -210, -8, 39, -239, 13, 49, -132, 30, 4, 137, 0, -194, -48, 19, 177, -172, -115, -20, 79, 71, 71, -370, -143, 245, 0, -49, -40, -229, -206, 44, -156, -10, -95, 260, 51, 191, 70, 17, 22, 62, -47, 93, 46, -22, 110, 269, -278, 55, -45, 224, 68, 66, 150, 107, -86, 278, 124, -142, -136, -7, -99, -54, -3, -143]
6215a43k9M20l57r3L08m3l35L68k72K49j81J62L8k38J74nJ8j54J78j43J16q1L1
6238a2N4m1j53L40k41j49L93p6j65O0j81J21Q2O5L1m5l38K69K38m44M07k24j83
6261a92K34j11J66K8k19L19j49K01m61J86J04J69o9n5kl50K59m0R6q7j03O1K4
6284Iq4l9J97n1N1n7j3Q4k8j17j31QL23k81o7J71m0N4J49l46L48j29pj29J62K2
6310E9k10R9O6K30r5k20j45J05qJ48K75l69K0K04m87J54L33j83Q5K41k69j53P7
6333d3j85L04Oj03L7K45n7O6K0m64K21L7j28jj82M98j53k42J93K7j62OK13nK6
6358A74Nl68J46j64K85k7k63L93q4k99Q2J78l41M67j25j45J93j51p4M48k22k12
6380a04o7J95Nj2K07l45J22j39j05j05K84K13k42J02j52K09q3l6J82K3j36K06
$$ y = [-143, -172, 248, -109, -202, 106, 63, -272, 96, -176, 73, -108, 54, 92, -146, 28, 23, 41, -113, 65, -78, 38, -43, -12, 42, 1, -152, 188, -53, -202, 191, 115, -50, 10, -171, -50, 32, 97, 128, 83, -255, 14, 252, -192, 215, -9, -192, 42, -69, 97, 125, -94, 225, 76, 277, -184, 2, 106, 275, 206, 151, 149, -201, 58, 18, 114, 27, -76, -15, 9, -75, -114, 83, 32, 83, 26, 13, 97, 69, -48, -179, -171, 152, -129, -196, -25, -65, -11, 138, -208, 140, 11, 4, -125, 37, 59, -151, -52, 14, 244, 149, -71, -216, -111, -119, 29, 304, -65, -45, 159, -328, -174, 159, -24, 61, 302, 33, -120, -43, -228, 76, 82, -21, 16, 261, 204, 270, 290, -174, 47, 84, -44, -45, -227, 271, 118, -124, 69, 96, -66, -60, 153, 148, 174, 179, -189, -43, -207, 78, 51, -212, 181, 97, -202, -120, 58, -283, 184, 59, -86, 107, -44, -118, 330, 108, -104, -171, 24, 29, 17, 224, -121, 1, -138, -243, -348, -64, 149, -93, 9, -143, 66, -17, -53, 129, 152, 16, 222]
6402B22j0k92L2q8Q6j71L10L9O5l93K62j0J20k25J77Nk59K59J07o11M07O6J53
6425B51m34K75p4K44j27j54lj41J32j83L14j02p3K34O3j68L2R7p2k76L42J06k23
6448F0j37J35N6k32K86p6j65J07M4k35J74J18j45j7j0l0M3J67m26K02O0J68k2
6471A25l7l41M41j92Lj7j05L08j31r7J67q0J28l98J61K90m32J66p1J25J37k2r5
6494C3k6n8L02l26j29J74k8R5K07k04l8j36q3J12J29r2N1K4J70l46M9J34o1J52
6518A05qp5j17j49K56K75n25M58k97J47k04K75l28K70K06k51k04K53m1L8K61l51
6540fL0j79kJ06L4K50Rm87M58k54k2M2J74l1l51J54P1Q0j90R8M44l31l87L19j01
6565g2K53j67k50K14m2L34p6l28J91o1R1p6j07l2j71K42L40m05N4M6k7j03O1M3
$$ y = [222, 212, -80, -48, -136, -50, -221, 89, 128, 193, -200, 62, 52, 172, -53, 124, 129, -130, 129, 236, -375, 32, 98, 251, -183, 92, 18, 262, 135, -19, -22, -163, -31, -214, 100, -2, -75, 159, 222, 54, 86, 183, 111, -165, 177, 283, 60, -77, 58, 114, -118, 168, 92, -73, 34, 78, -157, 17, 135, -10, -27, -37, -67, -24, 143, -283, -81, -21, 147, 125, 88, -253, 188, -4, -1, -18, -123, 185, 54, -43, 124, 44, 172, -226, -65, 225, -207, -41, -112, 13, 150, 128, 33, 7, -51, 251, -75, -204, -30, -58, 37, 244, 40, 2, -134, -217, -105, 24, -68, -17, 7, 177, -169, -120, 14, -47, 105, 97, 22, -95, -244, 12, 287, -238, 220, -77, 70, -134, 141, -187, 83, 289, 38, -166, 87, 46, 84, 345, -6, 24, -155, -157, -51, -17, 233, 242, -245, 213, -41, -63, -21, 153, 122, -229, -75, -4, 76, -114, -16, 428, 97, -290, 29, -72, 181, 14, -236, -22, -64, 270, 194, -134, 57, -4, 87, 11, -96, -128, -299, -57, 283, -122, -68, -22, -49, -152, -91, -48]
6589d8j88K28J53q4l40M16o1P7j37k64J98J16k53RJ43P7J8l0m6r5QJ9j4m5r9L70
6615A28k89j4L25p2k88K6K92r5J68J4l34k81N52k50K1KK29j08n8n9K36k16R1R1
6639A11N3l45q9L10k48J09l3J23K7N6r1j18rO6J34L5l44J29L07j87j06qk05N5
6663b68K81O6m9PR4j98J85k83K5k5J50L02k94Nm1K52j28m2j89K12q8L41l26P3
6687F2k68R6j89L74k89M71k09j47J61k56K09K07k44j10K93rn3m26K04M07Rl92
6709i9j20k40K52l2J71k1M7n2k8j06K79m9K88o74M35p1m09L81j53L89k71K9J53
6732I9n01M96j35K0R5j67J12J94l80J66j48OK29m7k39K18N7J90l0q8j46J56l83
6755b26K77r1JK74k69L36m16J64j02nJ10J8j3r5P1j32K47m34L92j94K82j1k55
$$ y = [-48, -236, -8, 145, 61, -279, 137, 76, 153, 16, -248, -50, 66, -187, -178, -35, 42, 60, 30, -16, -111, -103, -84, -98, -143, -242, 128, -161, -175, 150, 78, -210, -184, 108, 13, 181, 195, -139, -420, 132, -118, -97, -95, 134, 26, -32, -91, 145, -71, 20, 111, 164, -181, -270, 40, -208, -99, -132, -9, 18, 74, -17, -135, -144, -78, 56, 91, -253, -124, 183, -4, -110, -118, -323, -268, 13, 79, 30, 37, 131, -67, 118, -165, -140, -165, -15, 287, -7, -2, -43, 209, 81, 39, -150, 62, -26, 315, -11, 62, -206, -110, -299, 75, -214, 257, 48, -99, 62, -194, 15, 222, -22, -132, 161, 152, 99, -327, -123, 284, 293, -99, -219, -459, -207, -239, -68, -89, -42, -94, -122, -228, 51, 2, 290, -384, 51, -20, -429, -48, -201, 188, -83, -54, 99, -402, 94, -41, -21, 74, -93, 19, 213, -167, -1, -149, -143, 86, 39, -200, 18, 75, 265, 235, 147, 1, 157, -226, 51, -40, -39, 235, -34, 302, -114, 50, -52, -57, 53, 71, 58, -37, 34, -98, 149, -285, 107, -87, 195, 184, -71]
6778g1J23k67J0J95N9J34k72lJ24L9r2p4K83j42J76j77J11l37L86j98kN6k07R7
6802d9j94L61Jj74R2j57K69Q1l37L65l73J82k98O9J96j80J46R1j08K64j07o8r7
6825b5M5l0qM6q0J91p3o0r2J98j47j8J74R7m32J32P8J66j22O7K0k60K86l22K29
6850F0J65m90K83m1j97K16P5l04M22l54J98k2n8j76L31k34K96p3j68K21j66K9
6872A3nK59k71R2p6J43N6n5k43P4K35k32J93k20J45k62J08M9N3j05K85k94M5k87
6896c00Q7J24J61k9o4N1J43r6o7k34J28J27j32k06j8P9J24K24J62j62r0J48j89
6919b9J64k36J23Q8LK0l27K34R1O8k42l6J52j11L64l81N7J75m9j5n9j43J39pj58
6944a15RJ59j52J08J01l70Q6L1K85j62J53L9J1l28K1J67j98L55m73K55M9k11J55
$$ y = [-71, 52, -215, -205, -10, 49, 183, -89, -92, 32, 71, -21, -95, 188, 46, 222, 45, 156, -181, 205, 7, 5, 61, -146, -49, -243, 118, 119, -55, 37, -120, 149, 230, -107, 258, -115, 67, -231, -162, 34, -146, 0, 91, -17, 247, 140, 72, -25, 20, -10, -18, 28, -52, 139, 66, 6, -86, 112, -35, -53, 121, 218, -214, -82, -4, 162, 40, 107, 127, -133, 153, -169, 60, 225, -265, 18, -23, -220, -4, 71, -233, 189, -165, 33, 11, -47, -223, 108, -126, 170, 97, -71, 150, -16, 13, 8, 267, -4, 88, 12, 155, 211, 156, -87, -13, 222, -10, 183, -37, 108, -154, -46, 3, 56, -49, 236, -58, -13, -300, -213, -89, 72, 43, -21, 30, 173, 77, 10, -224, -96, 31, -101, -307, -325, -246, -122, 102, 264, 102, 12, 160, -29, 135, -101, 22, 110, 113, 133, -194, 40, 131, 199, -43, -79, 73, -38, 326, -55, 2, 177, 128, 113, 54, -89, 50, 43, -115, -106, 53, -99, 9, 110, -260, -174, -143, 142, -20, 133, 172, 183, -145, -124, 43, -155, 200, -273, -18, 31, -180, -25]
6967b5O7J57j32N7j48m3r5J95Q0l3P9j71J23L7k76j48K63J35q6o8J06k26L91n6
6991A83j13k12K09J02k58k10Q2L46k25QK68m3q2jJ07j27Q0k93J45L85m34M05j40
7014A82n79L3K15J64j18L27l06p6J2L56J0j69j25M77m02o5M9Pl74J18K70o5J9
7037d0J17l98L78k64L35j50N7l8j94l0k4Q5L12j12J6r2J13P5k69J8J16p8q7J03
7061e1k7N8J07l97L35J2j64J90r2K06k21R1K00j73o0j50J23j82J46J76l74L30
7083H3P7j4l31K05J99l50j23K64R4k00O0p5p6J89M6R8k07M4n6q9l3J68J02k3r5
7108d3o6R9J09j92j5k9J49J31l01J73K87k3m95K94m2k70M64n41K14j55L96k20
7130g6K12l05K81j3o9j52J05K4q6m4J47j03j56J62j94L15j10K7m3K64K16m22J57
$$ y = [-25, 42, 199, 67, 124, -24, -67, -162, 33, 113, 80, 159, -12, 111, 148, -128, -276, -13, 122, 36, -32, 74, -152, 239, 183, 70, -142, 67, 169, -89, -299, -217, 129, -96, -88, 180, 137, 55, 54, 161, 34, 114, -179, -34, 351, -83, 322, 182, -397, -364, -149, 15, -103, 224, -82, -158, -146, 210, 220, 51, -74, 403, 1, -64, -15, -8, -382, -264, 6, -59, -40, 77, -321, 57, -207, 128, -22, 35, -3, -197, -227, -251, -166, 146, 34, 50, -42, 71, 146, -123, -105, 11, -67, -154, -51, -78, -20, 87, -310, 25, 37, -127, 63, -29, 177, -44, 47, 247, 74, 14, -136, -13, -195, -49, 127, -247, 83, 160, 146, -185, 20, 219, -131, -254, 10, 104, -96, -36, -111, -187, 2, 48, 146, -61, -17, -73, -162, -195, -27, 75, 52, -43, -109, -10, 99, -93, -108, -137, 12, 143, -158, 15, 302, 279, -216, 78, 36, -234, 230, -311, -97, -252, 144, -76, 136, -169, 112, 99, 30, -122, -17, 7, -79, -123, 24, -79, -235, -73, -267, 48, -62, -35, -78, 186, 402, -20, 137]
7153A37P3mj58r6j30M03q6r3k32M1M19j59J26k21K17k05k4M4j75K92J01k65j17
7176a12n4M2R5k47K52q1M3mL3J44l19L83j00K3k54L20j29r2L20j32j84j18M20
7199B49l39J06j74K13j77J81N5o2N3k29P6m4J74R3k39m1m2J61l4N0j68K05k51
7222a84K23k22M83k08q1R7k00J27K0J21m78J62N7K98k65J85j17j27k0P9k6k58
7244c34K40j71K37j07K07k22L30k41j2k9M49n21K31P9j27l9J74l59J97l4p0J33
7266A1P5p5J27j29k3j59L88M5l88j2K04j1k15n0J61J73l23M15l79J96J31n7k27
7289a22o2P4K16p8J40m00O3J90k8J94r9k14O4k3o3J82r8R4r7K09l69L29m8klj5
7315C4O0j80K21j17r2j32Q2K37Pj49J02k71J3K66l1jk90J37J37J9j33J43K9l5
$$ y = [137, 210, 206, 48, -48, -178, 225, 139, 46, -186, -145, 274, 115, 241, 20, 237, 32, 8, 52, -123, 169, 270, 5, -112, -166, -124, -29, -276, -24, -105, -62, -66, -33, 111, -208, 175, 75, 98, -156, 164, 35, -57, 263, 131, -53, -171, 249, -90, 16, -158, 55, -122, 59, 114, 52, 105, -124, -48, -92, 82, 175, -64, -105, -147, 14, -20, 30, -138, 67, -184, 39, -183, 300, 92, 11, 108, -92, 35, 55, 176, -302, -140, -83, 215, -50, 135, 18, -109, -129, -50, -76, -334, -94, -265, -28, -135, 72, -150, 180, -61, -73, -102, 347, -174, 57, 136, 9, -30, 144, -215, -18, -52, -122, 11, 86, 11, 138, 9, -14, -173, 215, 260, -128, -140, 64, 53, -162, -212, -51, 122, -201, 214, -165, 31, 162, 105, -122, -184, -110, 106, 28, 168, -232, -169, 21, -7, 187, 88, -126, -62, -85, -148, 34, -64, 30, -67, 142, -227, 102, 54, 52, 49, 34, 94, -86, 135, 18, -74, -206, -124, 113, 120, -29, 73, -198, -185, 81, 50, 49, -241, -104, 33, 52, -81, 62, 91, 56]
7339E6j1n7J42p8J5N3l28K48j41J78pJ4j17l1K15l92J50K5N1R5p3K20l06J4K65
7364B00l84K68o5J01q5j7j02L22m56J41R4K91k15p8J12j64J43l19L79m57K56J47
7386A12j53j09O7J57j28q8K23j5J19j2j39k7J34l59N83k29n2j27M1jJ13j42k9
7409f1L00r6O6m53L09k83J84J08k3r7O6J54l9r2Rj93L24k7p2k05j10J89k06M57
7433B09q6k08R1oj48k8J80j00L6J4J26M5l00R5J55J7Q2r7M8j73J5k8J8K04j56
7458Ej48K80k40mK39j69L3j31J31j29LN6K3K0J16l14J76N9r3KP6j98k43M54J46
7483A50p6o2N6q2MK7N0NO1j59J92j80k62M31p2J19k22R6j24j85L97m90K97J18
7507H9m0R2m44L90rk13P8j03J29J0J01j80JJ21j66K73r4j17Q6pJ61Jk71j28m2
$$ y = [56, 45, -12, 130, 52, 67, 120, -208, 40, -101, 77, 70, 84, -33, -64, 151, -241, -91, -66, -15, 80, 7, 227, -79, -65, 200, -184, 84, 19, 120, 35, 18, -84, 238, -218, -77, 17, 308, 93, 15, 127, -37, 106, -213, 166, -291, -35, 112, -41, -150, -83, 74, -54, -142, 81, 66, 185, 173, 34, 7, 141, -218, 365, 136, 84, -43, -2, -3, 110, -32, -61, 239, 143, 209, -244, 65, -218, -34, 74, 51, -46, 20, 174, 135, 43, 52, -141, 183, 156, 84, -121, -231, -42, -248, 209, 123, -85, 6, 0, -148, -176, 4, -96, -60, -46, 80, 125, -175, -80, 75, 92, 174, 77, 125, -48, -33, -61, -43, 161, 5, -143, 137, -103, -107, 132, -37, -4, -135, -4, -133, -130, -74, -51, -31, 85, -229, -53, 6, -87, -85, -9, -207, -450, 4, 150, 74, 12, 68, -14, -10, 17, 67, 72, 133, -26, 166, -14, -276, 155, 83, 202, -20, 76, -48, -233, 164, -326, -29, 89, 49, 141, -303, 87, 78, -135, -57, -160, -31, -21, 80, -100, -99, 22, -144, 129, 35, -82, 4, -3, 158, 159, -112, -240, -282]
7532b82M57k27J16j55j06L7K70j06p3K4j97J87R0l3NJ01j17J32k74M71n23L45
7554A42j62qL6n1R4k37M06n21J61K18L3J70l39N0O7N6j99J33l3O2j22J77j4j14
7578Ek08K11q5J26K83l35O0k73M41j97j51K26K36k43rJ61l98J30J62l57M48l26
7600i3Q2k7m4j2L8j38J6K12j47J31Kq0j29J50k9J01j56K74m07L78O6j11K27l35
7624c1q8J32P8j68K68l62J82J58J0o5q7j0k47K40Nn3K34j15J6j53Q3j14P6l97
7648d08M27J6M0K65k63r7O8J70l98J46j1J26j26q5J61J05J18l08m0q2l11M60L9
7671A2l3k18M36j34MJLj36p0L76l04K3O9N9j40K31j29j41L04l17J47J05j58m3
7695e3j17K59J35j32j81K34p5j54J96n8L4j18JJ43J43l21P1Q2j0P3L1k49j61J39
$$ y = [-282, 175, -52, 64, -91, -197, -160, 110, 4, -69, -45, -242, -55, 35, 2, 7, 108, -9, 123, -151, 320, -203, 142, -20, -28, 8, -43, 51, -186, 220, -301, -140, 78, 111, 281, -58, -8, 59, 115, -84, 49, 16, 78, -44, 133, 119, 5, -203, 8, -77, 49, 332, -3, 57, -216, 225, 28, -123, 103, 339, 96, 87, 248, -150, -20, 142, -215, 233, -93, -11, -38, -82, -94, -56, -194, -178, 34, -113, 18, 20, -60, -189, -39, -68, 33, -123, 151, -256, 122, 188, 77, 304, -31, -119, 13, 91, -77, 191, -171, 11, 169, 179, 114, 27, 17, -230, 10, 15, -38, 196, 81, 97, -56, 27, -87, -11, -408, 19, 35, 75, 340, 77, -20, 48, 218, -180, -34, -45, 81, -45, -130, 31, 136, 254, -54, -94, -176, -487, -27, 12, -21, -239, 197, 63, 67, 68, 71, -65, -135, 241, -63, -40, 29, 88, -52, 179, 50, -91, 213, -104, 43, 148, -10, -53, -170, 89, 224, 92, -89, 145, 70, -84, 112, 54, 88, -30, -29, 114, 257, -64, 7, 89, 79, 152, 183, -66, -227, -88]
7719h8P2J49k23P5J54j03k65K79m7K39P6l86mL41k24k55K60J0O6j49J39K30q8
7742B58k11J67k44k3L27l36J07r5K27k23K58n4j90r1J57J14J05k1l73O1P0K38
7764B28k57l8n5K96M9k76K82j14k05n0L9L18l56j23J94K15l5k23j35K35nJ17m7
7787E4j18N7N2L9n3j71M46m06n1J33J70j46n4r8L40k36M3Oj48k0J70L9J33j53
7811B8k21K19r5m3K32j60K34q0p4jj0k43L47r1J1o5J25j50n7J6k6K60j4j73L31
7836C00n09K28n7K6j94L20q2J32k43o7J0j11J74qJ56j92M25k53M0j00o6L04j47
7859H6j67j15M9L1K13q5j52J79l66K50K25j42j65J92J71%l56K04jj70J66j47o2
7882a62J91J10K0l69J68kK46k53L20l88q1N9o2K86j44J80O9k39j81K98q1j20J11
$$ y = [-88, -16, 133, -90, -15, 139, 36, -229, 50, 3, 242, 318, -68, -72, 269, 45, -210, 50, 60, 126, -23, 116, 346, 258, 47, 214, -30, -53, 274, -62, 45, -50, 177, -46, 212, 158, -32, -123, 34, 148, 253, 232, -141, -80, -10, 228, -29, -67, -122, 174, 223, -53, 229, 115, -90, -140, -101, 217, -139, -262, -68, 147, 112, -111, -246, -11, -16, 101, 54, -64, -7, 45, 84, 31, -140, 306, -100, -151, -18, 152, 6, -48, -146, 194, -42, 1, 7, -141, -161, 9, 48, 181, 28, -193, 26, -69, -112, 120, -40, 194, 114, 40, 39, 29, -214, 133, 42, 53, -12, 113, -37, -94, -78, -104, 156, 142, -31, 300, -209, 19, -38, -12, -206, 114, 32, 164, -79, -146, -136, -247, -73, -81, 75, -117, 308, 55, 95, -5, -71, 233, 86, -81, -196, -147, -116, 97, 12, -140, 39, -327, -77, 148, 6, -159, 33, 204, 204, -152, 52, 51, -119, 47, -100, -162, 29, 139, 159, -210, -42, -44, 202, -51, 269, -119, -200, -141, -203, 83, -61, 119, 188, -51, -232, 66, -15, -135, -24]
7905b4k7J22o4K86m16K35j97J17K5j67L43l43P3J97j89r0m8K63k4k4j43L26lp4
7929A54j33P3k3j43J91j67rn8O6J90j24Jl3J30k14L61k38j29O4m5K41q8K25m43
7953a51K34j11J6l8J23r2N4L9k8N6j4o5k74J77n9j44M12j04J34q6lj45p6R4J49
7978I8q9l52J75J12qJ09R4m19L17J8m05J79J6J71J04j74O8p1K20k59Q2R0J53j91
8002C8j81P6J8n6J56j38P4J66l19K86l06K72J38l43J30k53L31m5l23L59O8k85
8024a37J98O1k57K13K28k93k2J77l06K94k60R6j03J59J17J7k15L31j59l38q2K64
8046a7P8J1pj63O4N2k38J28n4K0M55k11P6l02J55j7j83J17j1J19K7n9jJ16j26
8071B9L5k11L33n7J08k40J63l6J26l41J6J02J06N8k11k%k5K5m0j1Q1m7o8J64J08
$$ y = [-24, -51, 71, 7, 293, -123, 112, -85, 32, 57, -110, 233, -110, -37, 160, -29, -119, -167, 96, 72, 48, -95, 231, 228, 154, 21, 94, 71, -72, 119, -48, -57, -115, -49, 141, 17, 18, -15, 115, -99, 262, 24, -105, -41, -86, 155, 67, 292, -151, 83, -28, -12, -50, 73, -19, 35, 74, 46, 102, 88, 23, -251, -74, -133, -277, 135, 31, 165, 79, 76, -69, -145, -51, 98, 9, -343, -168, -56, -64, 45, 139, -280, 37, 55, -350, -171, -155, 16, 120, -54, 14, -57, 163, -96, -14, 76, 229, 38, -143, -67, -49, -105, 51, -87, -13, 153, -166, 120, -186, 86, 224, -119, 11, -242, 89, 44, -279, 80, 148, -137, 61, 122, -135, 78, 306, 13, -9, 168, -138, 156, -104, -8, -111, 48, 165, 182, -33, 298, 139, -199, -281, -17, 61, 72, 65, -98, -34, 18, -220, -92, -146, -126, 329, 118, 194, -108, 47, 30, -153, -36, -47, 72, 99, 40, 39, 155, 29, 64, -147, 186, 129, 237, -3, 160, 124, 250, -91, -75, 27, 133, 191, -20, -22, -22, -47, -22, -62, -73, 8, -39, -107, 57, 165]
8097A65J4k06K50l54K11J47m46M87n8k77j32M24j57qj58J97M0n0j42J31r3O7R5
8120A47l04K74LJ30k75J3k07L94j60L19l17j08O3qJ66P4l64J18k9P9q5P9J14K5
8144A41l32r9N36l49k3K83j80mq0J91p9Rk6j7P1o1O5j17j81K78j82J49j99J03
8168a03K8R8k2j58L63k56K98m17nM67j80l93N14l01J59K8n4j33j88J63K6j5J85
$$ y = [165, 179, -27, 223, -131, 80, 227, -219, 268, 210, -67, -199, 225, 68, 60, -98, 99, 139, 89, -53, 78, -15, 52, 147, -157, 117, 120, 250, -25, -12, -219, 175, 15, 334, 17, -91, -28, -36, 130, 204, -160, -42, -71, 8, -77, 2, 116, 141, -191, -290, 246, -103, -126, 157, -23, -27, -107, 84, 5, 14, -12, -29, 42, -19, 46, -71, -252, 26, -156, -7, -206, -103, -75, 23, 1, -157, 206, -50, 248, -169, -174, 293, 113, -280, 234, -67, 92, 120, 66, -67, -255, -92, -66, -81, 104]
8191A04
$$ Imaginary data points
##PAGE= N=2
##DATA TABLE= (X++(I..I)), XYDATA
0@%%%%%%%%%%%qJ6j6J6j6K4l2M0m8N6o9P7q8J04j28J52j75K02k30K65l02L44l92
34b08M41m97N60o28P03p85Q75r73J080j198J327j466J618j786J971k172K390k632
52a380K901l198L531l906M329m812N369o022O799p738Q903j0395J2383j5178J9432
67A1018k6770M2923j46054P1811J34439k14865Q6778J38765j03773o9814J64040
78H8498N253q5794N6191L1693j32943j0294P4349m8695m1352Q1610j4270p6847
90g2601K9061N0500j9908J2651K5545j4649n501J9482o311m498J1077p539j5279
103B030L665j5930j5030K6280m26m4005J4709L1574l1805N992O1125j4653m0821
116a7295L5589K1760l6887O830L2455l3050l5415K0897n677l3782K4995K9965
$$ y = [0, 0, 0, 0, 0, 0, 0, 0, 0, 0, 0, 0, -8, 8, -8, 8, -8, 16, -16, 24, -24, 32, -37, 40, -48, 56, -72, 80, -95, 107, -123, 142, -160, 184, -208, 233, -264, 296, -332, 371, -414, 461, -512, 568, -630, 697, -769, 849, -937, 1034, -1138, 1252, -1380, 1521, -1677, 1854, -2052, 2277, -2535, 2834, -3188, 3611, -4127, 4776, -5619, 6764, -8414, 11018, -15752, 27171, -118883, -47072, 87367, -127498, -40720, 98045, -5728, -75542, 88498, 93751, 7957, 64148, 95841, -37102, -47396, 26953, -21742, -63094, 18516, 4246, -72601, -43540, 6960, -12948, -297, 25248, 10599, 5098, 24580, 18269, 13771, 24848, 17309, 2030, 5695, -10235, -25265, 1015, 589, -43416, -28707, 2867, -28938, -22946, 38179, 23526, -17295, 18294, 40054, 3167, 9997, 42452, 9402, -26013, -5116, -10793, -44575, -19580, 10385]
128A0385k9205o214L1941n386p175L2926J1824k3418p992M341j0692j1111O033
141c743L049j2938r229L644M784M619J0123J2390K612j1157j492J3092m199q247
155C308J1581o141k5615K977J2288j0153p5J7678n247j6424J0933J3763r193L597
169C277J7201j1818j7955J2040M601j2195P629P076j5659o768P557m07j396Q152
183A335K786p314j430N102J597L737O324l780n479J0o046j739P642k768q369K320
199f072j169m905P486R558r48n52M293k149m617O087M907q900m783J378q644m452
215a3482Q517K572l690L176J710k084M381P225J823j805r23l029o134o30L534
230A161k556k870o48l132p51M081L475L847K339k193r38P44O30K191J226k971
$$ y = [10385, -18820, -25034, 6907, 1521, -5654, 27272, 39096, 15678, 7686, 12027, 1335, -9776, -3743, -694, -13632, -22861, -19217, -14433, -9814, 309, 12699, 15311, 4154, 2662, 15754, 11555, 3308, 14889, 8748, -16867, -13890, -1602, -11755, -11830, 5848, 601, -15823, -4890, 8873, -320, 3277, 20478, 8660, -9295, 2745, 7346, -4849, 2780, 9856, -5803, -12571, -5014, -5421, -6817, 1335, 4121, -3193, -4623, 479, 2076, 5813, 12137, 8357, 2878, 2888, -3158, -4897, 2745, -23, -8392, -6072, -7241, -12146, -4660, 4898, 3950, 3398, 7691, 5542, 925, 7012, 11919, 3019, -1764, -386, -9030, -13482, -4965, -2393, -6083, -2907, -1197, -3281, 1100, 8325, 10148, 8343, 7420, 4391, -1743, -2373, 1161, -1395, -4265, -4913, -8045, -8796, -4715, -1240, 2607, 4946, 2753, 1815, 2559, 3189, 5380, 6606, 3635]
246C635l832k655j708o4J815K727j555l540R56K478l97L879M162k020j368J48
262B661q19N30J772n17l109l723j216j5p76K110K105j215j044J506J991K889K230
279E360P10k03l090k421P99l50j941k45j497l592l68K624K343J614J586J736j518
296A547p55L744J043j990O1j659m344j255P75L98K54n6or42K89K922K345N8J012
315C441m00k390N15N01K87l05k145j205m48j057Q18J864n24j04O26q27M09K335
333A391J279O2p67l73q15j036Q33J442k239j187l51j339n6K221P58R9M4L60Q2
352D08K12J670J043j422r50p44j449l51R61k3n80j56l62O81N97J270J511m75j183
371F58L25k22o26Q50Q8j116j292m38O99p3L36J381Q5j334K42P33j27R43P12j085
$$ y = [3635, -197, -2852, -4560, -4624, -2809, -82, -1637, -5177, -4221, -1743, -2140, 1739, 5901, 3881, 2513, 2661, 1842, 2372, 4144, 3627, 518, -3205, -4421, -4436, -5212, -3102, -997, -2212, -3256, -1750, 241, 3130, 5360, 6070, 5867, 2777, 356, 1155, 805, -1136, -1381, -2878, -6470, -6838, -4214, -1871, -257, 1329, 3065, 1547, 792, 4536, 5579, 3589, 3650, 1991, -2353, -3608, -2833, -2435, -2181, -2237, -2243, -3185, -2896, 26, 2371, 2429, 3441, 3041, 651, 1166, 1667, 1954, 1649, -496, -1701, -2149, -3206, -2388, -524, -1048, -1152, -526, -1353, -944, 1391, 2670, 2732, 1965, 1592, 777, -259, 574, 2016, -223, -1410, -1761, -3100, -3156, -935, -177, -78, -34, 326, 408, 620, 2290, 3333, 1911, 961, 217, -1232, -1583, -622, -645, -1225, -1381, -1743, -1062, -465, 805, 2316, 1841, 658, 983, 761, 135, 985, 1073, -43, -1335, -1773, -1074, -1147, -811, 570, 655, -679, -437, 296, 169, 1112, 1824, 739]
391G39j226J71Q8l33P4P55l69j396N11Q98l36P76O68m78m17r5L88J10j3K28l65
412C78j110k69P59j33K60J28k01m99k53R83Q55kj22K92q04o47O31K36o15K65q71
433g39q20L07Q11O35r8N3M24l04l28J260q5n39P2n23j261J69P15l62k9K84K7n70
455i01K84J097K51K5L66n92n27M82j7j76M1p11p5j07j84N46J19Lj75N22q1n7M70
478F03L16J11q16j3k3l25K54M33j098l00J47k50L62K76M28j47k7L85p3J36M67
499H46K05q02j26k0l36k49K92j80k64m1j83J87O91K63O60m6o91R2N8K38k83pj86
522A18n00l68K99r7j4O21R0n23L93K17K67JJ02j49j83n6P2ln03K05j60l47n6L31
546b43j45L95J52k97Q4K05J10j4L21k32j37m69J33N9r7o4J83q19K20N49j98M13
$$ y = [739, -487, -316, -228, -561, -487, 268, -101, -1497, -986, -88, -424, 352, 1020, 542, 125, 30, 418, 528, 515, 743, 378, -732, -1001, -242, -375, -115, 13, -188, -687, -940, 43, 898, 896, 774, 1066, 262, -385, 246, 482, -133, 132, -739, -1559, -1252, -441, 194, 96, 149, 573, 269, -59, 1201, 1116, 577, 649, 126, -1135, -966, -251, -613, -642, -358, -331, -901, -617, 480, 731, 756, 1122, 530, 3, 485, 468, 292, 333, -378, -453, -560, -744, -198, -79, -76, -251, 271, 190, 133, 603, 919, 1030, 214, 201, 178, -147, 107, 540, -558, -858, -711, -961, -599, -323, 105, -42, -69, 316, 243, 379, 846, 1051, 249, 123, 103, -233, -482, -190, -370, -634, -675, -858, -671, 20, 283, 943, 897, 206, 298, 356, 594, 311, 304, 118, -382, -750, -451, -548, -562, 59, 149, -374, 19, 236, 503, 504, 606, 457, 274, 218, 290, 287, -216, -11, -171, -518, -574, -243, -388, 7, 159, -138, -54, 151, 261, 247, 568, 336, 199, -270, -137, -78, -175, -239, -56, -875, -655, -106, -304, 109]
568A09M12l34k93N0K04L8Q5k04K04k92k82Qm5K41J26l03J01J62o2K53J6J62k43
591A13l2j36J99n6L1k64j95K17l00K57J92lJ27Nm0j58J34N8r2j03j75M99j91l94
615c07M47j30k02L98k81k54N45j56P3j75J46k21r4L8L7J78J24n4m69K27K12k1
637F1Q4R7j65l27L94N2k53M03j56r1j10qj62R0J8J07j50MJ31l41K32L86k16k53
661a73L55j30j25J37j16m55N86j64p9J29kJ10k33k4P1J25j7K47k75N5r1j3M3J40
685A01o1j24J17q0n6J89k40K07n2J98j73N9j27J80j70J30j5j47r3M88l29k32O4
708a66j4J60k2K13J87m18l5J05R3K4o4j40K4Ml0k01J36J57m22K67K2j4L98l85
732a21K79m1J46n10J71j06l4K24J08M8j22j94r4J92l6J57J13p6K9k02J15K88m50
$$ y = [109, 521, 187, -106, -56, 148, 186, 271, 67, 271, -21, -303, -295, -340, -99, 27, -276, -175, -13, -75, 178, 194, 356, 113, 81, -55, 144, 88, 119, -145, -340, -123, -423, -166, 26, 23, 150, 155, 115, -43, 91, 149, 57, -46, -221, 278, 87, -307, 140, 10, -192, 206, -75, -329, 216, 60, 133, -42, 104, -117, -211, -173, -136, 42, 166, 112, -357, -130, 82, 61, 145, 242, 77, -250, 144, 196, -57, 346, 190, 99, -11, -19, -181, -91, -73, 34, -116, -112, 19, -322, -90, 296, 80, -173, 182, 52, -73, 64, -52, -507, 79, -85, -164, -35, -37, 73, -160, -184, -113, 12, -5, 242, -33, 22, -69, -82, -39, 101, 40, -84, 33, -47, -103, 86, -154, 53, 1, 199, 26, 85, -42, 138, -32, 98, 83, -64, -157, 331, 2, -230, -166, -180, -20, -42, 171, 358, -60, -95, 10, 103, 127, 63, -77, -53, -49, -79, -280, -144, 13, -409, -142, -120, -134, 264, -121, 158, 117, 263, -247, -76, -182, -216, 8, 116, 164, 42, -152, -246, -54, -90, 67, 180, 104, 133, -69, 46, 334, -116]
755a16K92j41J10n09L10J3o9K44k19O8J46k00K26L26k96k90J15J74K16j64k81
776d5J45r6R5m20J98k3L51m32K79j85K01m4Q1m26L90L5m6j03J99r9k53J25m9Q2
800d0K80m13Q0J47j08RJ17J95j77pj7N8j81M1K49j89k75K69j31N4K9j70K32N4
824A06L8k19J04k78L05l03M70k14n2K06q9j14K03j40N2o7J18J44j58k9M7r5k02
847a67O3kJ1NK4O4J88l75K47K5M1k12P7J04j01l7n2K58j80J47j93n3k8K31J44
872B29j83J29l23K7J43j89P5O3j16p2OK43K71k93j45j18J01q8J70J0m9M3K16l9
896A11J48m96LL57M3j89k94L44J04q5j2J51l00n4K75j98K10r4k11j25L63J72j32
919I1J5j47L7o4P7Lj86K52M7kk34l8K3K09n4q2J61k38L33l5n3n4M4r5l7J40m8
$$ y = [-116, 176, 35, 145, -364, -54, -41, -110, 134, -85, -17, 129, -71, 155, 481, 185, -105, 10, 184, 400, 236, -45, 100, 4, 99, -321, -123, -146, 205, -227, 52, -133, 68, 24, 105, -321, 69, 104, 58, -45, 154, 55, -198, -73, -122, -40, 240, -173, -93, 54, -54, -45, 72, 267, 90, 83, 66, 124, -57, -16, 233, 44, -231, 38, -93, -39, -10, -180, 52, 106, 144, -75, 29, -249, 56, -247, 223, 9, -43, 163, 74, -40, 163, 23, 75, 8, 126, 270, 112, 83, 130, 35, -167, -104, -106, -95, -90, -66, -2, 186, -189, 58, 83, 124, -88, -11, 93, -8, -45, -97, 161, -19, 128, -65, -118, -146, 85, 229, 46, 175, -148, -121, 22, -167, -92, -29, -145, -217, -211, 32, 303, 10, -135, -253, -152, -240, -70, -60, -109, -66, 150, 111, 259, -237, -234, 123, 166, -23, -317, 27, 131, 46, 34, 185, -115, -169, 106, -92, 118, 24, -187, -312, 51, 223, 91, 106, -41, -4, -68, 9, 12, -174, 78, 125, 123, -111, -149, -126, 83, 29, -53, 108, -130, 203, 168, 115, 61, 105, 10, -27, 113, 65]
946F5k44Q3Q1j3k04O3Q6n8L9K11m75M13j79M17l28j3j04N5o1J12L1J28k5k62O12
971D30l92K9k9n3K52n3j42jk16L41j73J21j54J46L8L4k07j36L00k52J53k35L41
994A42l30L89m9l81L32k71k56M65J67k49K3J0R8R6j41j18j28L15r0pkj82J52k3
1018c8P8K5J98k42k12K37J63k79J61O2j13Mj60L0P4q4J58Q6m6k40P0K59k70L3
1042d6J29K9o9m3j1P1K18l30J56j46R6j51J8J51q7m2P2K22Rl63L49k47r2J18J04
1067A15j50P2j81j32M94j29l9o9R8J3K5L24m02m9J68k76L08j04j00j32K73j43
1089a6Q8m7j76J23k33K41M5O1o2l3J01j61J4M36l74J01j55k04M54k28q5J17K0
1112B7JJ05k81j67M88n3l65M69o3j82M9j71o8K77R7l49J22n1J05R6k69M29k87
$$ y = [65, -179, -96, -15, -28, -232, -169, -83, -141, -102, 109, -366, 47, -132, 285, -43, -56, -160, -105, -166, -54, -23, 105, 80, -182, 430, 38, 67, 38, -15, 237, 184, 42, 41, -175, 166, -7, 114, -40, 106, 144, 178, -29, -165, 135, -117, 36, -199, 142, -188, 201, 152, -229, 103, -168, -424, 41, 208, -41, -18, -8, 90, 186, 45, -73, -201, 114, 24, 17, 15, -167, -15, -38, 40, 65, 263, 21, -191, 46, 209, -70, 91, 153, 40, 44, -116, -86, -12, -96, 62, 148, 102, -138, -68, 191, -79, -46, 83, 112, 43, 0, -11, 60, 278, -52, 104, -42, 54, -97, -79, 72, -15, -57, 15, 237, 246, -117, 232, -15, -107, 11, 115, -35, 37, -144, -276, 218, 89, 50, -19, 79, 92, 117, 441, 39, -10, 158, -118, 190, 86, -14, -146, 127, -16, 72, 25, -151, -28, -261, -20, 25, 86, 24, -9, 92, -69, -55, 381, 7, 108, -47, -251, 203, -25, -110, 7, 27, 28, 133, -148, -315, 173, 120, -245, 224, 161, -21, 28, -143, -211, 66, 163, -186, -64, -115, -10, 86, -183, 246, -41]
1135d1N6K47j69k1j48L53j54Q2j30K4l4j91J89l10M81k20m7j36J58K71m12J41
1157a1j27MK9P0k6M2J4M1j00M5O2k72L70j90K05k42r4J19L8k19O5Q1L7J54jK1
1183A15p3J4J31n1O7l34j2Q1N3mJ21K3j46O2j9j07L49j47O3j37J17k74J18J0j19
1208i9R7K39m2k13n9J20j44K05r5q6M27k34k95K15K40k09j9r7o2J36k7K1Q0n3
1232D6J52k90K41m37K07R7p8k4K91m61L41n3R0R9k84P4j42L35l41M7n5K80l9k22
1256a26J34O4m7k77L9K02k83K30m8j15J51K22k61J62L0j80J89K0J8k87K09J90
1278B36k21j32k08l6K75L16l39L45k23r3K98k50p5r1J23m7K32M7j43k96M84k63
1300f1R1k82M42j47Q4j39k1J55K11j5j24P4k34j71j59M16r3N7j88L19l38L36j90
$$ y = [-41, 15, 262, 93, 72, -76, 277, 123, 205, 75, 99, 65, -126, 63, -247, 234, 14, -33, -169, -11, 260, -152, -11, -138, -134, -105, -35, -61, -19, -5, 36, -64, -19, 43, -229, 141, -49, 156, -86, -180, -61, -23, -242, -177, -96, -59, 95, 94, 115, 42, 56, 187, 136, 203, -131, -143, -62, -9, -13, 108, 131, -15, 47, 28, -79, 270, 123, 186, 49, 166, -108, 10, 20, -99, -2, 237, 195, -18, -77, 43, -101, 104, 9, -77, 350, 116, -179, 36, 276, 67, 48, -49, -111, 25, -2, 19, 99, 46, 198, -92, 149, -288, -81, 16, -62, -86, 205, -256, 85, 32, 122, 221, -63, 11, -131, 204, -137, -90, -145, 135, 96, -126, 8, 72, 25, -252, -213, -11, -294, -64, -112, -227, -76, 146, -115, 47, 77, -103, 86, 106, 124, -163, 46, 236, 15, -117, -325, -361, -86, 230, -109, 236, 13, -80, 218, -32, -107, -198, -75, -122, 110, 157, 14, -282, 202, -61, 30, -252, 190, 43, 127, -12, -33, 122, 333, 318, 194, 268, 34, -137, -296, 120, 27, 84, -104, 215, -123, 213, 23]
1323B3L6k97L90m49O37l33J66n2l52J70K06K07m30N3q2l8N5J78J35l61J51n3j37
1346a77L23M3r7J10l14J43p3K58j91r6K40j89j5L0j69J60P2J3k17J54p8J08J59
1369A97j72L8q4N8j06J74j9k05K71k34J02K03j47j17J03j50L5q3J66K65n29K30
1391dp5j28L78k17j25J02k69J85M13p8j36J50k60L60k60Nk35L56k29J04k07j9
1413a89K86J5j21J06j62K99k65j87K02O6n0l8j26K76k43R1J92N5J2m83K73k2Q3
1436G0o1J65j89K01n3K76m24J8J76m34L14Q4pJ69k24j35j47L50M8j89M1j09L7
1459b3q7L7K9J29j0o1K2r7K06l43J12R5p6J40j00J45l9j24M3k54L78nk03K72k27
1484d1j1j58Q4j0P7J04L3N8l38RM96n02L00R9j23l7J35k46J66k6J20j51J22j43
$$ y = [23, 59, -238, 152, -297, 340, 7, 173, 121, -231, -61, 145, 352, -78, -25, -107, -145, -90, 88, 223, -138, 13, -40, -177, 146, 189, 92, 202, -112, 31, -42, 216, 25, -71, 169, -20, -35, -5, -174, -14, 58, 71, -146, 8, -70, 38, 197, 25, 63, -21, 37, -69, 105, 86, -119, 152, -82, 20, 223, 76, -41, 62, -88, -53, -136, 30, 295, -234, -4, -79, -207, 171, -46, -171, -69, -338, -153, 260, 182, 46, 196, -64, 296, 36, 41, -194, 162, -67, 37, -170, -189, 97, 112, -9, 97, -65, 234, -31, -218, -16, 50, 0, -38, -164, 112, -131, -40, 152, 207, 219, -264, 9, -13, 70, 9, 174, -15, 186, 133, 409, -15, 3, 179, -255, 59, 143, 136, 305, 81, -54, -201, 149, 197, 8, 49, -60, -23, -110, -73, -44, 85, 75, 14, 36, -61, 145, -198, -86, 9, -67, 73, -27, 118, 79, -45, -2, -256, 122, 117, -86, 186, -41, -52, -210, -126, -136, -59, 45, 78, 136, -202, -193, 303, -199, 101, 200, 77, 40, 175, -71, 95, 69, 189, 38, 160, 17]
1508A7j13P1J16R5j68q1j16J75j5j16J89K01n80K95L06Ql82O9J05m60M50P0r7
1531C9J24m1r6J24l12L34Q4r3j1o5J26k36J25R4l98L43j70j31Q9n0J76j63J07
1554aj99NP3K09j0k25P8J38J28o8j98r0K09j9J99k79NK30j99k08J79m0J30j37
1578i0r3N0J86k54K95K50k80k2R0m89L39M3j43K1j31L41k00J53l05L83m6%j44
1601d6L0l4N4R2P5k14l50N10j68J64RN5k23j3Q7k20J84J74j58k24K18Q3k36LJ72
1626B4L2NJ1K3j72rK05j93K58j68N1J04l39K39j77N8P6r2O4j77J77j94J26J25
1650E7p7J33J06p1J7M7j62p4K13k09l6J1K7M7L8p0L3J29q5n3l5L0rQ0l7J7L7q6
1678A8j11M1J3m4J01j47J04L60m13N6j72K27M0l48J83J93j66Q9J03l36K41j12
$$ y = [17, -96, -25, 91, 186, 18, -63, -179, -4, -19, -135, 54, 255, -325, -30, 276, 284, -98, -29, 76, -384, 66, 136, 39, 163, 122, 26, 150, -162, 172, 256, 163, 152, 87, 213, -23, 102, 196, -202, 141, -29, -160, -71, -121, 55, -108, -1, -200, -195, -122, 87, 77, -148, -70, 68, 196, 128, -70, -160, 49, 30, 229, -50, -45, 185, -14, -222, -43, -83, 47, -90, -183, -133, 53, -201, 94, 344, 64, 42, 132, -357, -18, 25, -118, -97, -228, 113, -87, 66, -239, 144, 98, 98, -46, -16, -50, 4, 96, 171, -43, -393, 117, -51, 113, 122, 177, -46, -59, 28, -192, -8, 166, 8, -216, 2, 85, -151, -148, 24, 56, 61, 72, 95, -77, -86, 119, -74, 184, 16, 67, 171, -168, 71, -106, -48, 28, -64, 0, -177, 0, -194, -68, 57, -20, 113, 219, 148, 165, 212, 50, -24, 189, -20, -56, -45, -18, 29, 67, -3, 30, 159, 74, 21, -14, 16, 7, 87, 50, 67, 104, 18, -93, -52, -39, -83, 18, -129, -25, 335, -78, -22, -194, 33, 73, -275, -92, 101, -65, 24, 127, -209, 32, -80]
1700h0oj7K49o7j12J45O0k38N7L48l60j22n8M3n7K19k02L44j79q3J76k4k43L45
1724A38k48K00j72J71k00J89PK4k97J02N5n7K06n8K26k82j08K75l41Q0K19K26
1746C55k27J58k82j26K83Rj46k23J43L3J26k2n4J39j39q2K74k00N5L05j31k19
1768B9J19j70O9l7oj83j09J20K88K0l98K63j74K85j05n4R2l82N24J96l70m6J66
1791A37j01r7k1K8j7K98k10r7K3K09n5O9L7k10k5r0L16l0j94J00N1j03J69q7l02
1816b02J07K70r7o1o2R1j41j10j76L18J85J22j65M9o0P5k23oK98k5k04M8j57R7
1840b9J18j60m9M09l22j81L87j38k24K1J54Mj58L03l61L37j02j34O3L9J25l45
1862b43L39k09L90m81L49m2j30lJ00j00R6p7j25L6l6J26j34J87j72K87j67J46
$$ y = [-80, -86, -103, 146, 79, -33, 112, 172, -66, -9, 339, -21, -143, -201, -158, -215, 4, -198, 146, -33, -116, 60, 36, -207, 138, -110, 90, -82, 89, -111, 78, 85, 109, -188, -86, -31, -88, 118, 60, 286, 4, -104, 171, -170, -90, 129, 355, 128, 286, 4, -122, 161, 170, 24, -199, -56, -23, 103, 81, 27, 166, 27, -55, 219, 19, 74, 379, 248, 29, 148, -22, 47, 10, 4, -179, -288, -168, 120, 140, -258, 5, -169, 116, 11, -43, 49, -333, 191, 387, 17, -29, 137, 36, -61, -82, -54, -71, 227, 17, -80, -57, 152, 97, 166, 203, -7, -32, -122, 194, 164, -30, 70, 121, 18, 187, 100, -202, -95, 175, 78, 17, -45, 46, -95, -205, -381, -63, 122, 244, 79, 128, 68, 143, -80, -86, 212, 187, -17, 31, -126, -29, 89, -71, -120, 289, -33, -214, 173, 35, -189, -168, -14, -10, -168, 135, -226, 111, 9, -125, -62, -23, 102, -243, 96, -113, 277, -204, 145, 103, -27, -30, 70, -30, 66, -11, -136, -100, -136, -10, -144, 43, -129, 158, -9, 137]
1884A37k29J55P5L0l29l6N1J32k21l6L07K27l0J41k43k8j18J33j53ML7M53m81
1907b2q0o9K95J48p29N27J45j35k71K05j6P5k12O5K88N3m5j32j48J45K41k31L14
1930D11m07J37r8k60L77k65L37k28J20r9pn6L53k18R6m35K30Q1m9j9j9PR6n3n5
1955b3J34m3P3Q9J4m48K15m2j18K08Rj66K7J52j49J6QKK6l13M18l05M87k98J99
1980A72m4o7r2Q5m1K66j95PJ22k08m20M71o9K55k83J26M3r0O1k94M3K10j47P7
2004a2K95l20J66k76J72K04l65K4J72m0n19M87P6k31L89j8M9k22J80J00l04lj75
2027a71r5L96l26L00J5j37k3N08n27P0P8j29j47L33k02J1k61K82m9j07L06m6j36
2050e7P2p1K81k43J41p6n9L39l84j83M06j29K3o8Q3J13P6l08k53L10Q7L6j94Q4
$$ y = [137, -92, 63, 138, 168, -161, -197, -146, -14, -235, -271, 36, 263, 233, 374, 131, 103, -15, 118, -35, -31, 6, 459, -22, -102, -171, 124, 272, -457, 70, 215, 80, -191, 14, -2, 73, -139, -74, 214, 267, 222, 90, -58, 87, 328, 97, 411, 4, 141, 43, -217, 160, -105, 232, 4, 124, 25, 18, -38, 315, 97, 193, -242, -12, 69, 20, 1, -18, -11, 85, 32, -23, 111, 68, 141, 230, 244, -204, 11, -31, -149, 59, 68, -98, -71, 81, -68, -52, -44, -42, -16, -329, 89, -216, 271, -27, 172, 128, 61, -31, 54, 13, 279, 84, 91, 213, 5, -415, 56, -13, 242, -41, 85, 128, 38, 99, -195, -152, 58, -89, -12, 283, -37, 129, -147, 25, 229, -136, -112, 60, 20, -499, -12, 64, -167, 222, 204, 253, 31, 211, 311, 7, 4, -171, -266, 130, -196, 104, 119, -18, -41, 467, -60, 10, 88, -41, -188, 145, -57, -46, -307, -25, -74, -181, 125, 79, -57, 15, -56, 225, -18, 123, 47, -12, 327, -57, -240, 166, 37, 60, -8, 75, 188, 264, -44, -297, 13, 100, 136, -58, 26]
2074B6K0r4J17m6K18k74l0R3o4J12Q2j55j20O1J64j35p1N3J3N2k7K81lj83k16
2099a26K23l26J25O7k19K39n2L1K38k44M8L9m4K6M3J6j78R2k30J56j90M03r7k41
2123b01P7L6l6J08r8j08L33j52j67J88Lj79K30k19K03R6j36j51K49L3j11R7j43
2146d8o8K62l59O94j46m74M32l39m0N6R6m1L2m2k38L94k04k8O1P0j95j06P1M46
2170B86k73l22L20J45j23k35L25j49k34k8L67l9j15QJ10l04N23k23k8RJ18j1j50
2193b3K44l05K94j65P7r1j57P3p5L3lj16K33j47J62k48L11o7J49k79K55J03j41
2216A17j54J34j8k25K71j64o4J70N8k81K62L8j75o3K1K24m11P5J53j53K84j3r0
2239dj0J8R1m9nj21k7j6K50j71l96M14M1%j74L81l09m7Q6k68K31R8j21j8J08j59
$$ y = [26, 46, -48, 69, 23, 241, -33, -63, 30, -34, 78, 160, 5, -115, -54, 110, -25, -96, -43, -30, 22, -5, 276, 273, 90, -126, 97, -229, -104, -37, -256, -17, -69, -38, 200, -44, 4, 43, -1, 25, 68, 84, -94, -2, -232, -76, -266, 137, 40, -201, -124, -88, -124, -16, -114, -222, 111, -41, -208, -20, -17, -196, 34, -185, 18, 114, -22, -173, 76, 109, -2, 95, -48, -116, 146, -213, 481, 335, -139, 293, -46, -86, -30, 66, 25, 57, 15, -223, 171, -33, -61, 0, 70, -125, -231, -160, 286, 13, -309, 11, 156, 33, -202, 123, -26, -260, -288, 79, 40, -75, -67, 43, -261, 262, 39, 11, 20, 138, 127, -23, 221, -84, 210, 45, 122, 31, -126, -53, -128, -95, -98, -214, 19, -128, 34, -214, 97, 30, 179, -100, 155, 258, 117, -37, 97, 79, -146, 125, -39, -103, 67, 125, -156, 106, 144, -31, -94, -73, 151, -260, -185, -32, -185, 99, 86, -4, -14, 4, 95, 46, 41, -80, -107, -123, 127, -44, -440, -26, 15, 15, -159, 222, -87, -134, -48, -316, -85, 13, -108, -126, -18, -177]
2265a77P6K39k99r8L82l76L92o0q2K7k35J06J1j32K98j94PJ16M2j30K59l5l87
2288b50L04P0k50O3j2o5J73j94J35r7K73k07J49k84N68l03j64oJ47N1n3q3n1J4
2312g2k35N08m9l08j03L11p8J7q1K36j61k76L83p8j2m0p0J7J59k07k0m2O90o10
2336a21J81P4j35n1M3nj3L1M3M8Lr5J51k05J03L6m67K87J11kPO3j55K6lj60L69
2363A64m1j48J43j93j32R6L72l59j82J07KM85l86k3J80p7Q3l9j32P2K6K05j20
2386A03j38m5J37k0l26J70J43P9j79M0J01j23J30n5k38K44j39k6K43J56k53L5
2408C9J78l67oK36j63J36J21j24j06p0K29J7n28N27N5n16J43J81K39k50P9O5k71
2431a56J4K24j59J20k01J70l9K9j43K18k08J49J28k13J0K25k4r3O7j78L8j25J67
$$ y = [-177, -101, 138, -161, -259, 123, -253, 139, 79, -3, 24, -211, -105, -94, -226, 72, -122, -115, 1, 43, -87, 172, 137, -250, 54, 124, -126, -63, -75, -140, 33, -161, -26, -123, 150, -57, 92, -192, 376, 73, -91, -97, 50, 101, 48, -35, -86, -72, -307, 201, 152, -156, -259, 52, -26, -9, -90, 146, -15, -291, 92, 14, 2, -38, -108, -91, 68, -139, -159, -201, 489, -121, 60, 134, -1, -52, -9, -14, -27, 4, 47, 95, 98, 3, 154, -51, 52, 88, -379, -92, 19, 17, 24, 87, -68, -42, -45, -205, 164, 123, -25, 118, -75, -207, -111, 261, -98, -280, -173, -171, 314, -72, -95, 85, 8, 91, 52, -80, -8, 18, 223, 103, -35, -80, 57, 37, -289, -119, 24, 103, -76, -36, 65, -58, 72, 17, -221, 23, -116, -142, 101, 257, 4, 39, 217, -150, -156, 80, -83, 53, 174, 50, -56, -126, 103, 120, -408, 119, 174, -342, -199, -18, 221, -29, 50, 115, -156, -142, 82, -77, 43, -158, 12, -27, 2, -141, 77, -131, 18, 146, -67, -57, 168, 144, 51, 118, -60, -22, -147, 20]
2454B0N9J48k50p0J2Qj25L0J80J21j88J93M1l41O0K12m4j50k97N09Oj5j8m8K2
2479G5p9j45K51j60R4p5k1Q6J24J8l3r2kJ1q4J02l45J72l3r5K44k16OJ14O7q6
2505a02J06o3M4M5q9m0M3K55l37j18K58n8J08j07j03L41j98P5j5r6k7L6K12j16
2529E4o5J73l10R7m7L95k48p3j08K06J96j01l60K41M1l23J72K40j23J46j77l9
2551a3j1p3r8L46j98rL10j99N1j02K3j70J65j27P1Jj08Q9q3K36j35N3j14M0o4
2576a19k3R0K33J73k61j02j52K6L92k76q1J24o1L8k87J82K65k47K89k59r8J08
2598d6q0k8K12m3OJ20k46J3M91m02J11J33k49K22k59J72K2l83O2J28KJ7o9K15
2622A21m3K6k09m9J87J4l21P3L38k51J25k5KJ39k95K23J5k85M00j57L5m04K01
$$ y = [20, 79, 227, -23, -93, -81, -73, -198, -168, 12, 133, -55, 138, 179, -162, -102, 110, 66, -84, -381, 128, 134, 119, 101, 53, 75, -4, -149, 102, -58, 36, -39, -60, 26, 150, 168, 135, 43, 41, 52, -32, 70, -275, -103, -136, -231, 13, -203, -197, -83, -16, -102, 4, -59, -15, 30, -59, -99, -56, 199, -138, -256, 2, -56, 52, -55, -158, 183, -15, 60, 45, -51, -78, -42, 170, 54, -11, 162, -148, -51, -98, 297, 49, -24, -132, 74, 270, 169, -191, 50, 91, -232, -60, 180, 57, 203, 26, -13, -24, -97, -195, 151, -47, -56, 254, 55, 106, 4, 27, -143, 22, -105, -34, -33, -141, -52, -135, 101, -34, 19, -95, -55, -119, -142, -52, 181, 354, 93, -9, -161, -135, 257, -19, -100, 24, -37, 1, -286, -104, 161, -86, 203, -56, -154, -46, -126, -154, 58, 15, 21, 141, -105, -92, 399, -3, 108, 241, -8, 214, -45, 127, 149, -234, -172, -44, -42, -25, -94, 121, 78, 104, -105, -154, 33, 47, -274, -201, 137, -114, 11, -14, -12, 127, -168, 55, 70, -215, 185, 28, 63, -341, -140]
2645a40M22l4k51lK82O6l50m2J54P6q3j89P5J0n8j71K37r7o7J46l34J10K66N3
2669G8l16J45r8M64k09k62L27J6j46o4R8k19J09m5N1L1PJ81j40R5k95L58o9k8
2693F9J31l22J32O3j64M1L9rQ0N6l31P9L3n0M5j11K49Jp0P5l2J52k50J92k17J38
2719A9N2Nj94p4j26K29N7j01K04O7j10N2Q5q9J1k05k1J14k14K31j78k7J20L73
2743B80j08N4l31k76L29K22l20L3K68k39K26k99L78j06j02J8R4q7P1m4k1Oj98
2766a52M27l06m5Q0K5k5j38OL24j09k41J40J30k74lJ73J69p5l54L08lQ2q2j29
2790g2p3L17k81k1J01j01OJ18k7O3n9J44k10MK29k4k70L56o5n6p9k19L3q4J98
2815g2J56K4j09J06k1m6j22R8k08K78m44N14j88K11k94K77k33J66o7l7Q2k82k7
$$ y = [-140, 282, 248, -3, -6, 276, 342, -8, -50, 104, 180, 97, -92, -17, -7, -65, -236, 1, -96, -163, -17, -351, -241, 25, 78, -238, -93, -191, 273, 64, -198, 129, 145, -1, -65, 33, -186, -77, -122, -71, -40, -33, 148, 8, 103, -192, 166, 97, 69, 200, -122, 10, 73, -91, -50, -11, -20, 60, 116, -215, -136, -103, -153, -108, -219, 30, 31, -39, 36, 4, 156, -94, 98, -119, 19, 71, 76, -118, -192, -318, -89, -32, -133, 71, 138, 28, 80, 165, 76, 87, -118, -139, -25, -239, -8, -186, -213, -93, 280, 172, 226, -105, -381, -52, 170, -150, -117, 151, -88, 138, -161, 217, 111, 9, 27, 121, 34, 105, 61, 40, 46, -152, 275, -31, -76, 4, 29, 4, -134, -128, 196, 87, -154, -14, 116, -158, -161, 12, 181, 106, -248, 60, 57, 139, 57, -72, -145, 172, -109, -130, -29, -130, -124, -6, -33, 30, -29, 115, -95, -91, 138, 114, -156, 200, 135, 79, 0, -219, -186, -270, -72, 84, 108, -1, 105, 84, 38, -84, 14, -194, 84, -360, 154, -34, 177, -117, 160, -73, 93, 26, -11, 71, -211, -238]
2838b38K89R4j58K4M7oqj13R4N3j86J25Q4j35O2q9J67l8L3K3k6m9k6Jj93J41J62
2865A34m57M48k89j06M34k65J15j02n0J70j46K04j10L08L1k15j70K59M1n37K28
2886g5k23L22j33K54j32r1K3kl9M9J04j75M37m27K95r9j81mK02kl14M94k02N9
2910A40k82J74n7J12j38K98j68j02P1m91N18l36M25Q8k13l32M07j5k78K31Q3O7
2932B02m9l65K07k8K8K3r3o3mK98m0k23J18K57l05K05l56L10j69l38M48k05L29
2955A87k36J66K0k04L11l39k6J42j02J12o6J58j14k05k8K31m13N71l00J44j59
2976a50K85l74K54J51m13J61R6J23P3l68m0L03l34K29k2K02j70K17j51j42J37
2997F7k84OK81m1o8K59n13J68J28lj36L50j30k05J15J3Q4k00m0K63o4m28K27K56
$$ y = [-238, 51, 145, -13, 11, 58, 52, 44, -69, 25, 78, -108, 17, 101, -34, 28, -61, 106, 68, 101, 124, 98, 49, 23, 24, -169, -28, 134, -323, 125, -164, -270, 164, -101, 14, -88, -138, 32, -114, 90, -20, 288, 319, 104, -66, 193, 234, -303, -75, -298, 24, -109, 145, 13, -78, -55, -57, -96, -47, 57, -118, 319, -108, 187, 88, -93, -97, 105, 103, -211, 283, 81, 140, -142, 32, -25, 87, -51, 247, 79, -23, 48, -443, 75, -261, 164, 252, 39, -293, 114, 99, -179, 52, 135, 202, 153, -212, -5, -33, -5, 18, -75, -138, -142, 156, 116, -107, 11, 268, -37, 168, -188, 122, -47, -385, 63, -142, 187, -49, 117, 137, -67, 244, -95, -121, 21, -81, 31, -35, 123, 9, -196, -224, 7, -406, 165, -135, 9, -150, 135, -239, 15, 166, -247, -86, 10, 133, 206, -162, -202, 101, -233, -4, -26, 176, 6, 223, 72, -70, 67, -217, -211, 70, 29, -39, 220, -293, -125, 3, 0, -136, 214, 84, -121, -6, 7, 91, -109, -149, 114, 50, -378, -151, 105]
3021A05joq4p7O5j04K0L9l0N6P9J0j33RN5K39l90J53N5r5J33l51J24Q3J07P5r
3048A27j54n2K94l61lK55k93L10j78M48l56J23r6J3k20m3o9K02k18R0J30l28N00
3071A21N4k29K82l58J62J86l04PO6Q0k23M91o06K97J44j65k36L06j55M1J70k30
3093i9j33J57M9J87J07r5j10j33jJ4J51r7K37l71J91P2mJ88l30q7r5J51L10j57
3117A02k05J51N3j08m0J39j04j17%K31l40Q0L76k50J45N3k21j13Q2K99l84K50
3139G9Q7l9j7r5j45J14Qj21M9j23K78k09P3j85K00L8jj58L54J24m57O6LK20j97
3164e4O1n5J32n3N5J38k04J18l0n39O04l90L51k08R0q9O7J44k48R8k8R3j14J50
3188H9K54l79k8L78k62J97m42m0J60K00q7q6J09K0j26K64l57N6J75k02L82m29
$$ y = [105, 104, 98, 14, -63, 2, -102, -82, -43, -73, -17, 62, 72, -61, -52, 3, 242, -148, 5, 60, -35, 98, -253, -129, -46, 61, 136, 127, -27, -79, 215, -146, -149, 106, -187, 123, -55, 393, 37, 160, 64, 77, -143, -186, -255, -53, -271, -181, -51, -379, 121, 175, -54, 228, -130, 32, 218, -86, -79, -13, 67, -156, 335, -271, 26, 170, 5, -231, 75, -80, -39, 131, -99, -232, -75, -26, 161, 268, 173, 63, -70, -71, -57, 94, -3, 234, -137, 54, 126, 122, 310, -20, -107, -202, -51, 259, 102, -103, 48, 101, -7, -47, 92, -12, -129, -129, 102, -238, -158, 218, -32, 113, 166, -55, -168, -86, 213, -171, 79, 166, 127, 110, 15, -130, -16, -8, -129, -80, -203, 75, -134, -61, -246, -46, -8, -9, -167, 187, 311, -146, -80, -77, 143, -54, 7, -48, 84, 31, 86, 224, 20, 138, 108, -431, 173, -217, 134, -74, 16, -73, -6, 138, -110, -12, -40, 53, -61, 89, 343, -36, -64, 314, 52, 249, -193, -233, -73, 127, 40, -46, 63, 83, -43, 221, -136, -80, 95, -107, 275, -154]
3210a54L28j94J42j65n1K00k00K22k25J64p3o2J87j55j6J30K8r5p5L67l66K58
3232A95l79M14k64K44n53O5L71k57N3j24P3J89k73L78k47k24N24j15R8rl32l1
3254b04L05l30K72r5J86j16m16M75j57q0K42j39l0k9L1m2n3J04qP3l1J68j62J25
3278H9j78pJ81J0n6k7L6k02J91l27J70j45L83L8j46L2j28M7L9j9J57l03L73k93
3302h5J64k22J86q3o1J19P5p9R8j21j63L69j28kJ24q9p4K08l71P0J10N8J86k75
3326A4k14K43l51N24J11j75n29M38N7j7j46q7J57N1k15J09L5K35j05j50q2J82
3348H5j65o4M01m87J89J09m0j63j03J25J97Nk52L39k64rj2J35n3J51Q6j18O7j61
3372bj17n6Q7rK95l60J46k4K03k30k39O68n27J47j04J45j40Q7l1K32r6j43R1J62
$$ y = [-154, 174, -20, 122, -43, -94, 106, -94, 128, -97, 67, -6, -68, 119, -36, -52, 78, 106, 11, -64, 303, -63, 195, -184, 230, -34, 210, -343, -278, 93, -164, -111, -235, -162, 27, -246, 132, -115, -339, 185, 70, 168, 159, -173, -204, 101, -229, 43, -52, 134, 18, -398, 77, -80, -160, 82, -57, -87, -116, -85, -127, -180, -76, -84, -11, -42, 126, -36, 89, -89, -96, 85, 95, 39, 12, 48, -154, 37, -290, -120, -265, 118, 156, 10, 42, -86, -39, 0, -19, 138, -165, 208, -85, 79, -143, 43, -40, -101, 18, 93, 14, 112, -9, -172, 197, 69, 67, 191, 102, 28, 236, -135, -65, 45, 103, 289, 14, -200, 43, -308, 216, 327, 152, -377, 61, 118, 101, -45, -132, 25, 76, -139, -30, 5, 240, 135, -15, -97, 85, -80, -144, 257, -230, -41, 68, 28, -135, -238, -113, 84, 89, -163, 176, -88, -97, -109, 26, -27, 124, 210, 92, 159, -2, -119, -175, -88, -97, 198, -162, -16, -40, 163, -67, -306, 362, -165, -18, -122, 23, -117, -30, -61, 171, 75, -68, 23, 185]
3396A85m7n00N84j79k68J97Q8p1J83k07J44n9J88j10j70Q7k49J12J61o8n1O8k34
3419b16L62J06m00K68j20Q9n9O1p4k9q7J81J01k43r3J91R4l74K77k9j63J80q5
3442f2J26m8j15J18N6p9J5Lp2J72q9O9o2j32N1K28l77K90m4L3j1k71O8J98Q3p2
3468G6j49j34K23j96K24K22l74L48j07l07K4L78j33j51J35l56N15j41M5n9j79
3489i6j65M98p1k21J8o4J31K90l32K1MN0k38K30k39j08K88p1R5r3k25J60J8n6
3513a76L55j61J6J8j09J99q6j31J21rj27K86o25K01K85j17k68M64j88j2O0P0l8
3536B8m6j48L00j99N7N3k55J29j65K41l2J9j83M09j06o3m7J14n2j03k07J72L3
3559e1M23l78K49l58j4O9J9J02j61J35j2l7K48m85J26k2q5M6K74kO7k14J5k47
$$ y = [185, 138, -362, 222, 43, -225, -28, 60, -11, 172, -35, 109, 50, 238, 128, -42, 45, -204, -92, 69, 1, -50, 18, -216, 146, 252, -148, 120, 0, 89, 30, 91, 17, -12, -99, 82, 183, -60, -153, 38, 132, -242, 35, 6, -157, 23, -62, 64, 16, -99, 19, 75, -4, 11, 14, -58, 114, 25, 94, 32, -100, -49, 179, -198, 92, 48, 81, 70, -201, -133, 65, 148, 76, -73, -207, 16, -180, 44, 266, -108, 240, 133, -174, -150, 228, 95, -56, 79, -277, 238, 97, 142, 83, -96, -261, 237, 166, -55, -37, -101, 30, 320, -12, 9, 13, 63, -175, 55, -184, -292, -4, -75, 20, -73, -298, -138, -120, -176, 179, 18, 34, 52, -57, 142, 56, -75, 46, 37, -90, 196, -429, -228, 57, -60, -328, 136, -52, -64, -4, 66, 28, -18, -166, 134, -65, -8, 45, -210, -81, -246, -5, -37, -18, -201, 208, 102, 39, -8, 106, 54, -49, -256, -84, -51, 372, -6, 243, -115, -129, -60, -41, 61, -100, 35, 23, -14, 234, -251, -125, -147, -232, -186, 88, 86, 153, -61, -46, -293]
3583b93L63l0J96k15J9j99J32J25l8K97m21L05l21kNJ88j53L8J80k14L18n26J41
3606a05J33j93M62m53K08KJ62j41j91m3M6K07l35K78k51K35k0k01K45J68j18k33
3628a38K35o8P0J00l00N7o6N9J36l17K36j17K21j94MJ23o2K61k2n82K3M56K5J9
3652A59m1o2J14j6k71J52R4l67J48L33M3l94k5L06k97J34J6q7J01l4Mj86R9L14
3676B37k13j46K30k9j93k2J65j1j9m4L4q7J44J69l43M28j68k06O3N5k00K53lj19
3700b5K32j5k55Q0J5M0j55J31o4j57K69J70j71j22J31K83m02k8l03N52j48J15
3722A73k34L7M4n1J63r7K93l93K3J34j0k10n6J44R3pJ17k53N0j10Q9J26J53l94
3746a76k08L38j45J7L43j60J1j1J98n55L22M5j85K37j33m2K57j59j74K49k07M36
$$ y = [-293, 70, 40, 236, 21, 40, -159, -27, 98, 60, 357, -64, 241, -80, -82, -77, 111, -42, -4, 176, -38, 280, -246, -105, 28, -165, 297, -156, 52, 54, 216, 75, -116, -159, -113, 94, -241, 37, -214, 21, 1, -200, 45, 213, 95, -138, 97, 29, 99, 199, -101, -44, -110, -51, 85, -232, 4, -113, 108, -86, -82, 41, -21, 240, 218, -364, -341, 115, 140, 159, 118, 56, 170, 154, -117, 35, 129, -238, -90, 243, 286, -108, -133, 173, -124, 10, 26, -61, 40, 6, 10, -176, -77, 237, 24, -122, 108, 79, -114, -136, 29, 18, -1, -45, -11, -98, 46, 215, -128, 300, 132, -74, -11, 44, -156, 97, 94, -25, 207, 192, -63, 17, 32, 72, -83, 48, -16, -173, 96, 266, 95, -27, 104, 387, -15, -43, -346, 206, 58, 173, -61, -24, 20, -31, 132, 35, 328, -65, -42, 92, 82, -128, -184, -40, 53, 46, 163, -90, -40, -150, -61, 65, 218, -176, -384, -46, -191, -174, 169, 9, 20, 9, 207, -348, -26, 19, -166, 71, -62, -104, 153, -6, -180, 69, -138, 298]
3768B98k79L6q0M6j64M9oj35M89j32m7k26M11l18k9J54M0J43k56K15m17M24j75
3791D1l00M57k96m7J29j23n1J43n3K15k28J41j31j85K03J45j27J02N1J38l94K89
3813A19j89K67j05l2k05p3Q3K95p5p4k4J29j96J40j60J14Pk11M9N4O8o3J49J27
3837A94k49P5r6K33P0n18K54P6j97K86k08k4R3j19K1L8j24J67Q6l05J89N3Nj3
3861a3l9l0P8L6J74j11j53N9k8L9k13J98R9l25K49rk51K35j96J68O2L7N5J76m34
3886a37L11j63J50j79j98K81j64J36l7J31l22J22J31l4J10j69J73K3j36J93l46
3907a24j5k9M73j37k31j36L58k38K20l03OJ58M5j9j01J01o6K05j45n1k89Q6J57
3930g5K45j84lq7J62k7O0J86l37K18l3k22L0K5L7O6pN6j16J67J50k60r5m0J96
$$ y = [298, 19, 55, -25, 21, -143, -94, -100, -235, 254, 122, 75, -151, 260, -58, -87, 67, 107, 250, -6, 209, -208, 216, 41, -259, 198, -98, -145, -16, -139, -190, -47, -100, 115, -113, 28, -103, -288, -85, 60, -67, 35, 86, 224, -170, 119, -70, 197, 92, 60, -145, -218, -135, 160, 85, 11, -13, 116, -80, 60, -100, 14, 21, -190, -141, -87, -19, -82, 67, 194, -55, 20, -76, 157, 227, -291, -37, 39, -158, 128, -80, -104, -11, -130, -109, -71, -195, -28, 58, -247, -58, -5, 0, -13, -52, -82, -4, 32, 206, 95, -58, 1, -27, 12, -201, -3, 96, -229, 20, 11, -240, -5, -201, -33, 29, 66, 121, 297, -137, 174, 11, 161, -18, -216, 65, -99, 37, 0, 131, -191, -69, 62, 28, 138, -31, 142, 165, 29, 222, -124, -139, -168, 305, 168, -63, -199, 159, -79, 141, -162, -156, 2, 47, 28, -73, 28, -38, 167, 22, -29, -318, -232, -75, 170, -14, -17, -104, 58, 31, 91, 277, -60, 158, 125, -97, -67, -42, -5, 61, 54, 110, -6, 161, 311, 51, -44, -84, 112]
3955A12k15J39k40L7Q9Q6J42m15L16J3j51J02j49j9R1L05l87L08k13K6k5j3J68
3978A07q4n7M4l41J96qK06j08O0J05K8j07J57j74O2j07p9R5o1M4R5J6l0J15o6
4003A08l29N22l03j9r7J2J71p5j73m9J67qN8q2P8j53j11K15J54m6j28Qj73J69
4027h4K13j00j48K5L02m07J90KQ1j04O2j66K81O8k52J86k59%J61r0J61j24j00
4050a02K04J1j13q6O3l7J67j70J31m02L53N4j72P3J73l44K57m1Q6j47J25j7J62
4073B28k90K11j72j04M1lP4J91r7k7m8L9q5k3L23k53J7M7n6j59k4J85o7J50k88
4098a90L65j58L08n4m52J6MJ36q8M13l04L3L5o1j34J80j86J48O5q6l6J60j20M2
4122C6q5M1J06j07m3Q3oN2j2q9q0J62K24j11j78L6M4j31j05J62J97l2k34M05j72
$$ y = [112, -103, 36, -204, -167, -78, 8, 150, -265, 51, 64, -87, 15, -134, -153, -62, 243, -144, 164, -49, -23, -48, -61, 107, 23, -34, 10, -331, -135, -143, 63, -45, 15, 120, 148, 41, 198, 24, 86, -21, -100, -5, -66, -22, 73, 89, 59, 174, 108, -221, 301, -2, -21, -118, -106, 65, -10, -183, -232, -65, -73, -15, -97, -19, -172, -283, -68, 86, 40, -88, -80, -253, -84, 129, 29, -119, -94, 208, -199, -9, -7, 74, -30, 32, -134, 147, 215, -37, 149, -110, -110, 51, -39, 122, -2, -102, 102, 113, 0, -86, -23, -60, 107, -63, 68, -334, 19, 73, -99, -26, 147, -197, 60, 19, 105, -42, 83, 66, 228, -62, 149, -23, -127, -86, -89, -15, 176, 79, 52, 4, 43, -42, -65, 258, 5, 22, 69, 13, -146, -170, 15, -52, 98, -190, 175, 17, 325, 271, -181, -165, -161, -25, -113, 300, -4, 29, 64, 3, -131, 49, -137, 11, 76, -10, -46, 114, -6, 36, -49, -8, 98, -9, -52, 31, 25, 77, 65, -24, -104, 58, 282, 171, -7, 29, 73, -58, -163, -1, 196, 164, -70, 335, 163]
4147A63J21l89J16J04J7p6J33o2j21Q3p2J64k22K32l36P9K23k90R5J31j68R8R9
4170A22k11J72m12M27k27ql12O10r1o1p5j41K02k4J21l53L93r4p1Qp7L79k99M0
4194A8l74J61K28r7L3J84l7K60m05k02K37k25L27j99R8oJ43L9k60R9j74K51q4
4217A5k7K05k34j34M16q1p7l47L31R7j17j22K40k77K8L07j32j05K00j5j22pJ72
4240B14l78J04L28l07J1K20j28L7L86l99p6R7j22q8l5L49j6l64J53Q0l03L13K3
4263I9q9k41J58L8j20K93l05O2Q1j87M28m67K45j52K99k03N4q9K23l44K38K91
4285C12n63N06k14j34N6j44L27k10k6O9K84l29J17P2k08r8M75l35n6M0J9l7o8
4308a45N9K72k47j39L39j43J24j63J03j40K7J01j29L65k02Ll2k92M93m54J75K50
$$ y = [163, 284, -105, 11, 115, 132, 56, 189, 127, 6, 89, 17, 181, -41, 191, -145, -66, 157, -133, -38, 93, -75, 23, 122, -89, 83, -329, 98, -129, -137, -449, 161, 70, 9, -66, -207, -5, -29, 92, -261, 132, 38, -33, -25, -102, 277, -22, 18, -356, -195, 33, -64, -31, 153, 116, 376, -29, -231, 6, -219, 108, -91, 7, 1, 144, 183, -77, 22, -152, 99, 15, -12, 193, -41, -175, 241, 160, 83, -264, 67, 164, 47, -75, 165, -112, -84, 223, 91, -14, 186, 171, 49, 42, 214, -164, -60, 268, -39, -28, 192, 64, 101, 487, 88, 12, 109, -13, -101, -136, 213, 197, -167, -14, 66, -237, 76, 99, 10, -231, -73, -35, -155, 138, -167, -105, -24, -211, 217, -250, -5, -157, 142, -61, -7, -96, 127, -217, 21, 312, -251, 255, 41, -93, -37, -181, 146, -64, -90, -21, 263, -66, 51, 123, -85, -183, 292, -43, -99, -59, -40, -77, -145, -86, 186, -61, -200, 139, -4, 120, -43, 60, -80, -53, 48, -81, 284, 82, 85, 53, -239, 254, -200, -25, 225]
4330B25k65j37O4J01l80L48K52j71k05K79r0k67J85k63K00J08q2J25o4J32J37
4351B32m38L35j63M33l62K27m33J62k31K55j65L27j49m3O1j23J37k76K36K6q9
4372d1k1J2K28k42L25m00J90k46K69N4m91O15k95K70k29l4P3K3J20k04J04j06
4394b6o0j2k6J92j8j39nr6K61l2ll3j0k5j42M9J49J08j27M3R7j87j88P6J40k11
4420b25M5J10K51p5k61J24J43q3K48l80M2J47p5j94K22m0J59j28j81M40k85o7
4442f3L75j40k13o1K06k18Q9j11J53l8j35M05j25j93K72l55p2J79j33K39j61K33
4464A33j75J61p5j16L9R9L0j40j48O9M9l5k06M00j6J31j91P1k19j00J91J56k81
4487a73K67L7j00J22l33K46j76M44l65K01n66N53k9k41r8J08J73m1l06K70j89
$$ y = [225, -40, -177, -113, -12, -392, -44, 208, 37, -168, 111, 21, -246, -61, -324, -124, -16, -98, 27, -37, 95, 232, -206, 129, -34, 399, 37, 264, -169, -7, -238, 17, -148, 179, 30, -13, 48, -75, 62, -214, 22, 48, -41, -62, -50, 178, -64, 261, -139, 51, -195, 74, 128, -363, 252, -43, 227, -2, -36, 37, 60, 180, -24, 80, -26, -86, -98, -124, 68, 50, -89, -94, -190, 71, 39, 36, 3, -7, -32, -174, -125, 24, 132, 5, 48, 145, -42, -230, -154, -14, -225, -180, -70, 181, 106, -155, -31, 112, 29, 277, -103, -61, 86, 11, -183, 39, -1, 158, 30, -151, 289, 4, -63, 312, 172, -41, -102, 104, -114, -25, -136, 17, -21, -156, 249, 124, -69, 203, -152, -224, -45, -178, 61, -100, 133, -42, 119, 44, -72, -33, 66, 96, -44, -192, -123, -74, -109, -315, 85, 69, 200, 9, 80, -139, -239, -48, 108, -173, 94, 131, 31, 153, -180, 66, -110, 334, -31, 170, -396, 157, 128, -113, -211, -103, 70, 29, -277, -7, -196]
4508a96j2J86J39k63r6M52k92k2q6L04k73l0l5J87l4R5m2R8k33L5J03M01j56n51
4532c21K02J07J17j75RN7j13n7K42r2J6o8J65k75O9J9m7j77K06K22N7n0o9M1l20
$$ y = [-196, -208, -22, 117, -146, -242, 210, -82, -104, -190, 114, -159, -189, -224, -37, -71, 24, -18, 80, -153, -118, -15, 386, 230, -321, -119, -12, 105, -70, -61, -4, -117, -174, 68, -24, -8, -76, 89, -186, -117, -98, -145, -322, -116, 106, 163, 113, 44, 85, -235]
$$ [...]
8191e3
##END NTUPLES=NMR FID
##END=
