##TITLE=1H_DE-106_78_old_TFA
 200.13MHz, DMSO-d6,
 8 sc
 
 22.8.2025
##JCAMPDX= 6.0         $$ Bruker NMR JCAMP-DX V2.0
##DATA TYPE= NMR FID
##DATA CLASS= NTUPLES
##ORIGIN= UXNMR, Bruker Analytische Messtechnik GmbH
##OWNER= pz
$$ XWIN-NMR		Version 3.5
$$ Fri Aug 22 13:39:14 2025 Russian Standard Time (UT+4h)  she@DPX200
##.OBSERVE FREQUENCY= 200.1308
##.OBSERVE NUCLEUS= ^1H
##.DELAY= (6, 6)
##.ACQUISITION MODE= SIMULTANEOUS
##.ACQUISITION SCHEME= undefined
##.AVERAGES= 8
##.DIGITISER RES= 18
##SPECTROMETER/DATA SYSTEM= spect
##.PULSE SEQUENCE= zg30
##.SOLVENT NAME= CDCl3
##.SHIFT REFERENCE= (INTERNAL, CDCl3, 0, 14.3821)
##AUDIT TRAIL= $$ (NUMBER, WHEN, WHO, WHERE, WHAT)
$$ ##TITLE= Audit trail, XWIN-NMR		Version 3.5
$$ ##JCAMPDX= 5.01
$$ ##ORIGIN= Bruker BioSpin GmbH
$$ ##OWNER= she
$$ F:/spectra/data/she/nmr/H-C/1/audita.txt
$$ ##AUDIT TRAIL=  $$ (NUMBER, WHEN, WHO, WHERE, WHAT)
(   1,<2025-08-22 13:37:58.54 +0400>,<she>,<DPX200>,
      <created by zg, POWCHK disabled, PULCHK disabled
       configuration hash MD5:
       00 E9 B6 7A A2 85 ED C7 34 08 36 98 17 FE 4E 26
       data hash MD5: 16K
       12 14 60 65 22 66 56 B8 4D A4 1D 07 6A 78 E8 B4>)
$$ ##END=
$$ 
$$ hash MD5
$$ 37 5F 9F DA 98 B3 22 2F 6C 31 79 A8 CB DA E1 22
##$RELAX= 
##$RELAX= 
##$RELAX= 
##$RELAX= 
##$RELAX= 
##$RELAX= 
$$ Bruker specific parameters
$$ --------------------------
##$DU= <F:/spectra>
##$EXPNO= 1
##$NAME= <H-C>
##$PROCNO= 1
##$TYPE= <nmr>
##$USER= <she>
##$AMP= (0..31)
100 100 100 100 100 100 100 100 100 100 100 100 100 100 100 100 100 100 
100 100 100 100 100 100 100 100 100 100 100 100 100 100 
##$AQSEQ= 0
##$AQ_mod= 1
##$AUNM= <au_zg>
##$AUTOPOS= <>
##$BF1= 200.13
##$BF2= 200.13
##$BF3= 200.13
##$BF4= 200.13
##$BF5= 200.13
##$BF6= 200.13
##$BF7= 200.13
##$BF8= 200.13
##$BYTORDA= 1
##$CFDGTYP= 0
##$CFRGTYP= 5
##$CHEMSTR= <none>
##$CNST= (0..31)
1 1 145 1 1 1 1 1 1 1 1 1 1 1 1 1 1 1 1 1 1 1 1 1 1 1 1 1 1 1 1 1 
##$CPDPRG= <>
##$CPDPRG1= <>
##$CPDPRG2= <>
##$CPDPRG3= <>
##$CPDPRG4= <mlev>
##$CPDPRG5= <mlev>
##$CPDPRG6= <mlev>
##$CPDPRG7= <mlev>
##$CPDPRG8= <mlev>
##$CPDPRGB= <>
##$CPDPRGT= <>
##$D= (0..31)
0 0.7 0 0 0 0 0 0 0 0 0 0.03 0 0 0 0 0 0 0 0 0 0 0 0 0 0 0 0 0 0 0 0 
##$DATE= 1755855477
##$DBL= (0..7)
120 120 120 120 120 120 120 120 
##$DBP= (0..7)
150 150 150 150 150 150 150 150 
##$DBP07= 0
##$DBPNAM0= <>
##$DBPNAM1= <>
##$DBPNAM2= <>
##$DBPNAM3= <>
##$DBPNAM4= <>
##$DBPNAM5= <>
##$DBPNAM6= <>
##$DBPNAM7= <>
##$DBPOAL= (0..7)
0.5 0.5 0.5 0.5 0.5 0.5 0.5 0.5 
##$DBPOFFS= (0..7)
0 0 0 0 0 0 0 0 
##$DE= 6
##$DECBNUC= <off>
##$DECIM= 32
##$DECNUC= <off>
##$DECSTAT= 4
##$DIGMOD= 1
##$DIGTYP= 9
##$DL= (0..7)
0 120 120 120 120 120 120 120 
##$DP= (0..7)
150 150 150 150 150 150 150 150 
##$DP07= 0
##$DPNAME0= <>
##$DPNAME1= <>
##$DPNAME2= <>
##$DPNAME3= <>
##$DPNAME4= <>
##$DPNAME5= <>
##$DPNAME6= <>
##$DPNAME7= <>
##$DPOAL= (0..7)
0.5 0.5 0.5 0.5 0.5 0.5 0.5 0.5 
##$DPOFFS= (0..7)
0 0 0 0 0 0 0 0 
##$DQDMODE= 0
##$DR= 18
##$DS= 0
$$ [...]
##$SUBNAM0= <"">
##$SUBNAM1= <"">
##$SUBNAM2= <"">
##$SUBNAM3= <"">
##$SUBNAM4= <"">
##$SUBNAM5= <"">
##$SUBNAM6= <"">
##$SUBNAM7= <"">
##$SUBNAM8= <"">
##$SUBNAM9= <"">
##$SW= 18.0517779522481
##$SWIBOX= (0..15)
0 0 2 0 0 0 0 0 0 0 0 0 0 0 0 0 
##$SW_h= 3612.71676300578
##$TD= 16384
##$TD0= 1
##$TE= 0
##$TE2= 300
##$TE3= 300
##$TEG= 300
##$TL= (0..7)
0 120 120 120 120 120 120 120 
##$TP= (0..7)
150 150 150 150 150 150 150 150 
##$TP07= 0
##$TPNAME0= <>
##$TPNAME1= <>
##$TPNAME2= <>
##$TPNAME3= <>
##$TPNAME4= <>
##$TPNAME5= <>
##$TPNAME6= <>
##$TPNAME7= <>
##$TPOAL= (0..7)
0.5 0.5 0.5 0.5 0.5 0.5 0.5 0.5 
##$TPOFFS= (0..7)
0 0 0 0 0 0 0 0 
##$TUNHIN= 0
##$TUNHOUT= 0
##$TUNXOUT= 0
##$USERA1= <user>
##$USERA2= <user>
##$USERA3= <user>
##$USERA4= <user>
##$USERA5= <user>
##$V9= 5
##$VALIST= <valist>
##$VCLIST= <CCCCCCCCCCCCCCC>
##$VD= 0
##$VDLIST= <DDDDDDDDDDDDDDD>
##$VPLIST= <PPPPPPPPPPPPPPP>
##$VTLIST= <TTTTTTTTTTTTTTT>
##$WBST= 1024
##$WBSW= 4
##$XGAIN= (0..3)
0 0 0 0 
##$XL= 0
##$YL= 0
##$YMAX_a= 177976
##$YMIN_a= -161171
##$ZGOPTNS= <>
##$ZL1= 120
##$ZL2= 120
##$ZL3= 120
##$ZL4= 120
##$ABSF1= 10
##$ABSF2= 0
##$ABSG= 5
##$ABSL= 3
##$ALPHA= 0
##$AQORDER= 0
##$ASSFAC= 0
##$ASSFACI= 0
##$ASSFACX= 0
##$ASSWID= 0
##$AUNMP= <proc_1d>
##$AZFE= 0.1
##$AZFW= 0.1
##$BCFW= 1
##$BC_mod= 2
##$BYTORDP= 1
##$COROFFS= 0
##$CY= -3
##$DATMOD= 1
##$DC= 2
##$DFILT= <>
##$DTYPP= 0
##$F1P= 0
##$F2P= 0
##$FCOR= 0.5
##$FTSIZE= 0
##$FT_mod= 4
##$GAMMA= 1
##$GB= 0.15
##$INTBC= 1
##$INTSCL= 1
##$ISEN= 128
##$LB= 0.25
##$LEV0= 0
##$LPBIN= 0
##$MAXI= 10000
##$MC2= 0
##$MEAN= 0
##$ME_mod= 0
##$MI= 1.114404
##$NCOEF= 0
##$NC_proc= 0
##$NLEV= 6
##$NOISF1= 3.799351
##$NOISF2= 2.8
##$NSP= 1
##$NTH_PI= 0
##$NZP= 0
##$OFFSET= 14.38212
##$PC= 1
##$PHC0= -1563.279
##$PHC1= 10.79229
##$PH_mod= 1
##$PKNL= yes
##$PPARMOD= 0
##$PSCAL= 0
##$PSIGN= 0
##$REVERSE= no
##$SF= 200.129724274929
##$SI= 16384
##$SIGF1= 3
##$SIGF2= 2
##$SINO= 400
##$SIOLD= 16384
##$SREGLST= <1H.CDCl3>
##$SSB= 0
##$STSI= 0
##$STSR= 0
##$SW_p= 3205.1282051282
##$SYMM= 0
##$S_DEV= 0
##$TDeff= 0
##$TDoff= 0
##$TI= <>
##$TILT= no
##$TM1= 0
##$TM2= 0
##$TOPLEV= 0
##$USERP1= <user>
##$USERP2= <user>
##$USERP3= <user>
##$USERP4= <user>
##$USERP5= <user>
##$WDW= 1
##$XDIM= 8192
##$YMAX_p= 0
##$YMIN_p= 0
$$ End of Bruker specific parameters
$$ ---------------------------------
##NTUPLES= NMR FID
##VAR_NAME=  TIME,          FID/REAL,        FID/IMAG
##SYMBOL=    X,             R,               I
##VAR_TYPE=  INDEPENDENT,   DEPENDENT,       DEPENDENT
##VAR_FORM=  AFFN,          ASDF,            ASDF
##VAR_DIM=   8192,          8192,            8192
##UNITS=     SECONDS,       ARBITRARY UNITS, ARBITRARY UNITS
##FACTOR=    0.0002768,     1,               1
##FIRST=     0,             0,               0
##LAST=      2.2672688,     0,               0
##MIN=       0,             -161171,         0
##MAX=       2.2672688,     177976,          0
$$ Real data points
##PAGE= N=1
##DATA TABLE= (X++(R..R)), XYDATA
0@%%%%%%%%%%%%%%Qj6J6j6J6j6K4l2L2m0M8n6O8p6Q8j04J20j36J52j71J95k20
$$ 0 0 0 0 0 0 0 0 0 0 0 0 0 0 0 8 -8 8 -8 8 -8 16 -16 16 -24 24 -32 36 -40 48 -56 64 -72 80 -91 104 -116
36a16K47k78L10l45L85m29M77n26N81o44P09p81Q61r49J045j151J267j398J547
$$ -116 131 -147 163 -182 203 -226 251 -275 306 -338 371 -410 451 -498 547 -604 663 -735 812
55H12j710J898k116K367k662L014l446L991m698N658p046R238j3214K2670q9159
$$ 812 -898 1000 -1116 1251 -1411 1603 -1843 2148 -2550 3108 -3938 5300 -7914 14756 -74403
70g4403m1996K33292O1083q5952k8190j1682r2977p118M1986k0962K022P0922
$$ -74403 -116399 116893 177976 92024 63834 52152 -40825 -47943 -5957 -26919 -24897 46025
82D6025k2921p8865Q29L5722K066K6243J5033l2350R72M5589q915l4391J4267
$$ 46025 23104 -55761 -54932 -19210 -17144 9099 24132 -8218 -7246 38343 29428 -4963 9304
95I304K1820j9437k4351p664Q091J6987j291k7330o779K3695J5433m649p650K218
$$ 9304 31124 11687 -12664 -20328 -12237 4750 3459 -23871 -30650 -6955 8478 3829 -3821 -1603
109a603J5405M860k0183n726K1776L199j9352m145N241j191Q173M93k5955q099
$$ -1603 13802 18662 -1521 -7247 14529 17728 -1624 -5769 -528 -1719 6454 6947 -19008 -27107
123b7107K7760P134k1826J197K0591K836o607q37J140R262Q495j6358k1199Q839
$$ -27107 653 7787 -14039 -12842 7749 10585 3978 3141 4281 13543 22038 5680 -15519 -6680
137f680J6972q582j6597k015N115N313P227N46k837Q780R686j1693j5523J0950
$$ -6680 10292 1710 -14887 -16902 -11787 -6474 753 1299 -1538 7242 16928 5235 -10288 662
151F62J9394n982k0288n098N300L989L920l639q521N830J0454j0385r724J6778
$$ 662 20056 14074 -6214 -11312 -6012 -2023 1897 -1742 -10263 -4433 6021 -4364 -14088 2690
165B690J4890j0780j0791P35J613P587Q009j0792j1837R257N831j3819l633J0836
$$ 2690 17580 6800 -3991 -3256 -1643 5944 13953 3161 -8676 581 6412 -7407 -11040 -204
179b04J558m976j866k555L486J5470K981j5024l180J1881J248p390j285K07j576
$$ -204 1354 -3622 -5488 -8043 -4557 10913 13894 -1130 -4310 7571 8819 1429 144 351 -1225
194a225n87n166o138P980J0995m272q539L016Q778L585j940n307j318M611J92
$$ -1225 -1812 -6978 -13116 -5136 5859 1587 -6952 -3936 4842 8427 6487 1180 -138 4473 4665
209D665p165l273N119K717m287m990J237O911M869m823o582K986O160J211l253
$$ 4665 -2500 -5773 -654 2063 -2224 -7214 -5977 934 5803 980 -5602 -2616 3544 4755 1502
224A502j629N35L139k44n619n67O592J196q095n130L353M831K035j917m195J687
$$ 1502 -127 408 3547 3303 -2316 -2883 3709 4905 -3190 -8320 -4967 -136 1899 -18 -4213 -2526
240b526O455O84m577J373N349k159o279k298K152K902J090m756n625L025O825
$$ -2526 3929 4613 36 1409 6758 4599 -1680 -3978 -1826 1076 2166 -2590 -8215 -5190 1635
255A635K6k763J763L430j451j972q33J329K670L30o141m445M071M257p39l233
$$ 1635 1661 -1102 661 4091 2640 668 -165 1164 3834 4164 -1977 -6422 -2351 1906 1167 -2066
271b066m68J475J184m9j064J254K852m15m264j349L913L579j590l789j675J507
$$ -2066 -2534 -1059 125 76 -988 266 3118 2703 -1561 -2910 1003 4582 2992 -797 -2472 -965
287i65J987r58k591K69J988n7k277K82M040K595j296l554m94K956J678k233k755
$$ -965 1022 64 -2527 -2258 -270 -327 -2604 -2322 1718 4313 3017 -537 -1031 1925 3603 1370 -1385
304a385o19Q03M06j408l00K212J723j095k046J127K923J719j967k877p91J906
$$ -1385 -2004 -1201 -795 -2203 -2503 -291 1432 337 -1709 -582 2341 4060 2093 -784 -1575 331
320C31J259j827j450P44J125r40j491J018K236J172k287k107R81K615J245j780
$$ 331 1590 -237 -1687 -943 182 -758 -2249 -1231 1005 2177 -110 -2217 -1236 1379 2624 844
336H44j583P92J177p99j212N31J201m76k111j286J446K068O52j588j238Q65K448
$$ 844 -739 53 1230 431 -781 -250 951 475 -1636 -2922 -1476 592 1244 -344 -1582 -717 1731
353A731op97l19M21m80r76q45P26J066j48k189j028J774K122J38r66p25R70O33
$$ 1731 1725 928 609 1030 550 -426 -1271 -545 521 373 -1816 -2844 -1070 1052 1190 224 -501 469 1102
372A102l27j083O79N77p39j743k2J416J615q72j701l28R76Q09m09pJ17M66l08
$$ 1102 775 -308 371 948 209 -1534 -1556 -140 1475 603 -1098 -1426 -450 359 -50 -57 60 526 218
391B18k96j98J027J073j120j846J59Q90O75l15j068m47M73L33J47K23Q82M26p91
$$ 218 -78 -276 751 1824 704 -1142 -983 -93 582 267 -801 -1248 -775 -442 -295 -72 810 1236 445
410D45j045N28Q72O40j044j334l74O43J015p23j90M36P3j2k88M51J157N6j372
$$ 445 -600 -72 800 1440 396 -938 -1312 -669 346 -377 -567 -131 -58 -70 -358 93 1250 1306 -66
429f6n51K98P53M37n20o50k17N12j29o15O82L16j18p90K57K40J131M67j197q84
$$ -66 -617 -319 434 871 351 -299 -516 -4 -133 -748 -66 250 132 -658 -401 -161 970 1437 240 -644
449f44M98N63k36K39k90o43J48l98l90P06J006l74r54J62Q31L57O36n02o78P5
$$ -644 -146 417 181 420 130 -513 -365 -763 -1153 -447 559 185 -769 -607 224 581 1217 715 37 112
469A12K1l74J49M20m68l02l99M4N05J134m06q48J30Q12k03J64q8l45q7K50m01
$$ 112 133 -241 -92 328 -140 -442 -841 -797 -292 842 436 -412 -282 530 327 491 403 58 -29 221 -180
490a80k70P32M94j392q1J32K53M62L31n35m63O85L29n55M33L35o66l21J16k64
$$ -180 -450 282 776 -616 -697 -565 -312 150 481 -54 -517 168 497 -58 375 710 44 -277 -161 -425
510d25N42L08p34q68O43L74lJ92M33m29K28L17k54K31Pj49r58P2M2J63O28K4p86
$$ -425 117 425 -309 -1177 -534 -160 -163 29 462 33 261 578 324 555 562 413 -545 -473 -431 -268 360 384 -402
533d02k77N40kM25K37j35n15k70K20J02R56l81q32o4K36l1R2L85o26o9K59k09
$$ -402 -679 -139 -141 284 521 386 -129 -399 -179 -77 879 498 -334 -398 -162 -193 -101 284 -342 -411 -152 -361
555c61j23Q79J14k29j78j75R1L80K33m42o68M1J31l64K01N28j18m16K62J88L51
$$ -361 -484 395 509 280 102 -73 18 398 631 189 -479 -438 -307 -671 -470 58 -60 -476 -214 -26 325
576C25K95P9n65l96L14L7P2k60J57l66J71K5J55O9K04l82m2j52L43L33P3n61J31
$$ 325 620 699 134 -262 52 89 161 -99 58 -308 -137 -112 43 112 316 -66 -108 -260 83 416 489 -72 59
599E9k7K86Q2j96m12J98k98k96K65N34k29m18K98j22L40L85p8P7m39m4J43j53
$$ 59 32 318 400 204 -208 -10 -308 -604 -339 195 -34 -452 -154 -276 64 449 371 448 9 -35 108 -45
621d5J58J52m05n70L7L71M18O0L7l16n5K02R7K32j02M1k89n24J76M05K37l92P6
$$ -45 113 265 -140 -710 -673 -302 116 176 213 -103 -158 44 141 373 271 312 23 -501 -325 80 317 -75 1
644Aj66l70L38K07K40p6j12j71jM21rQ0j82n06J32k07N01K62n77O4k25N4L90K60
$$ 1 -165 -535 -197 10 250 174 62 -109 -110 311 302 382 200 -306 -174 -381 120 382 -195 -131 -356 -302 88 348
668C48Q0l98o0L66j54L0Ll72J25j41o5L7J11L8k28K39K70k37K01L19k31j47j02
$$ 348 428 30 -30 336 182 212 215 -157 -32 -173 -238 -201 -90 -52 -280 -41 229 -8 193 512 281 134 32
691C2J77q8L2j4j35k33K5LJL84j75j20o3J24j04L60J44j20m55mK51L37l02q6J49
$$ 32 209 121 153 139 4 -229 -204 -201 -200 184 9 -111 -174 -50 -154 206 350 230 -225 -229 22 359 57 -29 120
716A20k45m18K85K10J35j62o8p1M57j21J86K9l58j27n5p3J88L20k96n63L52J19
$$ 120 -125 -543 -258 -48 87 -75 -143 -214 243 122 308 337 -21 -148 -203 -276 -88 232 -64 -627 -275 -156
738a56K24p8L64k03j07RK23l21M30k91k72Q4K7K07k09K55j31k72j56M93j86K11
$$ -156 68 -10 354 151 44 53 276 -45 385 94 -178 -94 -67 140 -69 186 55 -217 -373 120 -66 145
760A45j28J53j44L9p2J54j1J92n72M08j28j41J17m7p5q3L3J81N1K5R4j36J67k05
$$ 145 17 170 26 65 -7 147 136 328 -244 164 36 -105 12 -35 -110 -193 -160 21 72 97 191 55 222 17
784A7J81J96l65k6j6k80N10k28j23M92l27K33k65Q5O8lp3j09J41n5J76m9o0k12
$$ 17 198 394 29 3 -13 -293 217 -11 -134 358 31 264 -1 84 152 149 76 -33 108 53 229 180 120 -92
808i2K63l70L65k9j37k17K48j0r4J67J2L1m7K02l40J55n3k3O0k26M7R2QP5k28
$$ -92 171 -199 166 137 0 -217 31 21 -73 94 106 137 90 292 -48 107 54 31 91 -135 -88 4 12 87 -141
833a41j2K00l6P6K16k85j14r4q4R7K54j5j85J29m9k62K98J42q7L2l56J30L79J93
$$ -141 -153 47 11 87 303 18 -96 -190 -274 -177 77 62 -123 6 -43 -305 -7 135 48 80 -276 -146 233 426
857D26l01k54K23J3k55J98k31R3O2J18n87J47L88M4k45J77m1J73k50K04k11L20
$$ 426 125 -129 94 107 -148 50 -181 -88 -26 92 -495 -348 40 84 -161 16 -25 148 -102 102 -109 211
879B11n8j33j45o3K78k13O3J84j44j19J41J3J34k51K18l8K32k25l8J65j64j86
$$ 211 153 20 -125 -188 90 -123 -60 124 -20 -139 2 15 149 -102 116 78 310 85 47 212 48 -138
901a38J28m03N60r8j53j4k35N09R6j00j65j7P5K1J38J39k49l7j60J99r2K27m52
$$ -138 -10 -413 147 49 -104 -118 -353 156 252 152 -13 -30 45 66 204 343 94 57 -103 96 4 231 -221
924b21J56j1L11k83O7J55j10Q3r8M4j44QL69l37K9k69K73RJ15q8l9k5m0K33J9
$$ -221 -65 -76 235 -48 19 174 64 147 49 93 -51 -43 326 -11 18 -251 22 31 146 58 19 -6 -46 187 206
949B06l4p4N4q7J17j65m0R7j02J9P6p7j22Q4q7J1r9J59k7K1P0j80Q6K17p1J11
$$ 206 172 98 152 65 182 17 -23 74 -28 -9 67 -10 -132 -48 -135 -124 -223 -64 -91 -70 0 -180 -94 123 52 163
975A63k62J20kn3j28J95QN1K75l91k66M62J28k03Q3J2J56m09L6J48o9j08P1j26
$$ 163 -99 21 19 -34 -162 33 41 92 367 -24 -290 172 300 97 180 192 348 -61 -25 123 54 -54 17 -109
999a09J80lJ45J8J06j37q4K6J77k21j81J50o8M7O2J18m56P3K74k9J18j52j37J80
$$ -109 71 68 213 231 337 200 116 142 319 98 -83 67 -1 46 108 226 -230 -157 117 88 206 54 -83 97
1023I7q9J2j82q9K99R2n46N61j97k81M40j98K18m22L61O8k75J67K48k49j71K13
$$ 97 8 20 -162 -251 48 140 -406 155 -42 -323 117 -81 137 -285 76 144 -131 36 284 35 -136 77
1045G7j09J79l03L31l50J64K9q9J53mk11K51l87L42p3m0m2k2Nk02J92PK93m76
$$ 77 -32 147 -156 175 -175 -11 18 -71 82 78 -133 118 -269 73 0 -40 -82 -104 -99 -301 -109 -102 191 -285
1069b85K65l2j01J10m6R6LJ70j9l17J35l08J17J11J75j81K70k00R7l72J83K26
$$ -285 -20 -52 -153 -43 -89 7 10 180 161 -156 -21 -329 -212 -101 74 -107 163 -37 60 -312 -129 97
1091I7k17K71K49l85P4k60J74P4J66k52K05j01j95L55k09O9k66k8J10J49k9j46
$$ 97 -120 151 400 15 89 -171 3 77 243 -9 196 95 -100 255 46 115 -151 -179 -69 80 51 -95
1113i5j08J97k58L16j62k6M27q3k04J9K2L14m08j36M76j72r8m3j9J79R8k52O0
$$ -95 -203 -6 -264 52 -110 -136 291 208 4 23 45 359 -49 -185 291 119 21 -22 -41 138 236 -16 44
1136D4P0j5k37L7J94k97K02J91k37m28M78j56Q2N8K04j02o2l60N47k81k5K34j22
$$ 44 114 99 -138 -101 93 -204 -2 189 -48 -476 2 -154 -72 -14 190 88 26 -334 213 -68 -93 141 19
1159A9o3M8L0Nk75J59J46j19L18k86J51jk75K00J59Pj64J86n4l9k25O5q9L0o1
$$ 19 -44 4 34 39 -236 -77 69 -50 268 -18 133 132 -143 57 216 223 59 245 191 152 -73 -8 -97 -67 -128
1184a28K24j39k1K26l19N9n5L56k77K42l08J25J0j01N0j66K18J50k6k69J69P5
$$ -128 96 -43 -64 162 -157 -98 -153 203 -74 168 -140 -15 -5 -106 -56 -222 -4 146 120 -149 20 95
1206I5m59L72m2K23j73o0J57q8k0K57j70K8n5l00J6K62M6l33L25n9n1QJ22j03
$$ 95 -364 8 -34 189 16 -44 113 25 5 262 92 120 65 -235 -219 43 89 -244 81 22 -29 -21 101 -2
1230bn4O1k6J36p0j51K61n13j8M81o6K5k38K16l26pL81R1j04k94L09M2j01j22
$$ -2 -56 5 -21 115 45 -106 155 -358 -376 105 39 64 -174 42 -284 -291 90 181 77 -217 92 134 33 -89
1254h9J59J30j58k9J52J68k33j9Q2k35L0K48j95J07j52J78j2j25k6J52j79j4M7
$$ -89 70 200 42 13 165 333 100 81 163 -72 -42 206 11 118 -34 144 132 7 -19 133 -46 -60 -13
1277a3q0K98j91K36l55J04L6q9J34q1K14k49N6p7K59l64N1K19Pl17R8L11j68p4
$$ -13 -93 205 14 250 -105 -1 35 -54 80 -1 213 -36 20 -57 202 -162 -111 108 115 -202 -104 207 39 -35
1301c5j18Q1J80j63m7J76j15K08k99K02J8J34j82r2L0J92l39pK34J8r0j38J27
$$ -35 -153 -72 108 -55 -102 74 -41 167 -132 70 88 222 40 -52 -22 170 -169 -176 58 76 -14 -152 -25
1324b5j64L08j13Qk17MJ60K71l48O8j58RJ68J11J6j94p2J63J55l51L11P4k35l6
$$ -25 -189 119 6 14 -203 -199 -39 232 -116 -48 -206 -197 -29 82 98 -96 -168 -5 150 -201 110 184 -51 -87
1348h7L08R9l85P2K58k47M8L5m13J22K23K4J59p7j41m1j8j26J24L03j93j30Q3
$$ -87 221 320 -65 7 265 18 66 101 -312 -190 33 57 216 139 -2 -43 -61 -187 -63 240 47 -83 0
1371@k8j57M66k00j36K91k68J9j08L32l07M30l19n1j9J03l67L23L63l96O1k09
$$ 0 -28 -185 281 81 -55 236 -32 -13 -121 211 -96 334 15 -36 -55 48 -319 4 367 -29 32 -177
1393a77M31l10K83m77R9q5J04K31o0K37k34M5q7L2P6j42L48k88j21O4N6J41m24
$$ -177 254 -56 227 -250 -151 -236 -132 99 39 276 42 87 0 32 108 -34 314 26 -95 -31 25 166 -258
1416b58K06J49j39k15L14k43R7j28J51J16rK7q0O7o8J34l84L85l69K2L60J3o9
$$ -258 -52 97 -42 -257 57 -186 -89 -217 -66 50 41 68 -12 55 -13 121 -263 122 -247 -225 135 148 79
1439G9j02K44N1k80k54J36M44k95K62k70J25k63m3J22j87P8J70m6j15K11L6J91
$$ 79 -23 221 272 -8 -262 -126 318 23 285 15 140 -123 -166 -44 -231 -153 17 -29 -144 67 103 294
1461B94l78L62k71P9J24j75l1k78L41k57n9J53L3j34J94n3k7O2j45J83j77L50
$$ 294 -84 278 7 86 210 35 4 -274 67 -190 -249 -96 -63 -197 -3 -56 -83 -21 -166 17 -160 190
1483A90n0j60o1K76k78K68k47J07p0J13k39J31J22k81J74j17N29m47K67j33k39
$$ 190 140 -20 -81 195 -83 185 -62 45 -25 88 -151 -20 102 -179 -5 -122 407 -40 227 94 -145
1504a45K64j41M3M9o9j59l0K45k27L29k4q5j92kL09L5k85J56O1k97R8J18j31l4
$$ -145 119 -22 21 70 1 -158 -188 57 -170 159 135 50 -142 -144 165 200 -85 71 132 -165 -67 51 -80 -114
1528a14M73l32k22J20L45L5k40l63K85j81N9J90m4k2N9l64J38K88j24M5n6J01
$$ -114 359 27 -195 -75 270 305 65 -298 -13 -194 -135 55 11 -11 48 -316 -178 110 -14 31 -25 76
1550G6P8M1m04J58o7K97o6k82L14k50J92mL9l11J4K9O9J65n4O0j69K94j04L2R8
$$ 76 154 195 -209 -51 -118 179 113 -169 145 -105 87 83 122 -189 -175 -146 -77 88 34 94 -75 219 115 147 245
1575B45k69J8k4mj56R9N2K3K1J41R3N5k40n4K47l25J7J80o9j99O2O3J59k44o2
$$ 245 -24 -6 -30 -34 -190 -91 -39 -16 5 146 239 294 54 0 247 -78 -61 119 50 -149 -87 -24 135 -109 -171
1600a71Q1m5J41j08j15J26J2J12J2k50L90J9l19J40J35k16n2j58k2L73j44k0J9
$$ -171 -90 -135 6 -102 -217 -91 -79 33 45 -205 185 204 -115 25 160 -56 -108 -266 -288 85 -59 -79 -60
1623f0k1K06l15J47N7j73J46R4K9j9j08Qq6l8J94k25J43r1L29j81j30n4R4J74
$$ -60 -81 125 -190 -43 14 -159 -13 81 110 91 -17 -9 -95 -133 61 -164 -21 -112 217 36 -94 -148 -54 120
1647A20j9k85K82l73J96K09j99M3j70L69k8q6q5j04J66k40J93J63j70K16n5l19
$$ 120 101 -184 98 -275 -79 130 -69 -26 -196 173 145 59 -26 -130 36 -204 -11 152 -18 198 143 -176
1669a76J30k49K76O7J51k60J7K55k47j1K15k40j27J64l0M2M19l96j89M2J42j15
$$ -176 -46 -295 -19 48 199 -61 -44 211 -36 -47 168 -72 -199 -35 -65 -23 396 0 -189 -147 -5 -120
1691a20P5J99j61l7J6K07j11j58J11j02j86J42L53k38J19j02r4L13k77j6P3K60
$$ -120 -45 154 -7 -44 -28 179 68 -90 21 -81 -267 -125 228 -10 109 7 -87 226 -51 -67 6 266
1713B66m67J72K5j30R1n7q6J84j04L35Q1k93j4j78K99k01J93m9J2L3q0l9l84K56
$$ 266 -201 -29 -4 -134 -43 -100 -186 -2 -106 229 310 17 3 -175 124 -77 116 67 79 112 32 -7 -391 -135
1737a35M7q3L03j48O3J89q7N1j28j5l50L39K5J69l01L1J68j56K3k39L36j85K17
$$ -135 -88 -171 132 -16 47 236 149 200 72 57 -293 46 71 240 -61 -30 138 -18 5 -234 102 -83 134
1760A34l1j38J84K8J55j47j65j5J18l59J84J31k61J42Q1M1j23M8k81J96K80k13
$$ 134 103 -35 149 177 332 185 20 5 123 -236 -52 79 -182 -40 41 82 -41 7 -274 -78 202 -11
1782a1Q4j59Q1j83M08m34J46P9J66k18K89j17l6k71J81n7J03J20j26j67m7K65
$$ -11 73 -86 -5 -188 220 -214 -68 11 177 -41 248 131 95 -176 5 -52 51 171 45 -122 -169 96
1804I6l6j30J15k66J31P6q8J0K64o5N6m5j74J0R1K7N7j34l9l90N16j38N5j60J80
$$ 96 60 -70 45 -221 -90 -14 -102 -92 172 107 163 118 -56 -46 45 72 129 -5 -44 -434 82 -56 -1 -161 19
1829A9P2J24N0k35m3O6K9n7Q9k33J18k10K73J62j20J77k48k86K89l07O20l93k8
$$ 19 91 215 265 30 -13 53 82 25 114 -119 -1 -211 62 224 104 281 33 -253 36 -271 349 -44 -72
1852g2J1N9r0J47J40R4m15L69j84j95J95j14j05K73l15MK26j16K40k02M9J4R1
$$ -72 -61 -2 -92 55 195 289 -126 243 59 -136 59 -55 -160 113 -202 -198 28 -88 152 -50 -1 13 104
1875A04l03L22P4m08K27K3J3j70K26mj02k1J02j41l13J32J02L7Q6M7p4Pj89J98
$$ 104 -199 123 197 -211 16 39 52 -118 108 104 2 -19 83 -58 -371 -239 -137 -100 -14 33 -41 -34 -223 -25
1899b5j17K37j32Q6J32j01J05m54L20R0J10k31k49K38L6M3J0L8j46j50M4j4J93
$$ -25 -142 95 -37 49 181 80 185 -269 51 141 251 20 -229 9 45 88 98 136 -10 -160 -116 -130 63
1922F3r7R1j15K89j63N2O3k75j4J03j64L38q0K7K68k54p5K5j89J69l4j31J22J41
$$ 63 -34 57 -58 231 68 120 183 -92 -106 -3 -167 171 91 118 386 132 57 82 -107 62 28 -103 19 160
1946A60k43N1j68K86j52J28M1p9Lr6R8j01p7J67M5J61l65P2J21j79R6L33k85K67
$$ 160 -83 -32 -200 86 -66 62 103 24 27 -69 29 -72 -149 18 63 224 -141 -69 52 -127 -31 302 17 284
1970B84j05J42q8j52j1J32o6l11J77Q4O8j45j2p6J03j34R3l29K68K55j4q2j28
$$ 284 179 321 233 81 70 202 136 -175 2 86 154 9 -3 -79 24 -110 -17 -346 -78 177 163 81 -47
1993d7LOr4K23j07O5j27J12k2k11L40l42J64k20n1M16n1l57M93k05j04OJ89Kn0
$$ -47 -44 -38 -132 91 -16 49 -78 34 12 -199 141 -201 -37 -257 -308 108 57 -300 193 -12 -116 -110 79 81 31
2018C1o5M8l25M25j23j84N13k41L57m21K42l24K39j49J38j7k31K0j20N52m73l3
$$ 31 -34 14 -311 114 -9 -193 320 79 436 15 257 -67 172 23 161 144 -87 -67 -187 365 -108 -141
2040a41K93p2j11K7p1Q0j1n0k92M22j91L95j67Q2l2k79Rk6J14J72k19r3J63j60
$$ -141 152 80 -31 -4 -75 5 -6 -56 -348 74 -117 278 111 193 161 -118 -109 -135 -21 151 -68 -161 2 -158
2064a58K78K31j04q4L07m80M7%J68k09J36K6k52R4J96rlq7j87o3J50J95k52L5
$$ -158 120 351 247 163 470 -10 37 37 205 -4 132 158 -94 0 196 187 184 97 -90 -153 -3 192 -60 -25
2088b5l7j22L36l6j44N5q9J49j05o7KL10j56N1l19K00J18k78L61j59rm9j75J93
$$ -25 -62 -184 152 116 -28 27 -62 87 -18 -85 -83 227 71 122 -197 3 121 -157 204 45 36 -13 -188 5
2112EJ71k61J58Q2l76J64O9n3J00m19M77k0p0j53K86j67J99l77M38n48K13L70
$$ 5 176 -85 73 155 -221 -57 12 -41 59 -360 117 97 27 -126 160 -7 192 -185 253 -295 -82 288
2134B88N7l80j01K23l58J23o8K29J60K39m27P7j42p6K35q7J29k03J80J58m04n0
$$ 288 345 -35 -136 87 -271 -148 -216 13 173 412 -15 62 -80 -156 79 -8 121 -82 98 256 -148 -198
2156a98RL58j30l53L00k14P4K13K6j60J48P9l38K24j31K90l67J32k44L13J09l52
$$ -198 -189 169 39 -314 -14 -228 -154 59 85 -75 73 152 -186 38 -93 197 -170 -38 -282 31 140 -212
2178b12K09O8q5J92l07n2J41p4J76l3k1k6q2K37j03k73L24l64J8J96L61m17L00
$$ -212 -3 65 -20 172 -135 -187 -46 -120 56 23 2 -24 -106 131 28 -245 79 -285 -267 -71 290 -127 173
2201A73k15k14M11q8k41N9K23k1k18K85k95n9l2K08kR1k00J82J64j04j37kJ43
$$ 173 -42 -256 155 67 -174 -115 108 87 -131 154 -141 -200 -232 -24 -26 65 -135 47 211 107 -30 -32 111
2224A11k12J96q2K2M6j68J62n7o5lk31K15j41J87N6j72K21N2k89J72r6K00L6k31
$$ 111 -101 95 13 35 81 -87 75 18 -47 -50 -281 -66 -207 -20 36 -136 85 137 -152 20 -76 124 160 -71
2248g1Q2P0j58k31M41q8j39qj17K37J25j81K80k40J35K0o3jj66J42m0M52n24O9
$$ -71 11 81 -77 -308 133 45 -94 -102 -219 18 143 -38 242 2 137 157 94 93 -73 69 29 481 -43 26
2272B6M7j78K61j25pj91K33q9k19K51j63l2L35k49J20J46o9k25L65pl73K88q9
$$ 26 73 -105 156 31 24 -167 66 -23 -242 9 -154 -186 149 -100 20 166 97 -128 237 230 -143 145 56
2295E6K20k57q2j07J51j17K31r8l7J54p3k73L25j45j99K27J66k15J58k81K67q7
$$ 56 276 19 -63 -170 -19 -136 95 -3 -40 114 41 -232 93 -52 -251 -24 142 -73 85 -196 71 -16
2317a6J30j79K40p6j36j38J94m94L50r9M7M64q4l26PJ28N0L6k07l5J20J8j19R0
$$ -16 114 -65 175 99 -37 -175 19 -475 -125 -224 -177 287 203 -123 -116 12 62 98 -109 -144 -24 -6 -125 -35
2341c5K60j45l1M0p0M5n5qnJ30n24N53j95J97l41pj03N97k24j39JK49r0l64L03
$$ -35 225 80 49 89 19 64 9 1 -4 126 -398 155 -40 157 -184 -191 -294 303 79 -60 -59 190 100 -264 39
2366C9j2M9k69K30k29K49P4k53N6m1L22p8k25J17R6o0l9J21k9q9mr3k14K56L9
$$ 39 27 76 -193 37 -192 57 131 -122 -66 -107 215 137 -88 29 125 65 26 147 118 29 25 -68 -282 -26 13
2391A3k1j97J41J75n21M78jj53J47R2N2l41j93M49k65K43k60j70J22J90k19K87
$$ 13 -8 -205 -64 111 -410 68 67 -86 61 153 205 -136 -329 120 -145 98 -162 -332 -210 -20 -239 48
2413D8j50rK57j20m2J5L5k05J73L9l6j35M11m78K06m6r8O9K19l43J16K1J37m7
$$ 48 -102 -111 146 26 -16 -1 34 -171 2 41 5 -130 281 -197 9 -37 -135 -66 153 -190 -74 -53 84 37
2437C7j71R4M8j95J12J29j38Q1j66J99k8J2L5k42K03m6p4K23j7m38J10K89J3Q6
$$ 37 -134 -40 8 -187 -75 54 -84 -3 -169 30 2 14 49 -193 10 -36 -110 113 96 -342 -232 57 70 156
2461A56m60N10l38R5J50j41J49k27j4J86j48l5J25Q9k32Q4k05J96j14K33q2pn0
$$ 156 -304 206 -132 -37 113 -28 121 -106 -120 66 -82 -117 8 97 -135 -51 -256 -60 -174 59 -23 -30 -80
2484h0K13l86M5R4J1J70J11k71J64k8j22J44j65L56m90M26l26nM35j03p2R3j44
$$ -80 133 -253 -208 -114 -103 67 178 -93 71 43 -79 65 -100 256 -234 192 -134 -139 296 193 121 214 70
2507G0j42J74P3m8k3J5k80M80j48n8m0j26k07M00j98j04K31k3j97J8o1J9N8J20
$$ 70 -72 102 175 127 104 119 -161 319 171 113 73 -53 -260 140 -58 -162 69 46 -151 -133 -194 -175 -117 3
2531CJ62r7j40K2L39l21j84p5k5K68L3RJ3r2R1M1J43j1k27K69k09l6p9J11L1N3
$$ 3 165 68 -72 -50 289 -32 -216 -291 -316 -48 -15 -6 7 -85 6 47 190 179 -48 221 12 -24 -103 8 39 92
2557I2j49M5J73k2m9r1k7Q0J01n9j57J59R9j99o0J3P6O8r0n0J00q9L4J17j73j74
$$ 92 -57 -12 161 139 90 -1 -28 52 153 94 -63 96 195 -4 -64 -51 25 93 3 -47 53 -36 -2 115 -58 -232
2583b32K79k36L73k89P8J29j12K00j14k99J24R0p5L4q5N5K40j46j8m7J26n4Nk36
$$ -232 47 -189 184 -105 -27 102 -10 190 76 -223 -99 -9 -84 -50 -135 -80 160 14 -4 -51 75 21 26 -210
2607b10L36j40j25L85k98q4j42J57K52k86M2J38K21o0pk39K36R2l77j07K43PJ24
$$ -210 126 -14 -139 246 -52 -136 -278 -121 131 -155 -113 25 246 186 179 -60 176 268 -109 -216 27 34 158
2630A58J56ml12j01K77l55J53r1L46n32L4K75J55k61J38k18J70K27k06N8j0M3
$$ 158 314 310 -2 -103 174 -181 -28 -119 227 -305 -271 4 159 -102 36 -182 -12 215 9 67 57 100
2652A00J07n32N68j53j04q9J74J14k73J46J51r1p6q5j6mJ02j4Q7j19l8K50j80
$$ 100 207 -325 243 90 -14 -103 71 185 -88 58 209 118 42 -43 -59 -63 39 25 112 -7 -45 205 25
2675B5j45J82K23m09J82J36k47K3K08j11k19K55o1l90K22M03k03n4K38m84L29
$$ 25 -120 62 285 -124 58 194 -53 -30 178 67 -152 103 42 -348 -126 277 74 20 258 -226 103
2696A03k55L7r5L11k14R9p1j26K37k2l09M12J93m20j3K51K41l05O0j9k79K37L2
$$ 103 -152 -115 -210 101 -113 -14 -85 -211 26 4 -305 107 300 -120 -133 118 359 54 114 95 -184 53 85
2719H5r8k22J55K35j81J17j48L6j47J90L0l7J83p6k97L25j84Jm8RJ13j49R5O8
$$ 85 -13 -235 -80 155 -26 91 -57 -21 -168 22 52 15 198 122 -175 150 -34 -33 -81 -72 41 -108 -13 55
2743E5k88J51J46m7j51K2J37L8N3k60P1K71m27N1K62p3J55j10j83P6J54m28M92
$$ 55 -233 -82 64 17 -134 -112 25 63 116 -144 -73 198 -229 -178 84 11 166 56 -127 -51 103 -325 167
2766A67k59q9J41r1J17K4k38L13l79K97j12L8L18o6k36l6J25k08K62j60J23k4
$$ 167 -92 -181 -40 -131 -14 10 -228 85 -294 3 -109 -71 247 181 -55 -91 34 -174 88 -72 51 27
2788B7l91L54J10j79J20R3N0j10j8K6j24oJ05J49Q1l87K41l07K57M2k03M2K23
$$ 27 -364 -10 100 -79 41 134 184 74 56 82 -42 -48 57 206 287 -100 141 -166 91 133 -70 -28 195
2811A95k98J04kQ1n5r2J31j92L2J74j61o3K57M1j92lJ11m6J2L5j01R8o8J31K5
$$ 195 -103 1 -1 80 25 -67 64 -128 -96 78 -83 -146 111 152 -40 -43 68 22 34 69 -32 66 -2 129 154
2836A54j12J03j03j15LQ0j5R2q0l2K15l96J11R3K29j88N4p1j68L35r0n3m2j3j21
$$ 154 42 145 42 -73 -70 10 -5 87 7 -25 190 -206 -95 -2 227 39 93 22 -146 189 99 46 4 -9 -130
2861a30K8J10j49M02m13K21l46M42k95J57j77P6K08r5j09p3J58k65K10j60L7P7
$$ -130 -102 8 -141 261 -152 69 -277 165 -130 27 -150 -74 134 39 -70 -143 15 -250 -40 -200 -163 -86
2883h6Q3R8k75J67j20L78k59J35j20M03n14K7K6J67n2k42K62j59K14j20k97L16
$$ -86 -3 95 -180 -13 -133 245 -14 121 1 404 -110 -83 -57 110 58 -184 78 -81 133 13 -284 32
2905C2J92k49J85J44k38Oj0OL5k82R1lK26k40N1q3J16J06J18l49K67K9j08m02
$$ 32 224 -25 160 304 66 72 62 68 103 -179 -88 -91 135 -105 -54 -137 -21 85 203 -146 121 150 42 -360
2929c60K89M1K36k83K22q6K23L4n3k91Q8K41m39K22m16N52j60o6j78K43j06J88
$$ -360 -71 -30 206 -77 145 59 282 316 263 -28 60 301 -138 84 -332 220 60 -6 -184 59 -47 141
2951A41l8j7O4J29m00K56JK7lrj48R1j15J75j87j04K22K45k93K42q4l12N0K17
$$ 141 103 86 150 279 -121 135 136 163 160 151 3 94 -21 154 -33 -137 85 330 37 279 195 -117 -67 150
2975A50l09J26J44j86j87J55K83k77L24k52J8k15J80K60j91j29J69j46P2l6K03
$$ 150 -159 -33 111 -75 -262 -107 176 -101 223 -29 -11 -226 -46 214 23 -106 63 -83 -11 -47 156
2996A56k06J21O8j83L1K30m87K86K1J33r5J47o4r9K36j65r8j00J54j98J4K29j21
$$ 156 -50 71 139 -44 -13 217 -270 16 37 170 75 222 158 59 295 130 32 -68 86 -112 -98 131 10
3019A0q8j56L48l99N64l06J2K4j79K12j44J42k05J43O1j59pM20k70O8k28J64l58
$$ 10 -78 -234 114 -285 279 -27 -15 9 -170 42 -102 40 -165 -22 39 -120 -127 293 23 91 -137 27 -331
3042c31J71L2m0L27j43j94K13L0p4J24J00k42k9J40m37L5K49M47k51L9j70l16
$$ -331 -160 -128 -168 159 16 -178 35 65 -9 115 215 -27 -56 84 -353 -318 -69 378 127 166 -4 -320
3064c20K74j07K33j94rL23k16J65j59j93L78N1j47k82M73k18J49j87k70K53K08
$$ -320 -46 -153 80 -114 -123 200 -16 149 -10 -203 175 226 79 -203 270 52 201 14 -256 -3 205
3085B05j32l3k25J95q9j39J26j11N05n01K80q5Q7o2Rj90L43j38K5q9J06p9p5K43
$$ 205 73 40 -185 10 -79 -218 -92 -203 302 -199 81 -4 83 21 30 -160 183 45 70 -19 87 8 -67 176
3109A76l30j9m2J74J46J00k31m9K01q5k29M6kJ68M8q2j30L63l00K58r0j76o4J80
$$ 176 -154 -173 -215 -41 105 205 -26 -75 126 41 -188 -142 -144 24 72 -10 -140 223 -77 181 91 -85 -149 31
3133C1K80m74J92P2J56l04k38L55j04k8J03j10QQ8k3K8j31N2Q3K1O4j86Q0j49
$$ 31 311 -163 29 101 257 -47 -285 70 -34 -62 41 -69 -61 27 4 32 -99 -47 36 57 121 -65 15 -134
3157a34kP8rN3k24P9K91j04Nj22jJ87L4L9k64J38m7J41k39J1kM5j93P0L22Ql40
$$ -134 -136 -58 -67 -14 -238 -159 132 28 33 -89 -90 97 131 170 -94 44 -3 138 -101 -90 -92 -47 -240 -170 152 160 -180
3184a80P0K35j70j1K02k09N3r1J11Ln6j09L63l98j9L59k0j73k74K23L64m69j92
$$ -180 -110 125 -45 -56 146 -63 -10 -101 10 13 -43 -152 211 -187 -206 153 133 -40 -314 -91 273 -196 -388
3207c88M00k71Q2J49K09j99k60O6K08J05l23K12p2K37k29R6J24k51R2k92K83m9
$$ -388 12 -259 -177 -28 181 -18 -278 -212 -4 101 -222 -10 -82 155 -74 22 146 -105 -13 -305 -22 -71
3229g1O5j0j49R7O7m4J75k85R5l4o2J54ML3k36K50k1Q5k12P8P4J49k6ml37J27
$$ -71 -6 -16 -165 -68 -1 -45 130 -155 -60 -94 -156 -2 2 35 -201 49 28 113 -99 -21 53 202 176 172 -165 -38
3255c8R1j42j3j5Nj45L41k32Q0%n5nJ78k9K17k04j6J9k64Q0J13K1m2j61K15R7
$$ -38 53 -89 -102 -117 -112 -257 84 -148 -68 -68 -123 -128 50 21 238 34 18 37 -227 -147 -34 -13 -55 -216 -1 96
3281I6j80K69j95K61j89j04N3p2K57m0j23n5N2O0J5j35N5J35o20L61K3J20j70
$$ 96 -84 185 -10 251 62 -42 11 -61 196 156 33 -22 30 90 105 -30 25 160 -460 -99 -76 44 -126
3304a26J88J73nl05J96R3j38j47R6J74k54RJ94m1j13r6J5N13m92lL4L94o4k47
$$ -126 62 235 230 -75 121 214 76 -71 25 199 -55 -46 148 107 -6 -102 -87 426 -66 -69 -35 359 295 48
3328D8n8j56K84J37k88N2N5l8oJ35j15j33J4L80o67M89k02n0J98R7k62j4R0j53
$$ 48 -10 -166 118 255 -33 19 74 36 30 165 50 -83 -69 311 -356 133 -69 -119 79 176 -86 -100 -10 -163
3352a63J91j76J58L8j84P6r9L54k70p1K14k06K50k78J20L45n23L27j34R4L0j68
$$ -163 28 -148 10 48 -136 -60 -159 195 -75 -146 68 -138 112 -166 -46 299 -224 103 -31 63 93 -75
3374g5M75l36j66K2J02mLN2j16o7o8j33L63M9J88l59J87qO0j96k06K08m1j05Q3
$$ -75 400 64 -102 -80 22 18 21 73 -43 -110 -178 -311 52 101 289 -70 117 109 169 -27 -233 -25 -66 -171 -88
3399h8Q0j4N2N8k75K33O7q8k17M54l64L9k64O37l18j72K89l70N72m58p4M97n70
$$ -88 -8 -22 30 88 -187 46 113 25 -192 262 -102 -63 -327 310 -8 -180 109 -261 311 -147 -221 276 -294
3422b94K88K6M0K04k91Q0j86L40Qr6o1q8k51L01J84j25p0l6Rj22p6J82L85l15
$$ -294 -6 20 60 264 -27 53 -133 207 215 119 58 -30 -281 20 204 79 9 -27 -18 -140 -216 -34 351 36
3446C6p7l0J24J35m42J22r7J26L46o2j73K8p4R3L01o9l30m5R8J22o6k31jK89M4
$$ 36 -41 -71 53 188 -254 -132 -229 -103 243 181 8 36 -38 55 356 287 -43 -88 10 132 66 -165 -166 123 167
3471A67j41j97J20nJ77m61J91J50K9K19l48k3L67k92mK50m17K00j74L19j52J84
$$ 167 26 -171 -51 -56 121 -340 -149 1 30 249 -99 -122 245 -47 -51 199 -218 -18 -192 127 -25 159
3493A59n8j6J01j98j81J49j02M4oj7J28k10K78j03L7p5L0jm4j55L45j30j48j0
$$ 159 101 85 186 -12 -193 -44 -146 -102 -108 -125 3 -207 71 -32 5 -70 -40 -41 -85 -240 105 -25 -173 -183
3517a83K26J22k4k90J71q1K55j62p8O2r5PQo0J12o6J81l13K19J40j52j15m0jK8
$$ -183 43 165 141 -149 22 -59 196 34 -44 18 -77 -70 -62 -122 -10 -76 105 -208 11 151 -1 -116 -156 -157 -129
3542a29L13k66K25l56L18J32j99J08j53J16j00J90k12N3k03oK46M2L1k40NJ22
$$ -129 184 -82 143 -213 105 237 38 146 -7 109 9 199 -13 40 -163 -169 77 119 150 -90 -85 37
3564C7O3qj69N4n6o7K30K6j19J47n5rK03j35j63Q1j67n7L9J10o8OM3K09N0m51
$$ 37 100 92 -77 -23 -79 -146 84 110 -9 138 83 74 277 142 -21 60 -107 -164 -125 -15 -83 -77 -34 175 225 -226
3590b26M29r9P3q9j79Q1k47L77l84J21K48l44J99N5J41j78K5n6n4J07l09N10k99
$$ -226 203 104 177 88 -91 -10 -257 120 -264 -143 105 -239 -40 15 156 -22 3 -53 -107 0 -309 201 -98
3613i8J1J50l52J39K06l9k3J10l12K31n1l17J71j52K51J09j85M3J82mO4j37j75
$$ -98 -87 63 -289 -150 56 17 -6 104 -208 23 -28 -345 -174 -326 -75 34 -151 -108 74 70 134 -3 -178
3636a78J83j40L37m00K47K9n24L42o8K43k98J80O8j15M9J18m5M9J88n11J69l5
$$ -178 5 -135 202 -198 49 78 -446 -104 -172 71 -227 -47 21 -94 -45 73 28 77 265 -246 -77 -112
3658a12K88k33l60M45n3P6j35J13r7N6o6K31k9M8j80ql7M4oRJ49k0j27j41K81
$$ -112 176 -57 -417 28 -25 51 -84 29 -68 -12 -78 153 124 172 -8 -16 -53 -9 -15 -6 143 123 -4 -145 136
3683A36l36P3Q4J05m3o5J91l36M70k67j8k67K20n3K39j48p7K09j01K21o13M80
$$ 136 -200 -127 -43 62 19 -46 145 -191 279 12 -6 -273 -53 -106 133 -15 -92 117 16 237 -376 104
3705A04l77K98K30Oj81o7J58j03n7O1O1j84q6j46K01L88l98K83k01k35M40m31
$$ 104 -273 25 255 261 80 13 171 68 11 72 133 -51 -137 -283 -82 306 -92 191 -10 -245 195 -236
3727b36L85j39j12K79k52L48k55k5R9N5j03j87Q0J86K8l89K24k90L01j36k58K80
$$ -236 149 10 -102 177 -75 273 18 -7 92 147 44 -143 -63 123 151 -238 -14 -304 -3 -139 -397 -117
3749a17J66J1J11l70L67j76M5k1nk44K21J54j08m02L91N6l82K48K51j54O7r5R2
$$ -117 49 60 171 -199 168 -8 37 16 11 -233 -12 142 34 -368 23 79 -303 -55 196 42 109 14 106
3772A06p8m81J52K89L08j64j54J27j27j51K92r8o7K88j12k5Q6j24j28L18l14l8
$$ 106 28 -453 -301 -12 296 132 -22 105 -22 -173 119 21 -46 242 130 105 191 67 -61 257 -57 -95
3794i5J37M0k50N9J43P1r1L2j7j7J46p3q3R6R6k77K91k0j91K04k40J63l71K62
$$ -95 42 82 -168 -109 34 105 14 46 29 12 158 85 2 98 194 -83 208 188 -3 201 -39 124 -247 15
3818A5J79K1k10J3J35l51K83l05J65k55L28q6r9L67K8q3l24J02R3j45q1K99M6
$$ 15 194 215 5 18 153 -198 85 -220 -55 -310 18 -68 -167 200 228 145 -179 -77 16 -129 -210 89 135
3841A35m49L76J05j90M0m9j43K05j02l2K43P4j29j89K97k20o1l4k4K29k14J91
$$ 135 -314 62 167 -23 17 -32 -175 30 -72 -104 139 213 84 -105 192 -28 -89 -123 -147 82 -132 59
3863E9k55L19J78m66K25J02k32R8l3k65L33r9n5J00K02J08j74o3k11J7J00m7J86
$$ 59 -196 123 301 -165 60 162 -70 28 -5 -270 63 -36 -91 9 211 319 145 82 -129 -112 -12 -59 127
3886A27o2m15K1L87O0j06R6k00L29l11j02L3J26O7j07lJ22k88N7K99j79N7j87
$$ 127 65 -350 -329 58 118 12 108 -92 237 -74 -176 -143 -17 50 -57 -60 62 -226 -169 130 -49 8 -179
3909a79K02Lj9k10J61j7L8m61M11j0J70R5l10L3J50P1n8L0l10N70k53r8k78M65
$$ -179 23 26 7 -203 -42 -59 -21 -482 -71 -81 89 184 -126 -93 57 128 70 100 -210 360 107 9 -269 196
3933A96l73L58q9m42M49j41J09j96K56J09l49P6K66m17J61N2r4L44l50J37k40
$$ 196 -177 181 92 -350 99 -42 67 -129 127 236 -113 -37 229 -188 -27 25 -69 275 -75 62 -178
3954a78J16O1J44j06m5MM0K99l66J95k87Q0O9O9n7j09P2o3K4J24j96J53j87K15
$$ -178 -62 -1 143 37 -8 -4 36 335 -31 164 -123 -43 26 95 38 -71 1 -62 -38 86 -110 43 -144 71
3978G1K4k21P6j37J89J51j70J88j27j10O9K03J7k42J15q0L29j77l14J52K00l46
$$ 71 95 -126 -50 -187 2 153 -17 171 44 -66 3 206 223 -19 96 16 345 168 -146 6 206 -140
4000a40M54k93P8O9j02j13K31n55K95Q9j53L5J00k6Q0k21K04K25m12J76j82L33
$$ -140 314 21 99 168 66 -47 184 -371 -76 13 -140 -105 -5 -31 49 -172 32 257 -155 21 -161 172
4022A72k98m9J18J36j3k93J71J34j27K04k43k7O4K75k90o1K67p6LJ22n0J23j42
$$ 172 -126 -175 -57 79 66 -227 -56 78 -49 155 -88 -115 -51 224 -66 -127 140 64 67 189 139 262 120
4045A20k08K37j55k54J05O6O7J35q6P2K71l01L4m3j5k05J50o0K12l32K04K6l15
$$ 120 -88 149 -6 -260 -155 -89 -22 113 27 99 370 69 103 60 45 -160 -10 -70 142 -190 14 40 -275
4068b75J75k4R4j50K02j04J36n6NO3k5j33pp5J58J06l24L19LMq9K2j80K23K0j68
$$ -275 -100 -124 -30 -180 22 -82 54 -2 3 66 41 -92 -99 -174 -16 90 -234 85 88 92 3 25 -155 68 88 -80
4094h0J88J10k32J00j12J26k35j11L32J08n7p5l3j52K03l8O8q8q8K70j07o1Rj55
$$ -80 108 218 -14 86 -26 100 -135 -246 86 194 137 62 29 -123 80 42 110 22 -66 204 97 36 45 -110
4118a10R7J58l56N77k15l38K52k75J29K82l23Q7Q0j99K34J06k37J75N1j48l0k40
$$ -110 -13 145 -211 366 151 -187 65 -210 -81 201 -122 -35 45 -154 80 186 -51 124 175 27 -3 -243
4140b43j03J84J21j28M0K51n1k07K50nJ53l57Mn1K32k6k14k6K67O3k28M56j31
$$ -243 -346 -162 -41 -169 -129 122 71 -136 114 109 262 -95 -91 -142 90 64 -150 -176 91 154 -74 382 251
4163B51O1n97J62L63j03k26q2L53q7R8j24j83J48M3j53J71l1j83K60j70Nj94K19
$$ 251 312 -285 -123 240 137 -89 -171 182 95 193 69 -114 34 77 -76 95 64 -119 141 -29 -24 -218 1
4186AQ9k00K19j0M9j65qj46K28o8J81q7j80m5j3J44QNK20l64jJ6K77k60p1K64
$$ 1 90 -110 109 99 148 -17 -25 -171 57 -11 170 83 -97 -142 -155 -11 -3 2 222 -142 -143 -127 150 -110 -181 83
4212H3J08m41J40N8J58j35M5O5j94J16qK15j84O5L6j10l4k02M10l33Q5L43m13
$$ 83 191 -250 -110 -52 106 -29 16 81 -113 3 -5 210 26 91 127 17 -17 -219 191 -142 -57 286 -127
4235a27J44m0j22K61k1k16j1K95q3j76j83K37L8P8J15m37J27J67O1j72J02M8k6
$$ -127 17 -23 -145 116 95 -121 -132 163 80 -96 -279 -42 -4 74 189 -248 -121 46 107 -65 37 85 59
4258E9l1r1l8J45k1JL8km1RO2j38l3p3K53k04N6K85j39k04p0l8M04K03k54j51
$$ 59 28 -63 -101 44 23 24 62 60 19 28 90 -48 -81 -154 99 -105 -49 236 97 -107 -177 -215 189 392 138 -13
4284a3j15L20j72J48r7l16L28k43J64M0l19L04r3J85k32l5P9J7P6k09Q6R4J35
$$ -13 -128 192 20 168 71 -245 83 -160 4 44 -275 29 -64 121 -111 -146 -67 -50 26 -183 -97 -3 132
4307A32k6J6l61J61Qj23J22j12K11n1o5J11J15L3j70K08k89l2L7j39K07K69l11
$$ 132 106 122 -239 -78 -70 -193 -71 -183 28 -23 -88 23 138 171 1 209 -80 -112 -75 -214 -7 262 -49
4330d9J41M3j56q1J28k28K05j21J45ml5q0J2k6K12q7l5p8K52k78J28j28RJ19j8
$$ -49 92 135 -21 -102 26 -202 3 -118 27 23 -12 -92 -80 -106 106 19 -16 -94 158 -120 8 -120 -111 8 -10
4355a0N8r2K9o5l6J98l1k58K13n2P2P7k84J85K15l41J22j59J31j16J72j61K52
$$ -10 48 -44 -15 -80 -116 82 51 -207 6 -46 26 103 -181 4 219 -122 0 -159 -28 -144 28 -133 119
4378A19m3O3J7k02k5J87k25k6J95M7k56J71k29J78K44n26K55rP8M0K43l4m11K95
$$ 119 76 139 156 -46 -71 116 -109 -135 60 107 -149 22 -207 -29 215 -311 -56 -65 13 53 296 262 -149 146
4402A46l67J13J92r3n3J64m04L78j52o1K21j35j64K33P4j05K5M8j4J5p0o5j63
$$ 146 -221 -108 84 -9 -62 102 -302 76 -76 -137 84 -51 -215 18 92 -13 12 60 46 61 -9 -74 -237
4425b37K84m3J18j6k8j2j67K56lk73J7pJ38J0m43O20l50J46l8p1R9l3Q0K15m69
$$ -237 47 4 122 106 78 66 -101 155 152 -121 -104 -111 27 37 -406 214 -136 10 -28 -99 0 -33 47 262 -207
4450b07Q4Q2Q3R7k83J46J35k22l7k0J6J02N2q8L35k21k08o4K38r6P5L20m80L66
$$ -207 -123 -41 42 139 -144 2 137 -85 -122 -142 -126 -24 28 -60 275 54 -154 -218 20 -76 -1 319 -161 205
4474B05k72k26L56L1KJ71l12j78K01j43N3K36l18Q8J74n8k02K33j2r1K50k64k
$$ 205 -67 -293 63 94 96 267 -45 -223 -22 -165 -112 124 -194 -106 68 10 -192 41 29 -62 188 -76 -78
4497g8j66J84L46l47P2J7R0rp3QM9J91j61j23l3k5j9j66J33K49k70J95p7k5k11
$$ -78 -244 -60 286 -61 11 28 118 109 36 44 93 284 123 0 -33 -58 -77 -243 -110 139 -131 64 -13 -38 -249
4522b49M05k89o2J90l9K1n6J98lqo4o2K11j43j20J07J05k93J75p1Q3J41n01K58
$$ -249 156 -133 -195 -5 -44 -23 -79 119 116 108 44 -18 193 50 -70 37 142 -151 24 -47 36 177 -324 -66
4546f6k34M65r1k32K01J48Q4K3k95p6j95L51r3j5M0J4j18P9Qp4j78M8N05l96J10
$$ -66 -300 165 74 -158 43 191 275 298 3 -73 -268 83 -10 -25 15 29 -89 -10 -2 -76 -254 -206 299 -97 13
4571A3l3Jj45L02l05J28J60k48J90n9j17QK0J6P7Kj65L82j36O6k91j9J66j63M70
$$ 13 -20 -19 -164 138 -167 -39 121 -127 63 4 -113 -105 -85 -69 8 10 -155 227 91 157 -134 -153 13 -150 320
4596C20m61J08o0q5J55K45k90O7J05R3l24O6J75l59K10J77k95K40K6l38J48O9
$$ 320 -141 -33 -93 -178 -23 222 -68 -1 104 197 -127 -61 114 -245 -35 142 -153 87 113 -225 -77 -8
4618hR9j26p4J40M6k15J98j95L60j14j60M8rQ2j28o6J51j31k4j20K25j01K20j06
$$ -8 91 -35 -109 31 77 -138 60 -135 225 111 -49 -1 -10 72 -56 -122 29 -102 -126 -246 -21 -122 98 -8
4642hm8r1J93j12N5K59k65N2N5j84j40J80j10J26j2k09J78K36k58L51m69J35J06
$$ -8 -56 -147 46 -66 -11 248 -17 35 90 -94 -234 -54 -164 -38 -50 -259 -81 155 -103 248 -221 -86 20
4665B0m3p0P3p1J5K7k18K24NJ8j45J25J23j63J2m4K43q8o0j03M0J55j00J16o0
$$ 20 -23 -93 -20 -91 -76 -49 -267 -43 -38 -20 -165 -40 83 -80 -68 -112 131 43 -17 -120 -80 75 -25 91 31
4690C1MJ89k50l07L60J09j42R7O9j76j84J84R0j25J1K81j78k39P9l3K31jN6M9
$$ 31 35 224 -26 -333 27 136 -6 91 160 -16 -200 -16 74 -51 -40 241 63 -176 -97 -130 101 100 156 205
4714B05n5p8o7j37K05l06L40j50J12q6K93k35j55Q8l3k27K11O4N8o2JK4k68K98
$$ 205 150 72 5 -132 73 -233 107 -43 69 -17 276 41 -114 -26 -59 -286 -75 -11 47 -15 -14 10 -258 40
4738D0Qj03k07N58j06l77L78k58j87M21k75K16K03l99L11l09j04K50J97j74n7
$$ 40 48 -55 -262 296 190 -187 191 -67 -254 167 -108 108 311 -88 223 -86 -190 60 257 83 26
4759B6j01J6j21J88k7J47k1l7K43k35k70J93K07l7j05m86L52n2K03l7j04m3K02
$$ 26 -75 -59 -180 8 -19 128 107 70 313 78 -192 1 208 171 66 -420 -68 -120 83 46 -58 -101 101
4782A01m2o5K47j59k7j9q3k6j74K13j54J82O4R4K3j92P1J12r3n4k8n8j9K56r2
$$ 101 59 -6 241 82 55 36 -47 -73 -247 -34 -188 -6 58 152 175 -17 54 166 73 19 -9 -67 -86 170 78
4807G8r2l8j73L28k85K92j48K41k77l4L5p8J46o9J91J04j52k5k0K26j37j93M2
$$ 78 -14 -52 -225 103 -182 110 -38 203 -74 -108 -73 -151 -5 -74 117 221 69 44 24 250 113 -80 -38
4830c8j96M51j69o2l4M80l98j88J50rj46J70R2k23q8K40m4q4J28m1P9j54Q9J46
$$ -38 -234 217 48 -14 -48 432 34 -154 -4 -13 -159 11 103 -120 -208 32 -12 -96 32 -9 70 -84 5 151
4854A51k81J33q7J83j07J11o1k30K01m3nL7J08j33j4J40j31P8j14J02j58K05k07
$$ 151 -130 3 -84 99 -8 103 42 -188 13 -30 -35 2 110 -23 -37 103 -28 50 -64 38 -120 85 -122
4877a22K42k00k4K37j27l6j3K11j30j80J79N0j29oN7NJ57M7l27J45N6J77k86O5
$$ -122 120 -80 -104 133 6 -30 -43 168 38 -142 37 87 -42 -48 9 14 171 218 -109 36 92 269 -17 48
4901D8j73m5J52P6j7j22J40k7K5m3J61l54O6J27N2j49J46k43M91j28l46M55m35
$$ 48 -125 -170 -18 58 41 -81 59 32 57 14 175 -179 -113 14 66 -83 63 -180 311 183 -163 292 -143
4924a43R5J59k90J18k2J5K20Q8j91K1n0j19J21p8k7K70j39J41l03R8j84N6L85
$$ -143 -48 111 -179 -61 -83 -68 152 240 49 70 20 -99 22 -56 -83 187 48 189 -114 -16 -200 -144 241
4947B41j88mp7k1k06J25K47n6J70l26N8q4M9J04m4m5L0P4l27N72p3k27J46l22
$$ 241 53 49 -28 -49 -255 -130 117 61 231 -95 -37 -121 -72 32 -12 -57 -27 47 -280 292 219 -8 138 -184
4971a84K00L1N5MJ4j96J26R1k29J2oM57m42J0L69k89J58j70l70N10k28k6J49j30
$$ -184 16 47 102 106 120 -76 50 141 -88 -76 -82 375 -67 -57 312 23 181 11 -359 151 -77 -103 46 -84
4995h4n4J93O9j63J88r3j71r4M82l95Q5m8J24l6m9k8J27p4K8k58K27q4J60k35
$$ -84 -138 55 124 -39 149 56 -115 -209 273 -122 -37 -85 39 3 -46 -74 53 -21 7 -251 -24 -108 52 -183
5019a83J69j06r8M72m12M15l31K15k0r8J00J2k59L98k90P5j82J67p7j32j35K28
$$ -183 -14 -120 -218 254 -158 257 -74 141 121 23 123 135 -124 274 -16 59 -123 44 -33 -165 -300 -72
5041g2Lj36L60n37M83l55K05PK12j21J16r7j52J06O5l95M05q5j25K88k64l4K95
$$ -72 -69 -205 155 -382 101 -254 -49 -42 170 49 165 68 -84 22 87 -308 97 12 -113 175 -89 -123 172
5064A72p7k75K27pR5j03J62j54K5J9j91K84r0j43K10K6j13j09P3j57K03j11J28
$$ 172 95 -180 47 40 135 32 194 40 65 84 -107 177 87 -56 154 180 67 -42 31 -126 77 -34 94
5087I4j95L9r1J50J55L2l5L1L0k37n2O9j04K59l51L2rL18j13j79L82j72k77J30
$$ 94 -101 -62 -153 -3 152 184 149 180 210 -27 -79 -10 -114 145 -206 -174 -183 135 22 -157 225 53 -224 -94
5111i4rN3K54j75q6k9J72k27L18J92m02p1J14M0l06K86r3K0j71M36j94j88j46
$$ -94 -103 -50 204 29 -57 -86 86 -141 177 369 -33 -104 10 50 -256 30 -63 -43 -214 222 28 -160 -306
5134c06M37j47j7L6J4m6O0K14m00Q8K1NJ63J6q6m5J62j19l2Q8k01J83k9n3o9j61
$$ -306 131 -16 -33 3 17 -29 31 245 -155 -67 -46 -41 122 138 52 7 169 50 18 106 -95 88 59 6 -63 -224
5160b24j2L70K1k26J07k24P3N6R0r2J63R5k75K4j09K00k43J76j16L87k73j5j15
$$ -224 -236 134 155 -71 36 -188 -115 -59 31 -61 102 197 -78 -54 -163 37 -206 -30 -146 241 -32 -47 -162
5183a62J61n0K77k93j94J23K74l02J54q5N7J07j97K16j09k8K22J49l10r4J69j88
$$ -162 -1 -51 226 -67 -261 -138 136 -166 -12 -97 -40 67 -130 86 -23 -51 171 320 10 -84 85 -103
5205a03J70QRj19N3O2k55K47mp7j21J11j36P8J47K9m58L76kj33M8J91p5l27J98
$$ -103 67 75 84 -35 18 80 -175 72 68 -9 -130 -19 -155 -77 70 99 -359 17 15 -118 -70 121 46 -281 -83
5230h3j08L07j97n0R8L19k15K92k90j23J7m9p3j73K60J48K0j31J86l42J68j49
$$ -83 -191 116 -81 -131 -33 286 71 363 73 -50 -33 -82 -155 -328 -68 80 100 -31 155 -187 -19 -168
5252a68n4L76j27k16J88k8j53J08j4J46n7k5J60j72J93p8k63J96K73k09q8J62
$$ -168 -222 154 27 -189 -1 -29 -182 -74 -88 58 1 -24 136 -36 157 79 -184 12 285 76 -12 150
5274A50J19m83L20j37nJ76j04N2k20m2K49r7K01j47J3q4K55j11Q6r4j85J91n8
$$ 150 269 -214 106 -31 -36 140 36 88 -132 -174 75 -22 179 32 45 -39 216 105 191 97 -88 103 45
5297D5l28K36o0J7k4J73k04J93k8j81J21N7M9Ol25J24J47j9J19r1j45K2J85o7
$$ 45 -283 -47 -107 -90 -114 59 -145 48 20 -161 -40 17 66 72 -253 -129 18 -1 118 27 -118 -96 89 22
5321B2r7k9m5J91J56j34J53k41pNj0J76O8j78K4Jo7L3p8k5J83j33l0J92k75O5
$$ 22 -75 -104 -149 42 198 64 217 -24 -31 -26 -36 140 208 30 54 55 -12 21 -57 -82 101 -32 -62 130 -145 -80
5347h0J62M5k15R%l7J52K30k14k03P7L0J26j09K00R8n2O7k04j09r0J34L89m63
$$ -80 82 127 -88 -79 -79 -116 36 266 52 -151 -74 -44 82 -27 173 271 219 286 82 -27 -117 17 406 -57
5371e7KK3l2J61p7M4r3M5j9K05l93J38O5j53K97k50o1J33q3L01k28p2R7K45j67
$$ -57 -55 -32 -64 97 20 64 -29 16 -3 202 -191 -53 12 -141 156 -94 -155 -22 -105 196 -32 -104 -7 238 71
5396G1k83M29j23j95Q6k03K73pj5jL3j13o7J6K8o8J47j03rL42j93k81K82nJ23
$$ 71 -212 217 94 -101 -15 -218 55 48 33 32 65 -48 -115 -99 -71 -139 8 -95 -104 238 45 -236 46 41 164
5421A64J94k38O7j54O7R6l82lO4K10j83K23r3J5j16J68K61n35J28m5P3l01K3L02
$$ 164 358 120 187 33 100 196 -186 -189 -125 85 -98 125 32 47 -69 99 360 -175 -47 -92 -19 -320 -297 5
5445Ej7q6K33j26mj30j2J64p9r6j35M16J17l69K33nk33L2Q1mk8J95j29j00k5K59
$$ 5 -12 -98 135 9 5 -125 -137 27 -52 -148 -283 133 250 -119 114 109 -124 -92 -11 -15 -43 152 23 -77 -102 157
5471A57n1oK06k63p6P3k25J07K4k6j23L13k30M66l36j4J98pj30Q1k2p3N6Q5k59
$$ 157 106 100 306 43 -33 40 -185 -78 -54 -80 -203 110 -120 346 10 -4 194 187 57 138 116 43 99 184 -75
5496g5K63k14K25Ll34K78Lj19k7J06m3q2j19Q7m2J54j7J01k55J61N6k70J35K27
$$ -75 188 -26 199 202 -132 146 149 30 3 109 66 -16 -135 -48 -90 64 47 148 -107 54 110 -160 -25 202
5520B02l80M48k67J47l85R9J9K5K14k43K66k20j25L2J56j94J94P2l2k2M6j36J54
$$ 202 -178 270 3 150 -235 -136 -117 -92 122 -121 145 -75 -200 -168 -12 -206 -12 60 28 6 52 -84 70
5543G0O6Q8l64J05J25j0k57J74M6q1O9k23K40J44p4l19L95n0m6l1K60m67M5K87
$$ 70 136 224 -140 -35 90 80 -177 -3 43 -38 31 -192 48 192 118 -201 194 144 98 67 327 -140 -95 192
5567A92o6J2q9L2k19J95J5j74J64l51K58j47J34o7M27l77lJ08L4K0q7J53l10K01
$$ 192 126 138 49 81 -138 57 72 -102 62 -289 -31 -178 -44 -111 316 -61 -64 44 78 98 11 164 -146 55
5591E5QL1k3l26J60L59k40k26K62j46J58k62J69J4l3o9MJ87J98m11r6J49J84k82
$$ 55 63 94 71 -255 -95 264 24 -202 60 -86 72 -190 -21 -7 -40 -109 -105 82 280 -131 -227 -78 106 -176
5615a76M48o6P7l26L46j79j8n7K7k29q8K51J1j3L6mQ2j03k10K27r3J57j29m3M5
$$ -176 272 206 283 -43 303 124 106 49 76 -153 -241 10 21 8 44 40 122 19 -191 36 -57 100 -29 -72 -27
5640b7K19k45J21k1K2Nr4k40J86P1j14J04K27k11P8l56L12P6o5J69l44K03k47
$$ -27 192 -53 68 47 69 74 -20 -260 -74 -3 -117 -13 214 3 81 -275 37 113 48 217 -127 76 -171
5663a71J25J45q2j52J26q5k9J96L4o1j21P6j31K22j70P0j5K50j86k61L49k34M5
$$ -171 -46 99 17 -135 -9 -94 -123 73 107 46 -75 1 -130 92 -78 -8 -23 227 41 -220 129 -105 -60
5686f0K9J7pk9k0J08q9o4r5P0J53p2K11j16L08l97L06n30K46j5N9N8l36K94j6
$$ -60 -31 -14 -21 -50 -70 38 -51 -115 -210 -140 13 -59 152 36 344 -53 253 -277 -31 -46 13 71 -265 29 13
5711A3L00k79R7j67J3m9K2m7J61n3o2o8M9J42M9J35p8l51L93r1L0k6k15O7Q6K18
$$ 13 313 34 131 -36 -23 -72 -50 -97 64 11 -51 -119 -70 72 121 256 178 -173 220 129 159 133 -82 -15 71 289
5737B89k69J28j41K92l31n8Q9K33k21j54R8l9j43K3nP2J79k83M06l0nk94J81j11
$$ 289 20 148 7 299 -32 -90 -1 232 11 -143 -45 -84 -227 -204 -209 -137 42 -241 165 135 130 -164 17 -94
5761i4j64L75k10K9K83l17J97m69N03k30J3r2K44J40n03K85K80k65j54J93mlL8
$$ -94 -258 117 -93 -64 219 -98 99 -370 133 -97 -84 -176 68 208 -295 -10 270 5 -149 44 40 37 75
5784G5n4Q9qj62P5j26J78K5k44k0K16N6j23j64J31K69J27k36k66J11M0J58l21
$$ 75 21 110 102 -60 15 -111 67 92 -152 -172 44 100 -23 -187 -56 213 340 104 -162 -51 -11 147 -174
5807a74L02m7l9q5J91O1j86k4%k6k9J07n2J63o3Kj76J20p1k8O9j3n8N9K60j52
$$ -174 128 81 42 -43 148 209 23 -1 -1 -27 -56 51 -1 162 99 101 -75 45 -26 -54 15 2 -56 3 263 111
5833A11r4l3j35K26q2q7J96j0N9j65L20l41r7P7o0J68m5j00J53m2M5q4M1J64j08
$$ 111 17 -16 -151 75 -7 -94 102 92 151 -14 306 -35 -132 -55 -115 53 8 -92 61 19 64 -20 21 185 77
5858G7l8k5k05r1L86q5MQ7p6j11L19k04k19J48K36k28j87Q0P1o6J07m25L90M8
$$ 77 39 14 -191 -282 104 19 23 110 34 -77 242 38 -181 -33 203 -25 -212 -132 -61 -127 -20 -445 -55 -7
5882gj13p1Q4o6J19j20L26j38N6l5k2k48J65OJ47n2k24M40l6l05M6J60k11L10
$$ -7 -120 -191 -107 -173 -54 -174 152 14 70 35 13 -235 -70 -64 83 31 -193 247 211 -94 -48 112 -99 211
5906B11j37j60n0J66r9J87j97J61r7m3q0J31J27j40k28J2Q2j15L36j63o4L70l90
$$ 211 74 -86 -136 30 -69 118 -79 82 -15 -58 -138 -7 120 -20 -248 -236 -154 -269 67 -96 -160 210 -180
5929a80K5L44k91qm1J73J26j36k07M4j48K25j26K99K6p1J03l88M60l18NJ40P8
$$ -180 -155 189 -102 -110 -151 22 148 12 -195 -151 -299 -74 -200 99 125 54 157 -231 229 -89 -84 56 134
5952A34j23ORK2K5k24j54L98j20j42l8Q1j46K50K97q8k24j35j12J82p7K01J0m0
$$ 134 11 17 26 48 73 -151 -305 93 -27 -169 -207 -126 -272 -22 275 187 -37 -172 -284 -102 -179 22 32 -8
5976hK96m18J27O5J15r4P8k69N0R0r8J63o3K1k48O8P8O2j59K18j31J54j86j6K64
$$ -8 288 -130 -3 62 177 83 161 -108 -58 32 -66 97 34 55 -193 -125 -47 15 -144 74 -57 97 -89 -105 159
6001A59j32p8K20j22j07k40P8J69q7K05K55m38k2Q2O2j08P3k6m1j7K0K91j57j86
$$ 159 27 -51 169 47 -60 -300 -222 -53 -140 65 320 -118 -140 -58 4 -104 -31 -57 -98 -115 -95 196 39 -147
6025a47J25N9r2J9o3JJ67k2j60J11M6j11J49J93k97J23k00%M34l79J63k84l1L84
$$ -147 -22 37 -55 -36 -99 -98 69 47 -113 -2 44 -67 82 275 -22 101 -99 -99 335 -44 119 -165 -196 188
6049A88k20l29K68J91l0j48qP5Qr3L4K68J08k17jk91K12N3k7J80j69j01K36k04
$$ 188 -32 -361 -93 98 68 -80 -88 -13 -5 -98 -64 204 312 95 94 -197 15 68 41 221 52 -49 187 -17
6073a7P5l30K51J76k56R1K71m23K09n1j98K78k32J23j07J46j39K57j23P3j51j24
$$ -17 58 -272 -21 155 -101 -10 261 -162 47 -4 -202 76 -156 -33 -140 6 -133 124 1 74 -77 -201
6095b01M32k62j33J43j83J74K8k36L26m49L76j05J64j60P9J97j34j02O4r1j09
$$ -201 231 -31 -164 -21 -204 -30 -2 -238 88 -361 15 -90 74 -86 -7 190 56 -46 18 -73 -182
6116a82N33n7m42O3k6P3L9J31k03q1J1K89j77j08L15j50Jm7J1Q9m8l7j02j42M47
$$ -182 351 294 -148 -85 -111 -38 1 132 -71 -152 -141 148 -29 -137 178 28 29 -18 -7 82 34 -3 -105 -247 200
6141B00j64J74l45M2J29p5K11o0k47J00q0p2J63L64l91n1K75l34J80j42M5J19
$$ 200 36 210 -135 -93 36 -39 172 112 -135 -35 -115 -187 -24 340 -51 -102 173 -161 19 -123 -78 41
6163D1J12k09j55P8K06j83L7j53J35J32J01k20K8l32K89L06m26K57o1J40nk46
$$ 41 153 -56 -211 -133 73 -110 -73 -226 -91 41 142 -78 -50 -382 -93 213 -213 44 -17 123 118 -128
6185a28J92n9O0O0j64R5m60K66J67R0j83N23l72J2J68j9M9m98N8N2J41o8L4p5
$$ -128 64 5 65 125 -39 56 -404 -138 29 119 -64 459 87 99 267 248 297 -201 -143 -91 50 -18 16 -59
6209e9J56j70J95j52l3J32p3k3O1j4m8k51K87oJ05j98K62l40J74Q8k16J06r3r
$$ -59 97 -73 122 -30 -63 69 -4 -27 34 20 -28 -279 8 2 107 -91 171 -169 5 93 -123 -17 -110 -119
6233a19l6l6M16k61O1J18k67J1J11P4R8l20K98j79m6J20n5N2J6j65Q2J6J50l37
$$ -119 -155 -191 225 -36 25 143 -124 -113 -2 72 170 -150 148 -31 -77 43 -12 40 56 -109 -27 -11 139 -198
6257a98K13k67J15K86m29K84J24j43k9j24K84j88j2O0J80k14K08j96L04j82k12
$$ -198 15 -252 -137 149 -280 4 128 -15 -44 -168 116 -72 -84 -24 156 -58 150 -46 258 76 -136
6278a36K21L17o15L51k31K27j84j38J77J43N3k35J01J38j92M2N0l0M2k45L38k06
$$ -136 85 402 -213 138 -93 134 -50 -188 -11 132 185 -50 51 189 -3 39 89 59 101 -144 194 -12
6300a2K24l42j94Q1J59l5K17l5j07n6P3j6j87P0j9J19L51n67M33J0j5k67J07O
$$ -12 212 -130 -324 -243 -84 -119 98 63 -44 -100 -27 -43 -230 -160 -179 -60 291 -276 157 167 152 -115 -8 -2
6324bN2j18K33k22q7K37l15L32k27j5LL45j31q7K24n9k92M4J34Q7k17o2l3R4J65
$$ -2 50 -68 165 -57 -144 93 -222 110 -117 -132 -129 216 85 -2 222 163 -129 -85 49 136 -81 -143 -176 -82 83
6349H3k72J70k0K76n31M00j56L85k78J22o9l3n9k35K89q9P6k16K09N0kn0j81K64
$$ 83 -189 -19 -39 237 -294 106 -50 335 57 179 110 77 18 -217 72 -17 59 -157 52 102 100 50 -131 133
6373A33m6jk5L3l13n9J61N4k56J65R0J46k01L5p1J14K61j61k19J71K0J47l45N8
$$ 133 87 86 61 94 -219 -278 -117 -63 -319 -154 -64 82 -119 -84 -155 -41 220 59 -160 11 31 178 -167 -109
6397a09L03j20K55n47J20Q8j48j19O50l81r3K58l57J01O3j6ko3m8J84l19M13k60
$$ -109 194 74 329 -218 -98 -10 -158 -277 373 -8 -101 157 -200 -99 -36 -52 -54 -117 -165 19 -300 113 -147
6420a47R0J85o8M2j63Q8l12J46L74m13jJ28l07M90m9n5m71J26L86j42L75m34M1
$$ -147 -57 128 60 102 -61 27 -285 -139 235 -178 -179 -51 -358 132 83 28 -443 -317 69 -73 302 -132 -91
6443i1j30K37j39N2k45K05j8K50o6J28l70K44o9r1J80o7J30m35M10j46J0K36K1
$$ -91 -221 16 -123 -71 -316 -111 -129 121 55 183 -187 57 -12 -103 77 10 140 -295 115 -31 -21 215 236
6466B36j83k75K32P9j19M6p8R4J10k39p2K81k88J06R8l2n8K38l6j07o0J70m85
$$ 236 53 -222 10 89 -30 16 -62 32 142 -97 -169 112 -176 -70 28 -4 -62 176 140 33 -27 143 -342
6489c42N02l9k00K77q9r1j85J49l00L15j30M5j8L0K09m8l22L4L73j69Q1kr3q1
$$ -342 160 121 -79 198 109 18 -167 -18 -318 -3 -133 -88 -106 -76 133 85 -237 -203 170 1 82 80 -13 -94
6513i4M5j72J45L2q7J53J74j99j5J6J75l35K21N4m9J15q8k42k7K1O2J34J19k14
$$ -94 -49 -221 -76 -44 -131 22 196 -3 -18 -2 173 -162 59 113 64 179 91 -151 -178 -157 -95 39 158 -56
6537e6J20j46J88K4Q1k57l8k45M80q8l09N11l58J46j13K2j35j22Q3J84J61k27
$$ -56 64 -82 106 130 211 -46 -84 -329 151 63 -246 265 -93 53 -60 -38 -173 -295 -212 -28 133 -94
6559i4J49Rk43J40j36J35k3J42j96L74r9J12l52M2J63k47J98j58J50j45L5L9N1
$$ -94 55 64 -179 -39 -175 -40 -63 79 -117 257 158 270 -82 -40 123 -124 74 -84 66 -79 -44 -5 46
6582D6j32k4Nk47J90J04k6qK36l4Lj49J01j38Kk7J23J90l55K25l4p0m5P8o9k27
$$ 46 -86 -110 -105 -352 -162 -58 -84 -92 144 110 113 -36 65 -73 -71 -98 25 215 -140 85 51 -19 -64 14 -55 -282
6608b82K62q2K98q6j70Q6j11O0J77mj81L9j58N1Q0J17r2L7k07J19J5L5Q9j63R4
$$ -282 -20 -102 196 110 -60 26 -85 -25 152 148 -33 6 -152 -101 -21 96 4 41 -166 -47 -32 3 92 -71 23
6633B3j04L55k63M5r3j62j2K08k99K99R1j50J01j96N03k85R9j61K25o1j63Q9J54
$$ 23 -81 274 11 56 -37 -199 -211 -3 -302 -3 88 -62 39 -157 346 61 160 -1 224 163 0 89 243
6656B43k80J64q8j80K00J07j18o2J86k55K03Mj9j87J06q9Q6J03k76K71k26K3j5
$$ 243 -37 127 39 -141 59 166 48 -14 172 -83 120 124 105 -82 24 -65 21 124 -152 119 -107 -84 -99
6679i9J18J11J38r0o2J63j69k12P2L3o6K13k41J43m1J10O8j78K5l50K19K14k60
$$ -99 19 130 268 178 116 279 110 -102 -30 3 -63 150 -91 52 11 121 189 11 36 -314 -95 119 -141
6702a41q4l0J99mk18K41j4M3n8j27K78j55K7K5n6J72l89J67k8J45J2R1J99j04
$$ -141 -225 -255 -56 -60 -278 -37 -51 -8 -66 -193 85 -70 -43 -18 -74 98 -291 -124 -152 -7 5 96 295 191
6726A91k9j54J81J83n98L61k37r1O0PJ97j0Q2Q0k95j53N30l01q6q1J06k31J80
$$ 191 162 8 189 372 -226 135 -102 -193 -133 -126 71 61 143 223 -72 -225 305 4 -82 -163 -57 -288 -108
6749a08L81n87P0L33j78l9qJ59j31L0M8k57K69K69l57L48r6O5k75j90J85j10J03
$$ -108 273 -314 -244 89 -89 -128 -136 23 -108 -78 -30 -287 -18 251 -106 242 146 211 -64 -254 -69 -179 -76
6772g6J83mj74j77L62N5r8j18o3J23l6J29k68J41K00k95j26K15P1J42j3l80K57
$$ -76 107 103 -71 -248 114 169 71 -47 -110 13 -23 106 -162 -21 179 -116 -242 -27 44 186 173 -207 50
6795E0j33PJ34l23L74l18J37O2l11L0K75L4O7j1j32j2j10K95n4j22R4J30j24J07
$$ 50 -83 -76 58 -265 109 -209 -72 -10 -321 -291 -16 18 85 74 -58 -70 -180 115 61 -61 33 163 39 146
6819A46n7J8k75P0K14J59l30o2J01k6J29k12J94q4J01j69p6N08k35j81q5R9j23
$$ 146 89 107 -168 -98 116 275 -55 -117 -16 -42 87 -125 69 -15 86 -83 -159 349 114 -67 -152 -53 -176
6842a76K03j81L04J81n66M06r4k94L28q8J25r4j28J10j89P4M4K26l51R5Q6j13
$$ -176 27 -154 150 331 -235 171 77 -217 111 23 148 54 -74 36 -153 -79 -35 191 -160 -65 21 -92
6864i2K36l64J05K30J4j93J73P2J6l02J17j53K9J00J67j14k66N4K34m5J84j8k20
$$ -92 144 -220 -115 115 129 -64 109 181 197 -105 12 -141 -112 -12 155 41 -225 -171 63 18 202 184 -36
6887c6M8k58O7J60R2R2j68k11K78K64k63n1k28jJ08j24L80j03j74J59K43k60j39
$$ -36 12 -246 -179 -19 73 165 -3 -214 64 328 65 14 -214 -215 -107 -231 149 46 -128 31 274 14 -125
6910a25P1l3m3L87n94O13k72P4k03J75k48K74j51J24J48m8J30k92J09K1m9J3q7
$$ -125 -54 -87 -130 257 -337 276 4 78 -125 50 -198 76 -75 49 197 149 279 -13 96 117 68 81 -6
6933fq3J60j67j8K40r2K14k98O6r2j07L26J70n24K03j6l4J58j46J91j4j84J57
$$ -6 -89 71 -96 -114 126 34 248 -50 16 -76 -183 143 313 -211 -8 -24 -58 100 -46 145 131 -53 104
6956A04k32k96N08k33J00k00L44l5q4J60k45R1J68l42L10k85R4K39M2j14r9Q8
$$ 104 -128 -424 84 -149 -49 -249 95 60 -24 136 -109 -18 150 -192 118 -167 -73 166 208 94 -5 83
6978H3j66J91j99J80PL6j97K56k79K97k57L12l60J73j40J36J31j40j41J05j63
$$ 83 -83 108 -91 89 96 132 -65 191 -88 209 -48 264 -96 77 -63 73 204 64 -77 28 -135
6999a35M34j18j10j25Nm4n5O9L54m36J6M6K22k1K02l76L4K75m10K32Q7k36j27
$$ -135 299 181 71 -54 -49 -93 -148 -79 275 -161 -145 -99 123 102 304 -72 -38 237 -173 59 146 -90 -217
7022b17M54j04l34K19M5j21O2L56k24l37M5L26j44k87K07j43K59k84J38K28P6
$$ -217 237 133 -201 18 63 -58 4 360 136 -201 -156 170 26 -261 -54 -197 62 -222 -84 144 220
7043B20m09J67k53M5l5L75j76P5R5j73l3m0K74j50k9K48k94K6J03o3J78n05L96
$$ 220 -189 -22 -275 -230 -265 110 -66 9 104 -69 -102 -142 132 -18 -47 201 -93 -67 36 -27 151 -354 42
7066D2J42k67L30p9j02k72O9J24j12O4j7Q4j5j73j44J71K94J39l93J11P3j25o3
$$ 42 184 -83 247 168 66 -206 -137 -13 -125 -61 -78 6 -9 -182 -326 -155 139 278 -115 -4 69 -56 -119
7089a19L8J68k32J27r2j34K59r2j79R3L52j48j97J38m7J53p1l61K97J43l10J46
$$ -119 -81 87 -145 -18 -110 -244 15 -77 -256 -163 189 41 -156 -18 -65 88 17 -344 -47 96 -214 -68
7111f8Q7q6O6J54j02M1j71j20J47n1L64n12p4k1J94m7L02k72N3K09qj06j23L02
$$ -68 19 -67 -1 153 51 92 -79 -199 -52 -103 261 -251 -325 -346 -152 -199 103 -169 -116 93 85 -21 -144 158
7135A58j62k01K36K54k53J39J6l26K20JJ78l35J19K13l24K11k60qN5k02Q3J45
$$ 158 -4 -205 31 285 32 171 187 -139 81 82 260 -75 44 257 -67 144 -116 -124 -69 -271 -188 -43
7157d3k9M8J19J09n22J51k02K40qK43L4k01J71j89K96m2l13K54l0j68m6j59M68
$$ -43 -72 -24 95 204 -318 -167 -369 -129 -137 106 140 -61 110 -79 217 175 -138 116 86 -82 -128 -287 181
7180A81j70r8k8L47m55K36m2j28J47J39j57m7J32l18M87j70p4N5P5p1k46M05m86
$$ 181 11 -87 -115 232 -223 13 -29 -157 -10 129 -28 -75 57 -261 226 56 -18 37 112 41 -205 200 -286
7203b86J21k79N70o0M5k23J45j05J29j54r8K32k11K18j36k3n3K27J40Jr3j54j60
$$ -286 -165 -444 126 66 111 -112 33 -72 57 -97 -195 37 -174 44 -92 -115 -168 59 199 200 107 -47 -207
7226b07M12k38K51l09O5j43K94l20O6K2k80M67k4m1pJM1l7j0K1j04K57l66J5K25
$$ -207 205 -33 218 -91 -26 -169 125 -195 -129 -107 -387 80 56 15 8 9 50 13 3 24 -80 177 -189 -174 51
7251E1j56q1K72j86K37m5j27r6J69O4N3j78N5j18k7L6Q0o0L2J37J44n46J46K48
$$ 51 -105 -186 86 -100 137 92 -35 -131 38 102 155 -23 32 -86 -113 -77 3 -57 -25 112 256 -290 -144 104
7275A04j14J78p2Q5l02J85l23J47J46K07l36J70j29J63k63J17J72j16p6J13L9
$$ 104 -10 168 96 181 -121 64 -259 -112 34 241 -95 75 -54 109 -154 -37 135 19 -57 56 95
7296I5j31R3j1k10K6M77m30qO1j5J88o0Q7M8m40J27j19N26m46L74j48j8J62j62
$$ 95 -36 57 46 -164 -138 339 -91 -99 -38 -53 135 75 162 210 -230 -103 -222 304 -142 232 84 66 228 66
7320F6j56L9J56k5J55l67J60kN6j4j88L17k85P5m0m5K36j82J4j61K56O3J74m61
$$ 66 -90 -51 105 80 235 -132 28 26 82 68 -120 197 -88 -13 -53 -98 138 -44 -30 -191 65 128 302 -159
7344a59Q4J85j15N5J96k77j69P9J94n8J04k41K43j4j4k73J8J86q5J99n5j38J28
$$ -159 -75 110 -5 50 246 -31 -200 -121 73 15 119 -122 121 107 93 -180 -162 24 -61 138 83 -55 73
7367G3n1L5m4pqj38N5kK45l26J22J0j45J12J94k85M10p9j44j69j4J18N9N6q6l7
$$ 73 22 57 13 6 -2 -140 -85 -87 158 -168 -46 -36 -181 -69 125 -160 250 171 27 -142 -156 -38 21 77 -9 -46
7393d6j32J26L2J07r2J6o4N8M9j15J19j86J40j7m1j8Q8J38l15J81J6J60J47m91
$$ -46 -178 -52 -20 87 -5 11 -53 5 54 -61 58 -128 12 -5 -46 -64 24 162 -153 28 44 204 351 -140
7417a40L18l22R8Q4k31M06k63J2j8o4K8K65J07l09j71J95J17l13L68k93K42k63
$$ -140 178 -144 -46 38 -193 213 -50 -38 -56 -120 -92 173 280 -29 -200 -5 112 -201 167 -126 116 -147
7439a47L95j52j56R6R8j46j22J36l52K57K18NN8k23J02j34Q2r0J91n1l25L29q5
$$ -147 248 96 -60 36 134 -12 -134 2 -350 -93 125 130 188 -35 67 -67 15 -75 116 65 -260 69 -16
7462a6J28k91L91j46N4M0kj49J02j84K01L4k08n7k4J67J71q6k41J00j20M3L8O2
$$ -16 112 -179 212 66 120 160 158 9 111 -73 128 162 -46 -103 -127 40 211 125 -116 -16 -136 -93 -55 7
7486GK58n4m16M56l4k1l76J05P5j47J37k8K68l50J6Q9J21j26n4o3J72L5m20M83
$$ 7 265 211 -205 251 217 196 -180 -75 0 -147 -10 -38 230 -120 -104 -15 106 -20 -74 -137 35 70 -350 133
7510A33j58l3K14N6l83J6J92R5n4K62l34J0M6k20K04k11J49K53l77j10M70l85
$$ 133 -25 -58 156 212 -171 -155 37 132 78 340 6 16 62 -158 46 -165 -16 237 -140 -250 220 -165
7532a65J1L27m5k71o2P5K53k32q1K03j45J6J11q3J11j87J26J69j19J29m24M10
$$ -165 -154 173 128 -143 -205 -130 123 -109 -190 13 -132 -116 -5 -88 23 -164 -38 131 12 141 -283 127
7554A27k71L73l68j1J97K7l25M8R2L15j08j79L33l01J48O9j45j57L76o2p7q5q0
$$ 127 -144 229 -139 -150 47 74 -251 -203 -111 204 96 -83 250 -51 97 166 21 -136 240 178 101 16 -64
7577f4k08L56k42n4K70K0J44p7k11K54l24K80k17n7K38k30K04j78K03j28J02l21
$$ -64 -272 84 -158 -212 58 78 222 145 -66 188 -136 144 -73 -130 108 -122 82 -96 107 -21 81 -240
7599b40K59j10j8K0K00J76m59n7K02r3L40l04l3k8M74l82o5L19l53N00k95m9j34
$$ -240 19 -91 -109 -89 111 287 -172 -229 -27 -120 220 -84 -117 -145 329 -53 -118 201 -152 348 53 4 -130
7622a30K25k1j38J33k69J89N4L5K06m23o1K94NJ57l22K52j80J48j89o4n7M3o7
$$ -130 95 74 -64 69 -200 -11 43 78 284 -139 -200 94 99 256 -66 186 6 154 -35 -99 -156 -113 -180
7645a80L71j58J24J22l74K43K5l38K64k05J2k23L83M6j21J35j18J3j68L75q3j24
$$ -180 191 33 157 279 -95 148 173 -165 99 -106 -94 -317 66 112 -9 126 8 21 -147 228 145 21
7667B1o4n1R9m4j2j28L92k09j20J15k64N99j41l00L60k14J66j9o5k51K26j28O5
$$ 21 -43 -94 5 -39 -51 -179 213 4 -116 -1 -265 334 193 -107 253 39 205 186 121 -130 96 -32 33
7690C3K21m09P2L00r1J10j93J32o5n25M79k69K51M6N9m8q7nl3J43k26L03M3m11
$$ 33 254 -155 -83 217 126 236 43 175 110 -415 64 -205 46 92 151 103 16 11 -22 121 -105 198 241 -170
7714a70K46k68J22m4K41p8J82m20L35pj43N1j1P0k21N6r5J68pj9J85j78N9KP1
$$ -170 76 -192 -70 -114 127 49 231 -189 146 139 -4 47 36 106 -115 -59 -154 14 7 -12 173 -5 54 56 127
7739A27r5J1k11M69m26M6O0R1k7l18K84k12R4N8K22k67J26m5m2Pj7k6J12K5k50
$$ 127 32 43 -168 301 -125 -79 -19 72 45 -273 11 -201 -107 -49 173 -94 32 -13 -55 -48 -65 -91 21 46 -204
7764b04L25L8Q9l03n8Q0l7M8Q9l20M71m76K31R1K9J03n0j22J9J64k45Q0K0n6J83
$$ -204 121 159 248 -55 -113 -33 -70 -22 67 -253 218 -258 -27 64 93 196 146 24 43 207 -38 42 62 6 189
7789A89k12j9j2J31N6j78K82l08L06j64n9j47L04k59K83j70J37m68L69p6O5p9
$$ 189 -23 -42 -54 77 133 -45 237 -71 235 71 12 -135 169 -90 193 23 160 -308 61 -15 50 -29
7811b9q3K06n15M77j56J81p4j49o9L73l84Q6m0M15l19K79k19M1l9M0m0%N0P7L7
$$ -29 -112 94 -421 56 -100 81 7 -142 -211 162 -222 -136 -176 239 -80 199 -20 21 -18 22 -18 -18 32 109 146
7836A46l76k3K22K05m02pN6N32j72J83j42m22K29R6j75N0pj53M52j58j80J52J14
$$ 146 -230 -253 -31 174 -228 -235 -179 353 181 364 222 -200 29 125 -50 0 -7 -160 292 134 -46 106 220
7859B20r2J0K0k10k23J14K8l0j61M61j31M0k04J26l83J16o7K85q6P2J00q5j66
$$ 220 128 138 158 -52 -275 -161 -133 -163 -324 137 6 46 -158 -32 -415 -299 -366 -81 -167 -95 5 -80 -246
7882b46O12l03K54l16p7K29K80p06P29k64l41J62k36j10K50J58j37K59P3j00l88
$$ -246 366 63 317 1 -76 153 433 -273 456 192 -149 13 -223 -333 -83 75 -62 197 270 170 -218
7903b18M2K14r9O8J19j03O2p4l6j38J95J84l57L29l24N6K82j42M0m6J6O5j88K06
$$ -218 -176 38 -61 7 126 23 85 11 -25 -163 32 216 -141 188 -136 -80 202 60 100 54 70 135 -53 153
7927A53k40J30M1j16Rj22L61l55R5j08N07n17Q1j5p5J17K1n9L29k70J84Kr8J11
$$ 153 -87 43 84 -32 -23 -145 216 -139 -44 -152 355 -162 -81 -96 -171 -54 -33 -92 237 -33 151 153 55 166
7951A66k61L31J7m18K96l23L27p9J09j33P6j31J03rj88J71OQ7k43J22p1j80L37
$$ 166 -95 236 253 -165 131 -192 135 56 165 32 108 -23 80 71 -117 54 60 147 -96 26 -45 -225 112
7974A12m50N27k39J0J09j86J89j42M6K38j18k43L61o4k0j1p8j99J33m1P0J18j21
$$ 112 -338 189 -50 -40 69 -117 72 -70 -24 214 96 -147 214 150 130 119 41 -158 -25 -66 4 122 1
7997Aj57L49j38k63K89r6n4j1K52l2k62K31l6p1J28j93J31k9P4k85L19k0k80L33
$$ 1 -156 193 55 -208 81 -15 -69 -80 172 140 -122 109 73 2 130 -63 68 39 113 -172 147 127 -153 180
8021A80l9l10L06n1J65q3k89J17k3m2j4O5M3j30J11j95K72n6k50K21j1q0J06J7
$$ 180 141 -169 137 86 251 168 -121 -4 -27 -69 -83 -18 25 -105 6 -189 83 27 -223 -2 -13 -93 13 30
8045C0r3K82q1j31j97N35m39L14k77K85m63L14j8l12K54J24k34K44Nl20K24k27
$$ 30 -63 219 138 7 -190 345 -94 220 -57 228 -235 79 61 -251 3 127 -107 137 142 -178 46 -181
8067a81J11J19jJ0p6Q3k15J22k17K29J41l51J73M7KJ79j20J40j52j33K07j9qm34
$$ -181 -70 49 48 58 -18 65 -150 -28 -245 -16 125 -226 -53 -6 -4 175 55 195 43 -90 117 98 90 -344
8091c44L50Q6n6J76k91L24k95j57J66k59J4J97J73qj73L0N5N3J40l21K13J45k54
$$ -344 6 92 36 212 -79 245 -50 -207 -41 -300 -286 -89 84 76 -97 -67 -12 41 181 -140 73 218 -36
8114c6K40n03K44J9k09L14j80K06N5k52P4P7qJ01k33m9J38J75j40K03m49K1K08
$$ -36 204 -299 -55 -36 -245 69 -111 95 150 -102 -28 49 41 142 -91 -140 -2 173 33 236 -213 -192 16
8137A6o2J69r4n0k2j13J06KJ08j60J64j98K67j2pJ17m26J71k97K86J40L9J5l96
$$ 16 -46 123 29 -21 -43 -156 -50 -48 60 -100 64 -134 133 121 114 231 -195 -24 -321 -35 105 144 159 -237
8161b37l7M46P4l04R9P9k13l65K5M07o4J82k9k43K08O0j06Q4j28l24M34P0K8j88
$$ -237 -274 172 246 -58 41 120 -93 -458 -433 -26 -90 92 63 -180 28 88 -18 66 -62 -386 48 118 146 -42
8185d2P3q6J09q2j38j34
$$ -42 31 -55 54 -28 -166 -300
8191c00
$$ Imaginary data points
##PAGE= N=2
##DATA TABLE= (X++(I..I)), XYDATA
0@%%%%%%%%%%%qJ6j6J6j6K4l2M0m8N6o4P2q8J04j25J49j70J94k24K57k95L36l80
$$ 0 0 0 0 0 0 0 0 0 0 0 0 -8 8 -8 8 -8 16 -16 24 -24 32 -32 40 -48 56 -69 80 -90 104 -120 137 -158 178 -202
34b02M31m87N45o12O88p67Q55r51J056j169J293j431J579j742J921k117K334k570
$$ -202 229 -258 287 -325 363 -404 451 -500 556 -613 680 -751 828 -914 1007 -1110 1224 -1346
52a346K831l124L450l814M226m701N249n889O653p578Q730j0210J2190j4996J9316
$$ -1346 1485 -1639 1811 -2003 2223 -2478 2771 -3118 3535 -4043 4687 -5523 6667 -8329 10987
67A0987k6900M4153j59916k9495J56058o7799Q2621Q6861j6648m0001K9059n8181
$$ 10987 -15913 28240 -131676 -161171 -5113 -72912 9709 96570 79922 39921 68980 10799
79A0799l4557M3356M066p0377K0369M7555j1680k2034K788l0370O031N2130O000
$$ 10799 -23758 19598 23664 -46713 -26344 21211 9531 -12503 -9715 -40085 -34054 18076 24076
92B4076l9580J2123K4189j7304k1090J3539J9609J5313p648k8265r340K1502O981
$$ 24076 -15504 -3381 20808 3504 -17586 -4047 15562 30875 23227 -5038 -14378 7124 14105
105A4105j7628j5501L94R822K914j3951Q95K7512J0506j8435j194J4556J942J694
$$ 14105 -3523 -19024 -18630 -8808 -5894 -19845 -18950 8562 19068 633 -561 13995 15937 17631
119A7631j16k1133r956K1476P33l0969n080K2634M434q452L718P514P503N207
$$ 17631 17515 -3618 -13574 7902 8635 -22334 -27414 -4780 -346 -8798 -5080 2434 9937 15144
133A5144j2330j3872J4575J9948j0469k0683j182P150J541j16k428m795N051O821
$$ 15144 2814 -11058 3517 23465 12996 -7687 -8869 -1719 -178 -294 -2722 -7517 -2466 4355
147D355r469j1624J3212J9818p862j8909K000J4355O337k92m669r151J502O584
$$ 4355 -5114 -16738 -3526 16292 8430 -10479 -8479 5876 12213 11921 7252 -1899 -397 6187
161F187j0765j1947J2302J2261j3634j1702Q138R840O651N658q286r774J0692
$$ 6187 -4578 -16525 -4223 8038 -5596 -17298 -9160 680 7331 12989 4703 -5071 5621
174E621R056j2677o506R975o72j2381l285J088L392J1171J943j4525j704J5459
$$ 5621 14677 2000 -4506 5469 4797 -7584 -10869 -9781 -6389 4782 6725 -7800 -9504 5955
188E955L339q511o14L986p78o84l007m128N859O725p212j1510L715Q852M89m911
$$ 5955 9294 783 169 4155 3377 2693 -314 -4442 1417 8142 930 -10580 -6865 1987 2476 -2435
204b435l692J734O053K484m479l48O797K198n501m909J559M369N16p271p011L421
$$ -2435 -6127 -4393 1660 4144 -335 -683 6114 8312 2811 -2098 -539 3830 4346 -2925 -9936 -6515
220f515O398K29l461j52L013L921N56l232N76N729j5q870m208N049L871j732m170
$$ -6515 -117 112 -3349 -3501 -488 3433 3989 757 1333 7062 7047 -1823 -6031 -982 2889 1157 -3013
237c013l816J964O122Q92m445J725N136j499n313L3M469K704j038m676m462L118
$$ -3013 -6829 -4865 1257 2149 -2296 -571 4565 3066 -2247 -2214 2255 4959 3921 -755 -5217 -2099
253b099O202k124n108M22K612j422k118J282K554K599K8m178j730N217M651k725
$$ -2099 4103 1979 -3129 -2707 -95 -1517 -3635 -2353 201 2800 2828 -1350 -3080 2137 6788 4063
269D063m603j078J630j96j641j290P06K398q72k940Q19N620L137k789l737R4K498
$$ 4063 -540 -1618 12 -184 -1825 -3115 -2409 -11 -883 -3823 -3004 2616 5753 2964 -773 -679 1819
286A819J393j704l070M4J351q05k167J74L511J711k215k852J140L690J615k627
$$ 1819 3212 1508 -1562 -1518 -167 -972 -3139 -2965 546 2257 42 -2810 -1670 2020 3635 1008
302A008k091M58J734M95j408o80J285L29j981k053J049K979K6k382j663J072L002
$$ 1008 -1083 -625 1109 1604 196 -484 801 1130 -851 -2904 -1855 1124 1150 -1232 -2895 -1823 1179
319A179J534j626j260J212J065j260j762O06J753o82l062j627J716K855O59j972
$$ 1179 2713 1087 -173 1039 2104 844 -918 -312 1441 759 -2303 -3930 -2214 641 1300 -672
335f72r30J894J947m94j146N28M26p44j724r44J313J537m39k102j223J851K131
$$ -672 -1602 292 2239 1745 599 1127 1553 809 -915 -1859 -546 991 552 -1550 -2773 -922 1209
352A209k30j256j16P83P6r58O4Q01J417q31k071m7J434J436j058j833p14O22J183
$$ 1209 979 -277 -393 390 466 -492 -428 373 1790 959 -1112 -1159 275 1711 653 -1180 -1894 -1272 -89
371h9j88n03Q64J121p85j016N88J654N55j372j960j63J400M51q68q26P4M29J85
$$ -89 -277 -780 84 1205 420 -596 -8 1646 2201 829 -1131 -1294 106 557 -311 -1137 -1063 -634 -449
390d49K40K1Q64J052j149j604O55J473J4o20j149k92N64O42m03n24Q18J48p18
$$ -449 -209 -188 676 1728 579 -1025 -370 1103 1117 497 -652 -944 -380 262 -141 -665 153 301 -417
409d17o24Q01J249P3q17r14J02J585L73p10p84K8j94k09l26L11P10m50o42j20
$$ -417 -1041 -240 1009 1082 265 -649 -547 1038 1411 701 -83 -55 -249 -458 -784 -473 237 -213 -855 -975
429i75Q23R66K05n22o99M54K88L00j048L25r8p05l16L6N58L67N67q55l29R96O88
$$ -975 -152 814 1019 497 -202 252 540 840 -208 117 19 -686 -1002 -966 -408 -41 526 -329 -658 338 1026
450A026N5o30k80J11k00J2k19K06J43k37j105J94R87K86n7o64M2j2P09Pj54M41
$$ 1026 1081 451 171 282 82 94 -125 81 224 -13 -1118 -924 63 349 292 -372 -330 -342 367 374 220 661
472F61k87j28l27L52m4J82p0j249K2N62L57j24P5m00M03M93q3k10P95j1j115m51
$$ 661 374 246 -81 271 227 409 339 -910 -888 -326 31 -93 -18 -418 -15 478 395 185 980 969 -146 -597
494e97O00J83j72J85r52l38P06Q11o03J00O98m96l42L37K97m3J36m49p59M50M10
$$ -597 3 186 14 199 -753 -1091 -385 426 -177 -77 621 125 -217 120 417 374 510 61 -698 -248 162
515A62lj34qn87rO43j24j0P75n46m99J21M55M57j80j8j113J73N67k12K12l31J26
$$ 162 159 25 17 -570 -579 64 -60 -70 705 159 -340 -219 236 693 513 495 -618 -445 122 -90 122 -209 -83
538h3n60K95J65Q9M71M22j336M60M84J38j39on03n47K16K83k10K33O46r12kM60
$$ -83 -643 -348 -183 -94 377 799 -537 -77 407 545 406 400 -103 -650 -434 -151 -361 -128 518 -394 -396 64
560F4K58j09L91r7j015M69M88j12p7j48k66m48J82M22K1J61k97j50r7M75K93j42
$$ 64 322 213 604 507 -508 -39 449 337 260 112 -154 -602 -420 2 23 184 -113 -263 -360 115 408 266
582B66j34L14l88q8L27R9l67j70m12l23M38J88M83n17p3L49k15L69N23r5m51k97
$$ 266 132 446 58 -30 297 396 29 -141 -553 -876 -438 -250 233 -284 -357 -8 -223 146 669 574 123 -174
604a74L49k49RK30k29k90k56L27J84J6K71k76M5k02O10k92K30j76k75j42L06J01
$$ -174 175 -74 -65 165 -64 -354 -610 -283 -99 -83 188 -88 -43 -245 365 73 303 127 -148 -290 16 117
626A17J96J13l89k20m21N93j85J80J51J2J16n41M45K97l07J77l51l3j09P6j57
$$ 117 313 426 37 -183 -604 -11 -196 -16 135 147 263 -278 167 464 157 334 -17 -50 -159 -83 -240
647b40K67m63N3NK70R8N37m8m63M5k4J9M71j36l32l35j22j6J93M68j05o08K71
$$ -240 27 -436 -383 -378 -108 -10 527 479 16 61 37 56 527 391 59 -276 -398 -414 -221 247 142 -466 -195
670a95K60j31J15L55j7o52K81K65l50J73O9j02k16J10k58K38Qj83j46K21O61m61
$$ -195 65 -66 49 404 387 -265 16 281 -69 104 173 71 -145 -35 -293 -55 -47 -230 -376 -155 506 45
692D5m1J44k66O6K91j1l65PL0j2l31J51J52J94j22J21k65K01K83M3j24K21m44
$$ 45 4 148 -118 -52 239 228 -137 -130 -100 -112 -443 -292 -140 54 -68 53 -212 -11 272 315 191 412 -32
715c2K74m2k67K82l63K74l30j19J08K41k9J02l93K11K45J54o5p5j3l76o5L72r3
$$ -32 242 200 -67 215 -148 126 -204 -323 -215 26 -3 99 -294 -83 162 316 251 176 163 -213 -278 94 1
738AR3l57j51M1L36q3J77J61o0k5j74J23J94j70J71k12K6rmm8J48k47j16p1L51
$$ 1 94 -263 -414 -373 -37 -120 57 218 158 133 -41 82 276 106 277 65 91 82 78 30 178 -69 -185 -256 95
763I5L2P8R6j56l4k22K25J65k20j60L34o41L27KQ3j35k04N2L56J39j53K6j26R5
$$ 95 127 205 301 145 111 -111 114 279 59 -101 233 -408 -81 -79 4 -131 -335 -283 73 212 59 85 -41 54
787E4j81K98n5j09nk26J40L43m18O3R3N8m82K55K21r4J77J96l89j38L21j1j4n8
$$ 54 -127 171 116 7 2 -224 -84 259 -159 -96 -3 55 -427 -172 49 -45 132 328 -61 -199 122 111 97 39
811C9nj55p4K02j05J33k81L51J33k74L05jj38K5J01O2l08J21l98L06o4j71K30
$$ 39 34 -121 -195 7 -98 35 -246 105 238 -36 269 268 130 155 256 318 10 131 -267 39 -25 -196 34
834C4J41j07k8l29K35p6R9J57j35K02j93m3J14k61L79r1k49Q5j21o4K82NJ62j92
$$ 34 175 68 40 -289 -54 -130 -31 126 -9 193 0 -43 71 -190 189 98 -151 -66 -187 -251 31 36 198 6
858FK68k88N2L91l12K0k30L65l91m1J18O0k02m1K03j4L42k85J22j57M7j46J45
$$ 6 274 -14 38 429 117 137 -93 272 -119 -160 -42 18 -184 -225 -22 -36 306 21 143 -14 33 -113 32
881C2N9L0j51L8k95L75J19j78k5L3k10K0R3j56L11l5j22jk0K49l4j80J29m1J7
$$ 32 91 121 -30 8 -287 88 207 29 4 37 -173 -153 -60 -216 95 60 -62 -63 -83 166 132 -48 81 40 57
906E7k86J69K09k87N0L7j70K13l5J34q2M1L9j6K76k12k40K1M7k04K40K30l23l
$$ 57 -229 -60 149 -138 -88 -51 -221 -8 -43 91 9 50 89 73 349 137 -103 -82 -35 -239 1 231 -92 -95
930i5l2L11j19k15K29J76r2m04K94k80M34j19l12J82j98L00k54J71N8k34K84j17
$$ -95 -127 184 65 -150 79 255 163 -241 53 -227 207 88 -224 -42 -240 60 -194 -23 35 -199 85 -32
952c2K59K6j60J96m20J51N5K44j71l24J46j02J29K6k4k29J50K03q4j07K25J3j34
$$ -32 227 253 93 289 -131 20 75 319 148 -176 -30 -132 -3 23 -1 -230 -80 123 39 -68 157 170 36
975C6p0O8mk08K04M5k30j50K15R3n4L04k88o9O9Q9j1P7Q9k66o9J36J38m5j15O1
$$ 36 -34 34 30 -178 26 71 -159 -309 -94 -1 -55 249 -39 -108 -39 50 39 116 205 -61 -130 6 144 99 -16 45
1001D5K7j31lK94M9j45j32K19j42k00K03j71K07r5k60p3J89N3J21j77P0J98k56
$$ 45 72 -59 -62 232 281 136 4 223 81 -119 84 -87 120 25 -235 -308 -119 -66 55 -122 -52 146 -110
1024a10j02J23L1o6K48Q8j86Nj03pp1J09J11J93j36j76J12J1k12k6N1K35q1N8
$$ -110 -212 -89 -58 -124 124 212 26 31 -72 -79 -150 -41 70 263 127 -49 63 74 -138 -164 -113 122 41 99
1048I9OQ7j61K05r6l14M76j27O8J1l34j41L52j29K40m1r5j2j34L10n22K86P8j54
$$ 99 105 192 31 236 140 -174 302 175 243 254 -80 -221 131 2 242 201 106 94 -40 270 -252 34 112 -42
1072d2L6J83j09j24J45n0L9J02j15j3N8j73K00k39J06j17Q8L06l88J15l9Q4k92
$$ -42 -6 177 68 -56 89 39 78 180 65 52 110 -63 137 -102 4 -113 -25 281 -107 8 -31 53 -239
1095b39K88j71K97j92j48J19J19j63N3O7K4r6K16j26k6j99j4J71j80P5k4L39j40
$$ -239 49 -122 175 -17 -165 -46 73 -90 -37 30 54 -42 174 48 22 -177 -191 -20 -200 -125 -149 190 50
1118E0M7l29K30k2qJ55l4j70O9K00q9R6l20Q6j7K0o9N0R0K05j28k23k8J9J70k8
$$ 50 97 -232 -2 -24 -32 123 89 -81 -12 188 99 195 -125 -39 -56 -36 -105 -55 35 240 112 -111 -139 -120 50 22
1144B2k6o0j08n7J61r1j7K45j28p1P2J74k26J57j22L54l66K22J34k50j68ROj44
$$ 22 -4 -64 -172 -229 -68 -159 -176 69 -59 -130 -58 116 -110 47 -75 279 -87 135 269 19 -149 -140 -134 -278
1168b78L84k06K36j82l37N56J4j61K95l65j71K88k9j97M88l50J0J88k5O5j24q2
$$ -278 106 -100 136 -46 -383 173 187 26 321 -44 -215 73 44 -153 335 -15 -5 183 158 223 99 17
1190A7kM4j44j89M96j42p4P5j1l5r3J49m1k09K38n28N55l8j84L80k68L2m7j86
$$ 17 15 59 -85 -274 222 80 6 81 70 35 -58 91 50 -159 79 -449 106 68 -116 264 -4 28 -19 -205
1214b05J65j05K93l45L70j86J08j9k18K20j08K16k71L00l09j8P4R1K1l5nj89K75
$$ -205 -40 -145 148 -197 173 -13 95 76 -142 78 -30 186 -85 215 -94 -112 -38 53 74 39 34 -155 120
1237A20J56k97K07o1m2M8j18j08P2J44j43M4k56K71l4J89k12J02J62l86j7K77
$$ 120 276 -21 186 125 83 131 13 -95 -23 121 -22 22 -234 37 3 192 -20 82 244 -142 -159 118
1259A18j08o5K93k74k0p8K54k22j33M42l59J33K49l73L00l13l6K91l65M83l1l73
$$ 118 10 -55 238 -36 -56 -134 120 -102 -235 207 -152 -19 230 -143 157 -156 -192 99 -266 217 186 -187
1281a87L99k46j3K65N5j26j93J78mn9q8j9o8K63k01O0k93J73k05L27P4l57L26
$$ -187 212 -34 -47 218 273 147 -46 132 128 69 -19 -38 -106 157 -44 16 -277 -104 -309 18 92 -265 61
1304F1n5K19k09K8j15K82k71K02m4r4J46q2j52J16j68J29J23j6q0R8p9rl07M04
$$ 61 6 225 16 44 -71 211 -60 142 98 4 150 68 -84 32 -136 -7 116 100 20 118 39 30 -277 127
1328A27j74k69L25k15R7N4K37k32kJ69k26L65p1j29j04j14J93J95m05J19m7L6
$$ 127 -47 -316 9 -206 -109 -55 182 -50 -52 117 -109 256 185 56 -48 -162 31 226 -179 -60 -107 -71
1350g1ON3Q5L7l04L6O1J93j05m1J14M8m07R5K25j41K76kl6k16J08j86K63J0j37
$$ -71 -65 -12 73 110 -194 -158 -97 96 -9 -50 64 112 -295 -200 25 -116 160 158 122 -94 14 -172 91 101 -36
1375c6M6J46j81J89rk82J61J43J06on57J72j71K50J99p7k23L16j49J11k84L89
$$ -36 10 156 -25 164 155 -127 34 177 283 277 -280 -108 -279 -29 170 93 -130 186 37 148 -136 253
1397B53j14l29J28n1J81NJ20k16N0m6j08j08P4j1K48l41L97J01j98P0k45J43k08
$$ 253 139 -190 -62 -113 68 73 193 -23 27 -19 -127 -235 -161 -172 76 -265 132 233 35 105 -140 3 -205
1420b05R2K75j31Q6j47o0K9L10j24r3l3j9P3J8n6K11l82K51m21N45q7o8j65M0
$$ -205 -113 162 31 117 -30 -90 -61 249 125 32 -1 -20 53 71 15 226 -156 95 -326 219 132 64 -101 -61
1444f1m3J74N8j57KOj4j75J16J89r3J13L0L2j12o4k19L84j78j49J29o9J12r4O
$$ -61 -104 70 128 -29 -27 -21 -35 -210 -94 95 2 115 145 177 65 1 -218 166 -12 -161 -32 -101 11 -83 -77
1469g7J56k36Q6q4LJ41n9k15J48J83j35J70k39M3L3J75j77J69n00M48J83J3o9
$$ -77 79 -157 -71 -155 -152 -11 -70 -285 -137 46 -89 81 -158 -115 -82 93 -84 85 -415 33 216 229 160
1492A60k88J38j39O4p4K74N8l55L20k61J04Q7l4K7QJ28K9m25Q1m0R3R7j32K24
$$ 160 -128 10 -129 -65 -139 135 193 -162 158 -103 1 88 54 81 89 217 246 -179 -98 -138 -45 52 -80 144
1516A44j65J78j61J88j8k78O1N3q6J62J3L9j86L7m1Q0m11L76J57j58M3jp7K14
$$ 144 -21 157 -4 184 166 -112 -51 2 -84 78 91 130 -56 -19 -60 20 -391 -15 142 -16 27 26 -51 163
1540A63j80j11Q4P7M3k59J48k5J45j68J64L0l43M00k36K60M2j78k47J39n6K12
$$ 163 -17 -128 -44 33 76 -183 -35 -60 85 -83 81 111 -232 168 -68 192 234 56 -191 -52 -108 104
1562A04K34m14m8N4J11J0n8N4L1P8k48j69L09j75J01o2L56k32k23J56K5o1J79
$$ 104 338 -76 -124 -70 41 51 -7 47 78 156 -92 -261 48 -127 -26 -88 268 36 -187 -31 -6 -67 112
1585A12O8m21K31J90j55O9Jn1p1J32J10l77K96P7k30M36n12K43j34n7k9k43M64
$$ 112 180 -241 -10 180 25 94 95 44 -27 105 215 -162 134 211 -19 417 -95 148 14 -43 -72 -315 149
1608A49j61J0j0j24K54j02k0R9j06P9k05j97N46l62J98k04J5m6L85j04J21j63
$$ 149 -12 -2 -12 -136 118 16 -4 95 -11 68 -137 -334 212 -150 48 -156 -141 -187 198 94 215 52
1630E2j5L8m6K5n1rL0k47L98k22J77J41j88j99Q0K06Jk33L9p6q8M11l56K62j45
$$ 52 37 75 29 54 3 -6 24 -223 175 -47 130 271 83 -116 -36 170 171 -62 -23 -99 -187 224 -132 130 -15
1655a5J51P9k18n9J66k01K2J18m6j81L70j74P1k68M52k41n7N9j22K26j5j34P6
$$ -15 136 215 -3 -62 104 -97 -75 43 -3 -184 186 12 83 -185 267 26 -31 28 -94 132 117 -17 59
1678E9j22L2K76l44K11k98J75j0K8J10j40J48j08mj9K6M4k52L32L1k66L9j40P0
$$ 59 -63 -31 245 -99 112 -186 -11 -21 7 117 -23 125 17 13 -6 20 64 -188 144 175 -91 -52 -192 -122
1702a22M7OJ94j59K34mq7j86j41K82j83P9k0j52L43k52M3L75l81n9L3J85j18J12
$$ -122 -75 -69 125 -34 200 196 109 -77 -218 64 -119 -40 -60 -212 131 -121 -78 297 -84 -143 -110 75 -43 69
1726F9N5k55K99j91k35M06q1J11l4m17K51J15l51M76l79L9k0K15M58p25j32M10
$$ 69 124 -131 168 -23 -258 148 67 178 144 -273 -22 93 -258 218 -161 -122 -142 73 531 -194 -326 84
1748H4J7j14O2K2l20l0K02J92K8j82J93k25J5P1j17K42q5l2k25J91M5r6N0r4m9
$$ 84 101 -13 49 71 -249 -279 -77 115 143 -39 154 -71 -56 15 -102 140 55 23 -202 -11 34 -62 -12 -106 -155
1773a55l6K72j35K5q4O7K64j87L5L5l06K37p1J75J14l32j98M20j44q2M01j86j98
$$ -155 -191 81 -54 -29 -113 -46 218 31 66 101 -205 32 -39 136 250 -82 -280 140 -4 -86 315 129 -69
1796f9j4J07j15K64l44L47m23L31m5j54J95j83J10J43k83O9k6O9lj57J98k86J77
$$ -69 -83 24 -91 173 -171 176 -247 84 39 -115 80 -103 7 150 -133 -64 -90 -21 -24 -181 17 -269 -92
1819i2J6J82j44p9J15Q4j40J51j05Rm3Q8L6J77j36l35K14j26L48k61L06l92L50
$$ -92 -76 106 -38 -117 -2 82 -58 93 -12 -3 -46 42 78 255 119 -216 -2 -128 220 -41 265 -127 223
1842B23j92R4N8k73J0K86k67J47k11m3J1K42j93O4j33Q6k17N22p3j6j76j07N4
$$ 223 31 125 183 -90 -80 206 -61 86 -125 -168 -157 85 -108 -44 -177 -91 -308 214 141 125 -51 -158 -104
1865a04L10j98j4J16k32o0J33J6R7k08J98k4Q8k21J81k98K37K22l40K07j38N0
$$ -104 206 8 -6 110 -122 -182 -49 -33 64 -144 54 30 118 -103 78 -220 17 239 -101 106 -32 18
1887A8J24k81J32p4K51o4j08j60o9K17K0j52Q3K21k50p0J79m1J18k63J89k5k12
$$ 18 142 -139 -7 -81 170 106 -2 -162 -231 -14 6 -146 -63 158 -92 -162 17 -24 94 -169 20 -5 -217
1910b17k8J99P7k52K11l7N8m3P0j88O3K4N7J51k32j48L53k65M8M37Q3o09L63k11
$$ -217 -245 -46 31 -221 -10 -47 11 -32 38 -150 -87 -63 -6 145 -87 -235 118 -147 -99 338 421 -188 175 -36
1934c6L52k62Q3m11L27k38J78j26N6J76o9K39l11N3n8R2k21K19nr7K25J22k76
$$ -36 316 54 137 -274 53 -185 -7 -133 -77 99 30 269 -42 11 -47 45 -176 43 38 -59 166 288 12
1957A2rn6M7K25l38K89m2J48k19j43P3jj11J38J27p4KJ38q1m06O30l80r4K4K38
$$ 12 3 -53 -6 219 -119 170 128 276 57 -86 -13 -14 -125 13 140 66 68 206 125 -281 349 -31 -125 -101 137
1982A37l14P3k36K48N1J30k08J11l8J9j5j57K89MM3k07J57k57J55j94L1M6kK6
$$ 137 -177 -104 -340 -92 -41 89 -119 -8 -46 -27 -42 -199 90 94 137 -70 87 -170 -15 -209 -178 -132 -134 -108
2006a08N0J11K83m80n0K61j36j55L57k36J57j30o2oK06j90N5R3l1j08K92J1m64
$$ -108 -58 53 336 -144 -194 67 -69 -224 133 -103 54 -76 -138 -144 62 -128 -73 20 -11 -119 173 184 -280
2029b80K63O5M1r7J49M0n82L79J34j89K26j8l32M13j55p1P8j14M6N9p3j55K57
$$ -280 -17 48 89 -8 141 181 -401 -22 112 -77 149 131 -201 212 57 -14 64 -50 -4 55 -18 -173 84
2052H4R8p5k49K75l0r9q4J34j40J89j3l14K95J11r8j94K3P9J69k28J58Q2k80J62
$$ 84 182 107 -142 133 103 4 -80 54 -86 103 90 -224 71 182 84 -110 -87 -8 161 -67 91 173 -107 55
2076E5k19K09m1J39k45K64o6j71J83k32K96n37K95O1J28J33m34J31R4pJ6j94M1
$$ 55 -164 45 4 143 -102 162 96 -75 108 -124 172 -365 -70 -9 119 252 -182 -51 43 36 52 -142 -101
2099a01J74J01j80N6l84K91o8K8J96o2K6k18Q9Q9n5J46j40k77K34P0K03l03K56
$$ -101 73 174 -6 50 -334 -43 -111 -83 113 51 77 -141 -52 37 -18 128 -12 -289 -55 15 218 -85 171
2122A71k9k16J19o9J49k64j6K10l21L53J82k89P5k50K75M8k77O5L03o7k98K27
$$ 171 142 -74 45 -24 125 -139 -155 55 -266 87 269 -20 55 -195 80 128 -149 -84 219 152 -146 81
2144H1j18Q5k81J86Q0K7KK1p2O9k06J74O2j24K38p4p3k25K38j12J26j27J32q6
$$ 81 -37 48 -233 -47 33 60 62 83 11 80 -126 48 110 -14 224 150 77 -148 90 -22 104 -23 109 23
2168B3J9Mk2r9N1N9k5J27L2j98j88K40k90J60R2k5j5J1J03j69j2L58k70j34O4
$$ 23 42 46 24 -75 -24 35 10 137 169 -29 -217 23 -267 -107 -15 -40 -55 -44 59 -110 -122 236 -34 -168 -104
2193a04J67J77l19P6Q8q0J69j30K47O3l96L9j3k6J92j44j64R6j2J47l68J87K14
$$ -104 63 240 -79 -3 85 5 174 44 291 354 -42 -3 -16 -42 150 6 -158 -62 -74 73 -295 -108 106
2216A06j3k59L21j14Q9kj14J83n4o8k06j66J20K96J8l05J60J25j88J26J1k82K36
$$ 106 93 -166 155 41 130 128 14 197 143 75 -131 -297 -177 119 137 -168 -8 117 -71 55 66 -216 20
2239B0P8R9m9j04O6j06j87MK47J2k45R0O2K3j61L02k06r2K00j74Q6J21m77M68
$$ 20 98 197 148 44 110 4 -183 -179 68 80 -165 -75 -13 10 -151 151 -55 -147 53 -121 -35 86 -391 77
2263G7J5N3k20RJ27j12K5q7J77j06J0k5M7L1q5M6J02q9K84j98J25l65K34k52K10
$$ 77 92 145 -75 -66 61 -51 -26 -113 64 -42 -32 -57 -10 21 -64 -18 84 -5 279 81 206 -159 75 -177 33
2288C3M8j83K39K6j74m9J20k60J63J57O3k01K0L6l41O63l38R0Q7r9j28pr2L0m0
$$ 33 81 -102 137 163 -11 -60 60 -200 -37 120 183 -18 2 38 -303 360 22 112 199 100 -28 -35 -127 -97 -137
2313a37k6j8K74l3m9j3K5j47K89M1k20J15Pl35J44J96j55j12J48o1O6L01j78k38
$$ -137 -163 -181 93 60 11 -2 23 -124 165 206 -14 101 108 -227 -83 113 -42 -154 -6 -67 -1 300 122 -116
2337a16J51r4O7m3K34k87J72p1Rm48k8P61l91n7o7M20j24j80J34J94k22o7Kr2
$$ -116 35 -59 8 -35 199 -88 84 13 22 -426 -454 307 -84 -141 -208 212 88 -92 42 236 14 -53 -51 -143
2361a43P5K04j75J81O4l71K83j65K77j96o3J10k96p0L30P7J03j41m37N86j68N8
$$ -143 -68 136 -39 142 206 -165 118 -47 230 34 -29 81 -215 -285 45 122 225 84 -353 233 65 123
2383A23k45R1Q6L2K47l12j11J7K41K3j73k18L99k09o8J28K78j70l70K73lj96k3
$$ 123 -122 -31 55 87 334 22 -89 -72 169 192 19 -199 200 -9 -77 51 329 159 -211 62 59 -137 -160
2406a60J20K71k78K5O9J36p8m28L83m5M5o4N7m64L81j97K40K7j50L98j89K03l13
$$ -160 -40 231 -47 -22 47 183 105 -323 60 15 60 -4 53 -411 -30 -227 13 40 -110 288 99 302 -11
2429a1J27m5p1J08j33K05j91J41j33j30J33R9q4r7k56L34J26L5k59J85l19N79
$$ -11 116 71 0 108 -25 180 -11 130 -3 -133 0 99 15 -82 -338 -4 122 157 -102 83 -236 343
2451C43m91L36j86j9r9M3J21Q5k86L75k62O0m0J04j57O6kK07o6k4k69J95L6N0
$$ 343 -148 188 2 -17 -116 -73 48 133 -153 222 -40 20 -20 84 -73 -7 -9 198 132 108 -161 34 70 120
2475A20j49j46J08j16P0j39R0oM54k17j17j15K61k77N7L13l49K45J02j03k8J11
$$ 120 -29 -175 -67 -183 -113 -252 -162 -168 286 69 -48 -163 98 -179 -122 191 -158 87 189 86 58 169
2497A69O2m8l45l0L30j4j90p9K8j68jo8M52l5m4K8j87J80Q1k92J79m01R4j34M14
$$ 169 231 183 -162 -192 138 124 -66 -145 -117 -285 -286 -354 98 63 19 47 -140 40 121 -171 8 -393 -299 -433 -19
2522a9M9n4K50j6l82K22Q1j87n1J33K6j69J31Q1k52J85N1o2q3j57M29Mj6l83L87
$$ -19 30 -24 226 210 -172 50 131 -56 -107 26 52 -117 14 95 -157 28 79 17 -66 -223 206 210 194 -189 198
2547A98p2m9j81l4K77k59J06O4k65L40j25K0j49r5M94n09L60l55J79J00j55L19
$$ 198 126 77 -104 -138 139 -120 -14 50 -215 125 0 20 -129 -224 270 -239 121 -234 -55 45 -110 209
2569B09l38r0J84J63j52R5j5J18L7j77L3%q9r2K70j23mM8m08M70l0l22K44o6J34
$$ 209 -129 -219 -35 128 -24 71 56 174 211 34 67 67 -22 -114 156 33 29 77 -331 139 109 -213 31 -35 99
2594I9p6L7O8k3m1j74n3J11J92k24K34k19L0J40j56J21p7lk7j54K83k65J20j52
$$ 99 23 60 128 105 64 -110 -163 -52 140 -84 150 -69 -39 101 -55 66 -11 -14 -41 -195 88 -177 -57 -209
2618b09K64l1L02l80N6M8j27J53q7Q8l64K64j56R5m3RJ53N1p5j44L48l1m18L78
$$ -209 55 24 326 -54 2 50 -77 76 -11 77 -287 -23 -179 -84 -127 -118 35 86 11 -133 215 184 -234 144
2642A44J29M1l54K17q5j15o3Q2l9J74p7J75j45k79J27q1L87k47j93J92k49J84
$$ 144 273 314 -40 177 92 -23 -86 -4 -43 131 54 229 84 -195 -68 -149 238 -9 -202 -10 -259 -75
2664g5j17P5K84j46l32M55O0l68K93j79J44k95J38j41j5L07m5Ll7j21J49q0J40
$$ -75 -192 -117 167 21 -311 144 204 -164 129 -50 94 -201 -63 -204 -219 88 43 46 9 -112 37 -43 97
2687I7L3j74k3K1K0K22k3m1p6%o5O9N0q4N6Pj60N3O1j65RJ03K39l33R2p6L14j33
$$ 97 130 -44 -67 -46 -26 196 173 132 56 56 -9 60 110 26 82 89 -71 -18 43 -122 -113 -10 229 -104 -12 -88 226 93
2715I3N0k06j1K22n0j94J11m5j02J81M9pj22L6J04l11K11n5J72J86n17M34l44
$$ 93 143 -63 -74 148 98 -96 15 -30 -132 49 98 91 -31 5 109 -202 9 -46 126 312 -205 229 -115
2738a15j66J12J70j09MK14j10j01j7L58j95j15M1j21r3K75O0l5K7j38M1K5K1J
$$ -115 -281 -169 1 -108 -104 110 0 -101 -118 240 45 -70 -29 -150 -243 32 92 57 84 -54 -13 12 33 34
2762C4J18l19L89m01K70m08L07km4J63k06M7j34L07R6k67o0Q1J18J10j26j75J40
$$ 34 152 -167 222 -179 91 -317 -10 -12 -56 107 -99 -52 -186 121 217 -50 -110 -29 89 199 73 -102 38
2785C8j56K19j72%J42j57m2J14P6m5l86L88M9J00j59l21K31R7k3n9J8pK03l2J74
$$ 38 -118 101 -71 -71 71 -86 -128 -14 62 17 -369 19 68 168 9 -312 -81 16 -7 -66 -48 -55 148 116 290
2810B90j05j46j04j5L7J33O7l83M08J06k49j4K20l65K01j56L23k73J28n7k19L53
$$ 290 185 39 -65 -80 -43 90 157 -226 182 288 39 25 245 -120 81 -75 248 -25 103 46 -173 180
2832A80q1k66J35P9o2J49l19J04n1R0k98K31J24n8j18J20J55j48o5M8QK03j0k53
$$ 180 99 -167 -32 47 -15 134 -185 -81 -132 -42 -340 -109 15 -43 -161 -41 114 -34 -99 -51 -43 160 150 -103
2856a03j49N19k62J31k99J63Q2j48L9j19J65J67j46J08k10j32J40L73k33j01J23
$$ -103 -252 267 5 136 -163 0 82 -66 -27 -146 19 186 40 148 -62 -194 -54 319 86 -15 108
2877A08k34k8K49q6L0J6j79J26L6R5j28m8J47r2k65M30n9Pj80J06N5p1j65K71
$$ 108 -126 -154 95 9 39 55 -124 2 38 133 5 -43 104 12 -253 177 118 125 -55 51 106 35 -130 141
2901A41k39ML3r4n5m7O18l51%k77K42J9N6P3m7P7j59N9J9k67J28K51l18J18J32
$$ 141 -98 -94 -61 -155 -210 -257 361 10 10 -267 -25 -6 50 123 76 153 -6 53 72 -195 -67 184 -134 -16 116
2926A16K3k1k03J26J27k21j31J56M7j22K72j79K4P6k6O9j52J52p2k39K74l62J39
$$ 116 139 118 -85 41 168 -53 -184 -28 19 -103 169 -10 14 90 64 133 -19 133 61 -178 96 -266 -127
2949a27J21K24k52Q1j78p5Q5j4L06R6k39r4R8J90l93J10J32j14J55l04J80j34
$$ -127 -6 218 -34 47 -131 -206 -121 -135 171 267 28 -66 32 222 -171 -61 71 -43 112 -192 -12 -146
2971a46J4Qn0K94J77k75J01M2k00K74j70J8l06K33r3K1J06j31N1J65j06q3lk77
$$ -146 -132 -124 -174 120 297 22 123 165 -35 239 69 87 -219 14 -79 -58 48 -83 -32 133 27 -56 -59 -336
2995c36O4L35J71l60o3K19lK00k60J2L03k35j5J24j19j18J5j00J48K40p6l30J26
$$ -336 -272 63 234 -126 -189 30 27 227 -33 -21 282 47 32 156 37 -81 -66 -166 -18 222 146 -184 -58
3018e8q4o6J54M04j46j11o0R3l74M01k03J99k75K40l9k64Q0J93m4J70l70q9J91
$$ -58 -142 -208 -54 350 204 93 33 126 -248 153 -50 149 -126 114 75 -189 -109 84 40 210 -160 -249 -58
3041e8p8J73o1l8k20M77n5l4M9j61k25K47J39j18o1K33k61j79O6K04N6m0q0k65
$$ -58 -136 37 -24 -62 -282 195 140 106 155 -6 -231 16 155 37 -24 209 -52 -231 -165 39 95 55 -25 -290
3065b90K99j65J09K1k65J27J94K72l37M2mJj88M4K48j09P1O3O5l36K78J15j08
$$ -290 9 -156 -47 -26 -291 -164 30 302 -35 7 3 4 -184 -140 108 -1 70 133 198 -138 140 255 147
3088A47K0j9l2l03J86OQj67n0M55k59k79K09j5J90L8o7p5j31q6L14j09J96l52
$$ 147 167 148 116 -187 -1 5 13 -154 -204 251 -8 -287 -78 -93 97 135 68 -7 -138 -224 90 -19 177 -175
3112a75K19O1k76Q6j66K74k7L04k30Q9J6j75R6k30J89L8M0n5l8J22j14rm9l5J5
$$ -175 44 105 -171 -85 -251 23 -4 300 70 159 175 0 96 -134 55 93 133 78 40 162 48 39 -10 -45 -30
3137c0J23K55l68J68k24O4N8j80N0J07j14L64l95K33j30j4l6J26q9K03jj45n4
$$ -30 93 348 -20 148 -76 -12 46 -134 -84 23 -91 273 -122 111 -19 -33 -69 57 -32 171 170 25 -29
3160b9K58l08j08L91k13j4O9j76J09J8j08J80r8N2j33K62l72J12Mk00N95k64l74
$$ -29 229 -79 -187 204 -9 -23 46 -130 -21 -3 -111 69 -29 23 -110 152 -220 -108 -104 -304 291 27 -347
3183c47N71l76J02J19P9l59K70J31j63j04k27K73p5j71J96J33k87M04l41K54M8
$$ -347 224 -152 -50 69 148 -211 59 190 27 -77 -304 -31 -106 -277 -81 52 -235 169 -172 82 130
3204A30o6J41K9Q7m81K58k0m4m9L52l15J1l25O21n34P4%J42o4K36l18K79j23j02
$$ 130 64 205 234 321 -160 98 78 34 -15 337 22 33 -292 329 -205 -131 -131 11 -53 183 -135 144 21 -81
3228h1kq5J78L62p15M69q3J22J91k91k15L10m4j97K5j22J9K23j48L0P6l21K61
$$ -81 -83 -168 10 372 -343 126 43 165 356 65 -150 160 116 -81 -56 -178 -159 64 -84 -54 22 -299 -38
3251c8j34o9L89j58K9o4N4M4J70q5k10l0n9J75j64N4J26lK25k72J52j94j04O7
$$ -38 -172 -241 148 -10 19 -45 9 53 223 138 -72 -102 -161 14 -150 -96 30 27 252 -20 132 -62 -166 -99
3275i9K9K81j35O2p9j66L48l01P7j15J13j21K3lJ57j69j25L11q6L43m12j44J93
$$ -99 -70 211 76 138 59 -107 241 -60 17 -98 15 -106 -83 -86 71 -98 -223 88 2 345 -67 -211 -18
3298a8J4k6o4K65j06J85j38j93K30j2k32m4L51k36J45k45K44j39J08k15J35J01
$$ -18 -4 -30 -94 171 65 250 112 -81 149 137 -95 -139 212 -24 121 -124 120 -19 89 -126 9 110
3320A10J7o1O2j57O3oRM5m49O79m29K25Q6l8m3j19J60K9l32K35R5m08R1M8k74
$$ 110 127 66 128 -29 34 28 37 82 -367 312 -117 108 194 156 113 -6 154 183 -149 86 181 -227 -136 -88 -362
3345c62K07R3r5K11P4k38j26L80j01K19j73k96K72N8j22N9K5r6JR8J34k69O9L35
$$ -362 -155 -62 -157 54 128 -110 -236 144 43 262 89 -207 65 123 1 60 85 -11 -10 88 222 -47 22 357
3369C57k61k41l2J90o4J08p5L3k82K81p9r1N04k81k06K40k08J03N7j94l0L25o9
$$ 357 96 -145 -177 13 -51 57 -18 15 -267 14 -65 -156 348 67 -139 101 -107 -4 53 -141 -171 154 85
3392H5K3j49K53k71J34j74L0R0J64j79N0J06l4j79J24q5r4K09K51o08J91K92l32
$$ 85 108 -41 212 -59 75 -99 -69 21 185 6 56 162 128 -51 73 -12 -106 103 354 -254 -63 229 -103
3415a03J75J04M6L6k95j3J20j17k9p7j3q5L07M1j49pJ46N0m6j06p9K66k11K2j37
$$ -103 72 176 222 258 -37 -50 70 -47 -76 -153 -166 -251 56 97 -52 -59 87 137 91 -15 -94 172 -39 -17 -154
3440a54K61j55k05K76n1K12l65M39l29J26n8R6L5J59m91L29j47j46L06k48k4O1
$$ -154 107 -48 -253 23 -28 184 -181 258 -71 55 -3 93 128 287 -204 125 -22 -168 138 -110 -134 -73
3462g3J20j35L39l66j72K54k9P5k4K87l11l4KK80j57Qo4l7Q0j51R0k61K27K10
$$ -73 47 -88 251 -115 -287 -33 -62 13 -11 276 -35 -69 -67 213 56 64 0 -37 43 -108 -18 -279 -52 158
3486A58o9Pj50K11k50K29j84J67p3m2j07K70j35l6k17K45k19O8L71k97o0KL48
$$ 158 89 96 -54 157 -93 136 -48 119 46 4 -103 167 32 -4 -221 24 -195 -127 244 -53 -113 -111 237
3509B37j16j93Q4j34J88n9J15J46k98q9K55k03J90l1k91Q5J26L0k73L99k20Q4
$$ 237 121 -72 12 -122 66 7 122 268 -30 -119 136 -67 123 92 -199 -114 12 42 -231 168 -52 32
3531C2L4j83L8K01J54m24K74j69j53K35J13J43o86J74J19O8l73N00k16J38J8l46
$$ 32 66 -117 -79 122 276 -148 126 -43 -196 39 152 295 -391 -217 -98 -30 -403 97 -119 19 37 -309
3553c09L10J65j28j34O4J41o3L5j10k38K82l1L2O7j17k36L87j75L2N3k4o9P2P2
$$ -309 1 166 38 -96 -32 109 46 81 -29 -267 15 -16 16 83 -34 -270 117 -58 -26 27 3 -66 6 78
3577G8K1k35j7K42Q5k47L9Q2K8J29j03q7n27N94K36m63l1J46R6j58l3K27k24M08
$$ 78 99 -136 -153 89 174 -73 -34 48 76 205 102 15 -512 82 318 -145 -176 -30 66 -92 -125 102 -122 286
3601B86m26J57q8J35j41k03K88R7O6l33J1k9L81p2k10l5j22M29k36q0O9J41j99
$$ 286 -140 17 -71 64 -77 -280 8 105 171 -162 -151 -180 201 129 -81 -116 -238 191 -45 -125 -56 85 -114
3624a14R7J61MK0L5k74L3Q9k0K0M5r4m0o1N3N1%L2J3j00j37J92p8N8k16L03N5
$$ -114 -17 144 148 168 203 -71 -38 51 31 51 96 2 -38 -99 -46 5 5 37 50 -50 -187 5 -73 -15 -231 72 127
3651A27j59K49k39K3l2l83N90p5O1p9j6l6k36J4J13J82k41L94j82k74L23J5J16
$$ 127 -32 217 -22 1 -31 -414 176 101 162 83 67 31 -205 -191 -78 104 -137 257 75 -199 124 139 255
3674B55k76J35k62K33P8L4k91K84k55N0j6l2M94m66nrJ30j11K78n3k85j37K77
$$ 255 -21 114 -148 85 163 197 -94 190 -65 -15 -31 -63 431 -35 -40 -49 81 -30 248 195 -90 -227 50
3697E0j32k8K41l90L64j08J04l14K1J60n4J64j32K38q3k92J8L0l5K70l43l4J12
$$ 50 -82 -110 131 -259 105 -3 101 -213 -192 -32 -86 78 -54 184 101 -191 -173 -143 -178 92 -251 -285 -173
3720a73O8%J03m4R8J96j46q4o4J21m9K52o5k40o2L9K13k28J33M4K46k87q0qj00
$$ -173 -105 -105 -2 -46 52 248 102 18 -46 75 26 278 213 -27 -89 -50 163 -65 68 112 358 71 -9 -17 -117
3745a17L44n9j73j2j9K9k43M45k25K82k51No0n6J85l07L89l77J36K12Pj66K89
$$ -117 227 168 -5 -17 -36 -7 -250 195 -30 252 1 6 -54 -110 75 -232 157 -220 -84 128 135 -31 258
3768B58l41m3J31J40j7r4Jm5J90q0K8j08L2qj1J50k47J40n7k30K08j74K86j65
$$ 258 -83 -126 5 145 128 34 35 -10 180 100 128 20 52 44 33 183 -64 76 19 -211 -3 -177 109 -56
3792e6M1j41J11L03m10J23p9L1K07j78M50l30J7J15k44lLR7j05J60j97K73k97
$$ -56 -15 -156 -45 258 -152 -29 -108 -77 130 -48 402 72 89 204 -40 -43 -40 57 -48 112 -85 188 -109
3815a09l3J99n8k4j10K60l09K47j73K76k17J35k67o0J32J86j29J62K32k17k33
$$ -109 -142 57 -1 -25 -135 125 -184 63 -110 166 -51 84 -183 -243 -111 75 -54 108 340 123 -110
3836a10M35o88N51o29N72j32M0j37Q7o7Q3J86l38L63m30L83j46j99K07Rl18M96
$$ -110 325 -363 188 -441 131 -1 39 -98 -11 -78 5 191 -147 216 -214 169 23 -176 31 40 -278 218
3858B18j53j12n2L01k62Q9J51ol51j1L96j58o3P7j20J5J82j71K59k44K19j28k3
$$ 218 65 -47 -99 202 -60 29 180 174 -177 -188 208 50 -13 64 -56 -41 141 -30 229 -15 204 76 53
3881E3m8R6k13L91n29L52k51P9K2Q4k20J80j6L4l38K45j84J16J2K15L1j06k76
$$ 53 5 101 -112 279 -250 102 -149 -70 -48 36 -184 -4 -20 14 -324 -79 -263 -147 -135 80 111 5 -271
3904b71K21M6k8R3j12K80j63Q2l29K87n4m3Q2j12k33K60K13k47N7j41m3O4P8J55
$$ -271 -50 -4 -32 61 -51 229 66 148 -181 106 52 9 91 -21 -254 6 219 -28 29 -112 -155 -91 -13 142
3928A42k35j54L05l09K40J34j11J46l14J27j87J21J86p7p8k03J61L55k21R5Np0
$$ 142 -93 -247 58 -251 -11 123 12 158 -156 -29 -216 -95 91 14 -64 -267 -106 249 28 123 128 58
3950E8j28k2R9J32j71J69j38Q2j30j55J07Pk5L30l6qj47n1l7J1j9j83J47k5J83
$$ 58 -70 -92 7 139 -32 137 -1 81 -49 -204 -97 -90 -115 215 179 171 24 -27 -64 -53 -72 -255 -108 -133 50
3975E0m4j48M14l41j07J44OK45l03K74k99j69K09M40k39p0j08m2k2q0K38n6N6
$$ 50 6 -142 272 -69 -176 -32 -26 219 -84 190 -109 -278 -69 371 132 62 -46 -88 -110 -190 48 -8 48
3998D8kk11K36j52k03L72j46K51j35k77n7K60J98k87M8K3K64k81K13k79P7J09
$$ 48 46 -165 71 -81 -284 88 -58 193 58 -219 -276 -16 182 -105 -57 -34 230 -51 162 -117 -40 69
4020F9J01m32J05K23J6j99K25J7k30J05K83j34Ll43L24p2j55j0J11j82M36l76
$$ 69 170 -262 -157 66 82 -117 108 125 -105 0 283 149 152 -191 133 61 -94 -104 7 -175 261 -115
4042a15K71r8r0L0J87j11m1j87J71P1j94J38j42p1K27o7L39k27L0L9j45O5k06
$$ -115 156 58 -32 -2 185 74 33 -154 17 88 -106 32 -110 -181 46 -21 318 91 121 160 15 80 -126
4065a26L98k52j31J41p0K53r1j27J21L9j89o6K7P3K31l17J39q6lj91J13P2k09
$$ -126 272 20 -111 30 -40 213 122 -5 116 155 -34 -100 -73 0 231 -86 53 -33 -36 -227 -114 -42 -251
4088b51L38Q2l82N53k55j29j81J29J33L4j42J04m0K06p8k42J58R4l0k77K95j56
$$ -251 87 169 -213 340 85 -44 -225 -96 37 71 -71 33 -7 199 121 -121 37 131 101 -176 119 -37
4110c7J64k34j63M03l36K32N0j84n8K37J3k71m5j06L71J17j23J64k58k7K04j06
$$ -37 127 -107 -270 133 -203 29 79 -105 -163 74 87 -184 -229 -335 36 153 30 194 -64 -91 113 7
4132Gqp8k45L86J8k99J82m8J80j10k13J48L31l78J1Q8K93k53o0j50J21J87k22
$$ 7 -1 -79 -324 62 80 -219 -37 -85 95 -15 -228 -80 251 -127 -116 -28 265 12 -48 -198 -77 110 -112
4155a12J23j28L40k44k56J57K95k70L65l49Q1K3j43L21k81R6o7J28l08J49k14
$$ -112 11 -117 223 -21 -277 -120 175 -95 270 -79 2 25 -118 203 -78 18 -49 79 -229 -80 -294
4176b94K15J75k14j01K53K16k64j24J33k08K25o9L03j75j57n4MJ56K20l19K41
$$ -294 -79 96 -118 -219 34 250 -14 -138 -5 -213 12 -57 246 71 -86 -140 -136 20 240 -79 162
4197A62j06j98j18L68k0j47R9J9j42m4J79j40l1r4K52J86k66K01j53j72M55k52
$$ 162 56 -142 -260 108 88 -59 40 59 -83 -127 52 -88 -119 -213 39 225 -41 160 7 -165 290 38
4219C8j97p1J53J46r1j97L63l77K43j15J45p2J6o9J48l40M79j53Nj78J09rK26
$$ 38 -159 -230 -77 69 -22 -219 144 -233 10 -105 40 -32 -16 -85 63 -277 202 49 54 -124 -15 -24 202
4242B02m60L92l82P4J99J44n6j05J15n2j31K80j13Q1k30N8k94J8J23m7L66j02
$$ 202 -258 134 -248 -174 25 169 113 8 123 71 -60 220 107 188 -42 16 -278 -260 -137 -184 182 80
4264H0r6R2o5Q4J9m22R5K69L14k54k78kK62p1R3j61PO4pN6j12o4J39qJ64J4l54
$$ 80 -16 76 11 95 114 -308 -213 56 370 116 -162 -164 98 27 120 -41 -34 30 23 79 -33 -97 42 34 198 212 -142
4291a42J34k6o3K54m6j34K43j62j62J81j82J36K47m30J63n7P7RO3k9q0K4J67r6
$$ -142 -8 -34 -97 157 111 -23 220 58 -104 77 -105 31 278 -152 11 -46 31 40 103 74 -6 18 185 89
4315H9k88q5K32j6J61k1q3j13K49K7j68P1m6j65K63K9j61J7k62K22J59j93J98
$$ 89 -199 -284 -52 -68 93 72 -11 -124 125 152 -16 55 9 -156 107 136 -25 -8 -270 -48 111 -82 116
4338A16o5j02j70j31O57k73k85K75K2np2R2R7j33k09M05j50N8q5l27J70O7OM2
$$ 116 51 -51 -221 -352 305 32 -253 22 44 39 -33 59 156 23 -186 219 69 127 42 -285 -115 -48 -42 0
4362@j60K46k51J7J47P7j58N01o59P3O8J33J37j65j82L27j96j85K29L7k02J68
$$ 0 -160 86 -165 -148 -1 76 -82 419 -240 -167 -99 34 171 6 -176 151 -45 -230 -1 36 -166 2
4384Bj23K44J14m9j58j3J6lj51k03M57j17m3J5j28K69l40K99L4k92M19j83j59
$$ 2 -121 123 237 188 30 17 33 30 -121 -324 133 16 -27 -12 -140 129 -211 88 122 -170 249 66 -93
4407i3L7Q9K4j3j10j61K12q3p0M25k54J0j65K14j04O1J11k01J65N2m38K80oP2
$$ -93 -56 33 57 44 -66 -227 -15 -98 -168 257 3 13 -152 62 -42 19 130 -71 94 146 -292 -12 -18 54
4431E4N1jj89M25m24L14k19Rl4K90j90Q9l89J13l8k27O28n36K64R9M9n5p8K30
$$ 54 105 104 -85 340 -84 230 11 20 -14 276 86 175 -214 -101 -139 -366 262 -274 -10 89 138 83 5 235
4455B35j2j76r7K8k01K5J45J16j77R6l0q1R1Kj08L7J22j87P3K30k99J0Q0J63k10
$$ 235 223 47 -50 -22 -223 -198 -53 63 -114 -18 -48 -129 -38 -36 -144 -107 15 -172 -99 131 -168 -158 -78 85 -125
4480a25P2M5R1K27m80K27j08K90j00l54J31J52R7n2Q7k41J64k6J73K1k26j83J21
$$ -125 -53 -8 83 310 -170 57 -51 239 139 -215 -84 68 165 113 200 -41 123 97 270 291 65 -118 3
$$ [...]
8191A18
##END NTUPLES=NMR FID
##END=
