##TITLE=1H_DE-106_78_TFA
 200.13MHz, CDCl3,
 8 sc
 
 1.9.2025
##JCAMPDX= 6.0         $$ Bruker NMR JCAMP-DX V2.0
##DATA TYPE= NMR FID
##DATA CLASS= NTUPLES
##ORIGIN= UXNMR, Bruker Analytische Messtechnik GmbH
##OWNER= pz
$$ XWIN-NMR		Version 3.5
$$ Mon Sep  1 13:55:21 2025 Russian Standard Time (UT+4h)  she@DPX200
##.OBSERVE FREQUENCY= 200.1313
##.OBSERVE NUCLEUS= ^1H
##.DELAY= (6, 6)
##.ACQUISITION MODE= SIMULTANEOUS
##.ACQUISITION SCHEME= undefined
##.AVERAGES= 8
##.DIGITISER RES= 18
##SPECTROMETER/DATA SYSTEM= spect
##.PULSE SEQUENCE= zg30
##.SOLVENT NAME= CDCl3
##.SHIFT REFERENCE= (INTERNAL, CDCl3, 0, 14.3821)
##AUDIT TRAIL= $$ (NUMBER, WHEN, WHO, WHERE, WHAT)
$$ ##TITLE= Audit trail, XWIN-NMR		Version 3.5
$$ ##JCAMPDX= 5.01
$$ ##ORIGIN= Bruker BioSpin GmbH
$$ ##OWNER= she
$$ F:/spectra/data/she/nmr/H-C/1/audita.txt
$$ ##AUDIT TRAIL=  $$ (NUMBER, WHEN, WHO, WHERE, WHAT)
(   1,<2025-09-01 13:53:22.92 +0400>,<she>,<DPX200>,
      <created by zg, POWCHK disabled, PULCHK disabled
       configuration hash MD5:
       00 E9 B6 7A A2 85 ED C7 34 08 36 98 17 FE 4E 26
       data hash MD5: 16K
       FF E1 8E FB 66 99 80 A2 92 6A 68 BD FA 37 CA 66>)
$$ ##END=
$$ 
$$ hash MD5
$$ 30 59 EF 53 1B 91 75 49 A2 3F C0 93 11 1F 8A D2
##$RELAX= 
##$RELAX= 
##$RELAX= 
##$RELAX= 
##$RELAX= 
##$RELAX= 
$$ Bruker specific parameters
$$ --------------------------
##$DU= <F:/spectra>
##$EXPNO= 1
##$NAME= <H-C>
##$PROCNO= 1
##$TYPE= <nmr>
##$USER= <she>
##$AMP= (0..31)
100 100 100 100 100 100 100 100 100 100 100 100 100 100 100 100 100 100 
100 100 100 100 100 100 100 100 100 100 100 100 100 100 
##$AQSEQ= 0
##$AQ_mod= 1
##$AUNM= <au_zg>
##$AUTOPOS= <>
##$BF1= 200.13
##$BF2= 200.13
##$BF3= 200.13
##$BF4= 200.13
##$BF5= 200.13
##$BF6= 200.13
##$BF7= 200.13
##$BF8= 200.13
##$BYTORDA= 1
##$CFDGTYP= 0
##$CFRGTYP= 5
##$CHEMSTR= <none>
##$CNST= (0..31)
1 1 145 1 1 1 1 1 1 1 1 1 1 1 1 1 1 1 1 1 1 1 1 1 1 1 1 1 1 1 1 1 
##$CPDPRG= <>
##$CPDPRG1= <>
##$CPDPRG2= <>
##$CPDPRG3= <>
##$CPDPRG4= <mlev>
##$CPDPRG5= <mlev>
##$CPDPRG6= <mlev>
##$CPDPRG7= <mlev>
##$CPDPRG8= <mlev>
##$CPDPRGB= <>
##$CPDPRGT= <>
##$D= (0..31)
0 0.7 0 0 0 0 0 0 0 0 0 0.03 0 0 0 0 0 0 0 0 0 0 0 0 0 0 0 0 0 0 0 0 
##$DATE= 1756720402
##$DBL= (0..7)
120 120 120 120 120 120 120 120 
##$DBP= (0..7)
150 150 150 150 150 150 150 150 
##$DBP07= 0
##$DBPNAM0= <>
##$DBPNAM1= <>
##$DBPNAM2= <>
##$DBPNAM3= <>
##$DBPNAM4= <>
##$DBPNAM5= <>
##$DBPNAM6= <>
##$DBPNAM7= <>
##$DBPOAL= (0..7)
0.5 0.5 0.5 0.5 0.5 0.5 0.5 0.5 
##$DBPOFFS= (0..7)
0 0 0 0 0 0 0 0 
##$DE= 6
##$DECBNUC= <off>
##$DECIM= 32
##$DECNUC= <off>
##$DECSTAT= 4
##$DIGMOD= 1
##$DIGTYP= 9
##$DL= (0..7)
0 120 120 120 120 120 120 120 
##$DP= (0..7)
150 150 150 150 150 150 150 150 
##$DP07= 0
##$DPNAME0= <>
##$DPNAME1= <>
##$DPNAME2= <>
##$DPNAME3= <>
##$DPNAME4= <>
##$DPNAME5= <>
##$DPNAME6= <>
##$DPNAME7= <>
##$DPOAL= (0..7)
0.5 0.5 0.5 0.5 0.5 0.5 0.5 0.5 
##$DPOFFS= (0..7)
0 0 0 0 0 0 0 0 
##$DQDMODE= 0
##$DR= 18
##$DS= 0
##$DSLIST= <SSSSSSSSSSSSSSS>
$$ [...]
##$SUBNAM0= <"">
##$SUBNAM1= <"">
##$SUBNAM2= <"">
##$SUBNAM3= <"">
##$SUBNAM4= <"">
##$SUBNAM5= <"">
##$SUBNAM6= <"">
##$SUBNAM7= <"">
##$SUBNAM8= <"">
##$SUBNAM9= <"">
##$SW= 18.0517328524113
##$SWIBOX= (0..15)
0 0 2 0 0 0 0 0 0 0 0 0 0 0 0 0 
##$SW_h= 3612.71676300578
##$TD= 16384
##$TD0= 1
##$TE= 0
##$TE2= 300
##$TE3= 300
##$TEG= 300
##$TL= (0..7)
0 120 120 120 120 120 120 120 
##$TP= (0..7)
150 150 150 150 150 150 150 150 
##$TP07= 0
##$TPNAME0= <>
##$TPNAME1= <>
##$TPNAME2= <>
##$TPNAME3= <>
##$TPNAME4= <>
##$TPNAME5= <>
##$TPNAME6= <>
##$TPNAME7= <>
##$TPOAL= (0..7)
0.5 0.5 0.5 0.5 0.5 0.5 0.5 0.5 
##$TPOFFS= (0..7)
0 0 0 0 0 0 0 0 
##$TUNHIN= 0
##$TUNHOUT= 0
##$TUNXOUT= 0
##$USERA1= <user>
##$USERA2= <user>
##$USERA3= <user>
##$USERA4= <user>
##$USERA5= <user>
##$V9= 5
##$VALIST= <valist>
##$VCLIST= <CCCCCCCCCCCCCCC>
##$VD= 0
##$VDLIST= <DDDDDDDDDDDDDDD>
##$VPLIST= <PPPPPPPPPPPPPPP>
##$VTLIST= <TTTTTTTTTTTTTTT>
##$WBST= 1024
##$WBSW= 4
##$XGAIN= (0..3)
0 0 0 0 
##$XL= 0
##$YL= 0
##$YMAX_a= 123966
##$YMIN_a= -167703
##$ZGOPTNS= <>
##$ZL1= 120
##$ZL2= 120
##$ZL3= 120
##$ZL4= 120
##$ABSF1= 10
##$ABSF2= 0
##$ABSG= 5
##$ABSL= 3
##$ALPHA= 0
##$AQORDER= 0
##$ASSFAC= 0
##$ASSFACI= 0
##$ASSFACX= 0
##$ASSWID= 0
##$AUNMP= <proc_1d>
##$AZFE= 0.1
##$AZFW= 0.1
##$BCFW= 1
##$BC_mod= 2
##$BYTORDP= 1
##$COROFFS= 0
##$CY= -3
##$DATMOD= 1
##$DC= 2
##$DFILT= <>
##$DTYPP= 0
##$F1P= 0
##$F2P= 0
##$FCOR= 0.5
##$FTSIZE= 0
##$FT_mod= 4
##$GAMMA= 1
##$GB= 0.15
##$INTBC= 1
##$INTSCL= 1
##$ISEN= 128
##$LB= 0.25
##$LEV0= 0
##$LPBIN= 0
##$MAXI= 10000
##$MC2= 0
##$MEAN= 0
##$ME_mod= 0
##$MI= 1.114404
##$NCOEF= 0
##$NC_proc= 0
##$NLEV= 6
##$NOISF1= 3.799351
##$NOISF2= 2.8
##$NSP= 1
##$NTH_PI= 0
##$NZP= 0
##$OFFSET= 14.38212
##$PC= 1
##$PHC0= -1552.462
##$PHC1= 0.7922792
##$PH_mod= 1
##$PKNL= yes
##$PPARMOD= 0
##$PSCAL= 0
##$PSIGN= 0
##$REVERSE= no
##$SF= 200.129724274929
##$SI= 16384
##$SIGF1= 3
##$SIGF2= 2
##$SINO= 400
##$SIOLD= 16384
##$SREGLST= <1H.CDCl3>
##$SSB= 0
##$STSI= 0
##$STSR= 0
##$SW_p= 3205.1282051282
##$SYMM= 0
##$S_DEV= 0
##$TDeff= 0
##$TDoff= 0
##$TI= <>
##$TILT= no
##$TM1= 0
##$TM2= 0
##$TOPLEV= 0
##$USERP1= <user>
##$USERP2= <user>
##$USERP3= <user>
##$USERP4= <user>
##$USERP5= <user>
##$WDW= 1
##$XDIM= 8192
##$YMAX_p= 0
##$YMIN_p= 0
$$ End of Bruker specific parameters
$$ ---------------------------------
##NTUPLES= NMR FID
##VAR_NAME=  TIME,          FID/REAL,        FID/IMAG
##SYMBOL=    X,             R,               I
##VAR_TYPE=  INDEPENDENT,   DEPENDENT,       DEPENDENT
##VAR_FORM=  AFFN,          ASDF,            ASDF
##VAR_DIM=   8192,          8192,            8192
##UNITS=     SECONDS,       ARBITRARY UNITS, ARBITRARY UNITS
##FACTOR=    0.0002768,     1,               1
##FIRST=     0,             0,               0
##LAST=      2.2672688,     0,               0
##MIN=       0,             -167703,         0
##MAX=       2.2672688,     123966,          0
$$ Real data points
##PAGE= N=1
##DATA TABLE= (X++(R..R)), XYDATA
0@%%%%%%%%%%%%%%%qJ6j6J6j6K4l2L2m0M8n5O3p2Q5r3J04j20J36j56J78j98K22
37A18k51K82l14L47l87M29m73N25n78O35p04P77q53R39j034J142j263J394j543
56h12J714j911K142k411K736l139L647m317N236o575Q728j2722K2489r2283r0225
71a67703K45206L2188j62108M4736J31647r7223p9116P6840j0634r9906N6443
82b9630P5385p5203k8944Q8817k1135o7241P3080P1595n5806l1839K3063j6433
94E709k0871J7361k903k0047K986Q59j5255J2415K6963L44J0245K6277k2921l1922
108a0760K1016k176l4152K8699K6921n3115k4293M4613j660k9267L7725M1447
120D4998l1103j8914L4699o306m3868J7482L2013l3765k3547K1725r627k0187
$$ y = [0, 0, 0, 0, 0, 0, 0, 0, 0, 0, 0, 0, 0, 0, 0, 0, -8, 8, -8, 8, -8, 16, -16, 16, -24, 24, -31, 32, -40, 45, -48, 56, -64, 72, -84, 94, -104, 118, -133, 149, -165, 182, -205, 224, -249, 276, -302, 333, -371, 406, -447, 492, -542, 600, -663, 731, -812, 902, -1009, 1133, -1278, 1458, -1681, 1966, -2351, 2885, -3690, 5038, -7684, 14805, -77478, -167703, 77503, 109691, -52417, -7681, 123966, 26743, -52373, 24467, 13833, -86073, -29630, 45755, -29448, -58392, 30425, 9290, -57951, 15129, 86724, 30918, -921, 22142, 5709, -15162, 2199, -704, -20751, -17765, -16906, -32161, -19746, 7217, 7561, 17806, 44083, 21162, -10760, 10256, 8080, -26072, 2627, 29548, -23567, -47860, -3247, -4907, -34174, 3551, 44998, 13895, -5019, 29680, 23374, -20494, -3012, 29001, -4764, -28311, -6586, -16213, -36400]
132c6400K7909K7142p076m757P815l435j0524L349J2375n280j6307n051m378j0917
146b5535k31J5762J8252K983o892P637N465j6570K610K3060j2140k5692O034k196
160g453k3822M391K6556J545r476J4859J1617j6935j534K5509k739k0407O373
173H484l436k8101j965J5805l809N03J4563L030o787L155J1538L334j115L147
187A8346n740j5657p560m623o268Q485Q241n556M146Q757l940M030J6840K896
201B2397o092j7o259j7663q581O318O39q957N736Q888r079O78K0778O786k353
216A3219R192M7j6280p365J380m635o902O14K484r011m944J3092R745K328J2114
231A5078Q067p366n758r22m557m042k006k375o181q896j382O913K493P697J3938
$$ y = [-36400, -8491, 18651, 11575, 6818, 14633, 11198, 674, 4023, 16398, 11118, -5189, -10240, -14618, -25535, -25766, -10004, 8248, 11231, 4339, 11976, 17441, 871, 3481, 26541, 14401, -11291, -5257, -7453, -31275, -26884, -328, 1217, -8259, 6600, 18217, 1282, -252, 25257, 22518, 2111, 8484, 5048, -23053, -25018, -9213, -13022, -12519, 2044, 5074, -1713, 1442, 12980, 16314, 15199, 18346, 12606, -3051, -10611, -15234, -21502, -13017, -4776, -10332, -6186, 2571, -1369, 2661, 19501, 22397, 16305, 16288, 10029, -7634, -16215, -9897, -9258, -18215, -12479, -3591, -12670, -11992, 8786, 15572, 13219, 22411, 22458, 6178, -1187, 193, -4442, -11344, -10730, -8246, -17257, -22201, -9109, 636, 2964, 15078, 23145, 15779, 10021, 9099, 4542, 500, -1506, -3881, -10062, -18958, -20340, -13427, -10934, -3237, 10701]
246A0701M414l481L87p2k339j984k323k258q616j0744q33M11p9J0581J0124Q06
262D695J561L346K71L98J099J220k195j0647r175l330m027L42Q054N240J989K379
278A220J344K681L368K145M797j630j0458n617l283p218q52N846K040j43P32K348
294b680L611K781N864N793l345m971j949p391n847K956L12j953j37O1L33K293
310d269L859O668M239q49j233l064n191p27m58k361M52j503l061K72J052L012
326c162O618K588k77Q46k038l183o81J01M2o53l596j907r15p19M490M635N45J956
344D690L61l869p79J790l61M91j057l084k303k272O15L879K488J752K117k142
360B316k326J321K34R80O51k323j746k179l174J422L784J126J264J727j810j061
$$ y = [10701, 15115, 11634, 12021, 11949, 9610, 7626, 5303, 3045, -5571, -16315, -17148, -16737, -16816, -6235, 3889, 4695, 6256, 9602, 9873, 10271, 11370, 12590, 10395, -252, -9427, -12757, -16784, -16442, -8388, -3148, -1159, 1220, 2564, 5245, 8613, 10758, 15555, 13925, 3467, -2150, -5433, -12651, -13503, -7657, -5617, -5760, -5028, -2680, 931, 3712, 9576, 15369, 12024, 7053, 5104, -2287, -8134, -5178, -4866, -6819, -6956, -6895, -6562, -4269, -410, 6258, 10497, 9648, 8415, 5351, 160, -567, -1025, -3386, -2934, -4437, -7498, -7226, -6174, -3162, 3456, 6044, 5767, 6613, 4575, 1392, 711, 812, 854, 201, -3395, -5302, -6217, -6936, -2446, 2189, 2734, 4690, 5051, 1182, 403, 2193, 1832, 2323, 1266, -1818, -4121, -6393, -5778, -1899, 589, 2341, 4458, 2316, -10, 1311, 1545, 2525, 3176, 853, -893, -3072, -6246, -4824, -1040, 86, 1350, 3077, 1267, 206]
376B06M25J081J092o28j023p55m510j940L694O71j67L789J149k601o45J612J511
393B961l38l23J27k761m554R39J088j144L072K915j857n69J387O10J104J393k91
410C759m54l611l176Qp39P40K383O39o43J62k0J696K625J26J502m67m206k220
428a896K06j077K29J421j13j267m41Q29K386J861J548K007k006k653p8j449j700
445b193J858k41j676q70n98N01K180K075K528P56j077r70p89k075R83N58j050
462a00j158j450j639Q70O31J845L697K19j362R86o73j525J306P12j117k434o75
479a867o17j697O5M176J155j745J977R80l376J040L002q14r73M0j718k792n84
496c748K047J217n64J597O63j800m49K965p1L3J136k076k035l11n74J76J406N16
$$ y = [206, 631, 1712, 2804, 2176, 1153, 398, -4112, -6052, -2358, -1687, -1854, 1935, 3084, 483, -162, 1450, 2961, 2623, 2300, 2427, -334, -4888, -3949, -2861, -4005, -933, 1982, 125, -444, 943, 1553, 2657, 4050, 3759, 3305, -306, -3482, -3474, -4213, -3473, -1090, -451, -1094, -932, -952, 744, 3369, 3495, 4997, 4530, 324, -1896, -1690, -2767, -2538, -1117, -1230, -2497, -2938, -2109, 277, 2138, 3686, 5693, 3687, 1034, 956, -493, -2193, -335, -576, -2252, -3122, -3720, -3219, -1039, 1036, 3564, 4320, 3243, 2273, 1484, -591, 392, 950, -100, -1258, -2708, -4347, -3477, -2846, -1001, 2696, 2915, 1553, 2539, 1866, 341, 1647, 2359, 1242, -1192, -1867, -2484, -4181, -4116, 60, 1215, -530, 1447, 2427, -949, 91, 3093, 2279, 1306, 1346, -372, -3164, -3748, -1701, -484, -1048, 549, 1212, -588, -1037, 1928, 1857, 1890, 3026, 950, -1085, -1396, -1970, -1794, -388, 128]
514A28k67k21k57P6P28J483J243j483j087M73k715r72L211jj470J440P3j954M42
533a130K065O00J02K20q36j836j284J546K82r23J612K78k434N59J573p59J483
550A118J817j181j335q45o81k47K74Q52J102j876k45P49n14J056K002L20o75o7
568A624k212l83M9r6P57L22j629l43K31L34J665J315P42L79j798j010P07j020
586c66o19J415m92k055J90j73m6J361J960J149l75p99L17k68j099Q98M98k124
604f28j088k19p82k5J535J526O61k73L92N28r83M93J434r13j672l47j218j284
622b863M77P70N37J065k14M95R6O63P05O14m78J39j734j940M51n24m90J734J78
641c19j160O47O54p8J322J404L51j039j282m26p02r01O66Q79j449L26k2r76J190
$$ y = [128, -139, -360, -617, -541, 187, 1670, 2913, 1430, 343, 816, -1899, -2871, 340, 339, -1131, 309, 382, -1572, -1130, 935, 1535, 1637, 1857, 1021, -815, -2099, -553, -271, -1194, 418, 696, -1738, -1179, 394, -365, 1118, 2935, 1754, 419, -426, -1107, -1354, -1080, -228, 874, -1002, -1247, -498, -1012, 44, 2046, 2366, 1691, 1624, -588, -971, -922, -1018, -261, 61, -1568, -1911, -1680, -1346, 319, 1634, 2376, 2755, 957, -53, 654, -366, -985, 430, -62, -2117, -1927, -2100, -2146, -785, 1175, 2324, 1949, 1150, 1467, 1199, 100, 998, 1496, -628, -1716, -1935, -2717, -2742, -1207, 319, 980, 707, 1099, 1627, 644, 1137, 2571, 1658, -14, -361, -1579, -2863, -2386, -1616, -1079, -14, -228, 267, 363, 1026, 1731, 2345, 1867, 2006, 272, -1668, -1217, -1741, -2231, -497, -319, -1479, -832, -178, -256, 1066, 2470, 2821, 1782, 500, 74, -628, -1529, -863, 16, -1433, -1107, -1129, -2105, -915]
660i15K131K60J04M41p17j087k33K53j34l70m4m83j235j44J593K37K87J355J6
679A315j061J76j67L47l5L06m16j092r03N45nJ56J389K24p22o6q5J8P46Q2J08
700H60J2q51j032L27QJ13P25K64o32k13L0L57M39o4R41n21j468L36K08k19O20
721B40O75o71l27j11q89P63M46J11nk34m80q2m9M08J007m03M39n82r54Q2Q63m61
743b14J48O07r71l56J9J42L62P44M78l60l20j98K51j32J70P72q63j053K39n63
763a098o4Q25P20l5K34j83p05K40P01M96k77l11L5j272p45L98M16J25P47J2o23
784c64M5M79J31P69j24m04J68j124n11N95o8k3K65j71o3k90j22J342N48m49L92
805A021j48j176o6L94j41J68l30q1m21n26M67Q95L91N2N64o76j29J34l56M1O49
$$ y = [-915, 1216, 1476, 1580, 2021, 1304, 217, -16, 237, 103, -267, -311, -794, -2029, -2173, -580, -343, -56, 1299, 1315, 254, 430, 263, 610, 575, 881, 465, -627, -1530, -985, -990, -834, 555, 779, 57, -9, -94, -76, 670, 752, 860, 872, 21, -1011, -684, -676, -563, 162, 426, -206, -419, -389, -32, 407, 343, 1284, 763, -705, -369, -161, -380, 240, 915, 244, -83, -194, -1083, -320, 126, 237, 232, -2, -482, -564, -613, -205, 802, 399, 838, 256, -698, -616, 247, -214, -66, 541, -430, -786, -767, -625, -263, 481, 959, 599, 279, 81, 332, 200, 370, 1142, 279, -774, -535, -1098, -1162, -337, 383, 348, 582, 399, -306, -66, 635, 1131, 854, 543, 578, -694, -1439, -1041, -625, -500, 247, 259, -364, -319, 160, 291, 1060, 936, 532, 700, -424, -935, -340, -408, -431, -166, -337, -400, -690, -812, 530, 1078, 629, 1021, 873, -303, -369, 25, -116, 52, -278, -359, -780, -1306, -839, 56, 447, 499, 1063, 387, 258, 392, 36, 77, 726]
826G26j067j75j72m39Q2R62J81K68K07m41K9n3M2N85J45p46P2q50l00K64J89M42
848d9M08k38l39L27P9k21N68q5m2k82q35J54J51k9P12O6o91R8j57pL73L64K19
871E44q4l45p05M98k30L15M93m97p1K41n16L65J12J81K24j93o08n3j19J37M86
892A75M90n65k60J76j64K73j26N00k09k05l46K72p21K11Q21n25j35N43m84j22
912d01O65J78mM77o39m78l4j41k10P95m37k9m7m38P37J51K52M25j68n97L2m74
934c85j40N03j71J87l72k33J46K3R6Q44L68n60N56l30n93K35J41n17O7l6n79K10
956e40k28L06N50L59K87l68j72K25J68k83L10j49r49O1l57j28L00O47Q0j73J40
977H6M3K21J09N5L84o05k72J34r88J05K21R6K11L64m01l25P03O9N9N82N5m66k15
$$ y = [726, -341, -516, -688, -1127, -1045, -83, 98, 366, 573, 132, 161, 108, 150, 735, 880, 134, 206, -644, -944, -680, -491, -49, 359, 121, -218, 109, 188, -33, 535, 450, 408, 126, -709, -555, -404, -433, 279, 345, -346, -248, -405, -412, -39, 325, 544, 460, 115, -590, -92, -322, -7, 486, -11, -82, 159, -357, 8, 120, 301, 525, 332, -276, -329, -448, -311, 175, 665, 100, -160, 16, -148, 125, -1, 499, 290, 85, -261, 11, -710, -499, 322, -203, -338, 205, -279, -401, 264, 442, 438, 915, 276, -202, -236, -377, -587, 208, -229, -258, -305, -743, -6, 145, 397, 822, 654, 57, 89, -385, -525, -22, -193, -6, -378, -611, -465, -442, -346, 498, 866, 306, 862, 532, -61, 174, 315, -202, -135, -171, -750, -540, -768, -462, 88, 447, 734, 366, 194, 419, 587, 304, 614, 465, -484, -423, -780, -908, -608, 39, 119, -54, 86, 129, 350, 459, 514, 898, 293, 21, 155, -833, -728, -507, -411, -200, 164, -237, -562, 141, 210, 269, 851, 906, 440, 225]
1000B25n93o8P1l09L22p2m98O92L38j93K77M78rj47l42k08J78n9j74Kl75n2Q3
1023d33l47O86J88QL25J58q18N12K45l31J24J9n30j68J37k32J16L76K59k69lJ05
1045A27k07R1N86J58p23L01Q3q81j63N71j53P2M61l50n20J49K59J31L32j54K85
1066D55n52K81j72j72K62M16n69n60P06m91mN83N6m61K94K7k29j14N96J06k26
1087B32j7J69p22m36Q49k63j84N06mq02N02N08k3l33L91K28p20RK76k87l1J14
1109c8Rn38o1Q30p93L21L82j73L19J75m70l0O24k67m19O4J06l17m05N11K1l24
1131d73J42Q13p12P5L98K19Q2J9q6n00j41k01k64L36K6J43k40q5O37k19J77N92
1153G38p6o14N42p49l33O10k66k48N7Kj17J2L88J75K63R2J07l01k20K60K9p94
$$ y = [225, -368, -436, -365, -674, -352, -424, -922, -230, 108, -85, 192, 670, 661, 514, 172, -36, 142, 83, -91, -89, -464, -516, -433, -780, -94, 94, 102, 427, 585, -233, 279, 524, 193, 317, 336, -194, -362, -225, -457, -341, 35, 294, 25, 22, 127, -80, 11, 597, 755, 32, 333, 416, -465, -628, -57, -210, -138, 323, -27, -547, -398, -139, -8, 324, 170, 455, -97, 184, 12, -160, 102, 518, -51, -611, 95, -396, -400, 183, 239, -222, 72, 99, -130, -244, 352, 458, 232, 215, 384, -338, -774, 75, -188, -372, 134, 130, -672, -170, 338, 315, -18, 373, 601, -119, -110, 166, -121, -152, -38, -29, -567, -628, 202, -591, -270, 112, -61, 258, 433, -37, -67, 557, 290, -129, -65, 41, -276, -681, -170, -149, -473, -331, 482, -230, -155, 243, 462, 544, 563, 477, -23, -164, -365, -629, -293, -267, -124, -364, -449, 188, -31, 146, 738, 662, 48, 590, -159, -492, 118, -148, -396, -339, -337, -454, -442, -54, 121, 384, 476, 583, 282, 62, 322, 351, -443]
1175d43N64o5p32J25K05k31M31M87l18K08Q0j89J96r3J10J0n61j49L59r45O10
1196c41k0Q4O6N59j90r3L62j85K42q9p4k31j69j18N3o9M7J79n45J58L54K12j15
1219G7N15l11j72L76m16n81M58N4Q1l04Rj97M82j53P7L56k58J40o5j82K54j37
1241A03j11L2J28o16L97M3l01M27l71R8L1Q0J39J4n2P39n93m14L04Lm39L66q3
1264g6j90K82j47J8j66J69J90q2J83J77j26k97K87k00q5L13Jn74K6L55m24J50
1286b16L99l23j24L07M5J9K44j83J13m10J12K61l25j22M07n38k01L26O6k36O67
1307B88K9l07L48o8j0p9j43R4l96j8L20n08K54q8M61n09M30J03R4m1O6l15K75
1330B80J48n03K00l69K6jL5P7R5k87L03J95l44L67J15o6M8J48m73k29J22l88K11
$$ y = [-443, 121, 56, -676, -551, -346, -577, -146, 341, 23, 231, 311, 122, 318, 225, 335, 345, -216, -365, -6, -951, -341, -361, -277, -211, 348, 158, 65, 427, 242, 484, 395, 321, 90, -79, -197, -144, -213, -166, 13, -532, -374, -20, 192, 77, 592, 281, 109, 485, 69, -512, -54, 0, 81, -223, -214, -411, 71, -82, -5, 351, 93, 233, 168, -14, 240, 103, -8, 24, 152, -464, -67, -24, -325, 102, -269, -171, -140, -60, 79, 93, 41, 780, 187, -227, 77, 80, -359, 7, -76, -266, 16, -131, -113, -279, -110, 80, -2, 181, 358, 232, -65, 222, 22, -63, 250, 251, -323, -297, 58, -366, -216, 183, -140, -264, 43, 88, 107, 351, 168, 281, -129, -17, 244, -81, -203, 204, -334, -535, -209, -143, -379, 288, 317, 10, 358, 290, 280, 201, 58, 152, -244, -262, 58, -450, -196, -284, 177, -332, 98, 201, 295, 254, 320, 5, 280, 428, -75, 125, -244, -218, -219, -184, -107, -12, -299, 4, 199, -145, 222, 337, 271, 319, 467, -6, -235, -113, -501, -290]
1353b90J46k86L63j42J65J95k28L60L88k41k48K26l36m09M51j86n38O58k50k98
1373e00M24O4R2K69j95L73k69j53K70n26k36K31j05l01J10J40O3J85L09l1J8J63
1395C95l83K3M04n49Q6J51k33pm21K17K08k82M86J60k18L92l00p9M0K78n28K19
1417E9j69j22K00j82l71O62j23n2K85M6j71L90n36J80J34j59K24k33k11m8J43
1438e4j81mK13m18M94r6J96q1m8j08N28l13m67O28o4m39K06j38k50M33l07L52
1460H2j89o8M54k21j30O4K43m07N08j98m52N91k30m27M4M24l24J24Q6k86K65J3
1482c4J28J68j18j59R9m15K12J52j84k89L93j16J70j38L3J85m7J34Q4M8m4J50
1504D12m35o5r1o3j71O0J43p8Q4K60k78N18j3NJ1l53K25N3l79j14N9j07K1J61
$$ y = [-290, -144, -430, -67, -209, -44, 151, -77, 283, 671, 430, 182, 408, 72, -337, 114, -72, -610, 48, -202, -500, -76, -12, 80, 349, 154, 527, 258, 105, 375, -151, -387, -156, -261, -562, -452, -312, -249, -64, 245, 214, 232, 395, 12, 35, 439, -110, -24, 127, -106, -113, -534, -317, -109, -391, 95, 255, 37, 429, 129, 50, 90, 368, -160, 59, -110, -232, -32, -214, -585, 77, -46, -98, 187, 233, 62, 452, -84, 96, 230, 71, 295, 62, -149, -197, -54, -235, -239, -26, -444, 50, -46, 150, 69, 21, -87, 441, 128, -339, 289, 225, -214, -8, -146, -396, 37, -270, 82, -107, -175, 279, 58, -72, -8, 235, -172, 336, 138, -314, 277, 47, -380, -336, 88, -236, -112, -26, -312, -47, -34, 94, 262, 144, -15, 84, -331, -119, 33, -151, -440, -47, -163, 7, -131, -98, 87, 40, 174, 258, 306, 262, 412, -23, -88, -179, -242, -413, -353, -210, -288, -204, 56, -222, 296, 283, 288, 299, -54, 171, 224, -155, -269, -210, -317, -296, -135]
1528a35j73J21Q6K17M96m8k41n4j17P0O6m41K31k08l67K60K9l01K35K07J35K41
1550C09M1q7K13j94j50j47j9o2j09r4J03N3j4M03n3K5p6M2k89M56j68J04k24J0
1574G3j66j87K52j98j43K46K3PJ36K60M0J2k88L90k17l56J81j67j24J80j1j35
1596a92l02M92k38K96J8jj3n6K46j55j97J3K86m69J92R9m92k1N21M1k85J03P2
1619d2O1K12j59K35l45j23L77k41k74M44l07K19m08l4N68j25r2J07K04k70j3P8
1641G2j26J20q3j43J97k65K26k43j90Q4L61m6J77K60k07j95M4R9k35K26k13M10
1663C30j91o2j36l6M34m49J16J05o2J76Q1j47m8j45J70J07m46K85n29L34L34q8
1685A33k13L61j95j46J96K44Nj80l05n2J6r4L09k20j18J8L48o6l15K75rj60K71
$$ y = [-135, -308, -187, -101, 116, 612, 564, 323, 269, 152, 222, 288, -153, 78, -130, -497, -237, -208, -509, -274, -67, 68, 309, 350, 263, 476, 282, 132, -15, -34, -96, -205, -299, -196, -143, -157, 246, 193, 218, 142, 184, -105, 351, 183, 287, 63, 73, -93, -280, -28, -226, -369, -123, -100, -93, 43, 303, 343, 355, 67, 457, 240, -116, 65, -102, -226, -46, -57, -192, -494, -2, -240, 56, 74, 73, 60, 4, 250, 95, -102, -89, 197, -272, -80, 19, -473, -494, 27, 68, -217, -114, -42, 19, 231, 72, 307, -38, -161, 216, -25, -299, 145, -162, 57, -351, -385, 183, 58, -34, 73, 277, 7, -6, 72, -54, 66, -17, -160, 37, -228, -2, -245, -435, -351, 10, -36, 141, 401, 194, -1, 43, 142, -93, 133, -80, 330, 139, 77, -59, -95, 339, -110, 6, 111, 49, 225, 306, 159, 111, -34, 136, 243, -203, 82, -447, -113, 221, 133, -80, 281, 86, -60, 136, 380, 385, 205, -100, -152, -136, -230, 79, -141, -259, -241, 107, 41, -274, 1, -8, -168, 103]
1708A03L97k55j32J87k5k63o6P3l27L01n2qJ77j45K5M2L46j20P0k68m6j98L64
1731A80k81L9k14L63l7k01Q3R6j61K73J44j78n9J11j19M1q1k3P6j6j78nK21l15
1755b41L09O1j26K64k59j7L08n2m86L56o1k39L6J6j73K42P0JK6jj73K85j64L01
1779B83P3l88K33j26k96m5L77m05O8K79k91j20M37l9L15m57o8L04k41K0K23q7
1801D9l02J92k95L21o8k68K50J74Q5j03O5k40L06j02L1j31J18k45K34j48j90L24
1823E7k4M2o2K58l38J82J35k80J93J7k39J96l07K29K4Q5l35P5k61K70J96l97K05
1846g9R4q8M7J53n12O35j28m82K06K23Nk22j84M17N6l7l31K95k2o4M48k87l21
1869a78J59p8j83k8k18L56O0k6K12m77O37j34l89L31J54q7p3R3k98j00L4J34k87
$$ y = [103, 500, 245, 113, 300, 275, 12, -54, 19, -308, -7, -59, -67, 110, -35, -10, 32, 378, 258, 328, 60, 14, -184, 180, -101, -62, -276, 87, 50, -151, -68, 28, -133, 140, 284, 106, 47, 158, 39, 80, -1, -24, 52, 36, -142, -147, 74, -241, 68, 129, 3, 267, 8, -9, 299, 247, -239, 117, 56, -183, -147, -131, -304, -62, 8, 9, 35, 34, -139, 146, -18, 283, 356, -32, 201, 75, -221, -266, 111, -294, -226, 53, -238, -358, 79, 40, 355, -102, -170, 134, -107, -87, 136, 49, -253, -61, -356, -35, -103, -371, -121, 53, 138, 35, 100, -140, 166, 64, 95, -36, 82, -163, 71, -77, -267, 57, 33, 75, 13, 271, -67, 115, 250, -30, 163, 180, -59, 137, -170, 59, 83, 168, -167, -92, -353, -83, 113, -284, -79, 15, -73, -26, 127, -385, 250, 122, -360, -154, 69, 74, -148, -332, 85, 141, 104, -227, 68, 46, -18, 430, 143, -178, -19, -97, -280, -308, -526, -170, -110, -136, 76, -401, 236, 102, -287, 44, 198, 111, 38, 131, -167, -267, -233, -99, -386]
1892c86M49j43p2L01j21o3J74ok22O1k9L43k38m13K69Q5q5p9N15o66M71J09l97
1915a43R8m5q0J35L6j21O5k87J88NJ23n0m1J22k19N82k16LJ12m51K77j97O2J8
1939b4J62m34l8L3K71P2j77R9J41kl3R7K4j86L6R4q5j46J24j35J17n5j15j34L97
1964A03J10m3K8Ml6k20J25j71J78Q9O2l19J70j51k19L03J1J31j55K4K15m7j32
1987F0lL1j50K5J1m27O01j83%J2k8m7M99l73l6J19J87m8o3k56Q7q8o5Q9J9j0J01
2014F4m6k37K76J37j4m0n8P0j3m12K22n1J62l0l8O4l41K42Q6l9K85l67K5J18k25
2039a60K51n1J68k51J73q5j70K11l06J81J14n4m7K65k97L26p5o1J33m2j06jk24
2062a08r0M0j16K52J20L7l92L04j96J16L18M0r9j67j31O8j59k18L83J47k14qJ43
$$ y = [-386, 63, -80, -152, 149, 28, -35, 139, 133, -89, -28, -57, 286, 48, -365, -96, -11, -96, -175, 340, -326, 145, 254, -143, -45, -90, -170, -35, 1, -120, -55, -342, -154, -149, -26, -76, -117, 5, -214, 368, 152, 155, 267, -184, 93, -104, -42, -24, 138, -296, -334, -301, -30, 42, -135, -36, 105, 103, 70, 167, 191, 5, 41, 135, 50, -96, 28, -107, 10, -45, -160, -294, 103, 213, 170, 198, 202, 166, -54, 71, -100, 78, 167, 229, -90, 80, -71, -290, 13, 24, 155, 0, 24, 239, 192, 60, 57, 88, -62, -37, -26, -453, 148, -35, -35, -23, -51, -98, 401, 28, -8, 111, 298, 250, 187, -69, 18, -70, -135, -46, -27, -37, 64, 18, -219, 57, 194, 180, 140, 82, 152, 139, -273, -51, -102, 60, 30, -8, 56, -285, -43, 43, 4, 289, -78, -53, 65, -160, 91, 40, 208, -43, 130, 45, -125, 86, -220, -39, 75, 21, -26, 239, -58, 268, 193, 132, 265, 223, 117, 116, -108, -198, -158, -274, -22, 98, 135, -257, 47, -149, -33, 285, 325, 226, 59, -72, -4, -163, -381, 2, 149, -65, -73, 70]
2085G0j69j07J58l2J35N2J85k93J95M3j28j45n5J94j17Jl6k31N44j67j69J76J6
2108A20O6l67L24k91j62L01K8O4Kl81L35j50J51J84K3j73l12M46m80L59j37J07
2130E7o0J73k61J61k04J89J95l65K51j77J41N0l1P7m8k70J31q7l02L97o0j70K2
2153a91L50l4j92J92j98j59J04MP6j27m3R0l3J93k23K13P9j11O3o2L07k24J00
2176A74j83j8k9J79l28K31k3l8p2k0k31M26N2nL8q3j97R4j7K9J12k70o9N74l10
2201A6J26l92R0l03L04j89M82r1J42m7j04k84J79L35k12J15k59K06j30K09l56
2222a63L40R5j67j90K6N7J3L4k87J99p3K24R5k84J63m03J82O3k0J26k02L06l04
2245a70L76O6j81j29J79O3j76K5j84K24jk36K31q0l03L43l17K51m0K31k57K72
$$ y = [70, -99, -206, -48, -80, 55, 107, 292, -1, 194, 237, 109, -36, -91, 103, -14, -13, -49, -280, 264, 97, -72, 104, 120, 186, -181, 143, -148, -310, -9, 19, 83, 85, -296, 39, -111, 40, 224, 247, 74, -238, 208, -272, 87, -50, 57, -3, 170, -91, 70, -134, 55, 250, -115, 136, -41, 100, 150, 119, 196, 148, -122, 9, -78, -380, 17, -43, -213, -191, 159, 125, -67, 125, -73, -232, -128, -124, -48, -175, -218, -128, -161, 32, -191, 22, 101, -10, 53, -9, 298, 74, 174, -9, -27, -56, 123, -205, 26, 3, -35, -107, -127, -358, 68, 120, 115, 153, 70, -127, -33, -50, -21, 91, -179, -248, 326, 16, 142, -250, -160, -463, -159, -348, 134, 43, 185, 138, 34, -250, -71, 264, 52, 167, -92, 114, -16, 193, -163, 177, 272, 105, -85, -59, -2, 11, 45, -242, -43, -116, 108, 203, -81, 82, -321, -139, -76, -96, 30, -172, 134, -170, 206, 272, 91, -38, 141, 204, 28, 53, -131, 93, 92, -144, 87, 7, -296, 47, -270, -19, -59, 172, -85, 187]
2267A87k8P4j19l39L7P5r0J15J99m62K96n2O3L4l07M15J46j61j47J77l87J81l7
2290a30J08j19q3L0O0K71l13J64P6J21J4M9j24j05k49K26K55k28j36k25L60k13
2312a91J06K06j80Q7l05K65p7K07n1K3j53Rj20N0L99l60J71k14K35k38M93l64
2334bJ41J0j77J15k94N7K26k41K79q7k95J27K58M5l42K36r1r9J44k29K55j3n3
2357c0K81k57j11n7M3m1K05j98L54l36L87l19l5K57k04l8j6K77k25J03m9J96j26
2380F1p3m5L00KJ9l55J54P6k07L27l07Q2j19j0R2m1O6J74o8j93K42j06J00j49
2404B2j53K10L25m93J11n3j61L35q3j81K73j48k52M69p3k68Q5K61p3K73j95j98
2426C3K9j1J77k53J88O3j56k27J81Lk04L45Nk58K8O6L9p1j22J02J31N5m10K81
$$ y = [187, 159, 233, 114, -225, -188, -113, -203, -88, 111, -351, -55, -107, -44, -10, -317, 98, 244, 83, -64, 113, -274, -93, -130, -22, -141, -224, -194, -134, 137, -176, -12, 64, 185, 199, 248, 124, 19, -230, -4, 251, 23, -113, -338, 22, -191, -85, 121, -59, 28, -277, -12, -89, 118, 67, 90, -63, -54, -174, -124, 275, -85, 86, -128, 107, -131, 362, -2, 139, 149, -28, 87, -207, -150, 76, -165, 114, 27, -268, -141, 117, 162, -180, 56, -35, -134, 10, -219, 36, 23, -30, 251, -6, -117, -174, -131, -172, 33, -165, 189, -147, 240, -79, -114, 143, -61, -99, -115, 162, -63, 40, -9, 187, 61, -12, -57, 243, 245, 264, -91, 63, 139, -68, 259, -48, 34, -85, -95, -3, -44, 22, 196, 128, -65, 177, 71, 171, 22, -131, 79, 404, -89, 22, -31, -192, 143, 60, -121, 152, 4, -248, 221, 148, -120, -35, 226, 153, 426, 231, 33, 62, 51, 228, -25, 163, 226, 70, -157, 24, 27, -177, 168, 173, -85, -57, 9, 48, -23, -145, -43, 88, 143, -267, 14]
2450A4j53K99k48lJ49j03J74J4Nj59p8L38l14P9k7N9k56J33L76n80M53m4l13K34
2474D9N4j5p9k32L67j99j29P0J92k94K83n7q9mJ76m6P9j60Qj09J71j84k4L96n52
2499c28N4J03K57j0k35O7m8J66J14k67L08k79K65k8j32k0P0K48l88p2J99N9j39
2522c6n3j53M32j82J67l12N9K43l09L5L24k81L1J13j11M5K6Q1j68L17l40J12n7
2545a7m1L2J73j57r7K67l96L61l47K76k11L20j37k6R3k93M53m8j98J51k31K33
2567A60k05j18J35p7R2l06L30o0PJ83QN4l18kM28n1k55K8O3qk11J06J7k7M6O5
2593H4oM9q8k31K24n5j12J55K91k77j58N2K60k18j24P5J4P6L40k60m46L47OJ82
2617A80k06j7J53K05l69j09J36k8K2P1k6J53j98k7L41j30J27j50n0K61j00j78
$$ y = [14, -139, 160, -88, -91, 58, -45, 129, 143, 148, -11, -89, 249, -65, 14, -13, 46, -210, -77, 299, -281, 172, 128, -185, 49, 103, 88, 9, -223, 144, -55, -184, -114, 78, -216, 67, 10, -79, -83, 93, 47, 126, -34, -26, -135, 36, -148, -172, 224, -328, -274, -171, 86, 76, -159, -92, -140, 26, 140, -127, 181, -98, 167, 139, 7, -13, 57, 305, -83, -155, 44, 103, -36, -89, -242, 190, 8, 175, -137, -78, 165, -144, -109, 215, -66, -35, 78, -33, 12, 38, 119, -49, 268, -72, 40, -17, -58, -26, 147, -10, -107, 160, -236, 125, -222, 54, -157, 163, 26, 0, 93, -200, 253, 205, 7, 158, -73, 160, -45, -163, -28, -105, -13, -319, 11, -49, -42, 141, 149, 203, -115, -117, 311, 260, 5, 33, 96, 88, -123, -17, 0, -27, 19, 84, 78, 127, 39, -192, 32, -23, -135, 20, 311, 34, -124, -72, 188, -30, -154, -79, -65, 11, 351, 91, -355, -8, -2, 180, -26, -43, 110, 315, -54, -163, -27, -55, -33, 38, 12, 165, -33, -60, 281, 151, 278, 128, 78, 339, 239, 61]
2639F1k35J45n%J83m5j94J8l2j9j13J90K08l42L12l61J86L02l00O6j59L17j24
2662E9q3j2P6J13j6k3n09L49k89M21k87K0J05o3J54k56J36k5J83j76r6L13k33
2685a39J08K9J31J32k22p9K1KJ30k65K73j75Q5J34k30J89j30k03K35k08p3J04
2707a51N8QO4O5k98L83j82n2K5M4K76j22N9k38O8j07K03J0k92J59Q7n7O9k61J33
2732d9j4L3J05J51k99lp6K18J11Q6k56l36L47j11j09L87o5j2n38O11j47kl3kK85
2757B82J90o51J30k31N44l54K96j11k79K6K12n1k27J46N06l83M5j49l74M86j15
2778f2R8j97o0O9K7KM0j04L56j08Nn6l10L48j77k0J37J62k56Qq3NK8K48l7n3N5
2805F5k17Q1J62n5l19K21K45R0m24M59m32J89r6N7m2J97j40R2K4k00jo1J06R4
$$ y = [61, -174, -29, -34, -34, 149, 104, -90, -72, -104, -123, -236, -46, 162, -180, 132, -229, -43, 259, -41, 25, -134, 183, 59, -24, -36, 40, 153, 137, 114, -395, -46, -335, 86, -201, -181, -76, -139, 15, -241, -105, -130, 53, -123, -219, 94, -139, -31, -2, 129, 261, 39, -40, -19, -17, 113, -152, 121, -54, 31, 165, -65, 124, -6, -209, 26, -182, -255, -151, -93, -85, -21, 44, -254, 129, -53, -105, -80, -36, 240, 118, 177, -61, 7, -100, 103, 113, -179, -20, 67, 10, 79, -182, -49, -63, -30, 75, 226, -73, -76, -152, 66, 177, 263, 7, -329, 18, -93, -202, 185, 120, 108, -430, 181, 34, 32, -1, -3, 282, 472, -179, -49, -280, 264, -90, 206, 95, -184, -158, 54, 3, -224, -78, 428, 45, 90, -59, -433, 53, -62, 36, -161, -221, -152, -125, -123, -83, -187, 169, 61, 66, 10, -300, 48, -129, -149, -12, 150, -106, -98, -181, -176, -148, 100, 63, 10, 65, -152, -71, 91, 36, -283, -62, 183, 273, -151, 308, -124, 65, -31, 26, -16, 181, 41, 133, 157, -43, -44, -105, 1, 95]
2829I5j75j4K11k76K61J09j81M2o2J35j00J68l58J31j87J31K98r4l75N9K05l31
2851c08L25k6k73O23k76Kn3nJ9j3M7j89K68Pk68K52j11j32K12n0q5l83L02J84
2875F9%k82NJ08L9J38K92n80N10k02j03J80j25K73o27R6M71j63j54J64m2O5k72
2898a40J15j4L6j69M0L92j31k12L1P4j64R8l1Pp7j71J36K39Qk75L01j9q2M06k65
2923A33Q2j11p5k14K73k42Q8l2R1l8K62l47J48J56j90J14J01j79j1p0J40j72J21
2946B8J36l00K95l44pN6Q4K06k10o1J02J18K1j18j2K0l70M60J21k77J2l8J20j09
2970f7j65J9M13j56q5O8J04j10n6M1q5K71lk18o5j44L74j50j59o4J17J90j02q1
2994a13M6j9K54j82j82K38L9O7q6k04o2q8L75L4Q8l44J32K1M7K5K04l99Pj74K49
$$ y = [95, -80, -94, 117, -159, 102, 211, 30, 72, 10, 145, 45, 213, -145, -14, -201, -70, 228, 134, -241, -182, 23, -308, 17, -9, -282, 341, 65, 67, 14, 9, 28, 15, 62, -127, 141, 148, -120, 132, 21, -111, 101, 51, -34, -417, -115, 69, 69, -213, -208, -100, -61, 77, 369, -211, 299, 97, -6, 174, 49, 322, -305, -209, 262, 99, -55, 109, 67, 132, -140, -25, -39, -3, -172, -132, 260, 129, -83, -52, 22, -142, -44, -75, -68, -145, -316, -180, 59, 67, -208, 93, 74, -8, 398, 133, 215, 104, 29, -185, 88, -154, -66, -98, -7, -45, 217, -130, 18, 174, -16, 98, 199, 20, 9, -61, 79, -93, 28, 164, -136, 159, -185, -192, -136, -52, 154, -56, -117, -15, 103, 124, 6, -6, 14, -356, 104, 225, -52, -40, -78, 42, -67, -232, -213, 200, 44, -41, 27, 131, 21, -35, 6, -79, 192, 189, -29, -94, -238, 136, -14, -173, -237, -120, 70, -32, -113, -67, -86, 168, -14, -196, 42, 81, 148, 62, -142, -204, -292, 83, 117, 205, -139, -7, 14, 61, 86, 290, -109, -102, -276, -27]
3019b7j80R7R7J28j65k30L99J2L1k82K63k42J12k78J51J81p9k01J98K30k74K0
3041c9%m9L37j60q5Q9j21K52k17J91k94k03K14J78j85L62o3k45k06J49J37Q9r8
3064C3Q3l82N71j84k88M30l55J24l36L38K7k1m8M6k61M11j03m4j1n4j59M17N5
3087B89k67k77L31O9r6m8r6J10j18J30j4l02J58J34j2R5j88J97k62J78k6K28m95
3110b82K77r4O4n6L09q8n9q5P0l8j4p2r1K45p0k31Q0L4N7O2k8j17N2J68J3r9L6
3137D3J74m12M17l06R4q2j01k0K59K7j47q7n7l0j5M37j25j35J61k60Q1O1L7k3
3161iJ11o3o0j68J49J33j51K91q9J30n6n32K08J64j27k1J60L1k92K24R5l6J78
3184B70l0k80R8K10l56K67j33j65k5J23Q6r5kl05N13j91j79L54j73P2j31r8J49
$$ y = [-27, -207, -110, -13, 115, -50, -280, 119, 131, 162, -120, 143, -99, 13, -265, -114, 67, -12, -213, -15, 215, -59, -39, -39, -88, 249, 89, 4, 93, -28, 224, 7, 198, -96, -299, -85, 93, -92, 270, 207, -38, -244, -95, 42, 131, 33, 116, -266, 305, 121, -167, 263, -92, 32, -304, 34, 61, 40, -8, 38, -223, 188, 85, 41, 30, -24, -183, 234, 289, 22, -255, 76, 145, 49, 1, -95, 15, -103, 27, 13, -289, -131, 3, -9, 86, -102, 95, -167, 11, -15, 213, -282, -5, -99, -35, -91, 218, 130, 71, -14, 56, 18, 4, -68, -159, 86, 16, -215, -135, -101, -44, 18, -10, -127, -75, 93, 106, 7, 43, 217, -195, 222, -84, 10, -72, -173, -193, 66, 93, -54, -141, -198, -228, -243, 194, 69, -66, 95, -165, -84, -23, 14, -9, 102, 39, -21, -189, -40, 93, -58, 233, 144, 274, 218, -314, -106, 58, -69, -90, 70, 101, -191, 33, 128, 92, 270, 240, -40, 58, 268, -88, 179, 46, -119, -144, -21, 65, -30, -32, -337, 176, -15, -194, 160, -13, 59, -72, -170, -21]
3207b1j62J80J22r9nK9n7k73M27j15j7J66j72q7J12j6k0K84j75j69m8L76l85p
3231a32J55L6j5J08l41L20j22J67k43J17m1k06K27k6J17m2n8j87L61j57KOqj84
3255a46P8j16K87J10j10N7m7l09K87k33L74n61J48M35k34j33L24k19r8O0j25j25
3277b96J7L28j47J63k43J97r0q0J75L7j70L76l28j7K3J02R3k63j4J46L2M5j40
3300e4K33k53j03L06j50M7j08K66l94L92k59J94m44K86K49j16L3j02q4J53r0k46
3322b44K55j46K01m3j82L33m20K11j1j92K56j66L85k20j13L89m36K3lKQ2j6l25
3345c80jK29O7K32k74M79j61k35j16M52m00J3lK22m27L04p2j41L14j60p0P1M00
3368C43m27j16K06Q2m30M10K17l52O0j72M09j61%q4L1j06Q1q2j33R7K5L84k95
$$ y = [-21, -183, -3, 119, 20, 15, 44, -13, -286, 141, 26, 9, 175, 3, -84, 28, 12, -8, 276, 101, -68, -116, 260, -125, -132, 23, 59, 44, 152, -189, 131, 9, 176, -67, 50, 9, -197, 30, 4, 121, 79, 21, -166, 195, 38, 40, 46, 38, -146, -68, -184, 103, 213, 103, 160, 113, -196, 91, -142, 232, -329, -181, 254, 20, -113, 211, -8, -106, -46, -171, -296, -279, 49, -98, 65, -178, 19, -71, -151, 24, 61, -109, 267, -61, -78, -55, 47, 140, -123, -137, 9, 41, 86, -54, 179, -74, -177, 129, -21, 26, -82, 184, -210, 182, -77, 117, -327, -41, 208, 92, 125, 23, -61, 92, 2, -244, 11, -135, 66, 23, -159, 174, -246, -35, -46, -238, 18, -148, 237, 17, -96, 293, -143, -120, -123, -121, -39, -55, -380, -381, -152, -85, 147, -127, 352, 191, -44, -160, 292, -108, -95, -98, 124, -303, 1, -71, -212, 102, -58, -128, -57, 343, -84, -200, 6, 88, -342, 68, 285, -67, -7, -179, 230, 69, 69, -15, 16, -90, -9, -91, -224, -127, -102, 282, -13]
3391a3L7j92K14o6J2J67l34J70j7K07j18p3Np2J25K6P9p4Qj65K60n9l66K18o0
3416h1L43K4k25l1J30k79Q1J97m0j33j16K64k01O2J11k95R2pp2L95k77J01j30
3439h7M28m53J84N8q5n0k2M6N6j96Q3P5k10J14M1P2J32j82o6p4K64m50L40J0n0
3464b2j1P4l77J27J91J22m9j29R8Ok0L29r6m0k86J53Nk54K62k30K14m9o9j09P9
3489h1M3k0P8J9K25l42O0K65m20L06j25J69j32N0j76L02M9L6l02R1k06K67j46
3512A0J08j17J34j09j10k1L4k0R0j81L43j70j15k1L1j32K36K31j59j21J0K2L3
3535Fk79L85k87J47k39K27j05R8j24oM08k45j66N53k87J49j37l84K90l3J29k16
3557a16K16m26N26m4j70L0M7j21L8O2j20J9m6L0q5J1J75Q9j53o9M4j77J14K14
$$ y = [-13, 24, -168, 46, -20, -8, 159, -175, -5, -22, 185, 67, -6, -1, -73, 52, 78, 157, 83, 91, -74, 186, 127, -239, -21, -81, 262, 286, 61, 30, 160, -119, -38, 159, 119, -14, -130, 134, -67, -5, 106, -189, -97, -104, -176, 219, -58, 43, -87, 341, -112, 72, 130, 45, -5, -27, 19, 75, -121, -38, 37, -173, -59, -18, 54, 186, 4, -62, -136, 128, -322, 18, 28, -22, -33, 41, -336, -209, -18, 104, 55, -74, 24, 30, 10, 339, 243, 203, -83, 70, 75, -179, 83, -147, 67, 18, -51, -160, -81, -38, -58, 20, 39, 264, -78, -18, 247, -173, 133, 8, 177, 45, 95, -81, 221, 270, 306, 4, 95, -111, 156, 10, 118, 1, 135, 26, -84, -105, -71, -91, -1, -182, 161, -9, -124, -145, -114, -246, -10, 221, 62, -59, -49, -27, 6, -273, 112, -175, -28, -267, -40, -145, -47, -171, -177, 231, -14, -180, 373, 86, 235, 98, -286, 4, -29, 100, -116, 100, -326, 200, 156, -14, 16, 63, -58, -20, 42, -78, -59, -105, -75, -160, -149, 26, 115, -38, -107, -63, -240, -126, 88]
3581H8o3j29L56k77K21j59j4j20J81k68K12M9j09oL16o71M35j07o9M45m04O6J02
3604G5j14J05l69K96j57j18J14K22P4j19j68L3J22l3J43J81o46J79K11q5r4J79
3626C1k70O2J19P7mk93K51J43r1k34M67j27k05j27J5J91R2k81K46o0q5Q4J42L3
3650A76k21m8J54j65j07J72k98K99l4J10K1k28M83n5k55J3q2O2n4N3j79J16K24
3673A57j91K31J11k28j02J33J33k54J04j25J61L9J19m74K89j79M2L11k57j98J45
3694c3J24m39L40q6J53k18K51J3j83L20l83K41k72n9N38n19K03j3o9Q5p3M8J48
3717A17M2l44K30k57K25J53j86O9p0J29l78N6J07p5K16O6L1r3l7j89J39K17J02
3740B70j07j7j68k87L44J64m08L13k09K9q2K84l0j58j07L08k66J73k49M48k93
$$ y = [88, 25, -104, 252, -25, 196, 37, 23, -97, 84, -184, 28, 77, -32, -38, 278, -393, 42, -65, -134, 311, -93, -27, 75, -39, 66, -303, -7, -164, -282, -168, 54, 128, 9, -159, -126, -4, -37, 106, 287, -359, -180, 31, -54, -148, 31, -239, -177, -58, 19, 15, -278, -27, 116, 25, -209, 258, 131, -74, -201, -186, 5, 97, -184, 62, 2, -83, 1, 143, 176, -45, -93, 61, -104, -211, -39, -337, -38, -72, 38, 59, -169, 314, 259, 4, 17, -65, -3, -57, -4, -183, -67, 157, -34, 197, 308, 80, -22, 111, 244, -10, 94, -31, 130, 169, 288, -186, 103, -76, -34, 277, 20, -178, -33, 91, -348, -8, -94, 59, -159, 92, 105, -78, 242, -141, 100, -172, -231, 307, -212, -9, -22, -91, -6, -79, -31, 117, 159, -185, 45, -212, 13, 166, -20, 49, -21, 108, -270, -214, -107, -182, 34, 100, 131, 38, 1, -188, -49, 168, 270, 163, 146, -22, -309, 35, 199, -209, 104, -105, -76, -158, 126, 96, -62, -169, 139, -127, 46, -203, 245, -48]
3761d8J78J75k12k9q5K98l31K90k87M0K2j60L8K78j83K53j25j06M1l97J85J60
3783ejJ64Po8j36P6L2j66n0K55l0K2j05l6L25k41q2l6J1J6P8n7q5J66L5k08K7
3810i2M1L20l64M1l9J62k50J8J28J69p4M2l08K78p1L4n5j30J97J95l22J33k8K00
3834B25m86M52q7l72L80q2J78l79M75k55j71K27o4o4J26p1J8j04J65p9n5K05j11
3857G1k48m8K62j97K72J55l24KJ32M2k90K0L14j20j00Rj02J05nJ45m41L53j0L3
3881C0J92k57k79K62J32k63J06N7K1j18Q5M0j09O1j8j99L02J01j94K31n57M75
3903A01o7R5M1pk4j6j01j74L74j81o9j05QJ12J38j79M06l52j56J02M4p8J4O1J19
3928A06j11K10k45K40j59J27k33P3p0N3N9j29o7j17L28k3K48j48j70J85l81J91
$$ y = [-48, 130, 305, 93, 64, -21, 277, -54, 236, -51, -11, 11, -149, -111, 167, -16, 237, 112, 6, 47, -350, -165, -5, -6, 158, 165, 97, -39, 37, 69, -97, -147, 108, 78, 100, -5, -41, 284, 43, -39, -75, -64, -48, 30, -27, -112, 54, 89, -119, -92, -51, 269, -95, -54, -93, 69, -181, -163, -35, 134, 60, 102, -206, 72, 1, 35, -20, -150, 47, 242, -80, 53, 25, 225, -261, 191, 104, -268, 112, 30, 208, -171, 304, 49, -122, 105, 41, -23, 103, 32, 50, -54, 111, 32, -23, 182, 71, -177, -225, 37, -160, 112, 267, -57, -55, 77, 119, -171, -151, 163, 43, -57, -48, -150, -45, -50, 95, -346, 7, -3, 30, 222, -35, -314, -52, 80, -183, -77, -20, 1, -117, -32, 8, -101, -40, -58, -257, 45, 146, -48, 183, -374, 101, 34, 129, 170, 163, 139, 123, 22, -152, 222, 41, -28, -133, -125, -13, 125, -54, 352, 0, -156, -54, -10, -88, -74, -13, 106, -5, 205, -40, 200, 41, 168, -65, 8, -62, -9, 50, -79, -146, -263, 65, 42, 290, 142, -28, 157, -224, -33]
3950c3QJ0J19n5Q0k66L24p1k1O7n1k92L03j37Q0Q8N0m09J48K33l18P5J82n3m3
3975A8j29J10M3l15L32l04L61N5k99q5O3J11J11k02L43l59K69k56l5J11k39R1
3997b05J8K03r3Jj67L55O4k28J44K28m04L26k96K39j6j54L75o63J04K38n36M24
4019d3j47J66J39k37Q3L2mj04j20L40k58o8p8L10p2K27m29K35n9J15k79K40k1
4042c2k7L5K11m91L05j56J59L08l80J68j10K4K71l82J91k77K26%J15R4l85J51
4064A8KR4K28l27j02J4l9K58k07M4N3J97l55k0J20J61j3j05jk51o7L16OJ11k08
4089g3j37J79p8P4p9K9J97J01r8j98l0J22K0r3J82m28K95qK44j26j01O9j96r2
4113b25K44j19Q8j17M6R8l4j93J43N7J15J58k98n8j5m2jL07q7L5Nj01k3L32n77
$$ y = [-33, -25, -15, 104, 49, 129, -137, 187, 116, 95, 162, 111, -181, 122, -15, 65, 153, 203, -206, -58, 175, -143, -68, 114, 61, 18, -111, -1, 42, -273, 59, -245, 116, 171, -128, -213, -150, -39, 72, -130, 213, -146, 123, -133, -168, -57, -296, -205, -187, 16, -77, -76, -243, 112, 176, -52, 92, 320, -84, 242, -54, 185, 169, 15, 390, -273, -169, 69, -467, -43, -190, -24, 115, -122, -39, -7, -11, -115, -235, 105, -153, -221, -299, 11, -61, 166, -263, -28, -87, 28, -251, -11, -32, -59, -24, 187, -304, 1, -155, 4, 312, -68, 100, -10, 14, 285, -97, 94, -183, 43, 43, 158, 252, -133, 18, 20, 114, 342, 15, -87, -73, -112, 146, -61, -17, 36, 233, -122, -142, -22, 139, 126, 21, 20, -231, -298, 18, 24, 135, -73, -210, -31, -109, -35, -114, -85, 112, 213, 115, -83, -113, 9, 29, -64, 118, -310, -15, -23, 221, 95, -6, 63, -133, -225, 19, -100, -12, -129, -83, 15, -19, -212, -69, -12, 103, 261, -37, -95, -110, -152, -153, 154, 67, 102, 107, 6, -17, 315, -262]
4138b62J89P6J43Qm2o9P6j82K70j84K99l65j3J09k44L83j67Q3l9j33K43l07o9
4161a97J15J76l35M21m2n24L27n9M47j58k38r9R4j5J66j08k99M00k07L7K6j32
4183b04K25j25Q6l42L27K60j25k08K45k15J8K34l30K36Ll4j7k25j28L70K66m90
4205a73N7P0R3j78P3k13M81k66K3J4l10K36L7j33K98o1Rj65NK71l17Q7M7J7j44
4230a42J39j45J37k29K43l4J2J43k15J71k04J00k26J34J13pL0%J31m48K76R8J66
4253B43j86k7j63m1M06l49J48j06j1J13j06n1J79j56J28Q2k72J6L17q3l04K71
4275D8n0p8K17j21n2j23J2M34k38K2m8P0kJ19k77J04J89k60M3K5Q1l33J69j02
4299a51K21J64m74J33J99j86k8MJ65%J43q8n9k27K16r3j1K11j21j70Q5m9K79j44
$$ y = [-262, -73, 3, 146, 154, 112, 43, 119, -63, 207, 23, 322, -43, -56, 53, -191, 192, 25, 108, 69, -64, 179, -128, -197, -82, 94, -241, 180, 138, -386, -59, -118, 329, 171, -67, -166, -72, -87, 79, -29, -328, 72, -135, -98, -72, -204, 21, -104, -18, -360, -33, 227, 102, -106, 139, -76, -58, 176, -154, 82, 85, 51, 34, -191, -319, 51, 317, -173, -116, -46, 47, -131, -58, -271, 210, -56, -33, -19, -329, -93, -56, -189, 109, 48, 57, -108, -103, 168, -149, -62, -15, 2, -142, -3, -148, -11, -240, 3, -31, -19, 124, -91, 80, -124, -24, -250, -116, -3, -10, 20, 20, 151, -297, -21, 77, 243, 57, 30, -133, -174, 232, -117, 31, -75, -86, 27, -79, -130, 49, -107, 21, 103, -169, -153, 164, 81, -223, 48, -2, -80, 137, 16, -36, -159, -147, 287, 49, 71, 23, 93, 91, 210, -67, 37, 226, -34, 9, 34, 115, -218, -49, -151, 70, 234, -240, -107, 92, -94, -122, -118, 47, 47, 190, 102, 43, -184, 32, -61, -72, 139, 18, -152, -67, -116, 163, 19]
4323A9j33L55k20k21K15K2J09j91j95L57r9k5p0N7J72j68K4j40L34k4j69K7l4
4346BJ39n5m08M00M4q4J34j23n2J48j46p4N4Nj15J32nM3J55j01l46L08m7m9j66
4371b07J13j0j48K92j50K07k30L22m72M51j26j61K44k09l26N39l18M64k79m21
4391d25L49M8p3J44K24k35N9K8j96k26N15k52N3J8N9k0r2k1P2L6l0j5J45j07J47
4416B05m1j81J5j55NJ80n1r4R6K61l51j85L38r5N4k19p7L19l3J2L0j74K68J1J5
4441A53j31P2l26J24P2K20mj06K3j4k02J26K62k34j69J04j62K9L17q9K4k15K51
4464A25j16k15NJ60M16m78R7Q7J71j87J03Qk26K90k79J36j23l0O2r9L02j91j95
4487a77J62r3P2m3J48r6m8o8p2M60m26M76k53Q4j14j20OK7K36l08J07N3J29k4
$$ y = [19, -114, 241, 21, -200, 15, 37, 146, -45, -240, 117, 18, -7, -77, -20, 152, -16, 8, -132, 202, 178, 9, 36, 2, 141, 86, -322, 78, 122, 38, 172, 49, -3, 145, -1, -75, -21, -16, -131, 1, -4, 39, 194, 93, -253, 55, 8, -41, -207, -94, -104, -252, 40, -110, 97, -133, 189, -283, 168, 42, -119, 125, -84, -410, 129, -189, 275, -4, -425, -76, -28, -101, 43, 267, 32, 91, 119, -77, -303, 212, -40, 13, 31, 90, 70, -22, -43, 29, 65, 35, 20, 165, 58, 205, 164, -17, -2, -157, -152, 28, -23, -117, -21, 240, -111, -296, 42, -53, 1, -218, -295, 24, -9, 3, 33, -141, 127, 138, 153, 22, 94, -232, -108, -36, 184, 180, 74, 97, 83, -119, 7, 269, 35, -134, -30, -192, -163, 154, 65, 89, -126, 125, 9, -206, -201, -41, 375, -103, -6, 81, 252, 65, 168, 176, -50, 240, -39, 97, -26, -56, 6, -93, 209, 18, -177, -15, -108, -36, -79, 69, -27, -75, -143, -215, 245, -181, 295, 42, 126, 12, -108, -102, -75, 161, -147, -40, 13, 142, 118]
4511A18k94J00j69J88O2N2j83k21M65J10N2l41k80L97J12k23J01r5m6J42L0Q8
4533A65l13N1K71k47J48R1j17n2j1L2J61j00r0k8J06k8j57K64Q8k80j4J55K3K96
4557D14n67L35p5j87Q1L5J98k38r4L9N9j93K80J3j4k3L5n4j88L36K5k22n1j48
4581b04J25K67j37m8r2JL9J30k52L85j73k6M6j10K99k24k47M52l13K28J15k09
4603E2j38j43K94r9j02J57r3J35Q3j42K90l32L07k45j05Q9J03J26p9k10J69R1
4625B08j88N6J40j27q3k54M06Pj38n4J05m6J09j01J31j88j17L24k66K08l56M32
4647B08k10K8J7K4l9j25o2M20k83OP9K9J50n53L80l70L51l94J69R6Q6M1l9K02
4671B11l75J45J11p7j85J65j88K90j26K49k51j04O8pm0K78o0q0J86j61M0r4p4
$$ y = [118, -176, -76, -245, -57, 5, 57, -126, -347, 118, 228, 280, -61, -341, 56, 168, -55, 46, -49, -95, 47, 77, 165, -148, -97, 174, -73, 75, 166, 49, -3, -14, 18, 179, 79, -11, -39, 67, 39, -118, 146, 234, -46, -60, 95, 118, 414, -153, 182, 107, -80, 1, 36, 234, -4, -98, -59, 0, -193, 87, 100, 86, 63, 98, 44, -144, 192, 217, -5, -56, -204, -79, 188, 51, 3, -89, -88, -49, 81, -171, 214, 41, 15, 61, -49, 250, 26, -221, 231, -82, 146, 261, 52, -86, -229, 65, -34, -136, 21, -72, 63, 146, 4, 294, -38, 269, 24, -81, 8, 111, 237, 158, -52, 117, 208, 20, 76, 216, 89, 6, -248, 158, 165, 27, -27, 78, 32, 141, 40, 171, -17, -134, 190, -76, 132, -224, 208, -2, 26, 43, 67, 28, -97, -159, 261, -22, -16, 63, 92, 242, -311, 69, -301, 50, -344, -175, -79, 7, 48, 9, 211, -164, -19, 92, 15, -170, -5, -193, 97, -29, 220, -31, -135, -67, -74, -114, 164, 104, 24, 210, 49, 89, -5, -79]
4694g9j5j11K00o4J40p5O8j96J73O6Jj94J24R4r5p1O2k69j76M54j71K12k77PL23
4719A31k92M10k93j4j3P5j7R2K50l07l1P9R3k00k4p2K6j8J64J56k10K44k88J81
4743A22j60K9j13L7M0L3K65j84l30K05J46o6L20n35N61l09o8K95l45j22J97J14
4765A32m2j34N8k34K60M8k51L51j8k79n5Qj25K82J05k40J37m0q0O4J02R5m13m3
4789c12N05j40l9j38J08k8J0l7L0J55j69j39N87k67J63j74k13J47j98L37k45j25
4811a82k7K5Q6M7j22K44k53L61k76O2j31l7j3K74k07j38M90j98L51m69nK60N8
4834B00k03J23k06Q0n0N6j3l0J29l8r0K70j13l3k17J13K26m16L73k50L4J67k66
4857a54J1Q7L4rR4P6J5l67K73j39K22L3q6N6j08j22R9J03J0m9k41J11j30J91j12
$$ y = [-79, -94, -205, -5, -69, 71, -4, 64, -132, 41, 107, 108, -86, 38, 132, 37, -34, 28, -241, -417, 37, -134, 78, -199, -192, 131, -161, 249, -44, -58, -71, 4, -13, 79, 329, 22, -9, 70, 163, -37, -61, -133, -107, -125, 39, 195, -15, 229, -59, 122, -38, -9, -122, -85, -45, -12, 253, 69, -261, -56, 90, 24, 344, -191, 370, 61, -7, 288, -57, -179, 18, 132, 90, -44, 14, -220, 40, 88, -163, 188, 170, -109, -164, -156, -281, 1, 106, -134, 3, -37, -117, -53, 49, 144, -269, -312, 193, 53, 14, -124, -16, -44, -34, -71, -41, 114, -55, -194, 393, 126, 289, 115, -98, 49, -149, 188, -57, -182, -209, -184, -98, -51, -173, 71, -182, 179, -97, -35, -166, -203, -216, 58, -149, -287, 203, 5, 356, -113, -118, 142, 200, -3, 120, -86, -6, -56, 0, -13, -43, 86, 48, -42, 228, 115, 82, -135, -22, 204, -212, 161, -89, -55, 112, -154, -143, -56, -22, -31, 63, 139, 154, -213, 60, -79, 143, 176, 90, 146, 38, -84, 15, 118, 128, 79, -162, -51, -181, 10, -102]
4882a02n1j34M73j70M9k81J75P8J80l05J51n3k01J38l78J87J38J52k95K23J09
4903H3l9j65L65o02M91l73J0M84m08l5J76P2j85r5J62J23j56J73k07M00k10K26
4925B90m17N0j5j04P1M1nK15J22j99k07Q4L1M2pJ45k05K27j56j3k0M8J12j23j22
4950a15N5PJ59K1m28K55P5j08k4L28k07J41j94p4J59j62K78j22N2J18n16M18q0
4973C6qJ2j45J49N0j06p8L00l24L23k9P1l47J54j05j05K86l85K29J09m4m5N8j54
4997i8K24j24J5K9k38N4K04M6q9P2k81L29J5P4l63J20j58R2q7M47j53m7J14j84
5021A3M5N8j36j84K66l10K52q4K2J23K1j65R5n0K52j36l30P6R2K47j85J58j98
5044e8J84k0k04n8K45n8J41k84J32J93j40M7k09K40l34J11K8q3J14K9J90k15j48
$$ y = [-102, -153, -287, 186, 16, 65, -216, -41, 37, 217, -88, 63, 10, -191, -53, -431, -244, -106, 46, -249, -26, 83, 44, -121, 244, -358, 133, -240, -230, 254, -154, -189, -13, 59, -126, -221, -59, 64, -92, 81, -126, 274, 64, 290, -127, -77, -92, -196, -125, -84, -89, 126, 248, 49, -158, -74, -43, -1, -8, 137, -68, 159, 3, -10, -30, 18, 130, 7, -115, -60, -53, 106, 127, -301, -46, 29, -79, -103, 225, 18, 159, -35, -109, 50, -112, 166, 44, 96, 214, -302, 116, 36, 28, 40, -105, 44, 94, -12, -90, 210, -114, 209, 180, 251, -96, 58, -47, -152, 134, -251, -22, 87, 43, -2, 56, -98, 126, 2, 17, 46, -192, -138, 66, 112, 23, 95, -186, 143, 158, 232, -131, -11, -169, -77, -164, 283, 130, 83, 197, 13, 58, 116, -20, -204, 62, -248, 4, -80, -58, 65, 86, -79, 16, -34, 218, 82, -248, -172, -80, 167, -18, 140, -58, 126, 106, -98, -156, 89, 31, 172, -112, 20, 213, 73, 120, -89, 151, -183, -72, -44, -127, -13, 16, 206, -9, -157]
5067a57L64j23j53K01k37J17O8l42L90q8j2J37j39q1j0On1K45k59O3j65K38J7
5090B9l64K81j1J99k9J12l4m20L06K0j18L50n01K86j18O4NK7o5P5m16M26m7R0
5114A47p1j70J55l1j32KK02k34J58nq2O6N8k47K09K12l67K73P9j91m8J90j80R9
5138I2J42k45j09J70N7n0L2l06L62j32J54k84J03MN7mPj99Q6j34L49J5m19K06
5162d6J53j08J63q1o9O4K44K6l71M1k01r4K33J49j34Q1L5k5K23k25j12J58R6j58
5186D2k11J52l4J24mP1j93K39L7k76r8L0q5J18J5Q0lK18k71J18o5K97l32J90l6
5211A23m17L72k69K05O9K54k91J07q7k38M57j09j22J4o5J8J50j76P4j72Q3j4R2
5234E8j25N6K96l46m6N3P5L6j9n9N9K5J0p6P5k3J63k41J93k79j44L25p9P0j66
$$ y = [-157, 207, 84, -69, 132, -105, 12, 80, -262, 128, 40, 28, 165, 26, -55, -65, -59, -110, 135, -124, -61, -226, 12, 29, -335, -54, -65, 134, 105, 217, 183, -237, 69, 89, -29, 321, -180, 106, -12, 52, 57, 84, 19, 94, -322, 104, 57, 147, 76, -94, 61, 30, -102, -100, 102, -132, 26, 21, -61, 5, 63, -184, 25, 237, -130, 143, 222, 31, -17, 173, -7, 92, 234, -11, -120, 50, 107, 57, 89, -217, 145, 13, 167, -117, -14, -10, 47, 43, 50, -149, -63, -197, 152, 167, -252, -46, 107, -1, 162, 81, 12, 76, 320, 346, -25, 16, -185, -279, -46, 103, -31, 50, 85, 60, 283, 58, -54, 104, 200, 42, -169, -17, -51, 73, 69, 140, -53, 186, 223, -53, -151, -121, -206, -88, -73, 7, 4, 222, -49, 69, 4, 301, -31, 159, 123, -294, 78, -191, 14, 83, 337, 46, 153, 66, -172, 285, 176, 54, 68, 3, 21, 171, -5, 69, -103, -20, -34, 58, -67, -11, 285, -61, -107, -54, 21, 57, 38, -21, 38, 63, 73, -3, 72, 49, 212, -29, 164, -115, -259, 66, -13, 57, -109]
5259a09L0K03k80K41j71J90k35J76j63J46kJ69l69K21k70K70j45Q6L51l67J62
5280A34j49N5J57k77N3R5L7k74Q2RK6j50L08p5j48J40k40M5J23J68j65j04J77
5303B7m6J34l96K71j13N7J33m9N0k49Q6J02O7k26m4L07l2p7j32L18l71K5L90j40
5327I2mj05j79J66K33k00l4L49j33k05J20m2J11j94N1k45O4L45k23j49K82j19
5349a9j31L40l46L12m7j87K33j22r0k6J94O1L1j10j7n5K51k50j7K2l0J50j34J15
5373A28n5j64l4J88J53k81l08L92L09l05j55J71J21l2k00K81k88l9n7K08J24k32
5395g5J24k16N8l2J46K1j7k35K14N7O0j99K70k51p4J42j66L03q9J4n3j08M7J4
5419d5K45m50K99j03L1k46M47p3n2o3j01M9qmjJ83j02j67L33k14J19M3l6k7r2
$$ y = [-109, -79, 124, -156, 85, -86, 104, -131, 45, -118, 28, 26, 195, -174, 47, -223, 47, -98, -12, 339, -28, 134, -15, 40, 197, -80, -27, 68, 105, -169, -87, -78, -52, -202, 106, 31, -117, 23, -217, -172, -49, 119, -46, -150, 27, -19, 115, -281, -10, -123, -66, 67, 18, 68, -181, -95, 7, 74, -152, -196, 111, 79, 2, -130, 188, -183, -158, 232, 92, 88, -17, -196, -30, 203, 3, -31, 318, 185, -20, 100, 58, 169, -25, 26, -219, -155, 190, -33, -182, 100, -19, -150, 190, -156, 156, 109, -78, 155, 33, -57, -83, 111, 172, 203, 93, 76, 21, 272, 22, 5, 27, -3, 147, 13, 128, 73, -91, -125, 63, 216, -65, -373, 19, 328, 23, -132, 39, 160, 128, -72, 209, -79, -118, -175, 33, 157, -75, 49, -167, -109, -141, 5, 26, 9, -226, -12, 45, 105, -94, 176, -75, -149, -7, -173, 130, 41, 55, 2, -106, -59, -45, 200, -250, 49, -54, -23, -269, 178, 105, 53, -10, -111, -62, -70, -74, -75, 108, 6, -161, 172, -42, 77, 120, 84, 57, -35]
5444c5j22o8L40o5j5J73l46o8L40j18K07k50J33k02J30Qq1j37L69j55J49j18j71
5467a02K67NM6m55J51J07J04J26k54l35L67j53L68j58l55M16q4j76K85j48l78
5488c56K09J58p4l6J15j07N29l22j29j03J64q1Kp4J41r2K27l55L00q9R1l1j62
5511g5J72k74J78j23Q2k20J18K16N1l02J00L72l07J8j04j16O5J44J50j78Q0m99
5533d52M10K3o2J71l50K28O0l3K13k61J69k83Q1N7o3L16j83m12M16j35P4K22r9
5556A07p7M7j52K67j71K84m38o3L21j16j39J17jq9J77n5j29J55Pl39J33M22j74
5579I4O1Q1k21j59O7LoJ22m1N0P3j15P1j27j8L29k36j74J53l1m6RJ63j6J97l63
5605h0L30k49O1j20k1j51M88k68K07j43j44N7j16L69k34O5J2j65N9K26j69q5o3
$$ y = [-35, -157, -225, 115, 50, 35, 208, -138, -206, 134, 16, 223, -27, 106, -96, 34, 42, -39, -176, 193, 38, 187, 69, -102, 165, 170, 216, -239, -88, 19, 123, 249, -5, -340, 27, -126, 242, 84, -271, 145, 61, -115, 170, 22, -356, -147, 11, -63, -99, 16, -91, 438, 116, -13, -116, 48, -33, -31, -105, 36, -56, 171, -184, 116, 27, 118, 87, -75, 97, -177, 1, -122, -40, -260, -142, 74, 125, -177, -77, 295, -12, 6, -98, -214, -149, -5, 145, -33, 47, -452, -42, -19, -81, 90, -260, -32, 28, -5, 208, -53, 116, -167, -86, -29, -92, 224, 41, -371, 45, -90, -16, 206, 107, 30, 77, -75, 192, 21, 305, -133, -196, 125, 9, -130, -13, -14, -103, 74, 19, -110, 45, 52, -287, -154, 268, 94, 155, 236, 15, -144, -77, -74, -80, 42, 1, 51, 124, 9, 80, -47, -65, 264, 28, -146, 7, -24, -70, -61, 102, 86, 283, -80, 250, 1, 62, -58, -79, -230, 258, -10, 197, 54, -90, -33, -149, 220, -14, 51, 63, -102, -43, 183, 14, -71, -134]
5628a34K89N8k40n7O6K05j70j38Q2N9k15R2J71J18l0n2l35L47J22k53O8k21J70
5651Bj54l9J71Q0N4k9Nl46R8O3J81o8J42K56l80j89j47J59J69K04l25m4o8K62
5675E7k51J80J00j55K7K2n5j9J07k3k4RK61k68j05k5K39J09j28j87N4P4k1J38
5699A16j11O8J9j29L9ll3K51l52L46l86L69k88j05L18n0o2m5j7r9K18J1LL4k11
5724i9k1o7K08M9q8J46j26n7K55m17K48L5L3J01l61L43p8J0k14Q2mN6m9K20j81
5749B4o2J28j94K71r9l00K12pN4L8j09l5l14N33j98j32M41l25J46j22K17k41K74
5772B00o2l48J49j2J86j83J54Q2j35J27j52J86k20J46L8j33J03l15K01L9L3N3
5794A37n7r3K8m2J30k44L54J7k71j83N37m52J39O0Q4L3k94r4J54j09J86R6O4j67
$$ y = [-134, 155, 213, -27, -84, -18, 187, 17, -121, -39, 20, -195, -103, 68, 186, 156, 104, -231, 116, 238, -15, 53, -168, 2, -152, -191, -20, 60, 114, 85, 90, -256, -158, -95, 86, 18, 160, 416, 36, -153, -300, -141, 28, 232, -93, -137, -205, 57, -194, -14, 86, -69, -42, -20, -75, -94, 13, -10, -34, -25, 236, -32, -137, -162, 77, 186, 58, -129, -75, -1, -22, 116, 5, 73, 92, -37, 2, -1, -34, 217, -135, 211, -175, 194, -94, -199, 119, 69, 7, -38, -55, -154, 64, 75, 78, 112, -99, -120, -187, 21, 70, -18, 128, 2, -55, 200, -217, 31, 66, 99, 200, -161, 182, 104, 114, -100, -18, -22, 34, -15, 205, 24, -38, 90, -104, 167, 68, -232, -20, -27, 27, 65, -44, -79, -393, 140, -58, -190, 251, -74, 72, -50, 167, -74, 200, 138, -210, -61, -73, 113, -70, 84, 166, 31, 158, 6, 192, -28, 118, 156, 23, 126, -189, 12, 51, 84, 137, 80, -13, 15, -27, 103, -141, 213, 230, -41, -224, 313, -139, 0, 60, 144, 177, -117, -211, -57, -166, 20, 116, 180, 13]
5818A3J70p9j38N7k21K56o9m9K31j55P5j34K9k43L20q7krJ69o1p8P6p0j1K35p6
5844A49J19l89pJ38J10J57j61j88j22J4O3K50O8k38J01J43J94l69k21P4J38J50
5866A73O8n32J64k39M78l58L09J68l17J3J91j64j6j83J04L32k94K52k05m6K97
5887A95k42K57J8j0k03j29K92j98M1o1k74K90O9k30K55k48L64k87J56J65m6j56
5909A8k0o9L9ok5N2J52j65o2p8M31l69J31m1j80L72k18j81J85j15K08N3k79M0
5933a27K04j62J15j08J70k52L94j49J50k10j28o0N25j78q1j24L1J81l64L22n74
5954d25L47p4K05K1K6j67J74r1J29j94K56j59Q0j96J44J7p9l7j7j56N02k39j93
5977a26K40l7j16R9k76P7M27l46j74R3K88l90k2O2R1J64k7kJ28q7r2l25L67k7
$$ y = [13, 183, 104, -34, 23, -198, 58, -11, -60, 171, 16, 91, -43, -14, -257, 63, -24, -26, -35, 134, 73, -5, 71, 1, -10, 225, 149, 268, -121, -128, 10, 120, 277, 116, -72, -194, -180, -117, 133, 201, -37, 64, 207, 401, 32, -189, -115, 23, 173, 241, -291, -127, -366, 112, -246, 63, 231, -86, -73, 118, -46, -62, -245, -141, 191, -103, 149, -56, -102, 195, -47, 210, 228, 218, 15, -114, 178, -20, 21, -40, -314, -24, 45, -185, 70, -178, 186, -101, 55, 220, 174, 18, -2, -71, -32, -38, -63, -11, 141, -24, -86, -164, 267, -102, 29, -12, -192, 180, -38, -219, -34, -149, 59, 112, -167, -127, 77, -85, 30, -78, 92, -160, 234, 85, 235, 25, -103, -163, 362, 184, 103, -21, 10, 191, -173, 149, -425, -78, -152, 53, 74, 100, -67, 107, 16, 145, -49, 207, 48, 128, -68, 76, 93, 14, -23, -40, -196, 306, 67, -126, 114, 77, -39, 60, -216, -139, 288, -58, -232, -139, 149, -241, -263, -201, -110, 54, 27, 25, 153, 66, -26, -351, 16, -11]
6001a1L8J15j87j39L92j64K4J98l33J03K5J9P0k18q3M1k1n0K16k9m4k06M11m4
6025A23J63m79L6K51j7MK34k39K6k29K29q4j01K36n1J07j51Q9k43J45L4J27k34
6048b4K74j79oJ06k71K58j44k31J00J31Mj25jL4r9J79J21L3k54L44k49K61k96
6071c4p0L38j04j07o8K83k96j42J27N9L19n57J78J99j23L1l7j82K22J40k32J72
6093A16k00J96m15L65J9J55m37J51J59k6l08R2J1R9j85M97l44q2k9J83l2j01L62
6116B46j39l39L89j02k29L17j59J38j75j31lN0K67J3J39k45k3K24l68j1Q0l3L85
6139B91k54J65j3j1k12K67k94J66l07K99l4J68q9r1L7k24K8k6J51k09L07j53R5
6162E7n9k24K46k43L31j57q1R2k73L15J0N8j2j11l3M3qQ5P9l85K59r7J03P8k8
$$ y = [-11, 27, 142, -45, -184, 208, 44, 68, 266, -67, 36, 61, 80, 150, -68, -151, -110, -131, -181, 35, 6, -38, -244, 167, 123, 286, -193, -157, 94, 77, 81, 315, 76, 102, -127, 102, 18, -83, 153, 102, 209, 58, 147, -96, 49, 83, 210, -24, 250, 71, 65, 171, -100, 158, 14, -217, -117, 14, 18, -107, -108, -74, -173, 6, 127, 160, -94, 250, 1, 262, -34, -104, 234, 130, 23, -45, 238, -58, -200, -73, -14, 305, -252, -74, 125, 2, 33, -4, -186, 36, 176, -56, 116, -84, 112, -303, 62, 81, 236, -201, -50, 109, 83, -225, -133, -122, -23, -208, 289, -55, -137, -166, 17, -15, -116, 246, 107, -232, 157, 55, -174, 143, -16, 122, -53, -184, -187, -137, 130, 143, 282, 37, 14, 238, -130, -141, -61, -94, 291, 37, 202, 189, 178, -34, 233, -61, 105, -202, 97, 63, 231, 142, 51, 88, -136, -108, -134, 17, -192, 115, -38, 57, -2, -226, 20, -223, 108, -49, -130, -38, -311, 4, 14, 72, 60, -51, -84, -41, -49, 36, 115, -270, -11, -108, -5, 73, 45]
6187D5J28l47Q3nl7k65L06K33j67R1p0J76Nm44J72N8q9l8J21J89j84K33j79j73
6211a58K27j6LK6n2J86r4L5j54j71J25K7q7K99m54J59L06k13lj51M24l98J85J37
6235A88j22r7j50L94j39j06j64J15J90j2J00j37o9J26j74J34k19J54lJ38j18q8
6257e9J68q3rj15O8k2O5j54o7L74m4r9P1J86K1k19k68kK36k87NK63l72L42J61
6282A60k49p8pJ02J30o7j48j4M22p6k79N9j29P3J13QJ47l06K64j49j2J11o8r6
6306h9j7j33J11K07k57J63N1Q3j41L2j8l8k0o5J8L6o8J39o0L07l47R5l27K15K7
6331i6L98j83l38k0J03K18m4J70k99J24j5q9J90N6k67L4K46j72J9j2j01k3K83
6354A82k59K77r0J1j95O2N0j3j27r5M61k17q5J18j32J94N8k03k17J78K2k23K83
$$ y = [45, 173, -174, -91, -96, -133, -398, -92, 141, -26, 65, -5, 171, 176, -268, -96, -38, -127, -165, -44, 145, -39, 194, 15, -158, 69, 53, 56, 82, 30, 216, 122, 157, 3, -168, -43, -16, -103, 196, -258, -99, 207, -6, -9, -160, 264, -134, 51, 188, 66, -31, -181, 213, 74, -32, -196, -81, 109, 97, 197, 60, -9, 117, -57, 77, -142, 12, 9, 147, 29, -59, 109, 26, 17, -98, -30, -52, 13, -141, -208, 166, 122, 23, 94, 280, 301, 82, -186, -188, 48, -239, -234, 29, -343, -1, 160, -89, -167, -174, -72, 58, -9, -157, -171, 251, 175, -104, -45, -174, -101, 12, 20, 167, -139, 125, -24, -36, 75, 7, -89, -106, -239, -128, 79, -178, -15, 36, 119, -22, 10, -8, -46, -66, -131, -113, -77, -145, -6, -66, 241, -106, -11, -338, -123, -96, 302, 119, -219, -239, -136, 82, 38, 208, -91, 33, 18, -71, 119, 175, -92, -58, 188, 16, 35, 23, -78, -101, 182, -77, 200, 110, 121, -74, -12, 38, 25, -102, -197, 264, 47, -38, 80, -52, 142, 200, -3, -220, -42, -20, -243, 40]
6377D0r0J04k33K21k02L12j20k02K24p5L1j22K17O7j18k35L98k55l5p9J05q0N8
6400f9J68k17J00K87j94p4k42Q7P1r0K13j04OJ38k9J62o8l3j82K93k89K6J05j22
6424e7j63L79k8k73J93k13R2O2N8N7j06k28K55J81Nn56K60K03N4r0q7J8o8K9N
6449a8K96m04J45r6k15M06j02K37l08L69n33L19j36p4L55m78J58K28j33J37l05
6470a52J81l6N1Nj74K39p0j2K27k26K14k27J98m8l47oM35k06l85L75J85O4n80
6493b95J89N5J71k8j26p0J55j85K00l4L2J26k56J6J42k11q4L88j76m6m3L1MJ15
6517G0r2k28J77k66M14j91J90k21K87r3p7j5K60k61Q2J40n5O7l84J12J44L02k21
6540A41j22o4qj04mK1LK96j27K8j05J80j57O5K87m15J87k36J30K58p1p0m5O0j35
$$ y = [40, -50, 54, -179, 42, -160, 152, 32, -170, 54, -21, 10, -112, 105, 172, 54, -181, 217, -38, -73, -152, -47, -127, -69, 99, -118, -18, 269, 75, 1, -241, -154, -83, -173, 40, -64, -58, 80, 51, 213, 145, 112, -70, 223, -66, -40, 65, -57, -220, 159, 131, -142, 51, -162, -70, -8, 50, 107, 1, -227, 28, 209, 214, -342, -82, 121, 175, 85, -2, 16, -52, -23, -18, 278, -126, 19, -77, -292, 114, 12, 249, -59, 310, -223, 96, -40, -114, 241, -237, -79, 149, 16, 153, -152, 29, -7, 44, 49, -125, 114, 44, 32, 259, 33, 247, 20, 218, 170, -177, -183, 252, 46, -339, 36, 221, 285, -295, -106, -51, 120, 92, -34, -104, 51, -134, 66, 32, 64, 190, -66, -50, 92, -119, -203, 185, 9, -37, -80, -49, -45, 70, -22, -250, -73, -339, 75, -116, 74, -147, 140, 47, -30, -45, 215, -46, 36, 176, 121, 188, -196, -84, 60, 362, 141, 19, -45, -53, -157, -161, -140, -137, 159, 32, 60, -45, 135, -22, 43, 330, -85, 102, -134, -4, 254, 183, 113, 68, 128, -7]
6565gj44K82j38p2O6N8j79J20j62K11J10j47k34K53l55K59K28j64K06l20J43J44
6587A58j50J38q6J8k83J71J35R9k73p8K7J03N6j33J81Pk04J77q8j84L31j60n4
6610i2J18K3j24jr1L8k1K12j94K21k42K12q0j29R8r5n7L13l8N3J43j06j39k2m9
6635d9L68l62M5J73J0k10J45l6l6K62l08l0RJ06m78M62k99K17K30k69O2K34k79
6658c3l4K96j74Q3L5j30L7J19Qr8r7j74Q7J00j13J60Pj0J8r0k2J13J25k37kj08
6684a34J81J00J21j96j14j9K9K51k80L71l12j59J82R3K05l16R8k49j93M07k02
6705a36R5J75o9l3j69L52k98L7J37n4j92m3J0K19j21P6j5J00J33l24o2K65j3k7
6729D3r2K49k80J49k55J75J59k13J85j91M7lJ07r2%K68j96lq9m23K21K55R1j19
$$ y = [-7, -151, 131, -7, -79, -13, 45, -134, -14, -176, 35, 145, -2, -236, 17, -338, -79, 149, -15, 191, -129, 14, 158, 8, 146, 60, 78, -205, -34, 101, 200, -73, -151, -124, -21, 35, -98, 83, 90, -114, 63, -25, -209, 122, -38, -92, 26, 49, -75, -76, -167, -129, -150, 62, -132, 89, -153, 59, -21, -150, -52, -147, -204, 109, 71, 124, 267, 161, 22, 0, -49, 319, -43, 2, 175, 185, -25, 120, 84, 48, 310, 2, -28, -19, 87, -391, 71, -228, -11, 219, -50, 12, 246, -33, -67, 229, 55, 138, 173, 43, 80, 199, 207, 109, 12, -162, -75, 25, -88, 72, 79, 69, 87, -3, -25, 88, 213, -24, -26, -134, 47, 147, 268, 72, -42, -61, -32, 219, -61, 310, -2, -161, 21, 114, 319, 3, 101, -148, -341, 66, -136, -41, 134, 65, 32, -137, 215, -83, -46, 91, 37, -155, -198, -188, 31, -90, -14, -29, 71, 204, -120, -182, 83, 70, 43, -49, 200, -80, 69, -186, -11, 148, -65, 120, -71, -24, -27, 80, -12, -12, 256, 60, 57, -32, -455, -234, 21, 112, -7]
6753gm5L3K37j1k84L00j0l20l8K5L27j06k2M0K9q0j06qM4J16J01k70j15k6L76
6778A80KR0m51L95k52j20j89K93n4Q6J9p4R1j70K24j49M9p2J47m5no3J27m3r1
6803g5Q9J17k90j87N95l95K04L0o2jP5q8k1k42K13Q2P9j65k17K92m22K91o3K09
6827D8j10P7k49J7M3L03l6R6k19J02l24Q7K66R4p0j0j31n3K92k35j01K79N7j46
6851G7L7k61J10o4J8J28j31K08j14o9J11n2k3o2p0R0J89j27J59j45j31n4J06J77
6875A07p5n4J05j55P3k2l1j27J77L5k36K34k11L02k67O9j7P8p4l3K65k82j58K67
6899c0j90J55j0P7k4J68j72r3K13j55J16j96M59k58j43j2K22O8m10J05j15KM85
6922B62j30k76K40l32J30P4K70m24L63J9k17J16k4m2p6K69j84j60J42N2k41N5
$$ y = [-7, -52, -19, 218, 207, -77, 223, 213, -107, -145, -120, 207, 101, 79, 119, 148, 68, -38, -46, -2, 114, 215, -55, -170, -196, 180, 182, 272, -179, 216, -36, -156, -345, -52, -106, -20, -1, -75, 16, -154, 70, -79, -30, -102, 45, 0, -5, -68, 59, 16, -75, 14, 131, -159, -346, 249, -146, 58, 88, 26, 25, 100, 12, -9, -251, -38, 44, 123, -42, -259, 33, -389, -98, -161, 48, -62, 15, -234, -217, -174, 129, 93, 189, -30, 72, -252, -165, 101, 195, 125, 115, -16, -69, 223, -12, -113, 166, 223, 77, 114, -147, -37, -101, -83, 45, -86, 122, 8, -61, 50, -2, -25, -87, -157, -67, 122, -5, 154, 9, -122, -176, -70, 107, 32, -22, 83, -72, 1, -21, -52, -179, -2, 33, -203, 31, -180, 122, -145, -76, -93, -15, -89, -122, 143, -139, -297, -30, -220, -65, -75, 2, -22, 146, -26, -119, 94, -61, 55, -141, 318, 60, -83, -95, 127, 195, -215, -110, -225, -223, 262, 132, -144, 96, -236, -106, -32, 238, -186, 177, 196, -21, 95, 71, 29, -47, 222, 38, -122, 20, 72, -169, -114]
6944a14l7J21n2q1J36K6L87l61Q9k03J58q0J5J27n3LQ3oq8j18p7J00r3L62jk20
6970B3j79K48j8j92oj3K15l08N0K92j97NJ52oQ2p1j90J46Mo9j22N10j28p3j52
6995CK40p4n38L67n9O8K31j81q2J1o2K8j82N43k35k49K37N3l98M47j21M4k32J09
7019c2j35J07N7N3r0O9K8m8J13j73j2J54j54J68k74J75k64J26J26J73Ol13J19
7042b1L3l5N4J42qj82L22k16N2L2k9P2n3l36K43nk31m4L37q6j1J8N2k07M5L0j02
7069a34K61j45O8k4k4J7K52m39J33j63J88l4j75J41L22l58J45k03J19J18R5j98
7091c8O6O2j13J66j10J17j47L5Jn8k1M5O8k65R1J79L9q0O0j5l2nr0o6K2jK22j64
7119c2k01K15j13J46P8j05N2o0R3J25j12k05J05M3J46M0j76qj86K82n5k18J34
$$ y = [-114, -151, -30, -82, -163, -27, -1, 386, 25, 114, -89, 69, -11, 4, 131, 78, 81, 164, 158, 70, -48, -125, -25, -118, 244, 243, 23, -156, 92, 74, -118, -124, -137, 78, -230, -180, 112, -85, -80, 72, 66, 148, 77, -113, 33, 37, -32, -154, 356, 228, 155, 3, 243, 169, -369, -2, -61, 7, 238, 57, -25, -14, -76, -48, -230, 313, 78, -171, 66, 119, -279, 168, 47, 91, -141, -32, -167, -60, -3, 50, -40, 29, 57, 9, 122, -51, -63, 91, -63, 105, -169, 6, -258, -132, -6, 167, 173, -140, -21, 12, -23, 31, 173, 165, -17, 305, 89, 141, 173, 144, 216, 163, -173, 70, 65, -166, -210, 127, 41, 30, 48, 100, -107, -62, -32, -134, 127, -18, 50, 26, 2, 19, 271, -168, -35, -198, -10, -44, -219, -78, 244, -114, 31, -172, -53, 65, 160, -38, 28, 90, -23, 143, 33, 150, 3, 38, 39, -19, -40, 5, 73, -192, -101, 78, 117, 37, 97, 82, 50, 45, -45, -111, -89, -90, 132, -32, -233, -18, -131, 15, 93, -12, 40, -20, 73, 198, 86, -119, -14, 29, 175, 215, 39, 31, -155, 127, 72, -146, -12]
7142a2j95J02M7O9oK68n17L44M6j14nl4k35Q7J25j62P2NK18J77m34j2L4j7J60
7167A1k1N6J59k33lq0J79J4p8j1K37k68jJ95l57J25K51k43j5M0J6J69r9j41Q4
7192a4k33N19k42k90K61J70q5J4p5p4PJ85Nj76J55l6j26J05n4O1q6J56o0j46O2
7217Cq8RK99k16K7l2L16k54j09J27k12K39m91K50M4j75L49k51K7M6J72j57M4M3
7241A0J5o9M7l40L62J57j26j81j56N76o8k77J55p3q3P9k0k80M36j41k16L30j25
7264A2k70L46J8O4j77J15j00nm3j1M6m2K9k1j42K95Ok88R1P5r8Q1o0j7n4N03l84
7291c1J49m0p1j55K12j8j28L04r9r6J27l01K72k63L19l84J47m5J87k15J43N4j85
7314a17J44M6j2q6j79K14n7k4K45k02K17j3j8J2l63L13l61R3j18J95K07n6k11
$$ y = [-12, -207, -105, -58, 11, 5, 273, -244, 100, 146, 32, 27, -7, -242, -155, -30, -192, -120, -115, 103, 280, -154, -166, -132, -149, 11, -10, 46, 205, -28, -31, -111, 68, 82, 4, -7, 230, -38, -39, 156, -201, -76, 175, -68, -83, -43, -27, 142, 43, -98, -14, -247, 272, 30, -260, 1, 171, 86, 100, 25, -49, -42, 143, 148, -28, 127, 91, -35, 70, 16, 77, -9, 147, 87, -59, 3, -85, -76, 223, 7, 34, 2, 318, 64, -45, 82, -130, 109, -382, -132, -88, -263, 86, -165, -138, -92, 80, -77, -33, 10, 25, -44, 3, -337, 25, 182, 56, -125, -281, 295, 227, -50, 105, 32, -51, 28, 8, -272, 164, 23, -193, 137, 12, -258, 88, 106, 170, -7, 108, 8, 3, -40, -51, -5, -47, -18, -39, -181, 114, 120, -168, -77, -2, -100, -19, -79, -96, -150, 353, -31, 118, 78, 7, -148, 64, 46, -82, 222, 123, 27, 154, -147, 125, -138, 181, -203, -56, -101, 86, -129, 14, 68, -117, 27, 73, 61, -25, -204, 10, -47, -71, 174, -28, 189, 176, 158, 170, -193, 120, -241, -148, -266, -71, 136, 80, -131]
7337a31N8K20j01j10j38L40j47j56K80l29L56m49N24k89K14k07J00K05l8j06l7
7358E9p1j33OJ47O7j36J03O1q1j41J29L30l38K9j47J02o2P1m2O0k7j49K48m17
7382c32L00J18q7j20R4o0Q5J71m4k30J33J0J48Mk11j22J38K52j44o5j24p2P5J33
7406E0m5k16K50K3j54J58m2N4K6j94J57q1Jm3M2P1k85L04j34J47j68J44J78k4
7430B19r5l39K37q0Q9j67kq8M75l11J7L56k56o4k4j80J35k1O7M0j13PO6J04k40
7455a68J75j01Q2j89J40P8LJ43r2l09J84n4K4K59k29K04l08j54N94j49k17mJ84
7478I6k48K61mo9o3Lp3k4J47J01k03J29K3j77J87l64%J1K86P7j55jK8MK0Q0R7
7505A69m2j44J36k14K86k8q2J89j56j79k4j3J62l3l8nM9j85R8J06NO1j18%j85
$$ y = [-131, -73, 147, 46, -64, -202, 138, -9, -165, 115, -214, 142, -307, 217, -72, 142, -65, 35, 240, 202, 96, 59, -12, -145, -139, 8, 75, -61, 42, 103, 22, -119, 10, 340, 2, 31, -116, -14, -76, -5, -47, 13, -14, -163, 85, -332, -32, 86, -1, -121, -27, -87, -2, 169, 125, -105, 28, 38, 186, 190, -21, -143, -5, 247, 103, 38, -86, -158, -83, 50, 5, -211, 39, 62, -92, 66, 24, 78, 104, -90, 67, -14, -13, -56, -14, 57, -228, 76, -58, 89, -79, 65, 243, 219, 124, -215, 22, -58, 31, -136, -138, -226, 249, -62, -45, 311, 55, -9, -33, -213, -78, -99, -32, 8, -105, -98, -32, 72, -168, 7, -94, -12, -201, -61, 17, 20, 163, 71, -238, -54, -108, -84, 175, -54, 150, -158, -312, 282, 133, -84, -88, 96, -152, 109, 105, 36, -27, -24, -97, -121, 26, 127, -76, 53, 76, -101, 86, -278, -278, -267, 19, 96, -59, -60, -32, -28, -8, 72, 169, 127, -17, 119, -95, 191, 163, 81, 270, 114, -65, -89, -102, 60, 27, -11, -16, 33, -152, -54, 52, 57, 118, 0, 0, -185]
7530a85K20j31K40o0j78L80l94L27k10R8k07r8M73l66J92Nj0R0k42Q4J73l26L65
7553B40k19J17l91L77j53j15r8K63k01L83j81J59k72qn3J43n5l19M17j00R5J70
7575A99r4R4j42L3M1n3k52L11J01k30J83k43o1J86J85p22L47R6k13L31k50j93
7597c46K64n3j0J95m4L3J97k47K1k8Q2K28k95L8J5L2m4n8q4K36J11k52j0O6L7
7622H4j48r3J23J68Rk01P3Q1J3k43J00N4P9j8j64J79K0l32K67P3Q8k46j39K65
7646I2m27L43n3qK23k05J29k14J8n0j22K33k11K80P2m98L52JJ09k26L88l51K2
7669a03J25n1J21K21l23j33M0j44L54j83J91l25M36k51j85J14K39j66L05m28M5
7690a01L08rl04p2J92Q2j93L30q0j78j22m4K60m2j49n4K76j30P4n4R3l6K04j64
$$ y = [-185, 35, -96, 144, 84, -94, 286, -108, 219, 9, 107, -100, -198, 275, -91, 101, 106, 96, 186, -56, 28, 201, -125, 240, 21, 138, -253, 124, -29, -144, -242, 21, -180, 203, 22, 181, -91, -99, -152, -9, -64, -383, 34, -66, 29, 199, 105, 199, 57, 90, 131, 78, -174, 137, 238, 8, 191, -52, -113, 73, 258, -464, -117, -21, -234, 97, -153, -346, -82, -135, -145, 50, 6, 39, 236, -11, 10, -18, 64, 292, -3, 35, 50, 82, 38, -20, -104, 132, 243, -9, -19, 47, 84, -64, -157, -34, 134, 143, -58, 15, 96, 109, -134, -34, 20, 99, 81, -83, 96, 116, -216, 51, 124, 212, -34, -173, 92, -335, 8, -45, -53, 170, -35, 94, -120, -102, -152, -274, -41, -252, 28, 100, -398, -46, -45, 64, -162, 226, -125, -103, 22, -29, 92, 313, -10, -143, -103, -247, 107, -76, 115, -210, 226, -25, -210, -96, 143, -23, 282, -146, -101, 207, 198, -106, -178, 14, 96, -97, 233, 153, -25, -147, -191, 69, 27, -122, -176, 100, -30, 44, -10, 83, 47, 251, 87]
7714H7q2k5lq9K68j4j20k9m3j15J60k5M0K6l41J33K48k53M6J17j38J79J39k68
7738a02Q1r2m1oK05l19K90k9m9k33L03J54r1k01J74K7j47J72j50q6r6J67J43J68
7762B42k87j12l6K97j23j1L51j08l05J17R0N4j49J57o0l25J28n3J00k16N30k41
7784D0o9j5l9j28m6M15j09j54J06J10k45k9J65k47L33P1k72M08k34k91J83o7P8
7807c6J29l0o0J7J58m50M38j71j12k34P26n08J33J35m92L29J11j72K5j19L17r6
7829C8l61L89k68k26O81k40j99K39j05L3p1K09M2j79J13p9N0l48J35N5L9J42q7
7852BJ07qp9r3K90k23p0N4j53O0L90l04j86K38q7j41L56j20j24L5n4l8M39m1l37
7877h7m5K35j25J13O3j63R0m75M27j05J91l24J30j36M68k01k63J31J66j17k33
$$ y = [87, 5, -20, -23, -112, 156, 142, 22, -7, -50, -165, -5, -30, 10, 36, -305, -172, 76, -177, -131, -14, -152, 27, 166, -102, -21, -113, -154, -160, 45, -274, 16, -13, -62, -295, 8, 162, 71, -130, 44, 71, -76, 96, -54, -140, -236, -69, 74, 242, -45, -157, -193, 104, -19, -30, 321, 213, -92, 25, 115, 169, 20, 177, 117, -208, -80, -133, -33, -249, 281, 40, -29, -44, -83, -211, -257, 158, 49, -105, 1, 111, -134, -163, 2, -245, 88, 159, -113, 295, 61, -230, -47, -114, -36, 93, 63, 3, 20, 178, -272, 166, -5, -117, -351, 375, -133, 0, 135, -357, -28, 83, -89, -64, -183, 134, 38, -323, 66, -202, -428, 253, 13, -186, 53, -52, -19, -90, 119, 161, -18, 95, 16, 66, -282, -147, -92, -53, 89, 2, 109, 101, 22, -71, 219, -4, -74, -20, -173, -113, 277, -27, -213, 25, -62, -203, 153, 33, -91, -56, -110, -148, 291, 250, -87, -132, 103, -22, 91, 154, -9, 81, -394, 33, -72, 119, -205, -75, -211, 257, 56, -207, -76, 90, -27, -260]
7898b60J89J20M0j62P9J90j92N7J59l02P7kL4l6J69m55K67j12R1K6k15K02R0R
7922F3k55J43R8M1l21M88j29k09J90R6l62J61j51L05k21l6N3o6j49R5J25j14M60
7945C05l90K4MM6J00l0l9J05l8k55q3N3K69l22N09j13j75J40J00l82J57N6J15
7968A56m98K31p2J44K11K2q0j18J18m33L11M10k61k42j12J13o7L55J06j97J27
7989B24j27r3q6J41O6K3p5m33K06K38J32k19M1N6k02J63M8q0k08J92r4K38j73
8012b2j08J36l8m4O7J80j22k96L18p7J4J00k22L72j03l64L94J79l62L0L3l43L46
8035F8k87J77n6K45k9j32r3p1K51l9J76l6j21j90J80k01K43M0n5k74J28K15k15
8058g6r1J35p2J53k29K20m4J9K72m51J16j26J0K10o2J30l58L89O2k70J47P8l92
$$ y = [-260, -71, 49, 89, -73, 6, 196, 4, 61, 220, -82, -5, -7, 27, -9, 160, -295, -28, -140, -49, -23, -238, -36, 54, 63, -192, -49, 49, 90, -231, 257, 128, -81, 109, 205, -157, 4, -147, 158, -63, -99, -46, -112, -261, -166, -41, -155, 305, -85, -61, -57, -11, 89, 59, 20, 125, 87, -168, -251, -198, 71, -251, 258, 145, -30, 110, 210, -172, -15, 41, 156, -342, -111, -183, -39, 172, 194, 114, -4, 114, -319, -8, 402, 141, -101, -213, -100, -167, 188, 294, 97, 224, 97, 4, -82, 59, 125, 148, 73, -360, -154, 84, 216, -3, 38, 94, -108, 55, 103, 23, -185, 7, -87, 151, -22, -130, 6, -32, -76, -9, 171, 49, -247, 71, -6, 8, 108, -114, 258, 155, -209, 185, 364, 2, 32, 65, -278, 68, -219, -42, -98, 147, 118, -14, -107, -178, 73, 34, 210, 174, 53, -137, 43, -158, 85, 125, 70, -204, -76, 139, -76, -167, -32, -104, 49, -180, 40, -4, 15, 287, -164, -48, -174, -164, 46, -16, 114, -244, 145, 207, -63, 84, 162, -230]
8081b30L06j66L08oJ34k19m14L05R4Pj89J08o6J55ok09K26Lr9o3r5K17m5Qj30
8106f6J86r6LJO0j51K0L0r9j11N2Q2k3J66k1j68M32j75j16Q0l4r8K19j01N3j08
8132A7o4R5K40m08j27N74l69m1J18q4J03J95l9j95j13K42m80J53J54l18L82n0
8154a5J37k58K42lk0j93J51l4o4Qo6k05M70j46n4K60k63Q3J03Nj18jj92K94q6
8179C5K2J77k39Q2k57J13J18j4J13n1l70L3
$$ y = [-230, 76, -90, 218, 212, 346, 127, -287, 18, 112, 119, -70, 38, -28, 127, 121, -88, 138, 141, 42, -21, -116, 101, 56, 64, -66, 120, 24, 27, 28, 88, -63, -43, -13, -112, -223, -171, -89, -112, 54, 33, -135, 297, 122, 6, 86, 52, -46, 173, 72, 125, 17, -47, 48, 288, -120, -247, 327, -42, -83, 35, -49, 54, 249, 210, 15, -98, 144, -336, -183, -29, -347, 35, -15, 122, -136, 106, 103, 83, -110, 41, 7, -57, -49, -115, -320, 150, 4, -50, 210, -53, 30, 133, 138, 20, 19, -173, 121, 35, 57, 234, -5, 77, -180, -67, 51, 37, 150, 99, -271, -238]
8191b38
$$ Imaginary data points
##PAGE= N=2
##DATA TABLE= (X++(I..I)), XYDATA
0@%%%%%%%%%%%qJ6j6J6j6K4l2M0m8N6p1Q4r5J12j34J53j77K06k37K72l10L51l98
34b12M51n09N73o43P20q03Q94r94J105j226J355j497J652j824K013k217K440k689
52a411K965l267L606l990M425m921N492o159O953p917R117j0653J2704j5599K0027
67A1372k7721M4883j56492M3662J77407j63103N3295J20043p7663j06620J30148
78D9211N4367p8214P994N8721j08704p3203O9099K126q3594N8512P9840m7299
90a1144l1902O4443K0710j0388J9744L178l4699j3591j0800k7365q103J5628p689
103c1978l992K2522k786j5398M0754L3065j6547J9038K7327n4829m2354L3951
115H773l040m9116J3278L2931l3339k4000M4846K1602k4291K5668M7877k4913
$$ y = [0, 0, 0, 0, 0, 0, 0, 0, 0, 0, 0, 0, -8, 8, -8, 8, -8, 16, -16, 24, -24, 32, -39, 45, -50, 62, -72, 81, -96, 110, -127, 145, -165, 186, -212, 239, -270, 303, -340, 380, -423, 471, -523, 582, -644, 711, -786, 866, -958, 1055, -1162, 1278, -1411, 1554, -1713, 1893, -2097, 2328, -2593, 2899, -3260, 3693, -4224, 4893, -5760, 6944, -8655, 11372, -16349, 28534, -127958, -84296, 93111, -69992, -16697, 103346, 25683, -80937, 49211, 103578, 25364, 33358, 92079, -16625, -89828, -20729, -18603, -102197, -43685, 36155, -11144, -43046, 21397, 42107, 31719, 51463, 54641, 19942, 6351, -4449, -31814, -39917, -24289, -31978, -35970, -13448, -16234, -31632, 9122, 42187, 25640, 44678, 72005, 17176, -25178, 8773, 5733, -43383, -30105, 2826, -30513, -54513, -9667, 11935, -12356, 13312, 61189, 36276]
127C6276l2884J9705m766l3717Q778J3713k6579j9996Q649P332K981J7371K4931
140B1794N452r862K91K172r374n672M163j203j5409j9990j420J0199m390Q121
154a5128L2352K078j9251J2355J1850j7893k107J8374j0715k7495r29O600j5769
167b5678k145K9778Q129j5792J1465J2682j5774Q60J9572p055j5297R85o682j6683
181b1635r14J1887N361O12O940M082m749K940P554r20L513J871j5982j0624J802
196h262p862k526J4757M169n697M724N157l514K344J3258L409j3032n292J560
210C193j4337r269J4245M195r407O096O609p272L616J3974M479l489r42j423j2146
225a878j0362N699M028p305J639N394o347j250J0373P390L764L691R0n562r348
$$ y = [36276, 3392, 23097, 18331, -15386, -6608, 7105, -19474, -39470, -30821, -23489, -20508, -3137, 21794, 27246, 17384, 17675, 19847, 10473, 4801, 8964, 7761, -7648, -27638, -29058, -18859, -23249, -15128, 17224, 19302, 51, 12406, 24256, 6363, 4256, 22630, 11915, -15580, -16509, -9909, -25678, -27823, 1955, 10084, -5708, 5757, 18439, 2665, 3525, 23097, 16042, 745, 1730, -4952, -21635, -22549, -10662, -5301, -4689, 2251, 6333, 1584, 4524, 12078, 11158, 14671, 16542, 560, -10064, -8262, -16124, -18650, -3893, 276, -5421, -697, 4460, 946, 3290, 16548, 19957, 6925, 1633, 3193, -11144, -20413, -6168, -1973, -11380, -5284, 1325, -5947, -2331, 11643, 16122, 12633, 11691, 10268, -1878, -12240, -6541, -2513, -9818, -8179, -2785, -9132, -10382, -9, 7381, 11145, 14836, 14926, 9364, 16]
240A6m027K562l179l654M083k058p101K536P120N997N820M354J923m709p349p37
256A597N79m827K54J116p879n095L338L326M969P419N256K124m512m638J551q71
272C707k231J603k779p767l938j217K256N990M980O011K301n011r00L729k112
287D622r02K820l642p612m695j045J879K682M110N861j173k360L516O06j725N047
303G989N05o512m288l115k687L31K003L893L327j728J29J710J4L306L142j877
319F142k017l013n500j959P29N44L262J301k118J401J719J17L464K725J55k060
335D892m277l425n09j503J594K715j908n41J708j306J615N494J641l77j341l630
351H42k500j474n72K017M53j387N50j344o23M344L619J571J008j614l165j779
$$ y = [16, -4011, -1449, -4628, -8282, -4199, -6257, -13358, -10822, -3702, 2295, 8115, 12469, 14392, 9683, 2334, 1597, 2176, -2651, -2397, -1281, -9160, -14255, -10917, -7591, -2622, 4797, 10053, 12177, 7665, 3027, 4578, 3707, 1476, 3079, 300, -7467, -11405, -12622, -10366, -4376, 604, 6615, 8916, 3905, 3005, 6734, 4622, 3720, 6540, 2898, -4714, -9409, -10454, -8575, -5893, -1783, 4078, 2905, 545, 4061, 4667, 2942, 7989, 8494, 1982, -2306, -5421, -8108, -7777, -5774, -1881, 1446, -282, -153, 1557, 1571, 4877, 8019, 6142, 4125, 1112, -4388, -6347, -5618, -5074, -1812, -511, -2629, -1228, 491, 608, 4072, 6797, 6952, 4892, 615, -2810, -3319, -4822, -3228, -513, -2421, -2962, -1254, -2560, -945, 4549, 6190, 5813, 4472, 842, -1658, -3132, -3704, -1687, -1234, -2621, -2071, -3415, -4038, 306, 3925, 5496, 6504, 4890, 1725, -54]
367e4k876L10K229j138j921M41j440M84L439L120K913J57r51j027l143k504K606
384F45l26l735M23K4l192M64M323L067J810J136O50j263k963M93J446l284q32
401a114o5l876k358K049K285K258K937J193N87n80j081J457L76j500o21k756l852
418d661j180n7J010K954J271J514J799j132J44L392l9p59m54k921l940j842m44
435e345J370P84O12J776j40n99L424K492j03K149k06l893k718j598j452N55j9
452b911r1J35p75M25K412J762K527K666p81j818j648k130k18m20j140O18p42l071
470e200J187K050N69L159K927n11j652l13o5j635r77J773r47m098n29J646j954
487d570J235M847J030j209J158Q6j547L8J576k19k231j546M3k665n51L138J527
$$ y = [-54, -2930, -2620, -391, -1529, -3450, -3009, -4449, -3965, -526, 2594, 5507, 5664, 4713, 3686, 543, -1961, 645, 319, -3416, -2993, -2969, -6161, -5697, -1374, 1693, 3503, 4639, 5289, 4026, 1063, 1556, 3002, -282, -1114, -1179, -5055, -7413, -5364, -3079, -821, 2116, 3309, 3896, 3316, 2235, 3692, 4068, 2568, 1947, -809, -4661, -5841, -5898, -4888, -1934, -663, 851, 2650, 1518, 1662, 5054, 5015, 4256, 3802, 881, -3059, -4901, -5345, -3975, -3191, -2579, -803, -943, -1542, 1882, 4374, 4271, 6420, 6214, 2321, -397, -1995, -3447, -2892, -2911, -3002, -2867, -3642, -3217, -805, 957, 3484, 6150, 5369, 3551, 1903, -227, -445, -865, -2005, -1387, -2129, -5200, -4013, -1963, -1394, 1765, 4692, 4181, 2529, 2216, 2151, 516, -461, 1312, 365, -3733, -4262, -2616, -4570, -3335, 1512, 2542, 1333, 2491, 2577, 1030, 1068, 2644, 2425, 194, -1352, -1309, -3974, -4525, -1387, 140]
504A40l60J598o91j032J431P69J84O72q30k202j041r86P2O97R52Q46p10o87J064
523a14L18q0K603O40k622n08J35k463J2K246L49q08R4j22r78J80J986J173j283
542G58P67m32k689k21K021o38M10J255r69j610N52Q72L83O12M20O5k167j250Q88
561i73r6O62J465l22j311j4J2K62J524N02k99r8k003q63L28k0N08Q65j36k1p57
582g85q9J945L12l79J480q19k067k91j23m19L21R26j57r60n67P70J176K1J359
601A654J254j917j057P09q95o61P37N22j346o84k54P74M95O53K310l29j224O61
619A402m52j080N11M99q33o19q60o47L21Q80R79J022k46J82l51p91J132L55n16
638H88J42m98k355j58Q63m30P50J261m7l17m68Q01O14J37L16M98j784j004M12
$$ y = [140, -220, 1378, 687, -345, 1086, 1855, 2039, 2711, 1881, -321, -1362, -2348, -2276, -1579, -627, 219, -491, -1178, -114, 204, 124, 2727, 3367, 745, 237, 372, -2091, -2079, 167, 516, -292, -198, -320, -1298, -1118, 868, 2041, 758, 1525, 1093, -1596, -1817, 204, -434, -24, 1231, 262, -1348, -796, 76, 459, 1071, 1491, 1556, -611, -1861, -973, -1069, -407, 1058, 736, -575, -589, -577, -315, 1209, 1711, 1412, 1314, -689, -1552, -1224, -1244, -736, 129, -7, -28, -785, -874, 1071, 1383, 1004, 2484, 1665, -402, -693, -816, -1235, -914, 12, -145, -1105, -1672, -902, 274, 295, 1654, 2908, 991, -66, 643, -252, -913, -176, 346, -1000, -1684, -1938, -1164, -669, -16, 2294, 1965, 741, 1402, 950, -130, 381, 880, 47, -572, -1432, -2079, -1758, -878, 101, 1123, 877, 1059, 708, -83, 1049, 1404, 888, 1030, 532, -1823, -1981, -1118, -1548, -798, 463, 416, 99, -369, 432, 1046, 1183, 1499, 1997, 213, -791, -379]
657c79j336L36J868o47p58N34r9j84Q33J445J50n97m15o60j124k64J669j01j032
676g61J057m63r87O22R61R6O79L00r88m03n41N09k45K40K32Q9j384n5L68O20O73
697F19M32o78J70p73o95Q12O43m35K93l19o72J30J16O55K30K25j04m74r76J21
717f80R90n15N39J44o68m59K07J64M77J034l08k64o99n20j86L13L01O27o11r4
737b08m1p45O25J263o6J27J49r11p21N38r1P2M40p18k98n36O8Q76K79N39N77k34
759I84o95P1l13N3M84J65j228k18r7p81K98J203N72R4k51K2K57m60N69M01p61
780C69l72l23j000j81N30N5O38P30m01j04K74J94M74M71k70k31j059n12on25N67
801f82Q59q33q6O27m18O95R30K51k36No27m80m28l18L58K5j59n2m80Q5O70Q35
$$ y = [-379, -1715, -1379, 489, -158, -916, -382, -481, -665, 168, 1613, 1763, 1166, 751, 91, -1033, -1297, 372, 271, -761, 296, -167, -1154, -532, 429, 525, 1204, 1504, 516, 113, -428, 81, -164, 76, 308, 397, -987, -1042, -674, -54, 619, 1051, 373, 543, -230, -925, -113, 530, 95, 388, 69, -603, -473, -357, 298, 528, 753, 649, 175, -801, -680, 310, -205, 334, 478, -190, -649, -442, -278, 199, 1233, 925, 661, -38, -558, -744, -431, -130, 497, -114, -208, -249, -994, -369, 894, 828, 955, 1104, 193, -528, 10, -81, -9, 431, -287, -585, -1121, -1053, -177, 102, 641, 1218, 984, 289, 360, 47, 100, 584, 749, -479, -697, -794, -1575, -1277, -74, 498, 592, 341, 363, 620, 160, 729, 1130, 369, -3, -326, -1326, -1507, -977, -922, -284, 446, 45, -59, 215, 409, 883, 1354, 1084, 853, -206, -718, -724, -1249, -682, 177, -656, -742, -115, -533, 162, 1092, 1343, 1107, 1112, 485, 5, -423, -741, -383, -358, -517, -569, -1049, -964, -294, 541]
823E41J38K89j40l55j17j98PM26l93n51l10k77j06K11O94J000j38n07J57l02J69
844B38M78K83m84j70o29p16J08M36P8K65L29o1q5o22N73O46M8N7j91r83j24J00
866d26m34N60O71k93m96p2K6M04M74K81J62n13j46j58m75M83L57j72j26l19l46
887e58J73L06J8L18K76m30k62L19l79L90K35L3j88m30k40K40k23r7O91p8m19n
909c10l1J8J69O78k0j15l92l96K44L55j03N3l45kk98m11N81L25J78L83l05l81
931a25J69l1L76L23k00l66l13l93m94N55p5N64L10k97j33Q0k66N52O57l72J76
952F97n48m52l53L36j2r8L79m11K32q0j8Q62j5J60L35p72j87J58o13K47J75j31
974a09n34J34j58J26O20L95J37kn49K40k97p4M50k99l43M8k99o43P72K82j81L92
$$ y = [541, 679, 968, 828, 473, 356, 158, 165, 591, 198, -353, -663, -940, -1046, -835, -141, 859, 721, 214, 371, 69, 238, 716, 999, 515, 345, -284, -1000, -892, -456, -378, -113, 216, 155, 70, -552, 21, 667, 715, 772, 581, -402, -526, -426, -860, -300, 371, 78, -418, -490, -464, -60, 414, 695, 857, 344, 198, 40, -435, 48, 405, 233, 107, -212, -558, -385, -79, -61, 257, 533, 103, -159, 160, -219, 171, 406, 439, 251, -179, -419, -179, -402, -499, 192, 114, -305, -310, -341, -323, -154, 524, 504, 389, -3, -399, -155, 200, 97, 150, -195, -197, -495, -906, -325, 0, 178, 561, 256, -125, 44, 13, 389, 712, 512, 146, -167, -560, -1054, -499, -574, -10, 300, 3, -130, -50, -316, 236, 893, 521, 697, 149, -303, -656, -320, -332, -430, -51, -462, -230, -310, -328, 534, 519, 679, 1014, 242, 55, 213, -400, -153, 22, -109, -643, -509, -667, -541, 79, 474, 611, 609, 60, 300, 3, -71, 379, 80, -263, -215, -514, -1157, -385, -103, -284, 108]
996A08M54j60k94J44J86j77J77k3k65q21J18J75k67K29N96r6j97J42K8K9L25j46
1018B65L81m96l79K0R3q0J12k9k59L53l52L80K46j10J04M98n76l10K42l80j9M92
1040A96k65k25K0K03onJ61N85o99M6K74m62k04P94n45K11j83Q9n15N14J34P3m
1063A87l71R4m6j9L76j51l12N39j56n77N58Pj31J59J47n23P6L16n25J86K04K81
1085C19m34k91Q83m56m30N57L34m85O8L18p52p8P02l69j67K45R7j90k06L95K49
1106C09m2J45L14o02j40L66l48k2K19m86k35J56j05K08M15k8j61M12k48K48j55
1127B20J58mm89k74L33l55o13R01J33l72N16K5k94L76J98n5O4j64l6m86l51J24
1149d45J70M0N9K71k57k12O28m56N24N98o63J35k51m37K2J10j11L8k94N36n56
$$ y = [108, 562, 402, 108, 252, 438, 261, 438, 415, 150, -671, -553, -378, -645, -416, 180, 84, -113, 29, 57, 86, 411, 265, 646, 150, -229, -209, -116, -196, -84, -113, -372, -19, -371, 9, 255, 145, 249, 747, 171, -139, 103, -277, -296, 196, -69, -294, -274, -71, -77, -82, 79, 664, -35, 11, 285, -177, -381, 413, -132, 79, -104, -15, -530, -16, 118, 191, 187, -184, -90, -136, -155, 221, 70, -242, 297, 141, -436, 122, 129, -2, 157, 304, -219, -143, 173, -352, -166, 38, 319, -115, -406, 477, 21, -409, 148, 482, -3, 65, 383, -369, -447, 255, -114, -281, -36, 61, -129, -335, 60, 309, 267, 412, 726, 124, -16, 350, 2, -20, 199, -287, -522, -366, -471, -263, 152, 124, -37, 375, 127, 375, 220, 378, 374, -115, -389, -56, -411, -1024, -123, 10, -362, 154, 179, -115, 261, 459, 404, 468, 304, 268, -218, -569, -445, -275, -235, -176, 95, -162, -374, 254, -202, 322, 920, 257, 392, 141, -296, -274, -164, -275, -237, -531, 5, -551]
1170e51K8N67N98m28M02J70q88J18L68l42k22K65k92k52K81q1j03K99M8L87k09
1191A63j08N78n84Q6L13j99q91N86j44m70L68J57M4J85j72J58J36Q5Q2K9l43n7
1213Br3k32L24m05k83O09k9j84P56k55p01Q19M5o6N3k55j70k1NQ3k09l62LM95
1237g1k01J87M16l33M46j43m62J57N18p08O07j45l8k64j84K34l50J0L08K54o77
1258d39K81K92k9n4L3P5j69L7j57k14K91M0j62J90j96J21l67L19J72J5n3M27l38
1281A15j67K1K31m55M60j57n40K01N2n1M05m7l8Q7l30P62j86j88M07l19m25M64
1303C02l90l77K69K9j77K8K5J52L87n1J58n0k76L29k23l21j8M77m96J88j4l86
1325d35K42K50k21K16M51q5N0Lk14qj18m8j92m58J74J1j68K96K71j45J19M63l60
$$ y = [-551, -523, 44, 642, 214, 616, 786, -102, 16, 384, 42, -180, 85, -207, -459, -178, -259, -362, -63, -15, 372, 163, 55, 633, 49, 135, 448, 249, -642, -56, -200, -670, -302, -145, -101, 84, -88, 70, 206, 291, 373, 402, 59, 2, -91, -323, 1, -404, -687, -78, -107, -291, 465, 210, -491, 328, 373, 307, 360, 105, -65, -86, -81, 2, -207, -569, -566, -71, -272, -85, 331, -2, 444, 301, -161, -4, 514, -194, 413, 268, 230, -34, -218, 16, -334, -324, -16, 238, -439, -158, 134, 105, 51, 84, 159, -10, 27, -130, -344, -53, -13, -175, 15, -181, -60, -427, -108, 64, 79, 26, 453, 115, -52, -31, 200, -255, 205, 48, -492, -291, -239, -290, 115, 68, 30, 117, -213, 549, 363, 175, 582, 263, -162, 302, -88, -465, -196, -167, -344, -316, -291, -139, 248, 197, 355, 305, 29, 358, 135, -186, -204, 273, -223, -35, -49, -435, -193, 57, -164, 52, 503, 418, 468, 471, 257, 249, 131, 83, -109, -567, -393, -382, -550, -254, 17, -128, -9, 454, 94]
1348I4Q0J12j21O4J15m85M6j27l47R1L7M05K30K6l64N49Oj37L72l02l98J92k71
1371a33l41J05R6k60L45JJ11K26k39J58K66k3O2J30o47J75k61k2R1K29n16K53
1393a94J40j40K80Q2O7R8l79K88M0l5o4k53k92r4O10m53j84K79J27j40L56o9m2
1416B8K53K38k10j90k64J93j31k6P8p8k63L40k22K8L34L6J42j20j02k84K40k42
1438b22l3J37K72j00j15q3k95K10j60K81K01j04J65q5m50M76K73l42O7L1j78K49
1460A95n92J91L32O5l57K19j93J73R6J42j8J54p07N32k10q0J22k45l1JL02j71
1482h0J97m52K30L46k22J28P6j17R3R6l30k55J95k14j2J75r9K19J6j25j0L55l50
1505a40L26jm57N45l58K4j93l4L30K6k60M7j52K26K92q6j22J36L31m03pj17k14
$$ y = [94, 174, 286, 165, 229, 344, -141, -95, -222, -569, -478, -441, -36, 194, 220, -144, 405, 411, 274, 646, 344, -54, 138, -133, -474, -369, -273, -533, -188, -187, -76, 150, -89, 69, 335, 312, 374, 504, -143, 32, -229, -251, -160, 69, -447, -194, -54, -194, 86, 168, 235, 333, -46, 242, 282, 247, 183, -70, -362, -456, 154, -299, -483, -204, -77, -217, 139, 70, 28, 281, 519, 309, 119, -145, 48, -83, -109, -31, -109, -372, -32, -254, -226, 108, 144, 286, 166, 64, -220, 20, -222, -255, -118, 154, 54, -61, -144, -439, -229, -389, -108, 93, -11, 154, 69, -381, 95, 368, 26, 93, 124, -54, 195, -397, -206, 126, 191, -166, 53, -140, 33, 129, 271, 253, 407, -300, 232, 22, -58, 64, -181, -212, -211, 91, -80, 117, -335, -105, 241, 19, 147, 223, 106, 199, 295, -35, -290, -95, -309, -321, -146, -245, -26, -10, -135, -145, 210, -140, 186, 185, -272, 273, -85, -61, -254, -288, 42, 68, -192, -145, -297, -71, 221, 135, 13, 149, 480, 77, 70, -47, -261]
1528b61L5R3Nl4qq7q1L39l8M28J03l90J89k23J43l08j19L00m78M6J7K15k96J25
1552b85N29l06J79J28JJ4j05Mk9k1n42L63p7j76L4L64j23M5n2K07L6N5k28N92
1576F07k63j97r0k56k3M6q0J15J65k28J38o6O1K08J08p7L6N5m38jK94m19N20m84
1600b69j18P6J46K55P3p3M36m97J2K06k5n98M07K6l97j3L12k47J72P5K04k18m6
1623a01J39K01L3l00R2j76j25N42l62k68R6L2K33m3j54r3L52k13K5L26k21J70
1645A85j12R6j03n7L5r9l90L14p8O0N7K80j08j42J30l1R2O3p4j17K30m7l44K11
1669E1J24k40j89o6L16K86l73M69jm16L23J24k13l7l51L19J81n76n3L77k37p9
1691b61K73J86o3R2J7p9K96l14k9kLl10K39l77K07j61K11j9K26R0K7k54j18L40
$$ y = [-261, -226, -133, -128, -162, -170, -257, -338, 1, -37, 391, 494, 104, 293, 70, 213, -95, -214, 86, -392, -346, -329, -114, -410, -285, 244, -62, 117, 245, 246, 260, 155, 159, 130, 109, -433, -70, -147, -323, -289, 75, -48, -3, -55, 152, 188, 243, 15, 607, 344, 147, 57, -199, -222, -176, -256, -141, 24, -204, -66, -132, -71, 137, 245, 168, 204, 259, -179, -180, 114, -305, 215, -269, -387, -311, -165, 90, 163, 90, 526, 29, 41, 247, 222, -376, 31, 57, -340, -353, -41, -288, -116, -41, 163, -55, -101, 38, 239, 272, -28, 64, -112, -237, 305, -57, -325, -229, -197, 36, -7, -161, -254, 98, -115, -90, 236, 15, 185, 73, 169, 66, 9, 44, -55, -445, -131, -209, -149, -92, 188, 80, -62, 68, 37, 129, 192, 118, 1, 231, 184, -160, 51, 175, -65, -254, -320, -4, 282, -91, 378, 377, -39, 284, 408, 195, 158, -193, 126, 307, -269, -322, 55, -182, -261, 12, 198, 135, 227, 244, 165, 461, 147, 118, 116, 119, -191, 48, -329, -122, -283, -72, -91, 135, 225, 252, -2, -120, 220]
1715B20k76j60L42J6n43L76j60k18J66M40m51K98K56j06n8L73k11k97O1j33n3
1736a18P2M8p6j08j0J71k17L17K92m16M80J5o3j54j66k09L28o95M97k7k03JK20
1759b1l08N59J38k31N6J07l11L3K42n2k17l95L78k19R3J35L7j05J64Qq3n8J82
1782A32j97L19ql96j1J80N9l42J09K3n0K17k9n8J65J35N5k46j33J72N0k76L17
1805A87l15j02L67j73j30K54J3l21L84j10o9j0l3Q7L28m20Jj60K89l11M9K01j33
1828a27K38j87K86j36j25J39Q4N5m64R8L31k26j72j1K0J24N4O7l8K29k62k6j97
1851b46O54p8m47K81k48n3J71k41P9k42K20K02r5O2K21k32J0K07N1l34L36L4m09
1874i7L30j03k8l61K21K7m6J3K23m1N2m7k64j83M50J09k11J46n9m34L19k68R7
$$ y = [220, -56, -216, 126, 142, -401, -25, -185, -403, -237, 203, -248, 50, 306, 200, 142, 515, 304, 7, 68, -65, -118, -46, 2, -74, -182, -192, -21, -238, 79, 371, -45, 435, 450, 387, 233, 67, -142, 186, -509, -12, -39, -242, -241, -21, -329, 230, 368, 137, 193, 300, -11, 22, 264, 212, -5, -400, -22, -241, -148, -13, 24, -81, 83, 91, 8, -50, 132, -65, 254, 246, -150, -161, 19, 78, -264, -155, -132, -182, 35, 6, -52, 113, 248, 303, 57, -76, 96, 146, -130, 187, -128, -230, 137, -36, -166, 88, 101, -220, 164, 54, -15, -25, -58, 29, 357, -63, -62, -222, 67, -244, -195, 6, -127, 111, -76, 210, 74, -51, 88, 172, 227, -237, -139, 192, -34, -206, -217, -197, -73, -19, 48, 10, 239, -23, -49, -246, 408, 330, -117, 164, -84, -137, 34, -207, -128, -370, -150, 52, -43, 19, 240, 8, 18, 225, 276, -58, 278, 312, -97, 233, 130, 102, -259, -38, -11, -57, -44, 179, 138, 190, 143, -121, -304, 146, 255, 44, 190, 131, -303, 16, -252, -155]
1897a55P7p0K57r6J23j81L12N5k43k3k23P4K62m48L81k55Q5j77K22J50k22L41
1919B46j67j56J47J45p5j44j5r5l20L12N7j86J39J26J00j38K35j47K30j81R6N2
1941B61k95R2lK07k79k2l83L46Q3J7j95K29rJ40q9k06J39J01j04k10J89l63K50
1964a04M6O1k01j6L97K03j89j09p0R9P0j05k01J44Q3j38j19J5J17N2n5R0k19K87
1988A38j84n7L30l06Q8L05j45k3m6k02o3P0Jm2L41l20M0J09P9J94L6k57p2M0l64
2013c10K29R4k74k8J42O3pNp6L09k04J27j70K27J59k99k16K87M8k75J07kNJ7M01
2038C59l21J24j69q8K11j81J39m5r9L3n6O5K52L1l06p7J72Q1j46J4p7n5J88j65
2062a16K89J9k45N7n7m2k1q0k0L35k91K59J46p4j20O9K2l37M06k31M5J62j96m0
$$ y = [-155, -78, -148, 109, 13, 136, -45, 267, 322, 79, 56, -167, -93, 169, -279, 102, -153, -68, -245, -23, 127, -95, 246, 79, -77, 70, 215, 140, -4, -19, -114, -434, -122, -65, -251, -112, 14, 114, -24, 211, 64, 294, 113, 209, 261, -34, 58, 55, 262, -17, -39, -422, -76, 7, 24, -171, 58, 49, 189, 100, -106, 33, 134, 30, -180, 9, -354, -104, -58, 3, -198, -214, 183, 386, 197, 88, 18, 117, 187, 82, -119, 25, 108, -30, -149, -134, -17, 35, -20, 70, -149, 138, -46, -103, 227, -79, 9, 314, 169, 146, 100, -102, -165, -95, -94, -136, 205, -115, -75, 34, 113, 307, 343, 86, 14, 54, -310, -81, 13, -261, -289, -147, -84, -91, -86, -162, 147, -57, 70, -100, 127, 286, -13, -229, 58, 106, -169, -62, -64, -59, -42, 359, 38, 162, -7, -95, 116, -65, 74, 29, -70, -37, -93, -28, 224, 255, -51, -128, 44, 125, -21, -7, -84, -139, 49, -116, 173, 192, -53, 4, -53, -95, -116, -196, -216, 119, -172, 87, 233, 159, 39, 108, 130, -207, 199, -32, 13, 175, -21, -61]
2086f1j32M6k0K6J65Q2M1L3j56r3J85j37Q5j00R4qj32k4n1QJ94J2j7j00N9j8K04
2113A85j56o7j78J61J9m8K13j11J82k64mJ12J8k34j7J23L10k49j68K55l97M44
2135A29j83j46J93kj29n6K3L39k09L91j41j18m1J70j56j0K2l3j97J09J65o3o2
2158ek91P4P8pN13m76k9J38j88L33l97K34k54K74N0m8j11q5M22l12K50K2J36k36
2182H5oj70K97k32j41P0kK21o2k49Q9K30k61J31K7O9k35K49j44J13j21k0NR3k83
2207b47L74l35J30J9J03q7J72j15k86L47j4p9K09l0r0l41L35m76N18k38R7J06
2229G2l00L30j45J23q8O5J09Nk49j2J34J96k53L8k27L04L0m1k35J48R9j12L1K44
2253B66j36j94K5p6P3j64L19l36J41R6J2k03M22k27L4Q4k16M5kJ72k83mJ82m07
$$ y = [-61, -193, -147, -167, -141, 24, 106, 147, 180, 24, -69, 116, -21, 64, -36, 58, 50, -82, -106, -157, -149, 45, 57, 40, -60, -1, -19, 185, 29, -38, -216, -55, -36, -84, 129, 18, 200, -64, -68, 44, 62, -172, -189, -66, 244, -5, -173, 82, -315, 129, -54, -200, -7, -9, -138, -194, -171, 168, -41, 350, 209, 91, 50, 220, 64, 54, 76, 43, -154, -45, 120, 57, -5, -296, -222, -144, -151, 362, -114, -143, -5, -193, 140, -257, -23, -277, -3, 47, -1, -112, -197, 225, -87, 163, 185, 321, 85, 79, -91, 206, -26, -167, -97, -99, 122, 60, -189, -100, 130, -131, 0, 27, 96, -139, 110, -34, 79, -42, -62, -57, 36, -247, 127, -208, -78, -59, 44, -43, 129, 14, -272, 75, 61, -18, 191, 161, 71, -270, 65, -411, 107, -131, -34, 72, -228, 102, -43, 80, -8, 57, 166, 171, -78, -90, 44, 240, -13, 25, -202, 102, 132, 91, -144, 4, 103, -9, 22, 266, 130, -64, -39, -115, -42, -206, 113, -223, -82, 14, 26, -177, 245, 18, 52, 136, -80, -35, -37, 135, -148, -152, 30, -377]
2277c77L58k7N5j05K61n4M1p3j72J91o7Q9j69K0j60p8P0j6L21k98M03j12k57K16
2301F0r2M3K02k66j80M12n84M77m5j24K20k7j88q5M78m49J37o9L13O1j93Q9K53
2324D43n08K4k17J96K5j35J32j80n4L55k66R3M10l99O5R0q4L01l40p5J23p3o5
2347a39K0O0J49L9j09Q5Pj5m1L3J79k47k59J52o2j51N07m12K52m06L42M7K1r4
2371d2J44q9k5l74L79J0l46M88k10K3J1nK0rM2l12L58j57L18j62K9R3j93J29P6
2396A96k44j0J22k91J82M0k1M5k51P1K1K83Lk94L68p4k94M60l73J6O3m6nj16o
2421a55j6L90k86L40N6k77R2j15L11k90K78m65m2J97J11j55j10K82l15J32O7m6
2443a6R8K6J7j27J7K18l90J43L35m75J88K05l95K50o9K13l13K18l00M8J31%q5
$$ y = [-377, -19, -46, 9, -96, 165, 111, 152, 79, -93, 98, 31, 120, -49, -29, -189, -267, -197, -213, 108, -190, 213, 101, -156, 60, -32, 11, 213, -53, -233, 179, -405, 72, 27, -97, 123, 96, -92, -177, 301, -148, -11, -80, 233, 294, 101, 190, 443, -65, -41, -258, -62, -37, -172, -40, -220, -274, 81, -185, -92, 318, -81, -16, 74, -10, 291, -49, -124, -1, -74, -139, -119, -59, 90, 129, 20, 105, 112, 97, 56, 89, 268, 21, -238, -86, -148, -299, 208, -204, 48, -358, -16, 31, 52, -42, 102, 13, -12, -386, -7, 3, -343, 145, -65, -42, -31, -36, -16, -25, 17, -295, 63, -94, 224, 62, 91, 184, -9, 120, 196, -48, -58, 64, -227, -45, -5, -26, 19, -232, -161, -140, 143, 146, -148, 220, 146, -148, 312, -61, -45, 18, -28, -33, -149, -155, -171, 219, -67, 273, 329, 52, 144, 29, 340, 50, 328, -137, -179, 18, 129, -26, -136, 146, -169, -37, 30, -16, 82, 108, 125, -2, 15, 233, -157, -14, 321, -154, 34, 239, -156, 94, 25, 238, -75, 143, -157, -109, 22, 22, -63]
2466f3K0K0kL7j78O9K11m05L41r2J96P7m59M27p6j55L4M38n19j33K04K51k55k9
2490d1q1J18j02K39M9k1j97L42m11J1J3J09P7Q8l08jj03J16L32j43M1j03N8k53
2514a71L27j24j27KJ74q6j0k03l6K96K30m58P1J59q1J96j34L0P1j46J8r5l7P3
2538f1Jlj9J27o1q3r1J35M8J18J3j70Q4k85P31n32L4J46k44k74J60M22L3j26P7
2563A80k30m6K91j05r8K62k10J8j89K25kl7k38M4K67q2L8m24L90r7r6K81M0l34
2587a52J25J71o8j6p4k54K92J20j92J52q0qj58J54J97Mj01K9j81l8P7q8L7j06
2611a58o6L14L56k17k87J65j60K65k24K59k25J23k42P5K28j92n2r9K44j07m15
2632d15M95j27M5L9j97L02J5l14L23l2j93J07k62K72j01j7J80l78K9P8K41k46
$$ y = [-63, -43, -23, -25, 12, -166, -97, 114, -291, 50, -42, 154, 231, -228, 199, 123, -32, 2, 440, -79, -212, -8, 243, -12, -41, -122, -4, -106, 133, 182, 161, -36, 306, -105, -94, -81, 28, 105, 193, -115, -116, -219, -103, 229, 86, 127, 24, 82, -171, 156, 32, -95, -93, 81, -5, -15, -218, -254, 42, 272, -186, -115, 44, -37, 159, 25, 55, 126, -20, -2, -97, -134, -61, -60, -63, -82, 45, -16, -99, -190, -55, -7, 111, 124, -46, 38, -247, 484, -48, -14, 132, -112, -386, -226, 196, 229, 103, 180, -50, -96, 195, 90, -8, 254, 44, 62, -127, 98, 96, 59, -179, -135, 132, 50, 88, -336, 54, -43, -139, 142, 182, -152, -27, 144, 76, 60, -14, -268, 24, 144, -48, 104, 24, 16, -142, 12, 209, 213, 112, 141, -40, -78, -1, -89, -52, -158, -224, 90, 446, 229, -58, 107, -53, 212, -12, 247, 22, 145, -97, -22, 206, 14, -38, -137, 107, 0, -415, 80, -47, -2, 37, -160, 142, 157, -157, 166, 134, -59, 48, -214, 58, -43, -60, 120, -258, -229, -151, 90, -156]
2654a56J21n2J09J67Mk79J2m5J07k2n7q0J68K47j85k7o7J76k5P7l58K02k5j1K52
2679B53l93K33k27M10k38j05PK61j94J28m1l06j53L99J75l04K42j89O0k82O1L21
2701A18J47k68k2J70j83L66m52m5QJ34P2k93J28J62Q4l66L25J12l60K05J75j83
2723C4p0k9m1J25m11L30M33l81L2k5O5l01M37K5j48K6k0RK68m91P4L41l58Rl3
2748a00J29M3l8Q5k08K71m23K79K2Jo4J52K6k76J23j53o9K66Q5k17j85L15J5J23
2772B02j19J19j33j15j23K27l2k4k45K69l08L11j24rP4l8Ql8M02l17qK31j29k04
2796a23K28k01%O5m1R8m18K37K80J65k44k88L21J46k27n2J61k48K06K0l01KJ62
2819e2J51o8J08j8j18L5Jk51J26K23l42Q9K92m77M83o6l68L18j02J5o1N2O2p3
$$ y = [-156, -35, -87, 22, 189, 193, -86, -74, -119, -12, -34, -91, -171, -3, 244, 59, 32, -35, 141, 116, 193, -165, 37, 12, 1, 253, -140, 93, -134, 276, 38, -67, -60, 201, 7, 135, 94, -212, -365, 34, 209, -95, 147, -42, 18, -264, -203, 118, 265, -3, -25, 145, -38, 328, -124, -169, -161, -27, 45, -248, -120, 42, 126, -240, 85, 197, -163, 42, 217, 34, -36, -65, -106, 19, -392, -62, 371, -10, 22, -3, 62, -239, 198, 223, 75, 101, 81, 90, 358, -133, -59, 282, -76, -67, -100, 29, 72, 34, 119, -89, 182, -241, 38, 60, 61, -3, 149, 175, -101, 22, -131, -200, 66, 151, -66, -251, 64, 79, 202, 83, 202, 69, -46, -169, 58, 26, 2, -243, 26, -282, 29, -95, -104, -30, -68, -60, -98, 304, -13, -21, 210, 81, -123, 105, -96, -96, -31, -72, 26, -392, -155, 125, 290, 46, -242, 79, 225, -2, -54, 107, -141, 65, 85, -216, -214, -52, 99, 31, 139, 121, 3, 38, 39, -212, -86, 137, -205, -116, 176, -301, 182, 116, -252, 66, -36, -21, -82, -30, 32, -41]
2843d1O9N9K22k02Rj15j99J81KN8J57l1j62J71pJ84m15k9Q9K29k08j92L04l48
2867b15J37K07q1j16J53j08j21K98r6L00l63L8o2K38k4M7j04m17M79n9r5M1J63
2890B40k20N4O1j34q6J35q6L86k46J04j64K16n61L32k4p4J04pm3J11j1k24P1N9
2914gLJ32k48Qk4K7j69J80j14J41M18m50k0J21J94k85M43m71K14j0k61nK77k83
2938a89J81q6k4J23j76K33k08M13n01L02kL77l45j28p6l1pK46j17o1J3J91nl24
2962b01J20j72O32k34k28J01j06J53mJ90l01K0l4n5K48m43J58J12L08m01K29k7
2984F5L5j5p9p5%K05j3k1n9k77J80pL08j80P7j88O8J46j56J26j80J81j71nM67
3009D32m47J14Mr6O8l8k35K56k50J60j21J21Q4L3Rl63L99l40lK6K0J90J31j85
$$ y = [-41, 28, 87, 309, 107, 116, 1, -198, -17, -15, 43, 200, 169, 7, 178, 171, 355, -60, -89, 0, 229, 21, -171, 133, -215, -78, 129, 48, -68, 85, -23, -144, 154, 58, 358, -5, 33, -29, 209, 185, 232, 128, -289, 190, 131, 36, 77, 240, 20, 74, 135, 1, -85, 50, -36, 350, 104, 208, 44, 260, -301, 31, 7, -67, 37, 30, -13, 98, 87, -137, -66, -7, -4, 128, -120, -112, -136, -109, -278, -98, -212, -71, 347, -103, -123, -2, 192, -93, 350, -121, 93, 83, -178, -183, 94, -189, -8, -94, -118, 5, -171, 62, -146, 267, -234, 68, 66, 443, 98, -30, -106, -137, -144, 102, -15, -76, -63, 128, 123, -201, -81, -253, 379, 145, -83, 18, -88, 65, 61, 251, -50, -30, -64, -119, 129, -314, -156, -44, 264, -137, 92, 65, 100, 85, 6, -69, -69, 136, 123, 102, 43, -234, -54, -61, 247, 67, 144, -44, 24, 170, 14, 140, -40, 141, -30, -35, 432, -15, 99, 103, 7, 75, 37, -198, 58, -192, -32, -153, -32, 52, 85, 94, -269, 130, -210, -213, -187, -167, 23, 154, -31]
3033c1L95j43j11j21Qj93K22Q0n3j43k8K06l1J0J70l76J52r4Q5J13k68J34L6j9
3057@K59j56o1q4r6J23J14J77k63o3M28k48j51K32k14J69j05k13J78J5J0L26n05
3080a28K1Q7J18J16k22j34J73l5P9P7q3k71J5J84J16l24J68j74K54l2%K63r3R4
3104B69k80J24j06Q1k04J42N4j36L8K77m48K77J48j17k64O8M13k22j85j18J05
3125h4N3J05k29o5N6L7O8K76j20O3m2k18J7k20J81J6N7r3K00j21j02P7K54k83
3149a17J92j53m7J24J23j47J81l06l0L19l8m11L83k68n3N18k30j30m6J89j12J02
3171D3j01j41L11L5J46m77J94p9J95M7k50O8j88K17J93j72oJ57K6k75j9J48M4
3194A16j37j06J37j76k2K23kk09J12l5M5L80l21l3K02r6K15j0j72k21K04l37J95
$$ y = [-31, 364, 221, 110, -11, -3, -196, 26, 106, 53, -90, -118, 88, 57, 67, 237, -139, 13, -81, 4, 117, -151, -17, 19, 0, 259, 103, 42, -42, -138, -15, 99, 276, 13, -50, 378, 130, -21, 211, -3, 166, 61, -152, 26, 41, 51, 377, -128, -107, -20, 98, 214, -8, -142, 31, -4, 75, 152, 69, -202, -187, -3, 113, -211, -43, -217, 37, 5, 5, 268, 175, 269, -11, 113, 7, 88, -116, 26, 80, -56, -18, 259, -189, 88, 236, 119, -145, -77, 336, 114, -71, -189, -84, -31, 74, -155, -220, -164, -127, -59, 217, 97, 160, 118, -100, -83, -303, -122, -106, -49, -142, 58, -63, -165, -88, 166, -117, 75, -78, -125, -1, 122, -25, 156, -150, -180, 139, 101, -310, 73, -195, -248, 270, 40, -90, -136, 53, -59, 43, -58, -199, 112, 147, 293, -184, 10, -69, 126, 173, -77, -9, -197, 20, 213, 41, 35, 192, 218, -57, -76, 72, 116, -21, -127, 10, -166, -188, 35, 33, -176, -64, -99, -54, 326, 5, -28, 174, 78, 293, 283, 111, -110, 94, -243, -48]
3217d8m4j08J6L28k18J56l67L13J69k95k8n7J06N4j77K55j68p2O6Q9K19q4J34
3240B39m93M7L63k32j36k6L76K1k23o9J38K0o5M4j45j1J78k0j58J92k00J32O5
3263C7j07j38L60L0O8l42J4N0L23l40j9m8K87N6j49o8j12L0m7n0o0L74n76L63
3287f4R0k1K89l66K6L53l99j5Q4K7K85m93L0L43j36m3J07O4l50L75k78J88j0k41
3311a55K28k45J14j9MJ35o5N3j70J43n9n9n5N2N6r7M9J40k16jK32j29m1J9L30
3336B44m3j23j16J15j76N0K8L3M4k31K56J8M6o0J67m43L05j82j6J34l66M14n3
3359D5j68O9kk05J25RK55j98J5K54k97k7R7k25N20k37l1j70M96l32o9J65j07P5
3383E7m4p5k43L84Q3k37J95k39K59j60J95q3q5K41J1l1m33K20j17j20J42J17J18
$$ y = [-48, -92, -200, -184, 144, -74, 82, -285, 28, 197, -98, -126, -183, -77, -23, -200, 55, -113, -185, -119, -30, 189, 105, 239, -254, -207, 156, -76, -212, -238, 138, 159, -64, -133, 5, 25, -40, 4, -141, -152, 26, 6, -152, 40, -160, -28, 37, -70, -208, 152, 182, 250, -92, -78, -28, 295, -45, -64, -112, 175, 231, 82, 14, -98, -68, -115, -165, -225, 149, -427, -64, 26, 5, 294, -72, -46, 307, -92, -107, -23, 4, 289, -204, -174, 169, 33, -10, 97, 161, -189, 186, -92, 96, 86, -155, 73, -172, -58, -77, -73, 62, -3, 50, -120, 23, -36, -95, -150, -98, -42, -139, -90, 50, -166, -167, 65, -64, -105, -86, 244, 201, 78, -38, 77, -99, -49, -21, 12, 56, -175, 81, 99, 145, 85, 252, -191, 114, -68, -84, 50, -316, 98, 45, -123, -54, -56, -261, -136, -127, 128, -70, -55, 199, -98, -125, -28, -253, 267, 30, -1, -171, 325, -7, -76, 89, -18, 57, 13, -62, -305, 79, 162, -75, 120, -119, 140, -20, 175, 92, 7, 248, 259, 228, -205, 15, -102, -222, -80, 37, 155]
3406A55j19m5M9k32J46O0o8lQ9L9j5k11O3J37q1J72m33M01m5l03J90J92j90L45
3430B93j01j89r9K52k15j7k2J13p7P6j88O8J78p7J21r4q5O3j18J37j36o0K10j42
3454a09J27P0k91R5L91n06j7L62k98L25k57K06j33L35j85lj08m0K0K11k12m4q8
3477a49K07j48mQ4q3J00j74J39N1pj84K00m22J96J66Q3j33j43J91J20j40%M19
3500C69l85QR0l00pL00k67Q0M6L48m15K64k7K0j73k5K64k58J72q0n3m0J56N8j10
3525C5J10k24k17L49k69L04j26K28l44J27l54K12L65l10J26j81L11j63M3K9Kn4
3547aK04j10j42k89L93M1k03r1K72j15j07M34m79m3L42l6k49J93n2J83j76k36
3569b67L80J21q0l04L76J9j87p6J17o0L5k48Q1K55k56J57N2k70K26omR6j93J0
$$ y = [155, 36, -9, 40, -192, -46, 14, -54, -57, 32, 71, 56, -155, -92, 45, -36, 136, -297, 104, 59, -244, -54, 138, -52, 293, 192, 3, -96, 156, -59, -76, -98, 15, -62, 14, -174, -106, 72, -5, 116, 22, -63, 0, -118, 19, -117, -177, 33, -109, 18, 88, -203, -108, 283, -223, -240, 122, -176, 149, -108, 98, -35, 300, 115, 112, 4, -36, -16, 195, -17, -61, -149, 58, -90, -94, -10, -93, 7, -167, -28, 23, 16, -168, 32, -390, -194, -28, 55, -78, -221, -30, 90, -50, -50, 369, -16, -8, 82, -218, -225, 75, -192, -112, -66, 282, -133, 131, 104, 124, -49, -74, 190, -68, 104, 24, -29, -69, 87, 145, 35, 145, -79, -296, 53, -216, 88, -38, 190, -154, -27, -381, -169, 196, -114, 12, -169, 142, -21, 22, 51, 53, -1, 203, 93, -49, -338, 55, 96, -107, -198, 74, -41, -148, 286, -193, -236, 106, 70, -179, 14, -38, 145, -31, -267, 113, 234, 154, -150, 226, 245, 58, -18, 99, 39, 74, -174, -93, 162, -94, 63, 115, -155, 71, 65, 61, 157, -36, -26]
3593b6K47k59J18r2k15K31P8j55R0J62m6k17J33M7J01j20j45R1L8l09J95j4j4
3616h1kR7j6M0R2k2j80M22k15j41K04k16K79k62J9J57k55Q6J86r7j4j32K02k22
3640g1J21K11m04L78k56r8L01N3m31p0J76J94j65Pj2L33l28P7j68J56l28K85j90
3663b29K97l93J51j0J41J03J80j36r7M8J68j72q4Jj25J01j66J23k7J80N6Jl37
3686b26m7L32q9J99j75K67m49L15k19P6M6j5p5J94l30J25nN0M1K32m53M56j90
3709F0Jr7K29j35j85j7OQ2J87o5j81K16k62L04J8k04P3r6M8ML3o3l19O20m16J41
3735a8Q8j65K16j16j99L5L09M4k3j58R5Rj80Q5j17n7K00J9m0j3k8P7l80K19m7
3760a45K30l22L97q6j64KO1K03l7j30rj90K04J74k47J47j69K7J06j09k6L43k55
$$ y = [-26, 221, -38, 80, -12, -227, 4, 82, -73, 17, 179, 133, -84, 49, 96, 197, 77, -68, 23, 61, -248, -53, -67, -81, -83, 14, -2, 38, 130, 108, -72, 350, 135, -6, 198, -18, 261, -1, 18, 175, -80, 6, 192, 95, 81, -51, 151, -71, 50, 261, -143, 235, -21, -119, 182, 235, -196, -266, -90, 104, -61, -54, -66, 267, -61, 16, -152, 4, -324, -39, -229, 68, -325, -174, -184, -43, 60, 240, 104, 7, 55, 223, 51, -33, -32, -157, -56, -222, -99, -126, 54, 110, 111, -226, -273, 59, -30, 169, -6, 261, -188, 127, -92, -16, 30, 15, -60, 134, -196, -71, -76, -26, 15, 247, -206, 250, 60, 61, -36, 193, 58, -127, -144, -138, -56, 131, 66, -115, 101, -161, 143, 161, -43, 30, -66, -18, -14, 19, -44, -363, 257, -159, -18, 70, -95, 121, 5, -194, -159, 150, 194, 171, 13, 108, 117, -63, 22, -95, -152, 48, 67, 27, 14, -14, 63, -317, -98, -145, 85, -237, 160, 74, -90, -88, -27, 176, 139, 9, 0, -190, 14, 188, -59, 88, -81, -54, 52, -57, -83, 260, 5]
3783Ej57j01N02l02l0K99j72M6j50J17k4J34k88J33PlR6j42j04J72K34j00n5l17
3807b00K72j12j39rK92M0R1l49J12K96k12J63l04r1O9K31M1j08j06J22mo4j78
3830a47m4J39o7j16K75J78j39Q9k87K74o9J0j12K57l71J99RJ17l09J52j9o9R1
3853D1k3l90L29N0R6k46j32K38k48N0K41k03K92j06J42Jo9l2j75K15j27j62M15
3876A97m0m08M15k44K24k27K80J8j15K39m05O3J3q0r5J79OJ25K4j2O9l76j8J93
3900B5j99L71J22j82j1j26n5J00N8o9j08M9J40L00k47k86R9J42j11lj26J75j74
3923a16j45K0K89k12K65k46Q1J72k00J87m6J89n84M57j57N4k70K15K04j48j25
3944a16L3K34j83n7K00J7p0J85j86J65l52L16j08J2j94RK83k08L2Q4j17LJ47k35
$$ y = [5, -152, -253, 249, -53, -83, 216, 44, 90, -60, 57, 33, 167, -121, 12, 19, 16, 112, -30, -134, 38, 272, 172, 117, -200, 72, -40, -179, -188, 104, 144, 235, -114, -2, 294, 82, 245, -59, -150, -81, 150, 191, 83, -23, 99, 95, 31, -147, -191, -52, -119, -235, 40, 218, 79, 168, -119, 155, 86, 96, -16, 241, -130, 69, 78, 195, -114, 38, 19, -50, 41, 18, -372, -43, 7, 103, -143, -275, -37, -285, -235, 6, -197, 95, -11, 131, 132, 63, 31, -144, 71, -56, -218, 197, 157, -251, 164, -80, 144, -83, 197, 215, 100, 339, -66, -3, 10, -70, -165, 14, 20, 145, 169, 157, 226, -150, -168, 25, -174, 197, 319, 137, 126, 0, -55, 45, 103, 34, -74, -25, 115, 415, 168, -118, -19, 123, 12, 9, -117, 58, -116, -261, -241, 48, -164, 101, -145, -64, 108, -92, 95, 49, 238, -346, 111, -46, 8, -262, -47, 157, 9, -116, -83, 151, -32, -89, 111, 128, 58, 243, 57, 222, -130, 186, 78, 90, -104, -95, 188, -20, 12, 96, -21, -18, 129, -106]
3968a06J27j03N1P2k33M41m15L88l46K51l53J44L46m46K09L1J45j48j15R7p2K0
3990a5R9k77pM25n25M67j0j54l5j03L68j63j15O9n0l8j40K02j90K34m9O4o7j0
4014b0J12r8K69k95o3p2K70j87J8pL2K2K11k0j41p2j9j34M22k27k2K90k35n5J11
4039I0j90J90k68j2L39j15j34M9K45k00K22k01J2J29l01J62n7k54L48J24L9l66
4061a49J49Q1j88J9J6k4J21l5L2K69l70M5j22N4J53j7q5M5m7N0j88K73k0j73K22
4086A11k51R4J67Q5p6k46Q2j86J14L00j41j38R3J63k07o1j85K24j3J2M1K65k93
4109d6J03p2l16L20L90j83l13J88j7L9j45J02n8J13j24jM2J83j58l16M70r0Q1
4132A92p0J32m17J60q8J56K3j6j48J58J28K7j36k46k01PM58K3j66L87k69l04K22
$$ y = [-106, 21, -82, -31, 41, -192, 249, -166, 222, -124, 127, -226, -82, 264, -182, 27, 58, 203, 55, -60, 37, -35, -15, 84, -193, -200, 225, -300, 167, 157, 3, -32, -135, 233, 70, -45, 24, -26, -64, -204, -2, -192, 42, -7, 57, -10, -20, 92, -6, 263, -32, -95, -167, 103, -84, -66, -73, -41, -19, 192, 172, 31, -41, -60, -194, 228, 1, -21, 269, 34, -21, 90, -100, 90, -178, -190, 149, 34, -100, -51, 194, -6, 216, 15, 27, 156, -145, 17, -40, -294, 54, 178, 217, -149, 0, 81, -107, -88, -72, -96, 25, -10, 22, 291, -79, -34, -156, -102, 51, 34, -51, -6, -53, -3, -191, 82, 62, -111, 111, -140, -46, 121, 206, 130, -116, -34, -220, -106, 194, 53, -85, 8, 171, -36, -97, -282, -58, -71, -59, -18, 247, -46, 57, -15, -331, -11, 379, 196, -117, 71, 54, 93, -52, 50, -8, 105, -19, -20, 22, 205, 47, -269, 201, 111, 192, 122, 254, -163, -3, -91, 65, 88, 72, -76, 82, 210, 237, 101, -145, -346, -339, 119, 142, -24, 363, 94, -210, 12]
4155A2J04m80L27M5j94K85k1o6k49K36l99N42m26M89N1k17J50k27k2K30k44J17
$$ y = [12, 116, -364, -37, 8, -186, 99, 78, 12, -237, -1, -400, 142, -284, 205, 256, 39, 189, -38, -60, 170, -74, 43]
$$ [...]
8191B3
##END NTUPLES=NMR FID
##END=
