##TITLE=1H_DE-105_oil_TCM
 200.13MHz,CDCl3,
 8 sc
 
 1.8.2025
##JCAMPDX= 6.0         $$ Bruker NMR JCAMP-DX V2.0
##DATA TYPE= NMR FID
##DATA CLASS= NTUPLES
##ORIGIN= UXNMR, Bruker Analytische Messtechnik GmbH
##OWNER= pz
$$ XWIN-NMR		Version 3.5
$$ Fri Aug  1 13:51:33 2025 Russian Standard Time (UT+4h)  she@DPX200
##.OBSERVE FREQUENCY= 200.1313
##.OBSERVE NUCLEUS= ^1H
##.DELAY= (6, 6)
##.ACQUISITION MODE= SIMULTANEOUS
##.ACQUISITION SCHEME= undefined
##.AVERAGES= 8
##.DIGITISER RES= 18
##SPECTROMETER/DATA SYSTEM= spect
##.PULSE SEQUENCE= zg30
##.SOLVENT NAME= CDCl3
##.SHIFT REFERENCE= (INTERNAL, CDCl3, 0, 14.3821)
##AUDIT TRAIL= $$ (NUMBER, WHEN, WHO, WHERE, WHAT)
$$ ##TITLE= Audit trail, XWIN-NMR		Version 3.5
$$ ##JCAMPDX= 5.01
$$ ##ORIGIN= Bruker BioSpin GmbH
$$ ##OWNER= she
$$ F:/spectra/data/she/nmr/H-C/1/audita.txt
$$ ##AUDIT TRAIL=  $$ (NUMBER, WHEN, WHO, WHERE, WHAT)
(   1,<2025-08-01 13:50:12.65 +0400>,<she>,<DPX200>,
      <created by zg, POWCHK disabled, PULCHK disabled
       configuration hash MD5:
       00 E9 B6 7A A2 85 ED C7 34 08 36 98 17 FE 4E 26
       data hash MD5: 16K
       AE E1 C5 3B 4B 96 C5 0A 9A 1D FA 99 1C BD 45 A5>)
$$ ##END=
$$ 
$$ hash MD5
$$ 25 A5 76 F5 25 8E B4 62 5B 4A E0 22 6F 1E C0 61
##$RELAX= 
##$RELAX= 
##$RELAX= 
##$RELAX= 
##$RELAX= 
##$RELAX= 
$$ Bruker specific parameters
$$ --------------------------
##$DU= <F:/spectra>
##$EXPNO= 1
##$NAME= <H-C>
##$PROCNO= 1
##$TYPE= <nmr>
##$USER= <she>
##$AMP= (0..31)
100 100 100 100 100 100 100 100 100 100 100 100 100 100 100 100 100 100 
100 100 100 100 100 100 100 100 100 100 100 100 100 100 
##$AQSEQ= 0
##$AQ_mod= 1
##$AUNM= <au_zg>
##$AUTOPOS= <>
##$BF1= 200.13
##$BF2= 200.13
##$BF3= 200.13
##$BF4= 200.13
##$BF5= 200.13
##$BF6= 200.13
##$BF7= 200.13
##$BF8= 200.13
##$BYTORDA= 1
##$CFDGTYP= 0
##$CFRGTYP= 5
##$CHEMSTR= <none>
##$CNST= (0..31)
1 1 145 1 1 1 1 1 1 1 1 1 1 1 1 1 1 1 1 1 1 1 1 1 1 1 1 1 1 1 1 1 
##$CPDPRG= <>
##$CPDPRG1= <>
##$CPDPRG2= <>
##$CPDPRG3= <>
##$CPDPRG4= <mlev>
##$CPDPRG5= <mlev>
##$CPDPRG6= <mlev>
##$CPDPRG7= <mlev>
##$CPDPRG8= <mlev>
##$CPDPRGB= <>
##$CPDPRGT= <>
##$D= (0..31)
0 0.7 0 0 0 0 0 0 0 0 0 0.03 0 0 0 0 0 0 0 0 0 0 0 0 0 0 0 0 0 0 0 0 
##$DATE= 1754041812
##$DBL= (0..7)
120 120 120 120 120 120 120 120 
##$DBP= (0..7)
150 150 150 150 150 150 150 150 
##$DBP07= 0
##$DBPNAM0= <>
##$DBPNAM1= <>
##$DBPNAM2= <>
##$DBPNAM3= <>
##$DBPNAM4= <>
##$DBPNAM5= <>
##$DBPNAM6= <>
##$DBPNAM7= <>
##$DBPOAL= (0..7)
0.5 0.5 0.5 0.5 0.5 0.5 0.5 0.5 
##$DBPOFFS= (0..7)
0 0 0 0 0 0 0 0 
##$DE= 6
##$DECBNUC= <off>
##$DECIM= 32
##$DECNUC= <off>
##$DECSTAT= 4
##$DIGMOD= 1
##$DIGTYP= 9
##$DL= (0..7)
0 120 120 120 120 120 120 120 
##$DP= (0..7)
150 150 150 150 150 150 150 150 
##$DP07= 0
##$DPNAME0= <>
##$DPNAME1= <>
##$DPNAME2= <>
##$DPNAME3= <>
##$DPNAME4= <>
##$DPNAME5= <>
##$DPNAME6= <>
##$DPNAME7= <>
##$DPOAL= (0..7)
0.5 0.5 0.5 0.5 0.5 0.5 0.5 0.5 
##$DPOFFS= (0..7)
0 0 0 0 0 0 0 0 
##$DQDMODE= 0
##$DR= 18
##$DS= 0
##$DSLIST= <SSSSSSSSSSSSSSS>
$$ [...]
##$SUBNAM0= <"">
##$SUBNAM1= <"">
##$SUBNAM2= <"">
##$SUBNAM3= <"">
##$SUBNAM4= <"">
##$SUBNAM5= <"">
##$SUBNAM6= <"">
##$SUBNAM7= <"">
##$SUBNAM8= <"">
##$SUBNAM9= <"">
##$SW= 18.0517328524113
##$SWIBOX= (0..15)
0 0 2 0 0 0 0 0 0 0 0 0 0 0 0 0 
##$SW_h= 3612.71676300578
##$TD= 16384
##$TD0= 1
##$TE= 0
##$TE2= 300
##$TE3= 300
##$TEG= 300
##$TL= (0..7)
0 120 120 120 120 120 120 120 
##$TP= (0..7)
150 150 150 150 150 150 150 150 
##$TP07= 0
##$TPNAME0= <>
##$TPNAME1= <>
##$TPNAME2= <>
##$TPNAME3= <>
##$TPNAME4= <>
##$TPNAME5= <>
##$TPNAME6= <>
##$TPNAME7= <>
##$TPOAL= (0..7)
0.5 0.5 0.5 0.5 0.5 0.5 0.5 0.5 
##$TPOFFS= (0..7)
0 0 0 0 0 0 0 0 
##$TUNHIN= 0
##$TUNHOUT= 0
##$TUNXOUT= 0
##$USERA1= <user>
##$USERA2= <user>
##$USERA3= <user>
##$USERA4= <user>
##$USERA5= <user>
##$V9= 5
##$VALIST= <valist>
##$VCLIST= <CCCCCCCCCCCCCCC>
##$VD= 0
##$VDLIST= <DDDDDDDDDDDDDDD>
##$VPLIST= <PPPPPPPPPPPPPPP>
##$VTLIST= <TTTTTTTTTTTTTTT>
##$WBST= 1024
##$WBSW= 4
##$XGAIN= (0..3)
0 0 0 0 
##$XL= 0
##$YL= 0
##$YMAX_a= 213086
##$YMIN_a= -302290
##$ZGOPTNS= <>
##$ZL1= 120
##$ZL2= 120
##$ZL3= 120
##$ZL4= 120
##$ABSF1= 10
##$ABSF2= 0
##$ABSG= 5
##$ABSL= 3
##$ALPHA= 0
##$AQORDER= 0
##$ASSFAC= 0
##$ASSFACI= 0
##$ASSFACX= 0
##$ASSWID= 0
##$AUNMP= <proc_1d>
##$AZFE= 0.1
##$AZFW= 0.1
##$BCFW= 1
##$BC_mod= 2
##$BYTORDP= 1
##$COROFFS= 0
##$CY= -3
##$DATMOD= 1
##$DC= 2
##$DFILT= <>
##$DTYPP= 0
##$F1P= 0
##$F2P= 0
##$FCOR= 0.5
##$FTSIZE= 0
##$FT_mod= 4
##$GAMMA= 1
##$GB= 0.15
##$INTBC= 1
##$INTSCL= 1
##$ISEN= 128
##$LB= 0.25
##$LEV0= 0
##$LPBIN= 0
##$MAXI= 10000
##$MC2= 0
##$MEAN= 0
##$ME_mod= 0
##$MI= 1.114404
##$NCOEF= 0
##$NC_proc= 0
##$NLEV= 6
##$NOISF1= 3.799351
##$NOISF2= 2.8
##$NSP= 1
##$NTH_PI= 0
##$NZP= 0
##$OFFSET= 14.38212
##$PC= 1
##$PHC0= -1220.548
##$PHC1= 35.19254
##$PH_mod= 1
##$PKNL= yes
##$PPARMOD= 0
##$PSCAL= 0
##$PSIGN= 0
##$REVERSE= no
##$SF= 200.129724274929
##$SI= 16384
##$SIGF1= 3
##$SIGF2= 2
##$SINO= 400
##$SIOLD= 16384
##$SREGLST= <1H.CDCl3>
##$SSB= 0
##$STSI= 0
##$STSR= 0
##$SW_p= 3205.1282051282
##$SYMM= 0
##$S_DEV= 0
##$TDeff= 0
##$TDoff= 0
##$TI= <>
##$TILT= no
##$TM1= 0
##$TM2= 0
##$TOPLEV= 0
##$USERP1= <user>
##$USERP2= <user>
##$USERP3= <user>
##$USERP4= <user>
##$USERP5= <user>
##$WDW= 1
##$XDIM= 8192
##$YMAX_p= 0
##$YMIN_p= 0
$$ End of Bruker specific parameters
$$ ---------------------------------
##NTUPLES= NMR FID
##VAR_NAME=  TIME,          FID/REAL,        FID/IMAG
##SYMBOL=    X,             R,               I
##VAR_TYPE=  INDEPENDENT,   DEPENDENT,       DEPENDENT
##VAR_FORM=  AFFN,          ASDF,            ASDF
##VAR_DIM=   8192,          8192,            8192
##UNITS=     SECONDS,       ARBITRARY UNITS, ARBITRARY UNITS
##FACTOR=    0.0002768,     1,               1
##FIRST=     0,             0,               0
##LAST=      2.2672688,     0,               0
##MIN=       0,             -302290,         0
##MAX=       2.2672688,     213086,          0
$$ Real data points
##PAGE= N=1
##DATA TABLE= (X++(R..R)), XYDATA
0@%%%%%%%%%%%%%qJ6j6J6k0K8l2M0m8N6o4P2q8J04j20J36j53J74k00K26k53K88
$$ 0 0 0 0 0 0 0 0 0 0 0 0 0 0 -8 8 -8 8 -12 16 -16 24 -24 32 -32 40 -48 56 -64 72 -81 93 -107 119 -134 154
35A54l27L66m10M58n08N65o29O97p72Q56r47J043j147J264j394J536j693J866
$$ 154 -173 193 -217 241 -267 298 -331 366 -406 450 -497 546 -601 663 -731 805 -888 978
53I78k060K277k522K801l121L497l940M474n130N963p059Q562j0763J4297k0870
$$ 978 -1082 1195 -1327 1474 -1647 1850 -2090 2384 -2746 3217 -3842 4720 -6043 8254 -12616
68a2616L7006j48649j78031L93355J03150j74647O1724J31794r8907j6351P0205
$$ -12616 24390 -124259 -302290 91065 194215 19568 81292 213086 114179 97828 168033
79A68033q5535j05968N3066j8604j15733L393O9832m5311m3148N0459M8353L044
$$ 168033 82498 -23470 29596 10992 -104741 -101348 -31516 -76827 -119975 -69516 -21163 -18119
91a8119J5616K2050R420J0345K4409n59l7976j7263K2950j3183m8880k761K8269
$$ -18119 -2503 19547 28967 39312 63721 63162 25186 7923 30873 17690 -31190 -33951 -5682
104e682j3716j7777K1516J4217q430J5199J0678k3935L956L4148j5486l5314K0358
$$ -5682 -19398 -37175 -15659 -1442 -9872 5327 16005 -7930 -3974 30174 14688 -20626 -268
117b68K4857k2458j3915J6954J884j0786K089o75q966O445Q867j1285m772J5780
$$ -268 24589 2131 -11784 5170 7054 -3732 -1643 -2318 -11284 -4839 4028 -7257 -12029 3751
131C751O631r274j005Q048J233n583l483q36k311l14P51m258k602O724N405n006
$$ 3751 10382 1108 103 8151 9384 3801 318 -518 -2829 -3143 -2392 -6650 -9252 -2528 2877 -2129
147b129j911Q611L657n830j027M419j583l044P65k964m038L646J258o034o46P073
$$ -2129 -4040 4571 8228 2398 1371 5790 4207 1163 1928 -1036 -5074 -1428 -170 -6204 -6850 223
163B23P07l667J980M225k18j091N09j208o02J246k079l027R54K290j562j726J413
$$ 223 930 -2737 -757 3468 3250 2159 2668 1460 858 2104 25 -3002 -2048 242 -1320 -3046 -1633
180a633K279l94r61O79O96J30M50m55r24M28J209p46j616O15J150p82j483P30
$$ -1633 646 252 -709 -30 666 796 1246 791 -133 295 1504 758 -858 -243 907 125 -1358 -628
198f28M21k90j99O15m87P78N78P6j150J091O56o49j098L42L83q80j30k84L29r7
$$ -628 -207 -497 -696 -81 -568 210 788 864 -286 805 1461 812 -286 56 439 -441 -571 -855 -526 -623
218f23M3n1L7P76O71p94N6N34J52m40k36Q2l78r1R4m76j14M28L73j28k04Q28R9
$$ -623 -580 -631 -594 182 853 59 115 649 801 361 125 207 -171 -262 -168 -644 -758 -330 43 -85 -289 539 638
241F38r5l78J57J32n52K25L6m33K29Q1m71k3L92L44m67j22L20K21m12K07q0L58
$$ 638 543 165 322 454 -98 127 163 -270 -41 40 -431 -454 -62 282 -185 -307 13 234 -178 29 -51 307
263C07l41L59k65m7M9K21o73Q7J74J76P9m99K55J47J04j60Q8r4N9K30k06l22L05
$$ 307 -34 325 60 13 62 283 -390 -303 -129 47 126 -373 -118 29 133 -27 61 -33 26 256 50 -272 33
286C3N5j82qQ9j30J61J08j88j9P5P2k14L69k17n6J58m50M37k09j52L38n8k94J73
$$ 33 88 -94 -102 -13 -143 18 126 -62 -81 -6 66 -148 221 4 -52 106 -344 93 -116 -268 70 12 -282 -109
310a09N1j6j14K21J75j84k2O7J30j84m7l08N74r1q3n2k7N6j82K74l56O11j58k74
$$ -109 -58 -74 -188 33 208 24 2 69 199 15 -32 -340 234 143 60 8 -19 37 -145 129 -227 384 226 -48
334d8j23J48j0Ll91L00j37M58j93k2K15j54Rj56j7J97m8jP4O1k4k48K95j90J07
$$ -48 -171 -23 -33 -30 -421 -121 -258 200 7 -15 200 46 55 -101 -118 79 31 30 104 165 141 -107 188 -2 105
359A05m0P7k48J51k0j82K12j66n3K63r4%n2j1Q1J82l44Q9K28j98M8n2m1k7k80
$$ 105 65 142 -106 45 25 -157 55 -111 -164 99 5 5 -47 -58 23 205 -139 -50 178 -20 28 -24 -65 -92 -372
384c72M32j58K32m9j37K40P3j71j40L23k86J6j32k2K76l60K06j41R9K20m4l26
$$ -372 60 -98 134 85 -52 188 261 90 -50 273 -13 3 -129 -151 125 -235 -29 -170 -71 149 105 -221
406b21P4J38R1J11j50j47K7n3L27j79r7J82j91J88m72K47J60K43n18L20J04l19
$$ -221 -147 -9 82 193 43 -104 -77 -130 197 18 -79 103 -88 100 -372 -125 35 278 -240 80 184 -135
428a35K16O6q1j75M8J47k50K35J39k59J60k74lL87ml21M5m4P6R1j87K19j22J13
$$ -135 81 147 66 -109 -61 86 -164 71 210 -49 111 -163 -166 221 217 -104 -59 -103 -27 64 -123 96 -26 87
452H7j21K37k33Q9J56m29r9L61j24J25J27l93q1K71J25k2j42J98l4m1N9k53m8
$$ 87 -34 203 -30 59 215 -214 -313 48 -76 49 176 -217 -298 -27 98 76 -66 132 98 57 116 -137 -185
475a85K12m9l0J67m36K27M1q5k8J78k88K99R0r1k81L18l42L54q8j44L28k48j21
$$ -185 27 -22 -52 115 -321 -94 -53 -138 -166 12 -276 23 113 22 -259 59 -283 71 -17 -161 167 -81 -202
498b02M61k97j0J70k39o9K23m4r5J24J70k97K9k5J59j24r3J39J81k24J05J1j09
$$ -202 259 -38 -48 122 -117 -186 37 -7 -102 22 192 -105 -76 -101 58 -66 -159 -20 161 -63 42 53 -56
521e6j01R1L04m63M12j31j10K18j04j68J24j00L24Rj68n26N45k70P6J70r9m2J79
$$ -56 -157 -66 238 -225 187 56 -54 164 60 -108 16 -84 240 249 81 -445 100 -170 -94 76 -23 -65 114
544A14o3p5p2j15M93O8k54l36J04n3K27k47N79l96Pk09J01J40j0M2J6o4k09K11
$$ 114 51 -24 -96 -211 282 350 96 -240 -136 -189 38 -209 370 -26 -19 -228 -127 13 3 45 61 -3 -212 -1
568aJ15m4Mj81k44K98L2q3J79J26l59J31R4l26q9L20q8O2j96M14L0m48N26k25
$$ -1 114 70 74 -107 -351 -53 -21 -104 75 201 -158 -27 67 -259 -348 -28 -116 -54 -250 164 194 -254 272 47
592D7k79J16J72k2J49k19K79l45J1J89l57M11l75M49l43O3O8O8k26M08l70L78
$$ 47 -232 -116 56 34 183 -36 243 -102 -91 98 -259 152 -223 226 -117 -54 14 82 -144 264 -106 272
614B72j87Jk59K83Ll7p7J98o2k58J23J86j11j83R6j00J43p0K7J29nj11J69p9j77
$$ 272 85 86 -173 110 113 76 -1 197 135 -123 0 186 75 -108 -12 -112 31 -39 -12 117 112 1 170 91 -86
639h6J31j13K11k34J66r7J87j57k31K45k65K04j1J9J47J36m06O31m61M4j97L60
$$ -86 45 -68 143 -91 75 -22 165 8 -223 22 -243 -39 -50 -31 116 252 -154 477 16 60 -137 223
661B23l06OK39J0Kj73R5k18Lm1L68k94J49KK7j53O0k58M12k72K91j84m1K56m96
$$ 223 -83 -77 162 172 174 1 96 -122 -119 -160 208 -86 63 65 92 -61 -1 -259 153 -119 172 -12 -53 203 -293
686b93K59O5m7j09J61R1k87K1K55J45m9l08J26P2m2J37r6l23L26o2j9j96K09r7
$$ -293 -34 31 -16 -125 36 127 -160 -139 116 261 212 -96 30 102 60 197 101 -222 104 42 23 -173 36 -61
710f1M9R6j30J18r9q6j12K93j19R1k41K72J1k17L8K04l5l51K86k19M60l51q7K49
$$ -61 -12 84 -46 72 -27 -113 -225 68 -51 40 -201 71 82 -135 -97 107 72 -279 7 -212 248 -103 -190 59
734E9M6N5q0l6j43NJ65j52J45K34j37j98M6K15m09K67l01K68j42l5K63j48R7k1
$$ 59 105 160 80 44 -99 -94 71 -81 64 298 161 -37 9 224 -185 82 -219 49 -93 -128 135 -13 84 63
758F3j16rq9Q6J07J5j46n8L57k56M7K32m81k5K28NM9r1J42l53N50j58k3P4l2l7
$$ 63 -53 -62 -151 -65 42 57 -89 -147 210 -46 1 233 -248 -273 -45 -40 9 -82 60 -293 257 99 76 150 118 81
784H1J55j58n4Q7j08M7K38n22M06k22O7L0O3l1l0K8k42L37Q3j86k70L42O0J7j19
$$ 81 236 78 24 111 3 50 288 -234 172 -50 17 47 110 79 49 77 -165 172 255 69 -201 141 201 218 99
809I9J2k00O7J20Nl38L43j04l3J38Lk67K39K2J3q2j91K25Q6k04n0j48J97M6k7
$$ 99 111 -89 -22 98 103 -235 108 4 -29 109 112 -155 84 106 119 37 -154 71 157 -47 -97 -245 -48 -2 -29
834b9R7j76K65o9p7K15m56L9J64L63k29j00J36j13k24P1r9L21K8k19p7L17k12
$$ -29 68 -108 157 88 11 226 -230 -191 -27 336 107 7 143 30 -194 -123 -222 99 127 -92 -169 148 -64
857f4L10k13k2q4Q9K46k78K20k18o6J09p4L4j61L60r3n3q1rm6r0K13k28J67Q5
$$ -64 246 33 11 -73 16 262 -16 204 -14 -80 29 -45 -11 -172 188 95 42 -39 -48 -94 -184 29 -199 -32 53
882E3m9k2j23K35j25J8RK30l40P6N6o7J05k07K52k18J17k66J31L05j52N1k10R3
$$ 53 4 -18 -141 94 -31 -13 -4 226 -114 -38 18 -49 56 -151 101 -117 0 -266 -135 170 18 69 -141 -48
906d8p2K29J3j83j3Q6k05J07K88l11Q4L13l35K29k10j06K23J53n3k41j19K4R2
$$ -48 -120 109 122 -61 -74 12 -193 -86 202 -109 -25 288 -47 182 -28 -134 89 242 189 -52 -171 -147 -55
929e5N1j39J59l64N10j80J4J51k18J28J73l13K67j96pk75K69K20n05K29J37K3
$$ -55 -4 -143 16 -348 162 -18 -4 147 -71 57 230 -83 184 -12 -19 -294 -25 195 -310 -81 56 79
951G9j89J02q1O6J86l0J3k79M6L05l32L9K52j91M4k15K04J2rj47R6j66K73k30
$$ 79 -110 -8 -89 -23 163 133 146 -133 -87 218 -114 -75 177 -14 30 -185 19 31 22 -125 -29 -195 78 -152
975a52J67Q0l42K86j38P3k53K76o3L08k62K04k76O6J0N9O8q4J08j15M1l6j38K41
$$ -152 15 95 -247 39 -99 -26 -279 -3 -66 242 -20 184 -92 -26 -16 43 111 27 135 20 61 25 -113 128
999A28P9l17K33K8R4n58K91k6l59L37m3K97p8n2n8J43l32J54M17k71k31Pj11L07
$$ 128 207 -110 123 151 245 -313 -22 -48 -407 -70 -113 184 106 54 -4 139 -193 -39 378 107 -124 -117 -228 79
1023G9P2l4l31K45j15J15J58m03K88n0k11k3j3K59K36l55L2K05l96K00J77l15
$$ 79 151 117 -214 31 -84 31 189 -214 74 24 -187 -210 -223 36 272 -83 -51 154 -242 -42 135 -180
1045a80Q0j40L66K29m23QK70j71r9Kk8M4k2L7K50j89p5n4J63j81o8j8L02k33N4
$$ -180 -100 -240 126 355 -68 -60 210 39 -60 -58 -86 -42 -64 -27 223 34 -41 -95 68 -113 -181 -199 103 -130 -76
1070g6P7kQ0J49j6J7k95J09k29K62k37R6r6L16j66n4J29j12l4J07m1K14j23J05
$$ -76 1 -1 79 228 212 229 -66 43 -186 76 -161 -65 -161 155 -11 -65 64 -48 -82 25 -16 198 75 180
1094A80k54L2N1K6j37K78k63J53k27O8K09Ok05K3J16k03L05j93O6o00N06L32j26
$$ 180 -74 -42 9 35 -102 176 -87 66 -161 -93 116 122 -83 -60 56 -147 158 -35 31 -569 -63 269 143
1117A43k25K79k6k62M9k8J0L31j61l98R4J62K19r9j52K56J91n71M12k40J39Q3
$$ 143 -82 197 171 -91 -42 -70 -60 271 110 -288 -194 -32 187 88 -64 192 383 -188 224 -16 123 206
1139B06l41L02r3r3k18M00j64j9n1j84J53O0J43P7L5j73l0J13l5Qj16K83n46L82
$$ 206 -135 167 74 -19 -237 163 -1 -20 -71 -255 -102 -42 101 178 213 40 10 123 88 96 -20 263 -283 99
1163I9N3O4m45K30N9L8J62j80n6L0j97O0O1k2k01K24J91k95j3J78m0J48k80L8
$$ 99 152 216 -229 1 60 98 260 80 24 54 -143 -83 -22 -44 -245 -21 170 -125 -138 40 0 148 -132 -94
1187i4j3J40M2M8k18J50M6q1J8%P3k77M21m73L56k59K8K33j4k44J7M3K31R0m13
$$ -94 -107 33 75 123 -95 55 101 20 38 38 111 -166 255 -218 138 -121 -93 140 126 -118 -101 -58 173 263 -150
1212a50K03n1M9o9p8m6J54K05j35p2j85J29Q1K5j69K66o4l29J76K37l76J82j43
$$ -150 53 2 51 -18 -96 -142 12 217 82 10 -175 -46 35 60 -109 157 93 -236 -60 177 -199 -17 -160
1235a60J57L16j67k07q2J09j6M03m59q8J76k45K84r1k6L3m1J00J02J26k73L0K5
$$ -160 -3 313 146 -61 -143 -34 -50 353 -106 -194 -18 -263 21 -70 -96 -63 -104 -4 98 224 -49 -19 6
1258Fq9J18l3l9N7o2J31j53L17k63r7r1J38OK2j03N2N4M83p39K46q1o2J9K76n5
$$ 6 -83 35 2 -37 20 -42 89 -64 253 -10 -107 -198 -60 -54 -32 -135 -83 -29 454 -285 -39 -120 -182 -163 113 58
1284E8n0P4J5K2J09J18n27JJ87K97n50K5Rq9L57j23L38k58K09k41j43L10N0k64
$$ 58 8 82 97 119 228 346 -181 -180 7 304 -246 -221 -212 -301 56 -67 271 13 222 -19 -162 148 198 -66
1308f6k15J54k9L7n9J97j05j5J13J00j48J94q6k4R4R3jj97j86J85J56l74j28M68
$$ -66 -281 -127 -156 -119 -178 19 -86 -101 12 112 -36 158 72 48 142 235 234 37 -149 36 192 -182 -310 158
1332A58qj00L6p3p8r1J65j83M1K72j47j05L8jO0r9Q3j95K1J6M91l51J18l8J12
$$ 158 150 50 86 13 -65 -156 9 -174 -133 139 -8 -113 -75 -76 -16 -115 -32 -227 -206 -190 301 -50 68 30 142
1357A42k44K26O3l10n1P0J58K72j49k45K85l62J06r2J95j95P7N6n9J4o0J20j66
$$ 142 -102 124 187 -123 -174 -104 54 326 177 -68 217 -145 -39 -131 64 -131 -54 2 -57 -43 -103 17 -149
1380a49K09J15m28K69o8k18N03l04J85k03k0K74n22O18k84J90k13K03k03O5Q7
$$ -149 60 175 -253 16 -52 -270 233 -71 114 -89 -109 165 -357 261 -23 167 -46 157 -46 19 106
1401A06j27n3rK11k10Q5K54l13O1o3J26k26L18J25k12M2Pj79J9J79l79L12J44
$$ 106 -21 -74 -83 128 -82 3 257 -56 5 -58 68 -158 160 285 73 115 122 -57 -38 141 -238 74 218
1424B18k32J31o3k76L0R3k3L8N4j29P2Ln6L20j82j12K79j35O1r9J15K72m94K66
$$ 218 -14 117 54 -222 -192 -99 -122 -84 -30 -159 -87 -84 -140 180 -2 -114 165 30 91 -8 107 379 -115 151
1448A51l77L43j72j27k1K52km00K07N49m09k62K02o9J50k43K73j53J98n5j84K39
$$ 151 -226 117 -55 -182 -203 49 47 -353 -146 403 -6 -268 -66 -135 15 -228 45 -108 90 35 -149 90
1470I0k02J6K28k40J27L7J8k65J36L1K08k13j53L24J25K9k56k2j57L84j74j05
$$ 90 -112 -96 132 -108 19 56 74 -191 -55 -24 184 -29 -182 142 267 296 40 18 -139 245 71 -34
1492c4k72M64j05j32Q8q4K44J43l58J46m5N9r5R5m3J0o4k6J1op7j98L30J67j82
$$ -34 -306 158 53 -79 9 -75 169 312 -46 100 55 114 19 114 71 81 17 -9 2 -4 -81 -279 51 218 36
1517C6k17M25j49o4j99M41l65Q8K24l0J13l66L24m01n4J71L1J75l49L18L7k63
$$ 36 -181 244 95 31 -168 273 -92 -4 220 190 303 -63 261 -140 -194 -23 8 183 -166 152 189 -74
1539g4nK00O6m00M76l64l5j5K14j33j76j14O27q5o1l19K23j22J97o5N3q3j47J89
$$ -74 -79 121 187 -213 263 -101 -136 -151 63 -70 -246 -360 267 182 121 -198 25 -97 100 35 88 5 -142 47
1563D7K03l02o0K31K1J14k76k3R6L99l18j60q9L18o5o5Q8l05P7J08j48L14k08
$$ 47 250 -52 -112 119 140 254 -22 -45 51 450 132 -28 -117 201 136 71 159 -146 -69 39 -109 205 -3
1586cj08J80m4R7l07K86r8m9K08q2j26mJ52Q4m35L27J27k11m6o4l0R9N8r1N5J14
$$ -3 -111 69 25 122 -185 101 3 -46 162 80 -46 -50 102 186 -249 78 205 -6 -52 -116 -146 -47 11 -80 -25 89
1612H9k2M0l86L90J37n36K04J44p4J56k32K69k01j12J4J96k6p6r2L46j66j20J69
$$ 89 67 107 -279 111 248 -288 -84 60 -14 142 -90 179 -22 -134 -120 76 50 -26 -118 228 62 -58 111
1635A11k24oj5K69l75N17r9j7k29N9K05r4j14o5m8j6Q2J3K54o03N99j12j67K07
$$ 111 -113 -119 -134 135 -240 277 178 161 -68 -9 196 102 -12 -77 -125 -141 -59 -46 208 -395 204 92 -75 132
1659A32k30J61q5J98k55%K26l62K39L0J3r2J70k13q2l0M3L79l44j0K04k24j38
$$ 132 -98 63 -22 176 -79 -79 147 -215 24 54 67 -25 145 -68 -150 -180 -137 242 -102 -112 92 -132 -270
1682b70O4K06K23k88L9l5j03L2K00q8Q5n9J3J44ql86L16k30m1K19j21PO9k4p7
$$ -270 -206 0 223 -65 -26 -61 -164 -132 68 -20 65 6 19 163 155 -231 85 -145 -186 33 -88 -81 -12 -36 -113
1707a13N0L34l47K2j90K52J74k9j20k71J77rm1r5J26K31k39J27j70J05k15M16
$$ -113 -63 271 -76 -54 -244 8 182 153 33 -238 -61 -70 -111 -206 -80 151 -88 39 -131 -26 -241 175
1729A75k41J11j00K57k93M1M5l8k8K20n2k01j90P7M47n92M92j64j58K44j01J9
$$ 175 -66 45 -55 202 -91 -50 -5 -43 -71 149 97 -104 -294 -217 230 -362 130 -34 -192 52 -49 -30
1751c0M1j00K41l14o8J84Q3j49m0J84k03M10j49N1q3l7j4k16L66p1k90J12K66
$$ -30 11 -89 152 -162 -230 -46 37 -112 -152 32 -171 239 90 141 58 21 7 -209 157 86 -204 -92 174
1774A74m4J84l14lrJ46p9N3k55L20j77m2p7L23L1j98j45L82j61O1n2j45L9Mk7
$$ 174 130 314 0 -3 -12 134 55 108 -147 173 -4 -46 -123 200 231 33 -112 270 109 170 118 -27 12 16 -11
1799a1J74j91j30M01k00J8k00J43N8Kk39L2K12P7k62L35l28jn9K03r1j8j27K53
$$ -11 163 -28 -158 243 43 61 -139 4 62 64 -175 -143 69 146 -116 219 -109 -110 -169 34 -57 -75 -202 51
1823E1l06N0L83j28k01M56l66P7o4M67k76O8k41K1o2L3j23J93p8o4L2K38j93N3
$$ 51 -255 -205 178 50 -151 305 -61 16 -48 419 143 211 -30 -9 -71 -38 -161 32 -46 -110 -78 160 -33 20
1847B0k69k2M10k72K57k78j42K44l0J81j08K13Q6k48r3K1Q9m2m47L89J56j46k49
$$ 20 -249 -271 139 -133 124 -154 -296 -52 -82 99 -9 204 290 42 -51 -30 59 17 -430 -41 115 -31 -280
1870b80K92Rl4O0q6k5J16j40J1J58O4q8l0j54L06p8k82K41l00L77m54L08l7j28
$$ -280 12 21 -13 47 -39 -64 52 -88 -77 81 145 57 27 -127 179 101 -181 60 -240 137 -317 -9 -46 -174
1894a74J55j0j34k00L85J04j52k0L4Q7q7J22j38J04j79J14L47m30J43OP4j07j15
$$ -174 -19 -29 -163 -363 22 126 -26 -46 -12 75 -12 110 -28 76 -103 11 358 -72 71 77 151 44 -71
1917g1J8K01l1j34j14P2J15j82L29n6l33L1L39r4l10J29P0j48L8K8L36j01q1p1
$$ -71 -53 148 117 -17 -131 -59 56 -126 203 147 -186 -155 184 90 -220 -91 -21 -169 -131 -103 233 132 51 -20
1941b0k7j39P7m1P5R8l9J10j58K53l55L53j05r9L8J30k3j87K08k6j84J14kk0m7
$$ -20 -47 -186 -109 -150 -75 23 -16 94 -64 189 -166 187 82 -17 21 151 128 -59 149 123 -61 53 51 31 -16
1966a6J91k39L60j04j24Q7j90N8n3J72k81j96M10R8j91n2k12L82j47K88k60j49
$$ -16 175 -64 296 192 68 155 -35 23 -30 142 -139 -335 75 173 -18 -70 -282 100 -47 241 -19 -168
1988a68N5O0k3K87l54K0J46j88J16j26Q6Q4n0j54L80j98j00kO8L7j49K2N3J62
$$ -168 -113 -53 -76 211 -143 -123 23 -165 -49 -175 -89 -5 -55 -209 171 -27 -127 -129 -61 -24 -173 -151 -98 64
2012F4j62J04j49q2K67o9J72m51K90J5J13r0m5r7J30o4L14m10j08K08r2R8J95
$$ 64 -98 6 -143 -225 42 -27 145 -306 -16 -1 112 22 -23 -120 10 -54 260 -150 -258 -50 -142 -44 151
2035A51K88m71O6j33K71j11R2k53J22k7n3q0N2J48j93j53J90J34j53L24n47K31
$$ 151 439 -32 34 -99 172 61 153 -100 22 -5 -58 -138 -86 62 -131 -284 -94 40 -113 211 -336 -105
2057a05J33j24M6L24k79m7j3j72L08J08k98N3J08P1R1o9J1j94K14j27L6l6l46
$$ -105 28 -96 -50 274 -5 -52 -65 -237 71 179 -119 -66 42 113 204 135 146 -48 166 39 75 39 -307
2080c07L05O8K3m6J17j75P1j9M2K3m2J60k54R0J91k66l4K50N5k13j06K0M7J37
$$ -307 -2 66 89 43 160 -15 56 37 79 102 60 220 -34 56 247 -19 -53 197 252 39 -67 -47 0 137
2104A37N9j02%j7K8J3o0j39J53m5j72K39j63j26K40p0r2P4J17J09j86J01k15K79
$$ 137 196 94 94 77 105 118 58 -81 72 27 -145 94 -69 -195 45 -25 -117 -43 74 183 -3 98 -117 162
2128A62l63Q3M7r9M55r7K9k34j13K72j71m3K07pj16j42R1O8R3j99J42J96j31J19
$$ 162 -201 -118 -71 -170 285 188 217 -17 -130 142 -29 -72 135 128 12 -130 -39 29 122 -77 65 261 130 249
2152B49m63K35p7j49K39N7k8K36j72j46M2j57L21l27L09k06q3O8k7K34l44K27
$$ 249 -214 21 -56 -205 34 91 63 299 127 -19 23 -134 187 -140 169 -37 -120 -52 -79 155 -189 38
2174C8j8oO9R6l09L8J06j07O7j05J07L9J07r9M9j25%J46k26J35J35j16j03N2R2
$$ 38 20 14 83 179 -130 -92 14 -93 -26 -131 -24 15 122 23 72 -53 -53 93 -133 2 137 21 -82 -30 62
2199F2l72N14J53k31o2K3n1m7j0j06K19n8K33k37p0J4J6J07j83R2q3J68j41j30
$$ 62 -310 204 357 126 64 87 36 -11 -21 -127 92 34 267 30 -40 -26 -10 97 -86 6 -77 91 -50 -180
2223a80K30p3R4R2r7K24n0k82k77L21O0L6j17m4J1j41K69o3r7m7j74N76k46r4
$$ -180 50 -23 71 163 66 290 240 -42 -319 2 62 98 -19 -63 -52 -193 76 13 -84 -131 -305 271 25 -69
2247f9J78j29L96m23J09M5j86Q7L66k77l89N26l59QO7M7PJ42Nj75j10K52k23K09
$$ -69 109 -20 376 -47 62 107 -79 8 374 97 -292 234 -125 -117 -50 -3 4 146 151 -24 -134 118 -105 104
2271A04j89j15L38n26L22K6J85j15L0j61J65j87K86j44j05K41m19O12m58J34J49
$$ 104 -85 -200 138 -388 -66 -40 145 30 60 -101 64 -123 163 19 -86 155 -264 348 -110 24 173
2292A73j45J24l02J83k26o1K31l8J09LR4J45l68Pr3K19o1k50M65k30J0K45l35
$$ 173 28 152 -150 33 -193 -254 -23 -61 48 51 145 290 -78 -71 -164 55 -6 -256 209 -21 -11 234 -101
2315a01K23l66N70m12J70N8l07J49M11l21l7J23p3J07j60j53L15j80Rj8J38J26
$$ -101 122 -244 326 -86 84 142 -165 -16 395 74 37 160 87 194 34 -119 196 16 25 7 145 271
2337B71n06j8Q8L12l70L15j49K32l72L69j67j2m8L6J08k03k27K79j40K66j73K64
$$ 271 -235 -253 -165 147 -223 92 -57 175 -197 172 5 -7 -55 -19 89 -114 -341 -62 -202 64 -109 155
2359A55n0q1o1L72l60M7L0l07M64j92K98n28K02o3J98OL8m9m2j04J13n9j09j31
$$ 155 105 24 -37 335 -25 22 52 -255 209 17 315 -213 -11 -74 124 130 168 119 77 -27 86 27 -82 -213
2383b13L39k18N5Jp5L6L76l65L5J9J87k80K39j34j42L35l84L90k22J7J5k0R2n4
$$ -213 126 -92 -37 -36 -111 -75 301 -64 -29 -10 177 -103 136 2 -140 195 -189 201 -21 -4 11 -9 83 29
2407B9r3R0J34k40j37P7K26n7N9m1J85j90L2l4l1M9r6j9j89R9M08q4n31K46j38
$$ 29 -64 26 160 -80 -217 -140 86 29 88 47 232 42 74 40 9 58 -38 -57 -246 -147 261 177 -354 -108 -246
2432b46K26K9n5K79n2j61p0l71K81K05J14k66K18j54q8K83J79l22k7L7P0K67m70
$$ -246 -20 9 -46 233 181 20 -50 -421 -140 65 179 -87 131 -23 -111 172 351 29 2 39 109 376 -94
2455i4k2M5J50j71M4l31K47K68l16J91p9j7j03M76m10K23j89O7k55Q4J79J76k90
$$ -94 -116 -71 79 -92 -48 -379 -132 136 -180 11 -68 -85 -188 288 -122 101 -88 -21 -276 -192 -13 163 -127
2478a27K19k95K07P2j75J22J30k40J24q4o6r4J14J50J32l86M24j35J01j98R1j81
$$ -127 92 -203 4 76 -99 23 153 -87 37 -47 -113 -207 -93 57 189 -197 227 92 193 -5 86 -95
2500i5K04j93J43P4l20K83N3k72L44l23m2J14J02P3j99j8m6J82J47N6k33J02j35
$$ -95 109 -84 59 133 -187 96 149 -123 221 -102 -144 -30 72 145 -54 -72 -118 64 211 267 34 136 1
2523Ar6J84QJ38k75l9m9N7p3J51k15K30J25l5j50K33k88J9O3NO5L94m03j66K22
$$ 1 -95 89 97 235 -40 -79 -128 -71 -144 7 -208 22 147 112 -38 195 -93 -74 -11 -6 59 453 50 -116 106
2548A06l59K73J36j77m0J65j51n4n3K41o8j96J43j51j65L15J53m02L35m2j08P6
$$ 106 -253 20 156 -21 -61 104 -47 -101 -154 87 19 -177 -34 -185 -350 -35 118 -284 51 9 -99 -23
2570b3J68k94P1k92M11j28K60k18K55o7m37K94j70P7K83Q7j78j81QK37l53L07
$$ -23 145 -149 -78 -370 41 -87 173 -45 210 143 -294 0 -170 -93 190 277 99 -82 -74 163 -190 117
2592A17k5k15K09J45l23L00k86lo5L59o2j43q9K7K11m15L28k31L7J30J44n9r7
$$ 117 92 -123 86 231 -92 208 -78 -81 -146 213 151 8 -81 -54 157 -258 70 -161 -124 6 150 91 -6
2615fj09J10n2J23k06j03K10o1J11M0P2q9J63l46K28M4k59J28J38J5j49r8K37
$$ -6 -115 -5 -57 66 -140 -243 -33 -94 17 57 129 40 203 -143 85 129 -130 -2 136 151 2 -96 141
2638A41j52K76k45l4M6K27J53l37j74L14j04j24O3j38oJ11r5M8o2N5K58l28J16
$$ 141 -11 265 20 -14 32 259 412 75 -99 215 111 -13 50 -88 -94 17 -78 -30 -92 -37 221 -107 9
2661IJ7K6mk9M3n0Q7Q9k03j34K08j31N9r2J37m8j56K61k07J83m01K34Q1k17J75
$$ 9 26 52 48 19 62 12 99 188 -15 -149 59 -72 -13 -105 32 -16 -172 89 -118 65 -336 -102 -21 -238 -63
2686f3n2J96k32r8J72J18l9k17R8L55p1n3j36M5m0q5J43J18m08L83K3J8j18P1
$$ -63 -115 81 -151 -249 -77 41 2 -215 -117 238 167 114 -22 23 -17 -102 41 159 -249 134 157 175 57 128
2710A28q9j95K27Q9p1j23%K05k05L08o09K71L24k67n8r8J59O9j45K74k16j52P1
$$ 128 39 -156 71 160 89 -34 -34 171 -34 274 -335 -64 260 -7 -65 -163 -4 65 -80 194 -22 -174 -103
2733a03O9N1L2K76l72M4N4j49P6K8m4K48k59mR9k14L62k71N6j08M27l47K85k40
$$ -103 -34 17 49 325 -47 -3 51 -98 -22 6 -38 210 -49 -53 46 -168 194 -77 -21 -129 298 -49 236 -4
2757dk62J96J41k75J87j56M27Ko26M12k48K20j06N1K36j62J07m8KN6j7n6m0m7
$$ -4 -266 -70 71 -204 -17 -173 254 256 -370 42 -206 14 -92 -41 195 33 140 92 94 150 133 77 37 -10
2781a0o3J39j89K57J47k84m3K2j8oJ3J02j82J13N0j22R8L8PJ84k35j85j96L02
$$ -10 -73 66 -123 134 281 -3 -46 -24 -42 -48 -35 67 -115 -2 48 -74 24 62 69 253 18 -167 -363 -61
2805f1K22j78K68l08j20J89M7K13j61Q4J20j36j56j81J91j9Q5O3r0j81L56j28
$$ -61 161 -17 251 -57 -177 12 59 272 111 195 315 179 23 -158 33 14 99 162 72 -109 247 119
2827A19m9j60J59l11K97J28j10J10j64n9Q9j1j48j6K3J16j00n5J55j62K29k60
$$ 119 70 -90 69 -242 55 183 73 183 19 -40 49 38 -110 -126 -103 13 -87 -142 13 -149 80 -180
2849a80J72l0N8J65k33J76K0j34K09k50k1J66M6k26K20j19m5o4j48R3L88k61j58
$$ -180 -8 -38 20 185 -48 128 148 14 223 -27 -48 118 164 -62 158 39 -6 -70 -218 -125 263 2 -156
2872a56l8K54k34K91l55K62K28k36l25K69m8l2K6N7PN9o3l7L02j80Rk21K09k16
$$ -156 -194 60 -174 117 -238 24 252 16 -309 -40 -88 -120 -94 -37 -30 29 -34 -71 231 51 60 -161 48 -168
2896a68J77K0r6j68K21N1J98n6j28J51m88J69J83J44j16j9m7j00L5L7O9M5j49
$$ -168 9 29 -67 -235 -14 37 235 179 51 202 -286 -117 66 210 94 75 28 -72 -37 0 69 114 -35
2919c5k48P7K59J0O5l05L87m10K21K30k34q1P8k40p8J9L28J13j47M1j09k4J38
$$ -35 -283 -206 53 63 128 -177 210 -200 21 251 17 -64 14 -226 -304 -285 43 156 9 50 -59 -83 55
2942E5K9j23J18l65M02j36j58J26j32M05k88J65n8RJ7p0J0mj28M7j82L36pj4K8
$$ 55 84 -39 79 -286 116 -20 -178 -52 -184 221 -67 98 40 49 66 -4 6 2 -126 -79 -261 75 68 54 82
2967H2j20P7j6OM7j19J2J34k34K96N4l8j14j08J06J60m95J67j7J81K37n3k65N5
$$ 82 -38 39 23 29 76 -43 -31 103 -131 165 219 181 67 -41 65 225 -270 -103 -120 61 298 245 -20 35
2991C5J61m85L13J09l7L0j14p6J48j44O5k01M79%l75N2J2R7J49l47l4P5K86q9
$$ 35 196 -289 24 133 96 126 12 -64 84 -60 5 -196 283 283 -92 -40 -28 69 218 -129 -163 -88 198 109
3015A09k15l8O8P4J11k0P8r6J87j11j39k8r2M03j14j94j8j14M49l35n6N3K19p6
$$ 109 -106 -144 -76 -2 109 89 167 71 258 147 8 -20 -112 291 177 -17 -35 -149 300 -35 -91 -38 181 105
3039A05m18O00o4k19o1j47L89l02K53J45k00L5J9j60Qk8k30L95o5j35P5k11J40
$$ 105 -313 287 223 4 -57 -204 185 -117 136 281 81 116 135 -25 -17 -45 -275 120 55 -80 -5 -216 -76
3062g6K7r1L82j76J8K03k05K7j26m2p0RM84p5m37k4o5N45m13M9Q5j24J82jq7R2
$$ -76 -49 -140 242 66 84 287 82 109 -17 -59 -129 -120 364 289 -148 -172 -237 308 -105 -56 29 -95 87 86 -1 91
3088I1j72J03N0j02o3Q3k51J94j16N3P3j24j2l3M06j33M0j37J34j30K07Q7j45
$$ 91 -81 22 72 -30 -93 -10 -261 -67 -183 -130 -57 -181 -193 -226 180 47 87 -50 84 -46 161 248 103
3111A03j0k46q9N89j8m68J03J5m0K65l49K23k19J81K23l02J98l56Q8J05m8R6k8
$$ 103 93 -153 -242 347 329 -139 -36 -21 -61 204 -145 78 -141 40 263 -39 159 -197 -109 -4 -52 44 16
3134A6J19l20N5K3J07K99j62l72J69J44M6R9j70J33k17jJ56j63Q8Jr7K42J8l52
$$ 16 135 -185 -130 -107 0 299 137 -235 -66 78 124 223 53 186 -31 -32 124 -39 49 50 -47 195 213 -139
3158a39K46k90K51N0k21J03j19O0J9j1M5J63j79j34K92k80L6M26k72k17j50L25
$$ -139 107 -183 68 118 -103 0 -119 -59 -40 -51 -6 157 -22 -156 136 -144 -108 318 46 -171 -321 4
3180DL74n31J11r0J60J99j25j03J87JJ43k16l75K79R7K0m8j4l84L27K7j88L49
$$ 4 378 -153 -42 -132 28 227 102 -1 186 187 330 114 -261 18 115 135 87 73 -311 16 43 -145 204
3203B04j7j43J03k32M8pK1j13K22o8M4n8o7K00k04J86m8j73N9J39J30l38J90j57
$$ 204 187 44 147 -85 -37 -44 -23 -136 86 18 62 4 -63 137 -67 119 71 -102 -43 96 226 -112 78 -79
3227g9K57j65K30l18L09k30o3J18K73k74r9J30l56K75O5k97K39j26J06q3J14j61
$$ -79 178 13 243 -75 234 4 -59 59 332 58 -41 89 -267 8 73 -224 15 -111 -5 -88 26 -135
3249a35K18j13O1p9q1K06j66K37m0J79j62j54Q2J18l26L64k22Q0k8k88J17J25
$$ -135 83 -30 31 -48 -129 77 -89 148 108 287 125 -29 53 171 -155 209 -13 67 39 -249 -132 -7
3271gr6Q6K59l03R6j63J75L8J77l28J43J0J47k53l2O8J28Q8k30J01k7k73L16p9
$$ -7 -103 -17 242 -61 35 -128 47 85 262 -66 77 87 234 -19 -51 17 145 233 3 104 77 -196 120 41
3295D1K85m48K00J03n43L64k85K46Nj68k4L72k15J97j22l6Q6r7R3j11K3j22K64
$$ 41 326 -122 78 181 -362 2 -283 -37 -32 -200 -224 148 -67 130 8 -28 58 -39 54 -57 -34 -156 108
3318A08l56L06OQ7N0n44J19M46k59j17L00j66K08Jo5j60R7q8K44k36J21k71J89
$$ 108 -248 58 64 151 201 -343 -224 222 -37 -154 146 -20 188 189 124 -36 61 -27 217 -19 102 -169 20
3341B0K26k13K15m15K98k1k4l65K29P1R1j17L3K80j90Kk94J77o8J25m7j39R1J20
$$ 20 246 33 248 -167 131 110 86 -279 -50 21 112 -5 28 308 118 120 -174 3 -65 60 13 -126 -35 85
3365H5o1J98j72K7Q9k94j23K24j50Q5K43k00N5j04O2N1J7l57L87j29J86k63J10
$$ 85 24 222 50 77 166 -128 -251 -27 -177 -92 151 -49 6 -98 -36 15 32 -325 62 -67 119 -144 -34
3388c4J11j47j82K47J14l26J89Q8j17PK12j53J71j89J35j4k53n5L4J70K81n75
$$ -34 77 -70 -252 -5 109 -217 -28 60 -57 -50 162 9 180 -9 126 112 -141 -196 -162 8 289 -286
3410b86J97R8m4n9J68n9NM8j4j71J55J74l0l79M21k17k11k3N04k15k48L6O8J16
$$ -286 -89 9 -35 -94 74 15 20 68 54 -117 38 212 182 -197 224 7 -204 -227 277 62 -186 -150 -82 34
3434C4k49J45J61k14j5J68K8L3J56l16R7j16J60j58P0J58l8j87l8K5J16j93l0
$$ 34 -215 -70 91 -123 -138 30 58 91 247 -69 28 -88 72 -86 -16 142 104 -83 -121 -96 20 -173 -203
3457b03K09J7jJ19l48O2L23n26L2L38K42j06p2J46m20K43J9r1n6M2J55j74K88
$$ -203 6 23 22 141 -207 -145 178 -348 -316 22 264 158 86 232 -188 55 74 -17 -73 -31 124 -50 238
3480B38n02J46k35P65o65J73K19P1k12L08k28j3j10K86l54K25k4l05p1K55j90
$$ 238 -264 -118 -353 412 -253 -80 139 210 -2 306 78 65 -45 241 -113 112 88 -217 -288 -33 -223
3501b23K69j22n1J13m0J58j79q7K46m2K6J06j6j42J8j3L21m82J00O7P3P3l69J07
$$ -223 46 -76 -127 -14 -54 104 -75 -162 84 42 68 174 158 16 34 21 342 -140 -40 27 100 173 -196 -89
3525h9J31k44L73j33k06L52j21J75m11O1K22K45j56l27L92j24k62J89N3l96O1
$$ -89 42 -202 171 38 -168 184 63 238 -173 -112 110 355 199 -128 264 140 -122 67 120 -276 -215
3546b15J22O63m53k34J48J8J76J3q8l02O7J93j58j04M40j15N6k01m09L99o0Q3
$$ -215 -93 570 117 -117 31 49 225 238 150 -152 -85 108 -50 -154 286 171 227 26 -383 16 -44 39
3568C9j51M4J79j6L9p2M1J5j15J9k47L57o2k98L04J07l06K79k32J31j67L0J42
$$ 39 -112 -68 111 95 134 62 103 118 3 22 -225 132 70 -228 76 183 -123 156 -76 55 -112 -82 60
3591F0m5n3J40j09k61J76q1K5L6J70l8k28J78R7j11K43ok24j46O5RL4q3J74o4
$$ 60 15 -38 102 -7 -268 -92 -173 -148 -112 58 20 -208 -30 67 -44 199 193 -31 -177 -112 -103 -69 -152 22 -42
3616d2J11J84m23R0r2L06j80J40o0Q8K08Ll98p8L69k0k08q7K26k0j64J77K5j13
$$ -42 69 253 -170 -80 -172 134 -46 94 34 122 330 333 -65 -143 226 206 -2 -89 137 117 -47 130 155 42
3640D2j2q7j34J35N9J27j10l84M29k5q3Q9J8J78m80K31j19P1J43k42J76r4K03
$$ 42 30 -57 -191 -56 3 130 20 -364 65 40 -43 46 64 242 -238 -7 -126 -55 88 -154 22 -72 131
3663A31j60K50k40R8M0J44k80j12K68j66j35O66o02%K37k1p6q8n2K73j66lJ36
$$ 131 -29 221 -19 79 119 263 -17 -129 139 -27 -162 504 -98 -98 139 118 42 -46 -98 175 9 6 142
3686A42k21M35l37Pk26oM46m06K4K77k57K80J76m36J54L9Lk12J16K88k77Q9k59
$$ 142 -79 356 19 26 -200 -206 240 -166 -142 135 -122 158 334 -102 52 91 94 -118 -2 286 9 98 -161
3709a61J51n0J94l49L67m41J09nl2L99p7M3k69Q1J61J93k11j94J37J32K99m69
$$ -161 -10 -60 134 -215 152 -289 -180 -185 -217 182 105 148 -121 -40 121 314 103 -91 46 178 477 8
3731Hk66K47j30Q2L50l01L03j95k23n6N8n2J43r3O1K7L2n8J66n3j6J06L6l4q0
$$ 8 -258 -11 -141 -59 291 -10 293 98 -125 -181 -123 -175 -32 -125 -64 -37 -5 -63 103 50 34 140 176 142 62
3756F2L7k19L03p3j80K20k44p5L64k22K19r5j24K57k53L9j47J99m08M70j53o9
$$ 62 99 -120 183 110 -70 150 -94 -169 195 -27 192 97 -27 230 -23 16 -131 68 -340 130 -23 -92
3778i2L05m62L54l09J90r2P7L37m51L28j33m1J97R2m63j90N17k63R6J15k04m0
$$ -92 213 -249 105 -204 -14 -106 -29 308 -143 185 52 11 208 300 -163 -353 164 -99 -3 112 -92 -132
3800a32K83m3j5P2jm1j13j52K09J7j39J43r8J25k08J21Q5l75L82k32j69M03Kk31
$$ -132 151 108 93 165 164 123 10 -142 67 84 -55 88 -10 115 -93 28 113 -262 120 -112 -281 122 124 -107
3824a07K63j1j53k50K72L5l9k4K55k31l03L11n0O8l9OKJ64q8k02R9j4K39k89N2
$$ -107 156 145 -8 -258 14 49 10 -14 241 10 -293 18 -32 36 -3 3 5 169 81 -121 -22 -36 203 -86 -34
3849c4J10k50J60N3q7J84j45j60M05j82O7l10K81k16K49k29M6J06j7m1k49M15
$$ -34 76 -174 -14 39 -48 136 -9 -169 236 54 121 -189 92 -124 125 -104 -58 48 31 -10 -259 156
3871A56j5j53k69L58l28K65j37k09K36K25R9k89J68J19k23j77J99j67K11J7pk09
$$ 156 141 -12 -281 77 -251 14 -123 -332 -96 129 228 -61 107 226 3 -174 25 -142 69 86 79 -130
3893a30J37K6q1K71k91j21K65p5n8j81K70k04M44l97J13j30P3J67k19N5m4m3M8
$$ -130 7 33 -48 223 -68 -189 76 1 -57 -238 32 -172 272 -125 -12 -142 -69 98 -121 -66 -110 -153 -105
3916a05k03M63j06p4OL6j96K63J08l79P6M9m8K13r2P8j31P2j23K07q7k7p2N8J45
$$ -105 -308 155 49 -25 -19 17 -179 84 192 -187 -111 -62 -110 103 11 89 -42 30 -93 114 27 0 -72 -14 131
3941A31j08lj08j27L16k86N46k11k43K74n47L64j02J4J60m7m1o1k0j02J13K04
$$ 131 23 20 -88 -215 101 -185 361 150 -93 181 -366 -2 -104 -90 70 23 -18 -79 -99 -201 -88 116
3963A16j70n1n7J37j33J18Q3O9K8m35K92J71k88L6l10L39J59l43J60K60k48L6
$$ 116 -54 -105 -162 -25 -158 -40 43 112 140 -295 -3 168 -120 -84 -394 -55 104 -239 -79 181 -67 -31
3985c1j15K1K7M83j76k6j74R5R8Q3k17m1j2Q3l34P1j11J68J51q2J57l42L86k24
$$ -31 -146 -125 -98 385 209 183 9 104 202 285 68 27 15 98 -236 -165 -276 -108 43 -39 118 -224 162 -62
4009f2r1K40k88J44k5K74J4l09k8J58P3j48K79k49j41m1R5Q8k11N27m67K27k0
$$ -62 -153 87 -201 -57 -82 192 206 -103 -131 27 100 -48 231 -18 -159 -200 -105 -17 -228 299 -168 59 39
4032C9r8r9K96k2j79N3o3J88J09j92M5J31j74k07K47Lj98q8J96k04K43l7j40q0
$$ 39 -59 -158 138 116 -63 -10 -73 115 224 32 77 208 34 -173 74 77 -121 -209 -13 -217 26 -11 -151 -231
4056b31L42j73lJ75l22%J32j56M6L43j79J00p0L1M0j15M1k84L82k40M59k28Kj15
$$ -231 111 -62 -65 110 -212 -212 -80 -236 -190 153 -26 74 4 35 75 -40 1 -283 99 -141 318 90 92 -23
4080b3j12kL5K99k25q5k9K13j33L49l34J39P0J8l6j68k64J19K37J40l94M32l65
$$ -23 -135 -137 -102 197 -28 -113 -142 71 -62 287 -47 92 162 180 144 -24 -288 -169 68 208 -186 246 -119
4103a19R2j25M5M62l46N2j50L67k67K12j46j75J22K94l34j45J74k02J08K10j01
$$ -119 -27 -152 -107 355 9 61 -89 278 11 223 77 -98 24 318 -16 -161 13 -189 -81 129 28
4124B8k1n5l01J07L37o1R8J0k6l26K89k4j74r5P7M5J54R8j38r7j48M44o6k41K3
$$ 28 7 -48 -349 -242 95 34 132 142 116 -210 79 55 -119 -214 -137 -92 62 160 22 -75 -223 221 155 -86 -63
4149f3J46LJ67nr2k64k1L7J72j38j8n2K01k60J23J50j17j7J52k7J38O1k63n4R7
$$ -63 83 86 253 248 156 -108 -129 -92 80 -58 -76 -128 73 -187 -64 86 -31 -48 104 77 215 276 13 -41 56
4174E6k40K27j16k2N0m33O84j75m4j86J15LJ39j58j77J68K14k40L43k50K47k56
$$ 56 -184 43 -73 -95 -45 -478 206 31 -13 -199 -84 -81 58 -100 -277 -109 105 -135 208 -42 205 -51
4196e1J03j9L3k9j90M3L05k61L77l70L08l7k41J94j35L6J11j96k9q2M11k96k7
$$ -51 52 33 66 37 -153 -110 195 -66 311 -59 249 212 -29 165 30 66 177 -19 -48 -130 281 -15 -42
4219d2K34r1j56K8K33j43p9j54J32J36q5q2j22L56k25K9K06k35k55M3O1K01j80
$$ -42 192 101 -55 -27 206 63 -16 -170 -38 98 13 -69 -191 165 -60 -31 175 -60 -315 -272 -211 -10 -190
4242a90P6j28M75k66rK84k37J33q5J46k99oK64j05j7o7J49p7J08j81j01m4L10
$$ -190 -114 -242 233 -33 -42 242 5 138 53 199 -100 -106 158 53 36 -31 118 41 149 -32 -133 -177 133
4265A33k95J26J87l21L35m02J13l23L5K46L36j79o6R1PJ99k97r6J91p4m9K8Q3
$$ 133 -162 -36 151 -170 165 -237 -124 -447 -412 -166 170 -9 -75 16 23 222 -75 -171 20 -54 -103 -75 8
4288Hn6J37k27P5q3K48k39J39N3j72J70j06J94l20R8r0KL38k24j70K31j66P3M1
$$ 8 -48 89 -138 -63 -146 102 -137 2 55 -117 53 -53 141 -179 -81 -171 -169 169 -55 -225 6 -160 -87 -46
4312d6K00k23J07J49k29k59M45j18Oj66K32R8j86k99O39k85J7j4q7l4K16k52Q1
$$ -46 154 -69 38 187 -42 -301 144 26 32 -134 98 196 10 -289 350 65 82 68 -19 -53 163 -89 -8
4335hk26K40J97l28Q7L81m59R9M5J65n5k57p1K66k11K97j32k54M64j72m3J2Pm1
$$ -8 -234 6 203 -125 -38 343 -116 -17 28 193 138 -119 -190 76 -135 162 30 -224 240 68 25 37 44 3
4359CQ7k17n8J05O3j0K56l77J93J7j06R4j44J77k11P3JJ40j49L25k60l6O5l1j24
$$ 3 90 -127 -185 -80 -17 -27 229 -148 45 62 -44 50 -94 83 -128 -55 -54 86 -63 262 2 -34 31 0 -124
4384a24K30K35k36k3K9m8kp2M2j21K95q8l40j6K32j01K94k21O0j29J14M1J75N7
$$ -124 106 341 105 82 111 63 61 -11 31 -90 205 117 -223 -239 -7 -108 186 -35 25 -104 10 51 226 283
4408B83m41L58j15J91j29P2n50J88J24P4R7l43J37J41j66j19K07J1k00K16L5j71
$$ 283 -158 200 85 276 147 219 -331 -143 -19 55 152 -191 -54 87 -79 -198 9 20 -180 36 71 -100
4430a00j58J99R4m6j31N1J47oJ27j90L1o9j32J37n2Q2j05l7L22j04P4j79J98k6
$$ -100 -258 -59 35 -11 -142 -91 56 50 177 -13 18 -51 -183 -46 -98 -16 -121 -158 164 60 134 -45 153 127
4454A27j55K78l98L75K0l47J72N5l12O9J93j10J29j6J26r0k50J40k39J5J45K88
$$ 127 -28 250 -148 227 247 -100 72 127 -185 -116 77 -33 96 80 206 116 -134 6 -233 -218 -73 215
4476B15j24k83R0j9J08K82n72K82J91j58P3J23k40J63k39K47j71K34k48o3K47
$$ 215 91 -192 -102 -121 -13 269 -303 -21 170 12 85 208 -32 131 -108 139 -32 202 -46 -109 138
4497A38r9q6J91l35K03n9m1J81L3m3j56L8K3Q3k37K45j42n6K78k09k25K78j29
$$ 138 39 -47 144 -191 12 -47 -88 93 126 83 -73 -35 -12 71 -166 79 -63 -119 159 -50 -275 3 -126
4520a26K72l05K27j52K00p0j35K25j00J94l04R6M6j72J07k4R3p2j36O5K7J00q
$$ -126 146 -159 68 -84 116 46 -89 136 36 230 -74 22 68 -104 3 -21 72 0 -136 -71 -44 56 48
4543D8K4l3j1J64p6p5J47k26J50m87J80L25q0J23j94J24l16N4J90k02l4K14J30
$$ 48 72 39 28 192 116 41 188 -38 112 -375 -195 130 50 173 -21 103 -213 -159 31 -171 -205 9 139
4566A39j86J44K5j27n1M48l97K5j69K80j22OJ07j26J03j44J50j57K53l93L15k57
$$ 139 -47 97 122 -5 -56 392 -5 20 -149 131 9 15 122 -4 99 -45 105 -52 201 -192 123 -134
4588a34M0Q4pk66M66j44o5r8o8J78L05k87Q5r0J86k07l8KP5R7l13J02K63j21R4
$$ -134 -94 -10 -17 -283 183 39 -26 -124 -192 -14 291 4 89 -1 185 -22 -60 -58 17 114 -199 -97 166 45 139
4613A39k46M3L35k94J62k38K89N0l89k3j4L8L57j65j24J89J47k72J3l7j34K58
$$ 139 -107 -64 271 -23 139 -99 190 240 -149 -172 -186 -148 209 44 -80 109 256 -16 -3 -40 -174 84
4635H4j10j76J66p4k1J77j15m8K77j55o2M8m7J24k00O9K72k21N9l53K9O40j60
$$ 84 -26 -202 -36 -110 -131 46 -69 -117 160 5 -57 -9 -56 68 -132 -63 209 -12 47 -306 -277 363 203
4658B03j40j12q0Q2K9K61k7m08J26j3J7J95k50L29m47K04k29N01k15P3j77j71
$$ 203 63 -49 -129 -47 -18 243 216 -192 -66 -79 -62 133 -117 212 -235 -31 -260 241 26 99 -78 -249
4680b49K15K21l8k12N8J12j56j30K00L9j46K13K0j85pJ51l7j35rj23J1J04K32
$$ -249 -34 187 149 -63 -5 107 -49 -179 21 60 -86 127 147 -38 -45 106 69 -66 -75 -198 -187 -83 149
4703A49l29K43o0k85M76j96k6J81k82kK02J13J4k13O2j42J82j12k56K65J67j74
$$ 149 -180 63 3 -282 194 -2 -28 153 -129 -131 71 184 198 -15 47 -95 87 -25 -281 -16 151 -23
4725b3k34K65N2o2R0n10N44l11K08k66K70K17j15j81L22k05M0k39L40k56J2M03
$$ -23 -257 8 60 -2 88 -422 122 -189 19 -247 23 240 125 -56 266 61 101 -138 202 -54 -42 361
4747C61j64j44o3J4n2m6K53k03k90K94K89l31J47m6rr4L31o5o6Qj46K27Q2j63
$$ 361 197 53 -10 4 -48 -94 159 -44 -334 -40 249 -82 65 19 10 -84 247 182 116 124 -22 205 287 124
4771A24k34J62j42p9J85k59L14j45K76j50K8k49J19%Q6Oj84L42k61l45J84L50
$$ 124 -110 52 -90 -169 16 -243 71 -74 202 52 80 -169 -50 -50 36 42 -142 200 -61 -406 -222 128
4793A28j63j3J80j41j21J85nj09M7j98J02K58k62J73q0J64K57k68o5j69J61k42
$$ 128 -35 -48 132 -9 -130 55 50 -59 -12 -210 -108 150 -112 61 -19 145 402 134 69 -100 61 -181
4815a81M19l53j35L0K67O6k52Q8P7P9k48N6o3P1m2L09l18K13r0j88J06k23L07
$$ -181 238 -115 -250 -220 47 113 -139 -51 26 105 -143 -87 -150 -79 -121 188 -130 83 -7 -195 -89 -312 -5
4838eK5k20K43l45J74M6J57j51N4n1L5J28q8J38m65L88j59j1q5J33K2k47L55L0
$$ -5 20 -200 43 -302 -128 -82 75 -76 -22 -73 -38 90 2 140 -325 63 -96 -107 -192 -59 -37 -284 71 101
4862A01O4k47j00J58O8O5j44q0K19k33J44M9O4j6j6j42j66P4l1J07j30J98j79
$$ 101 165 -82 -182 -24 44 109 -35 -115 104 -129 15 64 128 112 96 -46 -212 -138 -169 -62 -192 6 -173
4885a73K46j98K25k3l10J77R4k06K49q9j48J20M6J20k31J35J79k42J3n2O3K4j70
$$ -173 73 -125 100 77 -233 -56 38 -168 81 -8 -156 -36 10 130 -101 34 213 -29 -16 -68 -5 19 -151
4908a51J22l7P5j11J24k9J14j27j28O2K36j89J9R8j11J39k92J92J23k84L52l12
$$ -151 -29 -66 9 -102 22 -7 107 -20 -148 -86 150 -39 -20 78 -33 106 -186 6 129 -155 197 -115
4930a15K31j78J35K7k60K71q2p4Q1k58L39j9l42J57k40O79l01l3M7k39L33q7j99
$$ -115 116 -62 73 100 -160 111 29 -45 36 -222 117 98 -244 -87 -327 352 51 18 65 -174 159 72 -127
4953a27K87l21R1K61J27m13K40L5k96L0M00m4k39k5rO7k7R8m9j27J01j49P1K6
$$ -127 160 -161 -70 191 318 -95 145 180 -116 -86 314 270 31 6 -3 64 37 135 86 -41 60 -89 -18 8
4977Hj80M0L79k63j37L16k24N9O2j73K4K30k30R4L3N6K09m83K16N8j08J38J22
$$ 8 -172 -132 247 -16 -153 163 -61 -2 60 -113 -89 141 -89 5 38 94 303 -180 36 94 -14 124 246
5000B46k73R5J58k84K53j99k92K49j50N29n12j5M37j21p7L2J67k20R0J5k20m2
$$ 246 -27 68 226 -58 195 -4 -296 -47 -197 332 -180 -195 242 121 44 76 243 23 113 128 -92 -134
5022a34K26j19J33o4l6j05J56q9j36K62j96j26J79n0J49r9J59O1k63j47K86j1
$$ -134 92 -27 106 42 6 -99 57 -32 -168 94 -102 -228 -49 -99 50 -49 110 171 -92 -239 47 36
5044C6L0P2j52J28mj35j38J33J37o4j55J31pN5M8k88P4N1K29k02L19k95j40O1
$$ 36 66 138 -14 114 110 -25 -163 -30 107 43 -112 19 12 67 115 -173 -99 -48 181 -21 298 3 -137 -76
5068g6Rk17L89p8J87j83q5k00O6q3K12L4O9J50p5p3J13k04K47k61J07P0j89K06
$$ -76 -67 -284 105 27 214 31 -54 -254 -188 -271 -59 -25 44 194 119 46 159 -45 202 -59 48 118 -71 135
5092A35N5j49j5J3M8l35P3J88N9l60J48J60k52R9K36k62K58p5j78K73k76K99k86
$$ 135 190 41 26 39 87 -248 -175 13 72 -288 -140 20 -232 -133 103 -159 99 24 -154 119 -157 142 -144
5115a44J87Rn5JJ06%m63O5J15J48K22k96r0M69k47j15L3Q2l90L32J53j31j69Q8
$$ -144 43 52 -3 -2 104 104 -359 -294 -179 -31 191 -105 -195 274 27 -88 -55 27 -363 -31 122 -9 -178 -90
5139i0J8k02N26m5p2k45K51m1j16j15K97l21K52j35l5Q8o4Lj74L91k13K79m24
$$ -90 -72 -274 252 207 135 -110 141 100 -16 -131 166 -155 97 -38 -73 15 -49 -46 -220 171 -42 237 -187
5162a87Q3L20n7p1j0J33o2j24j21J45J20l4P2l04K6O0Ml7p8P2J78j22j80J23J55
$$ -187 -104 216 159 88 78 211 149 25 -96 49 169 135 207 -97 -71 -11 -7 -44 -122 -50 128 6 -174 -51 104
5187A04r5K66k8l38N2Rk67J26J38Q9L03n33K81O8l77J56O6o1j20J23K40o9m50
$$ 104 9 275 247 -91 -39 -30 -297 -171 -33 56 359 -174 107 175 -202 -46 20 -41 -161 -38 202 133 -317
5210c17L64o7M4j02K62m37O4K28j9R1j90P8j25o8R2L1J56Q6j99j94J59n5M5K93
$$ -317 47 -20 24 -78 184 -253 -189 39 20 111 -79 -1 -126 -194 -102 -71 85 171 -28 -222 -63 -118 -73 220
5234B20p1l84N77m15N45m32P6k78P3j50K27k0k88K23J72Q9j31o6M9k85L51j35
$$ 220 149 -235 342 -73 472 40 116 -162 -89 -239 -12 -32 -320 -97 75 164 33 -33 16 -269 82 -53
5256e3R9l9J32L8k81K4Q6J10m2l47M38k53p0J74m2J14o4Kq0n4K53j16J4J98k50
$$ -53 46 7 139 177 -104 -80 6 116 74 -273 165 -88 -158 16 -26 88 24 26 -54 -108 145 29 43 241 -9
5281in4k37J92q8K95n5n1R6P2j27L50k87k31M48k35P0p5J61m09K16m5j33J00L09
$$ -9 -63 -300 -108 -196 99 44 -7 89 161 34 384 97 -134 314 79 149 74 235 -174 42 -3 -136 -36 273
5305B73j73q6j41M8p2J08r0L4q7K51R6l38L16k54O4P4J90l42K39J79j35q4r2n4
$$ 273 100 14 -127 -79 -151 -43 -133 -99 -186 65 161 -177 139 -115 -51 23 213 -129 110 289 154 70 -22 -76
5329g6M2J0o5J07k9K10k72K3P2j44M09m33O0m4Q9J17K5l25J58j9O4j48k0J63j64
$$ -76 -34 -24 -89 18 -11 199 -73 -50 22 -122 287 -146 -86 -130 -41 76 101 -224 -66 -85 -21 -169 -189 -26 -190
5354a90J43J00j02N7l7OK7k75L22j63K12o5k06K74j15j16J13K52l08L10j97k2
$$ -190 -47 53 -49 8 -29 -23 4 -271 51 -112 100 35 -171 103 -12 -128 -15 237 -71 239 42 20
5376B0j7L39l26N6p3m2J62j6j08k78J38L4j72J84k62M21m5J60O0j52k82N24k94
$$ 20 3 342 16 72 -1 -43 119 103 -5 -283 -145 -111 -283 -99 -361 60 15 175 235 83 -199 325 31
5399C1k32J88j4j16L36n69N60l32J04LK1J6o8Q9j49R3K67m48K17n5rJ66k77J44
$$ 31 -201 -13 -27 -143 193 -376 184 -148 -44 -41 -20 -4 -72 17 -132 -39 228 -220 -3 -58 -67 99 -178 -34
5423c4pQ2n8r9J88p5r4J41L9j68N5j35R6J57k8m9K58m04L85n53K40J48o3n8k94
$$ -34 -41 41 -17 -116 72 -3 -97 44 83 -85 -30 -165 -69 88 60 11 269 -135 250 -303 -63 85 22 -36 -330
5448c30L21l49L37j24j8J96k44L15l9J85m48M04p3n6j31Q6j1j3n9K51m04J80J20
$$ -330 -9 -358 -21 -145 -163 33 -211 104 65 250 -198 206 133 77 -54 32 21 8 -51 200 -204 -24 96
5471I6l78M66l98K95N0j63j29J13r4L27k60N6l0l4k55J73L25m92K55j56J5K94
$$ 96 -282 184 -214 81 131 -32 -161 -48 -142 185 -75 -19 -49 -83 -338 -165 160 -332 -77 -233 -218 76
5493G6l22K53K58l16NKJ79j40j69J16J51Ok48K29J08k97J64P1k70K13m5K69k56
$$ 76 -246 7 265 -51 -46 -44 135 -5 -174 -58 93 99 -149 80 188 -109 55 126 -144 69 24 293 37
5516C7L8l7R1j40j74J95K16l49K25jl61J71LK25k86j21M44l90K66j54j50L46J03
$$ 37 75 38 129 -11 -185 10 226 -123 102 101 -260 -89 -86 139 -147 -268 176 -214 52 -102 -252 94 197
5539A97k13J26J86j29N9m25M69j47k91j4K26l04K40k42J8J20J07K8k32K50k22
$$ 197 -16 110 296 167 226 -199 270 123 -168 -182 44 -260 -20 -262 -244 -124 -17 11 -221 29 -193
5560a93M9Q7K21%j77K15j98J79l67L46j97j82R7N0m2K5j4M4l7N3j10J95N3j50
$$ -193 -144 -57 164 164 -13 202 4 183 -184 162 -35 -217 -120 -70 -112 -87 -101 -57 -94 -41 -151 44 97 -53
5584e3J31j25K89r7Q4l37R5m6J77k03J06p2J07q3J04J09O5l94L9M0O4q2j32J55
$$ -53 78 -47 242 145 229 -108 -13 -59 118 -85 21 -51 56 -27 77 186 251 -143 -104 -64 0 -82 -214 -59
5608e9R2j2k01K59k98O05l43r0q3L19nk06K37j84j00N8J32l24K03j31J09l3L18
$$ -59 33 21 -180 79 -219 386 43 -47 -130 189 184 -22 215 31 -69 -11 121 -203 0 -131 -22 -55 263
5631B63l17K60l97K03n5Q9j34Q0K7J33j93N6j63J54n2k38O18o24J66J55k85L9
$$ 263 -54 206 -191 12 -43 46 -88 -8 19 152 -41 15 -148 6 -46 -284 334 -290 -124 31 -254 -215
5653b15M89n21M82l23K86K40o67M38l11n1K54P2l69J25M0J13K5m78L53o0J97l7
$$ -215 274 -247 235 -88 198 438 -229 209 -102 -153 101 173 -196 -71 -31 82 107 -371 -18 -78 119 82
5675H2j5Q7l1p7j02N1j04J37q5L31k49j56J76Km3k17M26m62K62m6M4K65n40L43
$$ 82 67 154 123 46 -56 -5 -109 28 -57 274 25 -131 45 47 4 -213 213 -249 13 -33 11 276 -264 79
5699G9l20J5O46m10P2o5j92K2O2J50k5m7k24L52j46j05L0M00m75J90L21p9k57
$$ 79 -241 -226 420 10 82 17 -175 -153 -91 59 34 -13 -237 115 -31 -136 -106 294 -181 9 330 251 -6
5722fk09L08j12k60K06J34p7J6k55M25j68K6K42J87m33M6p1L3J29k61K10mj68
$$ -6 -215 93 -19 -279 -73 61 -16 0 -255 170 2 28 270 457 24 70 -1 32 161 -100 110 106 -62
5745f2nJ58P9J4o7k49K34j9J53k85l0M04j77k53j58M94l38o6K14r1K25m7j42P0
$$ -62 -67 91 170 184 117 -132 102 83 236 -49 -79 325 148 -105 -263 231 -107 -173 41 -50 175 128 -14 56
5769E6j46J27m0J67j71Q4J57k62j40O8j7M27n47J15N7K59l30L04l37P2m6J46J69
$$ 56 -90 37 -3 164 -7 77 234 -28 -168 -100 -117 310 -237 -122 -65 194 -136 168 -169 -97 -143 3 172
5792A72j0J05l90J84j48J93k01K39k51qn1J2R0k73K73J90k60n4L12l27K91j79
$$ 172 162 267 -123 61 -87 106 -95 144 -107 -115 -166 -154 -64 -337 -64 126 -134 -188 124 -203 88 -91
5814i1j03J4q7K99N4R1j54J92p40M57q1l9M6J12J0O9k36N5P7J32l6l0J01k87Q8
$$ -91 -194 -180 -267 32 86 177 23 215 -525 -68 -149 -188 -142 -30 -20 49 -187 -132 -55 77 41 11 112 -175 -87
5839h7j53J67K08o2j47J47k94n8J52J55j24N9P3m9O8K4ppm9j53j11L55J28l53
$$ -87 -240 -73 135 73 -74 73 -221 -279 -127 28 -96 -37 36 -13 55 79 72 65 16 -137 -248 107 235 -118
5863a18r8K63l1K09k60qL27k47L37k16j98p8r6J55J94o8k7j87J62N5n0j37R4J33
$$ -118 -216 47 16 225 -35 -43 284 37 374 158 -40 -118 -214 -59 135 67 40 -147 15 70 20 -117 -23 110
5887A10k09K07j18L62m45J51N3j5Q1o8n2q1Nr4M9o0K66M6m12L78j48M0J18l2o7
$$ 110 -99 108 -10 352 -93 58 111 96 177 109 57 -24 -19 -113 -64 -124 142 188 -224 154 6 46 164 132 65
5912F5K52l31L9J01k51Q4Qk2J21j25j05R3K59j86N2p2J75n18K72J37MQj06K6o5
$$ 65 317 -14 25 126 -125 -41 -33 -55 66 -59 -164 -71 188 2 54 -18 157 -361 -89 48 52 60 -46 -20 -85
5937h5q3K73j60kL5P6j84J53K55k46K20k7j50j5Q0J43k19j8j11L01j88j37l7K67
$$ -85 -168 105 -55 -57 -22 54 -130 23 278 32 252 225 75 60 140 283 64 46 -65 236 48 -89 -126 141
5961A41k68K06M8M0j6q8k96L05j42J18J2j67L5mK17m11mM75j24n9P6p1M8j69Q
$$ 141 -127 79 127 167 151 63 -233 72 -70 48 60 -107 -72 -76 141 -270 -274 201 77 18 94 23 71 -98 -90
5986i0P6M7K7l5j43L46q7j85L8J58k25o2J34r4o2J9L66j04k24M1O4k16K27j02
$$ -90 -14 33 60 25 -118 228 141 -44 -6 152 -73 -135 -1 -95 -157 -138 228 124 -100 -59 5 -211 16 -86
6010h6j20L54J00m4l82K85nj1k16O8J79j50J48k00k2K2P0K54k42N2o0j00L4p8
$$ -86 -206 148 248 204 -178 107 102 91 -125 -57 122 -28 120 -80 -102 -80 -10 244 2 54 -6 -106 -72 -150
6034a50J94j83N1J99q5r7J29j39l2j4J71r1j11K60m1Mj58L4N5L8J1j80P2J26k41
$$ -150 44 -139 -88 111 26 -71 58 -81 -113 -127 44 -47 -158 102 61 65 -93 -59 -4 34 45 -135 -63 63 -178
6059a78J40j3J03j75L13j82M0j92O4J26l20J25J30K1OP4j49J60j24K20j60J5j94
$$ -178 -38 -51 52 -123 190 8 48 -144 -80 46 -274 -149 -19 2 8 82 -67 93 -31 189 29 44 -150
6082a50K51j71K09l00K23j60m2m2K8J66k3K35r5o2n1L0J86m96L24j9k0l8k90N1
$$ -150 101 -70 139 -161 62 -98 -140 -182 -154 12 -11 224 129 67 16 46 232 -264 60 41 21 -17 -307 -256
6106b56L39j64N6K11j85k48K68m5L01m29J11L9k17M26j12j33j38J9j39J72K05
$$ -256 83 -81 -25 186 1 -247 21 -24 277 -152 -41 -2 -219 207 95 -38 -176 -157 -296 -124 81
6127H1r7M3j54J92M1p1j03J68j37k32N47k79L37l22K64k69j22L02m55J42J59j40
$$ 81 -16 27 -127 65 106 35 -68 100 -37 -269 278 -1 336 14 278 9 -113 189 -266 -124 35 -105
6149a05P3K2l3J48Kl26M02J19m37P2O5r0P8R0k19K95L9j23j27J62J34l15J0N6
$$ -105 -32 -10 -43 105 107 -219 183 302 -135 -63 2 -88 -10 80 -139 156 195 72 -55 107 241 -74 -64 -8
6173hl46M78m4K12l35kR5k53M59k99K00k09J45l0r2J68r0j79J88M8k38J94j12
$$ -8 -354 124 80 292 -43 -45 50 -203 256 -43 157 -52 93 63 -29 139 49 -130 58 106 -132 62 -50
6196e0K58k54J83j48j2J62J24o5k37l2P0R0j44J70J48j63k93L23j2k25o6K35L05
$$ -50 208 -46 137 -11 -23 139 263 198 -39 -71 -1 89 -55 115 263 100 -193 130 118 -107 -173 62 367
6219C67m98L27j68J37n0Q4k39j6J43nL37n80L08k55K25k17l7J86j24P5M0q8J99
$$ 367 -131 196 28 165 115 199 -40 -56 87 82 419 -161 147 -108 117 -100 -137 49 -75 0 40 -48 151
6242A51k68M2k0m0J82r2n2k4K94j85J91k74K25q3j32M8N8J23r0K30l00J50l16
$$ 151 -117 -75 -95 -135 47 -45 -97 -121 173 -12 179 -95 130 47 -85 -37 21 144 54 284 -16 134 -182
6265a82J56K02j98R1J5m8rN2j80R7m4P2k8J46q2J13P3l83P6o8j39K32R4m4j65
$$ -182 -26 176 -22 69 84 36 27 79 -101 -4 -48 24 -4 142 60 173 246 -137 -61 -129 -268 -36 58 14 -151
6290a51K01M4j79J11M7K3o8O3k61L51R1n76K23k08K53K0J8o1K73j83l04K24O5
$$ -151 50 94 -85 26 73 96 28 91 -170 181 272 -304 -81 -289 -36 -16 2 -59 214 31 -273 -49 16
6313A6j32K6M65k44k33n7L32L5k22J72j36j17j16J72j8j51K54K27l89L9k6OJ14
$$ 16 -116 -90 375 131 -102 -159 173 208 -14 158 22 -95 -211 -39 -57 -208 46 273 -116 -77 -103 -97 17
6336A7K1j79K61l35L67k70n4J32K99l07O8k69K13j19M05l04K41j30%M4k86J23
$$ 17 38 -141 120 -215 152 -118 -172 -40 259 -48 20 -249 -36 -155 250 -54 187 57 57 101 -185 -62
6358f2m3J29k2j5L03m32K34Mk69J52J28Nn5J19n2m14L99j10K54j18j19K38l18
$$ -62 -105 24 2 -13 290 -142 92 96 -173 -21 107 112 57 176 124 -290 109 -1 253 135 16 254 -64
6381f4Qj37J36K78l28K33j96l6J83j25P4j97J94J75k05r8P8R8O1j86N9N8J21j63
$$ -64 -56 -193 -57 221 -107 126 -70 -106 77 -48 26 -171 23 198 -7 -105 -27 71 132 -54 5 63 184 21
6405B1r9K78j17j03J9m4N0j65J94J28o3j75K10r5k23J84o6l3Q5K13j78j61q8K00
$$ 21 -78 200 83 -20 -1 -45 5 -160 34 162 99 -76 134 39 -184 0 -66 -99 -14 199 21 -140 -228 -28
6429b8J7k15J15J1J39k40K25k6N5r3j77L76o6P6k93K36P8j96kj06QK88l0j05r5
$$ -28 -11 -226 -111 -100 39 -201 24 -2 53 -40 -217 159 93 169 -124 112 190 -6 -8 -114 -106 182 152 47 -48
6454d8K78l58l8J00J11K37l31k5j38J81O9l7J50k95J2K26q3J20r5K26r6K9k24
$$ -48 230 -128 -166 -66 45 282 -49 -74 -212 -31 38 1 151 -144 -132 94 11 131 36 262 166 195 -29
6477b9J40L8N4k47KJ78k77N5J10L00m86K90N3m7j0Pj18j96L37k16j49L93k96K12
$$ -29 111 149 203 -44 -42 136 -141 -86 24 324 -162 128 181 134 124 131 13 -183 154 -62 -211 182 -114 98
6501I8j65J76j88J68k29n5K60K66l01J4k25J23m1K16k79K11j02L3R3Qj38j53L07
$$ 98 -67 109 -79 89 -140 -195 65 331 30 44 -181 -58 -99 117 -162 49 -53 -20 73 81 -57 -210 97
6524I7j56q8n2K95l40J70Pj52m5o2L66k51J90n2K96k10r6R4Jj97J27J66q8j83
$$ 97 -59 -147 -199 96 -244 -74 -67 -219 -264 -326 40 -211 -21 -73 223 13 -83 11 12 -185 -58 108 20 -163
6548a63R4j46J10K59p0J65j80p1J35j60J66j17k78K83l19L12R2j18n4k17L36J67
$$ -163 -69 -215 -105 154 84 249 69 -2 133 -27 139 22 -256 27 -292 20 112 -6 -60 -277 59 226
6570B26l35n6L14j86k96M08j05j54K81k44K84mo7J69k3j71q5J0R2p8Q1m83N90
$$ 226 -109 -165 149 -37 -333 75 -30 -184 97 -147 137 133 66 235 212 41 -44 -34 58 -20 61 -422 168
6593A68l62P8K03j65L26l98m6K45m01M87k32J44j3K07m2k19P1l69M71k13m4K95
$$ 168 -194 -116 87 -78 248 -150 -196 49 -352 135 -97 47 34 241 199 -20 51 -318 153 -60 -104 191
6615A91j98r3q9J97L17j55l2p3k7k40P3K60J4j76n0J7K26j45J33J37k38J22j64
$$ 191 -7 -100 -189 8 325 170 138 65 38 -202 -129 131 145 -31 -81 -64 162 17 150 287 49 171 7
6638GJ59m74L90j39Q0n7J93k08j71m5L84j89j11Q6K41K9k80J63j5k9k30K40kl33
$$ 7 166 -308 82 -57 23 -34 159 -49 -220 -265 119 -70 -181 -95 146 175 -105 58 43 14 -216 24 22 -311
6662c11J32P8L02k41q4Q2J56j09N5M8l88M02j03j35m5K33m4j0K73j82P0k46j01
$$ -311 -179 -101 201 -40 -124 -42 114 5 60 108 -280 122 19 -116 -161 72 28 18 291 109 179 -67 -168
6685a68j0K92Lk20oj14K59M6j72J85J3j63p4N9K99p4m41J93K80k55J40p7J27p2
$$ -168 -178 114 117 -103 -109 -223 36 82 -90 95 108 -55 -129 -70 229 155 -286 -93 187 -68 72 -5 122 50
6709E0m7n6L9m2O9k20K76P5m62M98J92l67o1j0j4L36K5l33K54k15J37P4n77L49
$$ 50 3 -53 -14 -56 13 -207 69 144 -318 180 372 5 -56 -66 -80 256 281 -52 202 -13 124 198 -379 -30
6733c0J79l80K10K09k07J25j44J06k47K28j9L96n18o7J9K83M6k30J4k5Q8O4j75
$$ -30 149 -231 -21 188 -19 106 -38 68 -179 49 30 426 -92 -159 -140 143 189 -41 -27 -52 36 100 -75
6756g5L02j65j54L8j39J70O8jl59N8P7J73R0J53o2k30J48l82j3P2J92l03M88k07
$$ -75 227 62 -92 -54 -193 -23 45 44 -315 -257 -180 -7 83 236 174 -56 92 -290 -303 -231 -39 -342 146 -61
6780f1N3OJ3L2k6L70l59K5q9J63j69N9K40j57o9J92L9k81L0k10rM01K1l7l67J02
$$ -61 -8 -2 11 43 17 387 28 53 -36 127 -42 17 257 100 31 223 262 -19 11 -199 -208 193 214 177 -190 -88
6806h8l8J23j99Q5J46j93K35J36l86L65p4o4q1N8N3r6R3l44J53J1K47j08ro6R3
$$ -88 -126 -3 -202 -117 29 -164 71 207 -179 186 112 48 -33 25 78 -18 75 -269 -116 -105 142 34 25 -41 52
6831E2n4m4L0oK11k34J58j02j15J80r7k61K18J55J28r2j2l8Q1n51M24m0r0J40
$$ 52 -2 -46 -16 -22 189 -45 113 11 -104 76 -21 -282 -64 91 219 127 115 77 158 -393 31 -9 -99 41
6855D1k49j14K67K72m29K73l52J75P0n6K71k90J07J97k80K56r6m1J30j75q4K65
$$ 41 -208 -322 -55 217 -212 61 -291 -116 -46 -102 169 -121 -14 183 -97 159 63 22 152 -23 -107 158
6877A58l15OJ68j34J7L6K74j96N4j00J51M4m60L02O6k73L85k47J08q8j7j17j74
$$ 158 -157 -151 17 -117 -100 -64 210 14 68 -32 119 163 -297 5 71 -202 183 -64 44 -44 -61 -178 -352
6900c52K85N9j54K12k3p6J13J30r8J00j87r7J28j72K3K84j69M0l9l4K77k1j47
$$ -352 -67 -8 -162 50 27 -49 64 194 96 196 9 -88 40 -132 -109 175 6 46 7 -27 250 229 82
6923H2k16L50k96J42k1L3m6l7j07K11k32J21k6K98qn23L23N6N8p3J79k78L0J50
$$ 82 -134 216 -80 62 41 74 28 -9 -116 95 -137 -16 -42 256 248 -275 48 104 162 89 268 -10 20 170
6947A70r0q5j5o1P6k28L65M8l3j27k12MP2M81m83j60J83J80j55k01K38J83k61
$$ 170 80 -5 -20 -81 -5 -233 132 180 147 20 -192 -188 -116 365 -118 -278 -95 85 -70 -271 -33 150 -111
6970a11K4L13l7n1k02K30j79q2J36j35K58j55j6L1nr3J09Q4J89l62K02j30j70
$$ -111 -87 226 189 138 -64 166 -13 -95 41 -94 164 9 -7 24 19 -74 35 119 308 -54 148 18 -152
6993a52R6J00k3j46p7J49K63j37j57J12J58P1l66J15K06j89N2o4j98L83k00K45
$$ -152 -56 44 21 -125 -202 -53 210 73 -84 28 186 257 -109 6 212 23 75 11 -187 196 -4 241
7015B41k73L7N0l19J13P4J51M2k2m05L94mO5Q6l30K02k16K16j25J61Op7N2j55
$$ 241 -32 5 55 -264 -151 -77 74 116 94 -311 83 79 144 230 -100 102 -114 102 -23 138 144 67 119 -36
7039c6j06K1p3J52k02L25J93j39j32K47j96r6L66l58K41j88K42k27K84m19K0L3
$$ -36 -142 -121 -194 -42 -244 81 274 135 3 250 54 -42 324 -34 207 19 261 34 318 -101 -81 -48
7061d8N1j56Q7l2K67k49PJ72j82L73n46K28R8q6j6k37L83j62K34j69j09K01K39
$$ -48 3 -153 -66 -98 169 -80 -73 99 -83 290 -256 -28 70 -16 -32 -269 114 -48 186 17 -92 109 348
7084C48l38Q5m11J70L27Jj76n14M83L2R5k9J53l32K15O6l02J88K15j69j50Q4J1
$$ 348 10 95 -316 -146 181 182 6 -508 -25 7 102 73 226 -106 109 175 -127 61 276 107 -43 41 52
7107E2k47K76j27j72K43k2J50k43NK64r7j03L22m20J68j48K73l18P6j8K80m5j79
$$ 52 -195 81 -46 -218 25 3 153 -90 -85 179 82 -21 301 -119 49 -99 174 -144 -68 -86 194 149 -30
7130c0j43L69k55j82O0K5J84k74Q2M23l31J53j13jO6p4JK5K50m03L00K9p6m9k4
$$ -30 -173 196 -59 -241 -181 -156 28 -246 -164 259 -72 81 -32 -33 33 -41 -40 -15 235 -168 132 161 85 36 12
7155A2Oj20l5P3K44j49m6p6k1K3L9J83J57m25L87k13j63R0J26k73J08O1R6j2j34
$$ 12 18 -102 -137 -64 180 31 -15 -91 -112 -89 -50 133 290 -135 252 39 -124 -34 92 -181 -73 -12 84 72 -62
7180f2q3M15l06Q6j22K04j05j11J11j42O0k22L09l12J98J0K43j47nj92K53l52
$$ -62 -145 270 -36 50 -72 132 27 -84 27 -115 -55 -277 32 -280 -82 -72 171 24 19 -173 80 -272
7202b72L01J59r7J88l79L2M5J79j81k4M7o9l9Lj0J91k51l5J38j29J8PP3J84k34
$$ -272 29 188 91 279 -100 -68 -23 156 -25 -49 -2 -71 -110 -107 -117 74 -177 -212 -74 -203 -185 -178 -105 79 -155
7227a55J84k16K26o8ko1K10j26j0n0jM8J79J0j88Q7k02K33N2o2j67j71K43J90
$$ -155 29 -187 39 -29 -31 -92 118 -8 -18 -68 -69 -21 158 168 -20 67 -135 98 150 88 -79 -250 -7 183
7251A83K67m09J13m20K86l7M0j09K12M4l84K85l14K69k47K68q0jk67J31K73l44
$$ 183 450 41 154 -266 20 -17 23 -86 126 170 -214 71 -243 26 -221 47 -33 -34 -301 -170 103 -241
7273b41J21N39l20j91N4m3J04j07N8j05M64k88L2k27O4K89k85L2J39j47J95j09
$$ -241 -120 419 99 -92 -38 -81 23 -84 -26 -131 333 45 77 -150 -86 203 -82 -50 89 -58 137 28
7295B8j68J25J32J22l49Q2j00J56Q7j76o2J38l2M5J10j52j86QK91r7n8L5j1K66
$$ 28 -140 -15 117 239 -110 -28 -128 28 115 -61 -123 15 -17 28 138 -14 -200 -192 99 2 -56 -21 -32 234
7319B34l30Q0j04m3J48Kjj2L9l9K4o3ok9J17L52m25M32m30k32J47M7j49M43p1
$$ 234 -96 -16 -120 -163 -15 -13 -14 -26 13 -26 -2 -65 -71 -100 17 369 -56 376 -54 -286 -139 -92 -241 202 131
7344A31j37j20R0L23k15k10P5J34J08j23J30k58J58O5k54J65o1K29l87K25j08
$$ 131 -6 -126 -36 287 72 -138 -63 71 179 56 186 -72 86 151 -103 62 1 230 -157 68 -40
7365d0J84j55j35J33j03J8%m3o2L41r7k51p9K79O0o6K57k89o3n3J33K4o5K84l21
$$ -40 144 -11 -146 -13 -116 -98 -98 -141 -203 138 41 -210 -289 -10 50 -16 241 -48 -111 -164 -31 -7 -72 212 -109
7390a09o7K16K01o42N88m9p0J9j89q3J1K98J67k18j37K75k83k0q1K71j63J81k6
$$ -109 -176 40 241 -401 187 138 68 87 -102 -185 -174 124 291 73 -64 211 -72 -92 -173 98 -65 116 90
7413I0l27L79k58J67l21K04o1J86l62L78K0j17M4N0k73J23J53R2M8k40R1j49O3
$$ 90 -237 142 -116 51 -270 -66 -127 59 -303 75 95 -22 22 72 -201 -78 75 167 215 -25 66 -83 -20
7436b0J4R1N2Qk60n1J54O1j70k5J23j0j55K08j78K42k29K06K4l1l6n0P6K1O9l20
$$ -20 -6 85 137 145 -115 -166 -12 49 -121 -146 -23 -33 -188 20 -158 84 -145 61 85 54 18 -32 44 65 134 -186
7462a86P1K12j14J17m9j5J84p4j83J42k48L67j91j97J85J5r8MN1J92j62JK64m14
$$ -186 -115 97 -17 100 51 36 220 146 -37 105 -143 224 33 -164 21 36 -62 -58 -7 185 23 24 288 -126
7486a26J06p1R1K13j06j73O8R8n7j5m7P5r7K05k32j50M9L81m87L71k56K80m8p9
$$ -126 -20 -91 0 213 107 -66 2 100 43 28 -19 56 -41 164 -68 -218 -169 212 -275 96 -160 120 72 -7
7510gn8L58R5k68Lq0L6j63j0P4M08l98J21j84n2J03k27K89j77J10K45k33j32n4
$$ -7 -65 293 388 120 123 43 79 -84 -94 -20 388 -10 111 -73 -125 -22 -249 40 -137 -27 218 -15 -147 -201
7534b01K79j50K18L2k06p6J24l37N17j35n4j66L23J67k22r3k8J89l6o3L1p4j52
$$ -201 78 -72 146 178 -28 -104 20 -317 200 65 11 -155 168 335 113 20 -8 181 145 82 113 39 -113
7557a13K4K59k40p9L0K40j52PK44n36N04l54J31R6j8j57L93j70j95j67M27j55
$$ -113 -89 170 -70 -149 -119 121 -31 -24 220 -316 188 -166 -35 61 43 -114 279 109 -86 -253 174 19
7579A9J87j80o0L8K8n7J25k48K87l63J64j5QK31J8j88Q3l34K62k3r5K6p5M51j39
$$ 19 206 26 -34 4 32 -25 100 -148 139 -224 -60 -75 -67 164 182 -6 77 -257 5 -18 -113 -87 -162 289 150
7604A50k69L77k86l5j77K59j72O5K2J27M3q1l2L2K06k58J34k08j0J29k8r0Q6j84
$$ 150 -119 258 -28 -63 -240 19 -153 -88 -66 61 104 23 -9 23 229 -29 105 -103 -113 16 -12 -102 -16 -200
7628b00K33o4M2J66k50k32L35J08j20j32K52k82j23L81k91K69M8j99j01J06K44
$$ -200 33 -31 11 177 -73 -305 30 138 18 -114 138 -144 -267 114 -177 92 140 -59 -160 -54 190
7649A90j7k02j69L90q1k60K31K9p6q0K5n5Q5R2L0k03L4l2n2J55K5j69K61j29O2
$$ 190 173 -29 -198 192 111 -149 82 111 35 -45 -20 -75 10 102 132 -71 -37 -69 -121 34 59 -110 151 22 84
7674H4j90J82q6K7l85M89k94J10k00L78j14P6J16j82o7j03L5K25L3k1k24l3j6
$$ 84 -106 76 -10 17 -368 121 -173 -63 -263 115 1 77 193 11 -56 -159 -124 101 134 113 -111 -144 -160
7697a60k9J43p2J54j72J91K18k53J12m7J21M3k67k40M47j95k27L19j37n2J62N3
$$ -160 -189 -46 -118 36 -136 55 273 20 132 85 206 249 -18 -258 189 -6 -233 86 -51 -103 59 112
7719A12k90J36K37j42j91J3Q3Ok60L28J4J8j65NO8J60qpN3j56J7N25p27J22n7
$$ 112 -178 -42 195 53 -138 -125 -42 -36 -296 32 46 64 -101 -96 -28 132 124 117 170 14 31 556 -171 -49 -106
7744a06P7J18j65J66m36M28k39M28l78J3L1j63O4P7L34j82Q6j15k4J5R5p6j8J00
$$ -106 -29 89 -76 90 -346 82 -157 271 -107 -94 -63 -226 -162 -85 249 67 153 38 14 29 124 48 30 130
7768A30J5l3l1j80J88J12k32J98j52j63N01o07K64J0k59M86l72J10j4K39l00r
$$ 130 145 112 81 -99 89 201 -31 167 15 -148 353 -254 10 20 -239 247 -125 -15 -29 210 -90 -99
7790i9pp3J47J86l3k17K03m3l9L6j3k13L65k33r5K28k23J18j43J82k40M46k20
$$ -99 -106 -179 -32 154 121 -96 107 64 25 61 48 -165 200 -33 -128 100 -123 -5 -148 34 -206 240 20
7813B0K44l32J64j23M4m7J23j68L6N3j24K62j03n2p0M45l86J64n03K18J51k79
$$ 20 264 -68 96 -27 17 -30 93 -75 -39 14 -110 152 49 -3 -73 372 -14 150 -353 -135 16 -263
7835b63J68J73l3P0j51K2L1k44K57k65J91K45j3j14m63L42K29n7k24J04k19L50
$$ -263 -95 78 45 115 -36 -14 17 -227 30 -235 -44 201 188 74 -389 -47 182 125 -99 5 -214 136
7857A36M2k68J98j78K64l4L5j63r1K6J81j34l8J81k38l22L98j40K5M07l29J11
$$ 136 178 -90 108 -70 194 160 195 32 -59 -33 148 14 -24 157 -81 -403 -5 -145 -120 287 -42 69
7879F9K34l26K60k11k21l6L47j50j15J76P0j45J43k63j52L97k12P6r2KJ70j4r
$$ 69 303 -23 237 26 -195 -231 116 -34 -149 27 97 -48 95 -168 -320 77 -135 -59 -151 -149 21 7 -2
7902bj8j00j08L74k06K59o3n6n7O1r6j44m3P1L20j69M8l2N9j11J4Mj19L5L6L86
$$ -2 -20 -120 -228 146 -60 199 136 80 23 84 -12 -156 -199 -128 192 23 71 39 98 -13 1 5 -114 -79 -43 343
7928C43k45j21j15O6j21j37L39j81L08M2j73r6J44j39L11j97o1j06Q5J01Kj73
$$ 343 98 -23 -138 -72 -193 -330 9 -172 136 178 5 -91 53 -86 225 28 -33 -139 -54 47 49 -124
7950a24N0k03M25K3j26M8k13J91j76J67q7k54M08j63J04j69K31j36l3l4L86k31
$$ -124 -74 -277 148 171 45 93 -120 71 -105 62 -25 -279 129 -34 70 -99 132 -4 -37 -71 315 84
7972H4j02O6j06J66m1Rp1m3K76j12j71J72R6j40j5l8J66l34J16o5J97l21K02K19
$$ 84 -18 48 -58 108 67 76 5 -38 238 126 -45 127 223 83 68 30 196 -138 -22 -87 110 -211 -9 210
7996B10R2m17J7K49k61K1K82j9o0j0l43K1M91l37L6q3K44K0k29mj32J76j20L06
$$ 210 302 -115 -98 151 -110 -89 193 174 114 104 -239 -218 273 -64 -28 -111 133 153 -76 -80 -212 -36 -156 150
8020A50k97J66J3j68N06m74M7k66J72p6Q0O2m5r0K16j18J21P7j73J78n7j24n5
$$ 150 -147 19 32 -136 370 -104 -57 -323 -151 -227 -147 -85 -130 -220 -4 -122 -1 76 -97 81 24 -100 -155
8043a55K06l2L8J07p9J5j06l9P8l20K42J40l39K82k03J4L6K05Pk14m6K72o7j25
$$ -155 51 19 57 164 85 100 -6 -45 33 -287 -45 95 -244 38 -165 -151 -115 90 97 -117 -163 109 42 -83
8067h3J62l19K45jLK06l18L83l64J78j9k39K11p8J62J11l29K41l09k1m3L64N1
$$ -83 79 -240 5 4 7 213 -105 278 -86 92 73 -166 45 -33 129 240 -89 152 -157 -178 -221 143 194
8090A94M5k59NmO2J37R1l04q0J13J44k00L3K42j84k6p7N6l5O6P4L9m49J67P5N
$$ 194 239 -20 -15 -19 43 180 271 -33 -113 0 144 -56 -23 219 35 9 -68 -12 -47 19 93 132 -317 -150 -75 -70
8116g0R5j93j70K60K44J67m25L03k06p9K16k79L21l24L4J5J68O1q8K03j73J72
$$ -70 25 -168 -338 -78 166 333 -92 211 5 -74 142 -137 184 -140 -106 -91 77 138 50 253 80 252
8138B52q0k03J11j4j94K24j4k23L10j53N1R8J0j90N7m00M51k59K83j72Nj29K03
$$ 252 172 -31 80 66 -128 96 82 -141 169 16 67 165 175 -15 42 -358 93 -166 117 -55 -50 -179 24
8161B4j61r1M65n6l22j87M18j29J72RQ8l59J04p8M7p1J67R8p7j8j59K48K2k13
$$ 24 -137 -228 237 181 -141 -328 90 -39 133 142 230 -129 -25 -103 -56 -127 40 138 61 43 -116 132 154 -59
8185e9J1K71k62J97m20K03
$$ -59 -48 223 -39 158 -262 -59
8191e9
$$ Imaginary data points
##PAGE= N=2
##DATA TABLE= (X++(I..I)), XYDATA
0@%%%%%%%%%%Qj6J6k4L2l3M1n6P2q8J04j20J42j66J92k25K65l11L59m12M71n37
$$ 0 0 0 0 0 0 0 0 0 0 0 8 -8 8 -16 16 -17 24 -32 40 -48 56 -64 78 -88 104 -121 144 -167 192 -220 251 -286
32b86O12o95P84q86R98j118J252j397J555j731J924k130K355k605K876l175L501
$$ -286 326 -369 415 -471 527 -591 661 -736 819 -912 1012 -1118 1237 -1368 1508 -1667 1834
49A834l854M246m678N155n685O277o942P696q558R551j0715J2101j3781J5870
$$ 1834 -2020 2226 -2452 2703 -2982 3295 -3647 4049 -4509 5042 -5673 6428 -7353 8517
63H517j8550K2130k7192L4946m8470P8868k75470j297K43867k81202Q3734J95279
$$ 8517 -10033 12097 -15095 19851 -28619 50249 -225221 -226518 17349 -263853 -180119 15160
75A5160M38l1861J48315k7224o9541N9018M1378j13328q14O3907m6382q6435L4240
$$ 15160 15598 -16263 132052 104828 35287 94305 135683 22355 21541 85448 39066 -47369 -13129
88a3129K2809l4775k9563O745n008P471J9710J4499j4740J1145M5017J5379l2482
$$ -13129 9680 -25095 -54658 -47913 -52921 -45450 -25740 -11241 -25981 -14836 30181 45560 13078
101A3078N522L1679j4238l5906O755M910k4238o227P842j9572J19L4116m318l0296
$$ 13078 18600 50279 36041 135 6890 11800 -12438 -18665 -10823 -30395 -30276 3840 -478 -30774
115c0774K4770L5835j7772j7505K0885P072j5727l083J102j0859p3O157j1482
$$ -30774 -6004 29831 12059 -5446 15439 22511 6784 3701 4803 -6056 -6129 28 -11454
128a1454p026J4994P837r620l76J2481L706n442j905J662j208j595j346m152l300
$$ -11454 -18480 -3486 4351 -5269 -5645 6836 10542 5100 3195 4857 3649 2054 708 -3444 -6744
143f744M392L725n744k790P451L713n872j348O100N7l306J700K09k310L307K423
$$ -6744 -2352 1373 -4371 -7161 290 4003 -1869 -3217 2883 2940 -366 1334 1543 -767 2540 4963
159D963n792j872O135m90o502k95L789j041k441J275J102M84K133K81j630J357
$$ 4963 -829 -2701 3434 2944 -3558 -3853 -64 -1105 -3546 -2271 -1169 -685 1448 1729 99 1456
175A456K721j721k676L47J256j376k224K7P49n3M31J51l62R06J914m9j452J081
$$ 1456 4177 2456 -220 127 1383 7 -2217 -2190 -1441 -1494 -1063 -912 -1274 -368 1546 1497 45 1126
193A126J108o30j964K05P33j005q40k3j53N68N01Km79P68J561q43p57O79P34o81
$$ 1126 2234 1604 -360 -155 578 -427 -1267 -1290 -1443 -875 -374 -372 -851 -83 1478 635 -122 557 1291 610
213F10m83j58p6P4k10j81k83O58j00p3l01M31O47n83j64M94j12qM92m52j05J27
$$ 610 127 -31 -107 -33 -243 -424 -707 -49 -149 -222 -523 -92 555 -28 -192 302 190 182 674 222 117 244
235B44j67l15j5L64j30j13l81O56j73j3k7L97k22LL06k06N5J95j74l87m29N56
$$ 244 77 -238 -253 111 -19 -132 -513 143 -30 -43 -70 327 105 108 414 208 263 458 284 -103 -532 24
257B4l12M0j52J33J16K14j79K61K7j32L40p2k78K49l1m12n6L3J31k78N44k27n5
$$ 24 -288 -248 -400 -267 -151 63 -116 145 172 40 380 308 30 279 248 -164 -220 -187 -56 -334 210 -17 -72
280g2l2J31J89j84L29jn19J23J24l3r6j46J42J7KJ56j13j05j48M59l0k68J81j6
$$ -72 -104 27 216 32 361 360 -159 -36 88 55 -41 -187 -45 -28 -26 130 17 -88 -236 223 193 -75 106 90
304I0J98k91K6K08l79L87n48l2M38J59m87Q2L53j36l52L38K82k87QP9k69N6M25
$$ 90 288 -3 23 231 -148 239 -309 -341 97 256 -231 -149 204 68 -284 54 336 49 57 136 -133 -77 348
327C48k5n11J40pk01k8K34K03k62M8Q3j31J17J37K15n78K12K05l26p3J50q7J31
$$ 348 323 -188 -48 -55 -256 -284 -50 153 -109 -61 22 -109 8 145 360 -218 -6 199 -127 -200 -50 -137 -6
350fj9m4K75m88P07k24L7L2K8nm30L00q6%l34J49J13k4J29j84p1L85j51LN8J46
$$ -6 -25 -69 206 -282 425 201 238 270 298 293 -137 163 77 77 -257 -108 5 -19 110 -74 -145 240 89 92 150 296
376B96l6k06K0J08j12j98Q5m4J97L7r7j63N38o76L47j89J36j83P0J54l72J72L68
$$ 296 260 54 74 182 70 -128 -43 -87 110 147 50 -113 425 -251 96 -93 43 -140 -70 84 -288 -116 252
399B52j49M26l43o03K14P3K41r7j62K64l17J94k16M36j68Q2r7o1J61J96j45l04
$$ 252 103 529 186 -417 -203 -130 111 14 -148 116 -201 -7 -223 213 45 127 30 -31 130 326 181 -123
421a23K28j66K71j02j42k23L11j52k6J77r7o6j64J41R0l8j16L00j54R0K4j36J36
$$ -123 105 -61 210 108 -34 -257 54 -98 -124 53 -44 -110 -274 -133 -43 -81 -197 103 -51 39 63 -73 63
444F3j72J72l68L59K7j94P2j85K56k24J69Q0j34k9oJ93p0j26P5K03j88J74n6l19
$$ 63 -109 63 -305 54 81 -113 -41 -226 30 -194 -25 55 -79 -108 -114 79 9 -117 -42 161 -27 147 91 -228
468b28J98Q2k17k0K35k71L67K38l77K08Rm07L50k70K98p8N6p5k73j6J61J06kj61
$$ -228 -30 52 -165 -185 50 -221 146 384 7 215 224 -183 167 -103 195 117 173 98 -175 -191 -30 76 74 -87
492h7kJ26k56J62K94k36k6k5J75j01j4J1q2J73j22J25j92J69r1k60L52k19K11
$$ -87 -89 37 -219 -57 237 1 -25 -50 125 24 10 21 -61 112 -10 115 -77 92 1 -259 93 -126 85
515H5k4J50k56MK05k41J01P0j19K40l50m8M23k03Nj12J22k18J06K90m97L78j81
$$ 85 61 211 -45 -41 164 -77 24 94 -25 215 -135 -183 240 37 42 -70 52 -166 -60 230 -267 111 -70
538g0r5J67k6K55l1Mk60L01l58j10J26m1J00j16q3m0J97J09O0j02j31J95O8l13
$$ -70 -165 2 -24 231 200 204 -56 245 -113 -223 -97 -138 -38 -154 -237 -277 -80 29 89 -13 -144 51 119 -194
562a94K58Q4r7o8j81n4M23n07K39O1n8K08j81k1K0K37j26o2l24M67j58m8J70R8
$$ -194 64 148 51 -17 -198 -252 171 -336 -97 -36 -94 114 -67 -88 -68 169 43 -19 -343 124 -34 -82 88 186
586A86r1r9N2p9J02j79L1j01l1K60P1j16J0k4j50M2j50J88PM8k5J25o0Q8k34o3
$$ 186 95 -4 48 -31 71 -108 -77 -178 -209 51 122 6 16 -8 -158 -116 -266 -78 -71 -23 -48 77 17 105 -129 -192
612a92K9K35J61j6j54q7q0L26j84j36J80kj08K01k37J85j01L1Q5j06p6p9J50n
$$ -192 -163 72 233 217 63 -24 -104 222 38 -98 82 80 -28 173 -64 121 20 51 136 30 -46 -125 25 20
636B0J47k28O9Q9R8n01P2O06n31k24L66r5R8m7l7Q7q3l9J5K24q0J49l75L0J60
$$ 20 167 -61 8 97 195 -306 -234 372 -159 -383 -17 -112 -14 -61 -98 -11 -94 -133 -118 106 26 175 -200 -170 -10
661a0j02J1K81Q5j65J3j15j27J0mN2J98j46r9M08m42J47k63L51j01Q8J9j26p5
$$ -10 -112 -101 180 265 100 113 -2 -129 -119 -123 -71 127 -19 -118 290 -152 -5 -268 83 -18 70 89 -37 -112
685a12M4k7K21j39J24l09L63j17n1l3K0l7J70k28L45m03J02J06n6M6J53k6l8n0
$$ -112 -68 -95 126 -13 111 -198 165 48 -3 -36 -16 -53 117 -111 234 -169 -67 39 -17 29 182 156 118 68
709F8k84K20J33m9n0k16J72n2J63j32j53K30j05J49j73k46L12l96K58K58k49P9
$$ 68 -216 4 137 88 38 -178 -6 -58 105 -27 -180 50 -55 94 -79 -325 -13 -409 -151 107 -142 -63
731f3q5K04k66N23j75nk08Q8N6p6J34j23L1q9M1r4P6J74j24K2j57L80j51k25l6
$$ -63 -148 56 -210 313 138 133 -75 13 69 -7 127 4 35 -54 -13 -107 -31 143 19 41 -116 264 113 -112 -148
756a48J88J75m03N8J64q3N3q6o8O4J13n8K88k58O2N6k26J17J75j67J4k50L06k2
$$ -148 40 215 -188 -130 34 -49 4 -82 -150 -86 27 -31 257 -1 61 117 -109 8 183 16 30 -220 86 64
780F4r4j13J75J91k92J32p0J17O4k47J43J4j70K85q0j70J29j63K0J79k65K62j51
$$ 64 -30 -143 32 223 -69 63 -7 110 174 -73 70 84 -86 199 119 -51 78 -85 -65 114 -151 111 -40
803d0r0J34L7k45M00k63r6Q9k8O3J01k40l6J69J61l81M52k76r8K53j07N3j78L02
$$ -40 -130 4 41 -204 196 -67 -163 -74 -102 -39 62 -178 -214 -45 116 -265 187 -89 -187 66 -41 12 -166 136
827A36j58K03j34K9j39J62J24l9l9k94K6J42l6LR7k48J44M8k63M23j68L7o1Q5
$$ 136 -22 181 47 76 -63 99 223 184 145 -149 -123 19 -17 -14 83 -165 -21 27 -236 187 19 56 -5 80
851H0J91l56M9m6J23o2m7J33j96L95j26r4L15n16L05o9n8l50M23j80O6Qq2L49
$$ 80 271 -85 -36 -82 41 -21 -68 65 -131 264 138 44 359 -157 148 79 21 -329 94 -86 -20 -12 -94 255
875B55k34J86j94m7L5J17Mn6K52l96R2j13j50N68n6l1m6l28K16k7Om01L94k11
$$ 255 21 207 13 -34 1 118 122 66 318 -78 14 -99 -249 319 263 232 186 -142 74 47 53 -348 46 -165
899a65r7K46n1K25l21R8MK98j37j74m9J29J67l09j47K19J86k08k0M9o9J22j7j39
$$ -165 -262 -16 -67 158 -163 -65 -61 237 100 -74 -123 6 173 -136 -283 -64 122 -86 -106 -57 -126 -4 -21 -160
923a60L26l5k29L8J90Pj60j24K29k2j31K71j92J07o5J69n1k64J40n6J6M1k1J33
$$ -160 166 131 -98 -60 130 137 -23 -147 82 60 -71 200 8 115 50 219 168 -96 44 -12 4 45 24 157
947A57j99K3J01J56m80P5j7M50j96k44K12J39k4k25j54K31j38L50j04j92k0K37
$$ 157 -42 -19 82 238 -242 -167 -184 266 70 -174 38 177 153 -72 -226 5 -133 217 113 -79 -99 138
969A38j19K66m81J17k4K56k33L37l49L6J86k07J77j68J64N6k14K3K3p1J01j28
$$ 138 19 285 -196 -79 -103 153 -80 257 -92 -56 130 -77 100 -68 96 152 -62 -39 -16 -87 14 -114
991a14J98l00J54J97k46P7j18J47J01k92j2O8O2l02N04k29j09P7j12O84n49O8
$$ -114 84 -216 -62 135 -111 -34 -152 -5 96 -196 -208 -140 -78 -380 124 -105 -214 -137 -249 435 -114 -46
1013d6M62l52j61K73j7l4r1J03j86K5J09k6R5k98K11k02J12P6q1k8j5j25M1p0
$$ -46 416 64 -97 176 159 125 34 137 -49 -24 85 59 154 -144 67 -135 -23 53 -28 -56 -71 -196 -155 -225
1037b25L4J83j45R9k84O02l83K81k51K40l02N7J34j49L00k63K27k81K15l02M34
$$ -225 -191 -8 -153 -54 -338 264 -119 162 -89 151 -151 -94 40 -109 191 -72 155 -126 89 -213 221
1058B21j35J4Q6k68J36k0j55J73J91j18J29j43P7j27l34K09J11j63l3K01P1Jk21
$$ 221 86 100 186 -82 54 34 -121 52 243 125 254 111 188 61 -273 -64 47 -116 -149 52 123 124 -97
1081i7J83k29K20k42L45k04J77N7k97P6q1J12K1kj3k44L31K26k58j05j06K67J37
$$ -97 86 -143 77 -165 180 -24 153 210 -87 -11 -92 20 41 39 26 -218 113 339 81 -24 -130 137 274
1104B74k04j96M3R2k74J42L03O5k48J83pl40QJ78k68J5M09k34k1Q9J26k52K9J53
$$ 274 70 -126 -83 9 -265 -123 180 245 -3 180 173 -167 -159 19 -249 -234 175 -59 -80 9 135 -117 -88 65
1128F5k00J62j64j16L23pk6q1N69k63m1k10l13L61K85m68o6K46l1O6j22J45j69
$$ 65 -135 27 -137 -253 70 63 37 -44 525 262 221 11 -302 59 344 -124 -190 56 25 91 -31 114 -55
1151e5L7Q2no7j96M58n13K40J51r7J9j37M2j0L6j59P0j91K27k10M05k36J02J48
$$ -55 -18 64 59 -8 -204 254 -259 -19 132 35 54 -83 -41 -51 -15 -174 -104 -295 -68 -278 127 -109 -7 141
1175A41j76L41k51K02l33L43k49R2j75J07OO6k22K23K1m31K08K18k25L30l25J37
$$ 141 -35 306 55 257 -76 267 18 110 -65 42 48 114 -108 115 136 -295 -87 131 -94 236 -89 48
1197D8Q4j6L0j70j46K41j4N1K4k16N9M8N4k11P8J73J1j29q0N0j32J48N5k37Q4
$$ 48 132 116 146 -24 -170 71 57 108 132 -84 -25 23 77 -134 -56 117 128 -1 -81 -31 -163 -15 40 -197 -113
1222a13K79l09K55l9j40K12j26Q5K31m14k0L00j81R3j29L0J18j48j48J69l18N94
$$ -113 166 -143 112 73 -67 145 19 104 335 -79 -99 201 20 113 -16 14 132 -16 -164 5 -313 281
1244B81k06r6j90L82m14M79j51m85N28j39l6j61K5K15j46O3k4j13M05m22K43n6
$$ 281 75 -21 -211 171 -243 236 85 -400 128 -11 -47 -208 -183 32 -114 -51 -75 -188 217 -205 38 -18
1266a8j66r8K31J01L0l0J48k60n4Q5j00M9k41M30l09M40l8k82J05k30p1L96J52
$$ -18 -184 -282 -51 50 80 50 198 -62 -116 -31 -131 -82 -323 107 -202 238 200 -82 23 -207 -278 118 270
1289B70k71k00J09l7J46J80l22R8J83j02k85L67l71J18j24K39j72J80l5R7m6j
$$ 270 -1 -201 -92 -129 17 197 -125 -27 156 54 -231 136 -235 -117 -241 -2 -174 6 -29 68 22 21
1311B1J17q7j44J80j45O0o5r9N1K96r8j20j02r2L13j97j12M24j03k30L15j42J60
$$ 21 138 51 -93 87 -58 2 -63 -162 -111 185 87 -33 -135 -227 86 -111 -223 201 98 -132 183 41 201
1334B01j13j65j63J33o7O6J68q0M55k08j57K2P7j73L8m0j54J3M51l55J21p9k32
$$ 201 88 -77 -240 -107 -174 -108 60 -20 435 227 70 92 169 -4 34 -6 -160 -147 304 -51 70 -9 -241
1357b41J4J94m7M2L2n4Q7K5l5j75K60j53K22q8L2m0m98J66J34P4K21j53n3j07
$$ -241 -227 -33 -80 -38 -6 -60 27 52 17 -158 102 -51 171 83 115 75 -423 -257 -123 -49 172 19 -34 -141
1381a41O7p2JJ36Q3j08J31k19O5K22R5k29J34j49j58L07j77K36J3n31L4L20k06
$$ -141 -74 -146 -145 -9 74 -34 97 -122 -57 165 260 31 165 16 -142 165 -12 224 237 -294 -260 60 -146
1404a46L15k90J03nj51J31n1p1L10j56k05K07k02J97j25N3K64j11J07j63J17k1
$$ -146 169 -121 -18 -23 -174 -43 -94 -165 145 -11 -216 -9 -211 -14 -139 -86 178 67 174 11 128 107
1426A07k13K83k12n6J41p3J36N3k84K92j98j13K46Kk55K55J33k94l6K02k8j60
$$ 107 -106 177 -35 -91 50 -23 113 166 -118 174 -24 -137 109 111 -144 111 244 -50 -86 116 88 -72
1448g2K42l73L59m25J49J96n6J01k12j2N6J5Q0j39P6j26J56Q6j91J94k08J99j95
$$ -72 170 -203 156 -269 -120 76 20 121 -91 -103 -47 -32 48 -91 -15 -141 15 101 -90 104 -104 95 -100
1471a00M33m76J01kJ8J35n3J84j76p3j33K12N0K8M9j77K24k61J36k24J74j07l18
$$ -100 333 -143 -42 -44 -26 109 56 240 64 -9 -142 70 120 148 197 20 244 -17 119 -105 69 -38 -356
1494c56J35K50j8J65k05l49N54j34Jp7J47l6j06n1L21m15J83n8L76k32m0j61M4
$$ -356 -221 29 11 176 -29 -378 176 42 43 -34 113 77 -29 -80 241 -174 9 -49 327 95 55 -106 -62
1517f2L65k71K06j12k79M51m69J33p9J17J3j11L21o9k40M3j3J01n9n5O9J36j86
$$ -62 303 32 238 126 -153 298 -171 -38 -117 0 13 -98 223 154 -86 -43 -56 45 -14 -69 0 136 -50
1540e0L7Q8p8K2j5k04J53%J42r9j38K10%k50K79j22j18P4J12J5K9km8lj85K12
$$ -50 -13 75 -3 19 4 -200 -47 -47 95 -4 -142 68 68 -182 97 -25 -143 -69 43 58 87 85 37 34 -151 61
1566F1L8N4j62j89J44J42L12l89k22J85o7Q2j91J96Q2n5j19j91L49L04l92k94
$$ 61 99 153 -9 -198 -54 88 400 11 -211 -26 -93 -11 -202 -6 76 21 -98 -289 60 364 -28 -322
1588c22M77r3m0O0k44Q7J97m93L87l7j53J51K87j95r5o9j24K13J67n7l80L71l53
$$ -322 155 62 22 82 -162 -75 122 -371 16 -21 -174 -23 264 69 -26 -95 -219 -6 161 104 -276 95 -258
1611b58K89n0M7q6K44j1Rl20mK04k96L38k67L02J46l99k24j7L10R7q3nL37j84
$$ -258 31 -19 28 -58 186 175 184 -136 -140 64 -232 106 -161 141 287 -112 -336 -353 -43 54 -29 -34 303 119
1635A19l59M7K84j71J77J01m18J72J83j27L60j47k45K54j77JJ0r5J60j5l1J13
$$ 119 -240 -193 91 -80 97 198 -220 -48 135 8 368 221 -24 230 53 54 64 -31 129 114 83 196
1657A96m17L59j16p8n2q8M9L10l90K25N7k28R7J6m9n2l0J95J03k45K02j94K66
$$ 196 -221 138 22 -56 -108 -196 -147 163 -227 -2 55 -173 -76 -60 -109 -161 -191 4 107 -138 64 -130 136
1680A36l59N44k85Oj98pK84R1j49k62J50j35J21M77l57o3QJ79np7J03N1o2l80
$$ 136 -223 321 36 42 -156 -163 121 212 63 -199 -49 -184 -63 414 57 -6 2 181 176 99 202 253 191 -189
1704a89K81r0Q1j58q8K62k03N3J44j46j48q0L39O9j65l2J91j29l5K86l39J85k5
$$ -189 92 2 83 -75 -163 99 -104 -51 93 -53 -201 -281 58 127 -38 -70 121 -8 -43 243 -96 89 64
1727F4M0j23m1K91j27k99J2J48J68k24r5J61M6J99P7m26R5J02mo4M3k46K96j29
$$ 64 104 -19 -60 231 104 -195 -183 -35 133 -91 -186 -25 21 220 297 -129 -34 68 64 0 43 -203 93 -36
1751c6j68P0N8q5L5j60M00m8j48q2J32L1J3K96j54j72J43k23L0J91j73J04j17
$$ -36 -204 -134 -76 -161 -126 -286 114 66 -82 -164 -32 -1 12 308 154 -18 125 -98 -68 123 -50 54 -63
1774f3J70l04M90o72L69J94k11n2J32k72K67m0j61M08m11J20J42l9O7k35j04J77
$$ -63 107 -197 293 -379 -10 184 -27 -79 53 -219 48 8 -153 255 -156 -36 106 67 134 -101 -205 -28
1796b8j04L94m56M96k65j40JJ11j38R2J31j47M9j68j19L29NJ89j33K6m48J1L93
$$ -28 -132 262 -194 302 37 -103 -102 9 -129 -37 94 -53 -4 -172 -291 38 43 232 99 125 -323 -312 81
1819H1lk37j00K30n9o7j0K62k18J07K62l24m4r8J12j01K29j90J01J04J79k37p5
$$ 81 78 -159 -259 -29 -88 -155 -165 97 -121 -14 248 -76 -120 -218 -106 -207 22 -168 -67 37 216 -21 -96
1842i6M78k93j44Q9j04J13J56j85j72J8L35n41K56J82j65J7J72j94m6L16k67Q2
$$ -96 382 89 -55 34 -70 43 199 14 -158 -140 195 -346 -90 92 -73 -56 116 -78 -124 192 -75 7
1864Gp9K38k20J0n7O3J07k25L77m01L12kP8j94k39J26K1J2M0j05P3Q5k1K7K9J05
$$ 7 -72 166 -54 -44 -101 -38 69 -156 221 -180 132 130 208 14 -225 -99 -78 -66 -26 -131 -58 27 6 33 62 167
1890A67k61O6KJ92k99J63k34J41j92L64l42K67J29r8K14p7j7k66J0J1J72j65J75
$$ 167 -94 -28 -26 166 -133 30 -204 -63 -255 109 -233 34 163 65 279 202 185 -81 -71 -60 112 -53 122
1913A22j04j15L7J71K9o3K86m70J09jm14L94K88n83J95L5Q3k27L42o0p8j90K09
$$ 122 18 -97 -60 111 140 77 363 -107 2 1 -413 -19 269 -314 -119 -84 -1 -228 114 54 -24 -214 -5
1936ej08MM00n0k68k37R2K54Q7k19O6k03J04l3m8J69%M7r0r5J80j20J56k06K77
$$ -5 -113 -109 291 241 -27 -264 -172 82 169 -50 16 -187 -83 -116 -164 5 5 52 -38 -133 47 -73 83 -123 154
1961A54m35L45K5k18L7l8K67q6J49J5j4p5m3Ok45K24P3j30j27J96k86M20j38N1
$$ 154 -281 64 89 -129 -92 -130 137 51 200 215 201 126 83 89 -156 68 141 11 -116 80 -206 214 76 127
1985A27j83J99j65j3r0j68L58j47r8K23%K0J5k29j2QL43j64j04j07K52k93K32
$$ 127 -56 143 -22 -35 -125 -293 65 -82 -180 43 43 63 78 -151 -163 -155 188 24 -80 -187 65 -228 4
2008DJ38j3l81M48m09K39j43K02j25m0M7K04k71J34J24j22n6J64r9K3r6PQ3k0
$$ 4 142 129 -252 196 -213 26 -117 85 -40 -80 -33 171 -100 34 158 36 -20 144 45 68 -28 -21 62 42
2032D2k03M6R8R8J77k75k1o7o7MN1q0L38K35l42j8j85M3Q9N6J38j26q5M2M8j55
$$ 42 -161 -115 -17 81 258 -17 -38 -105 -172 -168 -117 -197 141 376 34 16 -169 -126 -37 19 157 31 -54 -12 36 -119
2058a19L98p3k09J36k14M12l04j26R5j5n1L24k59J37j24j04J25k41K23j32L01
$$ -119 279 206 -3 133 -81 331 27 -99 -4 -19 -70 254 -5 132 8 -96 29 -212 11 -121 180
2079A80n2j19J20m49K41K90l06L59k36k78K62j37J08m13K88MK21k36M6L60r6j14
$$ 180 128 9 129 -320 -79 211 -95 264 28 -250 12 -125 -17 -430 -142 -138 83 -153 -107 253 157 43
2101D3M2j50k9L16k23j6o7o0j4p7M00j63N1j42k24L29j57J56K37j89L8j20r3K85
$$ 43 85 -65 -94 222 -1 -17 -84 -144 -158 -235 165 2 53 -89 -313 16 -141 15 252 63 101 -19 -112 173
2125A73k76p3L45j72j14N8J14j50K05j05j3l8Q9p4J72l34J33K38j84n1l2l6J24
$$ 173 -103 -176 169 -3 -117 -59 55 -95 110 5 -8 -46 43 -31 141 -193 -60 178 -6 -57 -89 -125 -1
2148aJ09j34m2Q2L1p3K38k26k4J69k20K0k0J46k78N44k07k95K16j40p9R4J68j02
$$ -1 108 -26 -68 14 45 -28 210 -16 -40 129 -91 -71 -91 55 -223 321 114 -181 35 -105 -184 -90 78 -24
2172b4J55k27J29k93K25k81J00J63J46k82j67M63k75J77j94K16k57J48K69k30
$$ -24 131 -96 33 -260 -35 -316 -216 -53 93 -189 -356 107 -168 9 -185 31 -226 -78 191 -39
2192c9k57K08J12j38J00o8J77J1k94L18k26L77l08j15M50l58p5L01l5j99O6j94
$$ -39 -296 -88 24 -114 -14 -82 95 106 -188 130 -96 281 -27 -142 308 -50 -125 176 141 -58 8 -186
2214a86L89j05j93K05k81K12j07J82k17J23N3j50J02k22L34r4N7K7k81J59K26
$$ -186 203 98 -95 110 -171 41 -66 116 -101 22 75 -75 27 -195 139 45 102 129 -152 7 233
2235B33k14k67M99j15k27p1N6J7J32N0p5q3rJ59J31l20L2K12j73j26K11m5L8k45
$$ 233 19 -248 251 136 -91 -162 -106 -89 43 93 18 -65 -74 85 216 -104 -72 140 -33 -159 52 7 45 -200
2259b00J84J3j9J00j62Q9k45L02Q1K51l17P2ql23J81l0L18k58J08j64j03J70J37
$$ -200 -16 -3 -22 78 -84 5 -240 62 143 394 77 149 141 -182 -1 -31 287 29 137 -27 -130 40 177
2282A77l51K04j75P6J9j4k43J61L39k54J69j84J23l5Lq7K29j64P8o8J42p0n05
$$ 177 -174 30 -145 -69 -50 -64 -307 -146 193 -61 108 -76 47 12 15 -72 157 -7 71 3 145 75 -430
2305d30K65K09J17j19L25k67j45Q2j36J43o4l48J68K16mJ19J02l76r0L54l49m1
$$ -430 -165 44 161 42 367 100 -45 37 -99 44 -20 -368 -200 16 12 131 233 -143 -233 121 -228 -269
2327b69J75J78rj03N4K9j81P9r1K42O6l34M31l19R0J40o8P4k75K3J75Nk99j28
$$ -269 -94 84 75 -28 26 55 -126 -47 -138 104 170 -164 267 -52 38 178 110 184 -91 -68 107 112 -187 -315
2351c15L47p3k1j93J53JN9J28k42J1O5M17l43j00M1j13M32k79J24l3j04K03k56
$$ -315 32 -41 -62 -255 -102 -101 -42 86 -156 -145 -80 337 -6 -106 -65 -178 254 -25 99 66 -38 165 -91
2374i1k29L37p8L92m13K04k84K70k42K05j4j9J91q2j14J06j00k21J07J54J36j46
$$ -91 -320 17 -61 331 -82 122 -162 108 -134 71 57 38 229 147 33 139 39 -182 -75 79 215 69
2396F9j78K04m2L7l79L20k34J22K55j48j91J61o6k01K78m2j40J20m4M6m0K8K96
$$ 69 -109 95 53 90 -289 31 -203 -81 174 26 -165 -4 -70 -271 7 -35 -175 -55 -99 -53 -93 -65 231
2419B31j53l0j08m3M2Q7j18J75N6k22L19q8k39J61J57j7j3j31k48K43K13k77j65
$$ 231 78 48 -60 -103 -61 26 -92 83 139 -83 236 148 -91 70 227 210 197 66 -182 61 274 -3 -168
2442a68K09J92j23j89P0kO6J36m45K90j12K51k45j87J61J70K03l78J38P2l29K35
$$ -168 41 233 110 -79 -9 -11 55 191 -254 36 -76 175 -70 -257 -96 74 277 -101 37 109 -220 15
2464A5J32P5k87L32j63l90N7J19K35r1K14k51j62k4N5J85L0K3k01N8J50J0p1r3
$$ 15 147 222 -65 267 104 -286 -229 -110 125 34 248 -3 -165 -189 -134 51 81 104 -97 -39 111 121 50 -43
2488d3k30K05K34j65Kk79N82j24n24M11lk30L39m26Q8j02R7N32k91n0P4l20M06
$$ -43 -273 -68 166 1 3 -276 306 182 -342 69 66 -164 175 -251 -163 -265 -168 364 73 23 97 -223 183
2511A83k94K16j20J50m8n3Q4j11J53j75j79K38m7j64O5K95k66J33K42l10J21o0
$$ 183 -111 105 -15 135 87 34 118 7 160 -15 -194 44 -3 -167 -102 193 -73 60 302 -8 113 53
2533E3l0o7J09J06l14R1L18m14K07n4j94qO9k36M04o5j93N46m60J21J20k96J49
$$ 53 23 -44 65 171 -143 -52 266 -148 59 5 -189 -197 -128 -364 40 -25 -218 328 -132 -11 109 -187 -38
2556c8k10J54J5L19j94k31K86k41R4L25k63j37P6J3L6K6j52K23l32K54J18k83
$$ -38 -248 -94 -79 240 46 -185 101 -140 -46 279 16 -121 -45 -32 4 30 -122 101 -231 23 141 -142
2578a42k5M67m57J43J43m2r2j23K37K2N8l22M08j25j69n3J89k52n8L36l75K29
$$ -142 -167 300 -157 -14 129 87 -5 -128 109 131 189 -133 275 150 -19 -72 117 -135 -193 143 -232 -3
2600cJ25Kr0j42N1K06n6r6J07l24p5J22J5j00J90K73j15j07J53j49N4j37J91r6
$$ -3 122 124 34 -108 -57 149 93 -3 104 -220 -295 -173 -158 -258 -68 205 90 -17 136 -13 41 -96 95 -1
2624ap1M5j44J42o3J06M2q7J17p9P3k75K07J8l14K84K48k48J72j20j53J1M16j76
$$ -1 -72 -27 -171 -29 -92 14 56 -31 86 7 80 -195 12 30 -284 0 248 0 172 52 -101 -90 326 150
2648A50m29L45L7qJ07k76j74K49q7J37K99k93M6j84n7J33j92M7m2K12Q6j29J46
$$ 150 -279 66 103 95 202 -74 -248 1 -86 51 350 57 103 -81 -138 -5 -197 -150 -192 20 106 -23 123
2671A23J28k92j02J90j87J68n7N3l0k36M12J79m26l0j5Q7l6J42M0k18J79K6pM5
$$ 123 251 -41 -143 47 -140 28 -29 24 -6 -242 170 349 -77 -107 -122 -35 -71 71 111 -107 72 98 91 136
2695A36R2k54J30L7p1k00M32k20k15J70j63J28j9n1l2J52q6j09K83Ok30j43M84
$$ 136 228 -26 104 141 70 -130 302 82 -133 37 -126 2 -17 -68 -100 52 -34 -143 140 146 -84 -227 257
2718B57j14j06MK14Kk21L5J44p0k45J2J83j8N1l04J99m8J01j50K49M7k24O0j51
$$ 257 143 37 41 255 257 36 71 215 145 -100 -88 95 77 128 -176 23 -25 76 -74 175 222 -2 58 -93
2742i3M8j20N2K8R0j18K70j34L6q8m3J86l6O9m24L02P1j47K19m85M07K1r5j3Q2
$$ -93 -45 -165 -113 -85 5 -113 157 23 59 -29 -72 114 78 147 -277 25 96 -51 168 -317 90 111 16 3 85
2767H5K71l77k0K20j25j32K40j65j64J08K33k39Q1o7r3m7L01l22P5K8or6J61l3
$$ 85 356 -21 -41 179 54 -78 162 -3 -167 -59 174 -65 16 -51 -144 -191 110 -212 -137 -109 -115 -211 -50 -83
2791h3K40q2k17L13l56R0J98j89k48K11O9N0r8K25l6J56l28j01M43j92j85K18
$$ -83 157 75 -142 171 -185 -95 103 -86 -334 -123 -54 -4 -102 123 87 243 -85 -186 257 65 -120 98
2813I8k84J97J87j60j55r0L48l71J56J04q2K53r1l27J80NJ34l11M07o0l76K00
$$ 98 -186 11 198 38 -117 -207 141 -230 -74 30 -52 201 110 -217 -37 -32 102 -209 198 138 -238 -38
2835c8k7l5J33k34K07J70l38nK56J42Rk67o0J22k7j9O7l04M4R2L86l65J91m3J23
$$ -38 -65 -100 33 -201 6 176 -162 -167 89 231 240 -27 -87 35 8 -11 56 -248 -204 -112 274 -91 100 57 180
2860A80k19J26P6k56j47O4J83j16J01r3J23p1n2P1L4J79l00K38k20K00j60P6l2
$$ 180 -39 87 163 -93 -240 -176 7 -109 -8 -101 22 -49 -101 -30 4 183 -117 121 -99 101 -59 17 -15
2883a5K9J71k18K55j68O9J0J57j65k25L73l94p7K32j56O1J19J01K6m33J76n2K57
$$ -15 14 185 -33 222 54 123 133 290 125 -100 273 -121 -198 34 -122 -61 58 159 185 -248 -72 -124 133
2906A33k41K75j43N5j79K78k54J89J66m13K75K19j50r3J82n03n8K0M95j7l00j14
$$ 133 -108 167 24 79 -100 178 -76 113 279 -134 141 360 210 117 299 -204 -262 -242 253 236 -64 -178
2928a78K8J09M9jO6j88J50l6k17J00QL39m47J86J26k00K26l42K61j81K1m4J36
$$ -178 -150 -41 8 7 73 -115 35 -1 -218 -118 -110 229 -218 -32 94 -106 120 -222 39 -142 -121 -165 -29
2951b9J14l96N63k66N8m4j13M4O7r1O8k9L01j65J28j09M0q2j18R2J03n3m26K16
$$ -29 85 -311 252 -14 44 0 -113 -69 -2 -93 -25 -54 247 82 210 101 141 59 -59 33 136 83 -343 -127
2975a27J39J67Q6j48k62r7M49l97JK84j83J87k37K12p3k07J11K9L1j03j09K62
$$ -127 12 179 265 117 -145 -242 207 -190 -189 95 -88 99 -138 74 1 -206 -95 -66 -35 -138 -247 15
2997A5p7M7m0K70j83j80L7J56K76k61J56l17J93J10O6k30R2j46J99J61k69j25
$$ 15 -62 -15 -55 215 32 -148 -111 45 321 60 216 -101 92 202 268 38 130 -16 183 344 75 -50
3019e0J14J2k31J46j66O2o4J18Q2l0J5p0K11P3l63K95k87J76O2k02L4j40K32o5
$$ -50 64 76 -155 -9 -175 -113 -177 -59 23 -7 8 -62 149 222 -141 154 -133 43 105 -97 -63 -203 29 -36
3043c6n3q2L51j28k84J65Q0m6Q6J20j00N6k59J70J19j22p8q4j95M05j80jOJ09
$$ -36 -89 -171 180 52 -232 -67 13 -33 53 173 73 129 -130 40 159 37 -41 -125 -320 85 -95 -96 -90 19
3067A9Q2r5J09k79L14l0r6nk43J16K41j78L9r1P6p0K40p9j50R8K58m59j83N56
$$ 19 101 6 115 -164 150 120 24 19 -224 -108 133 -45 -6 -97 -21 -91 149 70 -80 18 276 -183 -366 190
3091A90J06l09K29j64K6P9j87J5K33l68L74m62L96j20j70J15K50o4m32L81j94
$$ 190 296 -13 216 52 78 157 -30 -15 218 -150 224 -238 158 38 -132 -17 233 169 -263 118 -76
3112g6K80j37O8l36K34k33K63k45OP8M8J97k96j74L63P2n2lk29K20j29j41L16
$$ -76 204 67 135 -201 33 -200 63 -182 -176 -98 -50 147 -149 -323 40 112 60 57 -172 48 -81 -222 94
3135I4Nj62M3k19M04R9k8k92L36l76J32q3J50j40P9m0j27k42R0M29l38L01k26
$$ 94 99 -63 -20 -239 165 264 236 -56 280 -96 36 -47 103 -37 42 2 -125 -367 -277 152 -186 115 -111
3158a11p4K17k45K59j1p8J68k72J68j46j88K37j6o3K65r9j15M28m27J76Q7k2j95
$$ -111 -185 32 -213 46 35 -43 125 -147 21 -125 -313 -76 -92 -155 110 11 -104 324 -103 73 160 138 -57
3181e7j14K52R7j03j62K58j58L10m00l28N41p1j14J05k46L49k98J51qo4J27Pn
$$ -57 -171 81 178 75 -87 171 13 323 -77 -405 136 65 -49 56 -190 159 -139 12 4 -60 67 74 69
3204F9rm4k15p7L50J18j87R9l60L58m9J4K9k05K01M6r7N2K45k93j81k02L50l1
$$ 69 60 16 -199 -276 74 192 5 104 -256 102 53 67 96 -109 92 138 41 93 338 45 -136 -338 12 -19
3228a9p7K53k74l0K14j25J2J89p7j37K12l45J83j72L63k67KN73o73K75j48J57
$$ -19 -96 157 -117 -147 67 -58 -46 143 66 -71 141 -204 -21 -193 170 -97 -95 478 -195 80 -68 89
3250H9k99J48J68m5j85J64j19K8P0m6R7J20j57L8n1k3j9j03J55r2J00j12K4q8
$$ 89 -210 -62 106 61 -124 40 -79 -51 19 -27 70 190 33 71 20 -3 -22 -125 30 -62 38 -74 -50 -138
3274a38K10n4L35l75q1J41j15J23r8q8P2M6mp5Q3N2j60L17J04J33m52R2N0k19
$$ -138 72 18 353 -22 -103 38 -77 46 -52 -140 -68 -22 -26 -101 -18 34 -126 191 295 428 -24 68 118 -101
3298a01J80j38p9J84j25J32j85J47m3P8M0l50l0M80m4ol92N1J09R8j50k14K06
$$ -101 79 -59 -138 46 -79 53 -132 15 -28 50 90 -260 -290 190 146 140 -252 -201 -92 6 -144 -358 -152
3321a52M04l88Q6J47k41L59J41m13No1o7K39L1j15o5J38j41j16L22j83J12J45
$$ -152 252 -136 -50 97 -144 215 356 -57 -52 -113 -180 59 90 -25 -90 48 -93 -209 113 -70 42 187
3343A87r1k9j2k34o0J85K28j44J1P0r1q5K71k5l26K07p8R0N3k34K05K41l13J61
$$ 187 96 67 55 -179 -239 -54 174 30 41 111 20 -65 206 181 -145 62 -16 74 127 -107 98 339 26 187
3367A87k35L1KL1L5k35L50j37J48k84K6j2j63P8M59k23j20R6K1j77J07j00J28
$$ 187 -48 -17 -15 16 51 -184 166 29 177 -107 -81 -93 -256 -178 281 58 -62 34 55 -122 -15 -115 13
3390A3r9L93m91L52k07J56j39k1M7j24P4J85j89J52k06j80n8M79p9Lk65L08jj98
$$ 13 -86 307 -184 168 -39 117 -22 -43 4 -120 -46 139 -50 102 -104 -284 -342 137 58 61 -204 104 103 -95
3414i5K9k03K99N2j38K50j00j20j2J36m05K28K71j46J08j15q6k8J27m72L31J33
$$ -95 -66 -269 30 82 -56 194 94 -26 -38 98 -307 -79 192 46 154 39 -47 -75 52 -420 -89 44
3436D4j5J7k80M14l36K0ok4J87qL46l27O0N8m64L71J15l2m7J9k54L40k94qK52
$$ 44 29 46 -234 180 -156 -136 -142 -166 21 13 359 32 92 150 -314 57 172 140 93 112 -142 198 -96 -104 148
3461A48o7Q6k1j17k8R3m8m0j63J79r5L09m18QL22j83O9P9j68J1J49l64K35M9j83
$$ 148 81 167 146 29 1 94 46 6 -157 22 -73 236 -182 -174 148 -35 34 113 -55 -44 105 -259 -24 25 -158
3486a58M05k95J2J17m9j51L6j77K91j60n6J94J79k97M01l79j22L09l87K89n5n6
$$ -158 247 -48 -36 81 32 -119 -83 -260 31 -129 -185 9 188 -109 292 -87 -209 100 -287 2 -53 -109
3508a09o8L22l47O7J31K46j93k59J02P2rk69M58m1O8k18j07K35J86m24K35n3n23
$$ -109 -177 145 -202 -135 -4 242 49 -210 -108 -36 -45 -314 144 103 171 -47 -154 81 267 -157 78 25 -498
3531d98O14j49J3n9J88K9k07r5Q2J68j30K44j45l6o9J39j3j49P1J9rk38P8J36
$$ -498 116 -33 -20 -79 109 138 -69 -164 -82 86 -44 200 55 19 -50 89 76 -73 -2 17 8 -230 -152 -16
3555a6J57j17J14j2l06M52l7k03K6j24P5j68J43R5j75L33n6j10n4p3l8j6L5N4
$$ -16 141 24 138 126 -180 272 235 32 58 -66 9 -159 -16 79 -96 237 181 71 17 -56 -94 -110 -75 -21
3579b1R3k60K32j8o4L78m51J51k77K97l75M46n4l12K68M7j9j35M0KJ79m0j88O1
$$ -21 72 -188 44 26 -38 340 -111 40 -237 60 -315 131 77 -235 33 80 61 -74 -34 -32 147 107 -81 -20
3603b0J16j72J18k53L31r1k7l25L0K12j04O6K62P4q4j63J0j9j78K57j28N1lj27
$$ -20 96 -76 42 -211 120 29 2 -323 -293 -81 -185 -119 143 217 133 -30 -20 -39 -217 40 -88 -37 -40 -167
3627a67J72k04n7K85J18o0j20K54j94m0j55M8J11l19L60L15l34j0k5j19J20K9
$$ -167 5 -199 -256 29 147 87 -33 221 27 -13 -168 -120 -9 -328 32 347 13 3 -22 -141 -21 8
3649HJ17j78N24o18L22l62K08r8L29j50r3j06o8k34M86j48j0J64r0J66j72J85
$$ 8 125 -53 471 -147 175 -187 21 -77 252 102 9 -97 -165 -399 87 -61 -71 93 3 169 -3 182
3671A82m24J59l9L09l20J87o6L5k60K92k48o6L02l34J85r6J24J51k3%J26k34j53
$$ 182 -242 -83 -122 187 -133 54 -12 23 -237 55 -193 -259 43 -291 -106 -202 -78 73 50 50 176 -58 -211
3694b11L56j10o3r5j20M56K7j21m89L75j01K35M2n62K77J81l30J89j79L71l06
$$ -211 145 35 -28 -123 -243 213 240 119 -370 5 -96 139 181 -381 -104 77 -253 -64 -243 128 -178
3715a78K94k40j07K80k18M22j37l52n9K53n6Nj3J23j28K7K84N2m06K04K11l12
$$ -178 116 -124 -231 49 -169 253 116 -236 -295 -42 -98 -93 -106 17 -111 -84 200 252 -154 50 261 -51
3737e1J84o7J8m1O1J6j91P9J0k9PK82k51R5MJ7j52M46n79PK86j2p7J62jk16j39
$$ -51 133 66 84 43 104 120 -71 8 18 -11 -4 278 27 122 126 143 -9 437 -142 -135 151 139 62 224 223 7 -132
3764a32L97l69J63J62m43L07R8R8k45l6Rl02J75L27n9l92J89q0J50k42L3J74l2
$$ -132 265 -104 59 221 -222 85 183 281 36 0 9 -293 -118 209 150 -242 -53 -133 17 -225 -192 -18 -50
3787e0L47m30L2M9m1k19L45q6J86k5j80o0J54j45m0R6k48M14L4j42Rk37j37K62
$$ -50 297 -133 -101 -52 -93 -312 33 -53 133 108 -72 -132 22 -123 -163 -67 -315 99 133 -9 0 -237 -374 -112
3811a12K9R8j67K54j18k70J61K50k47J61k14K41k44J21o2J05L35l61q4q7L48m0
$$ -112 -83 15 -152 102 -16 -286 -125 125 -122 39 -175 66 -178 -57 -119 -14 321 -40 -124 -211 137 97
3833I7K9k4J42ml13J26k36o6J18K13Lr5R3J46j32J06m28M9J56J82q5n1J93k31
$$ 97 126 102 244 240 -73 53 -183 -249 -131 82 85 -10 83 229 97 203 -225 -176 -20 162 77 26 219 -12
3857a2q1K42N9k12M10l51mJ56k56J17M1J30j88j83L04j46j51K1k04L86l5q2J86
$$ -12 -93 149 208 -4 406 55 51 207 -49 68 109 239 51 -132 172 26 -125 -104 -308 78 43 -39 147
3880A47k69l9J57K01l21J30K54j38k23K00M38m32k58K3K15n08M68R4k22K17k34
$$ 147 -122 -161 -4 197 -124 6 260 122 -101 99 537 105 -153 -130 85 -423 45 139 -83 134 -100
3901a00k29K02K76r7j45Q3j12M5J00m4J01k04K51n9j90r0J22p7M4N51n49L44j38
$$ -100 -329 -127 149 52 -93 -10 -122 -77 23 -21 80 -124 127 68 -122 -212 -90 -167 -123 428 -121 223 85
3924H5j06%K39l20K44l09N11n20J31j68J75k36J45L54l17N33p56M20K82n61J51
$$ 85 -21 -21 218 -102 142 -167 344 -176 -45 -213 -38 -274 -129 225 -92 441 -315 105 387 -174 -23
3945b3m8O9M7j56K09j46N1j34J81q4J4J6j56L9K74o48O49k67r7J44l3k54L77J08
$$ -23 -71 -2 45 -111 98 -48 3 -131 50 -34 -20 -4 -160 -121 153 -495 154 -113 -210 -66 -99 -353 24 132
3969A32j61j33L01P1J13l43K50j77j41J65Jj47K59k34j96L12j61J08K61j62L9
$$ 132 -29 -162 139 210 323 -20 230 53 -88 77 78 -69 190 -44 -240 72 -89 19 280 118 157
3990A57k33J19N8Q7j89m4L9k7oL9j29J55R7j67J01Q2p8n8J2O2j04o6R6j12J20
$$ 157 -76 43 101 188 -1 -45 -6 -33 -39 0 -129 26 123 -44 57 139 61 3 15 77 -27 -93 3 -109 11
4015A1n8O4J81j97J51k72Q3o8k03M07k14O6j10L05m4l51J41LK57l33J11k3R0p3
$$ 11 -47 17 198 1 152 -120 -37 -105 -308 99 -115 -49 -159 146 102 -249 -108 -105 152 -181 -70 -93 -3 -76
4039g6J01j21l1K32k10K13K5m1k0P7K8k94R8m5Q5oJ31m3j30J93l46K42j24K64
$$ -76 25 -96 -127 105 -105 108 133 92 72 149 177 -117 -19 -64 21 15 146 103 -27 166 -180 62 -62 202
4063B02j13l82L32M1P6n4j71J70j75N08m84K30k99N5K52j78K15k99O4N3q9O8R4
$$ 202 89 -293 39 80 156 102 -69 101 -74 434 -50 180 -119 -64 188 10 225 -74 -10 43 -46 22 116
4086A16k45K15p4j55M73j24k47Q6r3M2J78o0j04j00J62O0j46o6Q1j49N06m63K80
$$ 116 -129 86 12 -143 330 206 -41 45 -48 -6 172 112 8 -92 70 130 -16 -82 -1 -150 356 -107 173
4109A73j75K56k30K83k21P9k15j44K18M1k66NJ66N3l49K30J00K7Q7j11m2P6l7
$$ 173 -2 254 24 307 86 165 -50 -194 24 65 -201 -196 -30 23 -326 -96 4 31 118 7 -35 41 4
4132Dk77L48k64K24j06Q3o1R0q6J7r3K6J0j74P3N2M43k40k75R7O8Q1j91K32q8
$$ 4 -273 75 -189 35 -71 12 -49 41 -45 -28 -121 -95 -85 -259 -186 -134 309 69 -206 -109 -41 40 -151 81 -7
4157gk26L20J67m83K35q8J37j82P5J06l41K19N9J5j35L2K93L8j18j94J08Q7j62
$$ -7 -233 87 254 -229 6 -82 55 -127 -52 54 -287 -68 -9 6 -129 -97 196 234 116 -78 30 117 -45
4180d5j11J0j38K48j27o5J43K92M2q3k11K77l05O6R7J96l69J26l5J37k47n5K77
$$ -45 -156 -146 -284 -36 -163 -228 -85 207 249 166 -45 232 -73 -7 90 286 -83 43 8 145 -102 -157 120
4203A20l74O6K11N7j21Q4l18M77k14j41J13j4J58k52O2J77o0J3j42K15k36L2j27
$$ 120 -254 -188 23 80 -41 43 -275 202 -12 -153 -40 -54 104 -148 -86 91 31 44 -98 117 -119 -87 -214
4226b14J25j03J09k8J23j11p0J6M1K23m25K63k9j7m8K59j10J06Q9jk41R7J51l28
$$ -214 -89 -192 -83 -111 12 -99 -169 -153 -112 111 -314 -51 -80 -97 -145 114 4 110 199 198 -43 54 205 -123
4250a23K36Q0j51j72j32K16q1J83l02K5L46j79L00l47q0L29j59J22q6J96o04L17
$$ -123 113 193 42 -130 -262 -46 -127 56 -246 -221 125 -54 246 -101 -181 148 -11 111 25 221 -383 -66
4272f6K5j61K43L9j79L1Q6J29j66l2J28j71K25p4J74j97r5k5j05J55j49Q5J6O3
$$ -66 -41 -202 41 80 -99 -68 18 147 -19 -51 77 -94 131 57 231 34 -61 -86 -191 -36 -185 -100 -84 -21
4296b1L5rl8O3j10J14J35j72J44j8j67j15K5o3L27j71K55l7n9m75L07R1K6J58
$$ -21 14 5 -33 30 -80 34 169 -3 141 123 -44 -159 -134 -197 130 -41 214 177 118 -357 -50 41 67 225
4320B25j29k24l4K55N2j89J34l04J62j49J31l5n0rN41r4m17J27j02%m1L87l45
$$ 225 96 -128 -162 93 145 -44 90 -214 -52 -201 -70 -105 -155 -164 377 283 -134 -7 -109 -109 -150 237 -108
4343a08J68j50Q4L12m09K68k04N1L4M7N5k69J86j13K13l71J50K76l00J19J0OM
$$ -108 60 -90 -6 306 -103 165 -39 12 46 93 148 -121 65 -48 165 -206 -56 220 -80 39 49 55 59
4366E9j61M6J90j70K29j6k94K24r5MJ2K0KKj47J23K77j91j59q4K47l57P4M4J37
$$ 59 -102 -56 134 -36 193 177 -117 107 12 16 28 48 50 52 -95 28 305 114 -45 -129 118 -239 -165 -121 16
4391A6mj52L12j40r4P3k5Pp1J61J37k1l09rO7J61l5J51k69k55J94J28K1p0r1R4
$$ 16 12 -140 172 32 -62 11 -14 -7 -78 83 220 199 -110 -119 -52 109 74 225 -44 -299 -105 23 44 -26 -117 -23
4417b3J65k05J75o3q0j22J39K2L35l60L13k69J67k16oj84K84M5J34j78j05j90
$$ -23 142 -63 112 49 -31 -153 -14 8 343 -17 296 27 194 -22 -28 -212 72 117 251 73 -32 -222
4439b22KJ73n0q9R5M20k50k21J53M62o56M7K16L84m77Q0l18J84R6j75K86j97M9
$$ -222 -220 -47 -97 -186 -91 329 79 -142 11 473 -183 -136 80 464 -13 67 -251 -67 29 -146 140 -57 -8
4462hJ59J38N7m42K72P2o2k55P5r8L29j93P9J0L05k78k5j64k65L63j74K43L2m69
$$ -8 151 289 346 -96 176 248 186 -69 6 -92 237 44 123 133 438 160 135 -29 -294 69 -105 138 170 -299
4486b99M27J43j90j19k21Q6R5L36l62J78j55N3R2l40J41L22j90j08Qp8J4K16k31
$$ -299 128 271 81 -38 -259 -173 -78 258 -104 74 -81 -28 64 -276 -135 187 -3 -111 -103 -181 -167 49 -182
4509a82J92M2p5J03j68N2p9m3Q4J9J50n06J52L06P3j00m47O96k21O2l8m16M91
$$ -182 10 52 -23 80 -88 -36 -115 -158 -74 -55 95 -411 -259 47 120 20 -427 269 48 110 72 -344 147
4532A47L9N3l78L0L8J92k27m0q8L10l26P2K14L6l2j00P4j56J33Q0m6j30J94j60
$$ 147 186 239 -139 -109 -71 121 -106 -146 -234 76 -250 -178 36 72 40 -60 14 -142 -9 71 25 -105 89 -71
4556g1P8J75l82K08N4j82K19k37K46l1p3j80J63Q4k3k44K43p3M3J69j59Mj91K80
$$ -71 7 182 -200 8 62 -120 99 -138 108 77 4 -176 -13 71 48 -196 47 -26 17 186 27 31 -160 120
4580A20j91K94k15k62N85l59P5j47P6K27n26J50p5N87m50K27j26k35K10lj0k6
$$ 120 -71 223 8 -254 331 -28 47 -100 -24 203 -323 -173 -248 339 -111 116 -10 -245 -35 -38 -48 -74
4602g4P5K6O3j53n3k09M17o3k2J00n6j37K16P7k23l7PK7KK5j7J2l48K15L57j11
$$ -74 1 27 90 -63 -116 -325 92 29 7 107 51 -86 130 207 -16 -53 -46 -19 -17 8 -9 3 -345 -130 227 116
4628A16k28m2K89k58J02Q6j23K36j03j96K33j47M2J71Q7O2n89J83K6J67j17j87
$$ 116 -112 -154 135 -123 -21 65 -58 178 75 -121 112 -35 7 178 265 327 -262 -79 -53 114 -3 -190
$$ [...]
8191e5
##END NTUPLES=NMR FID
##END=
