##TITLE=1H_DE-105_oil_3
 200.13MHz,CDCl3,
 8 sc
 
 1.8.2025
##JCAMPDX= 6.0         $$ Bruker NMR JCAMP-DX V2.0
##DATA TYPE= NMR FID
##DATA CLASS= NTUPLES
##ORIGIN= UXNMR, Bruker Analytische Messtechnik GmbH
##OWNER= pz
$$ XWIN-NMR		Version 3.5
$$ Fri Aug  1 15:20:54 2025 Russian Standard Time (UT+4h)  she@DPX200
##.OBSERVE FREQUENCY= 200.1313
##.OBSERVE NUCLEUS= ^1H
##.DELAY= (6, 6)
##.ACQUISITION MODE= SIMULTANEOUS
##.ACQUISITION SCHEME= undefined
##.AVERAGES= 8
##.DIGITISER RES= 18
##SPECTROMETER/DATA SYSTEM= spect
##.PULSE SEQUENCE= zg30
##.SOLVENT NAME= CDCl3
##.SHIFT REFERENCE= (INTERNAL, CDCl3, 0, 14.3821)
##AUDIT TRAIL= $$ (NUMBER, WHEN, WHO, WHERE, WHAT)
$$ ##TITLE= Audit trail, XWIN-NMR		Version 3.5
$$ ##JCAMPDX= 5.01
$$ ##ORIGIN= Bruker BioSpin GmbH
$$ ##OWNER= she
$$ F:/spectra/data/she/nmr/H-C/1/audita.txt
$$ ##AUDIT TRAIL=  $$ (NUMBER, WHEN, WHO, WHERE, WHAT)
(   1,<2025-08-01 15:19:30.89 +0400>,<she>,<DPX200>,
      <created by zg, POWCHK disabled, PULCHK disabled
       configuration hash MD5:
       00 E9 B6 7A A2 85 ED C7 34 08 36 98 17 FE 4E 26
       data hash MD5: 16K
       A7 A3 9D 76 44 42 04 64 6C A3 35 8A BD 4D DC 4D>)
$$ ##END=
$$ 
$$ hash MD5
$$ A6 DE E4 66 E4 AE E2 6E 62 74 27 58 7F 83 65 6E
##$RELAX= 
##$RELAX= 
##$RELAX= 
##$RELAX= 
##$RELAX= 
##$RELAX= 
$$ Bruker specific parameters
$$ --------------------------
##$DU= <F:/spectra>
##$EXPNO= 1
##$NAME= <H-C>
##$PROCNO= 1
##$TYPE= <nmr>
##$USER= <she>
##$AMP= (0..31)
100 100 100 100 100 100 100 100 100 100 100 100 100 100 100 100 100 100 
100 100 100 100 100 100 100 100 100 100 100 100 100 100 
##$AQSEQ= 0
##$AQ_mod= 1
##$AUNM= <au_zg>
##$AUTOPOS= <>
##$BF1= 200.13
##$BF2= 200.13
##$BF3= 200.13
##$BF4= 200.13
##$BF5= 200.13
##$BF6= 200.13
##$BF7= 200.13
##$BF8= 200.13
##$BYTORDA= 1
##$CFDGTYP= 0
##$CFRGTYP= 5
##$CHEMSTR= <none>
##$CNST= (0..31)
1 1 145 1 1 1 1 1 1 1 1 1 1 1 1 1 1 1 1 1 1 1 1 1 1 1 1 1 1 1 1 1 
##$CPDPRG= <>
##$CPDPRG1= <>
##$CPDPRG2= <>
##$CPDPRG3= <>
##$CPDPRG4= <mlev>
##$CPDPRG5= <mlev>
##$CPDPRG6= <mlev>
##$CPDPRG7= <mlev>
##$CPDPRG8= <mlev>
##$CPDPRGB= <>
##$CPDPRGT= <>
##$D= (0..31)
0 0.7 0 0 0 0 0 0 0 0 0 0.03 0 0 0 0 0 0 0 0 0 0 0 0 0 0 0 0 0 0 0 0 
##$DATE= 1754047170
##$DBL= (0..7)
120 120 120 120 120 120 120 120 
##$DBP= (0..7)
150 150 150 150 150 150 150 150 
##$DBP07= 0
##$DBPNAM0= <>
##$DBPNAM1= <>
##$DBPNAM2= <>
##$DBPNAM3= <>
##$DBPNAM4= <>
##$DBPNAM5= <>
##$DBPNAM6= <>
##$DBPNAM7= <>
##$DBPOAL= (0..7)
0.5 0.5 0.5 0.5 0.5 0.5 0.5 0.5 
##$DBPOFFS= (0..7)
0 0 0 0 0 0 0 0 
##$DE= 6
##$DECBNUC= <off>
##$DECIM= 32
##$DECNUC= <off>
##$DECSTAT= 4
##$DIGMOD= 1
##$DIGTYP= 9
##$DL= (0..7)
0 120 120 120 120 120 120 120 
##$DP= (0..7)
150 150 150 150 150 150 150 150 
##$DP07= 0
##$DPNAME0= <>
##$DPNAME1= <>
##$DPNAME2= <>
##$DPNAME3= <>
##$DPNAME4= <>
##$DPNAME5= <>
##$DPNAME6= <>
##$DPNAME7= <>
##$DPOAL= (0..7)
0.5 0.5 0.5 0.5 0.5 0.5 0.5 0.5 
##$DPOFFS= (0..7)
0 0 0 0 0 0 0 0 
##$DQDMODE= 0
##$DR= 18
##$DS= 0
##$DSLIST= <SSSSSSSSSSSSSSS>
$$ [...]
##$SUBNAM0= <"">
##$SUBNAM1= <"">
##$SUBNAM2= <"">
##$SUBNAM3= <"">
##$SUBNAM4= <"">
##$SUBNAM5= <"">
##$SUBNAM6= <"">
##$SUBNAM7= <"">
##$SUBNAM8= <"">
##$SUBNAM9= <"">
##$SW= 18.0517328524113
##$SWIBOX= (0..15)
0 0 2 0 0 0 0 0 0 0 0 0 0 0 0 0 
##$SW_h= 3612.71676300578
##$TD= 16384
##$TD0= 1
##$TE= 0
##$TE2= 300
##$TE3= 300
##$TEG= 300
##$TL= (0..7)
0 120 120 120 120 120 120 120 
##$TP= (0..7)
150 150 150 150 150 150 150 150 
##$TP07= 0
##$TPNAME0= <>
##$TPNAME1= <>
##$TPNAME2= <>
##$TPNAME3= <>
##$TPNAME4= <>
##$TPNAME5= <>
##$TPNAME6= <>
##$TPNAME7= <>
##$TPOAL= (0..7)
0.5 0.5 0.5 0.5 0.5 0.5 0.5 0.5 
##$TPOFFS= (0..7)
0 0 0 0 0 0 0 0 
##$TUNHIN= 0
##$TUNHOUT= 0
##$TUNXOUT= 0
##$USERA1= <user>
##$USERA2= <user>
##$USERA3= <user>
##$USERA4= <user>
##$USERA5= <user>
##$V9= 5
##$VALIST= <valist>
##$VCLIST= <CCCCCCCCCCCCCCC>
##$VD= 0
##$VDLIST= <DDDDDDDDDDDDDDD>
##$VPLIST= <PPPPPPPPPPPPPPP>
##$VTLIST= <TTTTTTTTTTTTTTT>
##$WBST= 1024
##$WBSW= 4
##$XGAIN= (0..3)
0 0 0 0 
##$XL= 0
##$YL= 0
##$YMAX_a= 118108
##$YMIN_a= -152480
##$ZGOPTNS= <>
##$ZL1= 120
##$ZL2= 120
##$ZL3= 120
##$ZL4= 120
##$ABSF1= 10
##$ABSF2= 0
##$ABSG= 5
##$ABSL= 3
##$ALPHA= 0
##$AQORDER= 0
##$ASSFAC= 0
##$ASSFACI= 0
##$ASSFACX= 0
##$ASSWID= 0
##$AUNMP= <proc_1d>
##$AZFE= 0.1
##$AZFW= 0.1
##$BCFW= 1
##$BC_mod= 2
##$BYTORDP= 1
##$COROFFS= 0
##$CY= -3
##$DATMOD= 1
##$DC= 2
##$DFILT= <>
##$DTYPP= 0
##$F1P= 0
##$F2P= 0
##$FCOR= 0.5
##$FTSIZE= 0
##$FT_mod= 4
##$GAMMA= 1
##$GB= 0.15
##$INTBC= 1
##$INTSCL= 1
##$ISEN= 128
##$LB= 0.25
##$LEV0= 0
##$LPBIN= 0
##$MAXI= 10000
##$MC2= 0
##$MEAN= 0
##$ME_mod= 0
##$MI= 1.114404
##$NCOEF= 0
##$NC_proc= 0
##$NLEV= 6
##$NOISF1= 3.799351
##$NOISF2= 2.8
##$NSP= 1
##$NTH_PI= 0
##$NZP= 0
##$OFFSET= 14.38212
##$PC= 1
##$PHC0= -1213.055
##$PHC1= 31.99254
##$PH_mod= 1
##$PKNL= yes
##$PPARMOD= 0
##$PSCAL= 0
##$PSIGN= 0
##$REVERSE= no
##$SF= 200.129724274929
##$SI= 16384
##$SIGF1= 3
##$SIGF2= 2
##$SINO= 400
##$SIOLD= 16384
##$SREGLST= <1H.CDCl3>
##$SSB= 0
##$STSI= 0
##$STSR= 0
##$SW_p= 3205.1282051282
##$SYMM= 0
##$S_DEV= 0
##$TDeff= 0
##$TDoff= 0
##$TI= <>
##$TILT= no
##$TM1= 0
##$TM2= 0
##$TOPLEV= 0
##$USERP1= <user>
##$USERP2= <user>
##$USERP3= <user>
##$USERP4= <user>
##$USERP5= <user>
##$WDW= 1
##$XDIM= 8192
##$YMAX_p= 0
##$YMIN_p= 0
$$ End of Bruker specific parameters
$$ ---------------------------------
##NTUPLES= NMR FID
##VAR_NAME=  TIME,          FID/REAL,        FID/IMAG
##SYMBOL=    X,             R,               I
##VAR_TYPE=  INDEPENDENT,   DEPENDENT,       DEPENDENT
##VAR_FORM=  AFFN,          ASDF,            ASDF
##VAR_DIM=   8192,          8192,            8192
##UNITS=     SECONDS,       ARBITRARY UNITS, ARBITRARY UNITS
##FACTOR=    0.0002768,     1,               1
##FIRST=     0,             0,               0
##LAST=      2.2672688,     0,               0
##MIN=       0,             -152480,         0
##MAX=       2.2672688,     118108,          0
$$ Real data points
##PAGE= N=1
##DATA TABLE= (X++(R..R)), XYDATA
$$ plain form
0 0 0 0 0 0 0 0 0 0 0 0 0 0 0 0 0 -5 8 -8 8 -8 8 -12 16 -16 18 -24 24 -31 32 -40 46 -53 58 -65 73 -84 93 -104
38 -104 116 -131 143 -159 178 -196 217 -239 263 -291 320 -352 390 -428 471 -521 577 -639 711 -795
58 -795 891 -1006 1147 -1325 1549 -1850 2273 -2909 3977 -6078 11771 -60876 -152480 25842
72 25842 85431 20295 55380 118108 72546 64873 91825 41673 -11020 19083 4017 -65686
84 -65686 -61699 -23042 -55844 -81386 -46650 -15862 -9619 1942 11423 16875 28658 47281 42630
97 42630 13462 9712 34228 19134 -19915 -15759 4569 -14215 -31874 -15995 -10554 -17856 -2178
110 -2178 -1237 -24435 -1354 37258 6885 -22132 18430 38998 4247 -4976 14421 8104 -5201
123 -5201 -3029 -13425 -23700 -4918 -373 -24366 -18349 13933 15317 -560 6178 22195 21230 10230
$$ packed form
0@%%%%%%%%%%%%%%%nJ3j6J6j6J6k0K8l2L4m2M8n5O3p2Q6r9J11j23J38j57J77j97
38a04K20k47K74l02L37l74M13m56N02n54O11o72P42q18Q99r92J098j216J350j506
58g95J686j897K153k472K874l399M123n182O886j0055J7849p2647r1604J78322
72B5842N9589o5136L5085O2728m5562p673K6952n0152n2693L0103j5066o9703
84f5686L987L8657l2802k5542L4736L0788O243J1561R481N452J1783J8623m651
97D2630k9168l750K4516j5094l9049M156K0328j8784j7659J5879N441p302J5678
110b178R41k3198K3081L8612l0373k9017M0562K0568l4751r223J9397o317j3305
123e201K172j0396j0275J8782M545k3993O017L2282J384j5877O738J6017r65j1000
$$ plain form
137 10230 3969 10 -3427 -2789 -8931 -24832 -22218 -2564 -2272 -17071 -9143 14887 14793 1885 8648
152 8648 17795 10738 9322 7704 -6854 -4977 9447 -4145 -23109 -8704 7469 -6174 -16335
165 -16335 -2867 5190 -182 723 1544 -367 9894 14858 190 -2347 12854 12891 -3263 -8282 146
180 146 712 -10223 -13969 -10988 -8640 -3461 -1751 -6000 -668 14261 15188 4242 5810 17526 13642
195 13642 -1644 -3922 -145 -6134 -9698 -10626 -15751 -11950 -222 -2329 -9622 904 14638 9288
209 9288 489 7788 14042 7366 2224 724 -1503 599 1238 -7732 -11108 -2546 278 -8111 -10885
224 -10885 -1729 2409 -2639 -3121 2410 5184 7353 7752 4006 4457 9990 8198 -2797 -5579 885
239 885 -1339 -11754 -12187 -5399 -5157 -5090 -2607 -1159 2782 9000 8267 2962 5989 11693 5972 -3829
$$ packed form
137A0230o261l959l437O38o142j5901K614J9654K92j4799P928K4030r4j2908O763
152H648R147p057j416j618j4558J877J4424j3592j8964J4405J6173j3643j0161
165a6335J3468Q057n372R05Q21j911J0261M964j4668k537J5201L7j6154n019Q428
180A46N66j0935l746K981K348N179J710m249N332J4929R27j0946J568J1716l884
195A3642j5286k278L777n989l564r28n125L801J1728k107p293J0526J3734n350
209I288q799P299O254o676n142j500k227K102O39q970l376Q562K824q389k774
224a0885R156M138n048m82N531K774K169L99l746M51N533j792j0995k782O464
239H85k224j0415m33O788K42O7K483J448L941O218p33n305L027N704n721r801
$$ plain form
255 -3829 -2376 1196 -2968 -7067 -6587 -5699 -2875 -665 -3033 -3515 2333 6410 1032 -1965 3892 6699
271 6699 1486 -807 1961 2212 1699 253 -2544 -3231 301 336 -5681 -6775 -197 1469 -4378 -3052
287 -3052 2881 4491 3223 2955 3298 4017 4660 1941 -2752 -3261 404 -2521 -8227 -5795 -538 -861 -2435
304 -2435 -295 2543 4327 4796 2878 1233 3038 4302 -422 -4694 -1467 718 -2624 -4604 -2016
319 -2016 -132 -558 -425 -528 -289 1850 2829 -154 -1471 3314 4190 -188 -942 1815 2406 -191 -1876
336 -1876 -1683 -1554 -1296 -2346 -3964 -3163 882 936 -1814 259 4586 4272 1885 1807 2739 2393 526 -1644
354 -1644 -3202 -2644 -1433 -3329 -4996 -2077 1019 -95 -1010 1703 3529 2869 1943 1620 1132 1407 1609
371 1609 -1167 -2535 -295 604 -2189 -3293 -833 207 -1266 -1995 -713 246 624 666 140 696 3322
$$ packed form
255c829J453L572m164m099M80Q88K824K210k368m82N848M077n378k997N857K807
271F699n213k293K768K51n13j446k797o87L532L5o017j094O578J666n847J326
287c052N933J610j268k68L43P19O43k719m693n09L665k925n706K432N257l23j574
304b435K140K838J784M69j918j645J805J264m724m272L227K185l342j980K588
319b016J884m26J33j03K39K139R79k983j317M785Q76m378p54K757N91k597j685
336a876J93J29K58j050j618Q01M045N4k750K073M327l14k387p8R32l46j867k170
354a644j558N58J211j896j667K919L096j114r15K713J826o60r26l23m88K75K02
371A609k776j368K240Q99k793j104K460J040j473p29J282R59L78M2n26N56K626
$$ plain form
388 3322 2590 60 418 2510 1492 -914 -1720 -1031 -1499 -2159 -2601 -2636 -1539 407 194 -909 1397 3422
406 3422 2513 774 1419 2257 1005 -638 -1219 -1658 -1271 -1061 -2038 -2273 -133 1200 -396 -1181 1021 1800
424 1800 731 -192 679 931 1011 157 -606 -291 906 310 -1519 -1244 343 20 -1744 -1646 -491 170 -141
443 -141 23 155 854 2072 1015 97 634 1315 299 -1379 -932 -395 -1070 -1868 -1216 -416 289 477 259
462 259 87 1416 1966 567 -315 565 659 -536 -1129 -805 -571 -363 -845 -1129 -505 859 487 -605 -245
481 -245 839 1010 -80 -122 771 676 83 236 80 171 183 -235 -1219 -842 -190 -683 -1361 -766 483 603 178
502 178 343 962 1300 1241 508 411 433 501 -772 -1564 -625 -605 -1140 -1527 -485 215 373 469 284 747 1169 908
524 908 141 -55 586 446 -455 -551 18 62 -627 -607 -409 -3 0 -260 -450 -32 502 573 -64 71 972 737
$$ packed form
388C322p32k530L58K092j018k406q06O89m68o60m42l5J097J946k13j103K306K025
406C422r09j739O45Q38j252j643n81m39L87K10r77k35K140J333j596p85K202P79
424A800j069r23Q71K52Q0q54p63L15J197n96j829K75J587l23j764R8J155O61l11
443a41J64J32O99J218j057r18N37O81j016j678M47N37o75p98O52Q00P05J88k18
462B59j72J329N50j399q82Q80R4j195n93L24K34K08m82k84O24J364l72j092L60
481b45J084J71j090m2Q93r5n93J53j56R1J2m18r84L77O52m93o78N95J249J20m25
502A78J65O19L38n9p33r7K2O8j273p92R39K0n35l87J042P00J58R6j85M63M22k61
524I08p67j96O41j40r01r6N69M4o89K0J98M06Lk60j90M18N34P1o37J35R01k35
$$ plain form
546 737 270 311 358 481 -227 -718 -901 -543 -292 -729 -1147 -457 758 292 -84 604 1397 908 310 -41 379
567 379 337 172 -994 -870 -335 -59 -512 -604 180 224 285 -208 400 261 604 94 -137 78 550 281 -252
588 -252 -219 287 77 -389 -386 -110 279 -459 -457 -66 -102 58 106 86 85 1013 354 75 108 429 -89 -382 -615 -336
612 -336 -240 -145 -169 -503 291 425 -107 47 380 603 130 -157 71 1 -352 -610 -688 -208 -107 195 -329 -31
634 -31 -92 166 -16 72 25 206 242 51 16 27 304 -128 -129 -39 96 -158 -314 123 2 103 -150 -115 -140 173
658 173 205 -336 83 678 442 124 -108 14 -218 -533 -505 -618 -241 43 78 -212 378 185 433 241 98
679 98 145 282 22 -162 48 394 -272 -224 -125 -252 -95 -87 -207 28 -56 -84 -210 2 240 190 1 225 266 143
703 143 107 155 30 -79 -5 -252 -313 -206 -139 -42 -495 -8 67 251 187 363 95 249 324 89 -73 57 -23 -244
$$ packed form
546G37m67M1M7J23p08m91j83L58K51m37m18O90J215m66l76O88P93m89n98l51M20
567C79m2j65j166J24N35K76m53r2P84M4O1m93O08j39L43n10k31K15M72k69n33
588b52L3N06k10m66LK76L89p38KL91l6J60M8k0jR28o59k79L3L21n18k93k33K79
612c36R6R5k4l34P94J34n32J54L33K23m73k87K28p0l53k58p8M80J01L02n24K98
634c1o1K58j82Q8m7J81L6j91l5J1K77m32jR0J35k54j56M37j21J01k53L5k5L13
658A73L2n41M19N95k36l18k32J22k32l15K8j13L77K84L5k90N90j93K48j92j43
679I8M7J37k60j84K10L46o66M8R9j27J57Qj20K35q4k8j26K12K38n0j89K24M1j23
703A43l6M8j25j09P4k47o1J07O7R7m53M87P5J84o4J76k68J54P5k35j62J30q0k21
$$ plain form
727 -244 -202 -41 173 -36 -89 199 161 180 254 168 355 148 219 -32 -54 101 56 259 -113 -120 25 142 -251 -270
751 -270 -176 -283 -60 -182 -22 80 396 -131 225 175 135 -136 -185 159 -121 30 -368 -181 -70 -228 -236 -153 157
774 157 158 163 -159 275 61 138 -91 -341 -113 -64 -19 -236 -255 114 17 313 -21 -16 96 -92 -199 43 -21 30 -116
799 -116 -184 -85 120 -260 -126 39 99 84 -112 183 -12 116 98 -102 -176 73 216 -17 -45 163 115 -192 -33
822 -33 100 5 -302 48 24 -106 59 297 -127 -40 -12 172 61 93 170 -113 52 -68 -168 39 -9 120 32
845 32 230 54 64 -244 -127 -138 30 -32 -80 -239 -55 70 -7 -33 -1 20 194 -174 63 7 -7 -112 205 113
869 113 118 25 201 89 -57 178 253 -23 -97 -95 29 -13 -68 133 -250 -39 -185 22 -274 76 133 189 -114 190
893 190 -14 183 141 227 63 -106 68 -13 -148 114 -196 43 1 107 -89 259 -44 4 157 43 -38 -24 170
$$ packed form
727b44M2J61K14k09n3K88l8J9P4q6J87k07P1k51k2J55m5K03l72pJ45J17l93j9
751b70R4j07K23j22J60J02L16n27L56n0m0k71m9L44k80J51l98J87J11j58qQ3L10
774A57JNl22M34k14P7k29k50K28M9M5k17j9L69r7K96l34NJ12j88j07K42o4N1j46
799a16o8R9K05l80J34J65O0j5j96K95j95J28j8k00p4K49J43k33k8K08m8l07J59
822c3J33r5l07L50k4j30J65K38m24Q7K8J84j11L2P7k83J65j20j00K07m8J29q8
845C2J98j76J0l08J17j1J68o2m8j59J84J25p7k6L2K1J74l68K37n6j4j05L17r2
869A13Nr3J76j12j46K35P5k76p4KJ24m2n5K01l83K11j46K07k96L50N7N6l03L04
893A90k04J97m2Q6j64j69J74q1j35K62l10K39m2J06j96L48l03M8J53j14q1J4J94
$$ plain form
916 170 134 102 -36 -224 85 15 -46 318 -22 38 -7 197 16 60 37 -262 182 45 -16 -251 -17 127 -76
939 -76 -212 -25 61 -82 177 267 11 -173 -141 142 -175 133 -99 86 108 -71 42 -212 46 -68 14 -178
961 -178 -19 133 -74 -20 141 -111 -222 -65 39 -240 19 29 -114 -51 -266 -202 -89 3 88 -139 -142 161 273
984 273 193 -51 72 31 122 -104 144 -18 58 182 -250 221 -72 2 -272 45 105 -213 57 205 -284 39
1006 39 -45 95 -28 19 338 64 84 203 193 110 -115 -26 120 -108 87 -89 -100 139 -125 -43 -92 -160 -47 -205
1030 -205 -302 22 -7 -221 -26 172 33 242 157 -65 -16 59 176 -32 122 124 210 7 108 273 -82 -57 -56 -51
1054 -51 -17 107 121 28 74 225 -153 122 110 12 251 -67 173 9 -45 32 -85 -110 -69 -41 44 141 -227 -47 -201
1079 -201 173 -88 43 -178 -18 -36 50 -67 103 -209 63 42 -30 -40 144 -70 -128 171 -59 -173 286 56
$$ packed form
916A70l6l2j38j88L09p0o1L64l40O0m5K04j81M4k3k99M44j37o1k35K34J44k03
939g6j36J87Q6j43K59R0k56j84L2K83l17L08k32J85K2j79J13k54K58j14Q2j92
961a78J59J52k07N4J61k52j11J57J04k79K59J0j43O3k15O4J13R2Q5k27lL03J12
984B73q0k44J23m1R1k26K48j62P6J24m32M71k93P4k74L17O0l18K70J48m89L23
1006C9q4J40j23M7L19k74K0J19j0q3k25Q9J46k28J95j76j1K39k64Q2m9o8J13j58
1030b05r7L24k9k14J95J98j39K09q5k22M9P5J17k08J54KQ6k03J01J65l55K5JN
1054e1L4J24J4r3M6J51l78K75j2r8K39l18K40j64n4P7j17k5M1K8Q5R7l68J80j54
1079b01L74k61J31k21J60j8Q6j17J70l12K72k1p2j0J84k14n8K99k30j14M59k30
$$ plain form
1101 56 55 86 7 181 -55 276 -239 89 204 -225 -285 -30 -22 288 -137 -105 145 96 183 83 183 257 105 -98
1125 -98 -179 96 112 -53 81 -190 -306 280 49 48 201 182 -24 -19 -379 -62 -36 85 -129 -75 -157 64 -162 -134
1149 -134 96 113 -171 54 44 -21 66 -39 142 126 157 64 82 116 101 143 50 -55 426 -285 23 14 226 -100 35
1174 35 140 89 182 -131 254 -131 -202 119 151 -345 236 -29 57 -175 -28 -173 75 -42 -93 -31 -23 150 21
1197 21 138 37 -130 -98 0 -84 -94 -160 79 -76 117 -14 97 -63 139 -46 -135 61 183 -107 57 109 58
1220 58 -173 -35 -30 83 -34 124 122 -2 -84 -50 145 55 -89 -52 -31 -496 -13 83 -84 -68 -89 139 -179 90
1244 90 -10 61 61 -168 7 44 -28 -56 361 251 -196 -90 200 382 -36 26 81 -22 71 -149 -39 12 146 -69
1268 -69 -104 -24 -55 -191 77 -7 -33 153 -16 -79 -75 -87 -186 -61 11 -154 216 181 -89 -175 -33 61 122 4 112
$$ packed form
1101E6jL1p9J74k36L31n15L28J15m29o0K55QL10m25L2K50m9Q7j00J00P4j52k03
1125i8q1K75J6j65J34k71j16N86k31jJ53j9k06Nl60L17K6J21k14N4q2K21k26K8
1149a34K30J7k84K25j0o5Q7j05J81j6L1r3J8L4j5M2r3j05M81p11L08rK12l26J35
1174C5J05n1R3l13L85l85p1L21L2m96N81k65Q6k32J47j45K48j17n1O2QJ73j29
1197B1J17j01j67L2R8q4j0o6K39j55J93j31J11j60K02j85q9J96J22k90J64N2n1
1220E8k31J38NJ13j17J58kj24q2L4J95r0j44L7K1m65M83R6j67J6k1K28l18K69
1244I0j00P1%k29J75L7p2k8M17j10m47J06K90J82m18O2N5j03R3k20J10N1J34k15
1268f9l5Q0l1j36K68q4k6J86j69o3Mj2r9J25P2j65L70l5k70q6J42R4O1j18J08
$$ plain form
1293 112 127 -67 38 161 -148 -186 0 145 -19 1 -101 -29 -91 177 4 32 182 226 84 -31 130 45 -123
1316 -123 104 144 -158 -6 9 180 111 -219 -198 -182 -107 259 3 117 -170 -21 120 208 11 -78 210 -197 188
1339 188 153 81 66 102 -38 2 -204 -213 276 -324 77 -59 20 -61 36 101 -320 -31 -28 -124 -151 70 -47 -184 -1
1364 -1 -130 -38 -28 4 22 -94 107 16 -174 114 84 -12 -126 102 160 -16 -210 107 -27 58 -36 -266 -141 -118
1388 -118 -121 -315 -167 -111 118 163 -43 -200 -41 135 66 -105 112 -19 -233 149 35 -182 118 253 15 14
1410 14 -98 -30 -96 121 312 -171 -465 135 73 -22 -140 -57 81 -193 148 -89 -92 -146 36 -161 59 -223 -46
1433 -46 100 -11 -85 182 -44 -58 31 114 218 -25 183 33 194 152 -42 -26 -107 -44 -97 297 -107 47 -5 7
1457 7 -19 -183 207 87 65 -10 -86 -263 -164 58 -110 -13 -81 32 -74 136 182 -97 -22 -65 -118 76 58 84 -230
$$ packed form
1293A12J5j94J05J23l09l8J86J45j64K0j02P2o2K68j73K8J50M4j42j15J61q5j68
1316a23K27M0l02J52J5J71o9l30K1J6P5L66k56J14k87J49J41Q8j97q9K88m07L85
1339A88l5p2j5L6j40M0k06rM89o00M01j36P9q1R7O5m21K89Lr6k7K21j17j37J83
1364aj29R2J0L2J8j16K01r1j90K88l0r6j14K28N8j76j94L17j34Q5r4k30J25K3
1388a18lj94J48N6K29M5k06j57J59J76o9j71K17j31k14L82j14k17L00J35k38j
1410A4j12O8o6K17J91m83k94O00o2r5j18Q3J38k74L41k37ln4J82j97K20k82J77
1433d6J46j11p4K67k26j4Q9Q3J04k43K08j50J61m2j94J6q1O3n3L94m04J54n2J2
1457Gk6j64L90j20k2p5p6j77R9K22j68R7o8J13j06K10M6k79P5m3n3J94j8K6l14
$$ plain form
1482 -230 30 -99 -68 -249 -215 -129 60 82 -133 103 116 -134 -44 33 207 102 -49 26 141 -225 -188 26 -261
1505 -261 -96 -260 199 -53 216 -35 -93 -100 -80 -300 124 -106 81 21 171 -100 79 -76 -74 -143 168 -97 32
1528 32 24 68 -77 -215 41 51 291 5 -128 36 4 -118 -76 -153 -79 56 -30 -209 -131 119 -30 180 34 -113
1552 -113 -49 242 38 36 106 341 -129 35 -67 142 -85 -110 62 -225 -96 46 34 -85 192 -100 23 278
1574 278 -196 -4 -103 -216 -46 -13 82 -66 37 229 78 67 -15 33 -32 33 36 58 220 219 425 45 -10 55 392
1599 392 -98 85 -83 63 -70 -106 -24 34 16 -202 -91 147 -26 -129 -136 51 53 124 33 -178 40 126 -33 -196
1623 -196 191 -147 -242 58 184 -349 113 132 -35 -259 72 -62 135 -181 15 -187 -164 -8 -106 309 -228
1644 -228 197 60 -48 54 134 -91 -43 68 71 -61 106 -190 -9 19 -235 -63 183 -151 90 69 -160 105
$$ packed form
1482b30K60j29L1j81L4Q6J89K2k15K36J3k50R0P7J74j05j51P5J15l66L7K14k87
1505b61J65j64M59k52K69k51n8pK0k20M24k30J87o0J50k71J79j55Ko9L11k65J29
1528C2qM4j45j38K56J0K40k86j33J64l2j22M2p7P4J35q6j79P8K50j49K10j46j47
1552a13O4K91k04kP0K35m70J64j02K09k27k5J72k87J29J42j2j19K77k92J23K55
1574B78m74J92r9j13J70L3R5j48J03J92j51j1q2M8o5O5LK2J62jK06l80n5O5L37
1599C92m90J83j68J46j33l6Q2N8j8k18J11K38j73j03pJ87KP1r1k11K18Q6j59j63
1623a96L87l38r5L00J26n33M62J9j67k24L31j34J97l16J96k02K3J56r8M15n37
1644b28M25j37j08J02Q0k25M8J11Lj32J67k96J81K8k54J72K46l34K41k1k29K65
$$ plain form
1666 105 167 128 114 -212 18 -125 -48 48 -327 69 134 -76 -76 93 45 266 -209 -93 88 95 68 111 130 -46 -199
1691 -199 39 28 -155 -214 -258 -49 -231 24 144 -90 0 2 195 42 90 -2 102 138 -85 -112 -316 -22 261
1714 261 -53 22 122 -88 -53 -257 -154 185 -35 -13 27 -97 251 47 -51 -167 -217 111 -8 -66 1 -143 8
1737 8 164 -155 -230 18 5 176 183 158 11 4 -190 -292 -23 174 32 235 71 112 -86 91 -6 -10 7 107 -104
1762 -104 -499 110 26 140 41 -64 49 94 -252 -243 -93 -260 73 134 -316 -224 257 -33 120 -239 -277 36 -81
1785 -81 -185 -54 194 -16 -10 64 -45 66 144 320 22 182 150 -28 -47 -201 369 156 200 246 -172 52 99
1808 99 -86 134 154 209 -70 249 -35 285 -19 58 -117 -214 -20 -56 11 271 11 -5 -33 -36 78 -404 128 19
1832 19 -235 -166 54 -48 -11 -176 275 89 22 -246 1 79 33 40 109 -264 -6 -14 -34 -364 117 -35 21 73 124
$$ packed form
1666A05O2l9j4l26K30j43P7R6l75L96O5k10%J69m8K21m75J16J81Pk7M3J9j76j53
1691a99K38j1j83n9m4K09j82K55J20k34R0KJ93j53M8r2J04L6k23k7k04K94K83
1714B61l14P5J00k10L5k04J03L39k20K2M0j24L48k04r8j16n0L28j19n8O7j44J51
1737HJ56l19p5K48j3J71Pk5j47pj94j02K69J97j42K03j64M1j98J77r7mJ7J00k11
1762a04l95O09q4J14r9j05J13M5l46RJ50j67L33O1m50R2M81k90J53l59l8L13j17
1785h1j04J31K48k10OP4j09J11P8J76k98J60l2j78j9j54N70k13M4M6m18K24M7
1808I9j85K20K0N5k79L19k84L20l04P7j75r7J94l6O7K60k60j6k8lJ14m82N32j09
1832A9k54O9K20j02L7j65M51j86o7k68K47P8m6PO9l73K58qk0l30M81j52N6N2N1
$$ plain form
1857 124 -102 -64 -177 -93 69 -143 342 275 48 -48 -147 70 11 -50 202 -316 159 6 72 197 61 84 -49
1880 -49 179 2 200 -34 86 124 119 -112 100 -51 113 7 -51 142 56 -113 28 221 -128 -79 101 56 105
1903 105 -5 38 -160 49 -140 110 70 -413 -169 -25 -72 86 -67 32 -194 -104 19 -61 -17 79 162 -59 187
1926 187 -84 -34 233 -127 -20 -62 -186 -45 -175 60 -110 47 34 242 189 -133 -199 147 -109 -100 131 14
1948 14 50 -361 -109 -75 97 129 -165 274 -31 194 214 109 64 140 -140 -77 -336 -53 110 175 92 4 -35 28
1972 28 345 -169 123 -124 -126 -144 86 -114 296 169 144 58 -47 -7 -108 -373 70 -18 -3 -110 5 -143 148
1995 148 -246 -38 141 -269 61 101 -148 -67 88 138 144 328 -155 66 -134 37 89 123 -63 -22 131 129 -218
2018 -218 200 -46 30 68 214 -247 -86 -258 -18 364 -197 -7 -33 127 -244 202 -49 102 216 44 -111
$$ packed form
1857A24k26L8j13Q4J62k12M85o7k27r6r9K17n9o1K52n18M75j53O6J25j36K3j33
1880d9K28j77J98k34J20L8nk31K12j51J64j06n8J93q6j69J41J93l49M9J80m5M9
1903A05j10M3j98K09j89K50m0m83K44J44m7J58j53R9k26R0J23q0M4R6Q3k21K46
1926A87k71N0K67l60J07m2j24J41j30K35j70J57j3K08n3l22o6L46k56RK31j17
1948A4L6m11K52L4J72L2k94M39l05K25K0j05m5P6k80O3k59K83J63O5q3q8l9O3
1972B8L17n14K92k47kj8K30k00M10j27k5q6j05M0j01k65M43q8J5j07J15j48K91
1995A48l94K08J79m10L30M0k49Q1J55N0OJ84m83K21k00J71N2L4j86M1J53kl47
2018b18M18k46P6L8J46m61J61j72K40L82n61J90k6J60l71M46k51J51J14j72j55
$$ plain form
2039 -111 125 -285 -26 1 -417 72 -290 -215 -94 89 -100 -211 -27 -184 -39 -128 239 42 -221 -163 156
2060 156 107 49 192 -292 -343 -66 35 -18 37 -214 -12 314 -303 -63 -2 229 7 145 -2 -237 62 114
2082 114 -51 -95 219 -289 -219 -123 -39 -223 197 -51 128 63 240 17 -43 -10 -185 333 -63 -267 31 -95
2104 -95 -43 9 -110 -331 164 -74 -63 -186 -72 76 53 63 177 -94 -13 -103 -16 44 141 31 -127 427 347 166
2128 166 10 80 -29 12 46 222 25 83 -153 -58 -81 -150 71 -299 -308 -232 -145 155 -80 160 -4 -58 26 -107
2152 -107 79 -91 -159 -179 188 -5 186 -208 -7 58 -37 204 -15 170 -156 95 136 40 -196 142 115 -18
2174 -18 22 -168 -220 -24 174 19 -75 215 -45 -8 -89 -47 -92 119 163 9 -290 -95 -223 -221 89 -13 54 -63
2198 -63 -140 -81 216 87 15 -40 -1 -165 -130 -10 -24 -149 82 -96 -118 83 -212 75 -247 -118 -39 -30 103 28
$$ packed form
2039a11K36m10K59K7m18M89l62P5J21J83j89j11J84j57J45q9L67j97k63N8L19
2060A56m9n8J43m84n1K77J01n3N5k51K02L26o17K40O1K31k22J38j47k35K99N2
2082A14j65m4L14n08P0R6Q4j84M20k48J79o5J77k23o0L3j75N18l96k04K98j26
2104i5N2N2j19k21M95k38J1j23J14J48k3J0J14k71Q1r0Q7O0R7j10j58N54q0j81
2128A66j56P0j09M1L4J76j97N8k36R5k3o9K21l70rP6Q7L00k35K40j64n4Q4j33
2152a07J86j70o8k0L67j93J91l94K01O5r5K41k19J85l26K51M1r6k36L38k7j33
2174a8M0j90n2J96J98j55r4K90k60L7q1M2m5K11M4j54k99J95j28KL10j02O7j17
2198f3p7N9K97j29p2n5L9j64L5J20j4j25K31j78k2K01k95K87l22J29P9RJ33p5
$$ plain form
2222 28 -36 43 -177 -189 -38 80 163 -62 -53 -107 -158 -13 -91 -138 -195 -22 55 -242 17 -89 -137 -35 332 95 79
2247 79 -29 318 -12 148 -55 -8 -22 -71 -37 0 109 283 117 239 164 38 34 65 20 148 -290 246 -40 6
2271 6 -56 -53 105 -15 -114 121 377 41 -78 -159 42 -132 -42 156 -84 -22 -25 -132 -20 263 126 -14 218 57
2295 57 -290 -7 -83 8 155 -77 18 82 -348 -97 -50 143 -122 -134 235 -259 -97 -52 -65 -188 -28 -113 74
2318 74 188 -178 194 -18 -249 -89 77 71 265 -58 -106 74 -148 94 55 89 78 55 139 -182 -86 -132 -51 -166
2342 -166 -316 6 -24 -114 0 143 77 -255 67 129 -54 72 122 -68 200 0 64 -18 -164 -168 -133 246 67
2365 67 -21 -75 -238 -146 83 -155 170 -277 -153 232 -198 91 -92 142 9 150 80 -289 -85 279 -14 -185
2387 -185 86 140 -293 112 -123 -37 -96 60 -59 41 207 95 -115 91 1 157 79 -145 33 -86 62 29
$$ packed form
2222B8o4P9k20j2J51J18Q3k25Rn4n1J45p8m7n7J73P7k97K59j06m8J02L67k37j6
2247G9j08L47l30J60k03M7j4m9L4L7J09J74j66J22p5j26mL1m5J28m38N36k86M6
2271Fo2LJ58j20r9K35K56l36j19q1K01j74R0J98k40O2lj07J12K83j37j40K32j61
2295E7l47K83p6R1J47k32R5O4m30K51M7J93k65j2L69m94J62M5j3j23J60q5J87
2318G4J14l66L72k12k31J60J66oJ94l23m8J80k22K42l9L4j1k3Q4l21R6m6Q1j15
2342a66j50L22l0r0J14J43o6l32L22O2j83J26N0j90K68k00O4q2j46mL5L79j79
2365F7q8n4j63R2K29k38L25m47J24L85m30K89j83K34j33J41p0l69K04L64k93j71
2387a85K71N4m33M05k35Q6n9J56j19J00J66j12k10K06r0J56p8k24J78j19J48l3
$$ plain form
2409 29 -30 104 -75 6 -94 14 -66 -48 104 -177 245 122 -84 131 128 -191 -49 124 -224 -85 142 -330
2431 -330 124 115 -24 -185 -70 150 26 124 43 -77 -197 -102 -175 -26 79 7 -89 -1 -127 93 168 -65 -38 -115
2455 -115 5 -105 281 -150 220 118 -42 17 131 -97 -291 98 -191 378 47 8 97 67 -125 57 -62
2476 -62 -70 255 246 45 48 62 185 -274 44 220 -108 217 138 -25 5 -47 -56 77 138 92 50 -33 -326 24 51 -57
2502 -57 -96 -75 208 282 32 -231 124 -139 71 139 245 231 -39 -62 243 -92 34 170 251 -26 -128 97 5
2525 5 -81 131 -298 -101 228 3 -218 102 212 93 -142 -4 -17 131 -82 -129 125 247 -198 119 4 -37
2547 -37 212 197 -119 105 -113 42 161 85 146 -62 -17 272 -246 -163 21 -199 -72 -248 -25 -42 298 329 -1
2570 -1 -13 -138 -14 139 129 -119 15 -131 -22 -109 140 -82 34 -42 -5 -106 -136 51 -36 106 -54 -29 -97 -40
$$ packed form
2409B9n9J34j79Q1j00J08q0J8J52k81M22j23k06K15ll19J42J73l48J39K27m72
2431c30M54rj39j61J15K20j24R8q1j20j20R5p3J49J05p2r6Q8j26K20P5k33K7p7
2455a15J20j10L86m31L70j02j60N9J14k28j94L89k89N69l31l9Q9l0j92J82j19
2476f2qL25rk01LJ4J23m59L18J76l28L25p9j63L0n2rJ33O1m6m2q3k93L50K7j08
2502e7l9K1K83P4k50k63L55k63K10O8J06j4k70k3L05l35J26J36Q1k77j02K25r2
2525Eq6K12m29J97L29k25k21L20J10j19k35J38j3J48k13m7K54J22m45L17j15m1
2547c7K49j5l16K24k18J55J19p6O1k08M5K89n18Q3J84k20J27j76K23j7L40L1l30
2570aj2j25J24J53j0k48J34j46J09q7K49k22J16p6L7j01l0J87q7J42j60K5o8N7
$$ plain form
2594 -40 -109 178 -122 -33 32 -73 39 -146 8 -43 324 -204 -24 -76 -198 66 -61 -68 -197 -184 -116 119 -77
2617 -77 58 83 -395 179 5 -158 149 154 93 50 86 120 346 84 103 -74 103 24 -28 55 -167 6 -156 -97
2641 -97 264 -212 233 -106 32 -194 -135 -63 -67 32 203 45 -47 -133 94 -247 21 117 -72 -157 94 125 2 95
2665 95 -81 -213 153 64 -23 -104 176 147 -183 -187 0 -26 148 -111 -72 8 -37 284 -200 70 -58 -196 135 -66
2689 -66 23 -69 110 -25 -280 -27 70 -144 -63 -183 -126 0 -125 -45 -49 123 -98 -12 117 -46 178 344 -93
2712 -93 -82 89 65 88 234 -26 166 136 -81 63 -51 -31 12 -54 74 -12 -192 74 102 190 -59 -178 -165 -98
2736 -98 127 191 145 197 -147 -17 119 102 100 161 306 36 -52 22 15 81 111 148 -204 -267 -64 -192 46 69 209 99
2762 99 246 189 281 -82 81 -85 104 202 -171 52 -135 -61 89 139 -190 -23 -76 164 228 -16 65 -41 163
$$ packed form
2594d0o9K87l00Q9O5j05J12j85J54n1L67n28J80n2j22K64j27pj29J3O8K35j96
2617g7J35K5m78N74j74j63L07No1m3L6L4K26k62J9j77J77p9n2Q3k22J73j62N9
2641i7L61m76M45l39J38k26N9P2mR9J71j58r2q6K27l41K68R6j89q5K51L1j23R3
2665I5j76j32L66q9q7q1K80k9l30mJ87k6J74k59L9Q0m5L21m84K70j28j38L31k01
2689f6Q9r2J79j35k55K53R7k14Q1j20N7J26j25Q0mJ72k21Q6J29j63K24J66m37
2712i3J1J71k4K3J46k60J92l0k17J44j14K0M3o6J28q6j80K66K8Q8k49j19J3O7
2736i8K25O4m6N2l44J30J36j7kO1J45k70q8P4pO6L0L7l52o3K03j28K38K3J40j10
2762I9J47n7R2l63J63j66J89R8l73K23j87P4J50N0l29J67n3K40O4k44Q1j06K04
$$ plain form
2785 163 252 16 78 8 156 30 112 -126 138 117 43 -60 -174 14 45 -129 8 -15 47 61 -39 -160 -141 -128
2809 -128 -225 -85 174 36 184 -159 -32 93 358 -108 141 276 132 187 164 -32 -206 -191 -288 300 230 109
2831 109 -188 90 65 107 126 149 46 67 -191 -30 64 -15 110 -170 -15 173 -44 227 364 -100 -207 15
2853 15 -25 85 171 209 10 -126 -163 76 35 -24 92 -63 -78 163 216 143 -336 166 118 27 -274 178 152 -59
2877 -59 61 -52 -157 17 259 142 -75 23 58 -18 -5 199 -96 18 52 3 -38 -183 27 3 19 30 85 244
2901 244 10 -208 -84 64 169 -125 103 53 49 -47 28 -39 -126 -193 96 394 11 154 -187 228 97 -76 241
2924 241 -13 48 181 -88 157 25 142 98 93 -182 -48 38 313 244 90 -86 255 34 39 278 54 -74 70
2947 70 44 2 54 -94 146 34 -86 -20 337 -69 129 46 -380 120 229 120 33 -185 -99 -110 156 -289 -47
$$ packed form
2785A63Q9k36O2p0J48j26Q2k38K64k1p4j03j14J88L1j74J37k3O2J4j00j21J9J3
2809a28r7J40K59j38J48l43J27J25K65m66K49J35j44N5k3j96j74J5r7N88p0j21
2831A09k97K78k5M2J9K3j03K1k58J61R4p9J25k80J55J88k17K71J37m64j07K22
2853A5m0J10Q6L8j99j36l7K39m1n9J16j55j5K41N3p3m79N02m8r1l01M52k6k11
2877e9J20j13j05J74K42j17k17R8L5p6J3K04k95J14L4m9m1j45K10k4J6J1N5J59
2901B44k34k18J24J48J05k94K28n0mr6P5o7q7o7K89K98l83J43l41M15j31j73L17
2924B41k54O1J33k69K45j32J17m4nk75J34Q6K75o9j54j76L41k21NK39k24j28J44
2947G0k6m2N2j48K40j12j20O6L57m06J98q3m26N00J09j09q7k18Q6j1K66m45K42
$$ plain form
2970 -47 7 100 -89 -33 133 -117 44 -41 154 -107 -160 127 69 -126 112 51 10 28 109 233 67 111 -177 -149
2994 -149 -26 86 17 -75 -191 177 -119 114 -63 -223 203 14 -88 89 -31 200 290 44 -48 436 -269
3015 -269 220 94 216 -249 -7 -27 183 188 -5 139 30 88 91 -46 -328 -49 -48 6 189 -14 -166 -153 127
3038 127 -68 -129 60 230 121 -433 -108 -20 -89 138 -41 -198 148 10 -53 178 -149 -47 -94 184 -16 -13
3060 -13 -185 -53 310 125 61 232 -72 318 -13 39 99 -142 326 -126 14 -50 62 29 34 -35 73 167 -1
3083 -1 59 -45 256 193 -124 23 251 49 -148 -26 104 -75 243 42 39 -14 -49 -97 -125 -22 -130 -8 129
3106 129 -127 -74 190 84 44 102 -104 118 -75 210 -178 217 -24 -119 -1 168 -196 -77 237 -149 1
3127 1 -69 -18 62 -118 -96 -1 57 30 -10 84 -35 -146 97 -5 -71 -220 -27 323 -229 95 18 -120 79 7 8
$$ packed form
2970d7N4R3j89N6J66k50J61q5J95k61n3K87n8j95K38o1m1J8Q1J24j66M4k88K8
2994a49J23J12o9r2j16L68k96K33j77j60M26j89j02J77j20K31R0k46r2M84p05
3015b69M89j26J22m65K42k0K10Nj93J44j09N8Lj37k82K79JN4J83k03j52J3K80
3038A27j95o1J89J70j09n54L25Q8o9K27j79j57L46j38o3K31l27J02m7K78k00L
3060a3j72J32L63j85o4J71l04L90l31N2O0k41M68m52J40o4J12l3No9J08R4j68
3083aO0j04L01o3l17J47K28k02j97J22J30j79L18k01ln3l5m8k8J03j08J22J37
3106A29k56N3K64j06m0N8k06K22j93K85l88L95k41r5J18J69l64J19L14l86J50
3127Ap0N1Q0j80K2R5N8k7m0R4j19j11K43j02o6j49J93L50n52L24p7j38J99p2J
$$ plain form
3152 8 -73 -144 62 -112 -35 -246 -78 192 -241 -255 -81 -25 -197 -164 -257 74 -195 -250 -200 -177 -93 338 207 113 0
3177 0 -40 27 125 270 18 146 -111 214 -19 -88 -35 103 280 -203 119 245 -12 -62 -293 -19 111 139 123
3200 123 204 103 136 146 -208 -56 159 192 -158 158 147 69 82 -52 -73 -132 -17 59 34 162 -272 -90 143 -134
3224 -134 -123 78 123 -88 -42 -23 -147 -85 -102 75 -19 -229 240 -125 -127 -37 -142 111 32 13 -181 10 -253 273
3248 273 -152 -104 92 163 165 243 39 -79 -67 120 186 210 97 193 -106 -186 -83 179 312 -104 87 -223 44
3271 44 35 -165 -55 30 40 175 38 -202 105 220 -72 155 231 26 44 -19 39 69 276 16 -103 -68 -68 220
3295 220 107 116 187 -94 207 186 -147 -83 -109 25 96 115 317 1 -39 -80 -5 40 105 2 -160 -17 -57 -215 -208
3320 -208 -40 19 14 115 -102 43 230 321 337 -136 -124 -153 -171 -145 235 -29 25 39 -98 20 22 -162 -131 90 26
$$ packed form
3152Hq1p1K06j74P7k11J68K70m33j4J74N6j72L3r3L31k69n5N0K3Q4M31j31r4j13
3177@m0O7R8J45k52J28k57L25k33o9N3J38J77m83L22J26k57n0k31K74J30K8j6
3200A23Q1j01L3J0l54J52K15L3l50L16j1p8J3j34k1n9J15P6k5J28m34J82K33k77
3224a34J1K01M5k11M6J9j24O2j7J77r4k10M69l65kR0j05K53p9j9j94J91k63N26
3248B73m25M8J96P1KP8k04j18J2J87O6K4j13R6k99q0J03K62J33m16J91l10K67
3271D4rk00J10Q5J0J35j37k40L07J15k92K27P6k05J8o3N8L0K07k60j19L5%K88
3295B20j13RP1k81L01k1l33O4k6J34P1J9K02l16m0m1P5M5O5j03j62J43m0j58P
3320b08J68N9nJ01k17J45J87R1J6m73J2k9j8K6L80k64N4J4j37J18Kj84L1K21o4
$$ plain form
3345 26 32 13 148 32 -14 69 29 66 200 109 43 -46 -3 200 -7 14 44 188 5 -97 199 -141 -85 342 -181
3370 -181 122 -152 17 38 -57 -16 41 -22 -4 -21 230 144 201 -113 -137 71 -81 -7 91 -267 -46 168 -32 203
3394 203 -126 -292 -297 4 -143 -162 -49 -3 47 -154 306 131 -134 83 -70 -228 150 139 14 38 -149 261
3416 261 -249 -50 -154 -47 21 72 87 -152 17 25 258 65 -34 -17 -277 -122 -25 -377 47 311 36 -33 16
3439 16 -156 234 123 103 82 -207 286 43 23 410 18 81 58 148 141 -97 277 6 5 -23 133 92 211 73
3463 73 112 -168 234 -132 283 -84 -79 -94 137 -193 50 94 15 -41 -204 -165 6 254 -160 102 -54 -9 111
3486 111 29 -31 100 -116 233 5 208 26 270 -106 -163 -184 170 -235 -213 61 -15 138 -32 -153 75 -31
3508 -31 -130 300 -96 91 -31 52 -47 -178 85 -53 127 -311 74 -85 -186 62 -130 -177 -132 7 -71 134
$$ packed form
3345B6Oj9J35j16m6Q3m0L7J34r1o6q9M3K03k07K1L0J44j83j02K96l40N6M27n23
3370a81L03k74J69K1r5M1N7o3J8j7K51q6N7l14k4K08j52P4R8l58K21K14k00K35
3394B03l29j66nL01j47j9J13M6N0k01M60j75k65K17j53j58L78j1j25K4j87M10
3416B61n10J99j04J07O8N1J5k39J69QK33j93r9J7k60J55R7l52M24K64k75o9M9
3439A6j72L90j11k0k1k89M93k43k0L87l92O3k3R0pk38L74k71jk8J56m1J19j38
3463G3L9k80M02l66M15l67Nj5K31l30K43M4p9n6j63L9J71K48m14K62j56M5J20
3486A11q2o0J31k16L49k28K03j82K44l76n7k1L54m05K2K74p6J53j70j21K28j06
3508c1r9M30l96J87j22Q3r9j31K63j38J80m38L85j59j01K48j92m7M5J39p8K05
$$ plain form
3530 134 -19 73 7 -11 -10 -103 57 -82 -241 -90 -90 -9 81 103 -53 -61 -40 -122 -260 -56 -132 -113 34 327 181 184
3556 184 212 -160 197 -117 -44 -74 215 -236 -54 -123 -28 -295 -11 -38 -349 -52 52 36 -159 -218 -164 64 -39
3579 -39 -54 -53 -48 148 96 206 120 -117 21 244 88 13 -323 136 -34 -9 -71 -202 -40 -98 -79 159 -51 -258
3603 -258 12 80 281 -155 287 -106 -375 135 138 -4 104 24 175 -105 38 56 -312 -39 30 -66 66 148 -170
3626 -170 155 -132 33 115 -60 -8 181 -174 54 133 160 112 44 -295 -139 -73 20 45 16 39 281 219 59 44
3650 44 -55 37 -89 -38 68 34 -156 -46 36 59 11 -253 -93 70 -10 -32 -82 110 -21 -126 -22 134 -150 -34
3674 -34 -80 -180 -104 -111 -51 -59 -113 260 268 -315 77 152 131 114 99 9 190 -260 167 186 350 -69 40 -341 -70 -61
3700 -61 -17 90 279 -74 -47 -160 -110 -90 60 -19 -26 169 49 -44 336 57 57 -80 -5 13 39 -40 -170 59 -69
$$ packed form
3530A34j53R2o6j8Jr3J60j39j59J51%Q1R0K2j56qK1q2j38K04p6J9J47K93j46L
3556A84K8l72L57l14P3l0K89m51J82o9R5k67K84k7l11K97J04j6j95n9N4K28j03
3579c9j5JNJ96n2J10q6k37J38K23j56p5l36M59j70K5o2j31J62n8J9K38k10k07
3603b58K70O8K01m36M42l93k69N10Lj42J08q0J51k80J43J8l68K73O9r6J32Q2l18
3626a70L25k87J65Q2j75N2J89l55K28P9K7m8o8l39J56O6R3K5k9K3K42o2j60j5
3650D4r9R2j26N1J06l4j90J10Q2K3m8k64J60J63q0k2n0J92j31j05J04J56k84J16
3674c4m6j00P6pO0qn4L73Qn83L92P5k1j7j5r0J81m50M27J9J64m19J09l81K71R
3700f1M4J07J89l53K7j13N0K0J50p9pJ95j20r3L80k79%j37P5J8K6p9j30K29j28
$$ plain form
3725 -69 -47 172 -151 -32 91 87 236 -46 46 -53 -94 -27 -1 -265 81 -47 79 -39 -225 192 -264 -10 66
3748 66 -25 111 -158 296 35 77 -233 14 168 245 -169 -5 -105 -95 46 29 51 55 -292 36 40 -92 206 -77
3772 -77 115 392 -67 -186 245 -148 92 -134 -45 10 71 -68 124 15 48 -49 207 -229 -134 152 -213 -400
3794 -400 -221 334 -175 84 -164 190 210 -66 37 34 67 136 255 43 -249 72 118 -283 20 -125 -80 3 64
3817 64 -125 -162 -53 160 -55 52 72 -265 -110 -154 -128 97 -134 -35 157 -32 -182 55 -202 -274 -12 -60 21
3840 21 293 157 185 -108 -113 -17 248 32 -208 -17 -59 -105 -35 -11 -321 -157 -137 67 38 251 120 -115 18 141
3864 141 100 106 59 64 -311 157 33 -63 -70 20 -139 -119 -82 20 4 -13 -124 -93 103 17 152 -301 -23 -40 105 -420
3890 -420 57 -219 89 138 7 361 -31 -293 176 -160 -44 123 -13 -124 -179 186 198 109 32 -31 200 82
$$ packed form
3725f9K2K19l23J19J23mJ49k82R2r9m1O7K6k64L46j28J26j18j86M17m56K54P6
3748F6r1J36k69M54k61M2l10K47J54P7m14J64j00J0J41j7K2Ml47L28Mj32K98k83
3772g7J92K77m59j19M31l93K40k26Q9N5O1j39J92j09L3r7K56m36R5K86l65j87
3794d00J79N55n09K59k48L54K0k76J03lL3O9J19k12k92L21M6m01L03j45M5Q3O1
3817F4j89l7J09K13k15J07K0l37J55m4K6K25k31R9J92j89j50K37k57p2K62m8Q1
3840B1K72j36K8k93nR6K65k16k40J91m2m6P0K4l10J64K0K04k9K13j31k35J33J23
3864A41m1Om7Nl75M68j24r6pR0j59K0L7J02j6j7j11L1J96q6J35m53K78j7J45n25
3890d20M77k76L08M9j31L54l92k62M69l36J16J67j36j11n5L65J2q9p7o3K31j18
$$ plain form
3912 82 91 88 102 -62 -54 72 187 -58 88 -133 58 62 -214 10 -11 -12 82 -15 -117 -32 -23 -26 20 -347 -47 -72 -340
3939 -340 -167 -113 -232 140 26 175 -41 -77 -212 -235 -23 -261 -21 132 -74 50 -122 -343 66 -66 93
3960 93 9 0 -24 -55 70 107 -8 127 0 138 46 320 58 61 286 47 -32 85 92 -20 54 -11 -265 -214 1
3985 1 122 -223 100 -95 -135 -135 -109 -98 205 46 -204 176 -34 68 -66 -101 59 79 -43 59 -1 -321 -201
4008 -201 -271 96 131 227 171 -222 -75 -252 -83 -42 -166 208 110 -7 -150 -79 -242 64 9 9 -524 36 57 223
4032 223 66 -207 -97 139 -176 73 40 177 58 -206 -57 32 82 -97 90 -212 -74 296 -68 92 491
4053 491 65 -236 141 -244 31 7 110 44 -296 142 -285 -54 120 -187 147 57 71 35 -245 189 -1 -340
4075 -340 51 -259 26 65 -87 4 -63 53 84 -16 -42 205 112 221 74 -156 -117 -52 38 -225 -2 -299 5
$$ packed form
3912H2RlJ4j64QJ26J15k45J46k21J91Mk76K24k1jR4r7j02Q5RlM6l67L00k5k68
3939c40J73N4j19L72j14J49k16l6j35k3K12k38K40J53k06J24j72k21M09j32J59
3960I3q4rk4l1J25L7j15J35j27J38r2K74k62LK25k39p9J17Pj12P4o5k54N1K15
3985AJ21l45L23j95m0%K6J1L03j59k50L80k10J02j34l5J60K0j22J02o0l20J20
4008b01p0L67L5R6n6l93J47j77J69M1j24L74r8j17j43P1j63L06n5%n33N60K1J66
4032B23j57k73J10K36l15K49l3J37j19k64J49Q9N0j79J87l02J38L70l64J60L99
4053D91m26l01L77l85K75k4J03o6l40M38m27K31J74l07L34r0J4l6k80M34j90l39
4075c40L91l10K85L9j52R1o7J16L1j00k6K47r3J09j47k30L9O5R0k63K23k97L04
$$ plain form
4098 5 45 -20 14 220 111 -189 -313 -6 -216 -89 -29 -67 194 -244 -47 30 171 332 -88 -207 -103 -17 -80
4121 -80 124 73 -30 72 -38 8 33 185 0 156 -97 55 -146 47 -209 -29 -221 -149 97 14 -42 -235
4143 -235 -23 33 -16 141 7 172 -174 -89 -43 -154 -88 94 -3 163 -251 -70 117 196 54 -47 -10 -71 5
4166 5 -124 29 3 189 -50 -53 -163 -79 -236 -48 268 -253 172 32 -148 115 76 -141 44 -149 -6 -39 221
4189 221 28 -18 -240 58 -23 112 -131 -70 -128 49 190 -120 22 -33 -81 11 -78 86 -222 -51 -61 -89 -84 -218
4213 -218 -35 51 -189 -1 36 63 -43 -178 -247 6 -28 252 -4 -269 -232 155 -126 -63 -35 119 -96 -252 125
4236 125 156 -25 82 79 154 -19 30 71 -137 128 167 42 56 -116 109 -131 -181 40 -179 133 325 201 54
4259 54 -171 -45 -124 -47 5 -200 -97 44 -33 -1 -125 -30 -111 9 50 -146 178 210 -349 -3 44 63 260 10
$$ packed form
4098EM0o5L4K06j09l00j24L07k10J27O0l8K61m38J97P7J41J61m20j19J04Q6o3
4121h0K04n1j03J02j10M6K5J52j85J56k53J52k01J93k56J80j92P2K46q3n6j93
4143b35K12N6m9J57j34J65l46Q5M6j11O6J82r7J66m14J81J87P9j42j01L7o1P6
4166Ej29J53k6J86k39lj10Q4j57J88L16n21M25j40j80K63l9k17J85j93J43l3K60
4189B21j93m6k22K98q1J35k43O1n8J77J41l10J42n5m8R2q9J64l08J71j0k8Nj34
4213b18J83Q6k40J88L7K7j06j35o9K53l4K80k56k65L7L87k81O3K8J54k15j56L77
4236A25L1j81J07lP5j73M9M1k08K65L9j25J4j72K25k40n0K21k19L12J92j24j47
4259E4k25J26p9P7N2k05J03J41p7L2j24R5q1J20M1j96L24L2n59L46M7J9J97k50
$$ plain form
4283 10 95 144 -160 -41 118 381 -62 -336 81 237 295 164 21 -149 -146 -10 40 -65 158 -80 54 12 207
4306 207 115 105 121 85 -100 304 59 -87 -99 -198 10 -120 327 152 -7 -61 -72 124 26 -60 -48 225 132 -168
4330 -168 191 221 -192 -17 0 272 -62 80 -162 -140 353 -100 235 30 129 201 92 114 -20 307 31 94
4352 94 43 -236 -135 190 -121 1 -90 -59 29 55 30 -18 78 42 40 -52 207 260 118 44 66 5 -58 0 110 -51
4378 -51 4 186 4 121 56 66 -347 -118 -372 -96 178 125 165 -237 12 118 62 -91 -133 -404 -91 -260 128
4401 128 -172 202 -171 3 152 -62 22 -247 236 164 -101 -21 -318 -108 38 168 -128 -184 -86 23 272 30
4423 30 45 -10 2 -18 -135 127 -99 -134 -129 -131 -2 45 -60 -109 -46 -59 96 -84 -26 -27 68 66 -212 -32 -71 95 149
4450 149 -44 -162 13 -128 16 -276 66 -399 -83 -38 -131 -96 137 -91 -106 236 33 49 57 9 -112 300 175
$$ packed form
4283A0Q5M9l04J19J59K63m43k74M17J56N8j31j43j70LJ36N0j05K23k38J34m2J95
4306B07r2j0J6l6j85M04k45j46j2r9K08j30M47j75j59n4j1J96r8q6J2K73r3l00
4330a68L59L0m13J75J7K72l34J42k42K2M93m53L35k05R9P2j09K2j34L27k76O3
4352I4n1k79J01L25l11J22r1L1Q8K6k5m8R6l6kr2K59N3j42p4K2o1o3N8J10j61
4378e1N5J82j82J17o5J0m13K29k54K76K74n3M0m02K49J06n6j53m2k71L13j69L88
4401A28l00L74l73J74J49k14Q4k69M83p2k65Q0k97K10J46J30k96n6R8J09K49k42
4423C0J5n5J2k0j17K62k26l5NkJ29M7j05m9O3j3J55j80N8jR5kk78J80l9J66N4
4450A49j93j18J75j41J44k92L42m65L16M5r3L5K33k28j5L42k03J6Qm8j21M12j25
$$ plain form
4473 175 -18 -29 68 -13 -45 182 -232 -133 56 -121 157 -15 -123 2 -188 -79 -17 143 116 -113 -185 98 99
4496 99 175 45 -91 -109 147 -20 -131 -167 -25 158 264 -362 -44 71 -264 251 -178 85 79 -46 -108 210
4518 210 -111 -174 311 143 7 15 -225 -46 -68 -66 -159 -75 -17 -4 48 -73 110 -256 27 35 -66 -41 127 96 98 -72
4544 -72 -147 102 -139 -62 27 236 173 179 183 128 126 33 -70 201 -227 196 13 -40 -3 110 -44 23 134 -90 -235
4569 -235 -80 -118 23 2 -215 -101 -327 102 137 37 -7 -119 75 -37 -177 -212 24 31 -105 -192 -54 57 -117
4592 -117 -166 -128 -119 73 -22 26 212 -85 -3 45 30 -89 -86 -52 -87 -36 -89 -7 93 -168 -14 171 -59 169 97 102
4618 102 186 -175 142 42 -119 105 145 95 -228 -12 -87 50 -118 58 -157 110 84 110 164 -73 -29 137 -106
4641 -106 -7 20 -129 -54 36 -196 62 99 -246 -51 -92 96 366 -39 -183 79 -56 -162 77 154 -87 -37 -17
$$ packed form
4473A75j93j1R7q1l2K27m14R9J89j77K78j72j08J25j90J09O2J60k7k29p2K83J
4496I9P6j30j36j8K56j67j11l6J42J83J06o26L18J15l35N15m29K63oj25o2L18
4518B10l21o3M85j68j36Qk40J79k2Kr3Q4N8J3N2j21J83l66K83Qj01K5J68l1Kj70
4544g2p5K49k41P7Q9K09o3OMn5kr3j03K71m28M23j83n3L7J13j54O7J11k24j45
4569b35J55l8J41k1k17J14k26M29L5j00m4j12J94j12j40l5K36Pj36q7J38J11j74
4592a17m9L8RJ92r5M8J86k97Q2M8j5j19LL4l5N1n3Q2J00k61J54J85k30K28p2N
4618A02Q4l61L17j00j61K24M0n0l23K16p5J37j68J76k15K67k6K6N4k37M4J66k43
4641a06R9K7j49P5R0k32K58L7l45J95m1J88K70m05j44K62j35j06K39P7k41N0K0
$$ plain form
4664 -17 147 218 -185 -77 -22 68 242 -107 -71 80 -286 -69 -186 88 -163 177 516 180 -49 18 164 -8
4686 -8 -110 -16 -258 58 121 -260 116 -46 -37 -228 29 -182 -253 -58 4 -189 -60 125 -33 -91 -75 -12 245 312
4710 312 -140 114 95 -66 -137 0 207 125 -47 67 -206 -305 56 262 81 -175 189 220 -216 -67 7 -297
4732 -297 -157 -68 -8 -37 135 -66 -12 -25 -108 60 2 130 -14 40 86 -141 200 -9 -109 -75 -84 152 -67 250
4756 250 14 -190 -1 208 48 -73 109 118 -115 64 -103 12 132 -91 87 175 -278 152 347 26 33 -28
4778 -28 24 -139 101 -226 -54 182 10 78 -73 -51 28 55 125 306 -87 -8 -40 -193 332 -2 14 92 -46 213
4802 213 141 78 -48 89 7 64 -191 55 96 -237 273 177 35 -33 -1 44 -11 -231 -205 104 119 -39 184 -69
4826 -69 -28 165 17 -27 -40 -49 47 -146 -120 -80 2 -219 5 -13 242 -60 157 -108 35 -32 81 38 -209 -78
$$ packed form
4664a7J64P1m03J08N5R0J74l49L6J51l66K17j17K74k51L40L39l36k29O7J46j72
4686hj02R4k42L16O3l81L76j62Rj91K57k11p1J95O2j93J29J85j58n8J6O3K57O7
4710C12m52K54j9j61p1J37K07q2j72J14k73r9L61K06j81k56L64L1m36J49P4l04
4732b97J40Q9O0k9J72k01N4j3q3J68n8J28j44N4M6k27L41k09j00L4rK36k19L17
4756B50k36k04J89K09j60j21J82Rk33J79j67J15J20k23J78Q8m53M30J95l21Po1
4778b8N2j63K40l27J72K36j72O8j51K2P9K7P0J81l93P9l2j53N25l34J6P8j38K59
4802B13p2o3j26J37q2N7k55K46M1l33N10r6j42o8L2M5n5k20K6L09J5j58K23k53
4826f9M1J93j48m4j3rR6j93K6M0Q2k21K24j8K55l02K17k65J43o7J13m3k47J31
$$ plain form
4850 -78 39 -310 -38 177 17 -53 -283 -10 -73 -49 13 -129 -122 -52 -19 163 73 29 -140 -155 119 -70 140 59
4874 59 -79 -83 6 156 323 -143 -10 173 -63 23 76 146 68 -37 164 459 -200 -136 11 -359 -51 -164 201
4897 201 -111 -47 157 144 -100 302 -12 -165 141 -168 92 60 101 229 75 58 3 182 7 -216 -383 -250
4919 -250 -55 109 104 -128 414 91 -63 -180 107 -74 68 236 -240 -157 -41 50 94 -156 -53 124 70 -38
4941 -38 -323 -185 63 -68 154 218 46 -363 -293 -71 10 62 173 172 -55 -87 134 6 -41 347 194 0 -84
4964 -84 -125 -60 -70 -42 33 137 0 -223 163 27 -56 24 259 198 -93 214 0 -176 -212 -141 -249 72 -165 59
4988 59 261 -26 -171 -137 54 -410 -87 -69 -46 -68 279 -259 -200 -25 112 -53 -218 19 32 76 235 -71 47
5011 47 21 292 319 133 87 -6 66 -26 113 382 109 115 164 -9 -45 -93 152 -111 325 34 -216 72 59 -63
$$ packed form
4850g8J17l49K72K15j60p0k30K73o3K4O2j42PP0L3J82r0m4j69j5K74j89K10q1
4874E9j38mQ9J50J67m66J33J83k36Q6N3P0p8j05K01K95o59O4J47l70L08j13L65
4897B01l12O4K04j3k44M02l14j53L06l09K60l2M1J28j54j7n5J79j75k23j67J33
4919b50J95J64nk32N42l23j54j17K87j81J42J68m76Q3J16R1M4k50J03J77n4j08
4941c8k85J38K48j31K22O4j72m09P0K22Q1N2J11jk27l2K21j28m7L88j53j94q4
4964h4m1O5j0K8P5J04j37k23L86j36q3Q0K35o1k91L07k14j76l6P1j08L21k37K24
4988E9K02k87j45L4J91m64L23J8K3k2L47n38N9J75J37j65j65K37J3M4J59l06J18
5011D7k6K71K7j86m6r3P2r2J39K69k73OM9j73l6m8K45k63M36k91k50K88j3j22
$$ plain form
5035 -63 3 -363 202 21 9 113 111 -7 12 -62 -17 -64 -39 45 110 -139 202 216 -195 -203 30 -110 210 228 -65
5060 -65 -80 -62 -30 -76 124 64 75 -204 -132 -106 156 83 -64 30 -61 100 -1 -111 -32 -46 51 -7 19 -289 43 174
5086 174 -49 -10 -152 0 -64 -89 208 -131 141 15 101 -29 108 -224 30 33 87 -16 -26 215 99 -147 -14
5109 -14 28 262 433 29 33 -51 136 76 2 -270 256 -120 -5 62 -71 115 -98 -5 -64 -43 2 -1 106 142 20
5134 20 53 -95 71 -105 -90 -226 -139 -144 -116 -141 32 89 -43 62 24 33 -274 186 -184 -203 54 -62 -247 56
5158 56 -22 -246 -34 158 66 60 -310 -77 5 -5 -40 -2 -97 -156 -338 -69 -110 24 -59 -58 44 295 195 -193 -196 -126
5184 -126 303 178 76 183 150 -33 -172 -104 300 152 -19 177 -166 170 -139 -118 169 -150 108 147 41
5205 41 10 154 78 -138 -71 -197 214 -108 -189 -232 -25 -196 91 54 -174 -47 204 -26 -75 -1 45 61 37 -27
$$ packed form
5035f3O6l66N65j81j2J04kj18J9p4M5m7K5Q4O5k49L41J4m11qK33j40L20J8k93
5060f5j5J8L2m6K00o0J1k79P2K6K62p3j47R4r1J61j01j10P9j4R7n8K6l08L32J31
5086A74k23L9j42J52o4k5K97l39K72j26Q6j30J37l32K54LN4j03j0K41j16k46J33
5109a4M2K34J71m04Mq4J87o0p4k72N26l76J15O7j33J86k13R3n9K1M5lJ07L6j22
5134B0L3j48J66j76J5j36Q7nK8k5J73N7j32J05l8Rl07M60l70j9K57j16j85L03
5158E6p8k24K12J92r2ol70K33Q2j0l5L8r5n9j82K69m1J34q3JJ02K51j00l88lP0
5184a26M29j25j02J07l3j83j39O8M04j48j71J96l43L36l09K1K87l19K58L9j06
5205D1l1J44p6k16O7j26M11l22q1m3K07j71K87l7k28J27K51k30m9P4M6J6k4o4
$$ plain form
5229 -27 -118 -68 385 159 -42 201 -64 62 -1 -85 258 63 224 -35 -143 -277 -103 24 12 -223 256 126
5251 126 46 92 -91 186 51 105 17 -146 -131 14 131 -81 -103 68 55 -209 92 -51 128 -37 -4 -81 -98
5274 -98 96 -127 193 81 -351 77 -311 51 221 149 -71 -23 440 -14 24 -163 295 -102 99 203 127 -106
5296 -106 -69 87 -70 -6 52 -209 -112 -199 309 -130 66 111 -115 -89 45 -157 -104 89 -242 263 -31 -83 -157
5319 -157 -137 32 -52 31 -11 311 -40 32 122 -119 187 244 185 -111 157 -65 25 -178 57 -6 52 -2 96 -164
5343 -164 -131 -279 -93 7 -19 45 -57 40 88 -98 232 -66 292 -156 67 32 87 -164 43 -252 -29 108
5365 108 -21 -181 -85 -1 136 12 46 222 101 -30 153 105 -99 82 143 -113 141 47 21 128 42 191 -110
5388 -110 146 122 203 38 195 -82 130 55 -312 -153 159 85 -102 63 -30 -293 70 -23 95 -80 159 -61
$$ packed form
5229b7r1N0M53k26k01K43k65J26o3q4L43j95J61k59j08j34J74J27j2k35M79j30
5251A26q0M6j83K77j35N4q8j63J5J45J17k12k2J71j3k64L01j43J79j65L3p7j7
5274i8J94k23L20j12m32M28l88L62J70p2k20M8M63m54L8j87M58l97K01J04p6k33
5296a06L7J56j57O4N8k61R7q7N08m39J96M5k26K6J34k02N3J93l31N05k94n2p4
5319a57K0J69q4Q3m2L22l51P2R0k41L06N7n9k96K68k22R0k03K35o3N8n4R8k60
5343a64L3j48J86J00k6O4j02R7M8j86L30k98L58m48K23l5N5k51K07k95K23J37
5365A08j29j60R6Q4J37j24L4J76j21j31J83m8k04J81O1k56K54r4k6J07q6J49l01
5388a10K56k4Q1j65J57k77K12p5l67J59L12p4j87J65r3k63L63r3J18j75K39k20
$$ plain form
5410 -61 -113 20 30 -94 78 118 -54 134 -94 52 -104 18 258 -46 -88 -153 28 76 223 43 -76 -47 17
5433 17 346 41 -79 204 -49 -100 -159 217 218 -1 -114 -79 -45 -73 420 -123 14 242 -223 264 -60 203 -198
5456 -198 220 -255 102 244 -61 -67 -9 54 -7 280 45 342 134 24 13 -117 204 126 -129 -21 105 -135
5478 -135 60 58 77 -37 -52 149 142 -300 135 125 0 110 1 126 26 98 -23 -33 225 23 58 3 10 -79 -103
5503 -103 -51 -121 -105 72 61 -65 102 66 179 101 -69 -17 -273 63 184 -225 -40 58 17 0 -105 -26 -95 -2
5527 -2 279 73 51 -150 113 215 -178 141 -145 -101 108 160 214 125 10 -73 5 -282 -18 86 -150 -19 -104
5550 -104 150 21 -182 189 -189 -259 18 -58 320 -19 60 15 -33 -61 63 -254 -134 16 -11 -31 133 43 115
5573 115 51 -128 105 93 -64 -8 259 -185 66 117 63 104 -136 134 140 -29 74 296 -112 93 -132 -105 23
$$ packed form
5410f1n2J33J0j24J72M0j72J88k28J46j56J22K40l04m2o5J81M8J47j80j19K9O4
5433A7L29l05j20K83k53n1n9L76Jk19j13L5L4k8M93n43J37K28m65M87l24K63m01
5456a98M18m75L57J42l05oN8O3o1K87k35K97k08j10j1j30L21p8k55J08J26k40
5478a35J95kJ9j14j5K01pm42M35j0j25J10j09J25j00P2j21j0K58k02L5n5Pq9k4
5503a03N2p0J6J77j1j26J67l6J13p8j70N2k56L36J21m09J85R8m1j7j05P9o9R3
5527bK81k06k2k01K63J02l93L19k86M4K09N2N4q9j15q3P8k87K64J04k36J31q5
5550a04K54j29k03L71l78p0K77p6L78l39P9m5m8k8J24l17J20J50k7k0J64r0P2
5573A15o4j79K33j2j57N6K67m44K51N1n4M1k40K70Oj69J03K22m08K05k25K7J28
$$ plain form
5596 23 42 315 252 94 -69 -18 -119 -124 3 -111 -24 -43 -70 95 180 -118 -18 259 12 163 -106 25 -91
5619 -91 3 126 -105 194 11 63 -8 -109 64 -34 -180 85 203 167 -103 -292 169 105 -88 -8 121 -25 -207
5642 -207 7 94 54 199 121 47 131 113 -4 64 -187 -270 202 217 -5 2 -14 -289 -186 -183 -108 221 38 110 4
5667 4 -29 -7 21 -24 160 -35 -305 68 48 -30 -65 200 81 -32 62 28 -117 2 376 -88 131 59 -28 -193
5691 -193 115 96 -37 118 -145 -85 2 29 -161 68 -42 -75 39 -73 -76 141 -225 127 187 -54 -177 -215 84
5714 84 -110 -52 117 136 -142 -102 -126 74 148 -148 -75 -34 19 88 76 -35 72 -57 1 89 -28 302 -251 114
5738 114 17 9 3 70 197 -380 -44 -85 -136 41 39 -185 68 -25 86 -53 -207 130 80 -224 176 -9 -87 -140 180
5763 180 -84 75 -62 56 -32 198 -33 -144 31 32 -102 -182 -155 14 -47 -63 -174 -152 -267 -192 217 -116 -21
$$ packed form
5596B3J9K73o3j58j63N1j01nJ27j14Q7j9k7J65Q5k98J00K77k47J51k69J31j16
5619i1R4J23k31K99j83N2p1j01J73r8j46K65J18l6k70j89M61o4j93Q0J29j46j82
5642b07K14Q7m0J45p8p4Q4j8j17O8k51q3M72J5k22Pj6k75J03LP5L29j83P2j06
5667Dl3K2K8m5J84j95k70L73k0p8l5K65j19j13R4l4j45J19L74m64K19p2q7j65
5691a93L08j9j33J55k63O0Q7K7j90K29j10l3J14j12lK17l66L52O0k41j23l8K99
5714H4j94N8J69J9k78M0k4K00P4k96P3M1N3O9j2j11J07j29N8Q8j17L30n53L65
5738A14r7qoO7J27n77L36m1n1J77kk24K53r3J11j39j54L37n0l04M00j85p8n3L20
5763A80k64J59j37J18q8K30k31j11J75Jj34q0K7J69o1j6j11K2j15P5M09l33R5
$$ plain form
5786 -21 -59 187 -120 -91 197 -43 195 -353 -244 -171 -164 -216 -240 177 101 80 -158 281 132 193 99 67 43 -53 215
5811 215 80 166 26 68 -107 -195 -236 144 -118 -45 -90 -112 -75 -44 85 -26 -136 -6 -121 104 67 -13 -163 -47
5835 -47 253 -127 199 58 -52 34 275 5 -74 -34 -98 97 159 58 -77 41 -49 -321 155 -259 -241 -130 61
5858 61 -59 -26 -41 -21 14 152 -46 218 36 68 -116 68 156 68 93 155 184 90 -165 149 0 -207 146 54
5882 54 -41 -5 -92 20 -159 388 91 150 -28 12 61 -139 -55 -9 -201 45 202 43 -138 35 63 -137 -17
5905 -17 100 -161 49 -144 74 -90 312 83 -80 354 204 -1 213 -206 85 -182 134 155 46 -111 103
5926 103 233 142 1 -54 127 44 -175 184 200 136 48 -114 240 65 162 140 167 22 -56 -175 -4 154 91 37
5950 37 -300 -163 -84 29 -166 -50 -169 -34 26 225 353 162 -106 -8 -58 -159 53 -74 -139 80 -12 -115
$$ packed form
5786b1l8K46l07K9K88k40K38n48J09P3Pn2k4M17p6k1k38M39j49O1r4l2k4r6K68
5811B15j35Q6j40M2j75q8m1L80k62P3m5k2L7L1J29j11j10J30j15K25l7q0j50J16
5835d7L00l80L26j41j10Q6K41k70p9M0o4J95O2j01j35J18r0k72M76m14J8J11J91
5858F1j20L3j5K0L5J38j98K64j82L2j84J84Q8q8K5O2K9r4k55L14j49k07L53r2
5882E4r5L6q7J12j79N47k97N9j78M0M9k00Q4M6j92K46J57j59j81J73K8k00J20
5905a7J17k61K10j93K18j64M02k29j63M34j50k05K14m19K91k67L16K1j09j57K14
5926A03J30r1j41n5J81q3k19L59J6o4q8j62L54j75R7k2K7j45p8j19J71J58o3n4
5950C7l37J37P9J13j95J16j19J35O0J99J28j91k68R8n0j01K12j27o5K19r2j03
$$ plain form
5972 -115 -30 175 -67 69 -111 -2 -141 68 155 -31 -176 162 -72 -29 265 -171 356 38 137 278 -63
5993 -63 193 82 -33 45 3 274 -129 -172 146 -74 -45 -137 293 -19 118 70 -264 12 -86 -341 -230 -69 96
6016 96 -28 51 341 92 34 -30 91 292 -125 -197 -30 -187 -93 68 113 167 84 282 -34 81 -233 -132 37
6039 37 -108 -211 73 164 -38 4 -144 217 -94 133 141 -48 407 -161 24 -38 145 136 -221 34 -11 -102 17
6062 17 6 121 -69 -108 -101 181 -35 188 -48 -26 184 -172 -216 81 89 -155 -160 -160 -150 116 109 -142 -4 218 -79
6087 -79 80 293 278 -218 79 15 -188 9 297 -24 -234 63 161 -122 339 86 -91 -204 249 -110 -17 -284
6109 -284 99 121 -191 -99 21 -73 225 -12 102 113 -315 100 160 138 229 60 18 -305 -100 -206 9 58 185
6132 185 -43 -109 28 -19 -26 37 -26 137 153 -60 -89 -133 149 17 43 -218 30 -160 174 -167 252 97 184 277
$$ packed form
5972a15Q5K05k42J36j80J09j39K09Q7j86j45L38k34M3K94m36N27l18R9J41l41
5993f3K56j11j15P8m2K71m03m3L18k20K9r2M30l12J37m8l34K76r8k55J11J61J65
6016I6j24P9K90k49n8o4J21K01m17p2J67j57R4J61M5N4q3J98l16J15l14J01J69
6039C7j45j03K84R1k02M2j48L61l11K27Qj89M55n68J85o2J83rl57K55m5r1J19
6062A7j1J15j90l9PK82k16K23k36K2K10l56m4K97Qk44n%J0K66pk51J38K22k97
6087g9J59K13j5m96K97o4k03J97K88l21k10K97R8k83M61k53j77j13M53l59R3k67
6109b84L83K2l12R2J20r4K98k37J14J1m28M15O0k2R1j69m2l23K05j06K15M9J27
6132A85k28o6J37m7pO3o3J63J6k13k9m4K82j32K6k61K48j90L34l41M19j55Q7R3
$$ plain form
6156 277 45 194 -86 -257 -1 -356 114 85 -255 25 -112 79 -86 -42 219 70 -79 267 174 212 72
6177 72 29 -324 109 131 -42 17 -33 108 -48 -84 -26 91 114 113 8 44 28 127 -8 -264 68 -4 -4 194 44
6202 44 117 240 87 179 -4 183 101 -37 -23 148 111 -31 -78 57 -163 -141 87 -48 69 2 -170 -9 -190
6225 -190 65 -153 -143 -22 1 -74 311 284 240 -253 55 87 211 115 -53 -84 -117 -66 210 151 -94 6 191 -225
6249 -225 89 -40 -122 -3 -152 -11 132 140 -44 -115 -89 -75 128 -127 -232 -102 -166 -80 18 -203 3 -304 -298 -96
6273 -96 44 -112 -209 -29 215 -214 20 -114 -137 130 0 54 22 266 -35 55 -37 -124 265 220 26 -246 320
6296 320 21 319 -88 -72 -91 57 108 38 -37 120 174 41 -188 68 -28 -89 88 300 64 65 216 -73 -150 144
6320 144 -52 -15 136 -69 -100 -135 -279 11 -42 237 118 83 236 -8 158 19 67 -113 142 45 143 15 -96
$$ packed form
6156B77k32J49k80j71K56l55M70k9l40K80j37J91j65M4K61j49j49L46r3L8j40
6177G2m3l53M33K2j73N9n0J41j56l6N8J17K3jj05L6j6R9j35k56L32p2%J98j50
6202D4P3J23j53R2j83J87q2j38J4J71l7j42m7J35k20K2K28j35J17o7j72J61j81
6225a90K55k18J0J21K3p5L85k7m4m93L08L2J24r6j68l1l3N1K76n9k45J00J85m16
6249b25L14j29q2J19j49J41J43Qj84p1K6J4K03k55j05J30o4Q6R8k21K06l07OK02
6273i6J40j56r7J80K44m29K34j34k3K67j30N4l2K44l01R0r2q7L89m5j94k72N66
6296C20k99K98m07J6j9J48N1p0p5J57N4j33k29K56r6o1J77K12k36JJ51k89p7K94
6320A44j96L7J51k05l1l5j44K90n3K79j19l5J53k44J66j39M8j80K55r7R8j28j11
$$ plain form
6343 -96 176 74 -141 127 164 213 229 32 -46 -155 140 100 -167 56 0 -53 67 15 -190 -132 -5 -53 -4 -28
6367 -28 -49 -54 -257 35 -160 -91 -135 -10 -210 50 -202 191 23 -78 -17 -95 11 170 -59 -189 153 186 -19
6390 -19 -142 288 -54 35 -151 134 76 -61 39 337 171 -220 -72 120 -56 -141 -20 142 41 129 55 -87
6412 -87 -116 151 -246 2 -6 -96 113 -23 209 -117 -5 32 29 -104 -166 -73 160 -147 -83 -99 28 12 -147 287
6436 287 74 8 -131 -185 18 54 204 -11 -57 -146 99 108 -139 -9 -105 -73 -27 -148 -220 -50 -40 98 -12 110
6460 110 -196 -2 -64 -135 -68 13 127 -118 -157 -30 60 181 8 -84 21 123 -115 9 98 -24 312 272 45
6483 45 76 -12 -146 -24 -177 284 215 -75 -187 62 -60 73 19 85 -155 80 -191 39 337 101 -46 -152
6505 -152 -56 -114 -116 295 313 56 62 -31 -111 -48 78 -57 -68 43 78 106 -34 -42 -54 -29 -5 35 4 197 82 -111 -20
$$ packed form
6343i6K72j02k15K68L7M9J6j97p8j09K95m0k67K23n6n3J20n2k05N8J27m8M9k4
6367b8k1nk03K92j95O9m4J25k00K60k52L93j68j01O1p8J06J59k29j30L42L3k05
6390a9j23M30l42Q9j86K85n8j37J00K98j66l91J48J92j76q5J21J62j01Q8p4j42
6412h7k9K67l97K48qr0K09j36K32l26J12L7lj33o2R3K33l07O4j6J27j6j59M34
6436B87k13o6j39n4K03L6J50k15m6q9K45Rk47J30r6L2M6j21p2J70J0J38j10J22
6460A10l06J94o2p1O7Q1J14k45l9J27R0J21j73r2J05J02k38J24Q9j22L36m0k27
6483D5L1q8j34J22j53M61o9k90j12K49j22J33n4O6k40K35k71K30K98k36j47j06
6505a52R6n8kM11J8k57Or3q0O3J26j35j1J11L5K8j40qj2K5K4M0l1J93j15j93R1
$$ plain form
6532 -20 -283 -284 -129 -60 -148 -119 -147 266 -138 -67 -103 26 -12 -94 79 156 36 -72 -5 369 25 -3 -35 -59 22 19
6558 19 -96 -204 -185 28 19 -21 25 -246 91 -253 -253 -189 150 -239 15 36 231 -95 109 175 33 13 -102 -153
6582 -153 -98 36 65 23 114 238 -255 108 -195 -51 -30 -155 -12 -45 -71 -88 54 -91 80 223 -183 229 -192
6605 -192 -169 -119 179 229 81 -124 -20 69 48 -21 -44 -55 22 156 -119 -51 20 -292 -46 -127 -115 -149 -101 -83 -379
6630 -379 221 103 217 -98 37 73 14 224 -85 -345 38 139 -54 6 63 -52 8 94 -167 192 -152 15
6652 15 -99 -96 14 143 -125 -10 209 202 -117 -89 23 88 -150 -139 -229 -156 68 40 13 25 -92 34 62 33 11
6677 11 -32 -67 40 -162 -33 366 122 -60 -129 102 215 -50 12 -7 -29 84 121 31 -110 -113 -140 -87 -96 -22 196
6702 196 102 28 -67 -8 201 78 101 -344 78 220 -146 -12 -65 -68 230 188 35 -87 -75 83 -117 -111 90 54
$$ packed form
6532b0k63jJ55O9q8K9k8M13m04P1l6J29l8q2J73P7j20j08O7L74l44k8l2k4Q1l
6558A9j15j08J9K13rm0M6k71L37l44%O4L39l89K54K1J95l26K04O6j42k0j15n1
6582a53N5J34K9m2R1J24m93L63l03J44K1j25J43l3k6j7J42j45J71J43m06M12m21
6605a92K3N0K98N0j48k05J04Q9k1o9k3j1P7J34k75O8P1l12K46q1J2l4M8J8k96
6630c79O00j18J14l15J35L6n9K10l09k60L83J01j93O0N7j15O0Q6k61L59l44J67
6652A5j14LJ10J29k68J15K19pl19K8J12O5k38J1r0P3K24k8k7J2j17J26K8k9k2
6677A1m3l5J07k02J29L99k44j82o9K31J13k65O2j9k2J13L7r0j41lk7N3rP4K18
6702A96r4p4r5N9K09j23K3m45M22J42l66J34n3lK98m2j53j22J2J58k00OK01l6
$$ plain form
6726 54 -168 45 200 53 108 221 66 -122 -100 -62 119 45 118 107 45 -100 -121 -229 -117 104 -55 174 -152
6749 -152 170 -53 175 4 -81 -208 -181 -53 77 64 80 9 68 -122 -206 33 -190 -15 -20 -96 75 47 -46 -216
6773 -216 134 60 34 -201 -88 -138 -170 -19 -130 74 186 -137 -82 -172 1 16 -68 311 75 172 29 -78 -149
6796 -149 37 -274 -50 21 -183 -2 -145 94 415 113 -196 -89 79 125 167 -35 -121 236 154 59 -183 -19
6818 -19 138 -227 -35 -252 143 81 249 -99 -171 266 46 101 -51 39 30 95 -232 234 -155 -44 201 -14 74
6841 74 113 125 248 146 341 153 153 -107 -2 -31 -4 232 71 -9 84 -41 -213 56 -141 -69 166 106 -34 -224
6865 -224 -11 69 -70 69 106 -133 101 -43 -40 126 113 20 -216 -64 -34 -159 -1 -108 23 -364 93 204
6887 204 -178 192 -21 84 197 35 72 -63 -28 -36 -46 -158 -105 -91 77 -177 -145 74 -195 153 -296 36 -91
$$ packed form
6726E4k22K13J55j47N5J13j55j88K2L8J81p4P3j1o2j45k1j08J12K21j59K29l26
6749a52L22k23K28j71q5j27K7J28J30j3J6p1N9j90q4K39k23J75np6J71k8r3j70
6773b16L50p4k6k35J13n0l2J51j11K04J12l23N5r0J73J5q4L79k36R7j43j07p1
6796a49J86l11K24P1k04J81j43K39L21l02l09J07J68M6M2k02q6L57q2r5k42J64
6818a9J57l65J92k17L95o2J68l48p2M37k20N5j52R0rO5l27M66l89J11K45k15Q8
6841G4L9J2J23j02J95j88%k60J05k9K7K36j61q0R3j25j72K69j97P2K35o0j40j90
6865b24K13Q0j39J39L7k39K34j44LJ66j3r3k36J52L0j25J58j07J31l87M57J11
6887B04l82L70k13J05J13j62L7j35L5qj0j12N3J4J68k54L2K19k69L48m49L32j27
$$ plain form
6910 -91 -9 5 192 149 183 -20 100 151 -216 -102 -11 217 -204 62 -12 151 270 -6 -49 50 -44 71 -18 146
6934 146 -67 -141 127 252 -65 15 1 280 39 -65 -132 -139 116 -46 116 1 24 26 -113 24 -239 -40 -39 184
6958 184 252 -40 -171 -6 31 -174 -216 204 209 -103 -4 106 -138 70 117 -112 26 219 2 72 -11 -250 -120
6981 -120 39 -192 127 9 280 -64 -133 -36 174 50 -113 424 -555 -100 -61 189 267 -58 -63 71 134 -32
7003 -32 -246 40 46 -188 -10 6 -244 119 -123 -263 -35 -29 -209 60 93 -218 18 -69 -30 7 208 -157 286
7026 286 -115 15 -116 -225 -143 -143 38 -37 -52 43 128 74 -86 103 -151 14 83 152 -133 100 145 -39 -130 -56
7050 -56 345 0 50 -156 -4 -16 73 54 -319 -113 444 -178 -73 39 -226 -88 -483 -107 -29 36 323 -140
7072 -140 222 -60 -169 -67 -97 4 -240 -104 -280 170 29 -126 -312 -231 -51 149 -46 -140 -21 185 -212
$$ packed form
6910i1Q2J4J87m3L4k03J20N1l67J14R1K28m21K66p4J63J19k76m3R9r4J15q9J64
6934A46k13p4K68J25l17Q0j4K79k41j04o7pK55j62J62j15K3Kj39J37k63J99JK23
6958A84O8k92j31J65L7k05m2M20Nl12R9J10k44K08M7k29J38J93k17P0q3k39J30
6981a20J59k31L19j18K71l44o9R7K10j24j63N37r79M55L9K50P8l25nJ34O3j66
7003c2k14K86Ok34J78J6k50L63k42j40K28Oj80K69L3l11K36q7L9L7K01l65M43
7026B86m01J30j31j09Q2%J81p5j5R5Q5n4j60J89k54J65O9O9k85K33M5j84r1P4
7050e6M01l45N0k06J52j2Q9j9l73K06N57o22J05J12k65J38l95L76P8O5K87m63
7072a40L62k82j09J02l0J01k44J36j76M50j41j55j86Q1J80K00j95r4J19K06l97
$$ plain form
7093 -212 -8 26 10 -27 -31 1 -64 176 -100 122 -61 -112 105 1 -141 49 -45 -22 104 -125 93 71 24 -33
7117 -33 71 62 -71 68 -11 -177 134 -12 -219 -107 94 161 -82 79 61 71 72 368 61 -19 -52 -14 -140 -52
7141 -52 -160 168 204 275 135 64 -259 188 -57 138 -75 117 -88 -148 -80 102 -14 111 -178 -41 199 -185
7163 -185 -290 32 231 34 -107 6 -26 -106 -71 -158 66 195 -111 -46 -223 -116 229 -152 222 73 63 169
7185 169 -117 28 50 251 34 -48 -28 30 -45 -68 121 -103 -152 -29 -185 -173 117 -73 -46 -61 -241 192 228 -127
7209 -127 -129 -128 -1 143 -64 -103 161 -16 64 -17 -49 315 -57 -233 143 -13 -122 139 37 -141 121 -277 -4
7232 -4 45 -31 -69 15 36 117 -236 -37 -2 -37 -90 -54 -53 -236 144 -29 312 -31 -112 48 35 314 82 -246 120
7257 120 -38 -193 -16 -1 281 109 56 -1 222 21 133 192 179 249 13 -35 -16 -54 59 313 -154 120 -33
$$ packed form
7093b12K04L4j6l7mL2o5K40k76K22j83n1K17j04j42J90r4K3J26k29K18k2m7n7
7117c3J04rj33J39p9j66L11j46k07J12K01O7k43J61j8J0JK96l07q0l3L8j26Q8
7141e2j08L28L6P1j40p1l23M47k45J95k13J92k05o0O8J82j16J25k89J37K40l84
7163a85j05L22J99j97j41J13l2q0L5q7K24J29l06O5j77J07L45l81L74j49j0J06
7185A69k86J45K2K01k17q2K0N8p5k3J89k24m9J23j56J2K90j90K7j5j80M33L6l55
7209a27kJJ27J44k07l9K64j77Q0q1l2L64l72j76L76j56j09K61j02j78K62l98K73
7232dM9p6l8Q4K1Q1l53J99L5l5n3L6Jj83L80j73L41l43q1J60j3K79k32l28L66
7257A20j58j55J77J5K82j72n3n7K23k01J12N9j3P0k36m8J9l8J13K54m67K74j53
$$ plain form
7280 -33 -9 100 -203 -144 267 -47 -148 -7 97 -102 -43 73 -135 198 -22 218 -177 258 89 -136 234
7301 234 -195 14 -25 150 -69 41 -107 27 191 187 195 -124 161 165 -132 -100 -137 29 -336 -5 -179 -111 25
7324 25 -31 -128 54 -103 88 206 -15 109 30 -117 58 -8 -18 182 2 233 -86 123 99 -42 -42 48 -389
7347 -389 18 24 -192 161 -5 -194 176 -173 8 -29 346 39 -53 -164 2 44 176 184 -303 -181 85 -1 -331
7370 -331 -26 93 -27 -109 -56 105 48 -99 -115 7 -242 207 -11 14 90 20 62 230 -14 307 74 248 -162
7393 -162 55 58 194 -211 -107 162 -26 -62 69 56 -33 21 164 29 31 -188 63 -5 73 -43 132 74 113 -47
7417 -47 195 -29 -97 118 182 185 -246 -58 -127 126 20 251 170 -34 168 -142 279 -5 45 -41 11 -138 60
7440 60 -10 -114 -186 -319 16 -197 -15 -6 -215 -74 -27 39 -287 135 -37 -36 33 -60 -19 -183 -143 123 204 -88 -28
$$ packed form
7280c3K4J09l03N9M11l14j01J41J04j99N9J16k08L33k20K40l95M35j69k25L70
7301B34m29K09l9J75k19J10j48J34J64mQl19K85Mk97L2l7J66l65L31j74O8J36
7324B5n6r7J82j57J91J18k21J24p9j47J75o6j0K00j80K31l19K09k4j41%R0m37
7347c89M07Ok16L53j66j89L70l49J81l7L75l07r2j11J66M2J32Qm87J22K66q6l30
7370c31L05J19j20q2N3J61n7j47j6J22k49M49k18K5P6p0M2J68k44L21k33J74m10
7393a62K17LJ36m05J04K69j88l6J31j3q9N4J43j35Kk19K51o8P8j16J75n8L9j60
7417d7K42k24o8K15O4Lm31J88o9K53j06K31q1k04K02l10M21k84N0q6N2j49J98
7440F0p0j04p2j33L35k13J82Rk09J41M7O6l26M22j72JO9r3M1j64M0K66Q1k92O0
$$ plain form
7465 -28 -154 170 -25 91 -117 -148 179 -20 -29 -31 -3 -74 265 -109 -138 74 -146 0 -77 -205 113 245 -100
7488 -100 -526 -145 66 221 202 -146 211 -45 -69 1 -132 -167 181 -58 -6 -241 -98 32 -57 -15 112 -31
7510 -31 -225 369 -72 -150 -230 -76 -203 1 -71 30 -112 37 214 91 14 265 30 -137 -156 117 323 -193
7532 -193 134 209 -92 -191 157 -186 32 6 58 127 61 78 -185 224 -6 -219 119 156 -114 11 -214 284 -238
7555 -238 -129 323 108 111 -113 11 148 173 205 311 105 -249 -18 111 265 -123 -146 -121 -52 54 -96 -121 122
7578 122 49 114 132 -108 94 -247 -186 108 -45 -126 -72 71 20 -155 -89 241 38 -10 -14 138 174 65 -79 54
7602 54 -153 -4 -23 -18 -23 -17 -163 -56 -309 46 -152 -201 -96 -549 -50 -242 70 -35 18 -35 42 214 -67 43
7626 43 91 -41 334 -131 -25 -18 -42 98 39 9 146 -135 113 311 -80 134 47 61 -208 159 -89 86 -45
$$ packed form
7465b8j26L24j95J16k08l1L27j99rkK8p1L39l74k9K12k20J46p7j28L18J32l45
7488a00m26L81K11J55j9l48L57k56k4P0j33l5L48k39N2k35J43J30q9M2J27j43
7510c1j94N94m41p8q0J54j27K04p2J01j42J49J77j23p7K51k35j67j9K73K06n16
7532a93L27P5l01r9L48l43K18k6N2O9o6J7k63M09k30k13L38L7k70J25k25M98n22
7555b38J09M52k15Lk24J24J37K5L2J06k06l54K31J29J54l88k3K5O9J06j50k5K43
7578A22p3O5J8k40K02l41O1K94j53q1N4J43n1j75O6L30k03m8mJ52L6j09j44J33
7602E4k07J49j9NnOj46J07k53L55j98m9J05m53M99j92L12j05N3n3P7J72k81J10
7626D3M8j32L75m65J06Pk4J40n9l0J37k81K48J98l91K14q7J4k69L67k48J75j31
$$ plain form
7649 -45 -4 -78 65 -150 -179 -41 33 192 -1 -107 -25 -65 -98 -42 -62 126 -123 -65 175 -80 18 -281 -9 88
7673 88 -122 -132 -212 63 -59 71 21 152 -150 -139 -13 199 17 79 -178 149 72 -169 -217 -67 46 -73 -83
7696 -83 -6 100 126 -37 -93 221 203 80 83 -202 77 27 -13 158 -166 -109 49 31 50 113 79 166 122 -112 -8
7721 -8 -156 -48 57 82 222 -57 -45 36 162 192 -166 -29 31 -64 168 -293 -86 149 -62 255 9 59 -57
7744 -57 18 193 40 33 -157 -180 -225 3 47 -118 -55 139 74 -127 50 -103 -74 -40 126 -40 -21 240 208 -53
7768 -53 252 6 131 36 -136 47 96 -72 170 -349 -137 -179 2 -154 73 -79 242 -33 67 125 18 148
7790 148 57 -151 -83 -71 -223 51 -244 -4 -3 -33 -292 4 -84 -141 -92 -168 531 -77 -181 97 -102 208 -239
7813 -239 -134 142 53 -44 249 -24 -154 -225 -39 62 98 -129 128 -85 -70 143 22 228 -340 -344 -210 117
$$ packed form
7649d5M1p4J43k15k9J38P4J59j93j06Q2m0l3N6k0J88k49N8K40k55R8k99K72R7
7673H8k10j0q0K75j22J30n0J31l02J1J26K12j82O2k57L27p7k41m8J50J13j19j0
7696h3P7J06K6j63n6L14j8j23Lk85K79n0m0J71l24N7J58j8J9O3l4Q7m4k34J04
7721hj48J08J05K5J40k79J2Q1J26L0l58J37O0r5K32m61K07K35k11L17k46N0j16
7744e7P5J75j53pj90k3m5K28M4j65O3J94o5k01J77j53K9L4J66j66J9K61l2k61
7768e3L05k46J25r5j72J83M9j68K42n19K12m2J81j56K27j52L21k75J00N8j07J30
7790A48r1k08O8J2j52K74k95K40Jl0k59K96q8n7M9p6O99o08j04K78j99L10m47
7813b39J05K76q9r7K93k73j30p1J86J01L6k27K57k13J5K13j21K06n68mJ34L27
$$ plain form
7835 117 97 -186 99 -49 -16 51 290 122 -3 203 -125 -78 -121 -42 -134 -23 9 127 132 -78 -50 317 -282 -41
7859 -41 96 8 -84 271 -160 -223 85 -119 -147 -22 -222 -381 -54 64 3 -28 106 -129 -166 162 -35 206 188
7882 188 -305 6 87 114 3 -166 129 8 66 230 33 239 -171 -30 20 84 -83 -97 -7 203 -221 -69
7904 -69 57 10 -17 57 26 231 169 -236 -300 72 141 -105 56 -88 -41 167 41 -167 -13 12 -174 26 18 1
7928 1 181 116 81 -7 -127 -107 -36 53 -48 -80 -51 38 -207 130 -67 2 -237 95 94 -9 193 -95 9 130 10
7953 10 21 288 9 96 59 -23 79 375 -184 195 -7 -254 44 -127 23 82 -171 -13 22 -35 72 -254 103
7976 103 -73 9 -265 -124 231 20 -220 -137 44 -165 -24 -25 161 -320 188 -154 166 33 341 125 -39
7997 -39 45 -51 15 -186 -97 112 -107 36 -238 107 37 -90 -225 -7 -93 153 -82 -104 237 -82 -250 -246 101
$$ packed form
7835A17k0k83K85j48L3O7K39j68j25K06l28M7m3P9r2J11L2J18Nk10K8L67n99K41
7859d1J37q8r2L55m31o3L08k04k8J25k00j59L27J18o1l1J34k35l7L28j97K41j8
7882A88m93L11Q1K7j11j69K95j21N8J64j97K06m10J41N0O4j67j4R0K10m24J52
7904f9J26m7k7P4l1K05o2m05o4L72O9k46J61j44M7K08j26k08J54K5j86K00qj7
7928AJ80o5l5q8j20K0P1Q9j01l2K9Q9k45L37j97O9k39L32jj03K02k88J04J21j20
7953A0J1K67k79Q7l7q2J02K96n59L79k02k47K98j71J50N9k53J58L5n7J07l26L57
7976A03j76Q2k74J41L55k11k40Q3J81k09J41jJ86m81N08l42L20j33L08k16j64
7997c9Q4r6O6k01Q9K09k19J43k74L45p0j27j35K18q6K46k35k2L41l19j68ML47
$$ plain form
8020 101 28 66 58 116 -106 147 271 42 214 235 235 -149 92 202 -2 -2 113 -78 40 -83 9 -184 -174 111
8044 111 99 164 -12 -129 -63 -75 -96 -9 11 31 83 -63 49 -159 214 21 291 113 -36 -210 3 -300 -16
8067 -16 312 257 264 -270 176 90 95 120 -262 -19 -36 -83 99 82 -84 -183 14 129 -79 36 121 299 -243 150
8091 150 21 88 -126 38 -111 -424 61 -84 -244 -46 -123 63 -83 -25 -232 -59 140 255 -88 47 164
8112 164 103 317 -14 166 21 7 131 7 66 66 15 230 160 155 -38 2 -170 -247 -112 -151 -395 145 29 -92
8136 -92 296 -95 -67 -104 -94 77 -362 -62 5 113 -206 94 3 106 -63 34 19 42 22 -123 112 -204 -209 185
8160 185 -134 58 351 51 -13 -120 130 -207 -98 65 98 -100 55 11 -177 13 243 -98 -69 48 44 128
8182 128 -191 37 -12 288 11 9 -106 288 171
$$ packed form
8020A01p3L8qN8k22K53J24k29J72K1%l84K41J10k04%J15j91J18j23R2j93J0K85
8044A11j2O5j76j17O6j2k1Q7K0K0N2j46J12k08L73j93K70j78j49j74K13l03K84
8067a6L28n5Pn34M46q6NK5l82K43j7m7J82j7j66r9J97J15k08J15Q5J78n42L93
8091A50j29O7k14J64j49l13M85j45j60J98p7J86j46N8k07J73J99J15l43J35J17
8112A64o1K14l31J80j45j4J24j24N9%n1K15p0nj93M0j72p7J35l9k44N40j16j21
8136i2L88l91K8l7J0J71m39L00O7J08l19L00r1J03j69R7j5K3k0j45K35l16nL94
8160A85l19J92K93l00o4j07K50l37J09J63L3j98J55m4j88J90K30l41K9J17mQ4
8182A28l19K28m9L00k77kj15L94j17
8191A71
$$ Imaginary data points
##PAGE= N=2
##DATA TABLE= (X++(I..I)), XYDATA
$$ plain form
0 0 0 0 0 0 0 0 0 0 0 0 0 0 8 -8 8 -8 9 -16 16 -24 24 -32 40 -41 49 -59 72 -80 95 -105 121 -137 159 -177
34 -177 201 -227 256 -288 320 -358 399 -442 490 -545 602 -665 732 -810 893 -981 1082 -1192
52 -1192 1313 -1448 1601 -1773 1967 -2193 2452 -2758 3127 -3577 4144 -4883 5888 -7351 9675
67 9675 -13972 24619 -114105 -112639 13024 -109091 -73310 8544 6872 -7179 63853 51994
79 51994 25762 65459 84754 19424 19803 55361 20079 -31677 -7714 6507 -15545 -33237 -34738
92 -34738 -39595 -32516 -20101 -17146 -30858 -17602 21984 29376 5152 21331 51946 37779 11407
105 11407 19805 19484 -5360 -13366 -17045 -43564 -34074 667 -21236 -47291 254 36707 7614
118 7614 -419 30036 31045 10662 9718 3592 -11837 -4134 -1461 -26480 -25922 4875 4947 -14541 -6402
$$ packed form
0@%%%%%%%%%%%%Qj6J6j6J7k5L2m0M8n6P2q1R0j08J31j52J75k00K26k58K96l36
34a77L78m28M83n44O08o78P57q41R32j035J147j267J397j542J703j874K063k274
52a192K505k761L049l374L740m160M645n210N885o704P721r027J0771j3239J7026
67I675k3647L8591j38724J466J25663j22115L5781Q1854j672j4051P1032j1859
79E1994k6232L9697J9295o5330L79L5558l5282n1756K3963J4221k2052j7692j501
92c4738m857P079J2415K955j3712J3256L9586P392k4224J6179L0615j4167k6372
105A1407Q398l21k4844q006l679k6519R490L4741k1903k6055M7545L6453k9093
118G614q033L0455J009k0383r44o126j5429P703K673k5019N58L0797P2j9488Q139
$$ plain form
133 -6402 14044 14753 3829 2119 5542 6920 7912 4504 -6340 -4656 10561 7345 -12169 -10483
147 -10483 6695 1465 -17671 -13579 -288 -5592 -7764 -467 -3050 2879 21473 15253 -1880 11031
161 11031 25890 7009 -12082 -3963 149 -13570 -18963 -15616 -15286 -6500 2632 -3857 -2176 17789
175 17789 22229 7997 4519 14572 13581 -1055 -7908 -5633 -6548 -7497 -8595 -13097 -9973 2517 3055
190 3055 -6496 -3277 10599 10230 -1802 -37 10337 8147 2720 3730 555 839 6485 181 -12095
205 -12095 -7880 1671 -6754 -17641 -9333 1147 -2292 -4404 2439 6901 11537 14284 8538 5125
219 5125 11009 10393 -2725 -9965 -4478 -3861 -12592 -15338 -8511 -4444 -2758 -19 205 3879 11018 10801
235 10801 3048 1792 9183 7402 -3798 -4897 1283 -525 -5314 -4728 -4544 -3553 -682 -2073 -6582
$$ packed form
133f402K0446P09j0924j710L423J378R92l408j0844J684J5217l216j9514J686
147a0483J7178n230j9136M092J3291n304k172P297k583N929J8594o220j7133J2911
161A1031J4859j8881j9091Q119M112j3719n393L347L30Q786R132o489J681J9965
175A7789M440j4232l478J0053r91j4636o853K275r15r49j098m502L124J2490N38
190C055r551L219J3876l69j2032J765J0374k190n427J010l175K84N646o304j2276
205a2095M215R551q425j0887Q308J0480l439k112O843M462M636K747n746l413
219E125N884o16j3118p240N487O17q731k746O827M067J686K739K24L674P139k17
235A0801p753j256P391j781j1200j099O180j808m789N86J84R91K871j391m509
$$ plain form
250 -6582 -3140 4560 1873 -4419 878 8533 6169 2211 4091 5227 4427 2781 -2341 -5456 -2806
265 -2806 -1874 -8074 -10587 -3866 1042 -2817 -2434 3643 7000 6506 5720 4229 3133 4793 2643 -3906
281 -3906 -6259 -1668 -1185 -7423 -6774 7 1276 -818 -279 1459 3103 4170 2849 -385 602 3925
297 3925 2022 -3162 -1503 3101 759 -3200 -2308 -589 -172 -1407 -3031 -3245 -473 1895 18 -1989
313 -1989 2567 6496 2775 666 2621 3156 762 -1645 -2708 -3358 -2825 -2230 -4674 -4620 512 3121 120
330 120 329 4816 5810 2519 1084 1462 1480 306 -1686 -3703 -3435 -781 -1237 -4239 -2350 1762 1161
347 1161 -1161 172 2281 2118 1412 301 576 1335 2401 330 -2069 -93 2170 -798 -3554 -2036
363 -2036 -675 -1771 -3130 -1997 -665 409 1693 1173 828 3933 4886 1432 -34 1575 1663 -1329
$$ packed form
250f582L442P700k687o292N297P655k364l958J880J136q00j646n122l115K650
265b806R32o200k513O721M908l859L83O077L357m94p86j491j096J660k150o549
281c906k353M591M83o238O49O781J269k094N39J738J644J067j321l234R87L323
297C925j903n184J659M604k342l959Q92J719M17j235j624k14K772K368j877k007
313a989M556L929l721k109J955N35k394k407j063o50N33N95k444N4N132K609l001
330A20K09M487R94l291j435L78J8j174j992k017K68K654m56l002J889M112o01
347A161k322J333K109j63p06j111K75P59J066k071k399J976K263k968k756J518
363b036J361j096j359J133J332J074J284n20l45L105R53l454j466J609Q8k992
$$ plain form
379 -1329 -3329 -2700 -1796 -2322 -2520 -2401 -1536 1127 2130 50 1001 3643 3123 629 58 1271 818 -834
397 -834 -1253 -1296 -795 -229 -831 -2139 -846 973 -121 -1856 -464 1260 805 36 597 1468 1585 1729
415 1729 787 -204 672 968 -1220 -2548 -1164 -380 -1748 -2578 -1092 378 410 733 900 1153 2375 2053
433 2053 550 15 1361 198 -1812 -1654 -965 -684 -1491 -1333 -545 26 893 677 -84 588 1782 588
451 588 -942 -156 1287 155 -1201 -44 422 21 33 -470 -824 -39 285 -564 -1325 129 1131 214
469 214 -103 945 1230 1275 573 -72 88 232 -265 -1638 -1771 -262 -385 -1507 -1053 496 1038 491 613
488 613 1251 1217 1029 489 -333 -333 27 -551 -1322 -1209 -78 -86 -1205 -373 141 334 326 65 295 699 790 194
510 194 -189 517 968 270 -717 47 96 -520 -633 -863 -694 -102 -255 -858 -236 651 828 508 487 1253 1197
$$ packed form
379a329k000O29R04n26j98J19Q65K663J003k080R51K642n20k494n71J213m53j652
397h34m19m3N01N66o02j308J293J819j094j735J392J724m55p69N61Q71J17J44
415A729r42r91Q76K96k188j328J384P84j368q30J486J470L2L23J67K53J222l22
433B053j503n35J346j163k010J58O89K81q07J58P88N71Q67k16p61O72J194j194
451E88j530P86J443j132j356J157M66m01J2n03l54P85L24q49p61J454J002r17
469B14l17J048K85M5p02o45J60J44m97j373j33J509j23j122M54J549N42n47J22
488F13O38l4j88n40q22%L60n78p71J13J131qj119Q32N14J93qk61K30M04R1n96
510A94l83P06M51o98r87P64M9o16j13k30J69N92j53o03O22Q87J77l20k1P66n6
$$ plain form
531 1197 300 245 -75 -214 -350 -673 -1184 -862 -545 -445 -767 -364 869 562 252 299 938 1214 578 -91
551 -91 116 282 146 -381 -822 -220 172 -228 -999 -103 299 -287 -368 -233 190 233 370 18 264 859 1061
572 1061 38 -289 204 -110 -743 -1048 -664 -116 -469 -570 -433 107 335 466 61 383 996 648 -266 -223
592 -223 -109 -149 -313 -429 -526 -233 -9 -289 -252 100 783 324 -155 64 303 175 -320 20 -154 -46 79
613 79 -60 -305 -136 49 -345 -460 -147 263 -514 -215 -87 348 134 37 129 177 366 541 -289 -306 24 -177
635 -177 -406 -355 -116 -141 -69 -117 144 157 499 410 211 224 371 430 -118 -306 200 -340 -421 -203 63 -128 -97 -97
659 -97 -132 527 544 -4 -49 13 259 -59 -339 146 171 74 -44 -18 46 -106 -4 -338 -400 -268 13 -339 12 218
683 218 106 3 1 346 318 324 180 -35 -320 67 -177 -569 -474 5 -104 -225 -24 246 237 195 -86 43 159
$$ packed form
531A197q97n5l20j39j36l23n11L22L17J00l22M03J233l07l10M7O39K76o36o69
551i1K07J66j36n27m41O02L92m00p71Q96M02n86q1J35M23M3J37l52K46N95K02
572A061j023l27M93l14o33l05L84N48l53j01J37N40K28J31m05L22O13l48r14M3
592b23J14m0j64j16r7K93K24k80L7L52O83m59m79K19K39j28m95L40j74J08J25
613G9j39k45J69J85l94j15L13M10p77K99J28M35k14r7R2M8J89J75q30j7L30k01
635a77k29N1K39k5P2m8K61J3L42q9j99J3J47N9n48j88N06n40q1K18K66j91L1%
659i7l5O59J7n48m5O2K46l18k80M85K5r7j18K6O4j52J02l34o2J32K81l52L51K06
683B18j12j03kL45k8Oj44k15k85L87k44l92R5M79j09j21K01K70rm2k81J29J16
$$ plain form
706 159 421 214 46 126 70 -113 -309 -21 -192 -113 -50 -137 -9 28 -110 -304 -27 163 202 3 240 462 8
729 8 217 11 -215 -48 -25 -182 -235 -158 -21 159 136 90 70 185 324 147 312 183 -118 -61 -82 -183 181 -78
753 -78 -339 -71 109 -78 -134 123 -3 57 54 -8 -162 -75 -66 -283 48 -117 -214 6 95 -5 32 -22 -190 175 -118
778 -118 -24 144 -18 -86 131 95 -152 5 88 -80 -188 -337 -89 -165 -168 -489 -327 -174 274 46 188 104 31
801 31 96 -57 228 -40 15 -139 -123 -10 -166 73 11 146 -52 256 70 -202 -5 307 114 240 136 -263
823 -263 -226 -260 47 99 62 69 -23 234 -116 -12 -303 -100 17 79 164 138 -54 142 246 -184 40 202 157 -52
847 -52 230 17 -18 -5 -68 -90 -21 137 432 15 -25 280 -100 -80 148 120 72 -58 6 -14 21 -291 80 -57 -82
872 -82 13 -108 174 46 -10 47 -70 25 123 48 111 133 -18 -39 63 169 109 -48 26 -73 -39 -69 69 -89 -23 -176
$$ packed form
706A59K62k07j68Q0n6j83j96K88j71P9O3q7J28L7j38j94K77J90L9j99K37K22m54
729HK09k06k26J67K3j57n3P7J37J80k3m6k0J15J39j77J65j29l01N7k1j01L64k59
753g8k61K68J80j87n6K57j26O0lo2j54Q7Rk17L31j65r7K20Q9j00L7n4j68L65k93
778a18R4J68j62o8K17l6k47J57Q3j68j08j49K48p6ll21J62J53M48k28J42q4p3
801C1O5j53K85k68N5j54J6J13j56K39o2J35j98L08j86k72J97L12j93J26j04l99
823b63L7l4L07N2l7Pr2K57l50J04k91K03J17O2Q5k6j92J96J04m30K24J62m5k09
847e2K82k13l5J3o3k2O9J58K95m17m0L05l80K0K28k8m8j30O4k0L5l12L71j37k5
872h2R5j21K82j28n6N7j17R5R8p5O3K2j51k1J02J06o0j57P4r9L4l0J38j58O6j53
$$ plain form
898 -176 -89 -35 -135 -42 -298 25 -12 -122 -52 -121 -100 195 71 -166 -182 -121 123 198 -89 -104 -127 -32 156 82 -120
923 -120 -142 11 -146 -146 2 -80 -67 -243 -159 277 -259 188 153 222 174 -75 -71 -94 13 -222 59 -20 -290 -74 110
948 110 290 104 41 66 -269 216 -109 322 -26 -2 285 20 -142 187 33 271 63 -65 -131 14 -7 -156
970 -156 38 21 4 -162 -26 90 68 85 110 120 388 -176 258 -138 55 64 283 5 -207 51 -235 13 66
993 66 26 241 -68 -11 -265 -122 129 -81 -83 137 61 -24 -211 -126 15 -402 132 -79 -308 102 83 -15 -143 -298
1017 -298 -71 215 186 -40 -95 -22 -35 272 91 -64 -28 125 6 72 8 326 -233 -68 271 -39 51 37 -278
1040 -278 215 275 -159 -71 -138 130 -138 21 66 113 81 234 -191 -194 -25 -124 -224 -33 -99 -122 -11 183 228 65
1064 65 -54 286 -179 104 -89 -92 136 211 306 38 306 -175 181 5 37 -26 60 28 -132 -25 -43 -45 56 -221
$$ packed form
898a76Q7N4j00R3k56L23l7j10P0o9K1K95j24k37j6O1K44P5k87j5k3R5J88p4k02
923a20k2J53j57%J48q2J3j76Q4M36n36M47l5O9m8k49Mk3J07k35K81p9k70K16J84
948A10J80j86o3K5l35M85l25M31l48K4K87k65j62L29j54K38k08j28o6J45k1j49
970a56J94j7j7j66J36J16k2J7K5J0K68n64M34l96J93RK19k78k12K58k86K48N3
993F6m0K15l09N7k54J43K51k10kK20p6q5j87Q5J41m17N34k11k29M10j9r8j28j55
1017b98K27K86k9k26n5P3j3L07j81j55L6J53j19O6o4L18n59J65L39l10R0j4l15
1040b78M93O0m34Q8o7K68k68J59M5M7l2J53m25lJ69r9j00J91o6k3J11J94M5j63
1064F5j19L40m65K83j93lK28P5R5k68K68m81L56j76L2o3Q6l2j60J07j8kJ01k77
$$ plain form
1088 -221 16 191 40 -13 -53 39 -3 -394 140 -218 57 -98 -31 195 95 -211 69 -34 137 317 63 -178
1110 -178 -97 -291 -24 86 -24 37 32 -61 -363 -146 -135 -114 -4 111 -151 -222 -185 156 -245 15 62 -162 24
1133 24 -403 248 1 93 48 -277 45 -85 -183 -123 -39 163 -68 -54 -24 -97 -149 171 -39 31 -38 -94 -150 175 220
1158 220 -106 -29 -44 175 -131 -155 25 27 -194 -79 294 46 134 41 120 83 -239 19 -116 88 282 -14 128
1181 128 66 7 -61 -54 38 294 74 56 -30 111 23 -124 -12 -85 73 -143 -5 -12 -125 48 -61 -5 -185 -120 -79
1206 -79 178 49 -40 -37 20 195 -29 3 -117 60 -196 -70 109 -75 -93 468 1 -90 220 100 -25 -324 75
1229 75 341 87 53 69 27 31 -233 -121 147 4 130 -105 119 57 3 88 -65 6 248 191 -96 -187 161 172
1253 172 -85 -121 -138 -76 79 -54 -23 -49 215 176 277 -71 -58 -152 -6 -29 -222 -116 -359 36 -233 127 123 216
$$ packed form
1088b21K37J75j51n3m0R2m2l91N34l58K75j55O7K26j00l06K80j03J71J80k54k41
1110a78Q1j94K67J10j10O1nr3l02K17J1K1J10J15k62p1L7L41m01K60M7k24J86
1133B4m27O51k47R2m5l25L22j30r8O0Q4K02k31J4L0p3n2L20k10P0o9n6n6L25M5
1158B20l26P7j5K19l06k4J80Kk21J15L73k48Q8r3P9l7l22K58j35K04J94k96J42
1181A28o2n9o8PR2K56k20j8q6J41q8j47J12p3J58k16J38pj13J73j09N6j80O5M1
1206g9K57j29q9LN7J75k24L2j20J77k56J26J79j84j8N61m67r1L10j20j25k99L99
1229G5K66k54l4J6m2Mk64J12K68j43J26k35K24o2n4Q5j53P1K42n7k87r1L48J1
1253A72k57l6j7O2J55j33L1k6K64l9J01l48J3r4J46k3j93J06k43L95k69L60mR3
$$ plain form
1277 216 78 -78 42 -48 -60 -152 -20 250 -47 62 -68 -55 34 1 -107 22 -199 -206 183 158 83 -49 198
1300 198 106 -231 160 -88 -78 87 83 -203 -193 79 -145 147 -32 -128 -81 3 -153 -35 -56 242 114 231 156
1323 156 138 19 -82 -26 -91 292 23 -141 33 -157 -321 141 33 191 292 152 16 21 -109 205 -356 179
1345 179 -29 -93 -201 41 82 -199 63 123 141 244 249 -25 -150 100 253 -30 125 -67 218 27 83 96 -88
1368 -88 -134 -142 -46 -235 -136 -102 192 44 159 3 -55 67 -418 -165 45 14 -150 44 2 47 -173 220 75 -73
1392 -73 -64 -98 -7 205 260 159 89 166 251 -20 -68 271 -123 -25 -126 54 5 -13 -24 -100 34 -152 -101 -30 -265 88
1418 88 40 -45 -233 5 24 73 -50 -31 148 -116 61 -69 -30 72 -56 3 219 199 104 -80 13 -42 78 65
1442 65 -44 6 -105 66 -33 73 -116 43 -19 -150 76 121 97 -85 156 -182 -33 64 80 6 15 221 300 82
$$ packed form
1277B16j38j56J20r0j2r2J32K70k97J09j30J3Q9l3j08J29k21pL89k5p5j32K47
1300A98r2l37L91k48J0J65mk86J0K72k24K92j79r6M7Q4j56J18k1K98j28J17p5
1323A56j8j19j01N6o5L83k69j64J74j90j64M62j08J58J01j40j36Nj30L14n61N35
1345A79k08o4j08K42M1k81K62O0J8J03Nk74j25K50J53k83J55j92K85j91N6J3j84
1368h8m6qR6j89R9L4K94j48J15j56n8J22m85K53K10l1j64J94m2M5k20L93j45j48
1392g3Rl4R1K12N5j01p0P7Q5k71m8L39l94R8j01J80m9j8j1p6J34j86N1P1k35L53
1418H8m8q5j88K38J9M9j23J9J79k64J77j30L9J02j28N9K16k0r5j84R3n5J20j3
1442F5j09N0j11J71r9J06j89J59o2j31K26M5k4j82K41l38J49R7J6p4RK06P9k18
$$ plain form
1466 82 -202 -33 -136 -56 113 -16 -10 -322 -75 97 -162 -107 62 -37 -98 49 -160 330 89 311 -17 69 18
1489 18 166 -26 -83 6 16 159 -112 218 15 140 29 16 33 -87 13 33 -85 119 288 -284 -7 -317
1511 -317 -43 105 247 -94 27 -172 276 96 -25 56 -88 -93 161 -124 33 110 11 340 -70 -83 189 113
1533 113 148 -263 -172 197 -42 172 -50 -48 -95 -164 -69 -131 -104 143 -206 -84 53 -243 -54 189 129 61 -96 -116
1557 -116 9 173 23 21 16 -206 -170 -8 208 -156 19 -310 -82 -147 -174 -42 -303 63 14 140 127 93 77 13
1581 13 -125 -77 84 -4 -64 27 -92 70 113 151 -26 23 102 186 146 -205 45 215 -26 -74 -54 58 -330 -17
1605 -17 141 -130 96 100 243 10 -235 -21 41 1 4 74 -31 -42 181 -86 -80 -59 92 143 -146 -159 -8 51 -16
1630 -16 39 285 -49 13 -61 20 63 -65 238 -33 -142 -63 8 99 115 2 312 -48 111 244 -109 -18 38 -160
$$ packed form
1466H2k84J69j03Q0J69j29Ol12K47J72k59N5J69r9o1J47k09M90k41K22l28Q6n1
1489A8J48j92n7Q9J0J43k71L30k03J25j11j3J7j20J00K0j18K04J69n72K77l10
1511c17K74J48J42l41J21j99M48j80j21Q1j44nK54k85J57P7r9L29m10j3K72p6
1533A13L5m11R1L69k39K14k22Km7o9R5o2K7K47l49J22J37k96J89K43o0o8j57k0
1557a16J25J64j50knk22L6J62K16l64J75l29K28o5k7J32k61L66m9J26j3l4j6o4
1581A3j38M8J61q8o0R1j19J62M3L8j77M9P9Q4m0l51K50J70k41m8K0J12l88L13
1605a7J58k71K26MJ43k33k45K14O2m0LP0j05j1K23k67OK1J51N1k89j3J51N9o7
1630a6N5K46l34O2p4Q1M3j28L03k71j09P9P1R1J6j13L10l60J59J33l53R1N6j98
$$ plain form
1654 -160 -8 -322 -32 88 91 274 52 181 57 -90 -247 169 184 -10 -251 -246 252 -17 16 121 311 -176
1676 -176 127 86 -26 5 -188 16 105 158 227 118 -275 -38 112 248 17 -84 334 132 -97 33 111 -269
1698 -269 -169 134 181 145 -96 284 -60 -77 -3 -40 -136 -66 -31 82 -299 125 65 -136 -184 60 58 9 83 -53 32
1723 32 96 -153 -34 60 233 -96 163 -220 65 104 204 63 268 149 113 -121 -68 -137 4 -57 40 190 -251
1746 -251 -97 -273 131 80 105 -323 9 27 314 48 -66 40 35 -129 139 91 86 -102 -96 248 -151 -14 141
1769 141 -62 78 -107 -133 206 -83 -25 -65 -12 -158 -2 -94 32 -172 -117 -157 -207 3 -147 -50 -251 218 -24
1792 -24 291 47 -123 179 110 393 -242 -9 265 140 121 -144 25 69 -180 -103 -173 98 249 -60 -157 -7
1814 -7 -10 -84 114 29 -34 -154 -16 81 163 125 350 -13 44 -57 -72 -128 -93 41 -14 -92 -134 -87 86 -55 147 -376
$$ packed form
1654a60J52l14K90J20LJ83k22J29j24j47j57M16J5j94k41NM98k69L3J05J90m87
1676a76L03m1j12L1j93K04Q9N3O9j09l93K37J50J36k31j01M18k02k29J30P8l80
1698b69J00L03M7l6k41L80l44j7P4l7r6P0L5J13l81M24o0k01m8K44km9P4j36Q5
1723C2O4k49J19R4J73l29K59l83K85L9J00j41K05j19l6k34N3o9J41o1R7J50m41
1746b51J54j76M04n1K5m28L32J8K87k66j14J06nj64K68m8nj88OL44l99J37J55
1769A41k03J40j85k6L39k89N8m0N3j46J56r2J26k04N5m0n0K10j50R7k01M69k42
1792b4L15k44j70L02o9K83o35K33K74j25j9k65J69M4k49P7p0K71J51l09r7J50
1814glp4J98q5o3j20J38R7Q2l8K25l63N7j01j5n6L5J34n5p8m2M7J73j41K02n23
$$ plain form
1840 -376 77 97 43 -63 10 -49 100 -46 -175 -20 -130 66 -13 81 134 -67 -47 328 242 251 -66 59 106 -134
1864 -134 68 -220 -156 237 57 -189 68 -189 -350 -148 -91 -9 293 227 49 68 -16 120 -214 -127 22 -13 163
1887 163 -161 197 137 -58 -152 -200 4 118 -43 -319 183 88 -124 104 61 237 -15 -94 59 -170 -156 -103 16
1910 16 1 168 260 -56 63 -118 164 -61 -249 -185 255 139 23 204 48 -100 216 15 -196 -74 -121 -312
1932 -312 80 -84 -149 -130 -273 121 -147 85 134 0 -16 80 -75 23 -53 117 -288 -131 7 228 135 -1 155
1955 155 -168 -14 -26 -61 62 187 14 -160 -214 -184 103 110 78 85 187 8 113 -137 256 -77 86 -13 -92 31
1979 31 -48 -6 19 62 -52 76 -74 -35 -218 -271 -268 -28 -49 145 325 -41 2 142 101 51 137 159 -184 -256 -69
2004 -69 0 45 -92 -49 -264 -95 -114 156 202 133 170 -19 -36 179 -42 -166 -65 259 -298 -51 -112 -414 32
$$ packed form
1840c76M53K0n4j06P3n9J49j46j29J55j10J96p9R4N3k01K0L75q6Rl17J25M7k40
1864a34K02k88O4L93j80k46K57k57j61K02N7Q2L02o6j78J9q4J36l34Q7J49l5J76
1887A63l24L58o0j95r4m8K04J14j61k76N02r5k12K28m3J76k52p9J53k29J4N3J19
1910A6j5J67R2l16J19j81K82k25j88O4M40j16j16J81j56j48L16k01k11J22m7j91
1932c12L92j64o5J9j43L94k68K32M9j34j6R6j55R8p6J70m05J57J38K21r3j36J56
1955A55l23J54j2l5J23J25j73j74n4L0K87Pl2PJ02j79J05k50L93l33J63r9p9J23
1979C1p9M2K5M3j14J28j50L9j83n3LK40k1J94J80l66M3J40m1n0Q6K2l43p2J87
2004f9O9M5j37M3k15J69j9K70M6o9L7j89j7K15k21j24J01L24n57K47o1l02M46
$$ plain form
2027 32 -121 -111 156 -22 -143 5 22 -301 -133 77 -42 55 68 51 -23 32 -138 11 18 121 193 134 -26 23
2051 23 -153 -21 178 115 -111 -157 -172 160 -98 -132 -69 106 -154 86 -298 55 -112 10 -15 -77 70 110 -23
2074 -23 -71 329 67 -108 128 -128 -442 -86 -72 158 -156 -44 -14 92 47 -131 -145 -34 48 33 -170 -71 172
2097 172 -58 70 -221 -285 72 -48 -289 146 67 -83 -120 -71 -32 -98 31 -4 -100 -38 65 -145 497 -103 -46
2120 -46 -11 -169 120 44 151 -288 -101 -424 84 72 -92 84 -28 -44 -94 130 -238 228 -174 -127 211 90
2142 90 -18 227 97 -225 -147 -90 -199 68 -37 27 298 -118 -181 -1 164 -108 254 88 282 50 -187 117
2164 117 -34 -75 -73 14 -92 -390 158 79 -110 13 269 94 33 88 -83 -211 -40 157 64 -125 154 -222 -31
2187 -31 -175 -135 -157 97 -63 3 -20 90 -173 55 -61 -161 -235 -100 28 -148 -78 119 83 -115 125 108 130
$$ packed form
2027C2j53J0K67j78j21J48J7l23J68K10j19R7J3j7p4N5j70J49PJ03P2n9j60M9
2051B3j76J32J99o3k26m6j5L32k58l4O3J75k60K40l84L53j67J22k5o2J47M0j33
2074b3m8M00k62j75K36k56l14L56J4K30l14J12L0J06m5j78j4J11Q2j5k03R9K43
2097A72k30J28k91o4L57j20k41M35p9j50l7M9L9o6J29l5r6O2J03k10O42o00N7
2120d6L5j58K89p6J07m39J87l23N08j2j64J76j12j6n0K24l68M66m02M7L38j21
2142I0j08K45j30l22P8N7j09K67j05O4K71m16o3J80J65k72L62j66J94k32k37L04
2164A17j51m1KQ7j06k98N48p9j89J23K56j75o1N5j71j28J71J97r3j89K79l76J91
2187c1j44M0k2K54j60O6k3J10k63K28j16j00p4J35J28j76P0J97l6j98K40j7K2
$$ plain form
2210 130 38 64 -63 196 50 223 53 -86 -165 -62 273 179 -176 -104 -16 303 -126 -259 -2 137 64 53 -37
2233 -37 -1 15 251 201 171 132 21 198 272 99 -75 66 -55 23 -105 -24 -23 65 85 -269 176 260 172 -27 -29 187
2259 187 -164 42 -49 114 158 -212 54 175 -215 -59 -74 68 93 136 103 -37 86 204 -81 92 213 225
2281 225 115 482 104 -147 -163 -81 -49 90 -402 -117 289 40 75 -88 -174 43 -2 -283 -154 -152 -281 -220 166
2304 166 75 -16 153 139 121 -47 4 67 -148 138 -53 170 89 117 77 307 195 -56 37 -153 361 -142 -88 114
2328 114 -314 2 -65 -48 121 -111 -152 32 -112 183 17 -16 28 -149 -21 165 146 -250 31 -55 -69 -34 42
2351 42 -296 25 148 47 -172 110 -20 -260 -83 -21 -28 -242 -128 -15 -188 -42 42 40 -179 -66 -144 -106 -9
2374 -9 18 -172 -295 -316 111 47 54 142 -92 -106 50 76 -67 98 11 -167 38 -118 -178 88 235 95 124 -272
$$ packed form
2210A30r2K6j27K59j46J73j70j39p9J03L35r4l55P2Q8L19m29j33K57J39p3j1r0
2233c7L6J6K36n0l0l9j11J77P4j73j74J41j21P8j28Q1JQ8K0l54M45Q4q8j99kK16
2259A87l51K06r1J63M4l70K66J21l90J56j5J42K5M3l3j40J23J18k85J73J21J2
2281B25j10L67l78k51j6Q2L2J39m92K85M06k49L5j63q6K17m5k81J29Kj29O1L86
2304A66r1r1J69j4j8j68N1O3k15K86j91K23q1K8m0K30j12k51R3j90N14n03N4K02
2328A14m28L16o7J7J69k32m1J84j44K95j66l3M4j77J28J86j9l96K81q6j4L5P6
2351D2l38L21J23j01k19K82j30k40J77O2pk14J14J13j73J46Q4kk19J13p8L8R7
2374iK7j90j23k1M27o4PQ8k34j4J56K6j43J65q7j78K05j56o0K66J47j40K9l96
$$ plain form
2398 -272 6 -25 346 28 70 14 -171 -184 -47 -25 -96 111 -163 -90 24 55 -25 82 -108 -200 -43 -130 196 -177
2422 -177 162 -42 -7 -259 103 334 -44 -68 -160 -22 -173 77 336 -91 -180 301 215 -369 156 98 1 -177
2444 -177 -246 -273 -2 131 -81 -35 -170 -35 36 12 26 165 -36 129 298 -264 -150 -213 261 165 -125 -38 -118
2467 -118 145 194 -214 99 -152 -36 -178 19 204 136 18 8 118 -19 -34 -114 -232 -100 237 -17 147 -93
2489 -93 -81 260 -72 164 -46 -298 106 185 207 -32 -89 -121 126 54 -190 -191 64 -329 115 179 114 -170 13 129
2513 129 36 -140 -319 20 85 -331 7 337 -179 -56 -8 -36 13 303 -27 239 -16 -20 22 -252 -160 -10 -54
2536 -54 159 -52 74 65 -13 -52 -211 -84 44 -126 -31 155 79 -85 158 -38 77 93 0 68 202 86 163 -144
2560 -144 280 -57 -155 -219 161 111 63 122 -202 -107 -5 212 127 -57 187 246 -199 -171 -134 131 379 22 119 -265
$$ packed form
2398b72K78l1L71l18M2n6j85j3J37K2p1K07k74P3J14L1q0J07j90r2J57q7L26l73
2422a77L39k04L5k52L62K31l78k4r2J38j51K50K59m27q9M81q6n84N25n8r7j78
2444a77o9k7K71J33k12M6j35J35P1k4J4J39k01J65J69n62J14o3M74r6k90Q7q0
2467a18K63M9m08L13k51J16j42J97J85o8j18j0J10j37j5q0j18J32L37k54J64k40
2489i3J2L41l32K36k10k52M04P9K2k39n7l2K47p2k44jK55l93M44O4o5k84J83J16
2513A29r3j76j79L39O5m16L38L30n16J23M8k8M9K90l30K66k55mM2k74R2J50m4
2536e4K13k11J26rp8l9j59J27J28j70R5J86p6j64K43j96J15J6r3O8J34j16P7l07
2560a44M24l37r8o4L80n0m8N9l24R5J02K17q5j84K44N9m45K8L7K65K48l57R7l84
$$ plain form
2584 -265 79 146 3 -53 -169 -269 -128 -101 75 -56 -61 -21 32 -30 -6 -319 -95 130 -153 265 -21 -35 10 -185
2608 -185 138 -14 -178 41 62 244 40 250 193 -9 219 -13 -114 -150 -29 66 -13 96 -99 -153 58 173
2630 173 -71 180 -11 -309 50 212 -77 -224 47 -122 141 -3 -229 -363 7 142 272 -77 -19 -180
2650 -180 88 -220 18 81 -124 119 -7 98 -85 0 -127 261 99 209 46 54 -108 -198 -203 -22 -226 63
2672 63 56 118 69 173 -23 60 269 71 -46 305 267 -38 58 -87 142 -31 1 42 -243 -137 -180 126 145 44
2696 44 48 142 52 48 -169 69 158 -107 59 -56 -92 69 -53 -290 -139 -59 213 -75 35 87 141 -30 -4 125
2720 125 -247 -96 272 -43 -284 110 -170 114 205 -50 -112 38 129 195 -156 -18 -17 -322 -72 -76 44 7 -10
2743 -10 -89 88 50 -225 40 13 15 -56 -55 -39 -119 388 36 -36 241 -130 -51 -31 -147 -75 -43 138 94 68 246 129
$$ packed form
2584b65L44O7j43n6j16j00J41K7J76j31nM0N3o2K4l13K24K25k83M18k86j4M5j95
2608a85L23j52j64K19K1J82k04K10n7k02K28k32j01l6J21R5p9J09j95n4K11J15
2630A73k44K51j91k98L59J62k89j47K71j69K63j44k26j34L70J35J30l49N8j61
2650a80K68l08K38O3k05K43j26J05j83Q5j27L88j62J10j63Qj62r0nJ81k04K89
2672F3pO2m9J04j96Q3K09j98j17L51l8l05R6j45K29j73L2M1k85J06m3L06J9j01
2696D4MR4r0mk17K38Q9k65J66j15l6J61j22k37J51Q0K72k88J10N2N4j71K6J29
2720A25l72J51L68l15k41L94k80K84R1k55o2J50R1O6l51J38Jl05K50mJ20l7j7
2743a0p9J77l8k75K65k7Kp1JJ6q0N07l52p2K77l71P9K0j16P2L2J81m4k6J78j17
$$ plain form
2769 129 -57 -76 -220 -7 166 -81 -123 -96 67 -78 226 207 -36 53 31 30 200 211 34 20 124 -105 -181 -80
2793 -80 29 141 -141 75 11 -72 -30 -12 -46 -87 102 -60 86 219 -210 53 2 -106 -30 -25 -122 -270 71 102
2817 102 208 224 53 -312 -172 -15 -169 -8 -217 -32 62 73 -16 -158 -54 -29 -379 145 253 17 94 14
2839 14 -39 134 -9 51 -53 47 -21 93 62 -36 170 104 16 57 55 -218 134 71 39 -195 221 -133 -42 -87 123
2864 123 88 -53 -337 179 -239 249 139 -105 206 178 -18 -165 35 -17 85 -32 -118 113 -21 -36 -134 145
2886 145 56 -294 -213 -15 -128 -66 212 160 98 -57 -83 -13 73 -33 -152 37 132 118 76 -170 -281 -109 -8 -49
2910 -49 21 63 -134 -23 31 317 62 -29 184 79 219 -119 -47 -49 39 -351 -274 225 -19 4 -205 38 198 125
2934 125 94 10 -20 144 97 104 -29 -4 43 46 268 28 88 -106 -390 -360 264 -255 -176 259 -65 -22 26 -17 -150
$$ packed form
2769A29j86j9j44K13J73k47m2K7J63j45L04j9k43Q9k2jJ70J1j77j4J04k29p6J01
2793h0J09J12k82K16o4q3M2J8l4m1J89j62J46J33m29K63n1j08P6Nr7j48L41L1
2817A02J06J6j71l65J40J57j54J61k09J85R4J1q9j42J04K5l50N24J08k36P7q0
2839A4n3J73j43O0j04J00o8J14l1r8K06o6q8M1kk73L52o3l2k34M16l54R1m5K10
2864A23l5j41k84N16m18M88j10k44L11k8j96j47K00n2J02j17q6K31j34j5r8K79
2886A45q9l50Q1J98j13O2K78n2o2j55k6P0Q6j06j19J89R5j4m2k46j11J72J01m1
2910d9P0M2j97J11N4K86k55r1K13j05J40l38P2kQ8l90P7M99k44K3k09K43J60p3
2934A25l1q4l0J64m7Pj33K5M7LK22k40O0j94k84L0O24n19P9M35l24M3M8m3j33
$$ plain form
2959 -150 156 77 173 -119 102 1 -36 246 -212 -73 -120 225 160 51 -107 66 204 156 199 7 -199 -70
2981 -70 58 132 146 15 140 81 154 -26 -260 -128 119 -205 -132 -50 200 -11 -124 -122 -53 0 80 -73 -140 18
3005 18 -132 38 -210 115 -100 -14 -101 -72 271 -285 -9 -17 151 74 81 15 -40 155 -17 -52 -136 67 -70 -175
3029 -175 -268 82 -33 111 274 -137 -49 -258 -73 -14 -17 -74 93 70 101 -29 -19 184 -205 -107 25 38 -9 1
3053 1 28 -196 143 29 -13 61 137 37 -61 319 -30 176 -177 -293 -108 80 -354 -24 69 59 -83 -164 -197 -158
3077 -158 -28 44 -166 -52 -202 219 68 48 -112 -137 21 -42 -17 191 78 -311 187 -231 23 -21 126 -166
3099 -166 56 -56 122 26 -157 -105 156 -98 -285 127 72 72 -32 -64 -76 43 -95 -196 38 23 138 -90 130
3122 130 77 -113 -151 -405 -78 103 -310 -43 -63 -144 -106 74 -113 149 -61 -53 -157 -269 27 -256 -36 -57 -98
$$ packed form
2959a50L06p9R6k92K21j01l7K82m58J39m7L45o5j09j58J73J38m8M3j92k06J29
2981g0J28P4J4j31J25n9P3j80k34J32K47l24P3Q2K50k11j13KO9N3Q0j53o7J58
3005A8j50J70k48L25k15Q6q7K9L43n56K76qJ68p7Po6n5J95j72l5q4K03j37j05
3029a75r3L50j15J44J63m11Q8k09J85N9ln7J67k3L1j30J0K03l89R8J32J3m7J0
3053AK7k24L39j14m2P4P6j00r8L80l49K06l53j16J85J88m34L30R3j0j42q1l3L9
3077a58J30P2k10J14j50M21j51k0j60k5J58o3K5K08j13l89M98m18K54m4J47k92
3099a66K22j12J78r6j83N2K61k54j87M12n5%j04l2j2J19j38j01K34j5J15k28K20
3122A30n3j90l8k54L27J81m13K67k0q1L8J80j87K62k10Qj04j12K96k83K20k1m1
$$ plain form
3145 -98 167 189 -221 -26 -228 83 143 -22 130 4 -15 150 -45 48 124 -78 -6 -256 -117 6 -96 -48 -93
3168 -93 160 -166 105 13 177 -32 -115 -4 72 -8 46 -176 -124 75 138 -110 -174 -247 175 90 233 522 46 43
3192 43 68 62 328 18 -125 -57 384 -109 -415 -127 190 263 40 -216 161 -187 -65 100 110 48 -96 51 20
3215 20 138 24 45 15 -2 -150 -102 148 -76 0 76 24 -123 -70 118 268 178 -48 -221 -148 -26 212 18 66
3239 66 -27 28 -49 -110 67 -113 -51 -216 -133 -203 142 40 -73 -66 -2 114 88 -293 -115 -121 86 159 92 -171 -122 268
3265 268 232 -125 -11 232 7 320 -169 -97 -25 -74 40 111 -177 33 182 94 -86 109 195 -247 75 45 159
3288 159 -398 -236 -210 75 247 25 -257 111 -20 -164 39 -132 166 -94 49 225 -63 108 109 56 -55
3309 -55 -210 -10 -148 272 41 -13 -128 -125 -166 -74 -35 129 185 130 -70 -136 35 -30 -17 -307 86 30 -322 -67
$$ packed form
3145i8K65K2m10J95k02L11O0j65J52j26j9J65j95R3P6k02P2k50J39J23j02M8m5
3168i3K53l26K71r2J64k09q3J11P6q0N4k22N2J99O3k48o4p3M22q5J43K89m76l
3192D3K5oK66l10j43O8M41m93l06K88L17P3k23k56L77l48J22J65J0o2j44J47l1
3215B0J18j14K1l0j7j48M8K50k24P6P6n2j47N3J88J50r0k26j73P3J22K38j94M8
3239F6r3N5p7o1J77j80O2j65Q3p0L45j02j13PO4J16k6l81J78oK07P3o7k63M9L90
3265B68l6l57J14K43k25L13m89P2P2m9J14P1k88K10J49q8j80J95Q6m42L22l0J14
3288A59n57J62K6K85J72k22k82L68j31j44K03j71K98k60J43J76k88J71Jn3j11
3309e5j55K00j38M20k31n4j15Lm1R2L9J64N6n5k00o6J71o5J3k90L93n6l52K55
$$ plain form
3333 -67 -305 -94 -160 -145 -148 -41 17 107 61 -84 23 -43 -101 67 -52 -30 -72 -188 96 -124 -227 -42 358 193
3357 193 80 -121 -143 -109 -109 208 -126 1 35 12 -157 4 -20 -353 -126 -194 375 360 -161 -20 -123 95 -29
3380 -29 256 51 178 -139 167 -79 1 95 87 5 -128 -630 66 194 -130 29 195 203 -53 -87 147 148 201 -90
3404 -90 128 -176 -180 281 61 39 -87 -39 -226 25 -61 8 60 -71 -19 -94 -197 32 -304 252 -48 112 -149
3427 -149 74 -16 -10 193 11 16 -19 142 236 -170 -141 98 169 -8 -160 76 -276 29 -111 -137 -65 135 -139 -146
3451 -146 322 -242 -114 263 -67 -2 -130 183 107 -159 116 44 83 -53 -93 41 51 106 81 60 185 64 49
3474 49 145 125 148 330 9 211 70 35 116 -113 46 -86 -220 -212 -14 12 -67 -2 34 -165 -211 71 -243 86
3498 86 -22 -47 122 346 6 -4 148 -8 -105 54 -17 7 -279 185 460 -77 -101 -61 -116 -202 114 98 73 -109
$$ packed form
3333f7k38K11o6J5lJ07N8R0m6j45J07o6n8J68j19K2m2j16K84k20j03J85M00j65
3357A93j13k01k2L4%L17l34J27L4k3j69J61k4l33K27o8N69j5n21J41j03K18j24
3380b9K85k05J27l17L06k46Q0R4qq2j33n02O96J28l24J59J66Qk56l4K34JN3k91
3404i0K18l04mM61k20k2j26M8j87K51q6O9N2j31N2p5j03K29l36N56l00J60k61
3427a49K23r0OK03j82Nl5J61R4m06K9K39P1j77j52K36l52L05j40k6P2K00k74p
3451a46M68n64J28L77l30O5j28L13p6k66K75p2L9j36m0J34J0N5k5k1J25j21j5
3474D9R6k0K3J82l21K02j41l5Q1k29J59j32j34QJ98K6p9O5L6j99m6K82l14L29
3498H6j08k5J69K24l40j0J52j56r7J59p1K4k86M64K75n37k4M0n5q6L16j6k5j82
$$ plain form
3522 -109 5 67 -163 -112 -123 -69 93 -56 267 -49 -20 -154 -4 58 -42 230 29 84 -26 93 -69 -5 -149
3545 -149 208 0 -67 -48 -119 103 -256 287 -268 -143 -37 42 166 -44 -54 53 -151 8 43 295 80 -17
3567 -17 294 -66 -231 -115 -52 -60 -32 -431 134 -65 -306 -227 -148 18 202 298 5 88 6 294 -16 64 -188 157
3591 157 56 94 -111 68 -161 -121 -132 95 94 55 2 130 -14 66 -182 142 266 -35 -90 -199 -62 172 117
3614 117 -35 -56 34 375 -184 -84 -55 63 32 -269 -303 -206 -103 -157 -462 71 247 108 -72 80 49 24 -267
3637 -267 -123 341 -147 -253 -48 78 184 -112 129 -446 -141 35 -90 103 -101 -83 102 93 -128 171 97
3658 97 -41 -194 -161 -8 -30 145 -162 -161 -30 37 90 -1 -289 146 226 301 -2 -49 228 124 -167 -56 156 25
3682 25 11 -34 287 -23 8 -25 -17 -116 -101 50 75 -17 -6 -88 225 -283 99 70 176 60 -55 98 414 317 -294
$$ packed form
3522a09J14O2k30N1j1N4J62j49L23l16K9j34J50O2j00K72k01N5j10J19j62O4j44
3545a49L57k08o7J9p1K22l59N43n55J25J06P9J24k10j0J07k04J59L5K52k15r7
3567a7L11l60j65J16O3qK8l99N65j99k41P9P9J66J84R6k93Q3q2K88l10Q0k52L45
3591A57j01L8k05J79k29M0j1K27jl9n3J28j44Q0k48L24J24l01n5j09J37K34n5
3614A17j52k1R0L41n59J00K9J18l1l01l4R7J03n4l05N33J76j39j80J52l1k5k91
3637b67J44M64m88j06K05J26J06k96K41n75L05J76j25J93k04J8J85rk21K99p4
3658I7j38j53L3J53k2J75l07JJ31O7N3r1k88M35Q0P5l03m7K77j04k91J11K12j31
3682B5j4m5L21l10L1l3Qr9J5J51K5r2J1q2L13n08L82k9J06j16j15J53L16r7o11
$$ plain form
3707 -294 75 -109 243 -40 -16 -109 -161 -52 142 80 17 171 66 168 -187 86 -169 49 -81 44 -355 -85
3729 -85 100 88 200 155 251 289 160 135 -128 -25 -43 -87 23 55 217 -44 45 -102 -95 236 -178 41 -63 -119
3753 -119 -239 -275 -63 -33 58 -76 -66 -67 -55 163 46 -60 -101 -9 -146 -46 -211 -13 -201 -312 3 -31 78
3776 78 -33 -47 172 -82 -43 80 -21 -105 -146 -85 66 -139 -263 -109 -9 -113 285 151 -82 -9 -213 138
3798 138 305 -52 -204 -52 25 -101 -255 -53 24 -282 164 -79 -155 195 -221 260 -10 111 -31 -123 -16
3819 -16 -76 55 -38 -125 -70 -262 83 -364 -158 54 -127 -25 136 92 101 -43 -14 50 264 -94 317 -48 -103 124
3843 124 120 80 -313 -55 -332 123 -186 -184 -96 -193 -153 -50 -25 38 283 -191 -71 -79 -106 98 125 23 -83 -145 11
3868 11 -172 -115 27 201 -163 -223 48 -2 33 -24 77 205 239 62 3 5 -81 -44 280 186 -52 18 -209 -129 18
$$ packed form
3707b94L69j84L52k83K4r3n2J09J94o2o3J54j05J02l55K73k55K18j30J25l99K70
3729h5J85j2J12m5R6L8j29k5k63J03j8m4J10L2J62k61Q9j47PL31m14K19j04n6
3753a19j20l6K12L0R1j34J0jJ2K18j17j06m1R2j37J00j65J98j88j11L15l4J09
3776G8j11j4K19k54L9J23j01q4m1O1J51k05j24J54J00j04L98j34k33P3k04L51
3798A38J67l57j52J52P7j26j54K02P7l06M46k43p6L50m16M81k70J21j42r2J07
3819a6o0J31r3q7N5j92L45m47K06K12j81J02J61m4Rj44K9O4K14l58M11l65n5K27
3843A24mm0l93K58k77M55l09KQ8r7M0J03K5O3K45m74J20qk7K04K7j02j06o2J56
3868A1j83N7J42J74l64o0K71n0L5n7J01J28L4j77n9Kq6L7L24r4k38P0k27Q0J47
$$ plain form
3893 18 -169 -173 -177 130 -83 -13 -173 -172 134 12 -223 82 -192 -82 12 133 12 335 -133 67 49 7 -22 -107
3917 -107 -121 123 82 -193 124 7 -113 2 -3 -140 47 -122 -42 -164 0 59 -77 -263 -46 20 -39 -10 142
3940 142 -27 154 56 33 -48 -229 4 160 -151 107 20 15 137 -338 20 117 158 -67 -234 81 -72 -154 -60
3963 -60 149 -151 146 -105 14 102 -92 -53 17 -111 -10 -159 -103 67 84 49 -59 -75 204 96 -44 -25 33
3986 33 44 -38 161 -33 239 -86 42 -238 51 105 154 -149 129 189 67 140 -84 112 203 -188 8 -85 -41
4009 -41 -327 19 -178 -7 136 -29 -77 112 -4 45 -72 18 233 15 -353 122 -110 -231 -58 -2 -104 -18
4031 -18 142 -21 114 -52 42 32 -18 -153 7 -106 -197 141 -7 223 -162 -194 -82 -157 -46 111 143 40 267
4054 267 -52 -246 190 54 84 221 -312 -115 16 68 -5 170 -188 -31 -22 242 -119 153 -31 146 45 287
$$ packed form
3893A8j87mmL07k13P0j60JL06j22k35L05k74J10R4J21j21L23m68K00j8m2k9q5
3917a07j4K44m1k75L17j17j20J15nj37J87j69Q0j22J64N9j36j86K17O6n9K9J52
3940A42j69J81r8k3q1j81K33J56l11K58q7nJ22m75L58R7M1k25j67L15j53q2R4
3963f0K09l00K97k51J19Q8j94L9P0j28J01j49N6J70J7l5j08j6K79j08j40J9N8
3986C3J1q2J99j94K72l25J28k80K89N4M9l03K78O0j22P3k24J96R1l91J96r3M4
4009d1k86L46j97J71J43j65m8J89j16M9j17R0K15k18l68M75k32j21J73N6j02Q6
4031a8J60j63J35j66R4j0n0j35J60j13r1L38j48K30l85l2J12p5J11J57L2j03K27
4054B67l19j94M36j36L0J37n33J97J31N2p3J75l58J57RK64l61K72j84J77j01K42
$$ plain form
4076 287 22 118 -185 -108 22 -151 -40 -112 -32 37 146 153 -101 -89 -24 -129 -92 -22 -297 132 77 -149 -173 -151 160
4101 160 -193 325 -32 -101 -62 -138 184 112 180 -94 -132 -149 149 63 99 -107 103 -79 -4 -142 145 23 62 13
4125 13 -62 181 -18 26 58 268 45 252 -13 -32 199 -5 -22 -307 155 -8 -224 -89 146 11 15 -57 -73
4148 -73 -181 135 167 235 -90 -418 -343 -31 -123 10 -162 330 -190 -154 -57 -77 2 159 -118 40 39 -131 69 273
4172 273 21 202 11 -197 95 76 170 -96 167 -30 25 1 49 -21 131 -227 77 -119 65 8 -74 -30 -99
4195 -99 -33 -41 -56 7 85 23 -61 169 -111 -99 6 78 176 68 11 -23 -79 -32 129 -220 105 176 169 -209 266 -1
4221 -1 -277 -122 101 -285 47 140 -296 -98 -12 0 -215 -17 -279 109 -2 -30 -107 224 -46 -23 148 72 -203
4244 -203 -83 -63 195 151 -103 -35 120 130 99 165 -130 -16 -281 -147 50 -120 -153 -51 -77 -139 112 -10 56
$$ packed form
4076B87k65R6l03P7J30j73J11p2Q0O9J09Pk54J2O5j05L7P0k75M29n5k26k4K2L11
4101A60l53N18l57o9L9p6L22p2O8k74l8j7K98q6L6k06K10j82P5j38K87j22L9m9
4125A3p5K43j99M4L2K10k23K07k65j9K31k04j7k85M62j63k16J35K35j35Mp2j6
4148g3j08L16L2O8l25l28P5L12r2J33j72M92n20L6R7k0P9J57k77J58jj70K00K04
4172B73k52J81j91k08K92j9R4k66K63j97N5k4M8p0J52l58L04j96J84n7q2M4o9
4195i9O6qj5O3P8o2q4K30k80J2J05P2R8j08n7l4n6M7J61l49L25P1pl78M75k67
4221ak76J55K23l86L32R3m36J98Q6J2k15J98k62L88j11k8p7L31k70K3J71p6k75
4244b03J20K0K58m4k54O8J55J0l1O6k95J14k65J34J97j70l3J02k6o2K51j22O6
$$ plain form
4267 56 -197 260 -15 -181 75 60 165 -1 46 39 15 124 -14 9 113 -32 -141 138 25 212 192 183 282 250
4291 250 -311 153 -420 -155 -11 -141 28 79 -161 43 30 41 67 -227 188 -69 50 1 -14 280 -209 49
4313 49 42 -12 77 -162 129 191 66 -102 -104 -68 33 -61 -260 -271 -95 200 -47 163 54 87 -70 83 347 -106
4337 -106 78 -169 -223 -26 -267 -69 126 -21 65 -17 -189 114 -147 200 90 2 -63 154 -197 -26 -74 78
4359 78 -50 -101 344 -112 -155 253 -142 53 66 -296 228 -291 -44 177 -25 148 -118 115 -225 -166 -24 98
4381 98 -1 -68 -236 -94 96 -114 125 274 -12 -104 177 147 -155 166 -80 -55 171 -226 61 -93 14 -2
4403 -2 -140 -11 86 -25 71 191 -244 106 -11 -10 8 -27 55 71 98 6 56 141 127 -179 -192 46 40 -125 -31 81
$$ packed form
4267E6k53M57k75j66K56j5J05j66M7pk4J09j38K3J04j45j09K79j13J87k0rR9l2
4291B50n61M64n73K65J44j30J69N1k40K04j3J1K6k94M15k57J19m9j5K94m89K58
4313D9pn4Q9k39K91O2j25j68kL6J01r4j99j1J76K95k47K10j09L3j57J53K64m53
4337a06J84k47n4J97k41J98J95j47Q6q2j72L03k61L47j10q8o5K17l51J71m8J52
4359G8j28n1M45m56m3M08l95J95J3l62N24n19K47K21k02J73k66K33l40N9J42J22
4381I8r9o7j68J42J90k10K39J49k86r2K81l0l02L21k46K5K26l97K87j54J07j6
4403bj38J29R7j11R6J20m35L50j17JJ8l5Q2J6K7r2N0Q5j4l06j3K38oj65R4J12
$$ [...]
8191g8
##END NTUPLES=NMR FID
##END=
